
##TITLE=AC1250_VIERS11068_6666440_olafer27UV
##JCAMPDX= 6.0         $$ Bruker NMR JCAMP-DX V2.0
##DATA TYPE= NMR SPECTRUM
##DATA CLASS= NTUPLES
##ORIGIN= BRUKER
##OWNER= Administrator
$$ 1.72 TOPSPIN		Version 2.1
$$ 2012-08-13 19:16:14.312 -0500  Administrator@TOPSPIN
$$ Compression mode = diff/dup
##.OBSERVE FREQUENCY= 400.02188249412
##.OBSERVE NUCLEUS= ^1H
##.ACQUISITION MODE= SIMULTANEOUS (DQD)
##.ACQUISITION SCHEME= undefined
##.AVERAGES= 8
##.DIGITISER RES= 22
##SPECTROMETER/DATA SYSTEM= spect
##.PULSE SEQUENCE= zg30
##.SOLVENT NAME= COFFEE_meoh
##.SHIFT REFERENCE= INTERNAL, COFFEE_meoh, 1, 14.98509
##AUDIT TRAIL= $$ (NUMBER, WHEN, WHO, WHERE, PROCESS, VERSION, WHAT)
$$ ##TITLE= Audit trail, TOPSPIN		Version 2.1
$$ ##JCAMPDX= 5.01
$$ ##ORIGIN= Bruker BioSpin GmbH
$$ ##OWNER= Administrator
$$ $$ C:\Bruker\TOPSPIN/data/COFFEE/nmr/AC1250_VIERS11068_6666440_olafer27UV/10/pdata/1/auditp.txt
$$ ##AUDIT TRAIL=  $$ (NUMBER, WHEN, WHO, WHERE, PROCESS, VERSION, WHAT)
(   1,<2012-08-13 19:16:07.359 -0500>,<Administrator>,<TOPSPIN>,<go>,<TOPSPIN 2.1>,
      <created by zg
	started at 2012-08-13 19:15:00.875 -0500,
	POWCHK enabled, PULCHK disabled,
       configuration hash MD5:
       6B 1B 68 BB D9 2E 58 E2 7F 35 AD 54 07 DF 0E 41
       data hash MD5: 64K
       72 0F 12 E1 63 D6 7A 31 BA F8 99 BE 43 BF 32 4A>)
(   2,<2012-08-13 19:16:10.031 -0500>,<Administrator>,<TOPSPIN>,<proc1d>,<TOPSPIN 2.1>,
      <Start of raw data processing
       efp LB = 0 FT_mod = 6 PKNL = 1 PHC0 = 0 PHC1 = 0 SI = 32K 
       data hash MD5: 32K
       D8 29 A6 4D A9 EE ED 8D 3F 7A 24 FD F2 78 F4 74>)
(   3,<2012-08-13 19:16:10.406 -0500>,<Administrator>,<TOPSPIN>,<proc1d>,<TOPSPIN 2.1>,
      <pk PHC0 = 181.3458 PHC1 = 0 
       data hash MD5: 32K
       6F 47 C1 C6 B8 05 90 53 44 17 E3 00 3C F3 45 6F>)
(   4,<2012-08-13 19:16:10.500 -0500>,<Administrator>,<TOPSPIN>,<proc1d>,<TOPSPIN 2.1>,
      <abs ABSG = 1 
       data hash MD5: 32K
       C2 5A 67 61 FA D5 F6 04 BA 4E 48 28 E7 12 B9 24>)
(   5,<2012-08-13 19:16:10.578 -0500>,<Administrator>,<TOPSPIN>,<proc1d>,<TOPSPIN 2.1>,
      <abs ABSG = 2 
       data hash MD5: 32K
       0F 09 72 53 C4 38 52 B4 BB 42 34 FB 24 26 90 4A>)
(   6,<2012-08-13 19:16:10.625 -0500>,<Administrator>,<TOPSPIN>,<proc1d>,<TOPSPIN 2.1>,
      <abs ABSG = 3 
       data hash MD5: 32K
       06 39 1E 51 52 AC ED 1D 67 19 D0 59 B9 09 AA 0B>)
(   7,<2012-08-13 19:16:10.656 -0500>,<Administrator>,<TOPSPIN>,<proc1d>,<TOPSPIN 2.1>,
      <abs ABSG = 4 
       data hash MD5: 32K
       8B 02 5A 0C CF D0 05 41 6A 1D F8 2B EA 09 90 82>)
(   8,<2012-08-13 19:16:10.671 -0500>,<Administrator>,<TOPSPIN>,<proc1d>,<TOPSPIN 2.1>,
      <abs ABSG = 5 
       data hash MD5: 32K
       AD 22 C7 BD 17 19 77 70 03 91 09 41 F3 A1 CB D0>)
$$ ##END=
$$ 
$$ $$ hash MD5
$$ $$ A2 E8 36 FC EC 55 74 75 63 66 83 DC 97 45 DC 63
##$RELAX= 
##$RELAX= 
##$RELAX= 
##$RELAX= 
##$RELAX= 
##$RELAX= 
##$RELAX= 
$$ Bruker specific parameters
$$ --------------------------
$$ [...]
150 150 150 150 150 150 150 150
##$TP07= 0
##$TPNAME0= <>
##$TPNAME1= <>
##$TPNAME2= <>
##$TPNAME3= <>
##$TPNAME4= <>
##$TPNAME5= <>
##$TPNAME6= <>
##$TPNAME7= <>
##$TPOAL= (0..7)
0.5 0.5 0.5 0.5 0.5 0.5 0.5 0.5
##$TPOFFS= (0..7)
0 0 0 0 0 0 0 0
##$TUNHIN= 0
##$TUNHOUT= 0
##$TUNXOUT= 0
##$USERA1= <user>
##$USERA2= <user>
##$USERA3= <user>
##$USERA4= <user>
##$USERA5= <user>
##$V9= 5
##$VALIST= <valist>
##$VCLIST= <CCCCCCCCCCCCCCC>
##$VD= 0
##$VDLIST= <DDDDDDDDDDDDDDD>
##$VPLIST= <PPPPPPPPPPPPPPP>
##$VTLIST= <TTTTTTTTTTTTTTT>
##$WBST= 1024
##$WBSW= 4
##$XGAIN= (0..3)
0 0 0 0
##$XL= 0
##$YL= 0
##$YMAX_a= 504081
##$YMIN_a= -652116
##$ZGOPTNS= <>
##$ZL1= 120
##$ZL2= 120
##$ZL3= 120
##$ZL4= 120
##$ABSF1= 14.98509
##$ABSF2= -5.573092
##$ABSG= 5
##$ABSL= 3
##$ALPHA= 0
##$AQORDER= 0
##$ASSFAC= 0
##$ASSFACI= 0
##$ASSFACX= 0
##$ASSWID= 0
##$AUNMP= <proc_prof1d_extract_pilot.lims>
##$AXLEFT= 0
##$AXNAME= <>
##$AXNUC= <1H>
##$AXRIGHT= 0
##$AXTYPE= 0
##$AXUNIT= <>
##$AZFE= 0.1
##$AZFW= 0.1
##$BCFW= 0
##$BC_mod= 0
##$BYTORDP= 0
##$COROFFS= 0
##$CY= 15
##$DATMOD= 1
##$DC= 0
##$DFILT= <>
##$DTYPP= 0
##$F1P= 0
##$F2P= 0
##$FCOR= 0.5
##$FTSIZE= 32768
##$FT_mod= 6
##$GAMMA= 0
##$GB= 0
##$INTBC= 1
##$INTSCL= 1
##$ISEN= 128
##$LB= 0
##$LEV0= 0
##$LPBIN= 0
##$MAXI= 10000
##$MC2= 0
##$MEAN= 0
##$ME_mod= 0
##$MI= 0
##$NCOEF= 0
##$NC_proc= -8
##$NLEV= 6
##$NOISF1= 0
##$NOISF2= 0
##$NSP= 0
##$NTH_PI= 0
##$NZP= 0
##$OFFSET= 14.98509
##$PC= 1
##$PHC0= 181.3458
##$PHC1= 0
##$PH_mod= 1
##$PKNL= yes
##$PPARMOD= 0
##$PPDIAG= 0
##$PPIPTYP= 0
##$PPMPNUM= 2147483647
##$PPRESOL= 1
##$PSCAL= 4
##$PSIGN= 0
##$PYNMP= <proc.py>
##$REVERSE= no
##$SF= 400.02
##$SI= 32768
##$SIGF1= 0
##$SIGF2= 0
##$SINO= 400
##$SIOLD= 32768
##$SPECTYP= <>
##$SREGLST= <1H.CDCl3>
##$SSB= 0
##$STSI= 32768
##$STSR= 0
##$SW_p= 8223.68421052631
##$SYMM= 0
##$S_DEV= 0
##$TDeff= 65536
##$TDoff= 0
##$TI= <>
##$TILT= no
##$TM1= 0
##$TM2= 0
##$TOPLEV= 0
##$USERP1= <user>
##$USERP2= <user>
##$USERP3= <user>
##$USERP4= <user>
##$USERP5= <user>
##$WDW= 1
##$XDIM= 32768
##$YMAX_p= 475478227
##$YMIN_p= -725997
##$CURPLOT= <Network HP LaserJet P1505>
##$CURPRIN= <$Network HP LaserJet P1505>
##$DFORMAT= <normdp>
##$LAYOUT= <+/1D_H.xwp>
##$LFORMAT= <normlp>
##$PFORMAT= <normpl>
##$SURQMSG= 1
$$ End of Bruker specific parameters
$$ ---------------------------------
##NTUPLES= NMR SPECTRUM
##VAR_NAME=  FREQUENCY,     SPECTRUM/REAL,   SPECTRUM/IMAG
##SYMBOL=    X,             R,               I
##VAR_TYPE=  INDEPENDENT,   DEPENDENT,       DEPENDENT
##VAR_FORM=  AFFN,          ASDF,            ASDF
##VAR_DIM=   32768,         32768,           32768
##UNITS=     HZ,            ARBITRARY UNITS, ARBITRARY UNITS
##FACTOR=    0.250966925370066, 1,           1
##FIRST=     8223.43324360094, 251542,       -196781
##LAST=      0,             -93425,          -13548
##MIN=       0,             -725997,         0
##MAX=       8223.43324360094, 475478227,    0
$$ Real data points
##PAGE= N=1
##DATA TABLE= (X++(R..R)), XYDATA
$$ [...]
23795 -120413 -42534 -9821 3297 -263145 -61731 -167565 35718 -99834 -178819 -157466 99648
23783 -81686 62742 -94830 -70020 4792 -195650 15592 3629 -268821 -235547 -29168 -192090
23772 -192090 -124231 -171539 218661 -112197 -198868 75330 -216772 -120659 -135206 -207047 -336803
23761 -336803 -37395 -113878 -143309 -36974 -97311 177786 -190624 365275 -214006 219185
23750 -115504 -27126 376664 -118424 -149090 158220 -3033 91667 5306 -56580 -166354 -133558
23739 -133558 105493 -110924 48003 -8946 -221757 -69397 -289212 -6990 29168 216088 113992
23728 113992 181856 21678 -12011 -57069 30181 65886 254053 -231745 -77244 -262638 -202003
23717 -202003 80072 -37401 382174 186988 57491 215114 170568 -23393 395345 203482
23707 203482 -66747 293174 54856 28500 -162075 44775 -5619 -78256 -245785 139279 377439
23696 377439 161956 99470 -334459 -299595 226112 189934 14827 117768 46351 -261395
23685 78002 -93399 160218 -259128 204972 -36059 16145 211376 -53822 -248954 233891
23674 -79378 158788 95966 -198882 -41141 41662 46776 164480 170111 -209768 -1325 -195971
23663 -195971 -98353 178367 245224 -190034 89738 181443 173360 21033 -22628 -6401 175634
23651 -127808 155928 83845 -150581 169739 42915 -25544 -303506 -597315 319892 -227768
23640 102382 38313 -74370 -212796 -106087 -263247 135512 -71819 61018 -91017 60091 -2784
23628 -103253 83899 24619 -203989 -130339 -27065 -116227 192842 460072 -39167 -250972 28734
23616 -176258 401758 -111563 -113387 -141507 -239469 -40642 -79293 -347457 141843 124471 258122
23605 258122 1567 -117269 160138 -48005 -110321 -204362 126331 119246 -502767 -112758 38972
23593 37130 82842 -24933 -53601 185682 -93068 38197 251645 -415577 95831 499797 148652
23581 237242 229631 -211461 -40256 123702 201590 -228180 -183857 72889 -294822 10327 -34741
23569 -74279 -208801 -327548 -87238 -99907 167061 -76053 -33463 107712 170416 -34539 26934
23557 206738 -100840 -245346 90646 -161975 -13958 51659 -233992 385028 -257252 83342
23546 51627 -102023 -76595 -428273 281770 -137396 104161 -140549 -136396 220395 207652
23536 207652 -226845 -43896 47085 -126153 -53450 -243884 19887 267219 -103791 -4754 -136339
23525 -136339 330296 113836 298079 -164476 -40727 245214 -155704 25616 274285 -54864
23514 317544 -362272 -245238 128690 182558 175359 73331 -62356 -352530 -156737 -332453
23504 -332453 -42884 -235556 -130658 -66154 203248 -43156 19915 -130962 46069 175452
23494 175452 224535 -38931 152245 -192860 227796 124798 -220141 -69494 -111024 -136771
23484 -136771 145171 -142600 -21706 -66841 -198175 62787 -222297 21589 97769 50442 -38125
23472 -131398 101745 246858 -72602 83831 -176491 81829 6407 80832 98625 -212256 129390
23460 309717 -6110 48442 -53226 173314 -270260 -50786 71395 140908 13303 -51612 -277407
23449 -277407 145072 -17126 146777 -87072 -94728 -256893 -29587 -145263 -201504 75753 -54068
23437 -123575 276397 -134997 -110854 -55298 -89425 33444 -191145 -111799 -16767 116114 -128368
23425 -164296 113364 176457 -258992 -47529 -14482 -72321 -23227 145881 -266824 89319 -242803
23413 -87315 -32909 -36458 -244233 48924 -174200 209668 -128719 118767 -254257 -404683
23403 -404683 -204595 256955 -203268 -31848 31030 45166 107313 -159485 -127150 -136109 -238376
23392 -238376 -200976 -69238 -34883 37409 -212271 -279702 -181679 44112 35509 -196659 8729
23380 257995 -545 -229994 -28694 170896 404242 282064 93728 1518 193692 161386 42057
23368 212465 -158864 -58938 -9843 328706 -114364 167841 111902 -35039 -365934 54952 109323
23357 109323 -53502 90351 -141328 -4051 -52782 -596512 -122422 -4974 288638 383691 382338
23346 382338 -266428 41741 -245631 -46691 106229 345702 266144 -135577 329152 257546
23336 257546 218223 -392583 -183091 233588 -76397 566867 163446 -161818 171090 -5406
23325 -226974 -309456 171001 -185490 136862 -87311 -90217 -375106 63223 115143 61029 -110752
23313 -231237 194804 -30054 -162964 -9178 117058 -312171 -55898 -16007 152710 -187923
23302 58507 -4862 78795 -243259 -197557 14116 -107158 -175216 192180 110313 -211717 -286409
23291 -286409 342374 501534 35217 -174946 -74277 180579 -383326 -127220 105138 74372
23281 74372 240922 -130950 -181022 -40530 45807 -20182 -191005 -1980 -428034 94452 -239183
23269 -125939 -346903 -202926 -200313 -181532 -169647 -166898 -181676 -66729 378971 144019 182896
23258 182896 -258642 240899 10754 -344556 -117616 -104294 49701 154759 -171063 310113
23247 21309 14871 22965 137677 46520 131829 -91803 66445 39933 122944 -233660 -88737 -42600
23234 -163535 81295 -172743 55794 -74044 233569 -101378 -100345 -388757 -126682 20805 -237936
23222 10394 -194508 -239761 -5257 -224420 267888 37911 9834 -131822 -187846 -278057 -220056
23211 -220056 -277062 87959 -18251 -29103 239388 -3324 62488 111108 -38070 -111987 344124
23199 -31497 -312859 114304 123943 74501 -273389 25643 64967 117971 52840 202369 -213999
23187 165152 -136827 221726 133281 21988 53023 -72328 -266081 1876 -15217 116236 78401
23176 78401 49899 -16720 -82403 -164738 -180674 -75007 -68589 -166812 -27791 -248921 -17012 -140122
23164 -140122 91407 70897 -235734 87569 -256427 -98433 11452 -58131 195800 137206 65011
23152 265952 -407401 -297808 307800 -71934 206996 83868 -149495 -259555 -234040 -59338
23141 41253 65537 -21539 82759 71939 -224268 362402 234237 -77486 -148157 -27565 48485
23129 131472 186878 93110 -112022 38590 208905 42501 -112003 110861 -142580 31453
23118 221759 9284 195474 -158071 -354676 -36253 21052 -213319 -203472 24328 -347 148704
23106 89600 -26862 107658 217735 -187805 -111615 480282 -15401 -85757 -494346 102303
23095 -173740 179882 -280049 66024 113736 7488 -3239 9001 -74013 124206 -261508 96897
23083 278635 -37350 135997 223307 -105426 392559 -393823 -60676 -229024 -133837 155782
23072 52802 -97658 43608 194752 151832 11151 -70786 58276 -254976 204923 -78156 -173558
23061 -173558 -229313 -137862 -70138 -52581 -313440 -66098 -217166 -119509 103219 -264943 -98574
23049 19686 -81338 -177059 120654 415506 47755 -14777 -336518 78644 -189225 214503 319117
23038 319117 -51201 -113446 -82439 -75496 -128552 -14732 -270656 -116580 107599 -232252 52879
23026 131966 -24363 11401 -210123 -111382 -156270 -118890 453829 136738 110960 -117674 -9435
23014 151973 139447 -23433 64759 69535 -185694 49867 -321272 -106023 319135 146109 -287305
23002 -41688 -176983 8152 173366 177892 40175 42687 190939 52746 -112968 -46128 -157574
22991 -157574 -279611 189480 -303769 -269868 99373 -257270 -16372 11292 -286069 -401098
22981 -401098 -206279 -12665 -199515 -43619 62949 -32678 86752 190490 -169831 20398 -205359
22969 115735 -237971 222204 60605 32496 83087 41534 162950 80312 -4356 -264850 553
22957 25434 49324 -75148 228573 113200 56359 205024 140618 -498384 -20931 -190302 -120180
22946 -120180 -151222 -20528 -54243 133654 -124887 17435 -90731 121067 -236346 104629
22935 -37967 -213803 -60615 -208001 207995 42777 73334 -186187 -210894 181625 -3312 436506
22923 94859 -161390 -187510 -161911 37212 -84747 -413744 144892 -28208 -142573 -34132 27792
22911 -61629 185623 208501 83567 -172668 -20031 250134 -204538 -1743 -51379 -83928 297118
22899 202816 -199750 -296351 -124667 -144441 -269477 163247 -275768 -75978 -112269 -153743
22889 -153743 64280 -218145 67971 176182 138875 195167 425133 -10344 -4403 -725997 58082
22877 -98865 -294112 -129867 -8396 136063 -77980 -214615 -60678 -70715 201630 125050 -127837
22865 -145640 73027 -237251 -348878 60908 29357 117720 -81349 -386561 107289 -335190
22854 -126363 251007 -32112 -141313 -85236 165939 88019 -213306 -48298 -78028 -158001 -217584
22843 -217584 20209 -225542 -65956 -292909 -18864 148312 -254159 -131173 49499 -136394
22832 -70620 -72027 -256903 -3485 231132 354268 75421 -139948 -105117 -19184 -81386 -133251
22821 -133251 -35596 -282388 -296580 -198978 61568 -187117 19247 -168361 150366 -39852 132421
22809 125849 -251245 -60265 309365 117611 -17201 -19451 -328548 -46947 120667 28582 -123462
22797 137071 266967 356162 49328 -81787 -254761 91632 -165082 -139036 -79042 193269 -265700
22785 -75149 -198803 18063 -190598 280114 -174707 -210824 -293036 51269 -37625 35316 109639
22774 109639 -287329 -253296 101156 -282297 -3494 90565 25592 -82440 154363 -101448 17228
22762 293827 -145747 -156336 -96811 -490550 67560 -203797 -43314 -218950 -73305 69167 -119958
22750 -39129 -72509 17193 -65438 52256 -243127 -244319 245461 -55642 32624 -485970 224606
22738 146195 227533 194421 -72543 -41425 166677 267271 102493 227186 99302 -258326
22727 24796 26877 44593 -599 -284156 -7208 206962 283755 -435370 -86992 -329780 11910 -21480
22714 248305 60427 -27589 -56788 148146 -201774 -204947 -232532 74913 -29099 202168 -301451
22702 -293528 -31598 202803 126123 -191329 48712 -437956 -26976 -129763 73436 -27602 -81274
22691 -81274 -7673 22749 110359 -131917 -167874 444074 85210 -84198 -40017 -153302 123925
22679 -228060 12741 208846 -246089 248827 -120701 174135 -360529 104876 229310 -354338
22668 314088 -240927 -185622 -15418 240802 325593 -233686 -89889 -120301 242559 -159044
22657 67202 16834 239398 1682 -169669 225553 -154221 53772 120581 181429 -317970 114432
22645 -110623 154960 40524 -135886 -144761 -27151 -243122 -49179 -153322 -23363 -203298 180602
22633 -181914 28062 -71194 91766 -267546 -213599 40774 20929 -75988 296098 31959 178002
22622 178002 -58001 -4588 168738 234085 -91870 -41834 -447201 -9437 47839 -130607 3514
22610 -119788 -132352 -52708 152094 63579 115500 -218200 207300 -92857 9797 -206393 303608
22598 127060 258264 48334 -431009 -58459 -49347 179462 -172083 -230829 88060 -185721 46816
22586 -66225 -368533 66249 53233 -212793 84053 134784 75980 38691 -117295 -76155 42104
22574 120915 50382 -77498 -48302 -111775 -190585 216544 52689 -237818 156537 -100895 299258
22562 -121878 -167250 -276148 -46508 -12392 -151878 -248313 80983 -47761 -197214 -220238 165359
22550 -4606 152907 -256407 -30966 16559 -5474 118592 231901 -186453 185635 -34381 -105983
22539 -105983 196546 -81305 254021 260760 -92657 49911 -38317 -68976 -215190 15199 -19605
22527 -146164 -13871 -241671 -286506 -5928 23989 136016 -36857 -302449 109696 320302 -101674
22515 11696 234481 -337628 186949 142416 -108268 114562 -299232 13731 -242236 -156732
22505 -156732 -86267 106265 -159921 -127029 -105989 223544 68834 -32850 -79941 -196300 64611
22493 -84796 415287 113208 -42116 -103767 108434 -101593 159786 59952 -236594 -167222
22483 -167222 -205799 -13380 -40066 -100726 -320379 -164239 -37613 -240523 -65638 47928 -138112
22471 -36367 -6357 50057 -30862 72326 226714 -68878 -114265 -201479 -398817 81544 78072 259948
22459 259948 70067 -215273 281741 -259937 -139387 -224926 107296 -98332 67106 -120647
22448 73790 187057 -373004 19320 75859 172366 -33584 123845 -11559 -5013 8232 303518
22437 303518 229711 -296615 6795 -345501 391749 -62725 52966 198937 -19950 -61318 -275490
22426 -275490 493 -152369 -178528 -70961 727 -199603 91691 -130595 -2021 -141843 -388495
22415 -388495 -77921 -278468 -235497 127455 365887 -478590 -266427 122814 -13405 -217887
22405 -217887 -182494 102734 137842 -139871 -140825 54390 35223 275822 15344 76657 -146752
22393 -304769 -129293 301901 -90379 -37045 74445 -404098 26440 373666 310713 26356 34436
22382 34436 -74009 -293904 -19027 -197234 -128119 -229336 -49737 353965 158354 34682 57343
22371 57343 64536 207581 -391270 -115725 -79337 -76547 -78553 149284 -120448 -59125 -50678
22360 -50678 201439 -214415 150228 -73444 42282 -92763 -17765 141928 94915 -156950 30626
22348 -400304 -380673 109517 -222160 -76133 -334907 79897 -22471 -208065 175052 -62915
22337 -185145 -97818 -317956 -266693 -374515 18431 80532 -236477 290956 -143286 -73369
22327 -73369 466189 -40597 -313624 17125 -90826 116931 -146861 -4472 312099 -121269 39784
22315 -187506 7230 51194 172604 117138 29992 212266 -45546 -226604 -234533 -130094 112820
22303 53536 65355 -383042 -27382 -72588 329088 -176729 -153458 -127180 -122562 5616 -80662
22291 -54006 -37461 -20398 133765 -106385 -235058 -517419 215392 38499 59118 -53601 -185038
22280 -185038 -31448 -221263 -125449 -30121 178807 -84550 218318 -72305 179877 79822 211401
22269 211401 -62887 -166105 -84419 132402 192482 57989 -155895 288459 -34528 -53532 -2839
22257 166249 -170219 -116541 100768 -69415 385064 279863 -244857 47360 -80224 46838
22246 174149 -816 -114095 -6833 313853 -146735 304250 26583 -144481 -9613 -102039 -63633
22235 -63633 -354810 -327339 -146157 333455 51713 133828 -232502 38891 107045 -280161 98700
22223 167600 -58445 -394037 -577477 -317987 -184296 -48808 126897 36768 153707 5290
22212 -47673 16982 3494 -236041 -118098 -164465 -180909 -32231 383844 40008 39019 -176657
22200 137009 196088 263901 50893 -337830 -140487 -76587 -199858 -95833 270920 42394 -140837
22188 58072 -38020 290588 -197027 56710 -11555 42375 104152 -254045 -234128 -295816 107306
22176 -41358 -100413 -351213 -343161 -144527 100844 -83961 -113488 -210344 -65209 134206 147009
22165 147009 -193876 196887 248366 -277505 12997 -185822 -95778 -102437 -217936 -297416 105376
22153 -137601 -157631 65509 -100230 253830 66138 -64205 -253435 169755 -39833 -38126 138103
22141 -376195 -44854 32225 16247 -131222 -311851 -189175 -8610 -96095 -21732 -143710 17094
22129 -214799 146880 -343517 -99245 -343363 -10578 -25661 280530 -192554 -261497 -64902
22118 -142238 -85402 265114 68206 -16894 -214558 84195 -6467 290839 -152264 31680 -234137
22106 244967 -10868 78398 -209407 -52762 91458 -54897 -215542 224310 -284020 70545 358996
22095 358996 -155297 148482 -203166 -185215 -446746 -36118 -11964 244418 -129743 -181581
22085 -181581 43867 299860 158929 -104381 153439 -67310 -279504 -159188 -81740 -51824
22075 -51824 -169984 141121 71278 422229 -103522 -187204 -252763 163400 -162642 -569893
22065 -569893 125208 48997 -140078 40522 -235758 69361 -132541 -319808 145034 -317760
22054 471 -73788 -209231 -47154 -128985 132351 -123432 -360191 -226905 -143263 341349 430955
22043 430955 -102492 -52236 -195096 67134 45902 -20551 69740 -307906 -40466 195210 -274412
22031 -123494 -134949 -27594 138179 26874 -275548 -164092 3276 32390 -75284 -189646 -154717
22020 -154717 -183726 -149854 -251086 -82632 276852 177958 166008 -24770 104122 59764 -33056
22008 -100851 -152494 160482 -43570 -189380 -13530 159925 -192787 109559 -58560 -122063
21998 -122063 -198801 -20581 -90776 489722 -159576 -65959 -49455 -140758 -44961 -83551 -342406
21987 -342406 -258536 -25210 -124326 143027 146643 -58898 -43659 -14189 -129607 -142800 -281462
21976 -281462 -37153 -234746 -225070 -54880 -112877 39439 18580 -415327 -62235 49187 -178088
21964 17536 -195559 38754 104949 -423697 250918 -81903 280976 -121388 -197379 -9349 113943
21952 206379 35595 128946 -46209 -266679 -293478 200073 -174203 16208 -89725 -263912 -216937
21941 -216937 126122 -169272 59383 74285 -357343 -96128 -188063 133075 -72819 -199054
21931 -199054 48015 -207602 -261191 147561 -8799 15167 -236515 -142134 190963 -1084 -17193
21920 -17193 -346148 59710 105633 104554 -88007 -293238 -306659 57318 -6056 229246 -31549
21908 134989 103075 -161602 -147932 -266427 239787 -246146 -63579 -434106 -25100 -161225
21898 -161225 -53771 -107478 128639 -87027 -95028 -47589 -204750 -288813 -19111 -317284 -5943
21886 -113787 232240 14053 -191630 -122131 53979 15284 -142031 -62841 -90138 -57781 -131783
21875 -131783 -249898 -88452 -257576 -128857 -245039 -70839 -337976 -94747 -201513 20295
21864 77079 175560 -1667 87334 -223742 -127500 115691 26635 -46968 19714 -261698 -167986
21853 -167986 -106829 76951 -140115 -154 -172473 254097 188540 -20338 -106697 -21681 -249753
21842 -249753 118902 -308430 -296385 -28932 217206 -86397 53378 -132483 8205 -155941 90528
21830 326485 194595 -272427 -344742 -76204 24865 65457 55397 211547 -2501 346102 -87911
21818 -134502 -13231 -141474 -151239 -264651 -98193 210252 125447 -143349 -180069 -5215 -62196
21807 -62196 -96148 -95000 58191 -102909 112729 76668 -46798 189220 -74136 -282348 -228635
21796 -228635 190376 278746 70070 -38223 -289120 31266 145882 -81415 -352181 188030
21785 163733 -45153 -239864 65879 -24457 84243 -287722 120404 306860 -158986 -230687
21775 -230687 204066 -123160 144815 25191 -6104 -247035 30134 -279181 -42315 -189351
21765 -189351 -131943 266673 -204790 -67886 110431 -265790 -300620 -127321 -138174 15860
21754 136454 -19298 -387225 197354 -172878 -195067 -24837 -349899 64140 -5667 31059 -4316
21742 184149 -131463 125653 22825 113821 -239261 147030 94882 -46434 -125523 -201457 35647
21730 -326525 17473 -71307 -426809 -262519 101076 173296 -212692 28862 -343450 312899
21719 -103415 78718 -248932 -230455 32828 -38162 123723 -10612 207215 -336320 -306837 14892
21707 -19439 -112920 20048 -112312 147939 -60956 -31565 59529 -191819 -129391 -242140 -77626
21695 258299 103507 121935 -86240 -18767 150124 -379242 33791 -156527 121912 357827
21685 357827 -65631 67929 95135 169287 7207 -18882 -180359 -357935 176250 -346554 -299819
21674 -299819 39375 -340593 26085 208039 -157778 50158 -62913 -448470 -444507 110511 -112094
21662 -109983 -183475 168200 -251376 310718 -14920 110278 -27673 151301 -5478 -112567
21652 -112567 37583 142000 -56723 62006 -163561 -327755 164782 -237435 -40128 -44744 -47156
21641 -47156 61958 60107 -168644 -138882 105575 62249 -22810 118298 -93830 -366851 234414
21629 -205199 -179179 44283 338267 161963 41713 -50610 -113725 131640 -67729 18034 142561
21618 142561 161842 -151311 -64090 68843 -23482 140071 -599406 -85777 -35635 -141310 -30823
21606 192758 -1032 -309570 -6200 -191211 -175344 -134560 -580 -354293 91125 -18163 15480 -56040
21593 166319 -116564 -39506 29950 -179169 -184475 -120479 -19891 -253272 -29436 171920 17245
21581 -94273 -224782 130306 -187789 -93732 -408760 -113774 -368703 70324 58310 -39005
21570 62083 269231 -350852 92517 -300851 -258797 54717 -54561 -135666 79871 -98495 19321
21558 -40156 1831 -144882 111122 -123652 127115 -149434 -192964 -180105 -235202 -168624 -268542
21547 -268542 135027 -136399 -99439 35685 -219997 140709 -18717 -166926 38447 1414 -64255
21535 -117013 -180997 38912 -68191 19801 -62302 -155957 -124283 -33113 700 -155882 -100560 -264685
21523 -264685 51583 -147956 79541 32913 -42079 276688 -227520 149700 -164029 -61246
21512 -241196 313098 -105160 -30559 46959 -284208 130743 62761 137877 212117 94548 31391
21500 -159180 -185440 -184967 175550 -45975 -70826 -69963 -208857 182863 128167 -254857 352070
21488 -205575 -153747 -75696 -26756 -68135 -272860 -221823 -361115 201013 -213876 299642
21477 -146297 137944 46718 -88495 -135444 -80762 -325420 13150 77421 -171509 -159883 70972
21465 365393 -22914 -439331 -54511 49922 22067 -118124 -24481 -110232 -208416 -24774 -333452
21454 -333452 113188 -159995 117910 180409 -319211 -121933 265327 29839 -10293 178815
21443 80363 178213 -234407 102756 221745 173629 -232637 24239 -88180 67597 -236516 -63840
21431 30034 117473 196664 620673 592303 333593 481844 410355 439068 167257 542490 283687
21420 283687 -209518 125258 102599 -21321 -208370 -162662 -264799 -332361 186735 -73464
21409 72968 64975 74475 -172493 -21224 170751 -45117 -94089 -255906 555 -52045 76019 -47911
21396 -77139 -314550 180502 234224 -316208 -377956 165426 6981 -308921 100394 117640 -181525
21384 147665 386919 -5554 -232962 -170763 104023 373234 -13666 -298885 -175057 427999
21373 -195481 -181461 97818 205376 -345299 44936 -79356 248187 154782 -134857 20014 -62023
21361 170173 169443 -382920 92455 249660 104617 -216137 -319824 89214 82773 -30108 -179253
21350 -179253 -170048 -96442 185894 201716 -235446 -155604 126303 204972 -155336 -223799 -371080
21339 -371080 -98475 862 20956 8113 -116410 210244 -65408 -342381 43686 181728 -10637
21327 -246761 -195329 -314497 255593 44932 38781 -152378 -147811 11880 -125095 -75538 -48036
21316 -48036 -187335 113356 -478672 64175 -71095 14969 -174619 -105248 -124085 -39445 210594
21304 -179715 -257275 -225003 -141414 -35969 82305 -3023 51675 107101 -430192 -401800 -76611
21292 143144 29193 -250321 -124932 -304657 -209852 -14834 -399095 141320 -67402 114011
21281 -338348 -96463 -271452 -45541 83777 172875 -138071 224535 -91636 -84808 214238 -334791
21269 -108249 -195350 -132765 -149757 -166990 65744 -25990 -139969 -130969 194658 79938 88544
21258 88544 -22112 -33552 -38857 43201 -139006 -284642 -123276 48678 -128971 -392553 -98811
21246 -238106 239010 25334 -63403 -187884 -156319 112701 67600 -310066 -263095 -125537
21235 -222704 -87410 -38898 91447 -144236 -34018 -233351 -395976 186376 -339804 -58540
21224 349918 -69032 -105895 169596 -43592 -4495 -191071 -80941 134240 173684 -121619 -80180
21213 -80180 -42350 93929 -29776 -140542 -8677 -35364 -117393 -220195 180548 -308532 130316
21201 -327490 -347026 -28982 -132615 116969 -316257 -345290 -274624 93389 157554 278134 -14541
21189 -367983 -145449 -198442 211871 -158230 29709 -16446 59827 -294646 110790 -132824
21178 -51586 57472 -199938 -154029 54974 -199800 -84636 191696 -272551 -170907 -110659 193384
21166 209560 -144940 125888 2380 81585 -314049 -213863 -448406 222722 -241726 -67652
21155 -147122 122600 -222561 -292307 76413 -170280 53208 -101572 42287 172747 110250
21145 110250 34797 -37738 -107750 -322930 -69880 18304 -118318 98187 39932 313433 -342395
21133 -276483 -69384 -118038 31974 199598 -372391 -114626 -95306 -152798 -239639 -178649 370359
21121 118048 -162130 -75057 44144 -63933 -26299 -67710 -319686 -49256 -33666 -166044 13279
21109 3514 -67942 -109668 -15195 32751 107029 70600 -131969 -175351 155891 -425417 -16224
21097 -116790 -190333 130313 -198636 -21474 11525 59220 -72115 64185 -112826 -14567 -275737
21086 -275737 229292 138707 -206242 -144143 -360525 184069 -197286 -79604 52631 -21912
21075 208819 -128522 -146155 295928 -309985 -29440 256098 -82204 -218852 -121061 15430
21064 -247703 266287 93912 32005 -91741 14840 -35506 -163567 184695 -2803 -149313 282924
21052 -46960 82965 32697 86811 -278397 -33818 -94310 222433 89516 123997 72371 -143117
21040 -202943 -64413 35734 -153622 21213 309090 -97927 306163 218067 130301 -67063 -116986
21029 -116986 -8697 335689 120762 532171 90281 229340 155935 82071 85283 -44808 127642
21017 13879 -28592 411218 174381 -6608 212904 57113 -508130 -240725 -308179 -94444 63350
21005 -180520 -204340 163758 86874 109678 325679 -20141 121743 472104 268982 166943
20995 166943 93288 149462 81157 -38821 154418 28515 -292246 18725 78267 -214546 160673
20983 -76778 -313221 150444 -71126 -249176 199281 -371778 119227 169941 -80991 -314336
20973 -314336 206516 -98275 -174852 5320 122938 239714 -102586 126769 -218390 127401
20962 125885 190705 89494 142654 14901 -215879 -185415 -83346 -5957 -180981 91206 -220686
20950 -44380 260031 -159890 4455 -156405 -276215 157816 -148350 114166 307028 -178586
20939 73353 -226909 -149592 177196 70967 173219 130660 340456 -111539 407262 110243
20928 -304000 86426 5024 -279444 88959 -6012 -363831 204457 -391914 -424047 -228063 150490
20916 -196327 -66416 58745 47589 -280496 -64382 42223 -98623 139255 -287507 -232392 78869
20904 237701 -81641 161495 76169 66530 33732 81864 -27565 72076 -90764 -347333 226267
20892 246555 133858 275076 -39693 -56410 -320524 181832 -331560 23138 -266894 182288
20881 -29850 -69684 -71801 -240182 71800 -67054 210637 185406 229805 -149090 -26111 59044
20869 6624 174615 -91985 -420394 -364730 6773 194192 -267486 160271 -113283 -159745 128326
20857 252690 -38517 -113031 84137 -64556 129564 200637 -98946 237133 94103 25390 -121872
20845 -9722 -203657 220099 -105645 -287342 -31583 -293642 38075 48684 2040 -141304 -209216
20834 -209216 35244 9419 6343 -178993 -18930 86364 -207552 -103507 -181760 65904 8160
20822 -106252 -197767 -147852 161406 121147 -113981 -101293 -69501 188402 10600 -369215 87340
20810 -240914 241275 40966 -55848 -192527 -114644 -89791 -306253 -39364 -60385 -311003 -90017
20798 294373 257232 -90244 149613 -29220 37634 48733 -59778 -177298 26125 -283814 -248897
20787 -248897 -100022 51087 94352 99829 21900 158096 -111412 -115071 142688 -23174 -307132
20776 -307132 -165577 -79931 8387 -259139 -211982 63197 -163410 -238915 -78979 97258 -143138
20764 -48224 217701 62228 210873 -234204 32293 -7929 107858 81150 -81369 -265550 -246300
20753 -246300 149550 -418505 -328770 59110 -183423 -103420 371802 -107958 -297929 13860
20742 -524924 -269704 -165488 112218 -248968 -10919 -88884 -191384 -165423 14470 -14893
20731 -71675 -326679 221306 35596 -235591 115383 -18082 -23358 -2995 -59958 62119 -3755
20719 -133281 56798 -341482 41129 -218199 -315128 -6777 42091 44927 287348 -281592 -93539
20707 -25665 -11336 83497 24808 210088 -43564 -1091 244307 14760 -58469 -129096 242628
20695 -182 1213 -265921 -285213 -22744 -41838 26583 -265908 118663 -146775 -103074 5013 39737
20683 39737 44013 -170271 273720 55531 176151 62455 -172053 -488782 -192836 -82402 -326803
20672 -326803 -65422 211624 -48311 -121753 6395 -90900 -402960 104664 -247501 -81773 20539
20660 -20146 29588 251342 217717 18091 -259473 182452 -226939 354425 -329507 -404388
20650 -404388 -124468 -296702 -74640 -49364 -86303 142477 17522 23271 -232052 -109074 -160982
20639 -160982 -92434 66582 -287779 -36988 -98771 118261 -412354 -69856 -173899 203050
20628 -152799 92505 83313 -233681 -109130 -128679 -50232 -139597 -172573 21700 89717 -77946
20616 -183902 -90112 -44670 72524 -233311 -70731 79528 -4197 14824 44240 -41126 -194128
20605 -194128 -110112 164478 -310668 -136238 -121489 -192082 280434 -389764 -134963 129923
20594 -213891 -96141 -248039 170512 86533 22306 44774 144513 -481882 -375553 74869 102634
20583 102634 -439722 -86642 -13263 10074 -56794 43644 -234335 100092 284521 93335 232533
20572 232533 15485 -237229 -128921 -192320 -318078 -13495 -54217 -181373 -41559 118748
20561 -101390 377096 199428 166607 107214 -32703 -327064 284740 49547 -197460 -81412
20550 -100691 -209815 -18673 263199 187943 -35944 -52763 -160561 73433 239478 -9531 -226643
20539 -226643 -35781 48192 -249316 -52949 -31177 329422 -2720 292500 -32713 123504 99485
20528 99485 111602 21597 -266756 -196628 43794 -198005 -126615 -318575 170081 -334273 -64660
20516 -5982 -389435 -28923 -93048 -117065 -437442 -72914 -253302 -8274 46273 -86184 -85894 42912
20503 -178855 41326 141198 -232950 -7706 -37557 195448 -229445 -174523 38837 -327354 -43386
20491 -206951 -52503 -236928 139310 -105949 -109147 -135117 -220458 161031 -30604 -163965 -59366
20479 20245 85572 -6875 -170830 -110201 41399 -174822 -277026 -37399 174574 -173995 -194635
20468 -194635 19005 -8910 27339 -142721 -93996 -268112 -41197 -185400 138203 -209712 -100164
20456 115191 340854 -188021 1610 -263613 -25253 -166610 -156871 194525 -158511 -82176 -109584
20445 -109584 70376 -176697 -245589 -53859 -260046 112835 17508 104006 347775 71427 -35733
20433 -320666 -199090 -369984 -427587 -19289 -101471 -206492 -22576 156689 243824 -89648 -176414
20422 -176414 -261102 -221696 162205 -117207 -241872 95367 188529 -10881 -108690 -77075 -170619
20411 -170619 -32013 165387 -130782 -316229 414634 -247107 248114 -148505 -56617 -302957
20401 -302957 158639 252010 -204508 -468759 230723 -56354 -307604 209070 44237 119890
20391 119890 6453 -99971 -261494 79019 97303 82265 -48253 -85515 305708 22591 -134969
20379 -78891 -269103 -348584 22225 -276891 88007 -424267 -182171 99777 -327051 153460
20368 -12368 -28475 -108149 -321947 110056 -115951 53108 -107542 -197325 -175800 -237530 -200985
20357 -200985 84829 -210680 -15905 23991 298199 -179211 -77711 14358 42523 -238516 160566
20345 71572 10355 -327570 403657 366136 -59720 -146328 96400 -8210 3981 -52178 181631
20333 -3996 109671 -68867 -110095 211322 37219 391445 46514 -91126 43360 -337360 163053
20321 288325 111448 -364658 -28596 -155687 9160 187476 -239648 -13471 -272196 -163122
20311 -163122 9503 -119059 -157212 20901 -345371 -29571 -78848 -149582 -144302 171106 7802
20299 -58950 -443124 -221046 -169377 -303407 87893 -105979 22775 -11451 129801 69122 32809
20287 -231201 -214283 291661 -107649 -306669 -224873 112370 83338 92180 158445 254160 -73528
20275 26172 35059 -268453 13182 160195 -12671 121176 -173369 -149563 68534 178193 -157393
20263 -93033 -424191 24816 -213333 -51769 47301 206014 82487 -31481 -13987 -74676 -17044
20251 315464 -235987 -481456 -149687 -484516 -141187 188516 -222316 418190 -80254 -115748
20241 -115748 -188703 -402488 -169965 -31939 68584 43598 -208729 247877 -156310 -135752
20231 -135752 239042 -182949 56134 126623 79878 -259110 -348333 -243699 251270 -61065
20220 -66115 -40823 -227647 -279672 147595 50142 231445 -52734 30938 -65569 227031 -202404
20208 50701 -138711 -38348 -203463 345128 282772 127245 -117167 -197153 7631 -682 -173077
20197 -173077 -7490 -246764 37071 307251 6438 144086 -351071 -228883 -16372 -171286 -43056
20185 198746 -500456 -166970 -99392 168950 103646 -327862 -183313 -296152 -263015 121033
20174 213245 320588 -357285 -145952 68761 -263765 -484844 39949 124640 135355 458268
20164 458268 224786 8759 337507 383654 -418502 -220263 -5048 27198 -110073 49218 39933
20153 39933 209601 267031 297877 227014 59086 -176642 -35578 411423 115508 -55547 -270325
20142 -270325 20916 209896 -211328 248917 -19637 -131282 213144 394653 237377 -149166
20131 215869 437614 25027 241294 223897 545910 -55366 449715 35162 169673 168716 223027
20120 223027 -291209 -299812 -135025 8307 -205719 -380382 78923 120371 -196581 -169519 -202024
20109 -202024 -13141 -213697 -4804 -173093 47848 6454 1313 -83561 201356 150868 113837
20098 113837 -305337 -186713 10826 34162 -6389 -14081 257220 -32791 -423437 63340 -192421
20086 856 99603 -272602 251291 -33570 -142787 24690 -93773 -262443 -82749 -124611 163726
20074 139619 -76861 2545 -155778 -125008 16613 -10658 213964 104649 -310315 209719 -254635
20062 -77739 -172075 -210153 122833 -55383 -119087 -104220 143286 -7624 93494 282934 84755
20050 129354 13064 -97915 -14473 -77492 -44514 -266118 -113683 236169 -63434 -187964 18164
20038 -97215 85743 -364604 85628 77960 -38591 -453018 52914 -265157 -143665 -1797 -222812
20027 -222812 -305192 -54002 21077 -320275 -23687 38641 -177238 252119 362632 193697
20017 193697 -108482 33550 -69450 -331616 -108269 -346197 495010 -232980 -18137 -319589
20007 -319589 101955 390872 71155 -58688 40289 18431 42775 -139727 17133 126236 -170745
19995 -2487 -123118 -372594 -295147 407301 43638 -23571 -320461 -35656 -11620 -2726 459721
19983 -465 -4122 75600 133161 393532 513065 185299 -100325 66990 83718 83496 201944 8076
19970 38459 83370 268970 395881 82165 115190 -67982 233361 174922 231538 -63089 -2109
19958 -210165 86692 223585 -91431 -103231 -83420 -95187 -29293 97464 -79299 204987 3985
19946 -74123 474722 273517 -279097 -205190 -17873 69965 277665 -133391 289619 74300
19935 -39927 -250635 25084 -139579 -212234 -264205 123193 81718 -160262 76783 -39012 -176141
19924 -176141 -48962 -352483 -200014 -90787 58191 -87352 -90638 -15617 -502695 -311448 -177346
19913 -177346 -114811 113231 101753 -86698 347533 134258 -254572 -42562 93757 -66089 -58116
19902 -58116 194272 -333598 42970 -185510 -40636 -136488 -1619 -114008 53350 88521 -317261
19890 58359 284799 181042 -97191 -19513 -104446 -147518 170249 -39980 50416 76886 1510
19878 330760 -214814 -35724 202203 -96722 80072 -107892 53797 -54201 -262773 -89114 168600
19866 -123933 -291792 179021 -228856 8245 -571331 55622 -307772 -76469 63899 -95687 -235906
19855 -235906 -210020 32159 115886 184003 88812 -62864 28235 62795 40732 275229 -10597
19843 64000 -74936 -386976 30457 253269 162849 -481117 -1689 350890 -229490 -137847 208067
19831 -210299 -160785 -285641 -100973 -106137 -152019 -238281 -421710 -216304 226253 -61083 -98429
19820 -98429 183508 374851 -346341 -126501 -18467 -59635 127128 38907 122150 -291852
19809 -14248 31288 -387 231359 -139402 103484 -76478 -179061 177617 -238134 59730 -162620
19797 -109293 -8715 14079 -39497 10880 83407 -121604 242169 -84929 -136884 -179561 -96846
19786 -96846 -86639 114998 22749 83789 -61418 -107145 -172262 -534684 -85230 -160996 -260177
19775 -260177 4641 34500 326138 -92797 123165 -21885 -136018 160645 -30498 44132 -204132
19763 -384170 -133600 -43557 -82541 -105164 198187 -273494 -73755 45810 100708 -524064 -34113
19751 -282714 84458 134064 70911 -52078 -186444 -23829 -32151 -290986 -125349 -180325 284663
19739 205023 172270 20785 -39093 38446 30001 -188545 215962 -456 25110 -176939 5823 196147
19727 196147 92949 256425 -251098 -187876 76238 65963 191194 298722 391470 273862
19717 273862 167872 67930 16054 108073 -47171 15014 -292941 -297302 143725 124808 189356
19706 189356 -96206 31720 -191822 4242 293059 48134 128656 2846 -301090 -38261 194615
19694 108260 -231409 199983 87661 46240 98643 128945 132636 486284 272750 39229 264407
19683 264407 196911 -347486 -250902 263300 158746 3986 -120907 -224079 -184112 -102079 -97036
19672 -97036 -121990 394721 36927 -166571 236578 4049 -155534 -262017 107416 105961 87360
19661 87360 190691 -169416 131126 -247064 -19939 5291 -118247 -457416 -154098 -116363
19651 -116363 122190 -25973 -431249 -84513 2733 -531049 -325533 72964 -77745 -199609 -13448
19639 110149 272187 -120757 -88633 -166674 -25584 49838 154996 -61653 -19765 -12717 21306
19627 -262410 90976 215211 -233616 139693 -87591 -265250 135757 -183690 -398092 -170136
19616 -166182 -87814 1275 52648 -18738 -214803 35774 67213 -89544 104707 123518 -41016
19604 -82137 -70635 255001 -37094 -189337 -173084 -109204 -105452 48315 -226695 136899 227358
19593 227358 -132622 -235907 264406 -113853 -153436 223092 -131988 56217 226425 -236238
19582 15469 160883 -154875 -52059 283379 34651 347 -348438 461270 234889 17342 63106
19571 63106 41955 -173585 -154631 -453401 -329657 -93509 -37400 274523 -198106 196547
19560 63160 87681 -70885 -233060 186191 -236082 -215229 114828 -130489 -82938 -131806 51060
19548 16270 -3005 255892 -340681 74346 61505 57426 93008 -158815 -83739 -260241 -345821
19537 -345821 43922 56893 138216 -210344 143629 -238361 105210 926 -162850 -286456 266820
19525 -180877 -43898 -98172 -150992 -98295 -51562 72634 66671 -216318 -102952 -82883 -9040
19513 68394 -108041 -397360 -158795 -65482 -104544 -21966 -161426 -165552 -166320 -41271 -333769
19502 -333769 90282 -147836 -167668 -211735 -237030 80885 -137040 20710 -88609 -42204 246743
19490 -343457 -345303 194515 119052 -81776 11431 -145734 -390796 528438 34478 48157 -130238
19478 -121057 -353988 -74609 466604 171871 -66352 170818 -232170 -360685 230737 -213921
19467 100454 -527740 133073 160734 -8560 -340247 -179949 -135967 59315 235806 -20311 46011
19455 -101690 -138018 -218172 8247 -53647 -97191 -408475 -144103 -85272 -94508 154985 -39077
19443 198132 -198940 -108433 -7087 -100746 -149312 171395 62526 172221 -256990 288717 -98229
19431 139053 -25189 47970 -208313 56233 -192943 -387398 -279494 -131446 -350877 -151823
19420 -110887 -101196 212405 -187069 52571 75273 -45973 345696 -154071 37665 -395826 -43354
19408 108778 301533 98962 -149027 -132469 42945 -169350 -338229 -39425 -58880 29890 -24273
19396 34661 -119800 89102 230327 -391436 -125457 -377453 -26178 -122443 102302 -159943
19385 -169829 122569 90511 -336751 -293575 20223 -204956 85973 -83708 118932 -80753 -585835
19374 -585835 -369086 -13625 129860 -169306 -267070 -64766 -142196 -52786 -46878 -170956 -401615
19363 -401615 152713 153957 -11827 145138 -227552 8994 -78168 -224935 159835 62949 -47876
19351 -53621 -151749 -84667 304127 88693 55258 130668 57785 97602 15492 146981 -123802
19339 66241 179831 -151291 152379 -115277 -227129 93354 -458503 -102929 -36817 74272
19328 123260 -277985 -93604 46369 158607 221216 -70380 -204698 -46773 -72114 -324644 -12636
19316 -74816 174584 -206243 -135119 -290963 -96961 -68352 204782 139022 -118746 181672
19305 -245145 -46355 -360355 -171704 -219096 25145 230179 -405445 -19375 30721 4653 -277899
19293 -93560 -97874 -14712 -94878 -166592 -128646 155495 190451 56741 -275224 -127384 192867
19281 -86132 -52703 -218194 -93531 -99935 -217562 -219993 -481519 -9376 151711 -227261 -489341
19270 -489341 -115079 -247693 -343925 -124117 -101182 -61629 -136819 -268047 -263425 71968 2835
19258 -2114 -302628 -138603 -154246 -135965 -19874 -74833 -46509 87717 112986 -231489 -220447
19247 -220447 -60930 76783 250697 -262720 -55149 -28155 135225 -294090 -20797 -30430 -98407
19236 -98407 -243335 39579 -53341 -223427 -512227 282043 -205563 -133397 108351 44551
19225 198133 -135089 -297431 217198 -173872 217395 -327061 -207355 -5039 52054 98105
19215 98105 -103764 76216 437624 76321 -236184 163789 -43618 47273 267151 -191917
19204 110233 -260570 61390 -79306 -25461 158516 -146070 47052 278572 -115089 -249088
19194 -249088 162229 -38802 -179004 -80109 -20911 55167 -60336 -226091 66505 -109311 69381
19182 27621 255598 -42363 -139112 -205160 140990 219072 -151612 171669 -258349 -319998 -199608
19171 -199608 138138 82682 246757 -90104 223783 -3026 -179659 -277219 -111287 83566 -117321
19159 -265512 -46070 -148486 -206838 86803 -79300 -267148 -41124 163409 -202500 -104586 -64964
19148 -64964 8861 58646 -175156 -143987 -257808 -132863 144992 -256611 53502 -177633 -236660
19137 -236660 115638 -72962 44470 -181847 122396 -1734 -138396 -38113 -108282 154713 -169307
19125 108660 85433 -139891 -100010 28118 -131354 -351793 3907 -123878 62746 -189924 -482870
19114 -482870 140985 233275 -145464 -48643 18581 -243701 162507 -257303 191402 -182687
19103 -144530 -180325 -149703 109345 -32041 -57746 -105694 -144609 -292290 298880 -328296 -146870
19091 -34141 168369 39743 -138283 -6008 -119670 40011 36868 4905 89657 -241783 -83124
19079 115242 -203310 -76212 -75449 10765 -68497 -54152 85259 60831 -42236 -45774 -74850 -100747
19067 -100747 642 -126693 51845 57503 -195195 3166 218866 67442 -127542 -158213 26094
19055 52001 -292349 -107119 -189318 -133328 -191617 -359682 -24354 14300 -109298 -73605 -307477
19044 -307477 -120599 263530 -168084 -170713 -128551 -237593 -134044 23720 8849 635 -132753
19032 9071 111929 -345458 -124860 -34265 613 32132 347389 -169264 -101489 116062 -161309
19020 -165188 73218 -24044 40407 175341 24566 164119 -137073 -122270 251912 -87531 -174330
19009 -174330 50476 -101098 414544 -7331 -169974 -384049 129546 -7441 -172718 -187380 235280
18997 264839 31978 -402778 -432668 10021 183095 -36242 7734 -91331 147032 176142 420220
18986 420220 111441 154025 47175 -100383 -126046 36708 -12038 121367 30635 58069 -152484
18974 72720 38895 17719 27316 94498 891 -157073 -233377 265278 -107247 -182151 30200 226223
18962 226223 408020 221669 412613 262966 -57694 -103913 -41373 -173135 -72537 -13547
18951 -54392 -171853 -30791 -112322 -14760 -243810 -147050 -226457 -574225 -91261 101130 -39819
18939 360906 178929 -109279 -170687 -413870 67807 -93075 -162235 -226238 195273 -165854
18928 -56494 -51124 -278750 -73296 -289940 -109151 -167530 -43090 -76359 -20838 -213387 173877
18916 150878 191021 -268084 -247737 -169902 -238067 121038 -118543 292329 117813 -73075
18905 -18823 95016 -27155 -12376 -175594 172077 -191105 -143866 447703 461774 232614 950
18893 -230838 273717 -68469 163945 -262800 -181799 9116 309157 -176488 394489 -89871
18882 -6886 -27107 -141263 120410 -1060 -21897 60989 -181430 -116406 -167118 -135470 -158207
18871 -158207 -143287 -142805 36896 -241690 206888 29904 339370 -109348 148488 -180161 -76812
18859 -167150 201391 -159365 151555 251974 -140338 -289364 -155805 62437 -37179 319106
18848 304089 -189967 181271 -204605 -280600 -44733 -393791 253279 199813 -65621 19136
18837 28175 -387780 61299 -39873 -81846 104932 -262034 310270 -144859 82671 -23769 -128564
18826 -128564 152140 50665 -325195 249482 -142651 -82668 -100524 -319567 60820 -76798
18815 111356 -64949 -37470 87923 79160 -196983 -76406 -36123 -172064 -4970 -261908 -81370
18803 -66363 332275 -50004 -138410 10803 -115693 31918 45421 54257 -167494 -381753 -62704
18791 69475 -1963 -40819 -54950 -39106 -150409 -132682 156187 -95781 132344 -264869 -396607
18780 -396607 46593 -202248 -187940 -133549 -182476 -159555 -121292 80163 332180 72590 -64428
18768 -189270 -375732 -188975 383149 -151921 -166034 114098 -11256 -27492 217564 -18317
18757 66203 -26233 -203818 -272152 -357330 -160298 227489 232673 97934 -121197 32185 -96372
18745 -112027 -166782 153114 -196942 -64211 126960 -127698 -32849 95859 7758 210356 -79617
18733 9895 -70528 -88158 19611 -197982 -111 -291603 -30473 7470 -15739 219996 -141259 -91587
18721 -91587 -62389 -127195 -105930 -181818 -171203 338068 -315771 184674 -129714 -69565 159362
18709 207548 207882 -265373 -365210 135518 64124 361893 -299837 -199743 24504 -269096 -273439
18698 -273439 10094 123519 -158445 -96195 137882 -325459 -108416 38434 -140419 -20495
18687 -75103 -64307 -45951 33496 -245004 25135 186262 -64746 -232341 -89407 37621 -248664
18675 54560 349466 -45988 56616 -57049 -327753 -315957 -105452 14750 -399828 -17181 -280612
18664 -280612 -76151 -275512 146863 -158292 -116502 43682 -322203 -351760 26543 -167659
18653 -100159 206269 -85318 340692 -250748 -27366 -44548 -236858 -250101 79204 42362 -245746
18641 -67097 249279 154159 -411991 1373 117630 -119657 -199473 199593 -180991 -3422 33372
18629 -328472 -487 62523 -240233 50542 41808 -40629 364411 -395958 -91968 191058 -5193
18617 37092 -64679 231440 47390 20081 91714 -225374 219805 19932 -269957 -207463 184346
18605 -44687 -141538 -347497 -473511 49662 -43711 -155373 -216089 374592 -285996 -123432
18594 -12822 -73565 252782 4319 170165 -348373 -87883 -356142 -44507 318026 -105308 23132
18582 28363 -316748 -118818 -390743 -148222 -100079 -470 -3022 -222495 67680 146546 -149314
18570 -86561 -55448 -218274 -129238 -146008 -170468 -18434 -188273 1587 -267532 4535 68594
18559 68594 166212 139580 -25589 248178 95412 50919 -50072 -121904 -31436 169041 -176111
18547 -277239 -198370 -53639 -187963 262755 -64630 -79402 -49703 58645 -182649 -257514 199199
18535 -134200 -220882 -139251 31106 -34754 -57726 -245840 102793 97190 102293 -243705 192603
18523 -105302 -143172 25023 -193754 -308294 -279894 -155012 -35924 118341 -48358 130037
18512 -119250 -130120 163552 -37352 -120264 -22358 -26156 -93288 -122639 -85955 -135325 -414875
18501 -414875 53908 -190427 -224994 -284428 54803 -116174 -122765 43270 315172 114160 -29113
18489 -43071 -123956 -133624 -259032 -159261 107578 144464 63947 -60790 -326851 -71222 -6553
18477 95502 299842 121233 -235989 -185557 -9054 111069 304684 -543418 -156102 -98721
18467 -98721 -54063 86249 -101443 -116391 140897 -6175 -161546 52902 437419 -202659 -65644
18455 -143722 -57215 -291959 -354301 97444 -237647 -347635 -194126 -306828 -48741 -57753 -72504
18444 -72504 -83998 501441 392718 200195 227550 268526 -281424 4036 142028 -64454 -462524
18433 -462524 -202795 -2379 -97499 -18941 82946 162700 -15473 -299434 41656 -261082 -288475
18422 -288475 -138179 177795 -1314 -69994 -71317 -228228 -210194 133792 19426 138151 -163888
18410 -21212 -139862 -42691 69830 65997 -131396 183215 136047 175383 227970 -176915 62597
18398 -117098 -328923 -92220 237786 179683 -72422 184895 278939 -177075 -126110 -209677 -215243
18387 -215243 -104695 59451 -137 -122655 104045 61320 -408214 140913 -172151 -278886
18377 -278886 -167143 89573 -42581 48830 -235900 -242164 -77567 165711 -175777 328433 -10451
18365 115165 207735 339140 -132443 -63491 63621 127608 56738 22350 -83106 176407 -203592
18353 -91078 402637 69173 -291012 66484 -106624 -33334 -189315 115340 -219048 97002
18342 219549 27921 95045 -40716 -58093 91748 -107202 -165751 42680 264919 -160750 -33629
18330 -94970 -257565 -67337 273582 -328385 305767 -66930 -254453 46238 -2555 103738 -85909
18318 -248836 -123557 -192038 -70817 15320 199180 447 99418 -32129 -1628 -332680 -221018
18307 -221018 -30901 -141527 -156007 -227031 -44664 -40620 -235674 -145233 1514 2074 -81262 -146660
18295 -146660 -563030 -169765 155854 11204 -49017 -370478 72663 -182554 34122 -86095
18284 -235646 181886 -84012 -217150 20772 -62883 -110769 64167 204868 -123345 -439399
18274 -439399 -41870 92916 -36330 137861 37248 -551772 -245117 -37442 183280 -159409
18263 253633 -93651 -243486 -184396 179206 -12170 -190929 -98483 -4366 124906 83321 18310
18251 -9445 -120174 -84228 -56642 -43315 -91896 96283 110419 200539 -175617 -5295 -53293 -256698
18239 -256698 202916 149479 -381569 155136 -112482 74617 -209267 250477 -224400 133711
18228 144520 -19915 -224970 -17546 -35020 -9185 -32043 -130195 -307160 -45924 -81094 -71944
18217 -71944 263899 -414659 -169018 196369 -71712 27576 125319 -399081 40553 79855 -224320
18205 99163 -111405 97015 43819 466418 28907 98888 41828 -170805 149497 419434 129063
18193 159339 -41313 -63308 62147 144477 143050 -91110 -138849 126523 -185138 -223654 -44487
18181 -199 -79048 1246 -8225 75372 303919 -105824 218551 -194677 5046 -124460 134583
18169 -2334 -16229 -92140 201130 -70803 204531 -171852 -43134 -343126 -360901 -31193 -178192
18158 -178192 26758 239077 -8549 -8957 57426 -151012 -78253 -100552 -25658 69899 -6583 124867
18145 19443 -118447 98263 -376327 3063 -4864 -178064 -143431 -21994 -29511 -41804 73357 109374
18133 109374 -267604 -98058 -67324 32039 -48587 -305999 110528 57340 -50500 -156703 -73276
18121 -249338 163437 445224 374732 -215477 123743 -89649 -7960 239167 152444 88620 -13936
18109 55702 -139825 -323011 182854 -74241 -172432 -226599 131913 32467 53317 240319 273298
18098 273298 -312714 -251472 -125910 199081 73568 -147786 -756 -194635 -145662 -174304 188157
18086 73811 24091 -158127 -42538 -179337 120776 181807 -129346 -82028 -129196 -200626 67272
18074 -106961 70621 -19500 -233751 -34433 -105105 -108774 423586 -67492 7343 197206 -33623
18062 -50316 330066 -30541 341262 15299 42984 -167531 117717 104388 -138444 78696 -156855
18050 -203796 -38408 -102945 -226635 -89019 -111659 94206 53800 -219532 -396918 31265 38851
18039 38851 89501 33565 -215284 109356 280483 -41014 -212742 -214864 -125268 -21298 190427
18027 211287 -172809 75856 -339765 -30084 -126479 -312415 -61508 -172238 130888 148754
18017 148754 -74370 33068 117084 19161 -131109 -108910 -262696 259247 -121346 -41022 -216602
18006 -216602 55069 -240235 -218363 -213841 189152 59500 -255228 -212146 -79081 -59305 102094
17994 37547 -56848 -88812 35939 239884 -146518 -149669 -125617 -115294 115387 32946 -110448
17982 -179130 -141706 25448 -173575 347184 87856 11740 50314 57803 -188006 -102474 216543
17970 -49821 -330109 31866 -156340 202074 -52309 -14177 -106481 -116423 -304689 203511 49015
17958 129469 3654 103418 13229 -89275 -19534 -374718 -19621 47326 22305 -62680 103700
17946 -64855 -8963 -258642 249077 -381641 24789 408006 449763 -46749 31442 -43746 -255484
17935 -255484 -11072 -297825 -193961 158961 -393101 -161476 -483919 -281892 33379 23290
17925 23290 8951 -17440 -276811 -85042 73284 45368 271636 68882 -119671 127955 34578
17913 -46573 -137788 145560 56752 1888 -300016 -246365 111326 -152367 36462 -134347 443826
17901 132307 64975 -19694 138601 86089 96466 -40283 -114088 87303 -164990 -112656 72801
17889 269808 188847 -56433 194779 127610 -323512 108272 -84504 66845 86792 169144 108844
17878 108844 26818 -56864 -105446 66825 -62205 -15797 338496 19230 149702 113310 123144
17867 123144 -229160 43242 -106184 -85534 -79072 156303 355217 16013 -15958 -234293 63595
17855 244747 360050 -130761 4894 121096 109233 166422 290755 21622 -230088 -62868 8160
17843 125447 -93680 -357833 341120 128919 -230993 60326 188478 239156 -67040 85845
17832 -87106 173036 -14548 42144 258472 14322 -24167 -99871 -71203 373441 -102005 19065
17820 222034 -130707 -256618 -107476 -258475 325509 82661 279105 54249 -165871 121711
17809 -122487 -183856 184125 -9556 -58705 -30356 -89348 14800 -2309 324584 16240 48656
17798 48656 -108123 20178 70459 235927 84606 -56772 -24977 120266 39815 241978 -134184
17786 -270706 356655 62841 -40808 -232693 -110762 18664 80064 32807 -102237 -165158 208767
17774 -264629 -51003 156802 -3644 5181 -5706 -73713 22420 -41838 -302958 245676 38787
17762 166434 -165614 -28458 119367 166448 -150456 -225980 149051 -121001 278750 -57880
17751 -118616 -25019 9142 42488 121435 20724 -2231 -60377 -41767 -85864 -56123 200869 -106816
17738 150793 159086 211426 -8070 167327 222360 59548 -94848 -279335 171258 -2819 -270208
17727 -270208 280338 141671 90540 220019 -143022 101267 57499 276886 96186 -278192
17716 -93435 9183 140795 133001 151149 333721 164391 -183221 -57257 72663 41508 135839
17705 135839 208416 263587 533321 -10289 245974 157463 -120554 -127951 -516942 161075 20155
17693 16151 52368 -104539 87717 -144635 -855 -231675 2963 200732 227908 320246 163637
17682 163637 327526 -78342 -44615 -148940 -75087 143320 15328 149721 337255 124168
17671 304559 -78668 -73497 22056 143208 -71881 -150893 -155990 -278912 -227588 197853 142855
17660 142855 151935 -103122 -381926 227989 16928 111937 63503 -119986 -108357 -1764 -20203
17649 -20203 56609 24128 300039 93285 109560 -268125 -34431 -1293 298893 482 12865 84965
17637 84965 97399 18486 -10105 33124 -139641 224469 -97400 55678 -159829 125888 109259
17626 109259 -36921 90729 37473 -343168 263029 336478 334120 106046 168591 85973 -94255
17614 114794 -35475 -189202 -217982 153896 -45884 313626 -381415 337550 2375 -73817 -122590
17603 -122590 200811 53384 -300823 313868 335540 -102656 -325010 316849 167731 -282554
17592 24647 -105921 313692 -243046 153867 369628 208453 -112275 -18977 320864 96782
17581 -277027 -124096 275098 90882 -204751 211303 330558 194225 36645 -12794 172898
17570 295704 475932 28505 249734 11368 135249 486928 -147110 73976 -295788 -59114
17559 243244 -80464 335324 170243 -12994 337697 146865 183801 60131 -48250 -77412 -98856
17548 -98856 128323 221869 198475 222644 360748 51216 142666 122731 433036 297930 345861
17537 345861 299781 -56490 222820 -113470 105601 360694 152491 177467 153212 261941
17527 261941 205265 -41811 729667 297064 323524 428438 323668 460024 727444 383820
17517 383820 269419 -117997 -261108 40912 90407 -149353 261275 285180 117862 402524
17507 402524 230394 468523 282853 491914 209445 166660 -46597 -13419 104520 185215
17497 185215 338237 -118141 388602 474132 400865 356975 -7592 254765 396568 246685
17487 246685 218421 404962 510319 392830 173860 455171 318186 178539 227017 474596
17477 474596 154458 449548 9592 6959 319327 349635 328546 20398 -28378 261749 331914
17466 331914 110146 150747 252191 79098 246417 177048 179552 269716 27171 65352 93732
17455 93732 79057 213133 249398 391269 381161 449366 397122 246764 53618 263340 417300
17444 417300 283644 309353 457151 370361 360893 -148670 272313 274263 190804 437571 402898
17433 402898 125783 363862 183582 190147 190062 38708 245749 201457 225076 311178 110320
17421 445361 196553 162139 375946 251326 135588 146613 286410 564310 376768 636423
17411 636423 467942 482787 270111 244758 468896 241477 4473 181083 -296370 -27996
17400 248983 337012 168467 634845 396759 389203 -7792 347348 -32865 -36922 21977 176869
17389 176869 267269 428224 408812 129782 -67284 90178 236061 148768 -20812 92364 126763
17378 126763 13844 496333 209015 199545 470019 236463 57389 360889 51289 519604
17368 519604 240480 191866 -59148 234045 412265 322607 401623 148486 69164 -152589
17357 47030 -12591 401966 192905 -27312 145939 148186 247699 27764 63185 -37064 197436
17345 499170 -114333 349060 216161 274309 175095 673803 70415 140374 176207 226603 69806
17333 34794 278877 288225 253610 51375 215666 -39222 -10117 129404 228314 129770 135823
17322 135823 91831 550197 346620 43631 -121404 370614 89929 536546 289955 393204
17312 393204 24657 187696 430651 100583 147747 213212 196941 10926 213124 -24738 82679
17300 -40942 518511 241766 454266 345722 5278 132630 -8362 412412 -7266 176911 270620
17289 270620 159970 52105 65125 76990 358270 29138 280463 226084 148622 104270 309497
17278 309497 155065 -43407 538693 420750 66111 446584 6920 571765 19783 81119 224231
17267 224231 93261 291425 296363 34218 227008 275091 244311 83141 44510 218158 222892
17256 222892 456234 285845 178088 549481 525703 88376 368046 291645 323054 406712
17246 406712 -151118 559638 497669 158282 273977 390982 352508 394227 192577 224738
17236 224738 690224 195386 392030 376237 295656 353208 340124 120363 379220 165355
17225 458433 315590 72938 154208 406605 123740 -128111 266533 163866 126026 237667
17215 237667 169873 155132 84961 237450 404126 195595 601892 143144 121177 141510
17205 141510 62866 197567 278629 41084 164045 238582 290777 688742 469505 404809 697813
17194 697813 229479 428483 306480 212599 355379 191239 332854 266077 404493 -71248
17183 610343 257178 26041 395895 156858 212937 168993 10552 200901 126780 168386 453538
17172 453538 649590 313424 308491 276076 820229 189599 503438 408143 480781 287686
17162 287686 212964 292623 461014 743372 628778 316372 232131 270590 263647 371769 79595
17150 820389 618027 359527 148645 329356 417167 721835 486887 306131 265 537154
17140 537154 160131 699530 459801 180170 437493 619111 391651 345333 711461 326467
17129 356589 349843 403343 176254 394434 483658 551790 393671 298505 713962 216900 490509
17118 490509 365399 587345 404725 250830 311958 318368 396571 451327 447062 602111 185666
17106 340823 364539 331387 359796 684896 567430 402261 507499 588769 567034 669920
17096 669920 482961 248647 413809 481496 685265 373823 433983 44632 403995 655134
17086 655134 1174911 607407 279216 672503 458185 670701 775101 496080 401846 491101
17076 491101 454626 440543 192406 902570 411181 513823 468295 633336 671047 527076
17066 527076 798181 442209 486296 580602 517636 589092 842785 563192 763430 509279
17056 509279 863469 553490 703395 646446 698149 749981 499633 722639 552023 645779
17046 645779 553438 517458 602294 802569 842389 604906 693292 597404 451093 616895 774731
17035 774731 745377 863523 1036868 813533 868216 919998 814139 1003051 938872 426092
17024 675047 1107977 1005719 1075416 921685 795599 930104 1021886 963513 1016698 821372
17014 821372 643455 909415 728521 640521 1124360 775978 977601 897950 973152 870447
17004 870447 981937 787953 783346 753343 983466 1297179 1137702 1160039 983400 996248
16994 996248 944335 867255 966198 1017823 1156905 1102923 743543 1124685 900672 1515924
16984 1515924 906439 1232836 1284759 1145997 934643 1053134 1204499 793598 1248997 932147
16974 932147 1220490 756941 1167561 1226230 889827 1138407 893861 1018514 1250301 1280532
16964 1280532 1211847 1189913 1289291 1291941 965152 1226144 1345094 1356158 1328690 1117871 1360227
16953 1360227 1224357 1100597 1189784 1150638 1822409 1403915 1526107 1492313 1501552 1578440
16943 1578440 1551126 1647026 1576712 1373495 1834754 1771668 1820535 1754649 1702904 1529869 1953743
16932 1953743 1846121 1711309 1645317 1446167 2112732 1863863 1304065 1911831 1813089 1596425
16922 1596425 1715360 1936935 2064300 1965269 1809778 2123890 2006269 2011690 2113024 2143006
16912 2143006 1850067 2367316 1923524 1736334 2044229 2372866 2205671 2255725 2277325 2046244
16902 2046244 2443947 2256033 2205677 2499166 2158119 2035902 2544578 2532212 2213726 2365050
16892 2365050 2235236 2474935 2646443 2792752 2737983 2665565 2337704 2856636 2984082 2650760
16882 2650760 2780015 3160282 2766321 2758649 2850876 2838144 3244958 2866140 2964435 3105588
16872 3105588 3247734 3049292 3425718 3438049 3616199 3350204 3489813 3137926 3373649 3787694
16862 3787694 3763573 3848776 4002529 3801551 4097013 3937999 4098790 4151516 4085066 4248436
16852 4248436 4413319 4341812 4314732 4741800 4624064 4681057 4793780 4497128 4922254 4599136
16842 4599136 4787183 4963585 5130564 5201359 5217507 5019256 5277761 5357435 5445364 5522089
16832 5522089 5536449 6058921 5936713 6186148 6066432 6197844 6573524 6599517 6786812 7078268
16822 7078268 7096341 7347456 7453318 7324907 7471699 7550636 8008192 8027104 8299408 8426693
16812 8426693 8423803 8841238 8923580 8945627 9150111 9493336 9915996 9953340 10130449 10286836
16802 10286836 10552410 10505180 11095617 11472152 11394249 12152951 12010131 12803918 12321039 13336240
16792 13336240 13726362 13735003 14259716 14289990 14919614 15337918 16113784 16400514 16414373 16654678
16782 16654678 17411057 17928606 18777793 19189227 19843738 20218005 20920695 21746268 22033299
16773 22033299 23075047 23682726 24701798 25505576 26216131 27082333 28124860 28762644 29818037
16764 29818037 31255667 32397319 33170730 34830154 35866625 37186175 38925586 40214067
16756 40214067 41940431 43290983 45187246 47324243 48801015 50892211 53209169 55592604
16748 55592604 57818183 60417496 62962817 65572051 68748302 71496296 74461296 77703542
16740 77703542 81218269 84703014 88322145 92336660 96060047 99818712 104345313 108060649
16732 108060649 112069555 116031509 119973419 123889185 127412327 131297642 134226830 137376339
16724 137376339 139612953 141653024 143382457 144679433 145796302 145395673 145003194 144105571
16716 144105571 142794959 140972334 138821576 135911526 132713969 129254908 126203447 121893149
16708 121893149 118146160 114196499 109798847 105865220 101467156 97804520 94109483 90057837
16700 90057837 86486652 82601772 79155646 75521433 72268157 69519869 66288313 63725823
16692 63725823 60997316 58515315 55928447 53421936 51377104 49468040 47022730 45425723
16684 45425723 43815350 42054593 40324959 38730230 37206864 36039352 34729857 33203248
16676 33203248 32121266 31165188 29559749 28813515 27961150 27082958 26151948 25313048 24256763
16667 24256763 23480686 22971722 22154818 21345892 20586411 20366035 19613468 19209846 18349885
16658 18349885 17893303 17405476 16810227 16426232 16049689 15531364 14951328 14716206 14221560
16649 14221560 13977442 13605575 13205179 12843009 12757356 12399108 12123642 11580986 11758595
16640 11758595 11119996 11093972 10723977 10556612 10205447 10187075 9764479 9815228 9475655 8949883
16630 8949883 9154907 8696092 8859570 8098947 8157533 7876256 7991462 7609929 7628600 7539496
16620 7539496 7621820 7152445 7053691 6806238 7019971 6509049 6792560 6550982 6737588 6374290
16610 6374290 6342384 5997607 5762190 5821647 5834417 5580764 5308682 5484651 5090090 5270499
16600 5270499 5032882 5066800 4971114 5350474 4843788 4643490 4452043 4527377 4715447 4899445
16590 4899445 4297699 4331958 4348393 4287832 4063625 4238117 3449326 3959663 3912687 3951896
16580 3951896 3918261 3837254 3773946 3322028 3591020 3562520 3494226 3711036 3712846 3334710 2918868
16569 2918868 3043235 3306386 3113938 3134330 3591598 3127976 3208240 2992827 3176879 3214295
16559 3214295 2927713 2799320 2675900 2865209 2551707 2804423 2701557 2734582 2591579 2651256
16549 2651256 2623216 2604473 2451735 2554298 2417833 2520305 2606929 2311529 2331109 2491402
16539 2491402 2391957 2448092 2391380 2223337 2134899 2541585 2291179 2011475 2193690 2314942
16529 2314942 2129891 2433646 2111778 2123645 2067961 1929810 2233553 1465064 1960563 1545767
16519 1545767 1701120 1773874 2005665 1605429 1794456 1502425 1489314 1830348 1715437 1860661
16509 1860661 1926533 1917819 1636283 1651857 1421921 1759835 1721922 1510186 1502967 1501496 1703741
16498 1703741 1578654 1483764 1609680 1442145 1379685 1325323 1446756 1517741 1778962 1406891
16488 1406891 1396991 1180509 1311763 1307917 1541510 1286679 1182159 1529485 965228 1727071
16478 1727071 1670482 1131806 1462082 1202205 1229175 1197086 1373783 1335305 1348774 1215687
16468 1215687 1311787 1152582 1299314 1257170 973362 1134256 1172937 1123823 1257999 1102803
16458 1102803 1148005 799800 982575 1218265 1129301 1185805 860968 1205458 1293229 1022490
16448 1022490 1048035 1069375 1237350 761915 990463 1161887 558891 1008159 814427 1187594
16438 1187594 783148 792665 862413 970685 1237784 805580 774452 815382 1008536 796388
16428 796388 1067585 656274 763693 721147 1003418 836349 1070696 855765 885642 981671
16418 981671 776797 797685 844121 623954 1009603 730351 581487 665524 1050118 577418
16408 577418 904271 985489 788759 569322 814233 782140 710785 1000163 923955 829753
16398 829753 658921 1019340 719467 915603 535042 707717 794571 860666 822040 719070
16388 719070 618435 990319 570268 542219 663323 598160 684516 761551 803050 704417 473688
16377 473688 573614 801902 688293 768930 874100 655749 609187 601307 958936 704001
16367 704001 738052 800557 526928 528431 574114 485390 768240 583349 639964 831234 1002771
16356 1002771 575076 477027 360541 733021 554780 292864 879959 584594 576543 266382
16345 872595 430253 690760 239454 682297 699891 685039 424385 344825 350938 612652
16335 612652 534229 630811 621260 468212 401770 672459 560379 354602 787593 685788
16325 685788 460961 231529 758598 572442 795813 454068 533918 493973 475652 323902
16315 323902 473946 454755 318872 479832 375781 374698 226233 139704 354957 277310
16305 277310 321391 453530 369082 610172 186559 420737 184773 414172 330824 170453
16295 170453 221016 364001 270795 178521 211332 384724 408478 241294 747632 282187
16284 814609 662245 743186 176977 664012 484297 118029 206099 342612 609835 410130
16274 410130 689582 344730 441819 116376 231654 147933 231259 288744 379125 587878
16264 587878 388763 435638 496351 442954 640396 152210 468987 362966 635128 64246
16253 -251805 538368 449460 269838 254718 275675 303441 241204 169920 507556 323056 515317
16242 515317 202287 180124 556162 301398 -18048 238357 202098 464117 93474 331028
16232 331028 473391 303526 402190 363078 386269 382988 177493 157755 318027 529477 146395
16220 294695 590828 510917 392150 246594 352270 499753 426223 274833 339478 51922
16209 288302 48050 -54080 21083 288467 363673 -4781 72096 435258 190110 391650 399570
16198 399570 179374 313965 369836 222299 380563 460727 -19088 140676 162251 -89231
16187 15846 110925 487097 265567 304788 420060 429018 595819 23810 228866 43805 149788
16176 149788 113492 74316 218527 -212448 121469 102162 -64249 147436 179857 152382 39618
16164 120191 217973 28571 163060 39963 346565 269255 137625 -238609 74947 135484 -185271
16152 194025 -52612 141625 -19583 399194 61855 -62827 47681 157247 89552 384722 134663
16140 173421 96387 305939 283426 -133437 242425 347489 43505 183873 -63485 107195
16129 -2404 19336 428578 155442 -144711 -1013 301599 90833 152306 -190955 -31448 280094
16117 145491 134141 -162370 62150 -51067 401245 457568 134643 352390 56258 91806 251161
16106 251161 -183578 90980 148250 431004 148037 115598 302355 337843 33780 232301
16096 232301 10221 -21170 -86792 176270 -85060 287407 308290 -16395 69871 -100991 96042
16084 -239472 97752 98954 -91420 2697 88360 497575 313918 209093 84740 204276 332450
16073 332450 68919 -197694 120277 163833 104454 -190002 64662 1135 83036 75422 191177
16062 191177 2040 333241 -42226 -117256 179826 -169031 218827 357405 16983 136362
16052 136362 301829 -73229 -36061 143582 -221409 163631 104239 147095 32615 533401
16042 533401 140583 -67216 263950 -203950 -39696 73524 -156934 -91088 294291 314730
16032 314730 122881 -246355 253793 -485 -64502 -291599 96764 -205409 -8022 -106266 61331
16020 59562 -94265 -7074 -49017 -8614 223761 72890 29359 -108922 73527 67423 152405 -31292
16007 -139918 -149592 186824 264709 -44819 17553 -228272 -86308 245613 -365245 -235414 -43188
15995 35388 223062 -86025 89908 121617 -62062 140560 199166 305526 122483 -70338 202569
15983 713780 -87819 339089 413582 690030 618091 557452 453604 386783 204683 214176 51343
15971 14639 -149762 20969 335847 44533 17909 -42427 133690 -305502 -16511 -117438 89854
15959 -72756 34982 28888 132255 -31670 -73191 -173094 -80419 -177694 4602 -245475 276689
15947 -254351 122555 -102785 -236046 -128918 -104350 -161087 9987 148270 381586 -313441
15936 -43213 43502 313193 99432 -233716 -368903 15028 -5034 -83465 175121 186476 -34941
15924 103235 -39662 -462251 -54524 -10923 -29135 -172495 -131100 -10959 -131466 -183087 -136584
15913 -136584 40949 102502 54682 -96155 67013 -202923 145671 -50963 180288 -219870 -91248
15901 -308916 -93752 108716 104995 377562 57503 -153741 97030 -260694 57089 -388659 -144715
15889 87651 106147 129781 -62054 -290395 -235594 -26082 -122856 -170915 55218 -258336 145249
15877 -188264 -171563 148927 -32693 50825 -17756 -344524 -172858 -102635 -264428 -106675
15866 58281 -238910 -104974 200311 -153728 20602 -178295 -57332 -22457 -101308 -191934 -154428
15855 -154428 86694 -28608 -60448 -91151 -178933 110322 26051 169905 -151917 294491 -128505
15843 3898 -359200 -189418 -171747 -12707 -10430 -189874 274918 424181 -144892 207606 30061
15831 164827 11733 -85805 -168774 -29736 54037 156185 404 22790 79112 -393221 -70329
15819 -49395 -125654 -96373 111599 216500 -254913 -110377 93405 -92240 33164 -227782 -179192
15808 -179192 191614 -90657 55134 87306 557695 -297135 -124691 312969 51222 -269771
15797 55182 -71068 -291180 -93386 -198277 -110201 149399 -61955 137337 -347833 127979
15786 187830 -107138 -181822 319235 15978 -10517 173088 261035 26608 91434 -274794 168203
15774 -94731 274996 -184159 355872 136170 57550 -44936 -44876 143736 96054 -410324 16658
15762 72921 269519 241800 142261 131797 -370311 -151199 -87327 -106835 -43078 213191 164397
15751 164397 128604 -202670 1255 161340 -148753 -35623 77746 -250959 182530 156046 4162
15739 -40877 -181024 -34187 -318299 -405874 150796 32946 -44056 -22003 -192960 186066 -45838
15727 -264420 -201212 12625 -57449 -239737 76379 -193238 -229061 267604 -1351 -412607 -223034
15716 -223034 191665 -264342 -412792 -211933 47087 24720 24861 -343378 82289 -84158 -93816
15705 -93816 -448600 7548 -272351 135420 -70386 -134743 -3285 36691 179524 54736 -123447
15693 265870 3324 65158 294670 -200838 179341 -256023 -123629 -21115 -82393 68559 -207636
15681 250101 -156819 -152110 -418013 -97913 -368730 -45819 42665 -123349 -132289 257715 -311910
15669 -194624 -21226 163018 -12426 -94290 -161797 -117569 -190214 -19919 109002 75612 -5951
15657 -397584 -2074 -59059 99155 -118575 169516 165234 -127105 49869 88752 -40271 -226444
15646 -226444 -10560 -176868 -42559 -69275 43872 -65921 504305 -111173 -165856 -201343 45469
15634 -44673 -257842 20542 -142083 3584 -13785 -29854 -175901 101535 -387919 300911 -176431
15622 -69379 32642 -27696 -152500 189597 92116 -60967 -159744 -198241 95500 -250304 -214608
15611 -214608 -83113 -49517 212094 -83552 87568 -128091 -264796 -2999 -73538 -3545 118427
15599 140446 219284 50661 -85223 -247719 -235709 249570 208492 65486 15573 53335 -161295
15587 -10524 154943 -17178 -57504 114724 -159349 96753 -141934 -94804 70095 -85797 -306064
15576 -306064 -268981 -127975 685290 -86661 362228 -468509 120132 -106945 152825 131989
15566 131989 108491 -169063 -40376 143555 83130 -112073 237551 -186943 -292986 -34264
15555 248068 140207 -68607 -190783 202025 259929 -35989 -69652 71917 114980 103734 -199100
15543 -24485 1485 9143 89911 114563 177464 -66555 -39917 124464 323945 -69752 126131
15531 -4683 53179 145704 -95525 166803 259200 -178541 -656 258305 152754 213669 93795
15519 100674 37251 184305 117726 130052 48368 135849 137756 -474759 -87698 272967 410544
15508 410544 58897 118286 301252 212207 -14788 129628 297362 65508 -132635 392392
15497 2014 -288197 -272491 60069 -238583 121162 -237219 -57349 143375 40165 313811 120802
15485 -92343 -183430 -37294 197963 -236621 80157 57664 -292694 135428 -16429 47638 260314
15474 260314 -3252 244030 144146 281456 -149974 91025 13989 -191973 102929 325905
15464 325905 141885 7973 41 -12207 18925 -60479 -64557 217770 -80747 260807 -1843 51053
15451 186322 262614 275715 48448 201128 -41971 -156619 -82006 146949 319132 91130 531546
15440 531546 336754 206766 621386 143227 -116401 119479 75042 157353 9476 46944
15430 46944 -22242 153361 -514997 -215528 145921 118983 -27118 117317 -134627 163131
15419 -132770 -15007 -36910 193939 -112610 164734 -6480 85309 306809 66480 36831 -183747
15407 -201227 291663 9736 -79759 -40797 -278132 44769 128887 215899 -106012 -119764 -449859
15396 -449859 -112920 184146 -231773 -50892 -117323 94344 49313 -43716 8976 119500 -12675
15384 -2993 -105830 133511 -294251 33752 4257 -10300 310536 206778 36836 -192946 10664
15372 -100312 -239569 -105199 -234567 119998 167986 46204 -147590 -33951 299901 139377
15361 285022 -388944 144756 254746 149557 367463 119122 156986 -115761 -321994 130364
15350 -161409 78288 -69155 48678 73600 65164 -375998 -260244 174199 -80370 177962 70167
15338 241782 -185128 -114380 -224868 51865 98263 318200 -884 -97075 258306 -191800 82729
15326 -258301 374494 106856 90832 -190671 136636 132066 240054 152433 -275760 -19963
15315 -95805 5315 -95365 69144 154211 -170498 173715 87908 384823 -14460 -186354 -176922
15304 -176922 185097 -265850 -245477 354705 -165129 126883 205428 10324 -10970 253579
15293 164355 -142678 159099 64491 248873 25931 197091 80127 -22678 -62334 146875
15282 110091 163712 -172197 -16299 -133722 -183390 111310 391400 414965 13029 -412082
15271 -99621 -354685 404731 178880 143278 149546 210180 105666 -194453 -172128 -26073 48446
15259 310344 -360949 130888 276895 -395236 -130332 22453 92276 -118382 122914 157293
15249 157293 190040 489828 -64744 -95333 40137 -19502 -97630 190882 482150 433085 1388293
15238 1388293 3493512 2111413 2358052 3029372 1284582 299447 353978 245183 350045
15229 350045 221308 202498 123816 -15121 -171050 -26777 -324675 68349 -73287 303493 188023
15218 188023 95737 -15413 183419 106842 -139698 87686 290831 67859 106772 -80482 177269
15206 63108 -154777 24540 141878 73523 -171159 184825 401297 8694 183645 143117 34799
15194 139610 -20913 260046 -87133 -188466 16649 -60807 148886 66720 234735 71296 254800
15183 254800 -91618 65306 63303 249673 87021 -121412 -213705 60078 40986 161982 -61965
15171 190979 -210061 276463 47211 -141551 -173091 -154864 143689 303283 6163 -44513 -57721
15160 -57721 16053 -20333 -217618 -122021 134290 -24337 -66144 22649 370320 189551 -140561
15148 -156123 361664 52352 20514 124668 228744 203750 -30337 201223 90057 276323
15138 276323 -119665 -148217 276597 -97316 371874 303943 149690 -81817 209852 428488
15128 428488 -104134 369095 33229 195792 120571 167506 196900 202088 25056 425852 51815
15116 163447 79312 53547 186880 326479 -168965 716332 581461 716498 574884 231943
15105 426946 191811 452489 -52625 230012 -140538 -164072 254563 -119750 292517 536987
15095 536987 2879 -130006 554167 8959 190472 89545 296998 210953 121786 279671 469384
15084 469384 248019 -32118 251744 382819 76661 -34765 354481 49531 180792 153363
15074 153363 -126427 237523 100964 226147 -436144 44130 305643 338742 249212 -169630
15063 326883 344556 342971 113121 3445 -323122 113206 -105394 152326 391675 647783
15053 647783 154430 101704 397735 260455 68492 153330 36575 279822 135007 60565
15042 172286 -27563 187932 178835 13803 -142479 42590 148133 254498 12780 35176 350418
15031 350418 46704 238537 63789 255588 616100 -44007 -15707 455524 296402 109685
15020 245960 199058 697663 441668 129360 18601 238084 509604 257230 91364 606234
15010 606234 449674 209509 237148 226406 135151 535645 248117 156029 106955 281235
15000 281235 172596 271313 559804 289759 235735 176924 160614 392996 154392 336340
14990 336340 601666 30716 492956 383527 253542 309402 256255 417554 63101 107872
14980 107872 247225 424625 271412 471173 261046 -15079 99906 590242 475991 119893
14969 313382 498724 420951 -7875 345335 80037 294696 412936 372677 123787 196818 290145
14958 290145 349337 114302 296955 386471 379255 280924 298304 480558 389354 -69392 205086
14946 210402 49682 173592 182678 346239 414617 344438 508456 412537 200471 47914 -53904
14934 199233 654238 221756 344016 292043 444749 363095 252839 675118 447296 872396
14924 872396 568740 425829 658761 744814 650684 523279 478625 753444 638935 782586
14914 782586 1185151 909478 504994 686403 342234 677113 529543 546584 309428 408125
14904 408125 172321 185288 318714 787927 156967 642108 517189 157991 342885 125338
14893 563837 125704 569512 542169 385257 486297 202948 227073 296932 440019 250534
14883 250534 531620 637803 275183 484006 361672 297061 405048 217051 10073 299746
14873 299746 201623 239670 462735 369734 200779 733245 583102 379070 453446 325370
14863 325370 318986 599215 732836 490389 639455 270873 406156 100275 307731 485725
14853 485725 410114 107802 348298 591479 472968 723543 530968 570108 290156 477980
14843 477980 203235 639959 670448 724305 639244 592125 609557 646439 584226 983227 788825
14832 788825 499750 288467 463332 349311 712213 526181 581940 771021 849285 418581
14821 559522 803951 545376 494646 474488 621681 638826 616574 988859 244403 705263
14811 705263 881273 531346 137497 590390 405765 366854 390644 477838 417481 708845
14801 708845 874021 538295 916734 865005 619059 352209 745595 761070 603497 775156
14791 775156 461418 596027 799309 661041 228111 502200 771843 591376 737433 527244
14781 527244 110906 350314 588659 354986 481197 652300 640735 779120 779254 574882
14771 574882 571946 829967 282358 791521 765531 708719 788543 434148 476844 486619 532914
14760 532914 679184 331734 726101 342392 698845 827750 845943 634016 489121 967732
14750 967732 616659 479737 518674 519211 953536 521369 1036735 916466 826468 280323
14739 545171 441729 428304 543519 678762 447243 704259 601395 742459 1162424 995579
14729 995579 433608 681250 800944 1011807 824044 823864 1429170 1212063 1150939 1074456
14719 1074456 641177 1022582 1224598 1073511 711237 772314 1068692 767842 860508 832600
14709 832600 725125 678629 794063 738858 872357 885706 701256 990858 515686 770636
14699 770636 1163652 739348 1348301 1224224 791700 852581 1018540 1231671 1169004 1031094
14689 1031094 845796 529580 923559 783418 877627 797044 682976 927464 961128 925170
14679 925170 892003 839488 878669 881750 855576 1198854 1066776 1383449 816688 1192760 811421
14668 811421 976290 990138 856327 789140 1113746 966113 1067075 877695 852972 888370
14658 888370 1223783 1121683 996188 1363126 949809 1476264 1138778 1198350 979402 924641
14648 924641 1275028 1260724 1560913 1512408 1254733 1004252 1119262 1222339 1553463 1068089
14638 1068089 1425555 1393643 1153899 1377639 1122348 1184565 1131696 1132074 1247014 1387515
14628 1387515 1088515 1263551 1164782 1327875 1331706 1572944 1397061 1742740 1516389 1166406
14618 1166406 1226451 1051327 1458275 1330174 1317069 1296201 1362093 1365904 1380297 1534252 1379518
14607 1379518 1845609 1515345 1644246 1689963 1704575 1164422 1636110 2019497 1433772 1724045
14597 1724045 1720033 1592878 1741034 1775348 1767685 1600015 1334646 1580128 1535779 1973560
14587 1973560 1794396 2002026 1987651 1917285 1868513 2069540 2174156 1816448 2067060 2296307
14577 2296307 1722396 2090079 2281282 1971285 2048131 2149189 1937477 2400403 1947677 2392521
14567 2392521 2249829 2366720 2341675 2408273 2660876 3033754 2524035 2729377 2606986 2967020
14557 2967020 3093245 2832508 3545178 3687310 4089353 4441713 4824343 6083259 8118941
14548 8118941 12134395 20463580 39621003 41861436 19639266 9150757 5052270 3145767
14540 3145767 2710974 2707661 2244884 2476953 2868837 3543540 4838187 8958402 4461959
14530 3111352 2617841 2017850 2328187 2481293 2307731 2230208 2477013 2187898 2182970 2497852
14520 2497852 2253762 2490919 2557843 2688883 2965965 2257744 2694546 2514478 2418490 2571073
14510 2571073 2691018 2905679 2628410 2630293 2844784 2616612 3064564 2863828 3146830 3304367
14500 3304367 3125547 3232427 3259802 3244504 3236319 3426485 3397118 2962610 3361924 3408184
14490 3408184 3245170 3450617 3596445 3539130 3537336 3644954 3817329 3889245 3619669 3995558
14480 3995558 3816551 4014760 3954409 3957746 4359087 4390546 4484596 4173207 4230152 3993863
14470 3993863 4014385 4082094 4612028 4451940 4537381 4108101 4624586 4588708 4460416 4518674
14460 4518674 4564398 5218161 5322504 4982439 4713955 5126684 5244780 5226406 5497234 5303577
14450 5303577 5417487 5315685 5430528 5653856 5848978 5963473 5992446 5807161 5972044 5961677
14440 5961677 6067746 6239749 6348568 6430143 6271493 6509576 6491866 6929029 6597270 6864058
14430 6864058 6637473 6876912 7480710 7505821 7619797 7420676 7309182 7688736 7367183 7669823
14420 7669823 8103950 8107262 8167638 8379763 8404682 8815569 8909557 9052448 8814139 8946616
14410 8946616 9060307 9530544 9118601 9583273 9820218 9855294 9896626 10127777 10289685 10426153
14400 10426153 10569225 10780554 11103087 11035983 11159455 11150881 11522160 12006627 11773021 12196089
14390 12196089 12298319 12751758 12946361 12988652 13349900 13776294 14108885 13852358 14178002
14381 14178002 14417524 15255326 14972377 15024430 15511933 16095106 16218061 16626321 17076496
14372 17076496 17336297 17817924 17726133 18484941 18633466 19331222 19654573 20011338 20506770
14363 20506770 20901919 21347349 21827642 22446938 22986711 23175072 23599385 24083499 24374431
14354 24374431 25355956 26404444 26679265 27476037 27926674 28288111 29280508 30041264 30917023
14345 30917023 31717836 32251471 33554249 33931596 34917671 36156315 36962807 38141238 39046763
14336 39046763 40403811 41381606 42747882 43765431 45302679 46671283 47915018 49583515
14328 49583515 51316287 52699269 54830566 56586017 58511038 60294175 62334654 64699578
14320 64699578 66875951 69362817 72007746 74687093 77542626 80438973 83457387 86495434
14312 86495434 90120159 93770700 97942759 102173329 106066627 110890672 115442961 120856645
14304 120856645 125996609 131590084 137629427 143912992 150743094 158001673 165806348 173657693
14296 173657693 182002792 191081174 200966805 210807194 221511132 232736514 244592780
14289 244592780 257196688 269859491 283459735 297684452 312069027 326772048 342080516
14282 342080516 357630412 373001395 388272877 403355798 418099869 431755452 444508222
14275 444508222 455845639 464923868 470703134 472881161 474355339 475478227 473719799 469056367
14267 469056367 464041151 457885866 449970609 439721446 427341363 413418285 398750619
14260 398750619 383310238 367174460 351075413 335265311 318980701 303878388 288925930
14253 288925930 274508804 260784058 248067443 235607309 223555021 212323945 201332484
14246 201332484 190957904 182090631 176964827 168507012 159535672 151885495 144817120 138340744
14238 138340744 132493047 126700591 120930280 115312432 110434431 105956661 101810787 97830999
14230 97830999 93695676 90236371 86756142 83426603 79938752 77049849 74346491 71413740
14222 71413740 68942951 66684365 64808612 62618983 60206653 58256293 56152982 54498814
14214 54498814 53151469 51525477 50012128 48167255 46771208 45430949 44458359 43619158
14206 43619158 42544407 40669800 39515713 38569362 37058186 36579569 36105710 34659394
14198 34659394 33929515 32948073 31864137 31160272 30769786 29794146 28998769 28166243 27378329
14189 27378329 26668195 26315728 25778219 25097445 24738408 23970592 23996606 23046223 22469980
14180 22469980 22077147 21577018 21347005 20854943 20082438 19807814 19695323 18988165 18931930
14171 18931930 18512591 18318367 17622428 17037370 17125766 16838200 16304697 16116021 15902989
14162 15902989 15730881 15508595 15328110 14822648 14326259 14465052 14010960 13609828 13785942
14153 13785942 13231398 12846289 12846526 13082592 12560131 12087542 12032088 11728057 11869036 11376424
14143 11376424 11615283 11100099 10994974 10788470 10738884 10490916 10305821 10369931 10246413 10221746
14133 10221746 9832412 9669188 9613560 9280715 9166334 9063824 8899824 8913349 8599936 8173174
14123 8173174 8762736 8229828 8587657 8183089 8129099 7796691 7937482 7669407 7874812 7683780
14113 7683780 7361601 7409874 7336815 7360946 7148802 6946958 6790190 6767501 7054242 6618112
14103 6618112 6203337 6783533 6460570 6472866 6455906 6305411 6193921 5997583 6161104 5953911
14093 5953911 5656074 5819647 5858401 5366968 5302898 5464987 5459251 5439710 5192509 5216130
14083 5216130 5135000 5482617 4985882 5130942 4941179 5052627 5120422 4887526 4706628 4689023
14073 4689023 5151406 4674669 4317727 4602727 4335919 4397469 4738333 4612203 4375680 4430330
14063 4430330 4432553 4014409 4440427 3936353 4462541 4038995 4214411 4038245 3813548 3648485
14053 3648485 4020123 3768097 3834745 3624145 3484851 3705647 3522112 3603721 3442083 3735663
14043 3735663 3294086 3373525 3688223 3397033 3410214 3145734 3211851 3302471 3326057 3354756
14033 3354756 2929991 2833991 3328667 3349025 3170883 3258800 3133773 2933965 3129518 3078321
14023 3078321 3012019 3077380 3174388 2811894 2839541 2475955 2685067 2881627 2741856 2704110
14013 2704110 2735098 2687342 2590133 2623220 2481036 2568067 2691982 2452056 2499631 2210921
14003 2210921 2501891 2353188 2301555 2472598 2323614 2642517 2235469 1902043 2315143 2207652
13993 2207652 2544688 2249519 2407868 2935885 3979027 7217059 13373232 32038744 45677429
13984 45677429 26382402 14044882 8889277 6327701 5168801 4535336 4006183 3653888
13976 3653888 3215879 2965592 2883721 2920909 2969732 2457571 2813738 2407358 2652008 2495340
13966 2495340 2417774 2522960 2179722 2436285 2199960 2296667 2503965 2090566 2132443 2001920
13956 2001920 2262589 2295482 1803932 2004711 2201504 2156525 2052449 2140803 2116091 1874230
13946 1874230 1963107 1985267 1903229 1826369 1782217 1804761 1685077 1808443 1874722 1678186 1690717
13935 1690717 1861578 1649793 1986608 1713566 1879707 1612274 2132758 1579374 1882795
13926 1882795 1547501 1546473 1645493 1768836 1121449 1814868 1386404 1856840 1533138 1406854
13916 1406854 1459673 1576170 1727877 1568120 1667961 1678250 1413019 1569372 1397998 1322748
13906 1322748 1369955 1454814 1455531 1467379 1513591 1478188 1555904 1462709 1328184 1508044 1638357
13895 1638357 1335579 1315166 1345144 1345756 1105756 1446219 1186010 1472087 1336198 1440191
13885 1440191 1197570 1373634 1152724 1246764 1028070 1262265 1119888 1091057 1030920 1150736
13875 1150736 1089054 1296082 1274143 1231457 1200567 1488074 966318 1508248 1341741 1224733
13865 1224733 1202240 1223001 1167600 1188982 1219595 1122356 1399962 1057548 1350797 1004048
13855 1004048 1181984 1122373 1414287 1065599 1041616 750967 1527648 1005056 1562432 1109227
13845 1109227 1064253 673009 978954 808158 1208045 1215924 986045 950014 957680 923090 580499
13834 580499 883994 1214339 774082 942545 1227228 1120176 883288 515718 1277326 1116598
13824 1116598 899795 920582 864561 952382 774176 1060747 1019468 740190 1059046 888017
13814 888017 926371 853037 571432 994373 651601 1042085 1111348 959443 834914 920023
13804 920023 876815 604776 911087 771679 753543 964131 792956 781378 663614 771463
13794 771463 725684 911220 679979 783542 374712 938910 770814 547811 437524 882954
13784 882954 1144005 713934 369494 816972 887092 902958 999651 852694 806362 924479
13774 924479 749061 565219 1054223 687097 849092 692931 894690 385618 589261 936448
13764 936448 799206 852459 771519 1045096 872508 620489 1102887 540291 604617 400841
13754 400841 666396 851422 488543 609445 519642 955614 630849 855591 846503 743853
13744 743853 896510 455829 572191 844066 642894 840676 552055 524590 735764 933903
13734 933903 1055543 889585 372346 882501 706880 751796 578288 610181 654391 790913
13724 790913 937863 750304 707694 374682 499151 750383 629109 423765 880033 868157
13714 868157 583032 532411 609358 819443 417756 732881 429676 560356 628163 528178
13704 528178 620254 323139 300792 843333 412135 717757 540937 735207 587551 693875
13694 693875 291833 229467 748081 436769 394935 544537 590173 331742 521548 359948
13684 359948 536391 494067 836078 544351 758984 611812 786958 374003 373712 323976
13674 323976 574163 508309 791897 490346 509458 661929 410402 432884 408104 494647
13664 494647 702444 694491 530164 322469 590614 611675 305296 540115 654552 377202
13654 377202 494675 454492 424453 363180 372935 187666 428716 617933 212582 330009
13644 330009 215124 496667 489862 766995 291381 617697 653569 430597 474641 521797
13634 521797 368744 35817 335163 933062 440706 631809 297858 423921 242674 607085
13624 607085 726011 448924 -558 432286 465560 402401 333001 461118 357026 182620 260412
13613 260412 342916 388823 274050 586722 559591 699082 76665 185134 580484 136166
13602 383907 560121 328279 433102 492634 188572 303075 364326 295325 499829 237437
13591 516775 401618 568072 356747 384249 565812 315404 -93081 323006 38206 416969
13581 416969 645354 465155 261186 71537 199443 646134 185251 361483 279211 -18354
13570 303726 640714 679787 506425 404967 79035 231064 661999 345551 380039 182604
13559 73635 129614 605442 328866 911853 523808 532963 492185 14821 304450 -70017 419916
13547 324260 398589 402995 25576 97549 168132 243437 476338 504047 328636 409724 231639
13536 231639 152444 309561 395174 288699 525357 436028 27724 233643 458337 214677
13525 182006 465262 71279 26062 248986 403498 388448 129793 514188 414845 278268
13515 278268 231338 250450 313901 235306 139218 147737 343982 336446 630149 196836 353854
13504 353854 428218 -33612 543131 295145 -40501 297907 73644 508645 438622 554877
13494 554877 137042 311982 57040 88232 241039 240382 447643 228662 -17063 313640 198301
13483 198301 406644 292804 506268 50252 341148 209253 333538 152255 52110 128393
13473 128393 71443 93035 93946 532790 389356 264023 314391 255485 189554 22041 473421
13462 473421 414544 -179593 193405 257071 141646 51305 266025 517310 129940 266389
13452 266389 184973 456190 -130691 288644 80620 105878 187589 557068 291387 -52244
13441 133379 -641 234022 -51222 53511 170565 337389 81010 674750 54574 504116 414820
13430 414820 448722 253016 397282 160818 217249 145263 -589 199673 -68424 150205 253220
13419 253220 365020 258498 168732 130115 188771 125800 279927 205930 1938 265332 378651
13408 378651 251039 190425 278770 587967 239679 194384 339142 144616 32080 143912
13398 143912 337423 -88047 -55155 171519 49050 207358 88329 152277 -35789 140775 197260
13387 197260 356748 291582 -186265 258184 -183481 333637 467955 249775 348022 93724
13376 69362 240166 267352 177613 453782 191791 350058 1888 368906 144342 258555
13366 258555 159182 210122 112380 601291 132123 109634 259089 340924 229799 293111 84375
13354 283471 548431 492841 210106 97145 115446 563935 176295 -123002 87820 107300
13344 107300 391201 350049 194606 47218 637945 320926 197439 646682 440904 402161
13334 402161 423661 212415 688421 252294 422707 335813 235557 249228 236805 294728
13324 294728 84253 -148154 75030 261967 443503 336057 228923 57661 386024 265888
13314 265888 273359 101799 105155 204109 178705 211765 175336 313105 45766 -179365 25732
13302 -32669 31604 164099 172986 146615 216525 380722 151764 -7751 -39771 69960 174902
13291 174902 6372 267086 196984 96393 12188 193793 237843 81619 469722 312857 103338
13279 -163887 614158 -64518 170875 59525 131476 152822 2727 580330 -165644 62293 314918
13268 314918 261721 425383 118608 -11332 -161228 -31256 265024 -49847 147961 242718
13258 242718 137939 70213 -86713 -75827 38600 3895 103621 -123155 358364 405493 168456
13246 262135 177021 37336 84135 118026 -163106 126350 -14943 81276 49766 340390 195999
13235 195999 49353 26144 112352 267993 287681 206161 3557 -56261 309988 158984 203137
13224 203137 422934 75261 161916 209601 -299375 112869 46416 227867 -99092 309294
13213 182101 -207778 131508 -150926 219850 124084 45182 75267 150967 -104545 226697
13202 -147728 152948 -46091 100165 18168 224407 181754 248806 -28068 236574 -102542
13191 42525 192443 -176572 110324 -80987 189397 191063 206016 -93467 206360 241654 405133
13180 405133 116238 295506 242320 288451 64012 245163 -21476 249457 365744 -253257
13169 216841 180911 -9994 76404 120797 175655 93844 138116 19333 171562 365339 208099
13158 208099 -89866 251089 20414 -144094 215312 187583 254411 -176304 280294 -202924
13147 -168968 104475 371204 82869 122287 60705 -39331 53815 203349 190740 251728 329475
13136 329475 282209 -191018 104443 328636 -72593 121108 74169 188540 139260 18485
13125 -528466 -116610 -31919 108381 12662 -139763 12884 9905 182571 -173499 97659 -23903
13113 231296 265597 40091 123317 -109338 153349 -34230 268396 13782 -20329 116608 -144198
13101 101179 -95259 70082 246644 257441 60753 -163432 -35597 311736 205932 128409 -56239
13089 -11479 318009 -150518 494884 -55367 375961 -59159 223378 370727 -81742 417723
13078 25242 -143597 158989 186510 20914 326312 -282648 -480678 141382 -57562 100750
13067 122985 141650 132421 325066 -99206 -8653 40607 141885 -65416 144322 60068 150907
13056 150907 -144447 80294 -76376 77313 100570 343241 412102 12909 -116582 160292 -206030
13044 -131577 -4944 158633 -150373 -60233 140947 37674 411512 133425 106594 181174 -10098
13032 325727 152840 15544 66322 311484 -201863 18954 330439 155242 153414 -123764
13021 10527 163885 -147130 21451 133879 477762 -120706 55229 14761 154884 166313
13011 166313 177552 125516 -8868 77570 -193518 -172879 66073 -83719 -69441 59045 210470
13000 210470 543326 -233243 -84350 -54333 201700 1463 66632 -129296 -86955 281740 -182476
12988 -42595 -23317 61935 123320 -225899 -156370 47815 62551 140860 110288 -32320 -369970
12977 -369970 -97251 13175 -54711 57058 61539 36759 126427 48832 -231346 78659 185333
12966 185333 120829 183881 582650 -449188 207368 4422 -232594 -45169 114669 178578 72700
12954 -131832 -336304 157234 155478 139840 -72531 -69124 -168679 -27193 196019 228540 162363
12943 162363 294183 -338807 -8181 -105046 -172221 -157514 -51845 -423894 -61328 255748 -43037
12931 -132215 48821 31218 -7153 -284887 -122031 195549 -342080 270273 60823 -146211
12920 -59037 217344 -176523 217118 156517 211896 -155602 -337418 -26837 -76494 31753 -36701
12908 -24187 -320207 -23111 246381 209144 -162034 33800 -21439 363750 222497 259995 -189792
12896 -41380 -37941 58623 -59949 42403 -15389 -436041 104977 310885 138968 85528 144488
12885 144488 -246308 -140140 121735 68866 155819 88588 146924 -162475 40534 -172075
12874 62983 -88862 256121 278377 115956 42886 134708 72904 -59926 -240693 -273250 -104751
12862 235909 120051 178752 90547 22973 -14354 -18173 -52634 -100180 -192625 77038 18444
12850 177518 123039 22521 -115867 17170 324716 231103 357102 -111965 -191866 -104655 -225642
12839 -225642 191008 -137464 46844 24868 20507 -138057 112933 -172900 318624 -247916
12828 223519 93030 5586 86380 206070 -86669 272790 298287 239458 76732 80489 181488
12817 181488 294043 -4466 -52514 -322383 -64937 -27078 359546 144336 368319 -131369
12806 60693 -372116 -201194 -90507 -476 -30702 227748 -34119 -9959 162102 290484 203490
12795 203490 -13306 -196095 -326767 319460 -106469 -89144 -181514 -176400 45998 131104 -132686
12783 102411 208286 147959 12706 -106913 180322 192530 -24587 159159 34780 -149724
12772 127598 -256405 83496 2836 40549 58921 158305 31103 -20471 -198556 344884 -12739
12760 -303594 -361611 -201229 256817 61566 46135 42097 -231222 103722 83355 -25773 -7069
12748 68818 279457 -37850 -342966 -145455 -316890 -437438 124507 86753 -63221 123695
12737 -416174 65374 -67937 18141 -23824 -159165 70707 380348 314249 11478 -333205 1195
12725 62349 -88071 293593 -26098 47515 480319 -252437 -37462 -32331 38255 -219029 146973
12713 100263 -94854 -268559 -71825 242290 -237026 -136805 -19493 -168968 -126516 -208655
12703 -208655 254071 -36233 69102 -445286 -160734 -3101 280727 204129 251157 -462903 144049
12691 124523 -66190 250564 52146 -130170 140074 -126448 119371 57166 -49919 230228
12680 23298 -89577 -20888 -277295 28622 81609 -5185 113149 -20585 30788 -57416 -56548 136070
12667 151660 63324 -95572 -223941 276561 96839 343634 -56428 392932 -148599 179838
12656 223920 -50507 428110 -46964 269237 -193254 369550 296091 -142615 -4561 15540 -78500
12644 -300716 -23042 -61266 108496 346616 -17661 505199 18524 176371 -168039 27666
12633 49582 -147566 51525 396614 66307 241628 190695 271029 187286 197623 -88542 168286
12621 426995 210248 -38323 304466 -206742 151556 -16463 266897 -96393 112035 342275
12611 342275 185448 181600 230962 -315642 137864 466496 -121999 -25961 -248385 256718
12600 -88668 63159 273321 133727 -32203 139893 361248 159877 -33162 -107446 139523
12589 -107463 -63762 216028 108555 175691 91249 -198814 -23292 33932 -28067 -29627 86246
12577 13380 113261 128739 11968 -140648 29957 -168790 -85801 -169466 -148083 83241 -122213
12565 -174821 -346387 177049 242915 167586 198272 -35811 -154819 304477 426816 -8025 137352
12553 -233753 -214992 157172 -226600 78179 -110097 5053 -134225 131418 111857 162266 170605
12542 170605 -81407 45096 51830 221983 -257392 4508 324659 209499 -100571 17753 39266
12531 39266 167068 404605 222594 77406 -280550 -221699 267575 36925 279255 169584
12521 169584 51424 -171281 169533 -135724 55297 91649 122218 37263 -25847 -52337 50041
12509 35147 -14491 -349388 312780 18424 -34812 298612 144999 300101 330762 141075
12498 87311 129894 155419 177319 74458 12338 21612 149247 -145179 -29411 -327246 9122
12486 5454 -264941 354988 -204818 76102 -224107 222710 -205962 50810 284688 98275
12475 15262 259581 223652 132876 74392 124796 37645 -330210 153543 200933 27547 -165150
12463 17386 195681 117112 -166974 -128666 -222490 -144755 51108 259588 20262 -186436 105001
12451 -84692 -110095 -118460 -211971 -91512 269730 -108022 205413 -281146 75201 -117433 62264
12439 -78784 82914 341288 200795 -31176 85369 -48405 184703 -107749 110120 28320 -50328
12427 223457 -59235 -378420 83173 -125903 57627 24790 -83352 -38565 180082 -294343 -262633
12416 -262633 -424366 -142481 95220 300012 57085 93270 256170 102389 375910 217492
12406 217492 -64484 218581 -137816 -388921 -72140 289729 72356 -152890 -136800 18811
12395 7725 -188426 -110797 22930 37462 71758 369371 -109182 -114859 -89252 -54550 325449
12383 64382 -243723 -5167 119068 -217439 450419 68345 209059 214021 404988 89878 67279
12372 67279 51400 310704 210313 -138131 22667 348879 -65285 -239525 262984 -279442
12361 -56206 341676 -178244 271403 36585 277295 -58795 215327 133336 -342711 112501
12350 -194749 210536 -228947 -80192 -51739 -32442 83215 282059 -2039 152849 137914 -53133
12338 76351 114837 206838 43177 -121110 217183 104543 115647 110725 -55949 500233 220806
12326 -67962 380779 243803 -204136 -110116 168761 273838 458062 19732 160779 102820
12316 102820 576032 123362 520374 112387 -27329 104520 333638 85289 -74293 12281
12305 2837 344741 -203916 13730 -36434 -468820 -116342 -130274 -320418 151321 -116298
12294 136780 163186 -126641 -36624 13775 -92479 -104432 -51494 279560 -151959 522882 -160337
12282 198925 34727 44996 202107 165493 -92765 215022 232061 76660 -220603 -74929 -109896
12271 -109896 -436 75101 -24891 -29524 58806 -291 82460 119545 -122759 9793 103349 -320854
12258 124262 -127941 172310 -181846 107712 -145166 -296641 28883 -56629 258905 -125013
12247 53023 19748 -78331 254364 193094 120606 50504 373902 75041 -93562 284826 133224
12235 478450 159353 -55199 -82374 68500 89248 -86192 179169 339492 -158691 329754
12224 -34279 19369 251857 445468 358038 -57178 316118 267308 -182773 51303 215620 471221
12213 471221 282320 115431 687979 285122 220919 99721 52314 107080 234703 513843
12203 513843 -19936 251152 176639 108834 234147 277747 92001 -21811 14428 337019 443644
12192 443644 -8704 65963 396168 320925 217053 355309 321719 -99705 98591 261283 389442
12181 389442 292998 146168 42315 166351 -150196 268328 38241 -54852 86372 317215
12171 317215 295079 273253 124127 111535 17951 71880 325361 114672 25793 197823 -149473
12159 -31258 163833 238109 186115 290546 426717 207414 200432 212612 -34098 327540 219786
12148 219786 387284 283580 -207038 274130 348104 365239 217103 169868 211013 -122868
12137 361248 276631 263543 201419 -247131 182523 -156103 181793 178191 52192 45230 85833
12126 85833 425651 129173 316183 220625 240209 -91850 -196212 -38068 -322345 147493
12115 73440 489835 359155 -69855 316757 -13414 29980 63035 393019 -159394 -297159
12105 -297159 -224130 138872 -122992 -147955 91468 183410 -89003 182064 -149259 -107509 251004
12093 -294095 35924 -163264 120060 -114510 127015 -12837 -81527 -327530 99521 -9971 -157089
12082 -157089 -26452 194730 -2236 45777 380055 335114 40604 -289536 -101980 -108550 415513
12070 -56107 85346 -205187 71891 217130 107827 176166 88429 -142319 435599 -45585 -5655
12058 7205 -88980 454292 -163789 -170159 -218686 19241 197001 60712 -219971 -157591 -215139
12047 -215139 89296 156096 -137499 267115 -241514 78114 -24489 374292 -168742 -181214
12037 -181214 -80809 67013 63406 -99923 -238951 -427033 40304 226105 -306729 274861 -221418
12025 -129152 77729 221305 -85940 -114504 -167745 7225 -235227 -362414 -113364 42916 104713
12014 104713 154362 -120254 -156001 8486 86193 -252462 -151729 27597 -378553 64451 14225
12002 156199 72135 -180276 -65878 -112615 -54438 -28752 60595 -58654 109151 151790 -74486
11990 97185 23025 -153193 -120934 -33981 1703 116088 233634 -19366 103235 -50463 -68268
11979 -68268 -86719 88879 -133530 -65243 230105 276828 116027 108120 -366171 -114757 64540
11967 18802 -366847 72879 10506 91660 266338 -415543 -48501 -374983 61495 -108042 -163023
11956 -163023 -248042 62616 41450 -2122 -146531 193098 -268165 160415 29897 -86418 28599
11944 -65138 423852 -77534 -225498 -136296 -32550 164434 -94595 326445 -112942 -250296
11934 -250296 164754 17703 -149364 32420 -113514 -238165 -35036 -23469 92182 271954
11924 271954 -5021 188678 -184902 326561 -93262 -23361 -277985 -466763 3979 282278 -33600
11912 34401 159069 650 271888 -117987 -18652 84820 -62664 -558694 -136263 -14936 -104373
11901 -104373 -247354 173480 -127065 363542 -91532 -87393 64511 268304 104713 -130359
11890 -272906 46845 -80222 -55806 20479 75951 -289033 117966 173602 -65018 163044 -174693
11878 203345 -271861 228094 -169097 -133484 -52550 -55022 73344 -187273 -251196 6536 -33368
11866 118945 152723 251526 245330 -305981 -203 -57621 91925 -226777 13100 112936 184424 269742
11854 269742 21093 48177 -57714 275918 191645 -137457 -116347 -129096 195833 48304 -332162
11842 -62038 -81150 -157690 -104461 147276 189534 -156259 -176282 -6433 -159676 -137674 -322846
11831 -322846 -123862 -61187 -250273 -197867 -195071 -344945 -19050 -134051 -273148 -122319
11820 -149645 -71369 -209782 -235289 -36358 -23089 161485 77380 -328 100708 -2215 -43384
11809 -43384 88165 -44625 44099 22740 56643 43319 101569 130044 308602 -24334 -140775
11798 -140775 271131 -214003 -291945 -176272 -150140 -402777 -175696 123867 -22449 100022
11787 70743 139835 -2484 -312309 -188450 22750 99519 -283023 253323 -82077 -93041 -381989
11776 -381989 -65726 69958 -22513 104243 -425055 -86932 -122433 351593 -288462 -226945 -85743
11764 156345 -147431 116917 -167047 -225674 221276 -89000 147342 65150 -4414 5739 299123
11753 299123 56948 -125558 -24160 221597 -245813 -77941 95616 56151 55202 141024 -297713
11741 -144809 -24179 -239172 -218079 -72618 -18006 192985 145160 90693 91449 -217572 -198556
11730 -198556 156703 67389 -282423 93924 -64684 -218753 -308074 186121 -354232 23743
11719 -52344 309652 -63931 61647 -200745 -227681 240515 -190090 -141451 -281571 -321320 -142767
11707 -294972 297092 -99423 -17664 86341 -345470 -221620 -138498 24264 189125 -212810
11696 -142943 -259583 -28629 -312649 -260812 184042 442255 29978 201346 -221289 -101853
11685 -70909 -140856 -10504 -112659 17856 -25067 60448 94164 120404 109278 188964 -211149
11673 143445 -82325 220207 303088 90714 -128285 -342375 -52833 -244740 -19930 60404 74309
11662 74309 58932 115006 99577 -362867 20549 -171507 106633 80381 31005 -125408 100591
11650 -197051 -7303 -329708 -72581 103014 251244 81889 170198 -87342 -93592 195635 73201
11638 -21202 -155355 -48905 -73356 137734 -439340 -381097 -150434 -307750 -65780 -73230 -235144
11627 -235144 -40474 -3731 113940 -187418 -51000 -244636 38136 3692 -189808 -267390 107326
11615 -301791 -21155 -11001 -54382 -123362 53783 188164 247374 -139047 -121096 82609 98949
11604 98949 112697 194703 94532 35440 107766 138491 85420 -353159 186163 -9808 -244105
11593 -244105 301183 -120014 117082 69926 100914 -203181 -326403 -86509 -230768 -59239
11582 -65037 -202686 -6912 107632 -21963 -159246 55394 -153292 51103 -252623 -91090 -138147
11571 -138147 -109856 -197698 304995 113120 -325288 -229528 -299052 -36897 -23630 142464 -374097
11559 -193638 142831 307056 104349 -77839 -90201 134795 -115308 100970 168489 71300
11548 255710 334919 -180659 178131 -268866 144509 373243 -44531 21576 53694 397833
11538 397833 -74979 -36572 4610 -143376 -60408 -245475 339575 -172953 114611 34109 -71382
11526 28320 -165822 20503 76751 53703 -176200 137480 175157 -53462 114259 519890 44989
11514 -149756 -338865 161132 -54378 -210973 312875 33080 203112 31705 113168 -250292
11503 95118 235797 -18387 44008 341841 -78492 248042 -22903 307684 38988 203607 302855
11492 302855 93727 375851 40817 45719 10905 91649 354076 402258 128002 196568 264212
11481 264212 -127217 -99983 167259 276193 94762 43595 107108 105564 -80955 189346 -48569
11469 -84677 -32801 -67004 145713 108986 21994 278112 -239341 123678 351448 -123150
11458 541067 83424 233232 12120 405541 -57906 176552 113699 106170 114555 -43584 46616
11446 -105492 337419 -146917 154038 -28813 106546 -49314 233604 -173543 -285949 -190402
11436 -190402 13317 -231413 295 30140 245328 -115807 -135135 -246100 -59673 -70275 88263
11424 45381 353723 19281 -407281 -15354 118129 172322 -39877 95739 -259213 -219102 -145751
11413 -145751 -13618 48177 21572 385292 -63325 -102715 -160895 238115 -263192 174634 246247
11402 246247 -301426 315213 34293 -131462 -57258 -107247 -253570 -286839 -238124 -125129
11392 -125129 -141105 -73080 91815 -19178 -65665 77125 -89187 111627 115429 -29210 -52863
11381 -52863 86023 61344 127562 -175221 56354 -64251 -466044 51728 64387 -139835 73058
11369 17600 -10188 110748 -118886 37391 213248 86517 47083 26395 -56363 174964 83461
11357 -96848 -42746 200145 55574 -112991 -134242 -127546 -75930 -117043 110998 -234583 -238338
11346 -238338 44956 99718 -112318 115368 -325182 74444 -147008 -172270 120066 24980
11335 -160671 -66124 -228614 228910 99608 76915 -373254 -20362 -76263 -107003 127767 -196310
11323 -116486 47969 -368199 -134684 -79093 63695 -96436 -5854 99018 -92260 -199217 -175605
11312 -175605 194562 -255240 150697 149235 163647 5387 384326 -133327 -244740 -155460 -318213
11301 -318213 -214416 -4695 -154850 -44995 -260666 -472569 -268222 -75832 -491786 374124
11290 -128686 -198078 -321189 -297498 -180673 -207104 -146986 126750 -398607 -38149 64166 -210771
11278 -27604 101316 -61461 -291210 16811 -41944 -611884 -29 -178962 32109 -50416 78140
11266 -139652 47684 -11161 -37490 79785 -56930 54013 -42122 57172 -122935 -211560 329613
11254 156959 34874 357260 -318961 2034 -24949 50136 2494 -333190 -234354 -178759 -160542
11243 -160542 -4178 73927 -97776 -19785 -98870 241037 198969 -428336 244897 -160940 204168
11231 139967 -5627 -260056 -257105 -19481 6490 -366048 -124407 -266615 -500212 -254136 -213958
11220 -213958 234972 -29228 -245616 -193576 51491 -183048 35421 78558 -253407 -229835 -53342
11208 -88913 -132901 -23447 -87573 -159601 -268390 -72807 -218210 -31198 -66526 -88057 -740 -17017
11196 -17017 130963 57832 -137695 186128 414361 -51315 111974 -266015 -284178 -10543
11185 -208012 -85897 -149567 -217029 -145058 81828 -73069 -23815 111702 -147766 428827 -33989
11173 54033 -42391 32132 -86218 -40276 -496995 20054 -195467 420857 81993 69315 -342574
11161 -33952 264117 10271 25109 -193014 -84159 284149 -359760 -166815 -150897 -192780 -203229
11150 -203229 -5245 -197369 -232432 -122300 -125069 -7287 -120483 356197 67532 -363139 200596
11138 -19974 130498 -220634 213334 -136128 6407 321041 -88891 107753 257878 -110528
11127 189604 5192 95388 86017 75802 -137325 182190 104017 -118677 63199 -125673 -157273
11116 -157273 75302 202875 49166 -88005 -265308 138650 -98828 313309 -19055 -248781
11106 -248781 106205 296420 55338 383447 -337532 -6710 169988 83342 558417 242746
11095 12049 245321 173339 172292 230879 16296 -94726 273087 422 202680 175800 357979
11084 357979 293993 48568 210703 313650 -95597 282871 137131 23220 258328 509697
11074 509697 153709 566611 145812 202827 370215 102177 248832 222076 350849 184676
11064 184676 408604 194513 846801 619807 322882 435427 681888 599248 480572 415760
11054 415760 538236 278396 850057 433309 675734 634366 657376 928037 899546 878239
11044 878239 925627 949201 495274 654671 280303 1081029 776570 633290 1088068 595632
11034 595632 720577 651252 1081436 1004218 731789 1165482 705702 842109 1065354 705041
11024 705041 668900 668099 537022 878914 759732 540957 450180 668535 529368 1066548
11014 1066548 437062 781389 658948 623926 840033 703639 643178 280308 840627 313077
11003 505129 567683 472827 708456 285982 630215 824475 825950 392421 422654 902279
10993 902279 703528 780081 428342 768057 449114 543752 635727 807620 608230 819469
10983 819469 850212 1266700 892969 1022057 1065778 989527 1642902 1306708 1381940 1608370
10973 1608370 1771732 2020912 2443561 2801199 3082447 2898900 3093034 3101460 3025904 2692192
10963 2692192 2373024 2008260 1645183 1002322 909221 558732 813506 745520 747349 590259
10953 590259 826808 252772 409751 497934 233359 731226 287244 300266 33262 125479
10943 125479 139570 121102 -76816 45604 398016 -37123 -261837 -237227 288616 1089 47807
10932 47807 -206051 101167 95088 -169277 27528 43992 -361240 189731 -277672 1798 9727
10921 9727 185395 -33556 189102 115699 217222 182821 -261000 -332533 -79084 120987 -76702
10909 270136 -248546 101095 4998 -210879 -227944 -119934 -146086 99511 -371495 34678 169934
10898 169934 -229743 -306652 -129198 -207272 164305 -147336 9239 196552 17439 53343 13939
10886 6493 -188807 -43802 28232 -189468 -288033 -72626 -50051 -73992 202723 47407 -300668
10874 -466192 -256281 385942 97386 130691 433493 100188 -221867 -22359 392439 -145197
10863 -170892 195927 -28090 -166590 369655 -260435 -62975 22977 179135 334023 -47123
10852 -171178 -234896 -221623 47616 67334 147077 -52181 -45160 -33026 -34346 58047 57802 -185416
10839 -38338 125085 -77234 -385080 -22926 80665 -225410 -69250 124559 -369351 -139376
10828 188101 90767 4919 -131179 -81821 -13662 -244792 -222446 110626 -114011 -187810 -303564
10817 -303564 -3806 -90417 -105866 251209 51630 58038 414287 215558 22175 10693 48145
10806 48145 -145304 112408 133812 -107204 -455309 28539 109488 243305 -34867 -176370
10796 -176370 107287 -146523 52482 -104879 -86139 47475 147524 59961 276114 198682
10786 198682 15252 12900 -434271 196852 -382543 -153989 -187450 17051 6534 82808 144331
10775 144331 167091 217800 -21120 -4366 -253290 -123801 -64338 240214 421714 179277 -89193
10763 89222 -326109 -176353 311436 -434116 -189702 -183527 -126456 -115373 -809 95399 -172509
10751 -275354 -260875 53149 122064 -210132 58909 360429 -56979 -36685 -403040 -24841 -447838
10740 -447838 -345670 -165906 -226866 -97885 185658 146175 137800 -374277 -130211 -339128
10730 -339128 -199135 -33206 182535 115582 -90381 144464 -107667 -54522 -116969 -35722 -192591
10719 -192591 10572 -87787 -9178 35567 -11919 151785 -165943 20853 186719 -144547 222065
10707 -195573 261671 -109839 -181758 29378 68788 -280528 -52008 102594 -296104 235858
10696 -147019 125341 -143011 -15480 -225357 198316 -47253 157690 25625 -87906 107547
10685 -350681 -322002 -98774 -268918 17981 185707 -26630 42239 -129177 -147736 -74150 75531
10673 102859 -163221 -58282 -4571 -190112 -163560 -166717 -330133 136564 -284378 -147034 -378294
10662 -378294 -104974 -123807 -72759 58497 -5029 -147058 -14776 -4780 -367477 -161369 50597
10650 1039 -147169 -8115 -14106 -3702 -391997 -161885 -160629 -234472 164293 -49826 -276740 117733
10637 -10105 44768 -56864 72529 100784 -368212 -32887 -130059 -347637 -181396 223677 -152639
10625 -243112 66589 -23401 135445 158644 -225360 -70208 -350363 -23005 -55851 199450 53899
10613 -98250 51198 -433656 -252552 -197901 261890 57825 -169383 -14217 155780 -45127 137056
10601 36332 238738 -51118 -329596 -284006 32831 18092 -76133 -76158 -75649 320863 -16225 -409404
10589 -409404 9208 286953 78018 277871 -125280 -200250 47904 -112234 -449529 -26137 115065
10577 -23267 51125 -584761 -224851 -193027 -260882 270025 26408 20042 -128882 -113189 -198896
10566 -198896 -179423 -136007 96362 51571 6588 -169053 -122551 -155309 -145801 180218 260735
10555 260735 -202481 79887 -166254 -182779 -84980 -83349 25052 120263 -328103 16905 -78317
10543 -135597 32434 179132 12853 -47071 116361 6950 -210104 -175797 -245186 -109676 232478
10531 -188096 -189476 -233662 212377 -124446 131036 -111584 -215841 -148300 -49339 32385 -71003
10519 -93435 -120329 103480 -83052 20774 153762 -124163 303921 107749 60757 -100890
10508 229248 -87738 115328 -41037 161265 -143845 -53127 186508 18941 66131 -616167
10497 131294 190476 60714 -84373 172494 -327663 151948 465832 136845 -24063 143585
10486 -18542 -221034 -102692 227989 -449422 -245456 -179298 -226889 99883 -194144 116406
10475 -234452 -209258 163163 51001 69841 -248804 -184906 82336 9955 74167 112890 -279408
10463 -353185 -308162 -367019 -151905 205915 25863 -415286 -9857 -53893 -18388 87191 -44040
10451 -272207 -91806 -154940 -131237 -50754 -168052 -96760 -325645 -87158 -150521 376890 128065
10439 270727 190587 -226828 -198765 224808 14750 -12251 -60602 -255360 -126696 -99286 -101952
10428 -101952 -22239 -12063 32533 28756 76308 2610 -77185 -101732 -111339 128712 134816 -403601
10415 51887 128838 67348 -54843 -159904 13896 199094 -188265 22044 -352535 -61568 186653
10403 -203708 71117 -149577 -82545 -127683 -582497 -232717 259735 -108785 -112057 166036
10392 290052 -208320 -80210 150050 -1803 -9851 -72303 55880 -1297 -10866 374743 354854 200893
10380 200893 175117 57537 -28361 30155 -328301 467198 330897 312639 130570 267510
10370 267510 378459 -31897 7129 369999 344959 360284 173431 328820 382401 503938 594081
10359 594081 259471 283425 24463 101850 -30665 -98206 101606 332706 540051 933641
10349 933641 331010 464571 473836 63194 -181526 298919 48773 -2074 140480 105251 427633
10338 427633 -20829 47609 456631 256268 -12807 92512 372733 346859 142041 -86424 -122433
10327 -122433 243527 203359 39368 -23294 177984 203768 95370 260164 276118 185656 365414
10316 365414 284266 -137475 53668 198572 314974 -81246 -300263 -262767 105835 -37630
10305 309803 69418 59954 -177759 15346 -37128 169841 188711 -260517 106310 -116714 144334
10293 -273791 -323801 -58157 254405 225727 33359 -273965 -163071 54209 101445 -336 126736
10281 96145 7212 245584 -205289 -306990 -47728 -416405 -10188 105574 163346 36502 -214436
10269 -218707 -114401 81524 113171 -17733 190491 -183751 -507806 183309 -40647 56542
10258 50013 88488 297310 -163366 30453 -24049 -198626 416234 -226306 -74765 285347
10247 64355 127352 -254894 -478907 32906 -226171 405493 -271852 83592 -47707 36820 57865
10236 57865 -27347 -83209 -181662 216684 -77433 137367 -236343 -361102 -103363 391394
10225 -390098 -273238 104651 -129107 -204912 -178289 229422 -134066 -267705 -99871 -218649
10215 -218649 -26266 -103737 -1749 12760 -43961 -606060 -221556 169048 -35987 6400 44010
10204 44010 -306555 -344270 66100 415253 234079 259517 -86342 -91634 -178958 26683 -364830
10192 -62369 -104383 -119661 -306029 124981 -174380 -202221 40162 -12209 -40683 -176252 -50636
10180 -63721 129696 -188946 -228753 -29296 290819 51586 34752 -149503 22300 -57209 -46853
10169 -46853 41598 -260689 -64420 223321 18418 387930 -120315 -196722 55920 -65752 -272108
10158 -272108 139417 -315796 -233221 -293192 74582 -77612 -187343 -119823 17758 143936 -85360
10146 -140470 -91149 175154 -36699 -192855 78881 -67865 -326243 -151836 38508 19758 -122207
10134 -297848 -45175 65244 143080 -34881 104501 85019 215931 -82886 -25943 282022 219330
10123 219330 -199698 -242688 -184684 -38088 -36269 164053 -361556 -63560 64952 65289 2013 -22890
10110 -102271 -105253 -100991 -43985 -62339 744 -4777 27033 -54340 100513 106355 199731 -98212
10097 -102728 -494707 -104056 -161106 122416 144974 -239774 182423 -315937 -271845 -173666
10087 -173666 180285 -160762 -144219 -98053 360373 -102359 -146539 -78191 39683 199860
10077 199860 -97168 84686 -2049 27493 141731 -229204 -61024 -42234 -299863 36493 145122
10066 145122 -124627 -244356 -210556 13605 -101861 -318242 183617 -180225 -89877 -159290
10056 -159290 368227 72552 -197985 -203383 -277883 -114155 -158663 312308 267936 -141884 87809
10044 1032 214995 -126535 90909 -81821 45776 -181698 12916 75221 124631 200851 101033
10033 101033 -173997 357816 -101361 -105792 112422 -2724 58931 -165802 28086 -56175 -403
10021 104071 -324458 -20090 -191323 191182 -43381 -176682 245254 110428 -58641 6775
10010 -56744 154124 -55260 -96840 -194409 -4785 -241647 -354650 -27967 -316099 77368 29963
9998 161664 11169 -203570 129578 -408107 106692 -44660 45840 59302 -165607 -186263 -34876
9986 56156 143247 -147197 -39037 -145430 -19691 -220091 68992 133328 -458462 87634 -309511
9974 150233 -20588 82189 -167110 -15817 -277035 93608 129196 88214 -168423 -180284 -253130
9963 -253130 -402250 139542 -43876 71702 -192716 -410041 176054 -253593 -382582 -145055
9952 -187972 -186421 -124878 -65731 269833 6677 -258898 -137357 100200 -18506 -103721 231235
9940 136273 -1140 -156711 146060 -114567 -8170 -62041 -26404 263953 -78337 107951 -94803
9928 -327411 -164413 -323660 273092 75760 265523 -317351 113929 -116041 1388 -129393
9917 -370950 -170698 -337470 -385055 29245 -31849 92914 274986 -18607 -976 147804 -137822
9905 273400 126992 -297303 32066 -56326 -13033 -56284 -389965 -63127 -129205 -85279 53758
9893 -58924 -71345 -435 165974 374769 -61098 -344069 -151129 268580 64577 58303 63879 -51434
9880 -112434 -42387 112566 -391323 -155010 123030 179789 -296096 111811 -321728 -83677
9869 -53847 -113931 62979 164714 28936 76531 91887 196664 30845 8026 -101437 -106191 -122600
9857 -122600 -81549 137756 -227638 -136426 -195084 -195067 82523 -245851 -232161 -47046 -36322 -439837
9845 -439837 49812 -321347 76167 -211238 -108642 -146576 -289878 -462664 4632 -377415 -308369
9834 -308369 -110238 -25815 62722 -420754 -155038 -333988 124818 157046 -45801 11256 -44969
9822 -215618 301374 41665 -356540 -284228 -28276 25246 -130997 43805 -224149 -327664 -189285
9811 -189285 156682 44236 -88368 -223342 37263 172411 -230905 -129921 34034 -304166
9800 -85618 -278324 -278973 -292211 -215134 153075 -351825 -59681 -163953 77869 -167422 134777
9788 20341 -124013 -281205 310236 64258 -309963 -263276 -99227 -3070 22616 -318579 50655
9776 132973 -87704 38298 162534 -122799 135542 -287304 222763 187335 -100761 61899
9765 -304478 22462 -113931 60460 63069 -261094 -205952 20397 -107991 -156066 65956 -250935
9753 60841 -68211 -198648 39766 -47040 132934 7811 2027 -40299 -359300 -122106 -160378
9742 -160378 160568 -58492 39413 -184613 -245531 -49400 -290040 60342 -85480 -46320 66252
9730 1722 174698 -94886 -293769 -68805 -149732 -82803 -144832 -23220 -113106 -531 -61902 -5790
9717 -123964 -77836 -119459 97803 -174641 80707 96401 -263756 -260491 53388 -95038 45221
9705 332848 -159895 85906 327100 47387 -53950 -41232 -253529 -168040 -174644 -272698 -25470
9693 17498 33604 -104731 243409 236328 -61912 89620 -123723 -227608 102918 111409 3457
9681 -25277 -120504 67448 26158 85321 100599 -257793 -75679 -248747 -88422 157669 -198607
9669 122464 -16588 -382940 -177829 -216256 352544 1440 -64514 -103481 -81622 -144994 -120943
9658 -120943 -409478 -171661 78269 201178 73224 -207673 126257 -145573 30042 -88964
9647 79369 79061 208776 49676 -203764 -228146 -29239 39623 155789 78840 136349 -14500 -369702
9635 -369702 -77387 224211 19038 -311586 -15016 -312172 63296 -138600 -38935 -62962 173671
9623 123814 -88607 -102219 28000 -166398 -134365 66344 -205830 -68023 -177189 222292 -290838
9611 189783 29983 -37862 -224813 224089 -359819 -18073 104347 214768 158709 37870 142742
9600 142742 -111207 -124479 -113740 27295 -187092 34323 -38654 206565 191464 -255958 -99158
9588 -120257 43437 -179701 -67167 288805 -211350 392004 -193797 -312710 147805 155705
9578 155705 -312394 -120690 -220909 6021 -53919 108682 74160 149892 22208 -296853 -241526
9567 -241526 -75655 -50614 -64992 402758 -106879 3680 -129969 -414578 -293623 26400 -164948
9555 -83271 -207614 -6400 -21565 117979 -194313 26718 -186364 -124449 -166508 3308 -116441
9543 -56558 107149 -65650 -22503 81181 -271826 23217 -326872 -110124 -37397 -352678 -14906
9531 -77440 -117271 -189564 -278548 -244684 -80482 -126184 -44057 -134393 -535915 -473082 -164598
9519 161903 -157067 -68322 -237850 -302324 141425 273485 -193900 -390184 -110329 243940
9508 -23162 28764 160262 174660 -330459 64154 -238094 -104824 -131617 -319607 -129390 -277441
9497 -277441 72084 121682 -330622 -79479 -167139 -225779 55893 -242018 36706 -179500 -45092
9485 -220629 -220273 78390 -16886 -385665 -152635 -174665 -200121 -180581 1948 -224609 -71972 -102972
9473 -102972 -111800 233622 33917 -50834 103916 -169601 -47094 -354471 -314710 205088 -106149
9461 -309483 95728 212972 -310356 -333220 -149546 190976 -74127 -139285 -18538 133509 -339481
9449 47525 -1169 353309 -9044 62936 -90593 99672 114105 -110903 248913 85192 321946
9438 321946 -155908 -24681 267158 -272440 -243141 -81131 -70728 -77980 -39002 -340063 -185482
9427 -185482 -51760 430111 211689 -125897 -69492 47633 -153298 -123872 -32423 91165 -313633
9415 -42663 -161431 264964 -13757 11979 -97800 67547 -16250 -1653 -145453 307757 -109187
9403 -20722 139786 151285 27342 -169251 305297 72002 -16854 -35494 -2065 -56602 322699
9391 -75109 -330814 128338 45077 192072 -82783 55745 -146022 167236 -28677 -163123 -134568
9380 -134568 -427016 -52775 338909 -177887 -382837 -73191 -54396 293136 75038 -289819
9369 -105648 93669 -67632 -77348 -67162 -216426 -359653 -289267 -212184 -340780 167397 55625
9357 -58096 -335622 -303215 -65264 189041 -40306 -1442 -188047 -58337 -217061 121928 -97412
9345 -79196 -136190 -305451 -351288 203810 -346727 -239196 -60598 20120 128140 58835 99814
9334 99814 -190166 11128 -202920 245980 -11248 122992 -64916 78220 6374 215482 -298644
9322 -30486 -163010 -374396 53298 -88322 -534028 -6553 -215785 590537 50683 49805 -445373
9310 -165184 9921 178233 184121 219470 -75643 -70964 -209185 341377 -134188 27288 -147566
9298 126390 92417 -225940 69545 134772 -457177 -189550 26476 -142136 111823 -332143
9287 -77646 69709 136219 -3435 -173069 -216040 48476 -53470 -284795 -273401 26767 280792
9276 280792 162873 -220144 356153 -38014 39623 -115272 22763 -86279 195821 -382080
9265 -9273 255736 129692 -183005 -53619 -4152 -249063 78603 -53634 106826 -155306 10440
9253 -195226 50736 -99997 55665 102994 -71372 -25603 113724 -123970 -169342 -385442 -156870
9241 59975 46847 24648 -135517 -144639 -153374 18989 188910 -184753 116160 -51531 170706
9229 -244663 -196844 227388 -289259 -523 10703 -91298 -374616 -106769 -151392 -48620 -189753
9218 -189753 -175399 -89887 252509 -150615 -53705 -277187 -215147 89485 241986 -295770 106496
9206 -47490 -17689 -141685 -162404 -119947 -304840 -205694 161399 -307537 304517 58289 -116313
9194 52695 61806 302044 10242 -4929 19345 212476 -398205 -113923 113978 -7476 20389
9182 -137609 -210054 -210421 -206793 58524 -101240 -34883 245048 -164209 210742 -261607 -103240
9170 59733 -80941 -214885 -268196 107157 -90225 -120574 58379 81852 -304886 160923 -7607
9158 -260573 -66966 123667 -285107 -562490 131033 16635 -134483 191169 174041 -76616
9147 145786 22364 172498 339953 -632 20304 -1629 114836 -425576 -41641 64305 -327617
9135 -54916 -252635 -80448 276392 -218929 -229490 -131827 9098 102600 274472 -782 211312
9123 -3664 -181486 61844 419035 -50751 -40521 6223 17839 -168271 -71854 -66102 137588 -192851
9110 -101538 -115110 -188405 3453 -326341 89928 67334 -42111 54722 243353 32996 -103394
9098 -96502 -77143 -280594 266390 106187 65995 -455738 -355821 -114281 281718 -181240
9087 151303 -199994 85024 309690 -114117 153614 42401 -102783 -32218 124746 213214
9077 213214 -233986 14622 223110 289970 449221 -87770 -296130 -196877 96432 108866 4870
9065 -342170 -144946 -182969 -14059 -68883 219238 -10648 -129696 -22617 -11921 -225642 6637
9053 43493 -166474 -65542 -247015 -222450 -44733 -398945 37995 30835 -385487 -9999 -272792
9042 -272792 111307 -29252 -164584 53787 -35464 -8044 -165943 -140436 107699 -160796 -25631
9030 87965 -202089 221900 352670 -91430 331408 -40279 -171612 -1515 25585 -264515 56426
9018 -63377 129143 89172 33554 122593 -214785 -124419 71782 -272366 -234516 230650 -18032
9006 -232478 -27477 -36439 -112211 70238 -149475 155691 -362612 -152726 64150 18447 100776
8995 100776 -3923 -37057 -146004 -196079 -92115 151475 -513308 -190618 60471 184325 33232
8983 -216469 -23659 90615 -156052 38622 -25707 -1285 -177019 45930 -115575 -28061 -145820
8972 -145820 150254 222305 21673 32624 -115679 -279872 -451688 28942 -176516 -229204 132029
8960 -131064 -102974 -439258 -250628 -406922 213323 -303798 46422 -233995 31588 -44693
8949 -230019 -149663 49063 86888 -120812 -148699 235154 255810 -124394 -258835 -16588 -219965
8938 -219965 -179810 -2086 194067 16839 -11081 434294 451598 116447 247535 69743 -96437
8926 24929 264848 459095 315024 897453 1706467 3856863 16289083 7812171 2414488
8916 852367 200583 129155 -171481 380093 -355360 -128741 106715 288165 261042 342727
8906 342727 139276 191094 55664 -77309 -147157 219411 137085 -110796 -98918 -31117 -27896
8895 -27896 184405 73904 -207849 110234 -149743 -149704 -191253 -299727 54225 -513914 -65412
8883 159572 12497 -24364 297000 93700 31396 -40597 -37891 -139303 146905 -153918 -429375
8872 -429375 -208303 132892 -96507 -20234 -154965 -127505 17974 -53005 -78157 -56531 103436
8860 -106554 10719 168843 204588 286597 277143 -170040 59223 87155 -195538 -225782 -186066
8849 -186066 -235831 -69276 -103163 -57003 91942 138930 -139953 218144 8239 43853 -186356
8837 -113284 -137351 -207874 -302860 131047 -407077 -237883 175202 -142949 22525 -4661 -139351
8826 -139351 -113705 23670 -201529 35566 -42907 15759 -158769 -90497 -155246 -735 131680
8814 -230315 70475 -109210 237755 -125299 -229844 -97583 256140 -113260 -71084 -168775
8804 -168775 -859 -169441 -52764 -82301 201060 126644 -68508 -27111 -188248 -326421 -38843
8792 -147374 15858 -163092 -236616 -13859 -69356 -133494 -105142 55672 -24608 -240954 105040
8780 -39875 229554 -123605 -171008 -219294 -43646 -386635 154982 10977 -13736 25038 -48158
8768 24958 -152242 -151111 45992 -237083 283548 8963 -158288 -113454 -144045 -235127 -122126
8757 -122126 -253490 -127116 -110089 -134054 146919 -35663 20542 -140138 -236114 -106907 -2588
8745 24526 304134 226896 51934 33025 -89282 -42837 35120 131223 -69035 -367397 -40691
8733 -121626 -337784 52151 -23907 -106380 190744 136834 208455 19305 182440 -69417 87395
8721 19055 131350 -377198 69703 -274546 -94494 -58952 -333961 -148166 -43089 -167118 178250
8709 121621 -98925 62582 61886 -174289 82588 -157872 291943 249189 -117955 19287 -180462
8697 -15055 -152756 -110196 -116218 -411132 132298 -3048 -103849 -172348 -258690 -296405 -643419
8686 -643419 -89964 -286939 -96272 35214 -267064 -218809 -144094 -147641 208367 -9818 71180
8674 95817 125878 -19148 -67765 -149215 -204236 129849 -171519 -63154 122231 33076 -106045
8662 200444 -65873 -145171 -43912 352472 343550 135134 -26589 -25941 54379 138401 -738 -144096
8650 -144096 223653 -145517 83652 -390573 -355348 -279988 212570 -439165 -165740 -253809
8640 -253809 49439 -101830 189587 -148939 -87470 43275 72745 365720 475887 -45552 24842
8628 -363408 331107 174071 165119 145966 -218012 -434921 -129849 144249 -100847 -293006
8618 -293006 -191057 153627 -139392 -302622 -91548 136683 -66331 164027 73511 -195560
8607 319815 -475388 58537 124189 -138871 -130118 -269760 63723 -177682 165126 154477 -394377
8595 172365 -27008 -309071 218582 8991 -100228 260570 -144894 -327687 125497 135872
8585 135872 40606 -374557 106442 -48524 121500 -187696 -220577 -47985 44737 -203931 -239610
8574 -239610 115897 148778 -228628 -279429 35117 58366 -302324 84722 36367 -25237 24570
8562 -81984 -186554 15893 -193783 -151529 -31939 -181521 -26252 -48965 -133764 158340 -89971
8550 95324 -25401 -27834 216877 -91611 -270535 -136929 -76171 24045 -62485 -6868 19489 168119
8538 168119 61276 -363104 -283532 235654 -57722 -114756 -22274 -471870 -122167 95043 -1168
8526 24534 -89772 54957 -362440 49043 -185251 -96739 70547 -279455 -154481 -119927 -166714
8515 -166714 4951 -139214 -89117 -165318 -110436 -37051 -176034 161170 -172635 435641 260454
8504 260454 64349 30519 -210242 -424440 134291 10547 -82107 152353 -6851 -15869 -181956
8493 -181956 -206535 -130722 -242036 -200619 63654 66412 -261668 68535 159354 -100928 -105937
8482 -105937 217854 338598 -120949 -100948 180432 -32839 -29309 -264615 -102436 -448959
8472 -448959 -173811 -276757 126760 -208386 -51965 24099 124017 -426619 123133 300757
8462 300757 123434 -252670 -38858 -7307 -20035 126907 274258 189621 -191978 -7495 -426006
8451 -426006 -12904 54394 -154253 -196929 -54292 -377710 -358455 -13072 136565 -15660 158192
8439 -253987 -161331 281125 154461 -272373 -96509 -124511 83468 58292 85100 75129 155897
8428 155897 153919 -12509 -84083 -282918 146134 -41020 105815 148531 -36261 -29905 5990 -321715
8415 -107666 -15072 -123052 -176588 151154 -53867 86201 119883 -39561 -106074 -43855 -11410
8403 -277617 -67208 -63635 -171162 326676 -377015 39742 -318295 231604 -147973 -46160 128359
8391 -137386 30305 -69257 439052 119029 -57660 -248248 -126062 524159 35882 -40996 -23900
8380 -23900 -392475 55826 -189063 -27630 -3773 258451 -467434 233445 -249821 203564 -18723
8368 -91356 -20492 52453 174453 -197558 -193603 40943 220642 -101251 -178508 -13839 139150
8356 -225508 -223686 60389 -28279 -28113 -40838 -85175 113620 -163981 -190605 -226351 -315482 -98664
8343 20124 -202137 144510 178834 90943 -240690 33871 -12362 -69894 -67096 -70699 138204
8331 -332310 31687 -40550 -95184 -107569 123828 -53690 60326 68203 -139341 -100297 -457160
8320 -457160 166247 382846 246316 89045 -272158 281074 -43784 -188629 -36423 -102284
8310 -102284 -312442 -195599 -95949 -201209 -287831 -85474 32142 -140463 -683265 -55912 -199052
8299 -199052 -83219 -1619 -114676 -161041 -124475 -118695 60342 -230909 -111601 432802 174740
8287 43674 -97707 -124493 -2519 129357 -85457 -74040 -22322 7528 -420527 241401 -106621
8275 -159181 165573 -274365 101963 157678 23727 287924 -142968 94330 -136873 -68855
8265 -68855 -326608 -90445 -288931 -92870 6938 -165185 62342 10290 3019 38515 -252389
8253 186095 -94628 -345636 -339031 72819 -227244 267436 -244019 -145550 -292681 145232 -63675
8241 -425203 -205711 45179 30004 -82432 -230216 263242 -222020 -136790 -167757 -131074 -105672
8230 -105672 -35691 -345554 -229688 -132917 196001 -314160 -228733 79303 123852 -278572 74561
8218 -25092 -268514 40878 -245488 96275 -210064 168172 -39102 123324 -209371 -110082 -33203
8206 -197362 -274572 -118148 -59011 -128797 -127704 26251 29573 -270804 279191 -362431 -283170
8195 -283170 196288 185960 110569 -141522 -45113 24512 -253960 12364 -412413 -42847 20965
8183 78963 -51590 -110112 -306998 -21232 -38958 159615 61319 381691 -94799 -158709 196016
8171 56940 127232 413673 61855 -158915 -197715 -79191 49191 -214389 387531 245783 -72056
8159 770 90080 120647 -13175 415903 409862 160909 -209324 275488 -10049 100136 -1045 -157785
8147 -157785 3926 190182 129856 -48226 -147734 189435 130993 -67214 45794 171407 -104220
8135 -158841 70316 -90483 62168 -294 -108332 -239654 -141792 -137621 -74987 64048 174079 -224446
8122 48986 -172886 -228083 -372695 -175068 -206666 -10244 -315299 157291 -57119 -44716 -190755
8111 -190755 26953 122211 178318 -455049 151777 -143742 400451 1028 349094 -39734 126549
8099 276258 258198 -10013 -232598 -294508 8261 -212734 -141225 200793 55694 189632 -285760
8087 135962 -112779 135452 81944 -360769 -16122 -2294 -175783 -286858 -12335 -234346 96949
8075 -184944 221588 -159307 -379613 -142017 -321182 -230405 -116194 50 -59711 -188074 -215351
8064 -215351 25112 29371 -27074 -199284 -265920 95277 -8392 -182571 65058 -186814 -258245
8053 -258245 303923 292022 -24598 -116749 -168957 -146731 70815 195103 -287346 -147434 46667
8041 17222 -182968 -38263 104595 -252568 -25503 1846 124222 -62913 -16246 400297 279885
8030 279885 139811 64419 -82432 -189073 -112132 -210071 -42816 -322214 91647 -107911 -157664
8019 -157664 34775 -219564 -13910 37281 186694 -3694 -48077 -466645 -145113 -146070 100316
8007 12154 -177486 -426634 -304700 -172793 18598 -47580 -392750 36847 256521 -196868
7996 -134417 -75778 40843 -106461 -364294 -197313 30507 -246516 -97620 173886 334086
7986 334086 111198 -79054 -357956 152748 -74086 -45430 78337 -46118 -288636 36069 67876
7975 67876 -36775 -108662 -125435 58109 -10865 96641 137765 82700 -262670 -94944 63155 -33122
7962 -48426 405162 -33567 -168157 109675 -292815 56067 -432056 -191220 -296525 -40377
7951 -84897 305805 -269088 106239 53537 101534 -224173 181617 -212867 53840 -406870
7940 -51048 155050 14539 13223 154815 -234183 5801 -230879 -342968 -402567 123318 -68466
7928 -220310 -8477 173001 -376639 -165118 -74482 -335001 165502 127 -94163 -281455 -27933
7916 -31571 90647 -137115 -58413 159763 111063 211841 -132271 -120119 -46245 269193 49668
7904 -76972 -204409 -278959 144964 -170894 -196974 -307336 -72184 -206106 -482388 144107
7893 -457084 -329862 142003 -119537 84099 -25175 -52352 -199653 -80410 196276 233104 250453
7882 250453 -383978 -74744 114938 -160812 -429477 -64001 -81773 -136207 -199767 328149 128140
7870 -85514 -312817 -156993 -165504 110248 186358 -103519 108077 132974 -334634 241975 107407
7858 60582 -38876 220195 90612 -15664 320916 -117458 -297328 245669 224241 -13202 -26408
7847 -26408 161539 250937 148641 -305837 -207649 -97792 195032 -199272 -302698 -78269 -131821
7836 -131821 292550 -121061 -92836 104556 245111 79244 -378563 138509 -128315 46228
7825 -209687 -143200 125820 -41710 212841 90710 254251 116377 -171300 -11668 -117044
7815 -117044 -158194 144314 -181199 127056 -365742 -162361 -5183 -137754 -35347 -201158
7805 -201158 132652 -151313 -1823 159978 -18617 -172978 -78299 104378 -187465 -264713 -297856
7794 -297856 3264 234782 -82848 -30765 -102460 -567632 75765 -95885 -110663 29611 285282
7783 285282 -117340 -173189 -226706 -273079 309135 42092 -348159 50120 136107 -44638 140069
7771 -93273 380346 -267629 202721 -324780 51590 -224357 -251480 137114 174713 -19463 344294
7759 115258 -34467 399113 -15325 269281 1934 -237823 -187829 39306 -153352 299254 126241
7747 2337 136969 5071 -87987 -336870 -279404 38515 -158086 57541 -125018 70571 -53792
7735 -131066 315299 26159 -129001 -71125 122491 257840 -102425 -137105 -81118 -119480 -153838
7724 -153838 -183950 -65646 111269 -127704 102415 -281344 -180377 -109466 27069 3799 -164842
7712 -68539 56487 161286 197700 -28895 -81484 221005 -213322 178702 -228251 -95182 -120994
7701 -120994 -93223 39927 -92278 108865 -359958 -386469 -221980 100544 -96229 -100342 179099
7689 55451 -187379 52005 37472 364115 -21917 130103 53367 -115472 -336921 -189034 105293
7677 -53306 -80021 20507 111789 -65762 135952 -63318 190664 -49411 19266 -192447 -8213
7665 -373838 244984 178595 -170078 -185289 -72126 -170430 -195898 56897 241468 -44776 -71137
7654 -71137 -410473 364559 -242679 116577 118636 -37217 -153904 -225187 144616 -244971 75148
7642 -60467 195672 -235786 -42654 -53910 -24965 -12622 -131394 -270057 -126926 91982 98919
7631 98919 72712 80495 -99365 -178355 206829 -26110 78554 -185844 -15046 -155179 72561
7619 -168007 -119469 107189 -23685 -307156 7636 -179640 -254615 74211 48284 -257499 -52266
7607 -1489 -271802 -307613 272320 48758 386686 485865 -65610 -276431 330481 -128490 98867
7595 193636 -188274 19187 52265 101647 -148026 -111014 -210799 15484 -242990 -131297 329647
7583 -69766 -90251 178361 143231 4651 329373 25170 474 -39435 -173703 101460 1113 -60421
7570 -22168 -151184 -3852 -243924 -19298 192426 10929 31848 -117679 358880 129537 -186084
7558 -459461 265010 -186247 -143187 57122 22865 -151225 -188479 -412521 -168129 -283631
7548 -283631 19149 -199924 137574 417658 20148 -266069 139256 86498 189482 122161
7538 122161 -197437 62706 -225279 -254067 -117738 33189 -68342 198591 -116937 474199
7527 441108 -105312 -282419 -226450 -291281 20469 -194955 -3160 97311 129363 119711 -55501
7515 140638 -22732 -156610 86474 -121650 -84611 93024 124307 -24804 -106271 73005 218771
7504 218771 237053 -359575 -83845 -270307 -192605 -64177 -2365 -224477 127224 -59617 313101
7492 116233 15476 -310297 -24372 157016 33027 -296530 -7027 -99216 -273309 46945 137460
7481 137460 192950 52252 -125740 -36141 192494 -281011 141850 -132035 -112164 -192546 -99743
7470 -99743 -97019 -224317 -343882 -58484 -120537 104985 -204266 -297133 186744 275091 -83915
7458 -71467 259758 33058 -62197 48323 -120906 463360 -81969 119204 -187072 60794 33671
7447 33671 -149125 208222 72091 -146910 -350093 206578 164982 -88584 127744 66850 -171711
7435 -407476 -327009 206912 61544 -129157 -578042 -287036 -340898 -109396 -1436 58455 -227557
7423 113602 119476 11581 94498 136623 244843 -240993 311335 -314827 301986 -71185 -38029
7412 -38029 128576 124102 35504 22895 83133 -225460 -113072 -115027 -144219 -175883 -46040 19818
7399 -236428 -32579 167001 90234 -33081 -308338 -44262 -111670 142229 -187269 184138 -103958
7387 194207 -78866 -29946 107343 126128 120554 169438 94220 192208 364905 -180706 55937
7375 195384 -15418 59002 -293056 203724 -264586 -44348 -319899 -134268 61419 45801 242650
7364 242650 25871 -72132 -194975 -179947 -1590 -111509 139255 -111943 -39107 -365289 32031
7352 77521 -447607 -198929 148752 -26094 124038 67194 31338 100286 -63052 -220196 -176770
7341 -176770 44059 -46991 -18273 -110938 43779 23682 -77023 277774 225155 44641 253395
7330 253395 91129 -28367 261372 -122441 -238442 -209367 -77825 -44489 83624 230914 115412
7318 114928 -342731 198997 113880 205543 -189853 98550 571 2930 27744 187117 235350
7307 235350 220654 122336 106813 -286153 -126015 382491 321416 6072 -257756 -218513 -382238
7296 -382238 17158 -74537 94090 -210577 -256873 5647 113255 -96277 -84632 126545 -94558
7284 -153259 343504 69110 5131 235744 -212949 -201154 -47055 -23100 -8443 -4992 -176360
7273 -176360 -405589 -170033 -115875 -48945 -91596 -361466 -136629 -98861 157318 14460 62882
7262 62882 -254910 156155 146068 -58172 -59730 -169867 12767 159367 90203 36830 115475
7251 115475 -78879 76864 5238 47277 139646 -202743 -282469 -125518 -133357 424525 131402
7239 8316 229852 -189795 -102218 -175209 340484 62685 74389 -246412 -151176 -489552 -175172
7227 -127243 -79967 10346 21427 -143726 -79179 96530 231475 -56269 345851 -100486 -343150
7216 -343150 -143710 -207649 1690 -146676 48330 277246 -34188 -236028 130619 -10118 -48080
7205 -48080 -145356 -204465 52579 328063 -43903 -71157 -35104 -4047 169049 -161084 188097
7193 -15079 -366130 -163439 -104065 -386511 -31206 35570 -248008 -222394 35375 -293388 25321
7181 14454 -100648 -126124 -15350 156989 -227197 195606 -123626 98773 -76714 -41723 -76082
7170 -76082 -90430 -116032 -188058 121981 -203917 -142291 165550 16020 -176513 -49736 260808
7158 -8703 -297055 171302 -20357 -438620 -9379 104332 290599 -171123 530988 158060 238893
7147 238893 -95166 250659 81324 -102990 -269168 -102981 55259 277242 116382 146775
7137 146775 31650 -12669 -308456 14765 -58024 -292003 48524 180359 13279 6467 75596
7126 75596 85250 -20760 77424 -8510 5785 -204651 -393764 -32773 169270 -292625 76334 -17776
7113 -32015 -251799 -123800 121996 92011 281214 12780 72171 -219772 -11434 62345 -114127
7101 -287240 7387 -70801 30331 -15768 -77994 -80020 61006 -73666 14788 206746 -11398 121238
7088 97287 -49779 -66805 23678 -27163 52581 53219 -295450 210044 -94316 -174021 143901 -302508
7075 -272840 71790 71732 54954 -11472 -191705 -310467 -172772 22042 -7132 104929 -65673 154061
7062 135768 -54891 -171198 359846 325897 -63198 240350 199578 188200 130046 -309163 -78096
7050 169413 -226080 -29233 -366410 162463 -240914 90188 -159631 23321 198712 -110225
7039 -151338 -204760 -41578 175802 185501 -64127 -114732 -113019 -135736 51985 -154103 12340 27841
7027 27841 122578 -67292 -110516 -63942 -62960 -74745 107878 200143 -210140 -13089 -139406 195786
7014 113162 137101 -103852 -310384 -3616 -216674 43053 -177154 -197859 40059 64567 -137609
7002 -134220 364625 -174259 -63005 276411 102701 -55909 295408 -35045 11456 -160060
6991 112009 -245585 -57211 182426 -240862 98818 60539 -12082 -222370 137730 9171 -188726
6979 77253 111945 -185903 -291751 -58462 -152421 -144787 206844 120149 46702 20657 -148238
6967 58359 -240145 -14665 -60358 157765 365662 36442 -106906 -235566 147705 -236031
6956 122197 -138961 201867 -225192 -78216 -345891 177298 131283 -41085 -49388 269642 -102927
6944 -25529 -156216 133810 1533 -231326 -342619 47812 314976 -84472 -51201 -61510 -70257
6933 -70257 110257 158885 -257122 -300046 89166 290649 39042 185604 -92442 247865 -309222
6921 -141348 -40150 -182092 -88704 196543 44830 83281 -26746 135707 65938 -253307 62553
6909 -314650 116232 -165006 -179297 278637 -37381 285033 100459 19746 -26508 128068
6898 113892 -107870 166878 138170 -194108 114970 152706 -6971 -269077 -173386 -240111 26774
6886 -145776 140881 -12460 30506 74671 -344942 57449 -138941 117712 -156612 -37898 -24691
6875 -24691 -369925 -200785 199607 -19627 -340629 -40243 -37569 137215 128050 -199152 -116588
6864 -116588 -193284 -214755 225132 -109256 145101 33471 271570 -110559 157744 191955
6854 191955 130522 30599 -298941 119114 -268881 -275312 26807 -160946 20174 -407696 -131856
6842 -188861 -242868 -148313 -47212 -69279 60711 90801 -156434 282377 243329 -300163 -208759
6831 -208759 -314237 133992 61014 53265 164596 -390036 -44609 -158614 77797 -10250 -179401
6820 -179401 -54915 16443 -108856 -30913 -223189 -115125 51841 -76557 -69341 -308536 -256310
6809 -256310 -308614 47020 275574 -61353 -127855 121199 -306404 219701 233236 66577 170124
6798 170124 -415581 54857 -418222 -23488 45455 133979 -230828 -54160 242913 -49745 -15444
6786 78717 -72211 -122740 -252906 -133681 142136 -113439 508553 124087 -94702 156715
6775 -173557 -159393 129713 162172 -104274 -4530 161527 -187965 -30872 -56815 161573 66186
6763 -33757 21065 -187280 21289 -362542 66635 -34679 156129 51959 380826 43512 131240
6752 131240 16710 319150 -18531 -267131 -275892 -117224 197282 102470 -37106 -57818 -169037
6741 -169037 -8952 -295476 -427441 69291 162556 -105772 35879 138064 -23687 21131 213265
6730 213265 -327675 -253931 -61332 285976 302725 -100182 125436 -299100 124813 135316
6720 135316 -24723 42335 -47338 16349 119397 -113493 18601 61944 -28653 246513 -227576
6708 -61197 266942 222363 65697 -30233 -2729 -134465 -2086 -162720 82914 92823 -152366 -90556
6696 -90556 -4867 18935 -165887 -54283 100424 -21524 165054 -25249 -11813 86556 -29779
6684 71802 100860 -162404 -123599 167165 109190 88795 -209500 223606 -391306 -221713 -9532
6672 -58701 86149 -136683 91144 445230 105656 194645 73639 -169046 490364 55702 -70172
6660 -2164 298310 -114082 263813 -196966 -109858 259603 51061 -47430 -179588 -262603 -34223
6648 303635 -252363 68471 -16802 -293641 -312048 -75864 -6700 107584 36783 -28073 -105205
6637 -105205 71763 126534 91888 20533 108358 130532 128582 -88765 -140931 -230604 145115 152072
6625 152072 19292 106661 233067 -118891 -34938 -191331 -20112 -209416 -212483 152060 -123509
6613 -36803 -107496 119201 -333367 -151090 -257592 5537 212901 -1645 -94080 -78022 -73290
6602 -73290 -90011 -100588 -44990 22757 -105080 -116319 -113433 338703 -77131 -175522 27722 -198468
6589 -96361 187565 -209643 46397 -105993 204921 6162 175990 -92108 -292609 -125475 -188799
6578 -188799 -142983 -316916 -58269 -229022 -113380 111252 207325 -139778 -3349 36942 -257525
6566 -418155 198242 89099 -163119 335980 -42671 521754 38115 11172 303186 -137981
6555 -248847 -54091 -159249 -102978 -238349 206551 -71493 -155885 -5224 157847 -206094 184792
6543 -141723 -32957 163184 -44155 -36953 -87102 -166911 70690 13432 131851 165881 -112852
6531 71630 165977 -107453 84999 -40202 -111059 -244510 -206169 -275820 53898 251353 64187
6519 -30775 20801 -105038 264987 58162 -126304 -66619 222308 -126566 -184746 -243856 -198740
6508 -198740 -89805 358277 23672 -131718 -404574 92324 -91095 -7005 -104652 -243949 -371841
6497 -371841 219610 -189013 -133825 -97864 -131302 -338073 87840 -23807 145241 260059 -176982
6485 -246636 304299 49350 -162269 135407 -48333 220129 -164248 -141203 95457 -90427 -281132
6474 -281132 -71650 26622 -129854 163009 -80188 60673 185275 -46479 -7045 44565 -47087
6462 131098 -494482 -4365 126701 205335 -282824 47758 46126 12002 -281800 217829 -38848
6450 108779 -201078 133459 194237 -360486 -164853 134378 -267881 207264 -409 -151746
6440 -151746 -75255 -116258 188080 -51565 -116167 334432 61709 -65217 124495 61771 -133764
6428 19774 -82427 28659 -272758 -70809 -139481 -118509 -114893 -301804 -62603 103764 -169847
6416 -18848 -155257 233050 -99411 88334 126181 215874 -42986 -233471 -194601 -269718 -36432
6404 -21894 255481 22930 -114879 147177 -3387 163817 -53573 281421 109822 102426 -99146
6392 9818 -213376 -192979 -174502 -15235 -187821 -317698 -187551 -68585 32629 -129120 2560
6380 18632 -25103 181742 -84584 -140536 -201143 171775 -75014 -220120 -126534 -247992 -109023
6368 100209 50706 -251015 -39953 286236 -189927 -290033 -280841 -355896 -209497 130787 290404
6357 290404 -41048 -141264 -15688 245548 -17228 -251944 -85155 112017 239585 133063
6347 133063 377026 9185 321014 361692 -21441 -166 -120893 17719 36674 -198827 -74446
6335 -16022 220311 -48990 -157018 -440 -92602 -146959 41240 -102771 -204107 200659 -16060
6323 -310540 -57720 -587 174873 158476 -38420 57046 -109904 -68195 -194446 -205329 106528
6311 204789 152833 -111871 -276005 95267 -268006 -113636 -109380 63819 -120876 113068 149923
6300 149923 315194 -288254 -263427 -300890 223536 -50859 32433 -229642 -14181 74237 58112
6289 58112 -8871 -384354 232995 93006 -89000 318856 236713 33771 19278 43207 -128223
6277 211931 244894 -40522 32367 134200 -257109 -31523 57060 20663 -134568 14601 -86783
6265 15938 186491 -140573 501637 186043 -90573 -57513 -173332 -160959 -32251 -230916 -136403
6254 -136403 -204237 -74732 118441 -187457 -4697 -129288 116260 -133413 -152062 302881 -22780
6242 187932 77788 45842 -148016 136114 69674 -35784 125301 -115997 52910 -174015 -138152
6231 -138152 -6107 191252 131822 21227 277975 22010 59466 110284 122341 246284 -105410
6219 11616 -60488 -146007 13713 -253361 132891 67163 179789 65261 24491 -155065 268405
6207 151935 249757 -175981 43725 106546 -193374 -105771 4730 -241738 133500 -249913 291127
6195 67720 48141 258692 46727 98816 -129337 -82404 -226508 -23829 58006 -7557 -310013
6184 -310013 167743 -147647 251045 -32859 -194137 -23365 -105506 158179 71893 -98269 57535
6172 228773 75656 124964 64548 25951 -129889 165423 3582 108431 -46962 76885 -198416
6160 -98448 32884 67077 -213728 141430 52273 -49916 -198941 -311574 -67216 27481 -14742
6148 -22595 8300 -142687 -74821 -52438 -54514 -122160 -49491 106857 15640 38734 171838 24442
6135 101972 -152131 -65412 330587 -121551 88400 -194837 -196528 -36732 -96417 -47860 132452
6123 -172901 -131212 119105 75648 180499 84349 -128892 21755 456652 -174885 174027
6112 180790 42515 -98705 -337591 -175995 50729 -207158 -337104 45628 -233725 181657
6101 146901 143283 115747 -21455 -221876 285022 1750 365123 79829 -97659 110311 -20830
6089 -183577 116990 -280085 -279837 -167669 -303821 92969 102447 -165757 110471 -65442 -79724
6078 -79724 173847 97832 -67533 430802 -28772 87735 -14072 -103150 -105563 -72823 -80579 23782
6065 33241 -360018 95514 -145236 -34261 236773 244353 216582 -66110 -126928 127841 104329
6054 104329 -145756 -272778 -9909 92770 -274310 130719 74850 -504570 166439 87784 -169855
6042 -26156 -117157 -171096 176434 -36964 286185 -401620 104781 160185 -84761 -215262 -68226
6030 185122 232156 161843 -202127 -96020 96264 -254015 143670 28101 232058 84397 -144164
6018 18175 -28985 -271529 12714 261655 -40733 297244 345969 -275856 -434906 -323082 -186227
6007 -186227 292310 115254 -40325 -26493 294357 -18434 -232005 -8663 46279 131117 127827
5996 127827 -397879 -175874 351965 -88778 1948 95929 -29420 66827 -183118 -202195 -136233
5985 -136233 -170226 -104856 -260935 -44601 -48103 -87216 123053 -82744 106297 -36085 170939
5973 -127199 357451 -162145 225558 -140458 26406 5646 -265021 -213124 -143881 -53847 -118778
5962 -118778 -78560 -138192 94897 175694 -215165 -16929 225255 -159703 -233039 10007 145456
5951 145456 -297123 89123 8051 -117541 165553 423344 -112287 -65871 59295 -53416 341382
5939 215768 141495 -42379 1404 29323 -142550 -4446 305403 -159903 242228 -198682 129443
5927 -187278 211934 106166 202004 -43190 93359 -452122 -19769 155599 -76597 4704 90424
5916 90424 -56864 -24135 -111345 10952 89885 -2867 -311414 -155242 282545 397254 -81311
5904 -46316 79647 -254693 62629 -47354 -43663 54850 -147484 -71729 299426 -126812 116369
5892 221910 -42780 -172362 119556 55333 -180271 -52530 35442 -125987 190394 -18998 -370
5880 157008 -88282 20679 132872 334880 -130573 -63585 -381276 -3082 320775 -100768 205002
5868 -235113 5846 27520 319471 -14876 -207551 162785 89890 -133980 -238455 39225 273595
5857 273595 99933 -170163 228923 90579 -274599 -30041 -332932 -59863 158835 -302008
5846 -56328 66988 276959 -230960 -1819 -1109 -133728 -190669 -194078 -78660 -21066 27349 -82229
5833 87042 297314 -167857 38179 -89301 68897 -15552 -347735 -18184 -82731 99323 394224
5822 394224 233462 11935 170462 -332834 -155060 -299936 -208533 -242686 -179292 286172
5811 -125344 123972 10019 105013 46188 165065 -135488 -110863 -319298 -113426 443287
5800 77961 63855 176288 -29006 -211656 116111 373795 60196 30116 242077 317490 -295259
5788 128055 5711 -118210 -212518 87135 -32801 102883 44215 -188375 32762 -135752 -29980
5776 370047 -247963 -226264 -180774 -36855 -213269 -140121 469632 153694 -84719 -162648 304512
5764 -428778 160248 88759 327043 306793 -11831 161547 -49099 193468 -96720 120517 231546
5753 231546 -347569 138173 69761 -333029 87562 117818 -200756 486213 -130739 -356329
5743 -356329 -226617 182215 254527 -314892 -73119 26013 -38031 141278 -237158 23650 177254
5732 177254 -90375 -51469 102274 206798 332073 105694 293035 3393 -130233 133399
5721 159788 -8316 125549 129593 90822 487463 -167268 -13622 -7703 -94921 -164618 39807 -53113
5708 102195 56536 -133961 132514 4409 232282 -134848 -25829 126936 162297 411418 260531
5697 260531 -97718 -194599 -13127 -294694 -225270 -17312 51820 -131002 27991 155511 97277
5686 97277 63608 48809 -129967 237827 -328711 151608 124987 -18856 -223376 115302 89945
5675 89945 14315 15852 -7288 114233 -188067 -128155 57294 -127482 209170 -36725 -110452
5664 -110452 126961 137573 -137468 -236559 187640 -101771 128670 -329847 -212268 -57025
5653 -73174 103038 257739 201606 152629 -5175 -237066 -52143 -65772 78051 -273986 -297365
5642 -297365 147379 95527 -130786 -273038 -103710 -200111 -183761 -189275 -194081 47486 155617
5631 155617 39943 54412 106445 63737 262236 173155 -341639 -438192 -119646 -153400 -195568
5620 -195568 224995 82876 -320238 -130528 236751 106250 -11989 59505 225496 254345
5610 254345 290816 -26602 -256309 98065 108566 159288 -94926 197932 182027 -49538 -110987
5599 -110987 210898 69463 402069 238864 98012 109682 161203 90722 -51835 158836 -108588
5587 93523 273869 143471 17552 -75246 -88734 -162759 7104 240113 44751 54627 110840 -102374
5574 28074 -471367 11929 -269419 41299 -16121 -70044 -181887 -118343 29478 276652 14295
5562 -2256 99554 218938 -130986 156745 148202 -297224 -288332 233554 123840 -200110 149493
5550 109354 -120504 43190 -170085 61569 157392 166405 152134 157453 -195270 -80416 -196639
5539 -196639 -28686 94006 62769 55473 32172 225778 -176124 -104876 65301 -27369 77438
5527 372822 -96795 -55611 214199 -8511 23866 120861 -73064 -98802 -57328 132253 -140659
5515 -221080 177500 61311 4308 -243811 75637 516275 -12926 -280380 300491 -225326 1026
5503 -163359 957 27337 -58319 56811 -122371 16178 -30571 -443214 386067 -9200 -143481
5492 -143481 28047 90365 -91087 -221799 -149798 -8517 86283 -150180 140653 73428 238355
5481 238355 22399 -334 -45416 53876 74980 -55829 -107487 -207990 -35180 1376 379364 -23966
5468 114345 -99401 -162332 -135051 -253346 -169219 198543 -35108 -76617 274496 -37823 -173506
5457 -173506 -170967 99294 280668 9613 281629 -117378 228093 -8560 -243066 -76753 -412806
5446 -412806 -148860 155232 203504 162523 -190689 -6508 -124059 -32398 -38804 -78228 -69562
5435 -69562 -10496 -9813 79501 -106229 515 162708 86141 -2516 140476 -2872 115440 78430
5423 78430 -217798 -51951 -199081 321369 -187584 -125107 148353 122745 -281381 -38225 -24321
5412 -24321 112747 -305066 -82018 -186211 210056 130358 12674 366457 388774 51479 -142391
5400 36936 121421 -124625 -65823 11562 -27852 199257 56010 -84237 72177 201896 -89762
5388 -273986 -210451 245567 -270059 18257 -327681 34752 -153877 -54277 -68910 14532 174002
5377 174002 167362 -125875 -389721 -67809 105956 28654 326666 -261571 221971 54357 -153857
5365 143602 -118271 101176 -411552 59104 13 -227969 -74691 78698 -103103 247630 -15034
5353 -198262 140802 387741 -119383 267386 -199989 104113 -87792 -84830 161187 95826
5343 95826 469414 -56019 -9508 127072 39650 68856 41523 -73533 -265663 -124800 56477
5331 66373 -7760 302490 -45700 -414261 5133 435666 -54350 199641 265011 354925 -105427
5319 106919 -211742 124517 -359369 -265646 6403 58382 104035 211943 -164862 -153 464238
5307 -161163 -112461 55825 -208615 131650 -137960 201791 9037 -63554 116072 -198413 -264321
5296 -264321 -83897 156217 149693 290464 -160146 372234 -50065 -186874 102052 177279 -107046
5284 22771 89619 -80034 -137841 72540 168557 171349 -83008 26451 -176273 396313 -120095
5272 -96003 81791 214986 -53390 -366746 18726 -273417 72793 -191691 -188342 95896 -101884
5260 41917 -135567 -248319 -388707 -273249 4267 307584 -58867 149244 -157890 79297 -130457
5248 -332765 -148809 144656 187402 -172885 63619 -186718 -50930 265379 172311 416872
5238 416872 -195487 -485306 168989 76269 -73816 17614 59742 -274253 184663 288166
5228 288166 253935 -192039 -139879 23669 239786 89571 43098 -85101 73480 -78579 -139088
5217 -139088 178966 -220877 2079 14672 237110 112789 262007 50988 178255 37249 -179943
5205 128341 -219566 -320440 90750 81421 136858 -219378 152534 -161478 -84060 -221107 133624
5193 -152003 46261 130797 -42740 318254 70738 235557 174198 -142714 -27235 -226748 -76998
5181 -95046 -10968 -143407 -86970 -143006 278160 -152501 6141 195969 276062 102402 103996
5170 103996 26047 -114145 29501 173595 -236183 81485 -109802 -147642 -254522 -192563 280748
5158 90589 11842 305645 -296650 -155578 -90632 62267 89160 -107022 141589 118584 -40405
5146 267977 200166 25715 -236279 -530 -301691 -56796 -327376 -144826 -26508 -45968 149128
5134 -32451 350180 -174124 22779 302287 -279770 -111126 -117332 -347744 -19305 182560 230897
5123 230897 73659 -3345 68420 66104 60639 -72459 -241009 -196988 -139482 372893 -360476 -72872
5110 172083 129066 66487 -253085 162886 -148281 32189 126505 -255679 -262233 33897 17493
5099 17493 40283 354 -92094 -139817 114607 -56190 -123829 367829 252042 233281 286628 55284
5086 62700 314947 15567 -106724 -7384 29981 -163198 -41508 59885 -14008 501184 74058
5074 -266978 -343695 76443 9369 44731 -116094 89372 178262 -147077 -254102 153327 71714
5062 189689 91129 -162062 -25104 -298819 179328 104738 -24092 94920 -67201 -10223 -8281
5051 -8281 -24693 -34070 31774 131772 44391 -179740 218291 364326 249392 103342 163519
5040 163519 -155613 26944 46946 -99205 265426 -333912 -169438 -150029 -131210 -144575 31067
5028 -310363 -120790 -5416 -276372 -138353 23621 330674 -113499 263642 54501 -82658 -72002
5017 -72002 -402117 321194 172906 326165 -26041 1346 -143337 120939 -111876 -6226 130799
5005 -74433 300128 -96303 -205526 -54578 -175510 270163 -141824 285533 319529 -143107
4994 40543 231488 -51862 -90914 -63728 -181571 -43502 -170814 292204 276904 155609 7720
4982 75127 -35204 -31200 -198456 90089 -418269 -348786 -64173 -112974 77320 -248132 196661
4970 348875 27321 29592 -248717 -168311 78110 -69771 -259496 345852 112442 -19568 -121290
4959 -121290 301405 9556 173116 -52513 -287046 200949 -55557 -33089 510838 -100366 278549
4947 -2104 159985 -241455 59125 -76128 141950 428353 72861 38334 -215959 -290445 4562
4935 209585 7547 306119 169281 49196 -176334 -101846 336690 -203976 -22307 -159161 15187
4923 145502 62637 239821 176169 37695 82229 49436 -37735 -143256 -1862 34492 17676
4912 17676 64379 -169344 -39820 -75504 121715 -41947 -22308 48977 47285 -79942 212368
4900 270497 221241 6984 105787 -82647 411617 -23890 -151400 124664 -39418 -155589 -41968
4888 143755 -56908 -128256 286846 65511 -192474 72855 -242255 274723 362365 -66956 20476
4876 -310696 194933 49273 -102874 -16479 109460 -209226 -66606 19484 130013 53120 249196
4865 249196 134292 47645 -108912 93023 -29322 350148 374195 -99698 -137855 87891 -364572
4853 -80091 57885 7217 34681 52571 234923 -189070 107476 210305 64658 -12724 -24805
4842 -24805 -300707 233146 24836 -124508 -148135 183379 149146 -37763 306680 -216538 -68180
4830 -60273 -20246 128720 159916 47872 -41623 389537 275812 38653 -345170 129521 76273
4819 76273 489764 76879 462010 -147933 30521 305492 -204042 67183 450430 -11857 33231
4807 82257 265582 214980 -250989 24633 -9115 152980 228645 112204 -107086 7840 154025
4796 154025 25727 107585 -254594 132636 -29769 96980 -278550 -128775 -176513 -78735 214906
4784 -94556 77145 51837 -103287 138730 -263600 115071 -22916 68572 -120089 207657 36292
4772 -71784 -50354 -89341 3615 150142 -285785 -34958 10207 41818 -251262 133112 15610
4760 154849 -522004 380177 -157309 -104691 185734 -62180 -331718 11348 -26041 5723 -132250
4748 -82628 -181691 -231042 -232070 -413423 -184294 255148 220638 8314 -33547 65022 -282395
4736 89964 34451 307763 266932 -226795 -212076 325556 -323425 109061 75712 -47755 80258
4724 38650 -26015 -129872 43279 160283 -37018 -54591 131492 -62301 -52403 -80295 249515
4712 -4193 92444 211506 263962 223427 153730 132141 76901 9017 307780 -10886 130451 -201691
4699 -368306 -42413 -389655 -266390 -262180 164972 45028 47222 -179490 -127341 -130606 8853 -191984
4686 311614 258266 -40100 52472 -106596 215488 70909 -233821 35390 -113102 -148393 -32060
4674 71176 324579 155753 -144350 -76381 366718 57562 12999 -261855 45199 -28840 51694
4662 13578 -92309 8685 -113581 171409 -280151 328523 316739 251940 158824 328648 -138309
4650 -30203 2033 -80444 228711 225503 211306 -10950 -279379 -31117 -26647 -1899 -267875 88706
4637 289995 -218412 108845 43463 255697 -20202 75685 110429 256930 355724 -179956 230753
4625 -15874 -273478 203005 276653 -4610 65182 -50243 308277 193584 333494 117090 -355888
4613 -50363 437982 -85153 -156505 -203767 214299 -127470 -106805 -68941 246868 -195987 -57043
4601 -95390 91246 -121083 -10824 150880 389099 7814 -45735 -21229 20647 -3543 94530 -179688
4588 185926 354205 -45230 124433 49339 112395 -139641 251772 199447 -114840 -245067
4578 -245067 -352852 60236 77200 80693 87696 -246429 -14117 32468 441648 54325 -548815
4566 154982 -457433 31823 27174 -100759 -121595 -140361 -149936 70233 36291 373453 -144446
4554 -289679 38406 314930 349927 -11828 9557 41751 -340640 76093 15213 482358 352544
4543 352544 16250 167908 -165296 185619 -73449 131541 169810 141378 -336960 90419 -55050
$$ [...]
##END NTUPLES=NMR SPECTRUM
##END=
