
##TITLE=AC1251_CAMARS11069_6534722_LsklCzsz1x
##JCAMPDX= 6.0         $$ Bruker NMR JCAMP-DX V2.0
##DATA TYPE= NMR SPECTRUM
##DATA CLASS= NTUPLES
##ORIGIN= BRUKER
##OWNER= Administrator
$$ 1.72 TOPSPIN		Version 2.1
$$ 2012-07-17 03:41:46.812 -0500  Administrator@TOPSPIN
$$ Compression mode = diff/dup
##.OBSERVE FREQUENCY= 400.02188249412
##.OBSERVE NUCLEUS= ^1H
##.ACQUISITION MODE= SIMULTANEOUS (DQD)
##.ACQUISITION SCHEME= undefined
##.AVERAGES= 64
##.DIGITISER RES= 22
##SPECTROMETER/DATA SYSTEM= spect
##.PULSE SEQUENCE= noesygpps1d.comp
##.SOLVENT NAME= COFFEE_meoh
##.SHIFT REFERENCE= INTERNAL, COFFEE_meoh, 1, 14.96085
##AUDIT TRAIL= $$ (NUMBER, WHEN, WHO, WHERE, PROCESS, VERSION, WHAT)
$$ ##TITLE= Audit trail, TOPSPIN		Version 2.1
$$ ##JCAMPDX= 5.01
$$ ##ORIGIN= Bruker BioSpin GmbH
$$ ##OWNER= Administrator
$$ $$ C:\Bruker\TOPSPIN/data/COFFEE/nmr/AC1251_CAMARS11069_6534722_LsklCzsz1x/12/pdata/1/auditp.txt
$$ ##AUDIT TRAIL=  $$ (NUMBER, WHEN, WHO, WHERE, PROCESS, VERSION, WHAT)
(   1,<2012-07-17 03:41:42.078 -0500>,<Administrator>,<TOPSPIN>,<go>,<TOPSPIN 2.1>,
      <created by zg
	started at 2012-07-17 03:30:11.890 -0500,
	POWCHK enabled, PULCHK disabled,
       configuration hash MD5:
       6B 1B 68 BB D9 2E 58 E2 7F 35 AD 54 07 DF 0E 41
       data hash MD5: 64K
       AB 72 D9 E7 BD A0 79 95 B2 EF BD 34 F0 B2 C5 DA>)
(   2,<2012-07-17 03:41:44.890 -0500>,<Administrator>,<TOPSPIN>,<proc1d>,<TOPSPIN 2.1>,
      <Start of raw data processing
       efp LB = 0.3 FT_mod = 6 PKNL = 1 PHC0 = 0 PHC1 = 0 SI = 128K 
       data hash MD5: 128K
       EE E7 91 E1 70 59 C4 53 40 37 CE CC 6A F9 B0 B6>)
(   3,<2012-07-17 03:41:46.031 -0500>,<Administrator>,<TOPSPIN>,<proc1d>,<TOPSPIN 2.1>,
      <pk PHC0 = 1.867676 PHC1 = 0 
       data hash MD5: 128K
       37 8F EF 0E FB 9F 72 B5 13 78 AD 85 90 A5 6A 91>)
(   4,<2012-07-17 03:41:46.265 -0500>,<Administrator>,<TOPSPIN>,<proc1d>,<TOPSPIN 2.1>,
      <abs ABSG = 1 
       data hash MD5: 128K
       A5 4C 53 83 09 86 E8 55 C3 BE 4B 62 1F 6E AB A3>)
(   5,<2012-07-17 03:41:46.343 -0500>,<Administrator>,<TOPSPIN>,<proc1d>,<TOPSPIN 2.1>,
      <abs ABSG = 2 
       data hash MD5: 128K
       C4 D6 5B FF 68 80 B4 FD 2F 42 5B 45 E2 18 7A DB>)
(   6,<2012-07-17 03:41:46.406 -0500>,<Administrator>,<TOPSPIN>,<proc1d>,<TOPSPIN 2.1>,
      <abs ABSG = 3 
       data hash MD5: 128K
       B0 B1 2F 2C C2 FA 6E 85 A6 49 5F F1 6E 7C D1 3A>)
(   7,<2012-07-17 03:41:46.640 -0500>,<Administrator>,<TOPSPIN>,<proc1d>,<TOPSPIN 2.1>,
      <abs ABSG = 4 
       data hash MD5: 128K
       82 0F 5C 37 A1 5E 46 6A E2 0D 6A F2 33 FD 9B 34>)
(   8,<2012-07-17 03:41:46.703 -0500>,<Administrator>,<TOPSPIN>,<proc1d>,<TOPSPIN 2.1>,
      <abs ABSG = 5 
       data hash MD5: 128K
       6D BB 24 B8 F7 F0 89 FD 21 F6 D2 73 FF 86 13 2F>)
$$ ##END=
$$ 
$$ $$ hash MD5
$$ $$ 8B C0 59 75 16 BD 15 A0 44 21 EF D4 B3 BC 0F A9
##$RELAX= 
##$RELAX= 
##$RELAX= 
##$RELAX= 
##$RELAX= 
##$RELAX= 
##$RELAX= 
##$RELAX= 
$$ Bruker specific parameters
$$ [...]
##$TP07= 0
##$TPNAME0= <>
##$TPNAME1= <>
##$TPNAME2= <>
##$TPNAME3= <>
##$TPNAME4= <>
##$TPNAME5= <>
##$TPNAME6= <>
##$TPNAME7= <>
##$TPOAL= (0..7)
0.5 0.5 0.5 0.5 0.5 0.5 0.5 0.5
##$TPOFFS= (0..7)
0 0 0 0 0 0 0 0
##$TUNHIN= 0
##$TUNHOUT= 0
##$TUNXOUT= 0
##$USERA1= <user>
##$USERA2= <user>
##$USERA3= <user>
##$USERA4= <user>
##$USERA5= <user>
##$V9= 5
##$VALIST= <valist>
##$VCLIST= <CCCCCCCCCCCCCCC>
##$VD= 0
##$VDLIST= <DDDDDDDDDDDDDDD>
##$VPLIST= <PPPPPPPPPPPPPPP>
##$VTLIST= <TTTTTTTTTTTTTTT>
##$WBST= 2048
##$WBSW= 25
##$XGAIN= (0..3)
0 0 0 0
##$XL= 0
##$YL= 0
##$YMAX_a= 10713534
##$YMIN_a= -7631054
##$ZGOPTNS= <>
##$ZL1= 120
##$ZL2= 120
##$ZL3= 120
##$ZL4= 120
##$ABSF1= 14.96085
##$ABSF2= -5.597332
##$ABSG= 5
##$ABSL= 3
##$ALPHA= 0
##$AQORDER= 0
##$ASSFAC= 0
##$ASSFACI= 0
##$ASSFACX= 0
##$ASSWID= 0
##$AUNMP= <proc_prof1d_extract.lims>
##$AXLEFT= 0
##$AXNAME= <>
##$AXNUC= <1H>
##$AXRIGHT= 0
##$AXTYPE= 0
##$AXUNIT= <>
##$AZFE= 0.1
##$AZFW= 0.1
##$BCFW= 0
##$BC_mod= 0
##$BYTORDP= 0
##$COROFFS= 0
##$CY= 15
##$DATMOD= 1
##$DC= 0
##$DFILT= <>
##$DTYPP= 0
##$F1P= 0
##$F2P= 0
##$FCOR= 0.5
##$FTSIZE= 131072
##$FT_mod= 6
##$GAMMA= 0
##$GB= 0
##$INTBC= 1
##$INTSCL= 1
##$ISEN= 128
##$LB= 0.3
##$LEV0= 0
##$LPBIN= 0
##$MAXI= 10000
##$MC2= 0
##$MEAN= 0
##$ME_mod= 0
##$MI= 0
##$NCOEF= 0
##$NC_proc= -2
##$NLEV= 6
##$NOISF1= 0
##$NOISF2= 0
##$NSP= 0
##$NTH_PI= 0
##$NZP= 0
##$OFFSET= 14.96085
##$PC= 1
##$PHC0= 1.867676
##$PHC1= 0
##$PH_mod= 1
##$PKNL= yes
##$PPARMOD= 0
##$PPDIAG= 0
##$PPIPTYP= 0
##$PPMPNUM= 2147483647
##$PPRESOL= 1
##$PSCAL= 4
##$PSIGN= 0
##$PYNMP= <proc.py>
##$REVERSE= no
##$SF= 400.020009695554
##$SI= 131072
##$SIGF1= 0
##$SIGF2= 0
##$SINO= 400
##$SIOLD= 131072
##$SPECTYP= <>
##$SREGLST= <1H.CDCl3>
##$SSB= 0
##$STSI= 131072
##$STSR= 0
##$SW_p= 8223.68421052631
##$SYMM= 0
##$S_DEV= 0
##$TDeff= 65536
##$TDoff= 0
##$TI= <>
##$TILT= no
##$TM1= 0
##$TM2= 0
##$TOPLEV= 0
##$USERP1= <user>
##$USERP2= <user>
##$USERP3= <user>
##$USERP4= <user>
##$USERP5= <user>
##$WDW= 1
##$XDIM= 131072
##$YMAX_p= 407533601
##$YMIN_p= -11929
##$CURPLOT= <Network HP LaserJet P1505>
##$CURPRIN= <$Network HP LaserJet P1505>
##$DFORMAT= <normdp>
##$LAYOUT= <+/1D_H.xwp>
##$LFORMAT= <normlp>
##$PFORMAT= <normpl>
##$SURQMSG= 1
$$ End of Bruker specific parameters
$$ ---------------------------------
##NTUPLES= NMR SPECTRUM
##VAR_NAME=  FREQUENCY,     SPECTRUM/REAL,   SPECTRUM/IMAG
##SYMBOL=    X,             R,               I
##VAR_TYPE=  INDEPENDENT,   DEPENDENT,       DEPENDENT
##VAR_FORM=  AFFN,          ASDF,            ASDF
##VAR_DIM=   131072,        131072,          131072
##UNITS=     HZ,            ARBITRARY UNITS, ARBITRARY UNITS
##FACTOR=    0.0627417313425164, 1,          1
##FIRST=     8223.62146879497, 2901,         -47903
##LAST=      0,             4048,            -47945
##MIN=       0,             -11929,          0
##MAX=       8223.62146879497, 407533601,    0
$$ Real data points
##PAGE= N=1
##DATA TABLE= (X++(R..R)), XYDATA
$$ [...]
63929B616845K20025K21673K18321K09368J94513J73841J48205J19345Q9136N8510
63919D269782K7291m953l8210p2030j05443j36709j63628j84690j99754k09546
63909C182110k14778k16008k13834k08762k00981j90586j77915j63526j47991
63900A447729j31914j15998j01026q7758p6654o7400n8974n0689m3031l6958l2515
63889F44812k8901k5712k3209k1237j9081j6700j4976j4137j3040j0885q642p644
63877D40648p535o870n279l738k864k249j493q14l50L10J612L614O195R045J1472
63862D41704J2911J3746J4969J6954J9192K1300K3468K5751K7663K8926K9932
63851F76516L1087L2138L2589L2363L1634L0337K8254K5398K1974J8148J4091
$$ y = [2616845, 2836870, 3058543, 3276864, 3486232, 3680745, 3854586, 4002791, 4122136, 4211272, 4269782, 4297073, 4292120, 4253910, 4181880, 4076437, 3939728, 3776100, 3591410, 3391656, 3182110, 2967332, 2751324, 2537490, 2328728, 2127747, 1937161, 1759246, 1595720, 1447729, 1315815, 1199817, 1098791, 1011033, 934379, 866979, 808005, 757316, 714285, 677327, 644812, 615911, 590199, 566990, 545753, 526672, 509972, 494996, 480859, 467819, 456934, 448292, 440648, 433113, 426243, 420964, 417226, 414362, 412113, 410620, 409806, 409456, 409766, 411378, 414992, 421187, 430232, 441704, 454615, 468361, 483330, 500284, 519476, 540776, 564244, 589995, 617658, 646584, 676516, 707603, 739741, 772330, 804693, 836327, 866664, 894918, 920316, 942290, 960438, 974529]
63840I74529J0062O261K636j015m937r381j4324j9083k2641k4663k5995k7828
63828H43621l0400l2777l3827l3317l2017l0870l0120k9223k7644k5511k3357
63817E14558k1400j9414j7322j5476j4216j3447j2856j2391j2198j2265j2257
63806C51316j1845j0990r923q892q064p586p473p390o792n568m370l945m187m290
63792B50001l824l159k795k740k810k939k941k466j593r27p98p80n57n77j222
63777B19873j865j677r92q50j383j604r62j44q0q45j810k341k111j263m44k52
63761B01250m89m64j6L28K51L4k5K6J25K72J25o71j637j714p09L16N39M31Q23
63742A98795J632K198K269J982J386P12N65J172J817J696R98M28J55N1N11J964
$$ y = [974529, 984591, 990852, 993488, 992473, 987536, 978155, 963831, 944748, 922107, 897444, 871449, 843621, 813221, 780444, 746617, 713300, 681283, 650413, 620293, 591070, 563426, 537915, 514558, 493158, 473744, 456422, 440946, 426730, 413283, 400427, 388036, 375838, 363573, 351316, 339471, 328481, 318558, 309666, 301602, 294016, 286543, 279153, 272361, 266793, 262423, 258478, 254291, 250001, 246177, 243018, 240223, 237483, 234673, 231734, 228793, 226327, 224734, 223807, 223009, 222229, 221672, 221095, 219873, 218008, 216331, 215339, 214489, 213106, 211502, 210540, 210396, 210316, 209471, 207661, 205320, 203209, 201946, 201502, 201250, 200761, 200297, 200281, 200609, 200860, 200894, 200869, 200895, 201020, 201292, 201417, 200746, 199109, 197395, 196686, 197002, 197541, 197972, 198795, 200427, 202625, 204894, 206876, 208262, 208974, 209539, 210711, 212528, 214224, 215222, 215650, 215805, 215856, 216367, 218331]
63726B18331L742M568M266M007M584N418N660N388N174N160N221N489N959N947
63712B88914M770K879J574J408J477N71j450l730n478o436o498n639m307l351
63698B64704l113k984k266j176m33j10L63J118J565J483J594K544L870M581M411
63683B76151L879L378K909K557K535K665K363J374J00q29j104p69j05M96Q47J249
63667B97696K157L512M737N404N623N598N213M242K754J111l42j488k480l611
63653C30126m921n992o328n982n537n373n257m747l814k848k207j907j667j214
63639B72332n31J55P51J412K172K662K583K328K627L532M336M580M647N022N499
63624C14107N610N489N755O621P613Q204Q394Q587R131J0035J1111J2277J3716
$$ y = [218331, 222073, 226641, 230907, 234914, 239498, 244916, 250576, 255964, 261138, 266298, 271519, 277008, 282967, 288914, 293684, 296563, 298137, 299545, 301022, 301593, 300143, 296413, 290935, 284499, 278001, 272362, 268055, 264704, 261591, 258607, 256341, 255165, 254732, 254622, 254985, 256103, 257668, 259151, 260745, 263289, 267159, 271740, 276151, 280030, 283408, 286317, 288874, 291409, 294074, 296437, 297811, 297911, 297082, 295978, 295209, 295104, 295600, 296447, 297696, 299853, 303365, 308102, 313506, 319129, 324727, 329940, 334182, 336936, 338047, 337705, 336217, 333737, 330126, 325205, 319213, 312885, 306903, 301366, 295993, 290736, 285989, 282175, 279327, 277120, 275213, 273546, 272332, 271801, 271956, 272707, 274119, 276291, 278953, 281536, 283864, 286491, 290023, 294359, 298939, 303586, 308608, 314107, 319717, 325206, 330961, 337582, 345195, 353399, 361793, 370380, 379511, 389546, 400657, 412934, 426650]
63611D26650J5552J7454J8914K0003K1480K3900K6901K9776L2371L4967L7385
63600G05353L8743L8174L5434L0803K4760J7826J0561L565k462o817r161r821
63588H76958r525r051r131j0297j2481j5038j7594k0502k3913k6778k7653k6447
63576F68548k4428k2484k0261j7296j4013j1087q601o487n036m205l013o19K362
63563E33380M466N164N197N350N782O516P655Q845R386R164Q838Q839Q863Q798
63549F36243R406J1423J4436J7415K0162K3525K8288L4422M1490M8958N5562N8755
63537A000085N5691M5343K9711J2753j956j2642j8989k1297k0377j7686j4718
63526A035918j2172j0166r193j0188j3450j8053k2742k7023l0951l4252l6189
$$ y = [426650, 442202, 459656, 478570, 498573, 520053, 543953, 570854, 600630, 633001, 667968, 705353, 744096, 782270, 817704, 848507, 873267, 891093, 901654, 905219, 902757, 895940, 886779, 876958, 867433, 858382, 849251, 838954, 826473, 811435, 793841, 773339, 749426, 722648, 694995, 668548, 644120, 621636, 601375, 584079, 570066, 558979, 550378, 543891, 538855, 534650, 531637, 531018, 533380, 537846, 543010, 548207, 553557, 559339, 565855, 573510, 582355, 591741, 600905, 609743, 618582, 627445, 636243, 645649, 657072, 671508, 688923, 709085, 732610, 760898, 795320, 836810, 885768, 941330, 1000085, 1055776, 1101119, 1130830, 1143583, 1141627, 1128985, 1109996, 1088699, 1068322, 1050636, 1035918, 1023746, 1013580, 1004387, 994199, 980749, 962696, 939954, 912931, 881980, 847728, 811539]
63515H11539l6308l4915l2748l0342k7816k5102k2345j9981j8263j6860j5140
63504E31719j2918j0615q690p245o290n943o130o414o435o297o246o246o118n882
63490D30250n611n223m695m275m046l519k202m93N44L94k42k58O76J917K720L050
63474D08987L472M346N338N833N614M873L725K144L86j072k131l173m386n498
63460D28458o308o922p152o474n038m019m148m510l758k091r61j016j484j609
63446C72968j543j503j082N1J504K793M042N576P253Q679R765J0697J1733J3273
63432D44206J5780J9400K4022K9782L6627M2974M5674M2394L3932K3490J3931
63421G72212O296O50k779l696k204J341O642J3264K0400K7190L3282L8714M3181
$$ y = [811539, 775231, 740316, 707568, 677226, 649410, 624308, 601963, 581982, 563719, 546859, 531719, 518801, 508186, 499496, 492251, 485961, 480018, 473888, 467474, 461039, 454742, 448496, 442250, 436132, 430250, 424639, 419416, 414721, 410446, 406400, 402881, 400679, 400186, 400730, 401124, 400882, 400624, 401300, 403217, 405937, 408987, 412459, 416805, 422143, 427976, 433590, 438463, 442188, 444332, 444718, 443646, 441515, 438342, 433956, 428458, 422150, 415228, 408076, 401602, 396564, 392545, 388397, 383887, 380129, 378038, 377077, 376061, 374577, 372968, 371425, 369922, 368840, 368891, 370395, 373188, 377230, 382806, 390059, 398738, 408503, 419200, 430933, 444206, 459986, 479386, 503408, 533190, 569817, 612791, 658465, 700859, 734791, 758281, 772212, 778508, 779158, 776379, 772683, 770479, 771820, 778462, 791726, 812126, 839316, 872598, 911312, 954493]
63408I54493M5538M4344L8972L0268K0034R997J234n706j0607j3592j5039j5325
63396A084611j4850j4281j4529j6255j9541k3984k8874l3281l6390l7876l7778
63385H06972l6070l2854k8902k5358k2595j9983j7083j4396j2432j0685q342n600
63373E72672l361j855m49J196K707L894N255P214R433J1236J2375J3023J3489
63360F46829J4253J5896J8537K1563K4237K6422K8498L0729L3109L5590L8140
63349I33803M0499M2101M2286M0441L6048K8912J9513R153m34p843j2604j5118
63337A156757j6007j5715j4796j4299j5273j7873k1328k4877k8403l1884l4727
63326I21575l6090l5733l4256l2483l0821k9070k6630k2946j7961j2127n919L55
$$ y = [954493, 1000031, 1044375, 1083347, 1113615, 1133649, 1143646, 1144880, 1139174, 1128567, 1114975, 1099936, 1084611, 1069761, 1055480, 1040951, 1024696, 1005155, 981171, 952297, 919016, 882626, 844750, 806972, 770902, 738048, 709146, 683788, 661193, 641210, 624127, 609731, 597299, 586614, 578272, 572672, 569311, 567456, 567007, 568203, 570910, 574804, 580059, 587273, 596706, 607942, 620317, 633340, 646829, 661082, 676978, 695515, 717078, 741315, 767737, 796235, 826964, 860073, 895663, 933803, 974302, 1016403, 1058689, 1099130, 1135178, 1164090, 1183603, 1192756, 1192322, 1184479, 1171875, 1156757, 1140750, 1125035, 1110239, 1095940, 1080667, 1062794, 1041466, 1016589, 988186, 956302, 921575, 885485, 849752, 815496, 783013, 752192, 723122, 696492, 673546, 655585, 643458, 637539, 637894]
63314F37894O001R447Q858L593m989j4095k0949k4139k4145k2609k0791j8707
63302E15369j5962j3058j1210j0818j0838j0116q788p867p732p760p404o929o793
63289C90094o772o179m878l656l408m112m908n080m694m204l867l746l903m124
63275C26563l734k406j024q91j960k715k202j255j081j465j391q17o64j212j767
63260C01979j867j819j806j541j086j038j478j659j200p32p47p36j61M55L39k01
63244B86702k67J60K46l36r82j071o39o4L77N90P05R43J124O86l95j168r08k51
63226B85452k67p90p32N8M99k2p38o95O2Q81J339J301Q07L52O01J444J967J690
63208B93209J234J344J956K622L211L624L562L175L273M190N007M725L757L364
$$ y = [637894, 643895, 653342, 662200, 665793, 660804, 646709, 625760, 601621, 577476, 554867, 534076, 515369, 499407, 486349, 475139, 464321, 453483, 443367, 434579, 426712, 418980, 411220, 403816, 396887, 390094, 383322, 377143, 372265, 368609, 365201, 361089, 356181, 351101, 346407, 342203, 338336, 334590, 330687, 326563, 322829, 320423, 319399, 318508, 316548, 313833, 311631, 310376, 309295, 307830, 306439, 305622, 304958, 303746, 301979, 300112, 298293, 296487, 294946, 293860, 292822, 291344, 289685, 288485, 287753, 287006, 286270, 286109, 286564, 286903, 286702, 286435, 286595, 286841, 286505, 285523, 284452, 283813, 283749, 284126, 284716, 285421, 286364, 287488, 288174, 287779, 286611, 285703, 285452, 285185, 284395, 283663, 283721, 284220, 284198, 283460, 282765, 282827, 283708, 285047, 286348, 287155, 287507, 288108, 289552, 291519, 293209, 294443, 295787, 297743, 300365, 303576, 307200, 310762, 313937, 317210, 321400, 326407, 331132, 334889, 338253]
63194C38253L832M278M207M294N327P028Q354Q671Q368Q445R561J1356J2810J3400
63180D48184J3636J4232J5063J5404J4995J4303J3784J3407J2948J2385J1839
63169F00180J1394J0988J0323Q980O967N023L912L425K495M00k569n746q919j2219
63155F34634j5489j8202j9942k0678k0588j9806j8505j7019j5717j4707j3751
63144D40230j2520j0881q944p008n478m656m401m160l574k894k496k192j514o05
63130C68907j97n08p58j26J202K341K744K585K316K248K425K744L196M016N289
63115C98424O429O596N855N340N865O933P567P643P687P845P842P760Q008Q473
63101D98267Q469P746O920O755P424Q639J0020J1140J1671J1747J1933J2534J3174
$$ y = [338253, 342085, 346363, 350570, 354864, 360191, 367219, 375573, 384244, 392612, 401057, 410618, 421974, 434784, 448184, 461820, 476052, 491115, 506519, 521514, 535817, 549601, 563008, 575956, 588341, 600180, 611574, 622562, 632885, 641865, 648832, 653855, 657767, 661192, 663687, 664087, 661518, 655772, 646853, 634634, 619145, 600943, 581001, 560323, 539735, 519929, 501424, 484405, 468688, 453981, 440230, 427710, 416829, 407885, 400877, 395399, 390743, 386342, 382182, 378608, 375714, 373218, 371026, 369512, 368907, 368710, 368202, 367444, 367318, 368520, 370861, 373605, 376190, 378506, 380754, 383179, 385923, 389119, 393135, 398424, 404853, 411449, 417304, 422644, 428509, 435442, 443009, 450652, 458339, 466184, 474026, 481786, 489794, 498267, 506736, 514482, 521402, 528157, 535581, 544220, 554240, 565380, 577051, 588798, 600731, 613265, 626439]
63088F26439J3223J2442J1030R194O868L910N06k743n298p246r172j1333j3228
63075F34592j4225j4358j4191j4119j4187j4363j4551j4328j3247j1392r396p809
63063D78426o754o081n535m828l873l028k703k759k576j784n67P72K171L602M809
63048D49292N494N620N460N414N789O555P335P711P642P458P548Q052Q693Q812
63034E46875P879O188M777M402M761N016M741M039L083K131J622J661J589P02
63020E99466o92j647j924k194k833l325l142k500j834j144k82O01J412K578M548
63005E87088P044R357J1328J3551J6435J9407K1376K1942K1905K2337K3302K3824
62993G98896K3187K1885K0945K0680K0566K0117J9376J8614J8009J7619J7189
$$ y = [626439, 639662, 652104, 663134, 672328, 679196, 683106, 683612, 680869, 675571, 668325, 659153, 647820, 634592, 620367, 606009, 591818, 577699, 563512, 549149, 534598, 520270, 507023, 495631, 486235, 478426, 471672, 465591, 460056, 455228, 451355, 448327, 445624, 442865, 440289, 438505, 437938, 438710, 440881, 444483, 449292, 454786, 460406, 465866, 471280, 477069, 483624, 490959, 498670, 506312, 513770, 521318, 529370, 538063, 546875, 554754, 560942, 565719, 570121, 574882, 579898, 584639, 588678, 591761, 593892, 595514, 597175, 598764, 599466, 598774, 597127, 595203, 593009, 590176, 586851, 583709, 581209, 579375, 578231, 577949, 578550, 579962, 582540, 587088, 594132, 603489, 614817, 628368, 644803, 664210, 685586, 707528, 729433, 751770, 775072, 798896, 822083, 843968, 864913, 885593, 906159, 926276, 945652, 964266, 982275, 999894, 1017083]
62982A017083J6049J3658J0284O606K731j809p018j2066j6245j9767k3199k6613
62970I59694k9603l1897l3517l4434l4347l2884l0044k6601k3749k2002k0586
62959F40030j8509j6036j4390j3921j3553j2372j0852r966r742r574r382r593
62947D92140j0123j0296r819r176q878q801q617q431q658r344r861r483q143o595
62933C65915n608n158m651l881l294l129k850j901p54n26j550k832l218k662j973
62918C21928j588j091j04Q94J077M13k23j15N58J186J500J607J635J669J801J889
62902C33036J597J022R29J862L322M388M878N248N652N906O302P526R574J1507
62888D02749J2470J2345J1284R398P171N386M186K852R04j142k586l531m545n775
$$ y = [1017083, 1033132, 1046790, 1057074, 1063680, 1066411, 1064602, 1057584, 1045518, 1029273, 1009506, 986307, 959694, 930091, 898194, 864677, 830243, 795896, 763012, 732968, 706367, 682618, 660616, 640030, 621521, 605485, 591095, 577174, 563621, 551249, 540397, 530431, 520689, 511115, 501733, 492140, 482017, 471721, 461902, 452726, 443848, 435047, 426430, 417999, 409341, 399997, 390136, 380653, 372510, 365915, 360307, 355149, 350498, 346617, 343323, 340194, 337344, 335443, 334689, 334163, 332613, 329781, 326563, 323901, 321928, 320340, 319249, 319145, 320039, 321116, 321529, 321306, 321191, 321749, 322935, 324435, 326042, 327677, 329346, 331147, 333036, 334633, 335655, 336584, 338446, 341768, 346156, 351034, 356282, 361934, 367840, 374142, 381668, 391242, 402749, 415219, 427564, 438848, 448246, 455417, 460803, 464989, 467841, 468745, 467603, 465017, 461486, 456941, 451166]
62874D51166o971q054r088r907j0194r854r044q021p174o859o955o848o133n131
62860C40933m432m232m271m158l638k799k150k110k401k393k075j955j938j199
62846C01182L79J484R09p55j756j218J65J174J216M97l66q70j031j175j276r18
62830B97641r1N17M28N0p0m7k35m46l18j7J01K27P41J358J397P65M6l34m17l80
62810C00916l93p22j383j836j569q83m88n23n51m25m44p35r86r37n67J44J122
62793B89740J891J911J275O32M01M18L80J54k88q29j147r99n44k0O53J548K237
62776B97413K241J779J550J843K462L323M436N347N382M541L528K776K072J239
62762C39932O17N12O82N86j11j317k486k869k223j245q60j108j292j130j115j635
$$ y = [451166, 444195, 436141, 427053, 417146, 406952, 397098, 388054, 380033, 372859, 366000, 359045, 352197, 346064, 340933, 336501, 332269, 327998, 323840, 320202, 317403, 315253, 313143, 310742, 308349, 306274, 304319, 302381, 301182, 301561, 303045, 303954, 303199, 301443, 300225, 300390, 301564, 302780, 303277, 302911, 302041, 301010, 299835, 298559, 297641, 297550, 298067, 298495, 298545, 298475, 298428, 298193, 297747, 297429, 297412, 297513, 297740, 298481, 299839, 301236, 302001, 302047, 301713, 301296, 300916, 300523, 299801, 298418, 296582, 295013, 294130, 293642, 293119, 292568, 292143, 291699, 290964, 289978, 289041, 288474, 288618, 289740, 291631, 293542, 294817, 295449, 295850, 296268, 296648, 296802, 296514, 295685, 294538, 293539, 292995, 292975, 293628, 295176, 297413, 299654, 301433, 302983, 304826, 307288, 310611, 315047, 320394, 325776, 330317, 333845, 336621, 338693, 339932, 340549, 341061, 341743, 342329, 342218, 340901, 338415, 335546, 333323, 332078, 331218, 330110, 328818, 327688, 326573, 324938]
62746C24938k428l088l495l552l075k259j782k096k886l448l304k379j008J26
62732B90264M10r8p37r03m39N01J477J817J282O81J060K283L114K925K454K537
62716C08628K958L079K966L156L772M558N422O363P104P528Q237R985J2608J5085
62702D01449J6774J8035J9530K1415K3470K5575K7715K9679L1265L2714L4612
62691F82233L7088L9427M0747M0978M0778M0447L9349L6643L2215K6644K0418
62680A076967J3549N858k683j1725k0422k7727l3128l6971l9820m1754m2596m2481
62668G97067m1745m0459l8572l6325l3958l1228k7877k4437k1843k0284j8996
62657D61343j7404j5695j4154j2616j0914r407q527q107p434o029m195k907k922
$$ y = [324938, 322510, 319422, 315927, 312375, 309300, 307041, 305259, 303163, 300277, 296829, 293525, 291146, 290138, 290264, 290674, 290576, 289839, 288936, 288497, 288998, 290475, 292292, 293574, 294255, 295315, 297598, 300712, 303637, 306091, 308628, 311586, 314665, 317631, 320787, 324559, 329117, 334539, 340902, 348006, 355534, 363771, 373756, 386364, 401449, 418223, 436258, 455788, 477203, 500673, 526248, 553963, 583642, 614907, 647621, 682233, 719321, 758748, 799495, 840473, 881251, 921698, 961047, 997690, 1029905, 1056549, 1076967, 1090516, 1096374, 1093691, 1081966, 1061544, 1033817, 1000689, 963718, 923898, 882144, 839548, 797067, 755322, 714863, 676291, 639966, 606008, 574780, 546903, 522466, 500623, 480339, 461343, 443939, 428244, 414090, 401474, 390560, 381153, 372626, 364519, 357085, 351056, 346861, 343954, 341032]
62644C41032l915m646m349l580l306l590l765l554l194k654j714p39l98n39k77
62629C00812O12J326J298Q95M59k73j362k151k248k235k634k911k285j069l33
62614B87901n01j033j305j234j074j043j152j181r68p38q01q87l85O08J202R59
62598B78368N15M56M26m0m90k34M74Q09O49N71P64P74L46j40j43N29J646K583
62580B87863K572J443n1j045j452j686j784j502j069j090j672k230k202j573o31
62565B73891K43N77Q1q54j449j411j200j265j428j236o30O5O57J301K145K932
62549B72419L092K326R66k49p37m05L68R66R35M68K79P51J412J704J888K559L449
62532B92191L597K774J835J447J334J124J098J570K260K843L524M526N545O288
$$ y = [341032, 337117, 332471, 328122, 324542, 321236, 317646, 313881, 310327, 307133, 304479, 302765, 302026, 301628, 301089, 300812, 301424, 302750, 304048, 304943, 305402, 305129, 303767, 301616, 299368, 297133, 294499, 291588, 289303, 288234, 287901, 287400, 286367, 285062, 283828, 282754, 281711, 280559, 279378, 278410, 277672, 276871, 275984, 275599, 276207, 277409, 278368, 278883, 279339, 279765, 279725, 279235, 279001, 279475, 280284, 280933, 281504, 282268, 283042, 283388, 283248, 283105, 283634, 285280, 287863, 290435, 291878, 291827, 290782, 289330, 287644, 285860, 284358, 283289, 282199, 280527, 278297, 276095, 274522, 273891, 274134, 274711, 274792, 273938, 272489, 271078, 269878, 268613, 267185, 265949, 265319, 265384, 266041, 267342, 269487, 272419, 275511, 277837, 278803, 278554, 277817, 277412, 277780, 278746, 279681, 280149, 280428, 281179, 282591, 284295, 286183, 288742, 292191, 295788, 298562, 300397, 301844, 303178, 304302, 305400, 306970, 309230, 312073, 315597, 320123, 325668, 331956]
62518C31956O993P868Q630R195J0228J2261J4780J6949J8762K0640K2412K3579
62506E04253K4334K5345K6549K7001K5958K3545K0403J7156J4071J0837O853K115
62494G28420k487o234r386j2342j4581j5282j4603j3374j1830r537o424l011K98
62481F09627L376O057Q374J0896J3950J6843J8767K0128K1814K3269K2683J9315
62469G95099J4463R825N928K441j091n262j0648j6914k2748k7058k9794l1335
62457F82906l1855l1534l0731k9566k7928k6078k4528k3114k1068j8222j5391
62446D02891j3167j1228r254p594o517n624m595l753l210k357r18J60j43j373
62432C33318k152j893j144m98p8L1l82j206j952k254k077j519p56q2K28J14l99
$$ y = [331956, 338949, 346817, 355447, 364642, 374870, 387131, 401911, 418860, 437622, 458262, 480674, 504253, 528587, 553932, 580481, 607482, 633440, 656985, 677388, 694544, 708615, 719452, 726305, 728420, 725933, 719699, 710313, 697971, 683390, 668108, 653505, 640131, 628301, 618764, 612340, 609329, 609627, 613003, 619060, 627434, 638330, 652280, 669123, 687890, 708018, 729832, 753101, 775784, 795099, 809562, 819387, 825315, 827756, 826665, 821403, 810755, 793841, 771093, 744035, 714241, 682906, 651051, 619517, 588786, 559220, 531292, 505214, 480686, 457572, 436504, 418282, 402891, 389724, 378496, 369242, 361648, 355131, 349507, 344912, 341159, 337949, 335592, 334674, 334834, 334691, 333318, 331166, 329273, 328129, 327631, 327553, 327584, 327202, 325996, 324044, 321790, 319713, 318194, 317438, 317356, 317584, 317698, 317299]
62415C17299j238k029k215j665q70k67K25P08Q80N96L34N34Q04M64l97j013r70
62398C11180m83J31P10J050J055J074J590K513L295L735M137M610M756M261L413
62383C47027K785K655K949L543M377N377O438P465Q410R256R964J0474J0812J1151
62369D42683J1669J2323J2975J3698J4707J5998J7367J8859K0828K3369K6152
62358F30628K9065L2596L7190M2508M7834N2960N8183O3489O8111P0982P1373
62347A204919O9068O4173N6837M7219L5835K3830J2515K416o911j5967k4552l2122
62335A437260l8523m3965m8573n2265n4795n5625n4128n0466m5949m1974l8776
62324I12221l5741l2719l0199k8297k6374k4028k1802k0463j9947j9542j8929
$$ y = [317299, 316061, 314032, 311817, 310152, 309282, 309015, 309240, 309948, 310828, 311424, 311758, 312292, 313096, 313560, 313163, 312150, 311180, 310697, 310828, 311538, 312588, 313643, 314717, 316307, 318820, 322115, 325850, 329987, 334597, 339353, 343614, 347027, 349812, 352467, 355416, 358959, 363336, 368713, 375151, 382616, 391026, 400282, 410246, 420720, 431532, 442683, 454352, 466675, 479650, 493348, 508055, 524053, 541420, 560279, 581107, 604476, 630628, 659693, 692289, 729479, 771987, 819821, 872781, 930964, 994453, 1062564, 1133546, 1204919, 1273987, 1338160, 1394997, 1442216, 1478051, 1501881, 1514396, 1516812, 1509901, 1493934, 1469382, 1437260, 1398737, 1354772, 1306199, 1253934, 1199139, 1143514, 1089386, 1038920, 992971, 950997, 912221, 876480, 843761, 813562, 785265, 758891, 734863, 713061, 692598, 672651, 653109, 634180]
62313F34180j8547j8774j9076j8404j6474j4293j3081j2797j2331j1101r755q938
62301D60609q145o593m641l456l347l455l087k482j995j401m70M15P77P64Q53
62286D24346J182J659K356L285M036M207M047M157M587M800M536M211M276M637
62272D76322M948N183N580O264P147Q112R055R957J1071J2871J5496J8422K1009
62259F11437K3346K6164K9980L4673L9891M5445N1113N6513O1434O5922O9773
62248A115691P2183P2219O9360O3375N4196M2444K9608J7058N058o635j7597k7038
62236A489922l5079m2628m9798n5539n9227o1569o3291o3846o2272n8712n4149
62225H83812m9135m3788l8637l4411l0962k7398k3468j9981j7627j6062j4518
$$ y = [634180, 615633, 596859, 577783, 559379, 542905, 528612, 515531, 502734, 490403, 479302, 469547, 460609, 452464, 445871, 441230, 437774, 434427, 430972, 427885, 425403, 423408, 422007, 421537, 421952, 422729, 423493, 424346, 425528, 427187, 429543, 432828, 436864, 441071, 445118, 449275, 453862, 458662, 463198, 467409, 471685, 476322, 481270, 486453, 492033, 498297, 505444, 513556, 522611, 532568, 543639, 556510, 572006, 590428, 611437, 634783, 660947, 690927, 725600, 765491, 810936, 862049, 918562, 979996, 1045918, 1115691, 1187874, 1260093, 1329453, 1392828, 1447024, 1489468, 1519076, 1536134, 1541192, 1534557, 1516960, 1489922, 1454843, 1412215, 1362417, 1306878, 1247651, 1186082, 1122791, 1058945, 996673, 937961, 883812, 834677, 790889, 752252, 717841, 686879, 659481, 636013, 616032, 598405, 582343, 567825]
62214E67825j2779j1144r810q747p900p299p008o998o981o382m956l287k309k164
62200D70061k080j481p50n16o62m81L67J561K663L558M248M640M778N132O319
62185D97357Q372J0428J1465J1399J1218J1814J2945J3666J3483J2734J1856J0881
62173F37618R744Q576P507O579O098O742Q939J2413J6659K1600K7409L3810M0029
62160H43723M5425M9866N3340N5411N5174N1773M5094L6109K6470J7460R296J522
62148A290663o053j3116j9497k5558l1710l7706m2733m6097m7575m7257m5376
62137I27985m2392l8958l5569l2326k9129k5923k2653j9191j5628j2445j0150
62126F43621q684p536o393n362m462l361j914n05N43J661L622O532R745J2758
$$ y = [567825, 555046, 543902, 534092, 525345, 517445, 510146, 503138, 496140, 489159, 482777, 477821, 474534, 472225, 470061, 467981, 466500, 465750, 465234, 464572, 464091, 464458, 466019, 468682, 472240, 476488, 481128, 485906, 491038, 497357, 505729, 516157, 527622, 539021, 550239, 562053, 574998, 588664, 602147, 614881, 626737, 637618, 647362, 655938, 663445, 670024, 676122, 682864, 691803, 704216, 720875, 742475, 769884, 803694, 843723, 889148, 939014, 992354, 1047765, 1102939, 1154712, 1199806, 1235915, 1262385, 1279845, 1289141, 1290663, 1284610, 1271494, 1251997, 1226439, 1194729, 1157023, 1114290, 1068193, 1020618, 973361, 927985, 885593, 846635, 811066, 778740, 749611, 723688, 701035, 681844, 666216, 653771, 643621, 634937, 627401, 621008, 615646, 611184, 607823, 605909, 605404, 605947, 607608, 611230, 617762, 627507, 640265]
62112F40265J5720J8918K2187K5017K6857K6992K4627J9622J3114O940K417j05
62100H42571o62O14K855M104K373k689r432j5568j9717k1609k1469j9676j6883
62087G24812j3806j0671p195l355K43L035N303P824J0861J3886J6391J8469K0438
62074G86235K2269K3672K4619K5449K6516K7938K9560L0992L1701L1375L0296
62063A090622K9236K8955K9812L1757L4403L7078L8984L9468L8090L4417K8145
62052A460967J9699J0517K281m298r713j4738j9644k4457k9468l4945m0435m4893
62040A270873m7630m8833m9063m8571m7334m5482m3256m0644l7372l3444k9415
62029G99829k5983k3324k1021j8604j6097j3912j2295j1027r768q522p657p459
$$ y = [640265, 655985, 674903, 697090, 722107, 748964, 775956, 800583, 820205, 833319, 840259, 842676, 842571, 841909, 842523, 845378, 849482, 851855, 849166, 839734, 824166, 804449, 782840, 761371, 741695, 724812, 711006, 700335, 693140, 689785, 690028, 693063, 698366, 706190, 717051, 730937, 747328, 765797, 786235, 808504, 832176, 856795, 882244, 908760, 936698, 966258, 997250, 1028951, 1060326, 1090622, 1119858, 1148813, 1178625, 1210382, 1244785, 1281863, 1320847, 1360315, 1398405, 1432822, 1460967, 1480666, 1491183, 1493464, 1489166, 1479453, 1464715, 1445071, 1420614, 1391146, 1356201, 1315766, 1270873, 1223243, 1174410, 1125347, 1076776, 1029442, 983960, 940704, 900060, 862688, 829244, 799829, 773846, 750522, 729501, 710897, 694800, 680888, 668593, 657566, 647798, 639276, 631619, 624160]
62017F24160p843q466q989r217r141q929q752q534q029p204o355n698n000l864
62003E18139k297p37N25J661K960M335N416O007O289O561O800O551N252K866K33
61988E70561j455j822j805k641m460o381p870r271j0697j1262j0233q413p396
61975D86855p608q045p922p544p288o851o048n464n482n427m555l357k911l269
61961D05084l479k994k166j403p22k10m4k5K58O78P76P30J260K448L494L918M211
61944D11814M936O020P328R113J1378J3455J4886J6165J7967K0117K1888K2963
61932E78030K3508K3683K3594K3374K2890K1737K0003J8492J7586J6445J4064
61921H03406J0712P422M375P91l572p787j0836j2629j3623j3997j3536j1993r377
$$ y = [624160, 616317, 607851, 598862, 589645, 580504, 571575, 562823, 554289, 546260, 539056, 532701, 527003, 522003, 518139, 515842, 515105, 515630, 517291, 520251, 524586, 530002, 536009, 542298, 548859, 555659, 562210, 567462, 570328, 570561, 569106, 567284, 565479, 562838, 558378, 551997, 544127, 534856, 524159, 512897, 502664, 494251, 486855, 479247, 471202, 463280, 455736, 448448, 441597, 435549, 430085, 424603, 419176, 414621, 411264, 408353, 405084, 401605, 398611, 396445, 395042, 394320, 394110, 394066, 394041, 394299, 394977, 395753, 396483, 397743, 400191, 403685, 407603, 411814, 416750, 422770, 430098, 439211, 450589, 464044, 478930, 495095, 513062, 533179, 555067, 578030, 601538, 625221, 648815, 672189, 695079, 716816, 736819, 755311, 772897, 789342, 803406, 814118, 821540, 825915, 826706, 823134, 815347, 804511, 791882, 778259, 764262, 750726, 738733, 729356]
61908G29356o042k601N75L757P465J1690J5768J8979K0906K1304J9991J7057J2855
61895H71060P766K176l368q303j2348j5473j7623j8796j9363j9888k0566k1004
61883G24270k0689j9531j7983j6689j5927j5338j4326j2887j1767j1617j2246
61872E55270j2967j3293j3029j2009j0282q330o601m998l216j453k39L55Q18J632
61858D71658K974M851P067R197J1109J3345J6375J9711K2450K4644K7253L0688
61846F61322L4241L7275M0044M2789M4745M4842M3061M0289L6884L2110K5238
61835A082840J6774Q222P65n517j1050j5777j9082k0536k0253j8451j5178j0710
61823I72047n741p63M381R816J4855J8455K0185K0112J8067J3755P573N66o532
$$ y = [729356, 723314, 720713, 721288, 725045, 732510, 744200, 759968, 778947, 799853, 821157, 841148, 858205, 871060, 878826, 881002, 877634, 869331, 856983, 841510, 823887, 805091, 785728, 765840, 745274, 724270, 703581, 684050, 666067, 649378, 633451, 618113, 603787, 590900, 579133, 567516, 555270, 542303, 529010, 515981, 503972, 493690, 485360, 478759, 473761, 470545, 469092, 468853, 469208, 470026, 471658, 474632, 479483, 486550, 495747, 506856, 520201, 536576, 556287, 578737, 603381, 630634, 661322, 695563, 732838, 772882, 815671, 860416, 905258, 948319, 988608, 1025492, 1057602, 1082840, 1099614, 1107836, 1108601, 1103084, 1092034, 1076257, 1057175, 1036639, 1016386, 997935, 982757, 972047, 966306, 965543, 969924, 979740, 994595, 1013050, 1033235, 1053347, 1071414, 1085169, 1092742, 1093308, 1086776]
61810A086776j3589k0410k6532l1766l6269l9779m1445m0810l8534l5706l2830
61799G29106k9793k6452k2994j9825j7356j5668j4387j3038j1629j0488r647q717
61787E29112p505o306n497n166n192n378n396n017m419l963l721l610l793m406
61773D59743m914m528l342k361k221k465k328j618o01M01J001R37N65O46J407
61758D40322K344L084L820M583M845M325L516K961K571K112J852K108K639K960
61744D84042K893K386J336R0n55l33K1j13l00O5N95N17k0j89J71N05N80O96Q90
61725D93277Q79Q11J189J922K252J902J531J805K533L097L238L123K998L075L425
61710E27057L842M013L867L478K720J422q9j199j818k460l353m029m159m187m658
$$ y = [1086776, 1073187, 1052777, 1026245, 994479, 958210, 918431, 876986, 836176, 797642, 761936, 729106, 699313, 672861, 649867, 630042, 612686, 597018, 582631, 569593, 557964, 547476, 537829, 529112, 521607, 515301, 509804, 504638, 499446, 494068, 488672, 483655, 479236, 475273, 471552, 467942, 464149, 459743, 454829, 450301, 446959, 444598, 442377, 439912, 437584, 435966, 435365, 435766, 436767, 437704, 438269, 438915, 440322, 442666, 445750, 449570, 454153, 458998, 463323, 466839, 469800, 472371, 474483, 476335, 478443, 481082, 484042, 486935, 489321, 490657, 490747, 490192, 489859, 489880, 489767, 489467, 489532, 490127, 490644, 490624, 490435, 490606, 491111, 491691, 492387, 493277, 494156, 494967, 496156, 498078, 500330, 502232, 503763, 505568, 508101, 511198, 514436, 517559, 520557, 523632, 527057, 530899, 534912, 538779, 542257, 544977, 546399, 546310, 545111, 543293, 540833, 537480, 533451, 529292, 525105, 520447]
61695E20447n237n061l985k833k374k487k615k613k759l066l158k906k789l218
61681D75346l825l890l345k791k543k230j639j287j707k561k998k648j840j035
61667D41007n17m58p70r28n08J82M27N7l98n38n08m71k27L57R62J299J592K181
61649D42741K820K897K350J877K034K471K477K111K254L381M741N225M789M390
61635D86558M486M304L010J034l86p60p93j226j903k255k250k408k960l457l342
61620D77652k631j860j458j381j356j262j096p98l14J84L53J6p00j594k570l647
61604D57538m802n828o378o289n955o085o811p375p019n971n107m849m936n082
61590C75051n195m956l975k511j430j195j444j759k251l043l768l955l540k723
$$ y = [520447, 515210, 510149, 506164, 503331, 500957, 498470, 495855, 493242, 490483, 487417, 484259, 481353, 478564, 475346, 471521, 467631, 464286, 461495, 458952, 456722, 455083, 453796, 452089, 449528, 446530, 443882, 442042, 441007, 440490, 440032, 439262, 438334, 437826, 438008, 438435, 438492, 438094, 437556, 437048, 436577, 436350, 436707, 437669, 438968, 440560, 442741, 445561, 448458, 450808, 452685, 454719, 457190, 459667, 461778, 464032, 467413, 472154, 477379, 482168, 486558, 491044, 495348, 498358, 499392, 499006, 498246, 497453, 496227, 494324, 492069, 489819, 487411, 484451, 480994, 477652, 475021, 473161, 471703, 470322, 468966, 467704, 466608, 465810, 465496, 465680, 466033, 466049, 465349, 463755, 461185, 457538, 452736, 446908, 440530, 434241, 428286, 422201, 415390, 408015, 400996, 395025, 389918, 385069, 380133, 375051, 369856, 364900, 360925, 358414, 356984, 355789, 354345, 352586, 350335, 347292, 343524, 339569, 336029, 333306]
61576C33306j750j047j056j648k171k366k614l090l289k844k132j605j117n15
61562C06062k55o95j312j334q30m04k35r4k5k46n49n08j10L68Q77J364J406P67
61544C04247Q6J51P42R84P08N65Q54J097R51O96O44P76J119J887K920L608L645
61527C25680L426L401L391K809J370n54k114k637k236j704j580j678j712j900
61513C23962k411k705k176j162n45n51p26q86j189j406j120o42p44j353j495q03
61497C04048n5J07Q5L88P06N52J81R3J43j60p11r05n67k40m93j230j763j487n18
61478B98174L50M54p2n94p85p08l48L91J240J692J646J434J184P48K27l4j03m40
61460C04456j072j448j334j196j353j412r22o8O67J106J288J184Q85O90P18P46
$$ y = [333306, 331556, 330509, 329453, 327805, 325634, 323268, 320654, 317564, 314275, 311431, 309299, 307694, 306577, 306062, 305807, 305112, 303800, 302466, 301636, 301232, 300997, 300903, 300878, 300632, 300083, 299575, 299465, 299833, 300710, 302074, 303480, 304247, 304333, 304484, 305226, 306210, 306918, 307483, 308337, 309434, 310385, 311081, 311725, 312501, 313620, 315507, 318427, 322035, 325680, 329106, 332507, 335898, 338707, 340077, 339523, 337409, 334772, 332536, 330832, 329252, 327574, 325862, 323962, 321551, 318846, 316670, 315508, 314963, 314412, 313686, 312800, 311611, 310205, 309085, 308443, 307699, 306346, 304851, 304048, 303993, 304100, 304185, 304573, 305279, 305831, 306012, 306105, 306248, 306088, 305377, 304472, 303905, 303665, 303172, 301942, 300179, 298692, 298174, 298524, 298978, 298906, 298312, 297527, 296819, 296471, 296862, 298102, 299794, 301440, 302874, 304058, 304806, 305033, 304999, 304896, 304456, 303384, 301936, 300602, 299406, 298053, 296641, 295719, 295651, 296318, 297424, 298712, 299896, 300781, 301471, 302189, 302935]
61444C02935O72P00Q31O82J44k29Q5Q63J546K028K627L433M122M332M016L445
61428C32232K948K557J992J163M52J39j24o77r33j8J729K866K679J979J773K025
61412C52782K246K399K546K339J554O21J1m10q42j014q06q56j718k917l549l471
61396C48915l082k460j550r12j203k056k383j811j031o40m65k10l9j88m86n69
61380C29830k44M79J332J771J418O67M17J046K006K583K691K627K460K013J371
61365C52467R03P97P64M09k30p13p69n63l10J27R92K123L038L499L684L800L896
61348C73914M042M377M897N576O684Q533J0769J2407J2791J2157J1070R829Q521
61335D85567P242N924M410K950K134K023J833R45k88j216j934k985m297n136n114
$$ y = [302935, 303607, 304307, 305138, 305820, 305964, 305735, 305820, 306683, 308229, 310257, 312884, 316317, 320439, 324771, 328787, 332232, 335180, 337737, 339729, 340892, 341344, 341483, 341359, 340682, 339749, 339731, 341460, 344326, 347005, 348984, 350757, 352782, 355028, 357427, 359973, 362312, 363866, 364487, 364498, 364088, 363246, 362232, 361426, 360570, 358852, 355935, 352386, 348915, 345833, 343373, 341823, 340911, 339708, 337652, 335269, 333458, 332427, 331787, 331322, 331112, 331073, 330885, 330399, 329830, 329586, 330065, 331397, 333168, 334586, 335253, 335670, 336716, 338722, 341305, 343996, 346623, 349083, 351096, 352467, 353370, 354167, 354931, 355340, 355110, 354397, 353628, 353065, 352755, 352882, 353874, 355997, 359035, 362534, 366218, 370018, 373914, 377956, 382333, 387230, 392806, 399490, 408023, 418792, 431199, 443990, 456147, 467217, 477046, 485567, 492809, 498733, 503143, 506093, 508227, 510250, 512083, 513028, 512740, 511524, 509590, 506605, 502308, 497172, 492058]
61320D92058m674m455m543m487l900k933k177k048k299k277j674p81J3N82R42
61305D57347J101J199J433J803K234K923M105N513O659P597Q674R423Q649O000
61291E24660K667m5k108m162o141p295p227o302n276m807n013n170m375k768j440
61276D65198q62k29J075K332K648K419K648L398M065M722O012P891R490J0230
61262E21037J0232R653Q464O925N580M835M968O253Q486J0690J2093J3090J4454
61249F36760J5836J6031J4564J2076R153N808K209r93l356n045o254o876o987
61236F82926p104p630q350q681q239p197o135n437m736l451j936j344j917k348
61222F08421j536j70N23O92J284K091J992Q78k12q46j578k455k698k199j897k133
$$ y = [492058, 487384, 482929, 478386, 473899, 469999, 467066, 464889, 462841, 460542, 458265, 456591, 455810, 455823, 456405, 457347, 458448, 459647, 461080, 462883, 465117, 468040, 472145, 477658, 484317, 491914, 500588, 510011, 518660, 524660, 527327, 527282, 525174, 521012, 514871, 507576, 500349, 494047, 488771, 483964, 478951, 473781, 469406, 466638, 465198, 464336, 464107, 465182, 467514, 470162, 472581, 475229, 478627, 482692, 487414, 493426, 501317, 510807, 521037, 531269, 540922, 549386, 556311, 561891, 566726, 571694, 577947, 586433, 597123, 609216, 622306, 636760, 652596, 668627, 683191, 695267, 704420, 710228, 712437, 711444, 708088, 703043, 696789, 689913, 682926, 675822, 668192, 659842, 651161, 642922, 635725, 629590, 624153, 619417, 615966, 614030, 612686, 610769, 608421, 606885, 606715, 607238, 607930, 609214, 611305, 613297, 614175, 613963, 613117, 611539, 609084, 606386, 604187, 602290, 600157]
61206F00157j933p01N92O68m48j860l020l743l712k870j814j086m05Q13K575M437
61190E87650O291Q407J0880J3406J5595J7356J8941K0495K1417K0603J7755J4119
61178G72915J1194R144P323N939N819O657O994O307N578N310M467K328j6j204
61164H48755j650k664m305n524o014o538p533q610r536j0605j1823j2567j2465
61151G48921j1928j1523j1239j0682r613q095o301m325k112L80K807M401M567
61138F85258L515J928M2k542n989r466j1571j1629j0293q837p892p083n800m008
61124F05633k187p70K23J175K618M671O623P541P520P791R290J1597J3786J5655
61110F91166J7424J8830J9513J9872K0527K1207K1266K1056K1555K2637K2972
$$ y = [600157, 598224, 597523, 598115, 598783, 598335, 596475, 593455, 589712, 586000, 583130, 581316, 580230, 579825, 580638, 583213, 587650, 593941, 602348, 613228, 626634, 642229, 659585, 678526, 699021, 720438, 741041, 758796, 772915, 784109, 793253, 800576, 806515, 812334, 818991, 825985, 832292, 837870, 843180, 847647, 849975, 849959, 848755, 847105, 844441, 840136, 834612, 828598, 822060, 814527, 805917, 796381, 785776, 773953, 761386, 748921, 736993, 725470, 714231, 703549, 693936, 685841, 679540, 675215, 673103, 673483, 676290, 680691, 685258, 688773, 690701, 690743, 688201, 682212, 672746, 661175, 649546, 639253, 630416, 622524, 615441, 609641, 605633, 603446, 602676, 602899, 604074, 606692, 611363, 617986, 625527, 633047, 640838, 650128, 661725, 675511, 691166, 708590, 727420, 746933, 766805, 787332, 808539, 829805, 850861, 872416, 895053, 918025]
61099I18025K1911K0361J9376J8922J8339J7178J5065J1654P187K475k104o844
61087A061545j1621j5410j7504j8502j9497k0689k1416k1230k0470j9833j9597
61076H55776j9294j8265j6607j5142j4147j2784j0554q458p671p625o851n300
61064G13078m184l784l118j901j010o65K7J299K146K207K532L760N034N585N917
61049G26923O648P565Q611J0352J2629J4207J4676J5221J6639J8160J9204K0617
61037H91452K2997K5411K7007K8324K9778L0619L0761L1884L4964L8402M0404
61026A232003M1669M3844M6850M9796N3076N7388O1865O5247O7656O9291O9038
61015A857723O6738O5299O7937P4636Q3830R5846J11528J28865J44413J57229
$$ y = [918025, 939936, 960297, 979673, 998595, 1016934, 1034112, 1049177, 1060831, 1068018, 1070493, 1068389, 1061545, 1049924, 1034514, 1017010, 998508, 979011, 958322, 936906, 915676, 895206, 875373, 855776, 836482, 818217, 801610, 786468, 772321, 759537, 748983, 740525, 732854, 725229, 718378, 713078, 708894, 705110, 701992, 700091, 699081, 698416, 698443, 699742, 701888, 704095, 706627, 710387, 715421, 721006, 726923, 733571, 741136, 749747, 760099, 772728, 786935, 801611, 816832, 833471, 851631, 870835, 891452, 914449, 939860, 966867, 995191, 1024969, 1055588, 1086349, 1118233, 1153197, 1191599, 1232003, 1273672, 1317516, 1364366, 1414162, 1467238, 1524626, 1586491, 1651738, 1719394, 1788685, 1857723, 1924461, 1989760, 2057697, 2132333, 2216163, 2312009, 2423537, 2552402, 2696815, 2854044]
61005B854044J68693J80301J95292K20420K61482L18437L89590M78479N90845
60996E657583P27525Q89398J088910J347906J685758K121301K675986L329675
60988A9524042L936650M211765L878218K892331J530218K31907o53268r91145
60980C4560718q07974k11639N89489J250776J392385Q22055l20740j649847k770107
60971C2855116l462253l705416l595103l261921k828194k385095j981943j634297
60963A0000894j342755j103701r09537p50270o18999n12976m29438l64085l13500
60954C655633k75331k45741k20121j96763j76878j60551j45410j29743j14130
60945A990965r9341q5090p1857o1724n6251n4941n6272n8770o0705o0497n8164
$$ y = [2854044, 3022737, 3203038, 3398330, 3618750, 3880232, 4198669, 4588259, 5066738, 5657583, 6385108, 7274506, 8363416, 9711322, 11397080, 13518381, 16194367, 19524042, 23460692, 27672457, 31550675, 34443006, 35973224, 36205131, 35551863, 34560718, 33752744, 33541105, 34130594, 35381370, 36773755, 37595810, 37275070, 35625223, 32855116, 29392863, 25687447, 22092344, 18830423, 16002229, 13617134, 11635191, 10000894, 8658139, 7554438, 6644901, 5894631, 5275632, 4762656, 4333218, 3969133, 3655633, 3380302, 3134561, 2914440, 2717677, 2540799, 2380248, 2234838, 2105095, 1990965, 1891624, 1806534, 1734677, 1672953, 1616702, 1561761, 1505489, 1446719, 1386014, 1325517, 1267353]
60934A267353n5115n2211m9262m6386m4177m2291l9618l6203l3311l1264k8943
60923H08572k6008k3748k2887k2275k0804j9109j8222j7697j6436j4488j2796
60912E94102j1691j0657r267p606o036n014m774m833m268k735q22Q22K131L219
60898E32571L951M201M028L500K847K622L069L389K606J029o9k61l45q78j575
60883E60685k410l975o230q043q658q631q735q871q729q628q947r420r647r662
60869D50099r476q765p576o590o081n351l855k207j366j376j560j464r77m5J166
60854C94576K242L052L833M452M342L520K938L246M036M758N574O600P240P042
60840D57451O498O126N518M167K553J382L74j102k722l626l742l633l344k537
$$ y = [1267353, 1212238, 1160027, 1110765, 1064379, 1020202, 977911, 938293, 902090, 868779, 837515, 808572, 782564, 758816, 735929, 713654, 692850, 673741, 655519, 637822, 621386, 606898, 594102, 582411, 571754, 562487, 554881, 548845, 543831, 539057, 534224, 529956, 527221, 526399, 527221, 529352, 532571, 536522, 540723, 544751, 548251, 551098, 553720, 556789, 560178, 562784, 563813, 563744, 563483, 563138, 562260, 560685, 558275, 554300, 548070, 540027, 531369, 522738, 514003, 505132, 496403, 487775, 478828, 469408, 459761, 450099, 440623, 431858, 424282, 417692, 411611, 406260, 402405, 400198, 398832, 397456, 395896, 394432, 393455, 393410, 394576, 396818, 399870, 403703, 408155, 412497, 416017, 418955, 422201, 426237, 430995, 436569, 443169, 450409, 457451, 463949, 470075, 475593, 479760, 482313, 483695, 484069, 482967, 480245, 476619, 472877, 469244, 465900, 463363]
60826D63363j507j005j105j234j183j208j178o80mo2j194k786m218n391o309o872
60810D27427p195p501p578p064o254n864n883n525m485l495l237l403l320k923
60796C53700k634k570k359j660o20J84K58k39o10m64k05l13m81p2P97J349J296
60779C45357J189J511K066K486K779L107L504L962M487M876M878M683M835N529
60765C95249O376O919P063O913O622O363O113N459M134K708K074K240K273J646
60751D62152Q79N79N62L65P2Q4M56Q93J177J225R56M13k63j136k450m148n804
60734D56012p140q174q659q083o590n318n140n553n349m109k408q98J60O16M74
60719C89841K02L78R84J444J503J543J963K642L252L746M335N155O166P242Q273
$$ y = [463363, 461856, 460851, 459746, 458512, 457329, 456121, 454943, 454263, 454259, 454197, 453003, 450217, 445999, 440608, 434299, 427427, 420232, 412731, 405153, 398089, 391835, 385971, 380088, 374563, 370078, 366583, 363346, 359943, 356623, 353700, 351066, 348496, 346137, 344477, 343857, 344041, 344299, 344060, 343450, 342986, 342781, 342468, 341987, 341915, 342712, 344061, 345357, 346546, 348057, 350123, 352609, 355388, 358495, 361999, 365961, 370448, 375324, 380202, 384885, 389720, 395249, 401625, 408544, 415607, 422520, 429142, 435505, 441618, 447077, 451211, 453919, 455993, 458233, 460506, 462152, 463031, 463610, 464172, 464537, 464609, 464693, 465149, 466042, 467219, 468444, 469400, 469813, 469550, 468414, 465964, 461816, 456012, 448872, 440698, 432039, 423956, 417366, 412048, 406908, 401355, 396006, 391897, 389489, 388591, 388751, 389367, 389841, 390043, 390421, 391405, 392849, 394352, 395895, 397858, 400500, 403752, 407498, 411833, 416988, 423154, 430396, 438669]
60704D38669R251J0289J1454J2624J3598J4300J4722J4773J4424J3947J3805J4190
60692E96046J4806J5217J5301J5306J5485J5808J6073J6144J5954J5274J3803
60681G65217J1630R344P374N445L029J19k939o172r804j3390j5954j7274j8238
60668G18387j9394j9953j8969j6938j5319j4783j4801j4873j5181j5803j6155
60657E36218j5656j4436j2996j1538r986q424p066n907m755l647k884k561k226
60644D34136j308Q5J155J326R38O33L57m26j575k196j942j629j976k440k025p70
60628D22343M65J345K232L153L546L242K887L049L493L584K978J683Kj504k381
60613D50117k781l154l427l117k322j899k345l136l523l309k542j187L37R62J73
$$ y = [438669, 447920, 458209, 469663, 482287, 495885, 510185, 524907, 539680, 554104, 568051, 581856, 596046, 610852, 626069, 641370, 656676, 672161, 687969, 704042, 720186, 736140, 751414, 765217, 776847, 786191, 793565, 799010, 802039, 802158, 799219, 793047, 783243, 769853, 753899, 736625, 718387, 698993, 679040, 660071, 643133, 627814, 613031, 598230, 583357, 568176, 552373, 536218, 520562, 506126, 493130, 481592, 471606, 463182, 456116, 450209, 445454, 441807, 438923, 436362, 434136, 432828, 432913, 434068, 435394, 436332, 436965, 437322, 436896, 435321, 433125, 431183, 429554, 427578, 425138, 423113, 422343, 422808, 424153, 426385, 429538, 433084, 436326, 439213, 442262, 445755, 449339, 452317, 454000, 454002, 452498, 450117, 447336, 444182, 440755, 437638, 435316, 433417, 431072, 427936, 424413, 421104, 418562, 417375, 417712, 418674, 418847]
60598D18847j082j477j042r52j724k527k455j712j181j228j442j329r23o59p56
60583C98358r10p10k45N1J66O69J802K903L216K970L109M061N387O597P736R028
60567D44188J0500J2110J4021J6419J9330K2651K6146K9303L1360L1583K9456
60556F87067K4754J7796R585J347o142j2565j7564k0656k1629k0658j7997j4000
60544F09338r449n273j693J899N975J0299J4561J9003K3941K9113L4077L8750
60532G70541M2860M5118M3935L9033L1623K2820J2718J491r319j7436k1682k2593
60520I39109k1424j9083j6169j3466j1831j1566j2066j2252j1454r871q114o336
60508G85477m123j310J420L180L954M623O018Q347J1603J5910K1275K7472L4573
$$ y = [418847, 417765, 416288, 415246, 414294, 412570, 410043, 407588, 405876, 404695, 403467, 402025, 400696, 399773, 399114, 398358, 397448, 396738, 396493, 396544, 396710, 397379, 399181, 402084, 405300, 408270, 411379, 415440, 420827, 427424, 435160, 444188, 454688, 466798, 480819, 497238, 516568, 539219, 565365, 594668, 626028, 657611, 687067, 711821, 729617, 739202, 740549, 734407, 721842, 704278, 683622, 661993, 641335, 623338, 609338, 599889, 594616, 592923, 594822, 600797, 611096, 625657, 644660, 668601, 697714, 731791, 770541, 813401, 858519, 902454, 941487, 973110, 995930, 1008648, 1010139, 1000820, 983384, 961702, 939109, 917685, 898602, 882433, 868967, 857136, 845570, 833504, 821252, 809798, 799927, 791813, 785477, 781354, 780044, 781464, 784644, 788598, 793221, 799239, 807586, 819189, 835099, 856374, 883846, 918419]
60495I18419M3163N3506O4703P5288Q4550R2743R9844J04710J05740J02052R3904
60484A838622Q2311O8628N4077L9232K3918P866q666k5212m1790n8768p5769r1101
60472A813348j02555j08897j10485j08525j03857r6686q7372p7217o7995o0630
60462H89129n4615m8857m2883l6987l1580k6874k3131k0570j8844j7036j4574
60451E53178j1957j0125r261q632p716o891o713o838o336m988l664l117k984k426
60437D61530j403o23l75j34M63R81Q12J5r44j863k799l624m209m800n671o448
60421D30908o444n648m822m397l901k850j633r49p35l17M68R37N14m80j213j203
60405C98235n73K54Q36Q84M97J98L97R06J191J099R69J039J057P03J05k55p6N39
$$ y = [918419, 961582, 1015088, 1079791, 1155079, 1239629, 1332372, 1432216, 1536926, 1642666, 1744718, 1838622, 1920933, 1989561, 2043638, 2082870, 2106788, 2114654, 2105988, 2080776, 2038986, 1980218, 1904449, 1813348, 1710793, 1601896, 1491411, 1382886, 1279029, 1182343, 1094971, 1017754, 949759, 889129, 834514, 785657, 742774, 705787, 674207, 647333, 624202, 603632, 584788, 567752, 553178, 541221, 531096, 521835, 513203, 505487, 498596, 491883, 485045, 478709, 473721, 470057, 466940, 463956, 461530, 460127, 459504, 459129, 458995, 459458, 460439, 461251, 461266, 460322, 458459, 455660, 452036, 447827, 443027, 437356, 430908, 424464, 418816, 413994, 409597, 405696, 402846, 401213, 400264, 399529, 399212, 399680, 400617, 401131, 400651, 399438, 398235, 397662, 397916, 398752, 399636, 400133, 400331, 400728, 401634, 402825, 403924, 404893, 405932, 406989, 407692, 407797, 407542, 407466, 408005]
60387D08005J159J350J023O69Q92J590J926J452P97P95J252J310Q10M60O18Q00
60371D24908O35N04P68J048Q72N35O76J275J738J738J426J071R29J279J969K196
60355D43567J348l8q40p19l67k96k85o7J20O0K4L09Q46J573K752M356N563N495
60337D63401M386L386L172L163K409Q80m18o41j04J39l39q09m14N82J078N22m97
60320D79896j143j224r70m29L75J081J321J378J923L066M141M624M785N218O069
60305E10111P202Q844J1562J5603K0817K7197L4660M1827M5849M4446L8070K9228
60293H35416J9651R040l271j6396k8170l6606m0535l9713l5254k9493k4345j9917
60281E90407j5372j0852p473n690m811m249m204m794n539o137o859p659p732o605
$$ y = [408005, 409164, 410514, 411537, 412206, 413098, 414688, 416614, 418066, 418863, 419658, 420910, 422220, 423030, 423490, 424108, 424908, 425543, 426047, 426815, 427863, 428735, 429270, 429946, 431221, 432959, 434697, 436123, 437194, 438123, 439402, 441371, 443567, 444915, 444877, 444037, 443318, 442951, 442655, 442370, 442303, 442423, 442483, 442507, 442816, 443662, 445235, 447987, 452343, 457906, 463401, 467787, 471173, 474345, 477508, 479917, 480797, 480379, 479738, 479634, 479773, 479434, 478625, 478211, 478793, 479871, 480393, 479896, 478753, 477529, 476559, 476130, 476505, 477586, 478907, 480285, 482208, 485274, 489415, 494039, 498824, 504042, 510111, 517313, 526157, 537719, 553322, 574139, 601336, 635996, 677823, 723672, 768118, 806188, 835416, 855067, 864107, 860836, 844440, 816270, 779664, 739129, 699416, 664162, 634669, 610324, 590407, 575035, 564183, 556710, 551020, 546209, 541960, 537756, 532962, 527423, 521286, 514427, 506768, 499036, 492431]
60267D92431n041m143m043m070l789l238k497j667j077r52j056j074j103j306
60253D57375j394j028n34n67j194j845k136k181k120j821j160k35P36J451J516
60238D44863P93k20p96p42m98m16l20J61J099K208L106L623L925M297M684M642
60222D70409L949L047K540K450K306J841J246Q11O67P89R17O00k15p73k03J316
60206D91697K670L160L171L265L314L028K831L388M356M483L246J751J419K122
60192E33901K379J426K74K60J165J593R04r8n03m17m20o12q12j179j971k945l507
60175E29438l362k656j713r98r62j436j544p44K75M43k24o79l28K84L80p3m74
60158E15627j83J007K618L643L455K598K220K709L367L379K549J143l99j438j544
$$ y = [492431, 487390, 483247, 479204, 475134, 471345, 468107, 465610, 463943, 462866, 461914, 460858, 459784, 458681, 457375, 455981, 454953, 454419, 453852, 452658, 450813, 448677, 446496, 444376, 442555, 441395, 441160, 441896, 443347, 444863, 445656, 445436, 444640, 443898, 443400, 442984, 442664, 442825, 443924, 446132, 449238, 452861, 456786, 461083, 465767, 470409, 474358, 477405, 479945, 482395, 484701, 486542, 487788, 488599, 489266, 490055, 490972, 491572, 491357, 490584, 490381, 491697, 494367, 497527, 500698, 503963, 507277, 510305, 513136, 516524, 520880, 525363, 528609, 530360, 531779, 533901, 536280, 537706, 537980, 538240, 539405, 540998, 541902, 541804, 541301, 540884, 540464, 539852, 539040, 537861, 535890, 532945, 529438, 526076, 523420, 521707, 520709, 519747, 518311, 516767, 516023, 516298, 516741, 516517, 515838, 515510, 515794, 516174, 516101, 515627, 515444, 516451, 519069, 522712, 526167, 528765, 530985, 533694, 537061, 540440, 542989, 544132, 543733, 542295, 540751]
60143E40751j051p27p22m54M46J750L260M967O410O829O356O150O781P361O868
60128E94975N514M029K405M18j376k327k959m220n732o114n056l777l115k497
60114E70168j276J1N45N72R42J817K648L151L540L951M296M602M998N361N414
60099F10740N175M885M545L890K883J831Q98j25j387k582l288l517l605l604l073
60084F13666j677K03J692K292K309K338K506K515K208J771J326P27p3q18j386
60069F29599k166l583n400o811p323p216p084p140p113o655n763m880m512m679
60055E49274m782m280l464l248m057n256n806n345m453l948m109m417l992k443
60041D89674m67O79N49R6N22J763K666K609K315K791L949M737M381L084J601M92
$$ y = [540751, 539700, 538973, 538251, 537797, 538243, 539993, 543253, 548220, 554630, 561459, 567815, 573965, 580746, 588107, 594975, 600489, 604518, 606923, 607341, 605965, 603638, 600679, 596459, 590727, 584613, 579557, 575780, 572665, 570168, 568892, 568903, 569448, 570020, 570962, 572779, 575427, 578578, 582118, 586069, 590365, 594967, 599965, 605326, 610740, 615915, 620800, 625345, 629235, 632118, 633949, 634847, 634722, 633335, 630753, 627465, 623948, 620343, 616739, 613666, 611989, 612192, 613884, 616176, 618485, 620823, 623329, 625844, 628052, 629823, 631149, 631876, 631803, 630985, 629599, 627433, 623850, 618450, 611639, 604316, 597100, 590016, 582876, 575763, 569108, 563345, 558465, 553953, 549274, 544492, 540212, 536748, 533500, 529443, 524187, 518381, 513036, 508583, 504635, 500526, 496109, 492117, 489674, 489207, 489886, 490435, 490531, 491053, 492816, 495482, 498091, 500406, 503197, 507146, 511883, 516264, 519348, 520949, 521441]
60025E21441j71o46j231j997k729l169l329l509m004m762n394n472m922m091l410
60010D72605k985k589k062j532j245j235j284j110o30p3K32K67M07R37J602J969
59994D63274K125K542L189L378K790K074J985K333K450K331K553L091L128K266
59980D99509J250R43J156J075N39J52K40L82J31m09j015j850l031l959l766k426
59964D88921q95K0M33Q50J323J604J755K008K262K234K071K190K485K288J310
59949E10859P8q10j348j752j915j654j153p17l61k8J02j10m58q23j536k764l834
59932D91776l867l032k415k608l086l105k606j915j100j13P77J168J048Q38R01
59917D72661J209J465J440J235J219J652K349K839K834K476K102J990K280K943
$$ y = [521441, 521270, 520624, 519393, 517396, 514667, 511498, 508169, 504660, 500656, 495894, 490500, 485028, 480106, 476015, 472605, 469620, 467031, 464969, 463437, 462192, 460957, 459673, 458563, 457933, 457860, 458092, 458359, 458766, 459703, 461305, 463274, 465399, 467941, 471130, 474508, 477298, 479372, 481357, 483690, 486140, 488471, 491024, 494115, 497243, 499509, 500759, 501702, 502858, 503933, 504472, 504624, 504864, 505246, 505377, 504968, 503953, 502103, 499072, 495113, 491347, 488921, 488026, 488046, 488479, 489329, 490652, 492256, 494011, 496019, 498281, 500515, 502586, 504776, 507261, 509549, 510859, 510937, 510127, 508779, 507027, 505112, 503458, 502305, 501588, 501227, 501199, 501301, 501191, 500733, 499910, 498374, 495610, 491776, 487909, 484877, 482462, 479854, 476768, 473663, 471057, 469142, 468042, 467929, 468706, 469874, 470922, 471760, 472661, 473870, 475335, 476775, 478010, 479229, 480881, 483230, 486069, 488903, 491379, 493481, 495471, 497751, 500694]
59903E00694L738M264M176L360J992M84p32j430j534r46L14J735K531K502K298
59888E23446K554L106L485L739M213M732M751M272L927M045M222L961L299K603
59874E76355K169K136K409K597K328J722J141N78l44j685l057m136m859n094m653
59859E67607l690k634j609n85Rl71j369j919j722j572j865j769n37J267K729L958
59843E55928N549P331Q849J0573J3231J6001J6667J4016R147M095M2k684l748
59830F54997k798j16L249N896O436L992j105p181j2248j5344j6820j7460j7571
59817E83927j6897j5230j2884j0564q765p463o408n526m868m290l569k810k473
59804D82180k762l223l113k207j087o10j089k054k820l149l273l362l261k835
$$ y = [500694, 504432, 508696, 512872, 516232, 518224, 518708, 517976, 516546, 515012, 514066, 514380, 516115, 518646, 521148, 523446, 526000, 529106, 532591, 536330, 540543, 545275, 550026, 554298, 558225, 562270, 566492, 570453, 573752, 576355, 578524, 580660, 583069, 585666, 587994, 589716, 590857, 591435, 591091, 589406, 586349, 582213, 577354, 572260, 567607, 563917, 561283, 559674, 559089, 559098, 558727, 557358, 555439, 553717, 552145, 550280, 548511, 547974, 549241, 551970, 555928, 561477, 568808, 577657, 588230, 601461, 617462, 634129, 648145, 657292, 661387, 661429, 658745, 654997, 652199, 652083, 655332, 661228, 667664, 671656, 670551, 663370, 651122, 635778, 618958, 601498, 583927, 567030, 551800, 538916, 528352, 519587, 512124, 505716, 500190, 495322, 491032, 487463, 484653, 482180, 479418, 476195, 473082, 470875, 469788, 469178, 468089, 466035, 463215, 460066, 456793, 453431, 450170, 447335]
59790D47335k301k028k107k309k316j942j180k17O53J171J151M80o36j556j753
59775D32445j538j772k591l056k442j395j121j770k337k105j396q44n33k12J84
59760D09517O01J115J739K151J947J190M71M24J142K107K706K892L199L991M874
59745D40066N183M881M520M350L970L061J983J315J113J006P78M78J05m00q73
59730D71536j041r37r13j130j318j207r48q89j093j262j153q62p03q72j240j395
59714D54573j016k71J97j36j040j669j304L0J614K569K501J888J781K736M064
59699D66517M500L730K792K729L360L801L830M111N127O498P339O939N113K398
59685E28784j11j511j858j868j989k154k301k487k432j684m48L45J56n25r63j044
$$ y = [447335, 445034, 443006, 440899, 438590, 436274, 434332, 433152, 432935, 433588, 434759, 435910, 436390, 435754, 434198, 432445, 430907, 429135, 426544, 423488, 421046, 419651, 418530, 416760, 414423, 412318, 410922, 410078, 409545, 409333, 409517, 410118, 411233, 412972, 415123, 417070, 418260, 418731, 419155, 420297, 422404, 425110, 428002, 431201, 435192, 440066, 445249, 450130, 454650, 459000, 462970, 466031, 468014, 469329, 470442, 471448, 472226, 472704, 472809, 472409, 471536, 470495, 469558, 468645, 467515, 466197, 464990, 464042, 463153, 462060, 460798, 459645, 458783, 458080, 457208, 455968, 454573, 453557, 453286, 453483, 453347, 452307, 450638, 449334, 449364, 450978, 453547, 456048, 457936, 459717, 462453, 466517, 471017, 474747, 477539, 480268, 483628, 487429, 491259, 495370, 500497, 506995, 514334, 521273, 526386, 528784, 528673, 527162, 525304, 523436, 521447, 519293, 516992, 514505, 512073, 510389, 509941, 510286, 510442, 509917, 508954, 507910]
59669E07910r83p79m97o07j356k179k420k330k606l153l127k320j560j483j593
59654D80917r94L35J594K232K425K547K603K387J987J784J924J965J308n4j443
59639E01517k257k575k894l393l786l814l588l344l050k468j568p14l25l65l16
59624D67060K50J160J854K040J901J723J599J507J400J113L85q45k352l835n007
59609D69953n493m977l704k451j761j362o22N95J751K179J610L10j010j562j083
59594D52373j51L53J14l18k22M83J162J212P34L03K26K95K33M5l10j098k298l279
59576D49857l500l307l468m054m402m115l460k768k060j404r97q02o10n17q34
59561D13559j405j635j300p16p1P54J626K108K160K143K005J357N18M82J485K507
$$ y = [507910, 506927, 506148, 505651, 505044, 503688, 501509, 499089, 496759, 494153, 491000, 487873, 485553, 483993, 482510, 480917, 479923, 480258, 481852, 484084, 486509, 489056, 491659, 494046, 496033, 497817, 499741, 501706, 503014, 502960, 501517, 499260, 496685, 493791, 490398, 486612, 482798, 479210, 475866, 472816, 470348, 468780, 468066, 467741, 467376, 467060, 467310, 468470, 470324, 472364, 474265, 475988, 477587, 479094, 480494, 481607, 481992, 481147, 478795, 474960, 469953, 464460, 459483, 455779, 453328, 451567, 450205, 449583, 450178, 451929, 454108, 455718, 456028, 455018, 453456, 452373, 452222, 452575, 452689, 452371, 452149, 452632, 453794, 455006, 455740, 456043, 456269, 456564, 456797, 456842, 456532, 455434, 453136, 449857, 446357, 443050, 439582, 435528, 431126, 427011, 423551, 420783, 418723, 417319, 416322, 415520, 414910, 414393, 413559, 412154, 410519, 409219, 408503, 408432, 409186, 410812, 412920, 415080, 417223, 419228, 420585, 421103, 421585, 423070, 425577]
59545D25577K728K538K591K816L017L516M475N392O088P382J0039J3807J8198
59532E08164K2980K6807K6560K0020Q885k301j0056j3711j3981j1698q107m712
59520E48850k126L7J913L006L310L698M679N537N261L745J676l16j996l359m446
59505E69469n252n793o333p207q262q801q439p566o603n487m356l911m313m514
59491D82632l670k474j925j546l96Q64O89p34j502q01J39L15M65J540L076M095
59475D80767M617N357O612Q123R479J0164R729Q303O385M104J340j355k974l373
59461E47278l445l751l921l563k681r69K078N925Q974J0364J0812J1278J1904
59448E90283J2746J4304J6626J8929K0800K2608K3972K3057J8533J1373L680l423
$$ y = [425577, 428305, 430843, 433434, 436250, 439267, 442783, 447258, 452650, 458738, 466120, 476159, 489966, 508164, 531144, 557951, 584511, 604531, 613416, 611115, 601059, 587348, 573367, 561669, 553562, 548850, 546724, 546761, 548674, 551680, 554990, 558688, 563367, 568904, 574165, 577910, 579586, 579270, 577274, 573915, 569469, 564217, 558424, 552091, 544884, 536622, 527821, 519382, 511816, 505213, 499726, 495370, 491459, 487146, 482632, 478962, 476488, 474563, 473017, 472621, 473485, 474174, 473440, 471938, 471137, 471276, 471591, 472056, 473596, 476672, 480767, 485384, 490741, 497353, 505476, 514955, 525119, 534848, 543151, 549536, 553640, 554980, 553625, 550651, 547278, 543833, 540082, 536161, 532598, 529917, 528948, 531026, 536951, 545925, 556289, 567101, 578379, 590283, 603029, 617333, 633959, 652888, 673688, 696296, 720268, 743325, 761858, 773231, 776911, 773488]
59436G73488r787j4942j8177j9480j9417j8373j6719j5261j4605j4389j3904j3073
59424E85361j2136j0782q475n454k518KK498N272P982R921J0695J0798J1484J3796
59410F18444J7869K3529L0757L8189M1693L6656K2764N069j0369k0658k5596k5471
59398G52876k1096j4352o617K304J1735J7691J5439M569j0256k3552l2467l6440
59386F59834l5919l2219k7160k1940j6982j2905j0463r290p991n905l862k795
59374D72403k549k389j879q79M94J588J692J102R54J655K262J865Q29R9q1j03
59358D77063q7K77J040J706J830J696K190L824N936P192P090O587P027Q766J1162
59343E43299J3437J5092J5907J6135J6557J7701J9226K0327K0546J9760J7911
$$ y = [773488, 763701, 748759, 730582, 711102, 691685, 673312, 656593, 641332, 626727, 612338, 598434, 585361, 573225, 562443, 553968, 548514, 545996, 545998, 548496, 553768, 561750, 571671, 582366, 593164, 604648, 618444, 636313, 659842, 690599, 728788, 770481, 807137, 829901, 834970, 824601, 803943, 778347, 752876, 731780, 717428, 710811, 713115, 724850, 742541, 757980, 762549, 752293, 728741, 696274, 659834, 623915, 591696, 564536, 542596, 525614, 512709, 502246, 492956, 484965, 479060, 475198, 472403, 469854, 467465, 465586, 464707, 465201, 466789, 468481, 469583, 470537, 472192, 474454, 476319, 477148, 477247, 477166, 477063, 476976, 477253, 478293, 479999, 481829, 483525, 485715, 489539, 495475, 502667, 509757, 516344, 523371, 532137, 543299, 556736, 571828, 587735, 603870, 620427, 638128, 657354, 677681, 698227, 717987, 735898]
59332G35898J5255J2496J0037P495M473J364j305l727o207q258r300r798j0597
59319G37826j1464j1447j0481r455q785q078p244o706o409n744m745m216m400
59306F38652m595m395m343m783n042m360k973j660o56M34K038M274O940R624J2118
59291F41273J4791J8260K2749K7883L2620L4720L1078K0173M464j0762k1351k6514
59279G89384k7437k5222k0882j5951j1839q796o189l547q81J626L839N772P718
59266F87595R885J1838J2763J2437J1430J0262Q997P707O620N475L437M1m278
59253G84209q729j2617j5179j5865j5217j4597j4624j4547j3618j2254j1147j0030
59241F25785q241o024m354l665l481l242k852k433j999j361k03J606L524M559
$$ y = [735898, 751153, 763649, 773686, 781181, 785654, 787018, 785713, 781986, 775779, 767521, 758221, 748423, 737826, 726362, 714915, 704434, 694979, 686194, 678116, 670872, 664166, 657757, 652013, 647268, 643052, 638652, 634057, 629662, 625319, 620536, 615494, 611134, 608161, 606501, 605845, 606279, 608317, 612591, 619531, 629155, 641273, 656064, 674324, 697073, 724956, 757576, 792296, 823374, 843547, 848011, 837249, 815898, 789384, 761947, 736725, 715843, 699892, 688053, 679257, 673068, 669521, 668640, 670266, 674105, 679877, 687595, 697480, 709318, 722081, 734518, 745948, 756210, 765207, 772914, 779534, 785009, 788446, 788487, 784209, 775480, 762863, 747684, 731819, 716602, 702005, 687381, 672834, 659216, 646962, 635815, 625785, 617544, 611520, 607166, 603501, 600020, 596778, 593926, 591493, 589494, 588133, 587930, 589536, 593060, 597619]
59227E97619M320L522L038K814K206J086q4j127k453m276o069p113p318p186p112
59212E71867p049o871o711o713o683o311n688n125m493l310j662l91J7P5L31L80
59196E11663l05j146j082j63N42N78N83J093J830K467L176M076M903N516O126
59181E39857O729O993O945P030P256P014O115N292N181N454N412M917M285L787
59167F22267L689M323N584O757P279P397P692Q280Q837R119R070Q626P703O314
59153G22937M594K821J347K58q15k285m029n633o947q052q843r265r639j0074
59139F66375r871q430o487n403n284m961l940l021k761k530j702o32K01J012J995
59124F14561K746L129L842N360P031Q102Q849R901J1005J1492J1570J2191J3720
$$ y = [597619, 601939, 605461, 608499, 611313, 613519, 614605, 614521, 613394, 610941, 606665, 600596, 593483, 586165, 578979, 571867, 564818, 557947, 551236, 544523, 537840, 531529, 525841, 520716, 516223, 512913, 511251, 510860, 510877, 510952, 511283, 511663, 511358, 510212, 509130, 508967, 509509, 510087, 510670, 511763, 513593, 516060, 519236, 523312, 528215, 533731, 539857, 546586, 553579, 560524, 567554, 574810, 581824, 587939, 593231, 598412, 603866, 609278, 614195, 618480, 622267, 625956, 630279, 635863, 642620, 649899, 657296, 664988, 673268, 682105, 691224, 700294, 708920, 716623, 722937, 727531, 730352, 731699, 731957, 731142, 728857, 724828, 719195, 712248, 704196, 695353, 686088, 676449, 666375, 656504, 648074, 641587, 636184, 630900, 625939, 621999, 618978, 616217, 613687, 611985, 611353, 611554, 612566, 614561, 617307, 620436, 624278, 629638, 636669, 644771, 653620, 663521, 674526, 686018, 697588, 709779, 723499]
59111G23499J5417J6188J5553J3965J2406J1364J0260Q354O140M836M448L544
59099H45974J466m89r46m45n09j604l080m466n634o187n850n260n272n701n667
59084G96330m995m407m449n047o085p601r406j1076j2349j3159j3507j3644j4063
59071F76542j4696j4571j2936j0447q516p688p317o688n786m993m578m433m072
59058E69821k986j390k51j94q22j437j980k675l209l097k560k366k820l428l460
59043E37146k579j082J88N37K07P7M81J004J543K601L996M523L692K858L480N061
59027E63733O030N964N696N713N823O096O789P538P819Q168R637J2000J3698J3765
59013F78469J2765J1571J0224Q297N700K749M7j703k295k426k865l400l274k382
$$ y = [723499, 738916, 755104, 770657, 784622, 797028, 808392, 818652, 827006, 833146, 837982, 842430, 845974, 847440, 846951, 846005, 845560, 845051, 843447, 840367, 835901, 830267, 824080, 818230, 812970, 807698, 801997, 796330, 791335, 786928, 782479, 777432, 771347, 763746, 754340, 743264, 730915, 717756, 704249, 690605, 676542, 661846, 647275, 634339, 623892, 615376, 607688, 600371, 593683, 587897, 582904, 578326, 573893, 569821, 566835, 565445, 565194, 565000, 564178, 562741, 560761, 558086, 554877, 551780, 549220, 546854, 544034, 540606, 537146, 534567, 533485, 533673, 534210, 534417, 534494, 534975, 535979, 537522, 540123, 544119, 548642, 552334, 555192, 558672, 563733, 569763, 575727, 581423, 587136, 592959, 599055, 605844, 613382, 621201, 629369, 639006, 651006, 664704, 678469, 691234, 702805, 713029, 721326, 727026, 729775, 729822, 728119, 725824, 723398, 720533, 717133, 713859, 711477]
58999G11477j217J76K091M127N436O018O643P271O782M717K163L19r10k194l486
58984G49413m312m845n772p316q965j0168j0818j1084j1062j0630r547p788n711
58971F41395l767k011k38J501K835L577M051M841O331Q361J0208J1046J0749J0047
58957G08926R615R291Q504P166N618L922J809q15l747o774r605j1682j2559j2424
58943F97245j1825j0966r716q177o729n621m852m387m019l335k208j260j207j886
58929F21057k391k146j446r97j291k260l352m036m407m972n715n983n540m981
58915E71540m733m375l603k960k819k419r65R40K112K508K996L811M498N148O385
58900E78064Q228J0068J1693J3258J4328J4154J2920J1606J0587R482Q410Q114
$$ y = [711477, 710260, 710436, 712527, 716654, 722090, 728108, 734751, 742022, 748804, 753521, 755684, 756003, 755093, 752899, 749413, 745101, 740256, 734484, 727168, 718203, 708035, 697217, 686133, 675071, 664441, 654894, 647106, 641395, 637628, 635617, 635379, 636880, 639715, 643292, 647343, 652184, 658515, 666876, 677084, 688130, 698879, 708926, 718541, 727832, 736336, 743502, 749120, 753042, 754851, 754036, 750289, 743515, 733910, 722228, 709669, 697245, 685420, 674454, 664738, 656561, 649832, 644211, 639359, 634972, 630953, 627618, 625410, 624150, 622943, 621057, 618666, 616520, 615074, 614077, 612786, 610526, 607174, 603138, 598731, 593759, 588044, 582061, 576521, 571540, 566807, 562432, 558829, 555869, 553050, 550631, 549666, 550606, 552718, 555226, 558222, 562033, 566531, 571679, 578064, 586292, 596360, 608053, 621311, 635639, 649793, 662713, 674319, 684906, 694388, 702798, 710912]
58888G10912Q683R365J0049J1690J4794J8369K1008K2251K2411K1741K0260J7975
58876I09508J4884J1127P154L401j33l577o732r473j2117j4637j6054j5630j4274
58863H53447j3502j3295j2388j0540q979q516q727r238j0367j2008j3268j3730
58851G18889j3927j4129j3914j3320j3055j3028j2096j0010q195p709p620o592
58839E85294m954m027m194m761n091m831l616j649j40j69j316k195k142j695j613
58824E42901k040k559k674k380k295k898l657l571k604j737j423j002l3R00J292
58809E16220J631K458L355L735L852M163M295L593K199P69n01j759k842l422l525
58794E34221l314k736j911j407j523j686j243m31J6n5r3M94K003M348O835Q400
$$ y = [710912, 719595, 728960, 739009, 750699, 765493, 783862, 804870, 827121, 849532, 871273, 891533, 909508, 924392, 935519, 942673, 946074, 945941, 942364, 935632, 926159, 914042, 899405, 883351, 867721, 853447, 839945, 826650, 814262, 803722, 794743, 786227, 777500, 768262, 757895, 745887, 732619, 718889, 704962, 690833, 676919, 663599, 650544, 637516, 625420, 615410, 607215, 599506, 591886, 585294, 580340, 576313, 572119, 567358, 562267, 557436, 553820, 552171, 552031, 551862, 550546, 548351, 546209, 544514, 542901, 540861, 538302, 535628, 533248, 530953, 528055, 524398, 520827, 518223, 516486, 515063, 514061, 514028, 514928, 516220, 517851, 520309, 523664, 527399, 531251, 535414, 539709, 543302, 545501, 546270, 545769, 544010, 541168, 537746, 534221, 530907, 528171, 526260, 524853, 523330, 521644, 520401, 519970, 519986, 519931, 519838, 520332, 522335, 526683, 533518, 541918]
58778E41918Q624Q224Q210Q918J0061J1058J0946Q810M936R53j849l759n607p254
58764F04189p961p760p367p040o431n489m693m353m223l868l006j614p4R58J227
58749E42495J221J569K333L156L728L856L475K923K826L350M046M688N658P092
58735E92416Q296Q685Q725R217J0054J0453J0189R824R870J0256J0642J0741J0357
58722G19725R465Q298P196O382N917N677N407N083N170O105P569Q747R294R434
58708H19469R240Q575P667O847N660L226l37l891o866r771j2824j5400j7346j9523
58694G74726k2247k4320k4586k3408k1756j9827j7586j5679j4577j3576j1809
58683E65355r639q015p055o346o006o215o284n397l954l055k911k820k338j441
$$ y = [541918, 550542, 558766, 566976, 575894, 585955, 597013, 607959, 616769, 621705, 622658, 620809, 617050, 611443, 604189, 596228, 588468, 581101, 574061, 567630, 562141, 557448, 553095, 548872, 545004, 541998, 540384, 540310, 541268, 542495, 543716, 545285, 547618, 550774, 554502, 558358, 561833, 564756, 567582, 570932, 574978, 579666, 585324, 592416, 600712, 609397, 618122, 627339, 637393, 647846, 658035, 667859, 677729, 687985, 698627, 709368, 719725, 729190, 737488, 744684, 751066, 756983, 762660, 768067, 773150, 778320, 784425, 791994, 800741, 810035, 819469, 828709, 837284, 844951, 851798, 857458, 860684, 860347, 856456, 849590, 839819, 826995, 811595, 794249, 774726, 752479, 728159, 703573, 680165, 658409, 638582, 620996, 605317, 590740, 577164, 565355, 555716, 547701, 540646, 534300, 528294, 522079, 515795, 510398, 506444, 503389, 500478, 497658, 495320, 493879]
58669D93879O7K172L967M600M699N740Q106J0808J2973J4433J4865J3645J0800
58656F00754P208L504k81l852o309p177p079o903o759o156m932l562k655k373
58642E53428k452k741l434m544n359n114m114l422l288k739j145P07J704J789
58628E19276J632J549J488J526J639J416O81k1j68NP5K20Q14J798K976M390N840
58611E45136O714O929P282Q168Q695P863N881L538J146j011k108j860j421j967
58597E92985k985l197k581k134k142k072j930k218k691k458j412l60L36J232K764
58582E71137M653O436P920R025R815J0546J1184J1148J0110Q630P431O541N814
58569F80390N624O155O717O813P274R211J2317J5404J8118K0902K3574K5241K5516
$$ y = [493879, 493946, 496118, 500085, 504685, 509384, 515124, 523230, 534038, 547011, 561444, 576309, 589954, 600754, 607962, 611466, 611185, 607333, 601024, 593847, 586768, 579865, 573106, 566950, 562018, 558456, 555801, 553428, 550976, 548235, 544801, 540257, 534898, 529784, 525670, 522248, 518960, 516221, 515076, 515783, 517487, 519276, 520908, 522457, 523945, 525471, 527110, 528526, 529207, 529186, 529018, 529023, 529098, 529318, 530132, 531930, 534906, 539296, 545136, 551850, 558779, 566061, 574229, 582924, 590787, 596668, 600206, 601352, 600341, 598233, 596373, 594952, 592985, 590000, 586803, 584222, 582088, 579946, 577874, 575944, 573726, 571035, 568577, 567165, 566805, 567141, 568373, 571137, 575790, 582226, 590146, 599171, 608986, 619532, 630716, 641864, 651974, 660604, 668035, 674576, 680390, 686014, 692169, 698886, 705699, 712973, 722184, 734501, 749905, 768023, 788925, 812499, 837740, 863256]
58556H63256K4823K3625K2293K1284K0472J8667J4876R695M521j02m311p808j0232
58543A001059j2113j4091j5637j5890j5347j5280j5865j6376j6813j7734j8786
58532H27127j9073j8794j8855j8917j7620j4843j2062j0254q953p617o354n045
58520F68740l270j426n51o52n72J88Q25P71N34N93O69N35M60N76P61J292K458
58503F71931L474L127J630N36N41P86N76L45M61M95J97M7J82k0q21j587j788j596
58485F78516j149k86P11J220J428K259L873N365O356P580R435J1168J2104J2638
58471G51218J3286J3659J3014J1121Q180M528P49k584n490q233j0346j0856r608
58458G68638p559n654m164l088k301j358j9J157J600J848K838M364N395N576N235
$$ y = [863256, 888079, 911704, 933997, 955281, 975753, 994420, 1009296, 1018991, 1023512, 1023410, 1019099, 1011291, 1001059, 988946, 974855, 959218, 943328, 927981, 912701, 896836, 880460, 863647, 845913, 827127, 808054, 789260, 770405, 751488, 733868, 719025, 706963, 696709, 687756, 680139, 673785, 668740, 665470, 664044, 663493, 662841, 662269, 662457, 663282, 664053, 664587, 665180, 665849, 666384, 666844, 667420, 668181, 669473, 671931, 675405, 678532, 680162, 680698, 681239, 682025, 682601, 682946, 683407, 683902, 684099, 684146, 684328, 684308, 683487, 681900, 680112, 678516, 677367, 677081, 677792, 679012, 680440, 682699, 686572, 691937, 698293, 705873, 715308, 726476, 738580, 751218, 764504, 778163, 791177, 802298, 810478, 815006, 815755, 813171, 807681, 799448, 789102, 778246, 768638, 761079, 755425, 751261, 748173, 745872, 744514, 744495, 745652, 747252, 749100, 751938, 756302, 761697, 767273, 772508]
58443G72508M228K193l04k289l779n225o021n267l676k748k291q35J531L004L030
58428G54059L110M115M986M926M894N862P291Q308Q994R645J0116J0485J1120
58415H47911J1540J0658Q492O151L841O84l009n336n463m881n061n576n529n181
58401H49241n037m747m008l372l169k785j829q52k36N10J656K636L088L391L690
58386H38177L597L182L040L097K716K140K321L213L860M241N126O086N754M357
58372H90907L705M260M527L924L813M969O350P284Q527J0218J1101J0843J0848
58359I81276J1687J2054J1368J0982J1659J2163J1668J1224J1406J0927R055P214
58347A112683O559O169N190M593N153N834N799O033P322Q749R692J1128J3409
$$ y = [772508, 776736, 778929, 778625, 776336, 772557, 767332, 761311, 756044, 752368, 749620, 747329, 746494, 748025, 751029, 754059, 757169, 761284, 766270, 771196, 776090, 781952, 789243, 797551, 806545, 816190, 826306, 836791, 847911, 859451, 870109, 878601, 884752, 888593, 889277, 886268, 880932, 875469, 870588, 865527, 859951, 854422, 849241, 844204, 839457, 835449, 832077, 828908, 826123, 824294, 823442, 823206, 823716, 825372, 828008, 831096, 834487, 838177, 841774, 844956, 847996, 851093, 853809, 855949, 858270, 861483, 865343, 869584, 874710, 880796, 886550, 890907, 894612, 898872, 903399, 907323, 911136, 916105, 922455, 929739, 938266, 948484, 959585, 970428, 981276, 992963, 1005017, 1016385, 1027367, 1039026, 1051189, 1062857, 1074081, 1085487, 1096414, 1105469, 1112683, 1119242, 1125411, 1130601, 1135194, 1140347, 1146181, 1151980, 1158013, 1165335, 1174084, 1183776, 1194904, 1208313]
58334A208313J4936J4798J4507J5337J6150J5668J4711J4411J4323J4154J4980
58323A372288J6881J7680J6063J3780J2760J2395J1611J1193J1789J2098J1267
58312A519805J0785J1746J2656J2267J2057J3319J4517J4204J4027J5788J8014
58301A669185J8619J8696K0321K2644K3506K3151K3103K3147K2497K2283K3668
58290A910820K5215K5156K4554K5278K6623K7036K7362K9147L1517L2814L3653
58279B219175L5313L6946L7394L7818L9526M1275M1827M2761M5542M8294M9023
58268B674894M9443N1847N4835N6240N7637O1475O6319O9583P2488P7353Q2368
58257C374482Q4426Q5067Q8085R2861R5691R6346R7706R9963J00836J00732J02371
$$ y = [1208313, 1223249, 1238047, 1252554, 1267891, 1284041, 1299709, 1314420, 1328831, 1343154, 1357308, 1372288, 1389169, 1406849, 1422912, 1436692, 1449452, 1461847, 1473458, 1484651, 1496440, 1508538, 1519805, 1530590, 1542336, 1554992, 1567259, 1579316, 1592635, 1607152, 1621356, 1635383, 1651171, 1669185, 1687804, 1706500, 1726821, 1749465, 1772971, 1796122, 1819225, 1842372, 1864869, 1887152, 1910820, 1936035, 1961191, 1985745, 2011023, 2037646, 2064682, 2092044, 2121191, 2152708, 2185522, 2219175, 2254488, 2291434, 2328828, 2366646, 2406172, 2447447, 2489274, 2532035, 2577577, 2625871, 2674894, 2724337, 2776184, 2831019, 2887259, 2944896, 3006371, 3072690, 3142273, 3214761, 3292114, 3374482, 3458908, 3543975, 3632060, 3724921, 3820612, 3916958, 4014664, 4114627, 4215463, 4316195, 4418566]
58246D418566J05871J09306J13261J19848J28033J35032J41382J49601J59099
58237E579999J67518J75767J86300J97826K07510K17025K30447K47359K64151
58228G473902K80847L00370L22336L44082L66745L93600M23694M53964M86187
58219A0845727N24644N68440O13854O62788P20629P87187Q58586R36743J027825
58210A7546423J132744J249162J381702J539460J724677J935694K180505K474977
58202C1165344K828966L248899L754548M377958N146074O083038P231447Q650147
58194G2486421J0387804J2484948J5011933J8077609K1780595K6151503L1077217
58187B07458030L6097887M0107239M1317249L7872557K8947730J5533846J99063
$$ y = [4418566, 4524437, 4633743, 4747004, 4866852, 4994885, 5129917, 5271299, 5420900, 5579999, 5747517, 5923284, 6109584, 6307410, 6514920, 6731945, 6962392, 7209751, 7473902, 7754749, 8055119, 8377455, 8721537, 9088282, 9481882, 9905576, 10359540, 10845727, 11370371, 11938811, 12552665, 13215453, 13936082, 14723269, 15581855, 16518598, 17546423, 18679167, 19928329, 21310031, 22849491, 24574168, 26509862, 28690367, 31165344, 33994310, 37243209, 40997757, 45375715, 50521789, 56604827, 63836274, 72486421, 82874225, 95359173, 110371106, 128448715, 150229310, 176380813, 207458030, 243555917, 283663156, 324980405, 362852962, 391800692, 407334538, 407533601]
58180D07533601j4061874k5034366l1795576l4505590l3947661l1147613k7069063
58173B09971858k2381732j7481163j2800918r055827p012676o925848q246610
58166A26067084r956701j1195260j1604978j1240493j0326295r117244p844111
58159E4782002o661112n624008m735178l994684l397909k916918k516893k181380
58151B2753920j904088j669940j463194j283821j138160j020742r19754q32988
58143A2521233p64264p09949o61738o17746n79471n42545n01263m58173m19389
58134G266695l84276l48635l13760k83469k56338k29777k08103j97481j95686
58125D849170j95025j92636j90073j85697j76042j62904j51402j42198j32312
$$ y = [407533601, 393471727, 368437361, 336641785, 302136195, 268188534, 237040921, 209971858, 187590126, 170108963, 157308045, 148252218, 141239542, 134313694, 126067084, 116110383, 104915123, 93310145, 82069652, 71743357, 62626113, 54782002, 48120890, 42496882, 37761704, 33767020, 30369111, 27452193, 24935300, 22753920, 20849832, 19179892, 17716698, 16432877, 15294717, 14273975, 13354221, 12521233, 11756969, 11047020, 10385282, 9767536, 9188065, 8645520, 8144257, 7686084, 7266695, 6882419, 6533784, 6220024, 5936555, 5680217, 5450440, 5242337, 5044856, 4849170, 4654145, 4461509, 4271436, 4085739, 3909697, 3746793, 3595391, 3453193, 3320881]
58116C320881j21983j13963j07518r9678r1210q5266q1384p6623p1401o8414o7003
58105B336438o4260o0554n8495n7529n5003n1548n0029n0009m8573m5828m4377
58094A750233m3941m1796l8117l5876l5519l4541l2267l0457k9240k6853k3557
58083A378069k1610k1271k0713j9858k0386k1979k2461k1709k1782k3072k3839
58072A139389k3598k3465k3316k1956k0066j9481j9739j8756j6766j5998j6544
58061I19704j6119j4112j2391j1852j1492j1153j1847j3089j3101j2013j1782
58050G80753j2597j2593j1446j0996j1758j1897j0468q733p563o305m971m859
58038F66567o082o923o506n815n524n081m602n296p266q954r465r580r948j0138
$$ y = [3320881, 3198898, 3084935, 2977417, 2877739, 2786529, 2701263, 2619879, 2543256, 2471855, 2403441, 2336438, 2272178, 2211624, 2153129, 2095600, 2040597, 1989049, 1939020, 1889011, 1840438, 1794610, 1750233, 1706292, 1664496, 1626379, 1590503, 1554984, 1520443, 1488176, 1457719, 1428479, 1401626, 1378069, 1356459, 1335188, 1314475, 1294617, 1274231, 1252252, 1229791, 1208082, 1186300, 1163228, 1139389, 1115791, 1092326, 1069010, 1047054, 1026988, 1007507, 987768, 969012, 952246, 936248, 919704, 903585, 889473, 877082, 865230, 853738, 842585, 830738, 817649, 804548, 792535, 780753, 768156, 755563, 744117, 733121, 721363, 709466, 698998, 690265, 682702, 676397, 671426, 666567, 660485, 653562, 647056, 641241, 635717, 630636, 626034, 620738, 613472, 604518, 595053, 585473, 575525, 565387]
58024E65387r936r731r412q596p950q324q783p669n559m743n646o285n585m715
58010D62453m655m752m332l684k877j621o32j090k478l019k487k339k871k641
57996D22975j182J36N68R78J721J908J514J933L505M673M549M184M398M388L575
57981D59823K817K665K256J074L0k86p30j873k819k870k785l238l535l056k514
57966D44959k647k937k766k596k859k898k160j410j637k607l464l978m340m524
57952D04136m590m924n523n767n334m630l958l122k091j230o24p2L28M24P22J699
57936C65444K690K867K982M451O902Q494Q688Q586Q537P677O243N835O656O888
57922D52940N756M887N284N366L606J118k89r55k383m624o603q055r387j0363
$$ y = [565387, 555451, 545720, 536308, 527712, 519762, 511438, 502655, 494986, 489427, 484684, 479038, 472753, 467168, 462453, 457798, 453046, 448714, 445030, 442153, 440532, 439900, 438810, 436332, 433313, 430826, 428487, 425616, 422975, 421793, 421929, 422497, 423475, 425196, 427104, 428618, 430551, 434056, 438729, 443278, 447462, 451860, 456248, 459823, 462640, 465305, 467561, 468635, 468665, 468379, 467649, 465776, 462957, 460087, 457302, 454064, 450529, 447473, 444959, 442312, 439375, 436609, 434013, 431154, 428256, 426096, 424686, 423049, 420442, 416978, 413000, 408660, 404136, 399546, 394622, 389099, 383332, 377998, 373368, 369410, 366288, 364197, 362967, 362343, 362271, 362599, 363023, 363745, 365444, 368134, 371001, 373983, 378434, 385336, 393830, 402518, 411104, 419641, 427318, 433561, 439396, 446052, 452940, 458696, 463583, 468867, 474233, 477839, 478957, 478668, 477713, 475330, 470706, 464103, 456048, 446661, 436298]
57908D36298j0456r998r680r480r103q806q905r132r278r593r816q945o855n005
57894C11246m506m629m275l749l803m032l639k926k642k544j976j152o46k19O05
57879B71113J462J814K132L082M121M151L243K451K218K091J774J440J086M92
57865C02670l89j558l093m565m931l814k316j741j965j887r64N38K256L811M688
57850B86740M906N368O626P847P976P358P213P816Q336Q208P603O611N057L212
57836C80877J857J333J076K51j463l664n556o574o867o956o941o544n891n553
57822C29385n568n298m463l478k416p39J411K813K821K403K660L279L418L154
57808C29382K956K559J560M99Pm60j834l803n226n788o052o141n658m801m329
$$ y = [436298, 425842, 415844, 406164, 396684, 387581, 378775, 369870, 360738, 351460, 341867, 332051, 323106, 316251, 311246, 306740, 302111, 297836, 294087, 290284, 286252, 282613, 279687, 277045, 274501, 272525, 271373, 270727, 270508, 271113, 272575, 274389, 276521, 279603, 283724, 287875, 291118, 293569, 295787, 297878, 299652, 301092, 302178, 302670, 302281, 300723, 297630, 293065, 288134, 284320, 282004, 280263, 278298, 276411, 275447, 275985, 278241, 282052, 286740, 291646, 297014, 303640, 311487, 319463, 326821, 334034, 341850, 350186, 358394, 365997, 372608, 377665, 380877, 382734, 384067, 385143, 385394, 383931, 380267, 374711, 368137, 361270, 354314, 347373, 340829, 334938, 329385, 323817, 318519, 314056, 310578, 308162, 307423, 308834, 311647, 314468, 316871, 319531, 322810, 326228, 329382, 332338, 334897, 336457, 336956, 336963, 336503, 334669, 330866, 325640, 319852, 313800, 307659, 302001, 297200, 292871]
57793B92871m387m392m105l873l804l646l485l722m197m152l221j888r11p39j366
57778B44983k180k163r11O72J328R97P99J574L032M344N000N083N032N226N541
57763B78357N494M950M301L739K921J676M26n80j790l496n075n777n731n487n172
57748B68756m687m274m016l393k141r75o15o18j77M38L31n09j157j091n92r0J51
57731B45341j28p94j088n38K32M49M35R75J845K123J693J279J186J088R74J168
57715B56240J462J293P60M43L13j68q64j000m75j01l46q27j154j364j371q92j44
57698B51805K69L48P44J645K475K877L172L583L755L340K402J029p48k526l644
57683B70526l901l693l311k687j759m97J363L945O673Q805J0463J2490J5491J9801
$$ y = [292871, 288484, 284092, 279987, 276114, 272310, 268664, 265179, 261457, 257260, 253108, 249887, 247999, 247088, 246349, 244983, 242803, 240640, 239729, 240401, 241729, 242726, 243525, 245099, 248131, 252475, 257475, 262558, 267590, 272816, 278357, 283851, 288801, 293102, 296841, 299762, 301438, 301864, 301284, 299494, 295998, 290923, 285146, 279415, 273928, 268756, 264069, 259795, 255779, 252386, 250245, 249270, 248655, 248037, 247860, 248298, 248629, 248120, 246963, 245872, 245280, 245190, 245341, 245213, 244419, 243331, 242793, 243025, 243474, 243909, 244884, 246729, 248852, 250545, 251824, 253010, 254098, 255072, 256240, 257702, 258995, 259755, 260198, 260511, 260343, 259479, 258479, 258004, 257903, 257557, 256730, 255576, 254212, 252841, 251949, 251805, 252074, 252422, 253166, 254811, 257286, 260163, 263335, 266918, 270673, 274013, 276415, 277444, 276696, 274170, 270526, 266625, 262932, 259621, 256934, 255175, 254678, 256041, 259986, 266659, 275464, 285927, 298417, 313908, 333709]
57669C33709K6065L4785M5482N7303P0024Q2794R1662R0206P4037M4442P749k8019
57657I30239n6044p2599p7979p5535o8987o0551n1240m1879l3237k5871k0328
57646C45989j6856j4759j2735j0275p998o369n005l604k624k399k358j818r05
57633B58284q2O72J533K184K119J358L54m77r06r32r40j345j878j830j180q02
57617B56132j203j793j873j628j612j818j823j397n91L75R81P63Q8p5N79J285
57601B46390J444J340J260Q75J34j38M86J060N50n32r49o55p75j796k932l338
57585B42424l071k683k537k638k694k344j626j097j063j148r53q04j099j424j150
57570B16093o12p65j712k522k591k326k270k267j885j092j21Q47J595J834J649
$$ y = [333709, 359774, 394559, 440041, 497344, 567368, 650162, 741824, 832030, 906067, 950509, 958258, 930239, 874195, 801596, 723617, 648082, 579095, 518544, 467304, 425425, 392188, 366317, 345989, 329133, 314374, 301639, 291364, 283366, 276997, 271992, 268388, 265764, 263365, 261007, 259189, 258284, 258202, 258874, 260407, 262591, 264710, 266068, 266422, 265945, 265039, 264107, 263167, 261822, 259944, 258114, 256934, 256132, 254929, 253136, 251263, 249635, 248023, 246205, 244382, 242985, 242394, 242769, 243750, 244513, 244601, 244526, 245105, 246390, 247834, 249174, 250434, 251309, 251443, 251305, 251791, 252851, 253401, 252869, 251920, 251265, 250490, 248694, 245762, 242424, 239353, 236670, 234133, 231495, 228801, 226457, 224831, 223734, 222671, 221523, 220570, 219766, 218667, 217243, 216093, 215481, 214716, 213004, 210482, 207891, 205565, 203295, 201028, 199143, 198051, 197930, 198777, 200372, 202206, 203855]
57555B03855J581J961K323J898N74q85j551j132o5R32J345J038K36n27o79m1R52
57538B11815J648J803J691J712K051K604K994K774J945J121Q12P46M00l1J51J025
57522B35261J914K419K765K989K758K268K343L115L520K871K048K230L038L126
57508B72665K153J150R60J321J572J445J000L55k91p12q46o92k08M27P21M58J17
57491B81595K57P46J075J122R89M46o51j569j198M80K141K600J963J135O83N30
57475B92344L55Mm06o00m17K1M22N56L45k8k4Q02K073K728K263J411J189J726
57457C04764K528L293L913M055L677L474L936M270L364J670Q93J702K896L205
57443C47640K848K755L127L546L827M061M121L746K992K179J598J433J739K269
$$ y = [203855, 205436, 207397, 209720, 211618, 212192, 211307, 209756, 208624, 208559, 209491, 210836, 211874, 212110, 211583, 210904, 210863, 211815, 213463, 215266, 216957, 218669, 220720, 223324, 226318, 229092, 231037, 232158, 232970, 233716, 234116, 234085, 234236, 235261, 237175, 239594, 242359, 245348, 248106, 250374, 252717, 255832, 259352, 262223, 264271, 266501, 269539, 272665, 274818, 275968, 276928, 278249, 279821, 281266, 282266, 282621, 282330, 281618, 280772, 280080, 279872, 280299, 281020, 281478, 281595, 281852, 282598, 283673, 284795, 285784, 286230, 285579, 284010, 282812, 283292, 285433, 288033, 289996, 291131, 291814, 292344, 292699, 292703, 292297, 291697, 291280, 291301, 291723, 292279, 292624, 292596, 292572, 293374, 295447, 298175, 300438, 301849, 303038, 304764, 307292, 310585, 314498, 318553, 322230, 325704, 329640, 333910, 337274, 338944, 339837, 341539, 344435, 347640, 350488, 353243, 356370, 359916, 363743, 367804, 371925, 375671, 378663, 380842, 382440, 383873, 385612, 387881]
57429C87881K669K982L529M197M352L738K906K423K216K074K235K948L829M275
57415D32254M244M119M073M067M221M647N010M890M424M160M347M803N336N712
57401D96307N385M020K357J798K713L829L813K974K749L786N280O220O487O486
57387E54204O338N992N774O146O955P463P270O733O322N955N318M538M106M214
57373F37328M543M728M704M582M370M064L850M003M508M888M647L955L581L951
57359F97702M537M608M405M844O075P126P314P227P722Q555Q836Q426Q089Q329
57345G93795Q861R202R152Q707Q052P646P767Q036P925P679P981Q753R106Q682
57331I11344Q261Q697R849J0919J1286J0730R369P875P243P853Q992R668R576
$$ y = [387881, 390550, 393532, 397061, 401258, 405610, 409348, 412254, 414677, 416893, 418967, 421202, 424150, 427979, 432254, 436498, 440617, 444690, 448757, 452978, 457625, 462635, 467525, 471949, 476109, 480456, 485259, 490595, 496307, 501692, 505712, 508069, 509867, 512580, 516409, 520222, 523196, 525945, 529731, 535011, 541231, 547718, 554204, 560542, 566534, 572308, 578454, 585409, 592872, 600142, 606875, 613197, 619152, 624470, 629008, 633114, 637328, 641871, 646599, 651303, 655885, 660255, 664319, 668169, 672172, 676680, 681568, 686215, 690170, 693751, 697702, 702239, 706847, 711252, 716096, 722171, 729297, 736611, 743838, 751560, 760115, 768951, 777377, 785466, 793795, 802656, 811858, 821010, 829717, 837769, 845415, 853182, 861218, 869143, 876822, 884803, 893556, 902662, 911344, 919605, 928302, 938151, 949070, 960356, 971086, 980455, 988330, 995573, 1003426, 1012418, 1022086, 1031662]
57318A031662R120Q820Q985R589J0118R982R337R100R774J0686J0846J0244R733
57305A157996R906J0632J1472J2064J2147J1730J1261J1233J1599J1866J1748
57294A283654J1434J1235J1234J1337J1421J1442J1486J1690J2099J2647J3324
57283A413003J4134J4838J5016J4544J3846J3553J4022J5164J6430J7018J6520
57272A578088J5528J5122J5565J5985J5568J4567J3802J3619J3810J4104J4264
57261A740022J4012J3372J2854J2837J3058J3168J3347J3837J4219J3872J3036
57250A887634J2680J3325J4573J5734J6392J6425J5938J5308J4825J4410J3982
57239B051226J3882J4389J5040J5091J4594J4318J4621J5089J5367J5671J6243
$$ y = [1031662, 1040782, 1049602, 1058587, 1068176, 1078294, 1088276, 1097613, 1106713, 1116487, 1127173, 1138019, 1148263, 1157996, 1167902, 1178534, 1190006, 1202070, 1214217, 1225947, 1237208, 1248441, 1260040, 1271906, 1283654, 1295088, 1306323, 1317557, 1328894, 1340315, 1351757, 1363243, 1374933, 1387032, 1399679, 1413003, 1427137, 1441975, 1456991, 1471535, 1485381, 1498934, 1512956, 1528120, 1544550, 1561568, 1578088, 1593616, 1608738, 1624303, 1640288, 1655856, 1670423, 1684225, 1697844, 1711654, 1725758, 1740022, 1754034, 1767406, 1780260, 1793097, 1806155, 1819323, 1832670, 1846507, 1860726, 1874598, 1887634, 1900314, 1913639, 1928212, 1943946, 1960338, 1976763, 1992701, 2008009, 2022834, 2037244, 2051226, 2065108, 2079497, 2094537, 2109628, 2124222, 2138540, 2153161, 2168250, 2183617, 2199288, 2215531]
57228B215531J6855J7154J7030J6524J5775J5161J5067J5409J5749J5866J5761
57217B391882J5241J4247J3444J3687J4665J5049J4317J3567J3921J4944J5399
57206B550363J5095J5065J6146J8094K0095K1684K2989K4370K5779K6559K6131
57195B782370K4860K3740K3121K2355K1014J9718J9261J9495J9698J9522J8984
57184C014138J7941J6401J5068J4667J4931J4937J4404J3902J3802J3762J3343
57173C177296J2506J1344R962Q732Q152Q155Q035P271O074M997M373M193M148
57160C275238L686K488R79j7k19r5r3j97m26j014j825k242k135k413l889n960
57144C261866p180p063o534o544o932o973o461n723m820l418j455N36K063L238
$$ y = [2215531, 2232386, 2249540, 2266570, 2283094, 2298869, 2314030, 2329097, 2344506, 2360255, 2376121, 2391882, 2407123, 2421370, 2434814, 2448501, 2463166, 2478215, 2492532, 2506099, 2520020, 2534964, 2550363, 2565458, 2580523, 2596669, 2614763, 2634858, 2656542, 2679531, 2703901, 2729680, 2756239, 2782370, 2807230, 2830970, 2854091, 2876446, 2897460, 2917178, 2936439, 2955934, 2975632, 2995154, 3014138, 3032079, 3048480, 3063548, 3078215, 3093146, 3108083, 3122487, 3136389, 3150191, 3163953, 3177296, 3189802, 3201146, 3211108, 3219840, 3227992, 3236147, 3244182, 3251453, 3257527, 3262524, 3266897, 3271090, 3275238, 3278924, 3281412, 3282391, 3282374, 3282155, 3282060, 3281967, 3281770, 3281344, 3280330, 3278505, 3276263, 3274128, 3271715, 3267826, 3261866, 3254686, 3247623, 3241089, 3234545, 3227613, 3220640, 3214179, 3208456, 3203636, 3200218, 3198763, 3199299, 3201362, 3204600]
57130C204600M360N188N205M552M082M293M745M951N376O899R578J2640J5703
57117C292172J9346K4343L0809L8350M6577N5231O4147P3347Q3037R3393J04640
57106C925392J17433J32813J51662J74481K01860K34941K75254L24361L83865
57097E922062M55602N41676O44348P65701R06903J067442J244789J434463J630197
57088A4613183J824507K009614K177424K318271K420576K472592K462578K374486
57080C2673231K184903J871399J431040Q92631L08728k66294p93317j250757j628327
57071C5423237j921886k131439k260045k313360k300229k232580k123485j985124
57063A8155089j828450j663386j498121j338398j188089j050031r25795q15353
$$ y = [3204600, 3208960, 3214148, 3219353, 3223905, 3227987, 3232280, 3237025, 3241976, 3247352, 3254251, 3263829, 3276469, 3292172, 3311518, 3335861, 3366670, 3405020, 3451597, 3506828, 3570975, 3644322, 3727359, 3820752, 3925392, 4042825, 4175638, 4327300, 4501781, 4703641, 4938582, 5213836, 5538197, 5922062, 6377664, 6919340, 7563688, 8329389, 9236292, 10303734, 11548523, 12982986, 14613183, 16437690, 18447304, 20624728, 22942999, 25363575, 27836167, 30298745, 32673231, 34858134, 36729533, 38160573, 39053204, 39361932, 39095638, 38302321, 37051564, 35423237, 33501351, 31369912, 29109867, 26796507, 24496278, 22263698, 20140213, 18155089, 16326639, 14663253, 13165132, 11826734, 10638645, 9588614, 8662819, 7847466]
57055G847466p17879o32692n59013m95343m39874l91360l49072l12285k80364
57046C669584k52944k29408k08516j89275j71928j57375j45684j35767j26398
57037B052289j17016j07640r8578r0207q2602p5484o8696o2394n6440n0126m3107
57026A199999l5990k9364k2682j4950n984L967J5516L0113M9375P5159J08439
57015A373598J44598J69693J65596J23099N0757k9950r8004j42358j62233j62657
57005A432139j50574j32438j12785r4133p7866o4708n4481m6234l9087l2681k6951
56994F00201k1908j7778j4901j3318j2683j2494j2182j1137r086o380l656j362
56982D63316J06J39j592m517p643j0516j3141j5134j5738j4918j3757j3299j3415
$$ y = [7847466, 7129587, 6496895, 5937882, 5442539, 5002665, 4611305, 4262233, 3949948, 3669584, 3416640, 3187232, 2978716, 2789441, 2617513, 2460138, 2314454, 2178687, 2052289, 1935273, 1827633, 1729055, 1638848, 1556246, 1480762, 1412066, 1349672, 1293232, 1243106, 1199999, 1164009, 1134645, 1111963, 1097013, 1091029, 1094996, 1110512, 1140625, 1190000, 1265159, 1373598, 1518196, 1687889, 1853485, 1976584, 2027341, 1997391, 1899387, 1757029, 1594796, 1432139, 1281565, 1149127, 1036342, 942209, 864343, 799635, 745154, 698920, 659833, 627152, 600201, 578293, 560515, 545614, 532296, 519613, 507119, 494937, 483800, 474714, 468334, 464678, 463316, 463422, 463561, 461969, 457452, 449809, 439293, 426152, 411018, 395280, 380362, 366605, 353306, 339891]
56969C39891j3110j1712r477p181n388l948k188L78L530O668R450J1888J4007
56956C32808J5637J6375J5441J1916N781j440p649j1815j4251j5473j5537j4517
56944C17276j2848j0875q640o293m218k490p09J449L934O638R575J2669J5889
56931C21357J9484K3228K5467K4001J8304J0078J225p552j5642k1440k3707k3265
56919C51538k1941k0333j7881j4740j2044j0273q730o975n578m997m751m327l997
56906B14971m120m305l978l268k642k139j559j093j048j171q96r7R52K225L879
56891A95711N641O918P737Q934J1096J3846J6406J8266J8803J6891J1904N033
56879C37186j311n635q199r636r772q432o482m932l486j151J913M424O028Q024
$$ y = [339891, 326781, 315069, 305592, 298411, 293023, 289075, 286887, 287265, 290795, 297463, 306913, 318801, 332808, 348445, 364820, 380261, 392177, 397958, 396518, 388869, 377054, 362803, 347330, 331793, 317276, 304428, 293553, 284913, 278620, 274402, 271912, 271203, 272652, 276586, 283224, 292799, 305468, 321357, 340841, 364069, 389536, 413537, 431841, 441919, 443144, 435592, 419950, 398510, 374803, 351538, 329597, 309264, 291383, 276643, 264599, 254326, 245596, 238621, 233043, 228046, 223295, 218968, 214971, 210851, 206546, 202568, 199300, 196658, 194519, 192960, 191867, 190819, 189648, 188752, 188655, 189607, 191832, 195711, 201352, 208270, 216007, 224941, 236037, 249883, 266289, 284555, 303358, 320249, 332153, 337186, 335875, 330240, 322041, 312405, 302633, 294201, 287719, 282787, 279301, 278150, 280063, 284487, 290515, 298539]
56865B98539J1485J5770J9760K3716K8778L5043M0999M4608M4162L8462K7404
56854F28726J2723k503j5504k4848l0136l1502k9641k5811k1306j6922j2788q483
56842D22005l446K386Q499J4597K1217K9057L7913M6935N5710O4111P0674P1939
56830H41597O4310M6863K2384m083k7785m5953n7749o3242o2914n8104n1067m3705
56818E60552l6448k8912k1314j4424q279j978N081J2587K0206K8236L6803M4946
56806E97056N0900N2765M8722L7481J9628j619k1738l7315m7249n2083n2774n0148
56794E43626m5078l8716l2229k6213k0520j4963r953n995k740Q56N338J0391J5660
56781C79464K1095K5962K8341K6338J9698R815j435j2439k1861k8665l2392l3216
$$ y = [298539, 310024, 325794, 345554, 369270, 398048, 433091, 474090, 518698, 562860, 601322, 628726, 641449, 638946, 623442, 598594, 568458, 536956, 507315, 481504, 460198, 443276, 430488, 422005, 418559, 420945, 429444, 444041, 465258, 494315, 532228, 579163, 634873, 698984, 769658, 841597, 905907, 952770, 975154, 971071, 943286, 897333, 839584, 776342, 713428, 655324, 604257, 560552, 524104, 495192, 473878, 459454, 451175, 449197, 454278, 466865, 487071, 515307, 552110, 597056, 647956, 700721, 749443, 786924, 806552, 804933, 783195, 745880, 698631, 646548, 593774, 543626, 498548, 459832, 427603, 401390, 380870, 365907, 355954, 349959, 347219, 348075, 353413, 363804, 379464, 400559, 426521, 454862, 481200, 500898, 510713, 509278, 496839, 474978, 446313, 413921, 380705]
56769C80705l1779k9049k5938k2794j9483j6133j3400j1721j0702r636q371p254
56757A74445o477n873n240m555l990l852m227m501l741j915k74M3o13j013p52
56742A27465n85j091j821k020j651j272j148r92n24J6J21l06p84q38n34k36o0
56725A13740J14K38J63K0R5L38M29L86M85O83O65N16O33Q82O46k7k50L81J088
56706A21225J078N98K99K67L68P48J315J405P85K64M91Q29M15l50n15k29l92j076
56688A27525j518j485j358j036j23Q37P15m44j284j122p00o11k64Q53K009K198
56672A24192J483N66l16j242j921j949j481j003o81l37J53Q17J574K024J626N09
56656A24014l45j90O07J206J425J670K028K043J474P90P41J555K654L146K684
$$ y = [380705, 348926, 319877, 293939, 271145, 251662, 235529, 222129, 210408, 199706, 190070, 181699, 174445, 167968, 162095, 156855, 152300, 148310, 144458, 140231, 135730, 131989, 130074, 129800, 129843, 129230, 128217, 127465, 126880, 125789, 123968, 121948, 120297, 119025, 117877, 116885, 116361, 116377, 116498, 116192, 115408, 114570, 114036, 113800, 113740, 113854, 114092, 114255, 114275, 114370, 114708, 115137, 115523, 116008, 116691, 117356, 117872, 118505, 119387, 120033, 120006, 119756, 120137, 121225, 122303, 122901, 123200, 123467, 123835, 124583, 125898, 127303, 128088, 128352, 128843, 129672, 130087, 129737, 129222, 128993, 128601, 127525, 126007, 124522, 123164, 122128, 122005, 122842, 123557, 123113, 121829, 120707, 120007, 119396, 119132, 119985, 121994, 124192, 125675, 126241, 125925, 124683, 122762, 120813, 119332, 118329, 117648, 117311, 117464, 118281, 119855, 121879, 123505, 124014, 123669, 123479, 124086, 125292, 126717, 128387, 130415, 132458, 133932, 134722, 135463, 137018, 139672, 142818, 145502]
56641A45502J785J188J100J318J729K218K280J496L74n8L32N59o0r74j307r64
56625A56518l84K04P44J021J000J042J321J410R56L38O1p7o07j433j919j782j302
56608A57111p80k63K22O57J085J403J266O51K03M83J049R97K03o21j029j250j413
56591A59974j170m42J85K19m4q7J7j35n22p48p21p06p40n28qM52N95O07O73N82
56571A57453J65j75J43J055J915K328K500K722K986L258L719M469N431O725Q659
56556B03353J0997J2616J2527J0940Q864O829M673K430Q06M59J224K228K556J811
56542B82313L40j034j695j755j774k135k812l546l938l606k654j821j759k339
56528B51785l073l897m949n735n396l916k388j837k228k914l513l979m168l814
$$ y = [145502, 147287, 148475, 149575, 150893, 152622, 154840, 157120, 158616, 158990, 158932, 159264, 159823, 159763, 158789, 157482, 156518, 156134, 156338, 157082, 158103, 159103, 160145, 161466, 162876, 163832, 164170, 164231, 164154, 163547, 162114, 160195, 158413, 157111, 156331, 156068, 156290, 156947, 158032, 159435, 160701, 161352, 161555, 162038, 163087, 164084, 164287, 163666, 162637, 161387, 159974, 158804, 158362, 158547, 158766, 158722, 158635, 158652, 158517, 157995, 157247, 156526, 155820, 155080, 154552, 154544, 154996, 155591, 156198, 156871, 157453, 157618, 157443, 157586, 158641, 160556, 162884, 165384, 168106, 171092, 174350, 178069, 182538, 187969, 194694, 203353, 214350, 226966, 239493, 250433, 259297, 266126, 270799, 273229, 274035, 274494, 275718, 277946, 280502, 282313, 282653, 281619, 279924, 278169, 276395, 274260, 271448, 267902, 263964, 260358, 257704, 255883, 254124, 251785, 248712, 244815, 239866, 234131, 228735, 224819, 222431, 220594, 218366, 215452, 211939, 207960, 203792, 199978]
56514A99978k916j960j589j925k251j714m61L66M0q55j338j301j188j001m88L3
56498A81430k0n43j029j499k205k583j822l10O56O79N27M92k6r71j203l13N43
56481A71803M73K74R55J891J700L19r92j271n53O24J533J560R35P77J655K631
56465A84314K529J624J100J288J498J377J352J647J758J154R4n56n8J450K837
56450B03408K908J725O24O07J304J782J796J611J296Q31M47J82m62j705k806k930
56434B10618k272j634j225o96m0L22K23j24m80o53n36m06p11j176q43L80J180
56417B01927O72j15K19J248J458O60J09M18Q82R12P64O47L12j83l45j40p2k33
56399B09140j17M23R48J256J509J482P34l70q51n56l43n24k83Q82K195K693K422
$$ y = [199978, 197062, 195102, 193513, 191588, 189337, 187623, 187162, 187528, 187568, 186713, 185375, 184074, 182886, 181885, 181397, 181430, 181410, 180867, 179838, 178339, 176134, 173551, 171729, 171419, 172075, 172754, 173281, 173773, 173747, 172776, 171573, 171260, 171803, 172276, 172550, 173505, 175396, 177096, 177415, 176423, 175152, 174599, 175223, 176756, 178316, 179251, 180028, 181683, 184314, 186843, 188467, 189567, 190855, 192353, 193730, 195082, 196729, 198487, 199641, 199735, 199179, 199121, 200571, 203408, 206316, 208041, 208665, 209272, 210576, 212358, 214154, 215765, 217061, 217892, 218339, 218521, 218059, 216354, 213548, 210618, 208346, 206712, 205487, 204791, 204751, 205073, 205296, 205172, 204692, 204039, 203503, 203097, 202386, 201210, 200367, 200747, 201927, 202599, 202484, 202703, 203951, 205409, 206069, 206178, 206596, 207478, 208390, 209154, 209801, 210113, 209930, 209585, 209445, 209373, 209140, 209023, 209446, 210394, 211650, 213159, 214641, 215375, 215005, 214154, 213598, 213255, 212731, 212448, 213330, 215525, 218218, 220640]
56382B20640J955J489J053R15J146J381J541K137L261L955L345J991J258J609
56368B47676K221K161J292M7j133j916k062j571q04k88k30k79M6O04P24K52J1
56351B46751O36J426J161p7r00m66N37J016P16k7r02j472j117J65J328J386O53
56334B50814L00Q74J925K911L765M450M604L985K972K190J821J640J630K082K920
56319B88883L401K931J934J345J348J220M63n09j011q94m49J0K17P2q8K16Q70
56302B99959J321J548K108K959L289K971L056M007M567L505J533K40j42m79q94
56287C29548q04m05m77p95l43P96J346R26O46J204J787J584J137J383K246L013
56271C42792L392L481L264K764K250J869J501J279J686K784L896M387M307M102
$$ y = [220640, 222595, 224084, 225137, 226052, 227198, 228579, 230120, 232257, 235518, 239473, 242818, 244809, 246067, 247676, 249897, 252058, 253350, 253397, 252264, 250348, 248286, 246715, 245911, 245623, 245393, 245114, 245160, 245764, 246488, 246740, 246751, 247387, 248813, 249974, 249897, 248997, 248531, 249068, 250084, 250800, 250773, 249871, 248399, 247282, 247447, 248775, 250161, 250814, 251114, 251988, 253913, 256824, 260589, 265039, 269643, 273628, 276600, 278790, 280611, 282251, 283881, 285963, 288883, 292284, 295215, 297149, 298494, 299842, 301062, 301525, 301016, 300005, 299111, 298662, 298672, 298889, 298961, 298873, 299089, 299959, 301280, 302828, 304936, 307895, 311184, 314155, 317211, 321218, 325785, 329290, 330823, 331063, 330921, 330442, 329548, 328744, 328339, 327862, 327067, 326724, 327520, 328866, 329792, 330438, 331642, 333429, 335013, 336150, 337533, 339779, 342792, 346184, 349665, 352929, 355693, 357943, 359812, 361313, 362592, 364278, 367062, 370958, 375345, 379652, 383754]
56257C83754M110M534N361O143O412O436O914P885Q668R123J0150J2452J5375
56244D87317J7563J8425J8587J9112K0434K1984K2844K2860K2817K3174K3189
56233G18306K1883J9459J6851J4237J1054P287L661M92k579n636q259j0378j2360
56220G74018j4148j5230j5648j5988j6241j5752j4516j3384j2689j1808j0475
56209F18139r448r268r399r178q724q284p627o640n839n553n352m781m057l480
56195E20509k786j732p29k96k70k2P32J682K305K358K250K727L814M427L715K373
56179E41057J696J701J357N22K01P82J446J675K023K849L430L045K036J242J111
56164E66173J711K886M056M628M775N116N678O082O550P501Q383Q294P764Q248
$$ y = [383754, 387864, 392398, 397759, 403902, 410314, 416750, 423664, 431549, 440217, 449340, 459490, 471942, 487317, 504880, 523305, 541892, 561004, 581438, 603422, 626266, 649126, 671943, 695117, 718306, 740189, 759648, 776499, 790736, 801790, 809077, 812738, 813230, 810651, 805015, 796756, 786378, 774018, 759870, 744640, 728992, 713004, 696763, 681011, 666495, 653111, 640422, 628614, 618139, 608691, 599423, 590024, 580846, 572122, 563838, 556211, 549571, 543732, 538179, 532827, 528046, 523989, 520509, 517723, 515991, 515262, 514966, 514696, 514674, 515406, 517088, 519393, 521751, 524001, 526728, 530542, 534969, 538684, 541057, 542753, 544454, 545811, 546333, 546534, 547316, 548762, 550437, 552460, 555309, 558739, 561784, 563820, 565062, 566173, 567884, 570770, 574826, 579454, 584229, 589345, 595023, 601105, 607655, 615156, 623539, 631833, 639597, 647845]
56150F47845R742J0687J0543J0646J1897J3426J4473J5911J8728K2385K5757K8634
56138H40674L1374L4089L7144M1441M7534N5308O5027P7400R2055J07107J20660
56127A549813J31226J36334J32862J20240J01980Q3005O6543N4272M7342M5335
56117B468952M5226M3067L6463K5075J0202n070j6749k2606k3635k2633k2678
56106B515614k7222l9259n8392p9973r8646j11837j19025j19578j13403j02493
56096A645786q9801p6981o4437n2751m2618l4083k6953k1359j7027j2989q883
56085A197904n494l143r41J489L102L398L758N370P347Q339Q645R160R538R165
56071A257637Q728R173J0098J0717J1300J2271J3020J3097J3434J4907J6777J8033
$$ y = [647845, 657587, 668274, 678817, 689463, 701360, 714786, 729259, 745170, 763898, 786283, 812040, 840674, 872048, 906137, 943281, 984722, 1032256, 1087564, 1152591, 1229991, 1322046, 1429153, 1549813, 1681039, 1817373, 1950235, 2070475, 2172455, 2255460, 2322003, 2376275, 2423617, 2468952, 2514178, 2557245, 2593708, 2618783, 2628985, 2623915, 2607166, 2584560, 2560925, 2538292, 2515614, 2488392, 2449133, 2390741, 2310768, 2212122, 2100285, 1981260, 1861682, 1748279, 1645786, 1555985, 1479004, 1414567, 1361816, 1319198, 1285115, 1258162, 1236803, 1219776, 1206787, 1197904, 1192410, 1189267, 1188326, 1189815, 1192917, 1196315, 1200073, 1205443, 1212790, 1221129, 1229774, 1238934, 1248472, 1257637, 1266365, 1275538, 1285636, 1296353, 1307653, 1319924, 1332944, 1346041, 1359475, 1374382, 1391159, 1409192]
56059A409192J9043K0483K1851K2561K3288K4677K5919K6059K5574K5352K5355
56048A669354K5446K6068K6905K6595K5130K4583K6015K7645K7853K7799K9133
56037A962526L1164L2544L3763L5681L7376L7831L8169L9877M2319M4232M5995
56026B381477M8351N0566N2050N3990N7262O0609O2915O5246O8478P1305P2918
56015C045167P5172P9452Q3889Q6432Q8252R1352R5297R9192J04106J10498J16049
56004D074858J19359J22894J29002J35970J41575J47312J55282J64133J72118
55995E362503J80907J92182K03874K14140K25470K40227K55945K70091K85440
55986G430779L05179L26810L46898L67847L93625M22836M52720M85938N26235
$$ y = [1409192, 1428235, 1448718, 1470569, 1493130, 1516418, 1541095, 1567014, 1593073, 1618647, 1643999, 1669354, 1694800, 1720868, 1747773, 1774368, 1799498, 1824081, 1850096, 1877741, 1905594, 1933393, 1962526, 1993690, 2026234, 2059997, 2095678, 2133054, 2170885, 2209054, 2248931, 2291250, 2335482, 2381477, 2429828, 2480394, 2532444, 2586434, 2643696, 2704305, 2767220, 2832466, 2900944, 2972249, 3045167, 3120339, 3199791, 3283680, 3370112, 3458364, 3549716, 3645013, 3744205, 3848311, 3958809, 4074858, 4194217, 4317111, 4446113, 4582083, 4723658, 4870970, 5026252, 5190385, 5362503, 5543410, 5735592, 5939466, 6153606, 6379076, 6619303, 6875248, 7145339, 7430779, 7735958, 8062768, 8409666, 8777513, 9171138, 9593974, 10046694, 10532632, 11058867]
55977A1058867N71552O18843O71350P33433Q02894Q76898R60563J060589J175665
55968A8530654J303114J449637J624842J830048K065404K342314K676667L077182
55960C4899862L555074M138349M861611N751005O837321Q173827R820854J1826832
55952H9864735J4252587J7200733K0782491K5044676K9895894L4946565L9213938
55945B71201619M0988984L8335201L0189193J7272978J987156j2679414k4373962
55938C62921755l1979034l5520517l5756522l3744751l0495281k6769017k3049550
55931A45607083j9614176j6597013j4024314j1859591j0052439q554708p313080
55924E7591762o274964n403991m676637m067111l548689l105757k730855k412154
$$ y = [11058867, 11630419, 12249262, 12920612, 13654045, 14456939, 15333837, 16294400, 17354989, 18530654, 19833768, 21283405, 22908247, 24738295, 26803699, 29146013, 31822680, 34899862, 38454936, 42593285, 47454896, 53205901, 60043222, 68217049, 78037903, 89864735, 104117322, 121318055, 142100546, 167145222, 197041116, 231987681, 271201619, 312190603, 350525804, 380714997, 397987975, 399975131, 387295717, 362921755, 330942721, 295422204, 259665682, 225920931, 195425650, 168656633, 145607083, 125992907, 109395894, 95371580, 83511989, 73459550, 64904842, 57591762, 51316798, 45912807, 41236170, 37169059, 33620370, 30514613, 27783758, 25371604]
55916B5371604k135016j892760j684516j504782j345183j203824j082841r78782
55908A3543900q84685p99528p26509o63828o05936n52368n06878m68948m34070
55899G901150m01482l74035l51078l28557l05698k84996k66200k46575k26603
55890E115926k09296j94345j78574j61732j46246j31800j15520r7139p8751n9962
55880C742561l8329j4078J0436L5239O1523Q6286J02913J06878R6549O9723K5259
55869D284960l1425q9558j40464j80386k06917k18197k16352k06899j93492j76599
55859B624671j57499j39283j23319j08619r5363q5309p8036p0727o2582n5964
55849A647970n2133m9246m5742m2522m0511l8787l6504l4343l2913l1725l0481
$$ y = [25371604, 23236588, 21343828, 19659312, 18154530, 16809347, 15605523, 14522682, 13543900, 12659215, 11859687, 11133178, 10469350, 9863414, 9311046, 8804168, 8335220, 7901150, 7499668, 7125633, 6774555, 6445998, 6140300, 5855304, 5589104, 5342529, 5115926, 4906630, 4712285, 4533711, 4371979, 4225733, 4093933, 3978413, 3881274, 3802523, 3742561, 3704232, 3690154, 3700590, 3735829, 3797352, 3883638, 3986551, 4093429, 4189978, 4259701, 4284960, 4253535, 4163977, 4023513, 3843127, 3636210, 3418013, 3201661, 2994762, 2801270, 2624671, 2467172, 2327889, 2204570, 2095951, 2000588, 1915279, 1837243, 1766516, 1703934, 1647970, 1595837, 1546591, 1500849, 1458327, 1417816, 1379029, 1342525, 1308182, 1275269, 1243544, 1213063]
55838A213063k9567k8794k7456k5812k4676k3631k1669j9428j8486j8666j8337
55827I56541j7259j6645j6486j5524j3959j3535j4615j5554j5443j5139j5246
55816G87136j5166j4606j4029j3413j2393j1536j1564j1531j0001p696o589o590
55804F52022n719l582j908j418q90K38R49R51J379K474K903K182J670K332L454
55789F57037M271M948N345M686L097J672N72j125l361m974o131q729j3467j8437
55775F25404k1447k2146k1182j8998j6220j3623j0986p328k806J066L307L995
55763D99036K784r78o131r766j0381r349q511q005p284o628o497o635o656o588
55749D08411o311n644n209n846o999p199o391o070o725p031o134m925m221l439
$$ y = [1213063, 1183496, 1154702, 1127246, 1101434, 1076758, 1053127, 1031458, 1012030, 993544, 974878, 956541, 939282, 922637, 906151, 890627, 876668, 863133, 848518, 832964, 817521, 802382, 787136, 771970, 757364, 743335, 729922, 717529, 705993, 694429, 682898, 672897, 665201, 658612, 652022, 646303, 642721, 640813, 639395, 638505, 638743, 639692, 640643, 642022, 644496, 647399, 649581, 651251, 653583, 657037, 661308, 666256, 671601, 676287, 679384, 681056, 681628, 680503, 677142, 672168, 666037, 657308, 643841, 625404, 603957, 581811, 560629, 541631, 525411, 511788, 500802, 493474, 490668, 491734, 495041, 499036, 501820, 500842, 494711, 484945, 474564, 465215, 456704, 448699, 441415, 434787, 428290, 421655, 414999, 408411, 402100, 396456, 391247, 385401, 378402, 371203, 364812, 358742, 352017, 344986, 338852, 333927, 329706, 326267]
55735C26267k068q91p74j445k278l090l572l240k514k551l489m263m521n077o024
55720B80470o244n470n024n507n606m287k484j469r69k54L66N34J077K840N197
55705B53170O867P363O616M305O93k844n164o524p444p560o620n602n509n883
55691B25864n713n068m678m482l844k825k119j949j880j549r41j51N98R86J035
55676A93284J098J185Q32j69j467k726l808m338l925k941k165j610q11k06p47
55661A71486j968k092o20Q59J144J037J579K264K253J964K106K291J976J771K409
55646A88459L324L626L710M425N318N163L933K799K352J975R60p32k763m731o170
55631B11648o888p163p251o999o287n394m590l849l268l085l032k502j727j732
$$ y = [326267, 324199, 323308, 322534, 321089, 318811, 315721, 312149, 308909, 306395, 303844, 300355, 296092, 291571, 286494, 280470, 274226, 268756, 263732, 258225, 252619, 248332, 245848, 244379, 243410, 243156, 243522, 244056, 245133, 247973, 253170, 260037, 267400, 274016, 278321, 279014, 276170, 271006, 264482, 257038, 249478, 242858, 237256, 231747, 225864, 220151, 215083, 210405, 205923, 202079, 199254, 197135, 195186, 193306, 191757, 190816, 190665, 191263, 192249, 193284, 194382, 195567, 196399, 196230, 194763, 192037, 188229, 183891, 179966, 177025, 174860, 173250, 172439, 172233, 171486, 169518, 167426, 166806, 167665, 168809, 169846, 171425, 173689, 175942, 177906, 180012, 182303, 184279, 186050, 188459, 191783, 195409, 199119, 203544, 208862, 214025, 217958, 220757, 223109, 225084, 226044, 225312, 222549, 217818, 211648, 204760, 197597, 190346, 183347, 177060, 171666, 167076, 163227, 159959, 156874, 153842, 151340, 149613, 147881]
55617A47881k587k844j556K13Q93M72mk15o31j369k093k705l137k882j732n81
55601A27123n28j406k041j742q51nL98K36k51n46m40k25q7J35L50J65k15N0J018
55582A21138J478O43n08n29N74J694K182K149J776J335J411K259L337M173N108
55567A48220O464P647P950P597P092O134M213J678p69l079n311o781o875o277
55553A67903o158o506o445n830n320n061m595l945l591l417k811j882j424j602
55539A09316j710j428j279j493j429n79M75P14j10j287j953j907j658j742k014
55524I1916j889j282p32m87j46L97N12j00o07k29N01N33l4k33J61L35k54j146
55506H7216j543j081NJ009J186N75O8K72P52Q68P88Q96R02M18q6K0L47R0n55p13
$$ y = [147881, 145294, 142450, 140894, 141107, 142000, 142472, 142468, 142253, 141622, 140253, 138160, 135455, 132318, 129436, 127704, 127123, 126595, 125189, 123148, 121406, 120555, 120550, 120948, 121184, 120933, 120387, 119947, 119722, 119635, 119770, 120120, 120285, 120070, 120120, 121138, 122616, 123259, 122751, 122222, 122796, 124490, 126672, 128821, 130597, 131932, 133343, 135602, 138939, 143112, 148220, 154684, 162331, 170281, 177878, 184970, 191104, 195317, 196995, 196226, 193147, 187836, 181055, 174180, 167903, 161745, 155239, 148794, 142964, 137644, 132583, 127988, 124043, 120452, 117035, 114224, 112342, 110918, 109316, 107606, 106178, 104899, 103406, 101977, 101398, 101873, 102587, 102477, 101190, 99237, 97330, 95672, 93930, 91916, 90027, 88745, 88013, 87526, 87380, 87777, 88289, 88189, 87582, 87353, 87854, 88387, 88353, 88120, 88281, 88616, 88362, 87216, 85673, 84592, 84597, 85606, 86792, 87367, 87435, 87707, 88459, 89327, 90115, 91011, 91913, 92331, 92245, 92265, 92612, 92702, 92147, 91434]
55486I1434l74l84r04j054k96P78J275Q80j37j170j481q94k04k92q73r37k04O54
55468H5817J134J323J254P89K01j6o4p07j999k990k892j896o22N30J315J504J168
55451H3849O06j1n74p19j95N69Q70O94N30L70k68j256j724j214k05P53J671K524
55433H6270K772K051Q94K47M29Q67P79p3j211j963k157k119j963j364l16M75N23
55416H4141M27J060K184K732K299J599J342J445J422R85J98n85r63j039j414k271
55400I3562k780k165r19j92k43m02l52m28o87p19n19o09j090j362j064n62k66
55383G9203j54j66m61r54j168p74M5P95R74K85q75j422p36M02P70L22k0k0l54
55364G5692j155j496p43N20J376J658J721J755J694J385O30l62p25J68J503J710
$$ y = [91434, 91060, 90676, 89772, 88718, 88422, 89200, 90475, 91355, 91218, 90048, 88567, 87673, 87469, 87177, 86304, 85367, 85163, 85817, 86951, 88274, 89528, 90317, 90518, 90502, 90438, 89731, 87732, 84742, 81850, 79954, 79332, 79862, 81177, 82681, 83849, 84455, 84444, 83870, 83151, 82956, 83525, 84395, 85089, 85619, 85989, 85721, 84465, 82741, 81527, 81322, 82075, 83746, 86270, 89042, 91093, 91987, 92234, 92663, 93530, 94309, 94236, 93025, 91062, 88905, 86786, 84823, 83459, 83143, 83618, 84141, 84568, 85628, 87812, 90544, 92843, 94442, 95784, 97229, 98651, 99636, 99834, 99249, 98286, 97247, 95833, 93562, 90782, 88617, 87698, 87506, 87263, 86861, 86509, 86081, 85394, 84675, 84156, 83547, 82457, 81095, 80031, 79469, 79203, 79049, 78883, 78422, 77468, 76300, 75526, 75571, 76366, 77340, 77625, 76750, 75328, 74592, 74994, 75764, 76086, 76066, 76046, 75692, 74537, 73041, 72298, 72818, 74194, 75852, 77573, 79328, 81022, 82407, 83037, 82675, 81950, 82118, 83621, 85331]
55348H5331M91p80r79n40l59l74k8O27J055J102R91P87L81j33n48p70p64m90j54
55329H4846j28m12n10j22L39K68l54r23q34q2O83P23j0q01j035q14m30K09J063
55310H1676J379N43q24j536j412j194j115p39j62j26o75r04m25P9J81M47J230
55293G6423J744J205J11m51j89L60P78J060J324J645J937J855J221O27Q23J409
55277I1882J138k13j316j157l76K3J73O01Q57J75r51j164j45R30R52J22n54m84
55259I0493N2L64J17l19m16k89m64q82p34L39J505J681P97l25r88j092r12p71
55241H8156p54n39R3O56M15l86n88K82J264J352P59K19k45r62j619j542p29J19
55223H5951M48J77n04j110j029k66L66K90L2L73J091J311Q00J38k09k67r3L14
$$ y = [85331, 85822, 85042, 84063, 83523, 83164, 82790, 82762, 83389, 84444, 85546, 86537, 87324, 87705, 87572, 87024, 86254, 85490, 85000, 84846, 84718, 84306, 83796, 83674, 84013, 84281, 83927, 83004, 82170, 82088, 82771, 83494, 83484, 82683, 81648, 80834, 80404, 80613, 81676, 83055, 83598, 82774, 81238, 79826, 78632, 77517, 76778, 76616, 76490, 75815, 74911, 74486, 74565, 74746, 75193, 76423, 78167, 79372, 79483, 79032, 78843, 79203, 79981, 81041, 82365, 84010, 85947, 87802, 89023, 89650, 90473, 91882, 93020, 92807, 91491, 90334, 89958, 89981, 90154, 90755, 91612, 91787, 90836, 89672, 89527, 90457, 91409, 91531, 90977, 90493, 90545, 90909, 91026, 90707, 90291, 90002, 89538, 88656, 87922, 88261, 89766, 91447, 92244, 91919, 90931, 89839, 88927, 88156, 87402, 86863, 86956, 87612, 88027, 87641, 87053, 87335, 88599, 89951, 90710, 90929, 90684, 89722, 88103, 86561, 85832, 85951, 86399, 86576, 86072, 84962, 83933, 83667, 84033, 84323, 84355, 84728, 85819, 87130, 87930, 88068, 87859, 87592, 87499, 87813]
55205H7813P23Q14O46M75K49k35p86r83p58m05q5J69J46k98p44n09M42J277J100
55186H9051j48j577k089j369k70J04l05n63j72K94K10j04j6M53R04J337J897K296
55168H9933K201J846J623J347P14N9j04n7l95q57n93L70R36M44m16o00K0O64N95
55149I7730j79r35r66l92q3m77r66q40m18m65q79q95m36j74k72q9N90J031O79
55130I1564n1o02j109j758j995j182K94J355J510J206R61P19K19m28p50m09M30
55113H9974J201J421J104O11J49l65q66r10k09Q01J286R97O10Q42J548J952J727
55096A01873J352J315J355R68K87o2N1M8m84j176j459j286r70o81m78n57r87j340
55078I7769j045j49N93M91l39j103j142o63m91j004j488r78L99J396J148J74l61
$$ y = [87813, 88536, 89350, 89996, 90471, 90720, 90485, 89699, 88716, 87958, 87553, 87468, 87637, 87783, 87485, 86741, 86232, 86674, 87951, 89051, 88903, 87326, 85237, 83868, 83598, 83702, 83397, 82834, 82662, 82956, 83166, 83062, 83046, 83499, 84403, 85740, 87637, 89933, 92134, 93980, 95603, 96950, 97664, 97723, 97619, 97562, 97167, 96310, 95717, 96087, 97023, 97467, 97051, 96451, 96471, 97135, 97730, 97551, 96616, 95650, 95258, 95175, 94698, 93732, 92892, 92474, 92009, 91130, 90235, 89799, 89625, 89353, 89264, 89854, 90885, 91564, 91513, 90911, 89802, 88044, 86049, 84867, 85161, 86516, 88026, 89232, 90193, 90912, 91131, 90703, 89953, 89544, 89974, 91175, 92596, 93700, 94311, 94460, 94095, 93229, 92319, 92110, 92911, 94197, 95194, 95804, 96646, 98194, 100146, 101873, 103225, 104540, 105895, 106863, 107150, 107088, 107139, 107187, 106703, 105527, 104068, 102782, 101812, 101131, 100653, 100096, 99109, 97769, 96724, 96575, 97168, 97659, 97320, 96217, 95075, 94412, 93921, 92917, 91429, 90451, 90850, 92246, 93394, 93568, 93207]
55061I3207J2P73J127O78l50j230j303o15J39M13L31K69L62N29O12M03j13m31
55043I4813%Q56J164O56J75L71P31N47N7m2L18P11R40R37L92o82j480j264m65
55024I8735p4j75n9M71Q73Q88Q73R50O68k03j191j729j705j292o49kM08N98P36
55005I8121P58M53n3l13q2M19P73P02K50j57J9P54J305J080M11R8M96J380K410
54986A08824L132K941J647mj011j162r12n58j22J76J27JJ48K34l16j247j624j107
54968A09167l29P8Q0j28m74p64p22m05j16J37N89J159J491J518J453J257P43J29
54950A14863j35p7p9j41L8L15K50lJ21N27M91p2k97K85J010J083N64j43r57j753
54930A15890j972j292k67L03L68M30O88Q86Q89R73J418K084K541K666K999M194
$$ y = [93207, 93219, 93992, 95119, 95797, 95447, 94217, 92914, 92299, 92438, 92851, 93182, 93451, 93813, 94342, 94954, 95357, 95244, 94813, 94813, 95669, 96833, 97489, 97664, 98035, 98766, 99313, 99370, 99328, 99646, 100357, 101297, 102234, 102626, 101944, 100464, 99200, 98735, 98661, 98486, 98427, 98898, 99771, 100659, 101532, 102482, 103150, 102947, 101756, 100027, 98322, 97030, 96381, 96379, 96787, 97385, 98121, 98879, 99332, 99279, 98966, 98884, 99303, 100076, 100778, 101028, 100871, 100890, 101644, 102949, 104029, 104440, 104538, 105034, 106414, 108824, 111956, 114897, 116544, 116540, 115529, 114367, 113455, 112897, 112775, 112951, 113078, 113079, 113227, 113461, 113145, 111898, 110274, 109167, 108838, 108916, 108996, 108868, 108394, 107630, 106908, 106503, 106387, 106524, 107113, 108272, 109763, 111281, 112734, 113991, 114734, 114863, 114728, 114651, 114572, 114431, 114469, 114784, 115034, 115031, 115152, 115679, 116170, 116098, 115801, 116086, 117096, 118179, 118743, 118600, 117643, 115890, 113918, 112626, 112359, 112662, 113030, 113460, 114148, 115034, 115923, 116896, 118314, 120398, 122939, 125605, 128604, 132798]
54914A32798O010P329P597P614Q283R074Q663O780M335J882q15l588n566o436
54900A83960o940p591p841p163o048n259m740l977k897j868j202j054j345j506
54886A24529r67n5K98M4J48Q83J166L66l73K00J448J873J516J816L297M878N637
54869A46704N940O452P067P393P485P422O687M604J299k189m700n749n717n512
54855A77186n847o629p000o248m721l618l632m037l565k224j514k433l942m189
54841A17587k824j186l69k07j99l29o03o87n46o17r18p72N3P78P66N13O91R61
54823A12092N88k94r37j097j000n89K31Q96O87j33n85l54q3k13m21l22o4J21L10
54804A08833N75P53Q01R55J250J249N77m59j088q77j80K56J06k16j13M08Q10Q28
$$ y = [132798, 138808, 146137, 153734, 161348, 169631, 178705, 187368, 194148, 198483, 200365, 199550, 195962, 190396, 183960, 177020, 169429, 161588, 154425, 148377, 143118, 138378, 134401, 131504, 129636, 128434, 127380, 126035, 124529, 123562, 123507, 123805, 123849, 123997, 124880, 126046, 126412, 126039, 126239, 127687, 129560, 131076, 132892, 136189, 141067, 146704, 152644, 159096, 166163, 173556, 181041, 188463, 195150, 199754, 201053, 198864, 194164, 188415, 182698, 177186, 171339, 164710, 157710, 151462, 146741, 143123, 139491, 135454, 131889, 129665, 128151, 125718, 121776, 117587, 114763, 113577, 113208, 113001, 112802, 112473, 111870, 111183, 110637, 110020, 109102, 108330, 108383, 109161, 109927, 110440, 111131, 112092, 112680, 112386, 111449, 110352, 109352, 108763, 108994, 109890, 110577, 110444, 109859, 109505, 109422, 109209, 108788, 108466, 108402, 108523, 108833, 109408, 110161, 110962, 111917, 113167, 114416, 114993, 114534, 113446, 112569, 112389, 112645, 112751, 112535, 112422, 112830, 113640, 114468]
54786A14468P80R13R43N38r0n08o37o48n11j41L27P60J288J900K090J502O99O42
54768A24315J447K325K781L186L984M919N494N722O035O600P187P667Q206Q770
54754A98638Q734P375M753J715j064l668o237q217q901q501p868p267o236m761
54740A58495l596l075k536j463m63l31q18j176j315j609j900j765j450j539j766
54725A33693j220J03R83O52l0L09J766L217L902M279N160O506P468P492O935O363
54709A87578N630M030J327j831m582o484p443p466o776n851n040m370l789l249
54695A41684k604j838j442j894k737k907k192j474j248q53J53R30O09k21l62J53
54679A23757L17j31m35k04J22J77J09n3n38j148j227o14j8j77j078k149k775k613
$$ y = [114468, 115248, 116161, 117104, 117642, 117552, 117044, 116407, 115759, 115248, 115107, 115434, 116194, 117482, 119382, 121472, 122974, 123673, 124315, 125762, 128087, 130868, 134054, 138038, 142957, 148451, 154173, 160208, 166808, 173995, 181662, 189868, 198638, 207372, 214747, 219500, 221215, 220151, 216483, 210246, 202029, 193128, 184627, 176759, 169492, 163256, 158495, 154899, 151824, 149288, 147825, 147362, 147031, 146213, 145037, 143722, 142113, 140213, 138448, 136998, 135459, 133693, 132473, 132576, 133559, 134211, 134181, 134490, 136256, 139473, 143375, 147654, 152814, 159320, 166788, 174280, 181215, 187578, 193208, 197238, 198565, 196734, 192152, 185668, 178225, 170759, 163983, 158132, 153092, 148722, 144933, 141684, 139080, 137242, 135800, 133906, 131169, 128262, 126070, 124596, 123348, 122495, 122648, 123578, 124187, 123966, 123604, 123757, 124074, 123943, 123508, 123304, 123426, 123603, 123712, 123659, 123121, 121973, 120746, 120132, 120114, 119937, 118859, 116710, 113935, 111322]
54661A11322j746o41L52J245J879J634K81j210j594q54M0O34J233J773J618P41
54645A16707J27M70J247J510J013J39o61j076r91o74n10m27%P46J244J176P93
54628A20833L49k00p38r03p09o29q26q78n43j62KK36P66J272J411J334J258J027
54610A22900N10Pk41n25j157j795j789r91J61J158J739J811J441Q21J37m75q59
54593A22853r37r03r48q59k98N06Q87O72M10N43R09J222J437J389P20l94j045
54576A26164n88N27J349J440R78L18j49j35J24po44j071p47j30M7j91l91m59m81
54557A25954j42P41J446J078k2n22J19J022J243R42P67P74N58Q5k64l12k55k22
54539A32990r7K28O72J165J726K194K149J455P46R10J926K690K289J188N96Q80
$$ y = [111322, 109576, 108935, 109287, 110532, 112411, 114045, 114326, 113116, 111522, 110668, 110708, 111342, 112575, 114348, 115966, 116707, 116834, 117304, 118551, 120061, 121074, 121213, 120552, 119476, 118485, 117811, 117301, 116874, 116874, 117620, 118864, 120040, 120833, 121182, 120982, 120244, 119341, 118632, 118003, 117177, 116299, 115756, 115594, 115596, 115832, 116598, 117870, 119281, 120615, 121873, 122900, 123410, 123417, 123176, 122651, 121494, 119699, 117910, 116919, 117080, 118238, 119977, 121788, 123229, 124050, 124187, 123712, 122853, 121916, 121013, 120065, 119206, 118908, 119414, 120301, 120973, 121383, 121926, 122835, 124057, 125494, 126883, 127603, 127209, 126164, 125576, 126103, 127452, 128892, 129870, 130188, 130039, 129904, 130028, 130021, 129377, 128306, 127559, 127429, 127476, 127285, 126894, 126435, 125954, 125812, 126553, 127999, 129077, 129055, 128533, 128652, 129674, 130917, 131859, 132626, 133400, 133958, 134043, 133779, 133467, 133212, 132990, 132893, 133121, 133793, 134958, 136684, 138878, 141027, 142482, 143228, 144138, 146064, 148754, 151043, 152231, 152827, 153707]
54523A53707J185P17k39q50q13n29m81p47j018q28J8J045J413Q29k3k71P4J79
54505A53368n40j637k118j534n12p5m54q68o09mJ04l85p65o11k79r9J69P10J100
54486A44961Q90L65J65L77N28L33J0q9J70O23Q99P28L03J50M45P76P83P05R78
54467A54100J584K219K774L221L297K785K008J516J368J127N04l68j244j845j789
54452A71257r29J86P41O80P54J366J874J520N73m1m7j39q43j647j686r05j69k04
54434A72341r31j753k128j821j063n64q74j519j360j30R80Q95J41o0K96J56p16
54417A61890j299r63k93J09N36J177J304L45r21j295q00m11n40p02n72l35LP99
54399A58032J965K682K258R44l23p73l11N70J281J623J750J683J179L25j75K67
$$ y = [153707, 154892, 155609, 155370, 154520, 153707, 153178, 152697, 151950, 150932, 150104, 150122, 151167, 152580, 153409, 153386, 153115, 153189, 153368, 152828, 151191, 149073, 147539, 147027, 146952, 146498, 145630, 145021, 145017, 145121, 144736, 143971, 143360, 143081, 142982, 143151, 143861, 144961, 145851, 146216, 146381, 146758, 147286, 147619, 147629, 147540, 147710, 148333, 149232, 149960, 150263, 150413, 150858, 151634, 152417, 153122, 154100, 155684, 157903, 160677, 163898, 167195, 169980, 171988, 173504, 174872, 175999, 176503, 176135, 174891, 173046, 171257, 170328, 170514, 171255, 171935, 172689, 174055, 175929, 177449, 178022, 177981, 177934, 177795, 176952, 175305, 173619, 172714, 172545, 172341, 171410, 169657, 167529, 165708, 164645, 164081, 163207, 161688, 160328, 160198, 161178, 162073, 162214, 162154, 162450, 162606, 161890, 160591, 159628, 159335, 159444, 159980, 161157, 162461, 162806, 161885, 160590, 159790, 159379, 158839, 158137, 157565, 157230, 157233, 158032, 159997, 162679, 164937, 165881, 165558, 164785, 164474, 165044, 166325, 167948, 169698, 171381, 172560, 172885, 172710, 172977]
54383A72977J310K009J749N53j224l016m042l794k535j042Q8O37N57M8l81l69
54367A63525j08N0J33L02L85K37K02N73Q91N73rK7O26Q10J99m79o65p62j208j572
54347A63730j296o98m92p53j017j144j415j824j885j268l32J17m35j663k586k459
54331A44580j537p04l77j86K12N18L15k43o49p09n84l75r2J65L04M57P69J043
54313A42907R39M67N5O8M72R44J159R68M90M9p5J72O20R93J002N44j45o59p86
54294A50184n81r1O03J100R01P6o79r40j062j420j654j244n02k69o86j038q12
54277A41886k88M3Q1r8m42o50k39O91J287R14j1o15n66r0O23J355J585R80O3l24
54257A46185j81k57p93j104o73J06N83O87O35L98p9n13o27n90o78q20q64r23j065
$$ y = [172977, 174287, 176296, 178045, 178598, 177374, 174358, 170316, 166522, 163987, 162945, 163033, 163670, 164227, 164275, 163894, 163525, 163417, 163467, 163600, 163902, 164287, 164524, 164726, 165299, 166190, 166763, 166754, 166781, 167407, 168217, 168416, 167937, 167272, 166510, 165302, 163730, 162434, 161736, 161244, 160491, 159474, 158330, 156915, 155091, 153206, 151938, 151606, 151723, 151288, 149625, 147039, 144580, 143043, 142339, 141962, 141776, 141988, 142506, 142821, 142578, 141929, 141220, 140636, 140261, 140169, 140334, 140638, 141095, 141864, 142907, 143846, 144313, 144368, 144436, 144908, 145852, 147011, 147979, 148469, 148518, 148443, 148615, 149235, 150228, 151230, 151774, 151629, 150970, 150184, 149603, 149512, 150115, 151215, 152116, 152192, 151513, 150573, 149511, 148091, 146437, 145193, 144691, 144422, 143736, 142698, 141886, 141598, 141641, 141722, 141624, 141182, 140532, 140293, 140984, 142271, 143185, 143174, 142559, 141993, 141903, 142526, 143881, 145466, 146446, 146509, 146185, 146004, 145747, 144954, 143850, 143177, 143283, 143866, 144553, 145188, 145586, 145507, 144994, 144367, 143777, 143099, 142279, 141415, 140492, 139427]
54238A39427j006n72j32n4j07O8K11j04o14o76k64O9R3N2j5k59m20r8L98L86K8
54217A36411K24J089J595J112K83k11o62j427j909j465o31m21q16r12l68K13K47
54200A32352k03o98q19l78K77M15j42n86j89N83P85M63M59R01R11M1r45j058k46
54181A31923Q30J586J703J039j74j251j571j126m03J35L09J23l49r53j404j413
54165A29004r67m15o4K52Q57J494J427M76n45p73k79K95O09P41P68P89J015J372
54147A36056J357P83K78M30Q69Q79N01K53N6n35j248j266n50m8m04j230j785j696
54129A32700q71M81J580J628Q11J03j02l66r65j264p55O8M96N91P22P06J71m90
54111A35244l33R16K362K751J676k0j065r90n02m44o36k87O45J270J013L55J0
$$ y = [139427, 138421, 137849, 137717, 137663, 137556, 137624, 137835, 137731, 137117, 136441, 136177, 136246, 136339, 136391, 136376, 136117, 135697, 135599, 135997, 136383, 136411, 136635, 137724, 139319, 140431, 140714, 140503, 139841, 138414, 136505, 135040, 134409, 133988, 133172, 132260, 131892, 132105, 132352, 132149, 131451, 130632, 130254, 130531, 130946, 130804, 130218, 130029, 130612, 131397, 131860, 132319, 133220, 134131, 134172, 133227, 132169, 131923, 132753, 134339, 136042, 137081, 136907, 135656, 134085, 132959, 132556, 132691, 133000, 133123, 132774, 131821, 130417, 129004, 128037, 127622, 127558, 127810, 128667, 130161, 131588, 132064, 131519, 130746, 130467, 130762, 131371, 132112, 132880, 133669, 134684, 136056, 137413, 138196, 138474, 138904, 139773, 140652, 141153, 141406, 141462, 140927, 139679, 138413, 137863, 137815, 137411, 136181, 134396, 132700, 131829, 132310, 133890, 135518, 136329, 136432, 136330, 135964, 134999, 133735, 132980, 133048, 133544, 134135, 134857, 135563, 135734, 135244, 134911, 135827, 138189, 140940, 142616, 142596, 141531, 140541, 140039, 139595, 138959, 138672, 139317, 140587, 141600, 141955, 141965]
54094A41965Jr7m23p33p54l83K12N95M77J47M4N8j90m51n7Q95J474J236P99P01
54074A45516O57M01L55Q26J268J088N50J96mk07%R39J977K204J628R49M51l3m00
54055A58361l85k01k47l01J42Q42R83M72J22M72J101J448J662K205L024L525L232
54038A76457K319J558J703K741L850M293M228M342M961N825O539O869O749O375
54024B38809O145O127N825M855L603K678K078J402P25M83P00R74J185J451J483
54009B78523Q12k80r34j057j589l027m527n016m643m379m570m711m448m064l900
53994B32190l833l628l376l265l108k497j484p78j010j932k706k873k663k308
53980A96729j686q72m49p33j120q67k27l7l64m28J09O14N06J7l65n28m40J38J121
$$ y = [141965, 141966, 141869, 141446, 140713, 139959, 139576, 139788, 140383, 140860, 141007, 141051, 141109, 140919, 140468, 140411, 141306, 142780, 144016, 144815, 145516, 146173, 146574, 146929, 147755, 149023, 150111, 150661, 150857, 150853, 150646, 150646, 151585, 153562, 155766, 157394, 158343, 158794, 158761, 158361, 157976, 157775, 157528, 157227, 157369, 158211, 159194, 159666, 159788, 160260, 161361, 162809, 164471, 166676, 169700, 173225, 176457, 178776, 180334, 182037, 184778, 188628, 192921, 197149, 201491, 206452, 212277, 218816, 225685, 232434, 238809, 244954, 251081, 256906, 261761, 265364, 268042, 270120, 271522, 272247, 272730, 273430, 274404, 275589, 277040, 278523, 279335, 279055, 278121, 277064, 275475, 272448, 267921, 262905, 258262, 253883, 249313, 244602, 240154, 236090, 232190, 228357, 224729, 221353, 218088, 214980, 212483, 210999, 210221, 209211, 207279, 204573, 201700, 199037, 196729, 195043, 194171, 193722, 192989, 191869, 191002, 190775, 190738, 190374, 189946, 190055, 190669, 191175, 191192, 190827, 190299, 189859, 189997, 191118]
53961A91118J814J736J316J213J331J227J137J796L268M731N607O197O954P772
53947B37217Q451R358J0864J2299J2224R909O121K252q78l203m762n412n033l731
53933B85676j850j9J053J207J106J446J955J706M34r62j413o86O64J892K394K068
53917B96671J607J975L213M308M596M665N342O413P092P317P614P972P811O984
53903C73580N959M971L824K590J697J146L76p91j770k085k001j970k050k182k540
53888C78754l207l961m696n609o646p275p154o639o232n981n811n895o199o136
53874B97313n334m405m201m550m475l601k607k213k362k616k831l060l228l257
53860B48573l347l738m260m291l427k062j193j480k496l092k607j507p21o12q10
$$ y = [191118, 192932, 194668, 195984, 197197, 198528, 199755, 200892, 202688, 205956, 210687, 216294, 222491, 229445, 237217, 245668, 255026, 265890, 278189, 290413, 300322, 306443, 308695, 307817, 304614, 299852, 294440, 289407, 285676, 283826, 283807, 284860, 286067, 287173, 288619, 290574, 292280, 292714, 291752, 290339, 289653, 290317, 292209, 294603, 296671, 298278, 300253, 303466, 307774, 312370, 317035, 322377, 328790, 335882, 343199, 350813, 358785, 366596, 373580, 379539, 384510, 388334, 390924, 392621, 393767, 394143, 393352, 391582, 389497, 387496, 385526, 383476, 381294, 378754, 375547, 371586, 366890, 361281, 354635, 347360, 340206, 333567, 327335, 321354, 315543, 309648, 303449, 297313, 291979, 287574, 283373, 278823, 274348, 270747, 268140, 265927, 263565, 260949, 258118, 255058, 251830, 248573, 245226, 241488, 237228, 232937, 229510, 227448, 226255, 224775, 222279, 219187, 216580, 215073, 214352, 213740, 212930]
53845B12930q80p86o84o68p13p58o50k35M23R50R18K53o19j102r96o91p33j232
53827B04727j845k293k569k658k398j791j136o41j50M45Q41O94J77j69p4L07P40
53810A92207J102J292J339J520K078K822L339L546L687L854L935M055M534N283
53796B34593N736N657N529N736N797N025L719L077L751M996N461M658L379K773
53782B99887L174L871L976L424K944L083L605M042M530N700P771J0219J2209J2968
53768C81403J1627P454P59o692j2718j6236j7573j7547j6659j5159j3389j1732
53756B73538j0392r328q360p242n843m333l091k349k033j978k121k360k468k256
53742B09384j818j414j114p15l8P80J306J217O44P0j36q3j37m14o25m31J61P32
$$ y = [212930, 212050, 211264, 210580, 209912, 209199, 208441, 207791, 207556, 207979, 208929, 209847, 210100, 209481, 208379, 207383, 206692, 205959, 204727, 202882, 200589, 198020, 195362, 192964, 191173, 190037, 189396, 189246, 189691, 190532, 191226, 191403, 191234, 191160, 191467, 192207, 193309, 194601, 195940, 197460, 199538, 202360, 205699, 209245, 212932, 216786, 220721, 224776, 229310, 234593, 240329, 245986, 251515, 257251, 263048, 268073, 271792, 274869, 278620, 283616, 289077, 293735, 297114, 299887, 303061, 306932, 310908, 314332, 317276, 320359, 323964, 328006, 332536, 338236, 346007, 356226, 368435, 381403, 393030, 400484, 401243, 394551, 381833, 365597, 348024, 330477, 313818, 298659, 285270, 273538, 263146, 253818, 245458, 238216, 232373, 228040, 224949, 222600, 220567, 218589, 216468, 214108, 211640, 209384, 207566, 206152, 205038, 204323, 204285, 205065, 206371, 207588, 208232, 208302, 208166, 208083, 207946, 207532, 206907, 206476, 206637, 207369]
53724B07369P84J56p65j342j240p26k85j30k19n52j059j308p61M98J665K041J747
53707B05873J444J591K060K374K156J540J111J278J705J753J448J524K284L051
53693B31192L061K541K343K767L307L424L153K892K911L080K958K239J224N91
53679B67683M81J95q35k192l027l191l232l443l614l600l458l035k055q44k54
53664B35579n93j152j168q10p72j243j722j760j436j137j056r83n68J93Q24R04
53648B23100O24N37P54Q07M18m5j67j35l93q72j024o52k55l34o59n21K83J097
53630B22563J204P35M26N80P43N95N42J015J622J630J143J048J743K603K912K803
53614B43907K857L217L527L533L363L227L126K870K341J745J535J928K496K550
$$ y = [207369, 208153, 208309, 207544, 206202, 204962, 204236, 203951, 203821, 203602, 203050, 201991, 200683, 199922, 200420, 202085, 204126, 205873, 207317, 208908, 210968, 213342, 215498, 217038, 218149, 219427, 221132, 222885, 224333, 225857, 228141, 231192, 234253, 236794, 239137, 241904, 245211, 248635, 251788, 254680, 257591, 260671, 263629, 265868, 267092, 267683, 268164, 268359, 267524, 265332, 262305, 259114, 255882, 252439, 248825, 245225, 241767, 238732, 236677, 235833, 235579, 234986, 233834, 232666, 231856, 231084, 229841, 228119, 226359, 224923, 223786, 222730, 221747, 221179, 221372, 222196, 223100, 223724, 224261, 225015, 225822, 226240, 226195, 226028, 225893, 225500, 224628, 223604, 222952, 222697, 222363, 221704, 221183, 221466, 222563, 223767, 224502, 224928, 225508, 226251, 226846, 227388, 228403, 230025, 231655, 232798, 233846, 235589, 238192, 241104, 243907, 246764, 249981, 253508, 257041, 260404, 263631, 266757, 269627, 271968, 273713, 275248, 277176, 279672, 282222]
53600B82222J949J251R78J018R11M52j75o54p58n31l30n41j077j416j211o97l60
53583B81031l86o00q43j171j728k467l009k867j990r30l24k37k91k99l66m53l06
53566B62764R6M46N37M08P3m60q25o07q6p8o87r32l4J467K452K603K428K309K261
53547B74135K376K789L194L087K525K120K201K500K758L124L788M619N374O005
53533C20595O546O992P393P868Q416Q894R265R648J0063J0395J0717J1286J2048
53520D40126J2465J2217J1842J2264J3675J5376J6775J8141K0009K2169K3827
53509F18886K4680K5278K6093K6683K6281K4857K3164K1795K0698J9634J8671
53498H76720J7981J7554J7277J7122J7108J7197J7344J7462J7415J7169J6953
$$ y = [282222, 284171, 285422, 286400, 287418, 288329, 288781, 288606, 287952, 287194, 286663, 286333, 285792, 284715, 283299, 282088, 281391, 281031, 280645, 280045, 279202, 278031, 276303, 273836, 270827, 267960, 265970, 265040, 264716, 264479, 264188, 263889, 263523, 263070, 262764, 262860, 263306, 263843, 264251, 264324, 263864, 263039, 262432, 262346, 262268, 261581, 260649, 260615, 262082, 264534, 267137, 269565, 271874, 274135, 276511, 279300, 282494, 285581, 288106, 290226, 292427, 294927, 297685, 300809, 304597, 309216, 314590, 320595, 327141, 334133, 341526, 349394, 357810, 366704, 375969, 385617, 395680, 406075, 416792, 428078, 440126, 452591, 464808, 476650, 488914, 502589, 517965, 534740, 552881, 572890, 595059, 618886, 643566, 668844, 694937, 721620, 747901, 772758, 795922, 817717, 838415, 858049, 876720, 894701, 912255, 929532, 946654, 963762, 980959, 998303, 1015765, 1033180, 1050349, 1067302]
53487A067302J6957J6931J6459J5597J4781J4085J3150J1992J1335J1641J2232
53476A222462J1853R912O886L733J236l42j414k767m804p158r314j1253j3219
53463A205811j5068j6370j7038j7443j7913j8464j9046j9719k0524k1405k2254
53452A000567k2885k3058k2685k1943k0992j9780j8304j7001j6415j6466j6325
53441G84713j5205j3196j1183r914r165q095o382m667l565k643j076R75K543L472
53427G06612M753O847Q766R636J0209J1825J4364J6502J7633J8398J9349K0338
53415H65232K1375K2999K5301K7451K8746K9508L0462L1777L3202L4718L6486
53404A187257L8392M0129M1630M3083M4620M6256M8052N0016N1905N3271N3768
$$ y = [1067302, 1084259, 1101190, 1117649, 1133246, 1148027, 1162112, 1175262, 1187254, 1198589, 1210230, 1222462, 1234315, 1244227, 1251113, 1254846, 1256082, 1255740, 1254326, 1251559, 1246755, 1239597, 1230283, 1219030, 1205811, 1190743, 1174373, 1157335, 1139892, 1121979, 1103515, 1084469, 1064750, 1044226, 1022821, 1000567, 977682, 954624, 931939, 909996, 889004, 869224, 850920, 833919, 817504, 801038, 784713, 769508, 756312, 745129, 735215, 726050, 717955, 711573, 706906, 703341, 700698, 699622, 700597, 703140, 706612, 711365, 718212, 726978, 736614, 746823, 758648, 773012, 789514, 807147, 825545, 844894, 865232, 886607, 909606, 934907, 962358, 991104, 1020612, 1051074, 1082851, 1116053, 1150771, 1187257, 1225649, 1265778, 1307408, 1350491, 1395111, 1441367, 1489419, 1539435, 1591340, 1644611, 1698379]
53393A698379N3435N2701N2020N1471N0835N0127M9696M9493M8617M6238M2747
53382B245759L9342L6470L3413K9620K5610K2068J8747J4857J0285N727J721j930
53370B481689n723r843j4229j9009k4666l1512l9051m6046n1503n5447n8446o0543
53358B065671o1223o0491n9299n8614n8508n8432n7961n6832n4770n1878m8973
53347A438690m6958m5899m5158m4320m3513m2835m2034m0791l9027l6837l4479
53336I76839l2353l0637k8898k6567k3848k1565j9951j8198j5678j2956j0977
53325G35211r697q328o691n346m409l177j377J81P93J014J848L279M545N514O792
53310G20152Q491R927J0762J1575J2853J4248J5382J6751J8986K1611K3354K3706
$$ y = [1698379, 1751814, 1804515, 1856535, 1908006, 1958841, 2008968, 2058664, 2108157, 2156774, 2203012, 2245759, 2285101, 2321571, 2354984, 2384604, 2410214, 2432282, 2451029, 2465886, 2476171, 2481898, 2483619, 2481689, 2475966, 2466123, 2451894, 2432885, 2408219, 2376707, 2337656, 2291610, 2240107, 2184660, 2126214, 2065671, 2004448, 1943957, 1884658, 1826044, 1767536, 1709104, 1651143, 1594311, 1539541, 1487663, 1438690, 1391732, 1345833, 1300675, 1256355, 1212842, 1170007, 1127973, 1087182, 1048155, 1011318, 976839, 944486, 913849, 884951, 858384, 834536, 812971, 793020, 774822, 759144, 746188, 735211, 725514, 717186, 710495, 705149, 700740, 697563, 696186, 696367, 697160, 698174, 700022, 703301, 707846, 713360, 720152, 728643, 738570, 749332, 760907, 773760, 788008, 803390, 820141, 839127, 860738, 884092, 907798]
53298I07798K3562K4239K6152K8556L0285L0760L0402L0060L0036K9878K9117
53287A220845K7758K5831K3076J9566J6230J4052J2890J1641R499O571L344J69
53275A391472k688n002o833q506j0241j1964j3545j4995j6480j8241k0365k2474
53263A240138k3952k4782k5761k7497k9459l0651l0957l1186l1839l2592l2966
53252I18496l2889l2382l1327k9764k8078k6649k5644k5123k4969k4691k3852
53241F13128k2704k1915k1594k1199k0504j9945j9748j9300j7878j5557j3058
53230C99726j0994r651r081q979q666p696o375n410n050m871m437l994m313n677
53216C04532p183p475o374n200n080n444m984l672k782k931l307l115k711k671
$$ y = [907798, 931360, 955599, 981751, 1010307, 1040592, 1071352, 1101754, 1131814, 1161850, 1191728, 1220845, 1248603, 1274434, 1297510, 1317076, 1333306, 1347358, 1360248, 1371889, 1381388, 1387959, 1391303, 1391472, 1388784, 1383782, 1376949, 1368443, 1358202, 1346238, 1332693, 1317698, 1301218, 1282977, 1262612, 1240138, 1216186, 1191404, 1165643, 1138146, 1108687, 1078036, 1047079, 1015893, 984054, 951462, 918496, 885607, 853225, 821898, 792134, 764056, 737407, 711763, 686640, 661671, 636980, 613128, 590424, 568509, 546915, 525716, 505212, 485267, 465519, 446219, 428341, 412784, 399726, 388732, 379081, 370000, 361021, 352355, 344659, 338284, 332874, 327824, 322953, 318516, 314522, 310209, 304532, 297349, 289874, 283500, 278300, 273220, 267776, 262792, 259120, 256338, 253407, 250100, 246985, 244274, 241603]
53202B41603k605j777l89N67M80m03j467k161k142j522q92p06p88o85l53j47k67
53185B26346n72q11q21o01l69l77n82p22p46q42r40o40R0O39M90j08n50o08m52
53166B17824k85k99o56j160j233o29J26L75J67Q8M78J159J682J569N70r02j887
53149B16987j794j029m16k41k24j09J73O38J109J161O15n4k91k27l86q02r52n24
53131B13634J52N30L27l56j138j577j483j061o13k99k35n28r48r66m35P0%l90
53113B04684m02J28O91P75L22l81q95r15n86m08n67o42k49L63O75N40J63l48r13
53094B02035j278j276j045p16k76j6n37j778k647k318j401r91j061p20J54O78
53078A86807L34l69p22n65q7M21M81k32j348k095k165j801j159l08K78P6o00q39
$$ y = [241603, 238998, 237221, 236832, 237399, 237879, 237476, 236009, 233848, 231706, 230184, 229292, 228586, 227798, 227113, 226760, 226613, 226346, 225774, 224963, 224142, 223541, 223172, 222795, 222213, 221491, 220745, 219903, 218963, 218323, 218413, 219052, 219542, 219434, 218884, 218276, 217824, 217539, 217240, 216584, 215424, 214191, 213562, 213688, 214063, 214230, 214318, 214796, 215955, 217637, 219206, 219776, 218874, 216987, 215193, 214164, 213748, 213507, 213283, 213174, 213347, 213985, 215094, 216255, 216870, 216816, 216525, 216298, 215912, 215110, 214158, 213634, 213786, 214316, 214643, 214287, 213149, 211572, 210089, 209028, 208415, 208116, 207881, 207353, 206405, 205439, 205004, 205074, 205074, 204684, 204282, 204410, 205101, 205876, 206198, 205817, 204922, 204007, 203421, 203013, 202446, 201804, 201555, 201918, 202593, 203133, 203296, 202948, 202035, 200757, 199481, 198436, 197720, 197444, 197428, 196891, 195113, 192466, 190148, 188747, 187756, 186695, 185975, 186129, 186807, 187141, 186772, 186050, 185485, 185398, 185819, 186300, 186068, 184720, 182625, 180460, 178659, 177500, 177192, 177470, 177546, 176946, 176107]
53060A76107m13Op2m13p32j059j161n31O42J322R07j5o01p63p76n39P6O95R27
53041A73607R83J234J487J255N29k09o13p20p17p94j028j162p98k0M80K44l34
53024A73424n64l49j17q8n4J76N17P32O27J95l30o57p54p92p96o19l50k71l59
53005A69571k31J81M11J43l17n54o50q38r55p14k85j10l23o68q57p55l69K5mm73
52985A62228p18j05J123K043K029J310N80L04L48K17l52j001j136p04k47j42j89
52968A65588r2J25L57O27Q31P20M78P52J693K428K129J173O09P13P99L65l00p09
52950A78286q00q02q70r86r88p20l49l76j030j796j967j580j332j579j881j597
52934A59633o47M40R57N50l79q71l42O74J093N25l40o80m29j39k02m66m72kN87
$$ y = [176107, 175694, 175700, 175628, 175215, 174483, 173424, 172263, 171732, 172374, 173696, 174603, 174588, 173987, 173224, 172448, 171909, 171985, 172680, 173607, 174590, 175824, 177311, 178566, 179095, 178886, 178273, 177553, 176836, 176042, 175014, 173852, 173054, 173034, 173514, 173758, 173424, 172860, 172511, 172394, 172306, 172252, 172428, 172945, 173677, 174304, 174499, 174169, 173512, 172758, 171966, 171170, 170551, 170201, 169930, 169571, 169340, 169521, 169932, 170075, 169758, 169204, 168554, 167716, 166761, 166047, 165762, 165652, 165329, 164661, 163804, 163049, 162680, 162705, 162701, 162228, 161510, 161405, 162528, 164571, 166600, 167910, 168490, 168794, 169142, 169359, 169007, 168006, 166870, 166166, 165919, 165777, 165588, 165496, 165621, 165978, 166605, 167436, 168156, 168634, 169386, 171079, 173507, 175636, 176809, 177418, 178131, 178930, 179295, 178995, 178286, 177486, 176684, 175814, 174828, 173840, 173120, 172771, 172395, 171365, 169569, 167602, 166022, 164690, 163111, 161230, 159633, 158986, 159426, 160383, 160933, 160554, 159683, 159341, 160015, 161108, 161633, 161293, 160613, 160184, 160045, 159843, 159377, 158905, 158903, 159490]
52915A59490O57N0o14o89l23j76m00m27J30Q39R24K00o85q96j93Q12J236Q32J53
52896A60920k37m09o70q44n47L7K91R6K8M90J167J565J566J198L95o61j345j275
52878A61765q08n23m49j98L33Q85J276J512J525J158M79k22o75o76r8Q43J463
52861A67590J286P16N79J023J472J685K151L077L663K982J257l62j142j275j206
52846A83496j073r28r32j083j104q80p09r24j474k080k509k548k031j177o26p72
52830A62646j253j439j205q44m59J25Q23J301J506J771K147K121J313J19p22j002
52814A66948j076j142r60m08J01J26k5M16J524K284J860R32J069K659M196L982
52798A82486K027k91j940k924l533l772l589l112k432j585q02m13m76q04j315
$$ y = [159490, 160147, 160197, 159583, 158894, 158571, 158395, 157995, 157568, 157698, 158537, 159461, 159661, 158976, 158080, 157887, 158699, 159935, 160767, 160920, 160683, 160274, 159604, 158760, 158213, 158250, 158541, 158637, 158665, 159155, 160322, 161887, 163453, 164651, 165046, 164385, 163040, 161765, 160957, 160434, 159985, 159787, 160120, 161005, 162281, 163793, 165318, 166476, 166955, 166733, 166058, 165382, 165284, 166127, 167590, 168876, 169592, 170171, 171194, 172666, 174351, 176502, 179579, 183242, 186224, 187481, 187119, 185977, 184702, 183496, 182423, 181495, 180563, 179480, 178376, 177496, 176787, 175863, 174389, 172309, 169800, 167252, 165221, 164044, 163418, 162646, 161393, 159954, 158749, 157905, 157446, 157571, 158394, 159695, 161201, 162972, 165119, 167240, 168553, 168672, 167950, 166948, 165872, 164730, 163770, 163362, 163463, 163589, 163564, 163980, 165504, 167788, 169648, 170580, 171649, 174308, 178504, 182486, 184513, 184222, 182282, 179358, 175825, 172053, 168464, 165352, 162920, 161335, 160533, 160120, 159644, 158840, 157525]
52783A57525j892k020j225Q0Q95R01P43Q55P88J43n47n54k4L34K79J37N6j00k58
52764A56116j56J22J47k14n28l79R1L75K39nJ16O21J027J054J072J472J816J269
52746A64255m6r12n33M59R77Q90Q26J059J232J021N03k2j96K32R52J146M16n25
52728A71734o56J21J042J521J551J301R26O89O35K60q89k314k983k647k012j593
52712A66686j159n69l37p88j298j071l59j62p83j368j141n14m46r77j112l30N02
52695A54774L27n09p50j07L79L5m91m70k62m47n89P3J213J789J615J470J750J984
52677A61784J720J072K78n38j083j122r60j055j212r25m04k73l12L52J625K249
52661A61196J658Q72Q94J200P40l66j087r16k24N48J246J823K400L281M432N150
$$ y = [157525, 155633, 153613, 152388, 152468, 153363, 154264, 155007, 155862, 156650, 156793, 156246, 155692, 155668, 156002, 156281, 156418, 156474, 156374, 156116, 155960, 156082, 156229, 156015, 155487, 155108, 155199, 155574, 155813, 155808, 155924, 156545, 157572, 158626, 159698, 161170, 162986, 164255, 164209, 163297, 162764, 163223, 164200, 165090, 165916, 166975, 168207, 169228, 169731, 169709, 169513, 169745, 170697, 171843, 172259, 171734, 171078, 171199, 172241, 173762, 175313, 176614, 177540, 178229, 178864, 179124, 178235, 175921, 172938, 170291, 168279, 166686, 165527, 164958, 164621, 163833, 162535, 161464, 161105, 160943, 160160, 158792, 157651, 157137, 156691, 155714, 154602, 154272, 154774, 155101, 154592, 153842, 153735, 154114, 154149, 153658, 153188, 152926, 152479, 151890, 151963, 153176, 154965, 156580, 158050, 159800, 161784, 163504, 164576, 164854, 164316, 163233, 162111, 161151, 160096, 158884, 157959, 157555, 157282, 156970, 157322, 158947, 161196, 162854, 163726, 164620, 165820, 166560, 166194, 165107, 164191, 163967, 164515, 165761, 167584, 169984, 173265, 177697, 182847]
52645A82847M803L573K067M91j159k480k960k797k738l051l237k819j945j099
52631A69496n11j04K13M00M06L81O20J129J445J198P56Q36J377J470O29n22j130
52614A78089j168j130j176j137j019q95n87M6P10J054J223J486J562R40k58j264
52598A76476j564j303q48l62J45P35J464K142K271J630P69M76Q28J199J146Q25
52582A86029M97J42l10p12q54p00l61L7M43R34J533J958J723P70k95q59r77j050
52564A87948j165j129r89r71j008q14l98n0J06J62R3k03n31n38k00J53L35L98
52546A81199L78K87L21O09Q96R11Q62J016R81J75j009j404o43K97M05k13q68j245
52528A82955j291p90K35J099J114M84pl1Q9Q9J24L58O03N31Q6l60k26P01J860
$$ y = [182847, 187650, 191223, 193290, 193781, 192622, 190142, 187182, 184385, 181647, 178596, 175359, 172540, 170595, 169496, 168985, 168881, 169094, 169494, 169900, 170281, 170901, 172030, 173475, 174673, 175429, 176265, 177642, 179112, 179741, 179219, 178089, 176921, 175791, 174615, 173478, 172459, 171564, 170977, 171023, 171733, 172787, 174010, 175496, 177058, 177998, 177740, 176476, 174912, 173609, 172761, 172399, 172544, 173279, 174743, 176885, 179156, 180786, 181555, 182031, 182859, 184058, 185204, 186029, 186526, 186668, 186358, 185646, 184792, 184092, 183731, 183768, 184211, 185145, 186678, 188636, 190359, 191129, 190834, 189975, 188998, 187948, 186783, 185654, 184665, 183694, 182686, 181872, 181474, 181424, 181530, 181692, 181785, 181582, 181051, 180513, 180313, 180466, 180801, 181199, 181577, 181864, 182185, 182794, 183690, 184601, 185463, 186479, 187460, 187635, 186626, 185222, 184579, 184876, 185281, 185068, 184200, 182955, 181664, 180874, 181109, 182208, 183322, 183806, 183799, 183768, 183857, 183946, 184070, 184428, 185031, 185562, 185648, 185288, 185062, 185763, 187623]
52509A87623K331J817R88O27Q06J123J483K084K824L247L018K168R00m93j596
52494B08950k105k139j998j658q91J19O66K99o14j249j141m82J90M58K87l1k13
52477A98448k63l23k54L47J534K662K916K172J120N19N50Q82J135J120Q45N23
52461B13933M78Q22J229J282J004P63O41K78m93j241j480j378j417j572j352p17
52445B10780l00n31r70r48n27l94r27j727k130j889j325r48j025j403j703j672
52429A92361j287o44Q0N55M94Pm22m33o2N13J186J709J662J031M62N20Q99Q71
52411A99502L86R1L12O76R22J395K338L252L584L740M704O678Q629R360Q568O648
52395B60785L944O23k846n577o815o547n493m495l862l272k330j225o30p99j071
$$ y = [187623, 189954, 191771, 192759, 193386, 194192, 195315, 196798, 198882, 201706, 204953, 207971, 210139, 211039, 210546, 208950, 206845, 204706, 202708, 201050, 200159, 200278, 200944, 201243, 200629, 199380, 198239, 197757, 197947, 198405, 198692, 198661, 198448, 198185, 197862, 197608, 197955, 199489, 202151, 205067, 207239, 208359, 208878, 209428, 210310, 211445, 212565, 213410, 213933, 214411, 215233, 216462, 217744, 218748, 219511, 220152, 220430, 219937, 218696, 217216, 215838, 214421, 212849, 211497, 210780, 210480, 209949, 208979, 208031, 207504, 207110, 206183, 204456, 202326, 200437, 199112, 198164, 197139, 195736, 194033, 192361, 191074, 190430, 190510, 191065, 191559, 191566, 191144, 190711, 190649, 191162, 192348, 194057, 195719, 196750, 197212, 197732, 198631, 199502, 199888, 199979, 200291, 200967, 201889, 203284, 205622, 208874, 212458, 216198, 220902, 227580, 236209, 245569, 254137, 260785, 264729, 265352, 262506, 256929, 250114, 243567, 238074, 233579, 229717, 226445, 224115, 222890, 222260, 221461, 220390]
52380B20390o02N09J310J232P85P15R63R53O52O29J069J375J120P41R18J576K037
52363B36372J985J668J230N11l80q60o47k64l29o50n95k26l20j158j888j571m36
52346B32442M25M82K82M84R83J235J108R56J044J326J726K273K850L133K957K533
52330B56239K229K232K533L101L904M845N784O539O910O788O335N862N523N252
52316C24076N030M962M939M614L914L309L223L423L406L146K953K802K378J808
52302C73983J608J784J725J280J233K124L239L519K991K480K160J462L45l75k59
52287C99299P4m7m22n87o82j026j320j024k91K04K05P5J60N43J343K562L686M028
52269D06780L606L133L036L081L000K957L121L391L813M658N800O448O016M862
$$ y = [220390, 219788, 220297, 221607, 222839, 223624, 224339, 225302, 226255, 226907, 227536, 228605, 229980, 231100, 231841, 232759, 234335, 236372, 238357, 240025, 241255, 241766, 241386, 240526, 239879, 239615, 239286, 238636, 238041, 237815, 237495, 236337, 234449, 232878, 232442, 232867, 233349, 233631, 234115, 235098, 236333, 237441, 238397, 239441, 240767, 242493, 244766, 247616, 250749, 253706, 256239, 258468, 260700, 263233, 266334, 270238, 275083, 280867, 287406, 294316, 301104, 307439, 313301, 318824, 324076, 329106, 334068, 339007, 343621, 347535, 350844, 354067, 357490, 360896, 364042, 366995, 369797, 372175, 373983, 375591, 377375, 379100, 380380, 381613, 383737, 386976, 390495, 393486, 395966, 398126, 399588, 399933, 399558, 399299, 399373, 399326, 398904, 398317, 397635, 396609, 395289, 394265, 393974, 394178, 394383, 394458, 394618, 395161, 396504, 399066, 402752, 406780, 410386, 413519, 416555, 419636, 422636, 425593, 428714, 432105, 435918, 440576, 446376, 452824, 458840, 463702]
52255D63702L787L118K712K472K443K615L028L812M786N288M874L930L179K835
52241E12581K640K441K211J781J236J267K439M170N169M878L859K856K252K370
52227E52150L372M631N094M618M178M379M645M365M035M396N126N359N110N184
52213F16642N838O408O367N947N616N489N461N441N343N186N252N709O114N814
52199F96627M885M119L948L946L566K907K426K276K329K447K467K247J970K124
52185G38284K797L329L012J975R44L78K02K17K35j47j331l097m631n417n792o295
52169G24663o783o594n571m499m241m647m641l447j513K3N60M63L95O63J314K376
52153F88521L591M272L861K574J082l07j663k705k741j611j66O66J000J609K645
$$ y = [463702, 467489, 470607, 473319, 475791, 478234, 480849, 483877, 487689, 492475, 497763, 502637, 506567, 509746, 512581, 515221, 517662, 519873, 521654, 522890, 524157, 526596, 530766, 535935, 540813, 544672, 547528, 549780, 552150, 555522, 560153, 565247, 569865, 574043, 578422, 583067, 587432, 591467, 595863, 600989, 606348, 611458, 616642, 622480, 628888, 635255, 641202, 646818, 652307, 657768, 663209, 668552, 673738, 678990, 684699, 690813, 696627, 701512, 705631, 709579, 713525, 717091, 719998, 722424, 724700, 727029, 729476, 731943, 734190, 736160, 738284, 741081, 744410, 747422, 749397, 750341, 750719, 750921, 751138, 751373, 751226, 749895, 746798, 742167, 736750, 730958, 724663, 717880, 711286, 705715, 701216, 696975, 692328, 687687, 684240, 682727, 682750, 683310, 683773, 684168, 684831, 686145, 688521, 692112, 696384, 700245, 702819, 703901, 703594, 701931, 699226, 696485, 694874, 694708, 695374, 696374, 697983, 700628]
52138G00628L261K701J204l66j529k468l363l940l809l063k219j513n83R51K786
52123F88678M208N026N879P411R423J1172J2301J3093J3831J4309J4129J3243
52111H12703J1968J0566Q987P001M529J828o15k457l786m914n919o498o375n691
52097H21327m847l989k821j029J197L151M181M317M257M690N592O186N578L501
52083H51291N52k261m296n660o749p427o950m956k234j49O44N94M44N07P35J070
52067H15155J414J584J591J747K224K673K562J705L38j111k113k269j851j888
52053H21761l159n135o403o179m993l806k938k186j556j444k108l303m507n333
52039G68711n720n813n747n495m964m190l397k795k290j474O7K257M418N774O162
$$ y = [700628, 703889, 706590, 707794, 707428, 705899, 703431, 700068, 696128, 692319, 689256, 687037, 685524, 684941, 685892, 688678, 692886, 697912, 703791, 711202, 720625, 731797, 744098, 757191, 771022, 785331, 799460, 812703, 824671, 835237, 844224, 851225, 855754, 857582, 856967, 854510, 850724, 845810, 839891, 833393, 827018, 821327, 816480, 812491, 809670, 808641, 809838, 812989, 817170, 821487, 825744, 830434, 836026, 842212, 847790, 851291, 851843, 849582, 845286, 839626, 832877, 825450, 818500, 813544, 811310, 811161, 811805, 812399, 812843, 813350, 814085, 815155, 816569, 818153, 819744, 821491, 823715, 826388, 828950, 830655, 830993, 829882, 827769, 825500, 823649, 821761, 818602, 813467, 807064, 800885, 795892, 792086, 789148, 786962, 785406, 783962, 781854, 778551, 774044, 768711, 762991, 757178, 751431, 745936, 740972, 736782, 733385, 730590, 728300, 726826, 726893, 729150, 733568, 739342, 745504]
52024G45504O029N773N350M726M303M440M807M656L728K490J467Q04N07O23J027
52009G96234J352J332R37J18j149k530l613m677o537r205j1384j1988j1763j2440
$$ y = [745504, 751533, 757306, 762656, 767382, 771685, 776125, 780932, 785588, 789316, 791806, 793273, 794077, 794584, 795207, 796234, 797586, 798918, 799855, 799973, 798824, 796294, 792681, 788004, 781467, 772262, 760878, 748890, 737127, 724687]
$$ [...]
##END NTUPLES=NMR SPECTRUM
##END=
