
##TITLE=AC1251_CAMARS11069_6666575_Mi8tgwo5B0
##JCAMPDX= 6.0         $$ Bruker NMR JCAMP-DX V2.0
##DATA TYPE= NMR SPECTRUM
##DATA CLASS= NTUPLES
##ORIGIN= BRUKER
##OWNER= Administrator
$$ 1.72 TOPSPIN		Version 2.1
$$ 2012-08-13 19:52:49.156 -0500  Administrator@TOPSPIN
$$ Compression mode = diff/dup
##.OBSERVE FREQUENCY= 400.02188249412
##.OBSERVE NUCLEUS= ^1H
##.ACQUISITION MODE= SIMULTANEOUS (DQD)
##.ACQUISITION SCHEME= undefined
##.AVERAGES= 8
##.DIGITISER RES= 22
##SPECTROMETER/DATA SYSTEM= spect
##.PULSE SEQUENCE= zg30
##.SOLVENT NAME= COFFEE_meoh
##.SHIFT REFERENCE= INTERNAL, COFFEE_meoh, 1, 14.98509
##AUDIT TRAIL= $$ (NUMBER, WHEN, WHO, WHERE, PROCESS, VERSION, WHAT)
$$ ##TITLE= Audit trail, TOPSPIN		Version 2.1
$$ ##JCAMPDX= 5.01
$$ ##ORIGIN= Bruker BioSpin GmbH
$$ ##OWNER= Administrator
$$ $$ C:\Bruker\TOPSPIN/data/COFFEE/nmr/AC1251_CAMARS11069_6666575_Mi8tgwo5B0/10/pdata/1/auditp.txt
$$ ##AUDIT TRAIL=  $$ (NUMBER, WHEN, WHO, WHERE, PROCESS, VERSION, WHAT)
(   1,<2012-08-13 19:52:41.343 -0500>,<Administrator>,<TOPSPIN>,<go>,<TOPSPIN 2.1>,
      <created by zg
	started at 2012-08-13 19:51:34.859 -0500,
	POWCHK enabled, PULCHK disabled,
       configuration hash MD5:
       6B 1B 68 BB D9 2E 58 E2 7F 35 AD 54 07 DF 0E 41
       data hash MD5: 64K
       C9 82 56 40 65 13 E5 7B BD 25 2A 7F F8 4A 7A D8>)
(   2,<2012-08-13 19:52:44.875 -0500>,<Administrator>,<TOPSPIN>,<proc1d>,<TOPSPIN 2.1>,
      <Start of raw data processing
       efp LB = 0 FT_mod = 6 PKNL = 1 PHC0 = 0 PHC1 = 0 SI = 32K 
       data hash MD5: 32K
       74 FA CF A6 12 A3 B2 37 8F 99 6C 2D 80 F6 40 64>)
(   3,<2012-08-13 19:52:45.171 -0500>,<Administrator>,<TOPSPIN>,<proc1d>,<TOPSPIN 2.1>,
      <pk PHC0 = 182.5818 PHC1 = 0 
       data hash MD5: 32K
       65 00 51 71 97 AE B5 D6 D3 5F 64 A8 4D 27 CA 45>)
(   4,<2012-08-13 19:52:45.328 -0500>,<Administrator>,<TOPSPIN>,<proc1d>,<TOPSPIN 2.1>,
      <abs ABSG = 1 
       data hash MD5: 32K
       3E 0C F4 90 E4 9C FD 98 12 97 B6 B4 C5 31 7D F1>)
(   5,<2012-08-13 19:52:45.437 -0500>,<Administrator>,<TOPSPIN>,<proc1d>,<TOPSPIN 2.1>,
      <abs ABSG = 2 
       data hash MD5: 32K
       70 14 9F 28 F6 FA EC BD 07 93 22 DD B4 E4 E3 2F>)
(   6,<2012-08-13 19:52:45.468 -0500>,<Administrator>,<TOPSPIN>,<proc1d>,<TOPSPIN 2.1>,
      <abs ABSG = 3 
       data hash MD5: 32K
       B1 F1 BA C0 6A CE 62 11 9A 92 C2 F4 9E 5B B5 26>)
(   7,<2012-08-13 19:52:45.531 -0500>,<Administrator>,<TOPSPIN>,<proc1d>,<TOPSPIN 2.1>,
      <abs ABSG = 4 
       data hash MD5: 32K
       D9 D4 0A 4A F2 6F 6A 55 7F 20 5B 0E AF B4 CE AE>)
(   8,<2012-08-13 19:52:45.562 -0500>,<Administrator>,<TOPSPIN>,<proc1d>,<TOPSPIN 2.1>,
      <abs ABSG = 5 
       data hash MD5: 32K
       4A 43 C5 33 6A 08 AF BF 78 DE D1 D0 2D 2E 53 B3>)
$$ ##END=
$$ 
$$ $$ hash MD5
$$ $$ 24 DE 7A 5E 91 9C 33 98 CC D1 65 45 5E BD 7B 85
##$RELAX= 
##$RELAX= 
##$RELAX= 
##$RELAX= 
##$RELAX= 
##$RELAX= 
##$RELAX= 
$$ Bruker specific parameters
$$ --------------------------
$$ [...]
150 150 150 150 150 150 150 150
##$TP07= 0
##$TPNAME0= <>
##$TPNAME1= <>
##$TPNAME2= <>
##$TPNAME3= <>
##$TPNAME4= <>
##$TPNAME5= <>
##$TPNAME6= <>
##$TPNAME7= <>
##$TPOAL= (0..7)
0.5 0.5 0.5 0.5 0.5 0.5 0.5 0.5
##$TPOFFS= (0..7)
0 0 0 0 0 0 0 0
##$TUNHIN= 0
##$TUNHOUT= 0
##$TUNXOUT= 0
##$USERA1= <user>
##$USERA2= <user>
##$USERA3= <user>
##$USERA4= <user>
##$USERA5= <user>
##$V9= 5
##$VALIST= <valist>
##$VCLIST= <CCCCCCCCCCCCCCC>
##$VD= 0
##$VDLIST= <DDDDDDDDDDDDDDD>
##$VPLIST= <PPPPPPPPPPPPPPP>
##$VTLIST= <TTTTTTTTTTTTTTT>
##$WBST= 1024
##$WBSW= 4
##$XGAIN= (0..3)
0 0 0 0
##$XL= 0
##$YL= 0
##$YMAX_a= 472599
##$YMIN_a= -608667
##$ZGOPTNS= <>
##$ZL1= 120
##$ZL2= 120
##$ZL3= 120
##$ZL4= 120
##$ABSF1= 14.98509
##$ABSF2= -5.573092
##$ABSG= 5
##$ABSL= 3
##$ALPHA= 0
##$AQORDER= 0
##$ASSFAC= 0
##$ASSFACI= 0
##$ASSFACX= 0
##$ASSWID= 0
##$AUNMP= <proc_prof1d_extract_pilot.lims>
##$AXLEFT= 0
##$AXNAME= <>
##$AXNUC= <1H>
##$AXRIGHT= 0
##$AXTYPE= 0
##$AXUNIT= <>
##$AZFE= 0.1
##$AZFW= 0.1
##$BCFW= 0
##$BC_mod= 0
##$BYTORDP= 0
##$COROFFS= 0
##$CY= 15
##$DATMOD= 1
##$DC= 0
##$DFILT= <>
##$DTYPP= 0
##$F1P= 0
##$F2P= 0
##$FCOR= 0.5
##$FTSIZE= 32768
##$FT_mod= 6
##$GAMMA= 0
##$GB= 0
##$INTBC= 1
##$INTSCL= 1
##$ISEN= 128
##$LB= 0
##$LEV0= 0
##$LPBIN= 0
##$MAXI= 10000
##$MC2= 0
##$MEAN= 0
##$ME_mod= 0
##$MI= 0
##$NCOEF= 0
##$NC_proc= -8
##$NLEV= 6
##$NOISF1= 0
##$NOISF2= 0
##$NSP= 0
##$NTH_PI= 0
##$NZP= 0
##$OFFSET= 14.98509
##$PC= 1
##$PHC0= 182.5818
##$PHC1= 0
##$PH_mod= 1
##$PKNL= yes
##$PPARMOD= 0
##$PPDIAG= 0
##$PPIPTYP= 0
##$PPMPNUM= 2147483647
##$PPRESOL= 1
##$PSCAL= 4
##$PSIGN= 0
##$PYNMP= <proc.py>
##$REVERSE= no
##$SF= 400.02
##$SI= 32768
##$SIGF1= 0
##$SIGF2= 0
##$SINO= 400
##$SIOLD= 32768
##$SPECTYP= <>
##$SREGLST= <1H.CDCl3>
##$SSB= 0
##$STSI= 32768
##$STSR= 0
##$SW_p= 8223.68421052631
##$SYMM= 0
##$S_DEV= 0
##$TDeff= 65536
##$TDoff= 0
##$TI= <>
##$TILT= no
##$TM1= 0
##$TM2= 0
##$TOPLEV= 0
##$USERP1= <user>
##$USERP2= <user>
##$USERP3= <user>
##$USERP4= <user>
##$USERP5= <user>
##$WDW= 1
##$XDIM= 32768
##$YMAX_p= 476778129
##$YMIN_p= -693253
##$CURPLOT= <Network HP LaserJet P1505>
##$CURPRIN= <$Network HP LaserJet P1505>
##$DFORMAT= <normdp>
##$LAYOUT= <+/1D_H.xwp>
##$LFORMAT= <normlp>
##$PFORMAT= <normpl>
##$SURQMSG= 1
$$ End of Bruker specific parameters
$$ ---------------------------------
##NTUPLES= NMR SPECTRUM
##VAR_NAME=  FREQUENCY,     SPECTRUM/REAL,   SPECTRUM/IMAG
##SYMBOL=    X,             R,               I
##VAR_TYPE=  INDEPENDENT,   DEPENDENT,       DEPENDENT
##VAR_FORM=  AFFN,          ASDF,            ASDF
##VAR_DIM=   32768,         32768,           32768
##UNITS=     HZ,            ARBITRARY UNITS, ARBITRARY UNITS
##FACTOR=    0.250966925370066, 1,           1
##FIRST=     8223.43324360094, 127449,       -26213
##LAST=      0,             -167157,         -313424
##MIN=       0,             -693253,         0
##MAX=       8223.43324360094, 476778129,    0
$$ Real data points
##PAGE= N=1
##DATA TABLE= (X++(R..R)), XYDATA
$$ [...]
23801 26951 35052 -74873 76086 -70207 -116018 46010 392241 -112915 -20091 -10594 64850 128158
23789 128158 -278554 -135254 -166638 212384 72798 -294597 -69307 -15375 325423 165090
23779 165090 149749 68139 49722 116741 5265 78279 158837 37570 -50807 -138597 -131408 -167947
23767 -167947 -222980 -230920 302360 -135163 -56589 98410 -70158 -366664 -73456 -185403 -390820
23756 -390820 -86732 -199422 -114806 257635 141178 -233613 -322929 35825 -353077 84021
23745 16719 -9031 -47857 -292330 -195214 -46351 -231312 -167263 280291 15282 121726 -270017
23733 236473 -63220 285822 -232959 168351 342237 358107 -138713 222367 -168491 -73833
23722 -233018 -10208 -79602 -35082 -152651 -151036 -219689 -504191 153207 112265 281699 24165
23710 -283494 -23502 -364592 -332521 -336709 73895 299524 35551 227845 -101348 -74388 13702
23698 -115479 -46062 72040 -41249 -267312 20719 164549 -188421 -338224 153664 -311127
23687 350346 -326957 75348 118004 59407 -356650 -197493 310207 -47494 -223973 -206035
23677 -206035 -157256 -333245 -193971 305003 23 -62374 108808 169737 -198460 -59735 64076
23665 -173105 -466897 -6351 26104 -5738 -244323 -137409 -319722 -272512 111847 238665 34951
23653 -332670 31142 130496 78969 -128861 -132497 -56855 -75561 -231432 146632 -60113 -170312
23642 -170312 -64615 3051 -78322 105541 -13076 264 99596 -116221 344834 65186 -295697
23630 -65146 -128580 -265760 276806 278429 179996 -400486 -120079 214547 -49789 288150 144053
23618 -160984 71543 -293562 -186771 371991 -135181 215233 362125 -201187 -65989 -188663
23608 -188663 -215884 -310666 26475 -31236 -49741 -132945 -301626 -21113 -78098 25006 -22837
23596 -261354 -184108 -446402 194623 56463 -275768 49946 55690 490805 167430 -22707 41073
23584 83555 144053 141303 -112149 320481 -64424 -33763 -42653 -116424 -33190 80456 47672 72718
23572 72718 34729 -181055 2591 134997 46121 -33467 80388 -100982 -366696 261766 -201070
23560 -238538 128202 -31443 -275488 71426 201772 95275 -111917 124365 -236202 102020
23549 223926 -134747 227458 -50558 49281 219925 176165 -44447 138472 -226747 82999
23538 -138566 -352049 250688 297213 -272193 -530862 182576 81924 -134550 45213 -20578
23527 -15269 77310 -245150 123855 -30046 59122 194072 54843 184465 241227 -225891 -259704
23516 -259704 -193329 -96728 -233319 -256530 -103354 -44320 54039 14228 66193 336811 -54983
23504 -162203 15466 -114771 1761 105712 150257 40955 -103231 -361510 148470 40128 -25169
23492 -198917 456975 12854 -223898 -44297 -40743 75059 -13901 -201225 -204710 144488 -85196
23480 128308 300631 101238 -24252 236532 214759 -149507 379555 -176111 2473 -8321 -160847
23469 -160847 153434 130692 141867 -95703 -33907 16234 37818 -354678 270174 5845 -236577
23457 171044 211929 214319 31433 -222589 -80672 8038 57182 -259445 -159961 15802 -63775
23445 190552 344218 262571 -156801 173559 -17528 -186292 -127180 -102695 22914 91275 53911
23434 53911 231096 40982 -11131 -49359 208469 -51016 -121628 -61582 -36487 -157305 -299982
23423 -299982 -253924 35661 -219112 -335677 -198665 -402933 -168867 -350030 95538 100034
23413 100034 -300851 208060 -129237 -147913 -173783 155546 -21820 244026 73640 76291 84931
23402 84931 -260380 169884 25347 71666 -82857 -128891 137042 -47020 -104626 -142391 -33578
23390 111317 82352 101534 -103982 -129448 -139142 -56176 -335559 -102208 -173541 224572 -22155
23378 71643 -178754 212901 -176144 108892 -79986 -187293 -252537 -33904 14888 -164521
23367 -156369 -84612 50835 -104394 382441 -111782 274211 -141774 -108032 200596 352075
23357 352075 188128 -117191 -290657 -139831 97095 8583 -116557 24077 177128 -191553
23346 -296435 -193026 4089 143198 -331227 140159 180045 -58581 118848 -152355 -52910
23335 6936 114573 104538 369413 202861 -212913 -11409 -83755 -119462 -89445 -168884 95045
23323 -57446 69383 -177605 -185018 108458 177551 113092 -125995 -247752 -61051 116986 115237
23312 115237 365350 -213373 -100874 -251786 150802 149696 -26080 -87735 -149991 173304
23301 -194099 239439 -188926 -38122 -1648 47973 -215549 176734 22429 -137135 -149193 29084
23289 -27792 -179207 -70866 -28118 -202855 -264384 427975 -74030 65282 -90154 -71421 -88143
23278 -88143 157081 37759 -169986 94304 -254332 -284570 131283 180324 241308 119863 -84807
23266 99171 164034 311620 -333694 -30716 24262 104888 -286206 -30608 -8436 5812 81422
23255 81422 -128584 -8927 10595 85387 139542 -4517 -58188 80082 -154674 -357926 -193670
23244 -193670 53127 9340 -231001 192701 -153430 -186229 21721 -158370 57317 -19559 -312998
23233 -312998 -56910 191793 25637 -234964 -93329 111406 -13116 103026 -61241 -201307
23223 -201307 76072 56179 -367237 -48090 -118284 -99315 249787 233050 -72434 63547 -17162
23211 -61085 58421 245289 32291 -53952 84799 14920 9894 -121497 -38205 88443 -104422
23199 -69653 -332183 -45366 100694 440416 177429 7869 -45403 95029 94717 -129024 56170
23187 -149211 -156348 -178383 -287542 -169861 -103904 -543965 -62738 -114963 237544 -201069 331263
23175 202507 6057 -87414 -290563 -139805 -199978 -175654 -283101 -70658 -8956 -174970 134757
23163 75015 -43735 -132416 -181089 54750 -109683 110623 53040 -142285 277752 -52001 -131220
23152 -131220 106819 93266 102670 155740 9694 -6093 -277431 16317 173249 -133553 357136
23140 202563 -168756 -808 -45335 -98735 -39873 63454 20429 -36151 -73237 265093 -104609
23128 88578 130846 292495 -195824 -96851 312734 -207295 79922 852 -17465 66098 -109235
23116 -59988 127017 -233863 70599 -86679 -15760 -153201 184013 -35695 -439030 37184 117103
23105 117103 -91033 81541 -117900 260736 -124696 155799 -44345 193970 252903 -239565
23094 -76052 -329698 -201217 -72735 131049 165797 -163859 98569 37159 -31468 -79869 286021
23082 -12700 -39598 -179930 -31963 60300 -214167 -301355 76720 101594 -201552 -207220 -544928
23071 -544928 -442821 -9765 23710 -132574 -212811 -56277 162053 315972 45079 -29530 48633
23059 -179817 -249131 218210 -102113 231298 -229496 213288 169385 347625 88028 23739
23048 44102 274677 -20299 87534 95119 104975 575397 -71359 -279622 -70923 208076 73372
23036 134944 -62321 -66255 -310262 52985 305520 247369 61475 2561 -38680 -357737 736 -245266
23023 -308651 -244662 -234235 -27967 432 437219 -78430 325118 -364962 162822 -242975 197368
23011 29825 -107607 -139196 -185848 60388 -256749 -12921 -53029 -151592 33856 -238945 211979
22999 -99644 214775 6628 -26086 -127370 -173751 -124730 63801 -105816 131997 5799 -4090
22987 -176569 -16228 -17761 2782 78125 -222326 20480 -158970 -37491 90563 246057 -199888
22975 -28582 -119090 -350473 194681 -317581 305011 28975 -178339 -264023 72795 117600 31295
22963 -209855 68707 167089 57479 204559 -156106 -182666 -132796 -183873 -264387 106109 196859
22952 196859 120251 -85404 24614 165261 61886 16660 -154963 70530 -9391 -49947 83372
22940 201502 -254100 119362 -133248 75519 -15553 -281737 -120008 192228 196986 114988
22930 114988 -222624 23297 -341129 -111733 -62565 108954 237077 -8078 372871 82325
22919 151762 -16761 164109 54162 -52318 -526442 -58700 -53268 39413 123219 68397 273363
22908 273363 -316868 -244437 49960 -155497 -123120 12549 23497 -29755 -155534 -5362 -78410
22897 -78410 -240540 299040 -99957 -38957 257932 320850 -165937 170700 -234715 146491
22886 -253882 -78777 -50429 -19919 41063 -285535 368630 -48370 319538 78239 155832 -173423
22874 -120470 39457 -8232 -33787 -116142 -206792 138480 199049 -58423 -10500 -16719 -564267
22863 -564267 33313 316994 -217388 78286 152206 212495 -81192 -66971 274551 137130 -189453
22851 -128454 -156320 -359673 -245382 -21393 -305333 3223 -253461 -139966 178179 -195152
22840 -28663 137780 -259590 172008 128366 -164359 -75680 75493 22876 3819 330911 -173811
22828 -55735 22486 -478056 66320 208076 -8988 -249680 256341 -116275 -5437 -224762 -105355
22816 -145634 69702 11425 101232 54047 -22243 63021 -120384 -48113 -162285 -43452 -236021
22805 -236021 -60323 -41207 167768 -23161 -38316 9022 275551 -95074 -98299 -183524 1693 -29823
22792 11168 -522822 -145766 75758 -268380 283974 -502494 -92492 179876 -165393 -229716
22782 -229716 -89406 -38877 36668 -65371 -380498 -189449 29661 -145505 311852 -99565 -414172
22771 -414172 -125552 90271 125156 22413 -346525 -77523 -14057 -71488 -177504 -111030 -123458
22760 -123458 -1616 -157154 330791 -101641 96384 47915 2413 230322 -144193 -39738 123658
22748 69706 -161746 47333 -228679 -132155 -157989 -119237 259796 -11186 -310208 -258245 119484
22736 -292437 112593 -211474 140602 -136312 103731 112820 -261335 -130058 32414 -53828
22725 -34177 -148758 90823 -201872 -59197 50012 201071 -147248 -104251 -396424 89214 -336482
22713 -168747 131924 64952 346753 -224206 155459 283792 62906 205295 186516 -160503
22702 -271614 238612 -21159 -188938 -114194 -19756 -127813 94408 -185154 94012 -230282
22691 -217214 41194 -256336 205986 -6493 -84214 -176421 16324 -79644 -319100 -234317 117282
22679 -327702 -49015 -53372 -135040 -112865 270025 -90513 -210740 150280 234472 -34497 -46208
22668 -46208 161010 -253516 -263839 93647 -55448 -163111 -5919 -66522 -52606 -123614 -38437
22656 279311 -101586 -374494 -64012 -328947 63061 -55977 -226787 264552 133217 -91616
22645 288851 259246 -225165 -432343 209413 -74393 -143496 179544 -119762 -131745 -380255
22635 -380255 -140895 -372478 -314229 -107766 -135798 -4998 -42107 151685 84436 -86528 -135467
22624 -135467 10601 -241661 41698 255399 -221342 -345783 -103237 37038 -142978 -53201
22613 -21203 -192062 -179588 -130456 167934 -3912 -10122 -140464 -135767 -158447 178655 -53087
22601 -161766 -173506 -272629 -311051 -96711 -210637 -11840 12442 149178 -157315 -214405 330050
22589 -4554 22063 398899 -40219 -84068 184782 -285088 -20965 176345 -156741 389558 -139939
22577 -74048 -42022 58976 97221 -278930 248980 -11266 -222689 180561 67850 -224480 14148
22565 -44297 98552 52054 121348 110044 45224 -135981 92458 31094 280140 132123 -133608
22553 108061 -168415 -180795 279668 72684 40266 86046 127800 38687 -353152 -161382 -179200
22542 -179200 54785 15100 -152501 -237906 191928 -12044 -311658 126566 -168156 2509 -162529
22530 97361 60947 -52069 -126920 -439431 -254133 -24753 -101043 32955 -18775 309266 131467
22518 -65444 -107810 -146848 -12249 54434 17642 -362 189435 94036 -20624 -22750 41138 -69466
22505 -50230 -52981 59985 92734 -63830 -136175 -284137 -156638 87432 61952 176350 57868
22493 5381 179973 50125 112737 -64793 25268 128537 -110399 -229250 -25787 -275933 -154216
22482 -154216 -21729 9962 112864 60104 -38275 302456 -144790 -247146 -89457 27968 -103906
22470 -137173 -68207 151113 -75145 27339 -206671 21917 -291961 -272038 -167954 -239131 -22015
22458 61846 -85790 25411 258696 285856 117709 143829 -237818 111131 150327 211888 127124
22447 127124 104025 102152 -126614 -30173 -439413 -32753 97641 -12626 113515 -20891 -226715
22436 -226715 -97491 244321 183528 -31540 -121875 -26772 207844 9788 -275019 8566 -87073
22424 -20676 -140815 -437351 172457 354135 -122527 -53991 -121463 -74150 57298 -170186
22413 -153483 14734 112318 -539811 24031 -323840 -15323 -168020 39097 23103 29561 15764
22402 15764 77618 -36626 279448 -340152 162246 -211897 -144255 -92907 -151148 160382 89614
22391 89614 -95743 31115 -110236 -307480 29730 -92503 216331 -152680 -9946 -173929 -126605
22380 -126605 -111257 -36281 -218012 -88754 32204 83459 77977 -459660 -9132 -288165 -155268
22369 -155268 406459 28173 87321 309158 -186176 -75089 -175349 -175748 -55423 67317 -352206
22357 -118953 -255316 -94993 -399906 115410 113477 108370 -114583 -44727 142658 -23182 122173
22345 219523 -221844 -396164 -27799 -199899 73909 -302861 -209389 105180 -7406 -102785 -116782
22334 -116782 98461 -50349 185115 -66032 86075 -271492 66886 -232039 -160342 72746 69173
22323 69173 -229045 -56845 -30757 -126040 -76910 -485146 -333390 -225247 -41513 -351985 -25335
22311 -28440 328919 -184219 56721 -41379 247166 -215031 -30699 -20863 -149181 14234 -76895
22299 -27758 -179316 29541 110000 -125603 -114566 87839 -326916 -85314 196917 -82819 -191002
22288 -191002 -309149 -209672 -14689 91748 53891 -326316 199040 4511 49462 -145944 -239357
22277 -239357 -225318 -95262 190746 -45347 6752 -17435 112426 348041 -540572 -40873 -69072
22266 -69072 44195 -142700 87811 110850 -3652 162608 -55615 96505 -41985 -42753 73188 25095
22253 104419 -139679 -377427 -396697 -34162 226164 51129 -131580 -116139 36210 70343 -284880
22241 20230 -36034 116486 96085 -115614 40130 238586 89353 -175883 74047 30940 98473
22230 98473 -27980 94284 -18694 -427524 -31516 -197368 14376 -289263 -295561 265051 -66615
22218 -349192 96088 -211082 133556 -180491 135514 -126029 -154649 -112489 105975 167077
22208 167077 -213244 121413 -179682 -114581 -221645 57186 -314745 67072 44166 173124
22198 173124 -234142 -230587 126220 154679 -251131 27417 -200057 -39962 30437 -91523 -80079
22187 -80079 -72805 140719 -159148 116904 27673 140216 -66617 -18816 5449 -276965 -151442
22176 -151442 -207213 -66070 -36479 421666 -73110 -276857 104797 -108147 -103512 10389 186669
22165 186669 7064 239832 -290508 -136810 -228665 -147410 -356299 -41025 -247050 -27003 -28547
22154 -28547 -62906 -50497 -57326 324613 60813 -48304 -140590 -240800 -152709 -275382 198194
22142 153228 -87092 125969 332627 -107740 49438 97382 -397511 18040 66005 -27136 -208708
22131 -208708 255063 -152892 -189184 -42890 -537567 30063 1572 204189 213704 -233730 132488
22119 -37242 -126867 -312209 191551 -167081 -39099 48277 25936 -34466 48730 254545 -288067
22107 -86801 69644 70986 171569 215193 35045 -165838 200454 165463 -2413 -120575 90724
22095 -41519 -176388 18638 -217459 -262478 46824 229225 -352707 18382 -276553 -1734 -74437
22084 -74437 164562 -226953 -26835 -35450 -85334 -204517 -20845 -110506 -163545 19986 -265564
22072 -334464 268837 -173752 53230 -59023 -239718 -336690 147042 -223865 198656 -112189
22061 146858 -205674 137731 -291633 -42321 478934 18754 -337881 -19361 -245700 -169282
22051 -169282 35786 -418331 -263410 5359 -324590 133507 31277 -112306 -72331 -40611 139971
22039 -223710 94092 31610 -74959 -538829 -230760 119049 192865 22867 -66712 -188368 -91525
22027 -57963 -200062 -21889 -275550 30576 -96742 -126737 13288 160263 194100 103105 -161027
22015 -47808 -66271 -196016 -205207 134508 88032 25171 -48453 -34832 230376 213490 -143341
22003 -147270 -199765 -270306 -250521 -201347 -32669 14063 -197476 -436015 113890 -109960 -21896
21991 -137980 62971 -82161 -161993 128238 -73200 79232 -77027 73866 102098 -293723 -107716
21979 83837 141390 -216211 319114 -105409 -215726 -140092 -217340 74768 123327 -43065 81104
21967 -170076 -103419 226152 275564 125183 -52720 -63746 293391 94302 12994 106200 -295777
21955 -145403 -274805 -33334 -18009 23496 24489 -79302 156395 20360 222387 -115994 -93454
21944 -93454 -62258 -457812 -147694 -285650 170971 -82222 -80293 -68551 72846 -370985 20089
21932 41592 87686 182594 -110287 171145 -222623 -37518 -191278 296041 -365573 -285811
21922 -285811 133388 -121536 -259280 -273165 -48632 171721 386259 -150364 64374 156427
21912 156427 -187300 17337 5787 -182708 2470 -174801 8773 -121541 246360 18847 -146731
21900 -163955 -279139 -146086 -3746 -168934 81818 -186560 -153613 142235 23815 -46212 62422
21888 -156305 -151296 -53001 -174837 -248545 17003 166398 497245 -121717 52938 313680 152331
21876 -63845 -168731 -165138 -13103 -47936 194726 158768 -62077 -79790 128413 47670 -97404
21864 -247739 80641 -257097 156707 -316450 17151 -37325 -140363 75864 -118093 210248
21853 -61508 -367172 -16183 45263 105917 -92341 18026 -205451 -102579 -314831 -221562 -64102
21841 -328514 -122486 -147164 -211887 -237757 -192082 -67782 144999 -341716 -62325 37548 -11417
21829 -196155 174886 -40552 -39664 -239860 139195 -110049 -435487 113737 -361239 54930
21818 134470 29288 -143177 -35462 -134260 -56468 -660105 -51505 -106457 -71294 -81325 155924
21806 -155754 -66133 194097 163981 -202341 -331454 -44073 35620 109502 -255751 -13136 93388
21794 -119561 -46472 41358 -303771 -112939 65377 -126240 -247292 -112302 217868 -108529
21783 -202524 -41843 182081 195212 105122 -59712 37607 194672 57997 -348867 189573 -28326
21771 -4809 920 91704 -191523 207659 11130 -346346 -136486 56419 -249527 -60637 -232559
21760 -232559 -260513 23193 -45390 282298 7143 42322 111655 -8200 -4141 -122942 209683
21748 -106864 -147068 68325 -125105 -347063 41155 -19384 -263824 -79831 -92345 159267 166791
21737 166791 109171 -42026 -148388 282727 -167283 -415547 -332871 18552 337942 214344
21727 214344 -47454 -94859 -91269 -179403 -73075 -45300 -186736 -27374 52693 109658 24495
21715 -48064 85201 110512 -118429 -293051 -191412 81074 24640 159290 -268118 218301
21704 -133564 -131702 -57658 -156135 -144527 -117438 -95181 -61084 -54033 -222587 -172465 -159528 -159268
21692 -159268 38669 -181580 92349 73944 73007 -191283 -124920 -87534 112805 -42061 -31435
21681 -31435 -135713 279273 -227994 -51842 137579 399437 317483 99652 -168115 104345
21670 -73644 -157345 219745 89508 -219656 29923 82815 -284832 5656 -87281 195913 32732
21658 31827 94049 70088 -236472 172514 -72325 -89599 314354 -264013 -23451 -320532 28712
21646 -41746 -34585 20132 -119031 14854 -24092 40586 -62656 184025 -251439 -42382 160321
21634 -61889 -123298 -159837 -166020 384251 79815 66713 99221 -150994 242057 -245531 33807
21622 58917 -96427 32902 -76318 -244185 15718 -33313 -219469 -73467 142599 -152561 -14287
21610 -79732 -172885 -265930 14411 -342718 -231396 -92318 -268290 1451 -113805 -120764 231227
21598 -170860 -139716 -202600 219193 -45191 -261062 -614899 -199117 246885 -295327 -285151
21588 -285151 -314548 -47012 -177419 7795 20292 -359148 -56570 -88287 -242106 20539 144431
21577 144431 -73755 -78006 382547 -274166 -197286 -110615 240752 -235025 86514 13672 139846
21566 139846 -165087 158561 -8917 202838 -94438 73526 -175556 -68547 41109 -37116 -257540
21555 -257540 -305275 -285186 -390993 32873 -174769 210525 220177 -43112 -39326 -126183 31940
21543 54993 205173 -4715 -90909 129143 -175690 22451 233182 -93982 162560 11300 -180539
21531 -283980 145341 -102427 -375457 96927 103760 -65285 65661 -221724 168282 98437 43725
21519 -47386 -241509 5631 -167763 126736 -233660 -127357 43977 -39109 -108931 165163 52445
21507 306267 -23982 -206995 165343 64903 203705 -38755 -221786 -16563 -62953 137419
21496 5037 -322290 52548 98832 22097 -57805 -181001 -180466 212156 20234 -9814 -206817 95488
21483 -362944 -277416 -57346 -106676 -28093 -336557 -81465 134588 -4067 106618 -74944 19863
21471 -309211 -70180 -186748 -182264 62617 -5240 72714 -270461 -204935 -331811 15746 -174162
21459 -281548 -122629 33409 -61411 264359 -126685 -281292 -91144 134146 -167284 312161
21448 182832 -51538 172903 -238815 -347115 134845 -313404 -212134 168607 -77241 -121442
21438 -121442 -254932 -16088 -58083 59109 29995 168299 427051 227744 -147911 453996
21427 368586 638759 842427 855605 579965 416750 593153 128066 -32279 94219 -83328
21416 141882 -138377 -31997 -72838 139799 260827 136913 126457 43488 -114862 -134006
21406 -134006 -5837 -61242 -263751 -159651 -261988 154578 -220997 249782 -174241 -13930
21395 214488 -50989 -19736 -362901 -110306 -95196 162605 -41480 162556 -177389 -363735
21385 -363735 26836 -51026 -479143 -69060 -238415 -164024 291469 -154528 112939 223034
21375 223034 28055 -22107 -213815 -127659 72571 60113 189804 61753 -9619 -312558 88517
21363 -49244 -185211 36188 114222 303544 -105801 -14412 -114002 71583 -317440 40634 -159581
21351 -371294 112291 226401 56709 -26918 -3660 87147 -217755 -36408 161640 -321401 -81333
21339 -116379 -298721 67277 -182556 229232 -510246 -184115 -323870 -34405 -143218 194573
21328 -220765 43479 -86436 478861 17369 266823 -390601 -1267 -130172 -25616 146462 -63834
21316 -53690 124770 -134686 -126693 -296628 249422 -90864 -413829 -131594 242613 -189618
21305 89413 407766 -121322 -83835 -247315 63866 -206931 139367 -101548 -89482 -239210
21295 -239210 29058 -106124 -198343 -478088 -213129 -231450 -111469 130905 -240397 75403
21284 -137856 -259877 -215282 -234490 -100386 290229 11685 38765 65604 -264013 -104990
21273 5102 197654 62930 281658 -260077 274417 60001 -246671 117770 -280540 -250279
21263 -250279 -273598 119057 -232804 -49888 -56642 -421597 -53753 37506 87430 254202 -190971
21251 235769 165440 481388 -296553 113996 94196 -262562 -258358 173257 -42226 52094 254488
21240 254488 -264828 -14 -305384 -81040 102596 45364 -159298 -77687 -255991 -8526 -59231
21229 -59231 204336 -165510 -65922 52694 -49173 -63150 -33556 157081 408747 279958 -171686
21217 -142233 -203389 -158921 -239621 -141116 58728 108459 234964 -143251 -211430 411910 -317715
21205 96962 -331683 194908 338317 -137178 -166669 -155070 -22549 -218238 -190479 191360
21194 -26843 -46844 44515 -303088 -337389 -288197 203082 -82947 -373735 -199226 -42058 -14764
21182 36835 -38119 89403 -27098 30591 -227670 -197889 16199 -67670 -84169 -156553 -71118
21170 67205 49267 -84859 -376014 119423 35236 456 -311454 -61831 -321524 -96185 -140739
21159 -140739 84380 -104598 -250673 79739 -136140 149056 152738 -81679 -80615 11640 -277860
21147 -249100 -94113 -76498 -233049 -240582 484454 -159093 -183926 131931 -231085 226246
21136 69883 -312900 -45290 -96016 43622 48318 20693 -178758 -71371 2984 -287966 -228899
21125 -228899 -124784 -1973 117428 -113863 -218102 222276 -317504 -59767 -197617 175136
21114 31082 -71869 177636 245884 163477 311436 -87111 -174214 -308257 -88700 -75957 71963
21102 76323 -356353 -242800 -4262 -2912 -326112 68938 -217898 161261 -280930 -39656 -414934
21091 -414934 -171624 129658 90751 236753 -24264 -31461 -348015 86817 -166042 308648
21080 -93152 -81291 137513 327474 215242 200699 -320175 -381161 -298509 -329878 -354826 -85920
21068 -54153 212551 64700 -51631 -148026 176079 -63746 -77795 114455 198304 107246 -110495
21056 83070 -200958 54300 -107642 133321 -234435 56413 198068 -124322 -40814 239697
21045 -24559 150882 107394 2534 -352354 -151769 -383645 59028 -88964 -72638 -6806 317125
21033 284651 178738 193692 -194888 -287053 207876 76437 153971 70608 39295 41186 -22151
21021 -109444 -161051 -13383 -143361 -289257 12540 41675 -102485 -173553 4529 92297 -453617
21009 -59066 -33973 22661 157966 152980 -414085 40816 310770 -345787 -149659 -316118 20107
20997 375425 161873 -10377 284824 391529 153997 -103566 228406 -30354 143203 348226
20987 348226 167591 232606 37693 11858 165373 -14744 -446852 419266 14114 114919
20977 114919 -180875 -108989 -110493 -137010 -362798 -81891 163479 477456 113977 265089
20967 265089 -363679 60700 114665 -78503 219995 127768 78645 -55252 69359 61162 156695
20956 156695 -256435 -53614 171229 259662 -45674 116017 141503 141915 218873 -142219 -234647
20945 -234647 155594 -399038 -13793 -321909 18964 176576 -375475 41264 75084 256124
20935 256124 126659 361026 409133 328800 168274 -32332 287787 -331276 -228903 -249718
20925 -249718 411067 -385095 -195900 -165700 -177175 197361 -234475 267509 82045 -120495
20914 74867 121798 -105716 236953 126809 -120574 -136196 -99657 -84961 -274443 65112 -135737
20902 44852 117833 70803 73203 253131 -144419 -286240 4737 6195 -252390 -185578 75181
20890 -371904 109042 157200 1964 163279 -27756 -186375 -36806 336162 -10252 -238906 -170413
20879 -170413 -118887 49803 -6787 -70535 -111802 -86186 -52015 12720 -284053 -61540 -80693
20868 -80693 36487 238578 -64167 -83043 -28163 -113620 -892 -74973 157604 -203051 -245627
20857 -245627 168402 -276200 41295 -79554 -167041 -53478 47735 -83854 -113033 -164516 -62600
20845 -109563 -35473 -200844 227587 47784 34672 103837 -112058 -55123 -174538 -513664
20835 -513664 102205 97226 -209874 -20457 -208898 -169507 -80855 47093 -197742 -241436 -4723
20823 -220830 -55221 -125776 249396 -78588 164438 -565333 97302 44630 -291058 -85448 -169640
20812 -169640 165449 -190028 -401621 79881 -26360 -231133 -138504 -232053 -350577 -108304
20801 -188542 -6566 -8177 -158629 -343487 77560 -224217 196928 80732 -305385 177072 -113536
20789 -136858 -131267 -81167 -72782 121401 -57239 -324722 138297 -26631 -240132 318176 -334529
20777 440951 193847 -308189 203961 -88748 -36618 -306345 -195718 10167 -3015 -29955 -91676
20766 -91676 -10600 78004 -180858 -29442 -129464 123739 -124014 7973 107963 -121095 -140379
20755 -140379 124422 -13970 -65327 -66811 -20226 -62246 85217 -156596 67011 -59508 -184274
20744 -184274 44240 -127521 105061 -45237 -39514 101901 -44765 -183767 -63943 520 -315173
20732 294998 52952 139330 -188962 -100371 15028 133247 25529 -10186 283536 111562 -69118
20720 385536 -171653 -73286 216403 203308 -174727 276906 -259816 -191230 -451358 209747
20709 -362446 15853 -429767 -167630 17679 -8929 108612 -173935 82327 12297 -126060 182116
20697 289505 34049 -211421 -10136 122622 171807 -13179 -126016 91196 -50044 51591 -294682
20685 -4501 71264 -110040 119037 -242351 -152398 -180335 -199709 -322027 20908 -2104 128618
20673 162790 134478 -87674 -300198 -385371 268186 127891 -8182 -12408 233423 112684 -138123
20661 -109728 -26736 185275 104135 -24924 -103553 137783 -51432 -27138 15354 -131443 190564
20649 -168901 -259399 -66213 -24451 62468 -65723 -61341 87943 73691 30080 -257510 -36446
20637 -202623 77312 173748 177471 173466 68228 -99567 104163 -64674 -348962 539372 -139217
20625 -97430 -225398 -111635 -379942 -255165 111784 -18786 -374976 74337 53509 -45331
20614 -65002 -387132 -513099 55575 -160128 11248 -154607 169143 -251925 195170 216551
20604 216551 -265749 87978 136831 132552 -14384 113202 -18348 -157436 -225232 -123856 149281
20592 -95344 -308011 421952 -214079 -245957 -135021 -27657 -226651 -222850 -25694 -417377 -74351
20580 31619 -75906 -187778 -71206 -145671 -65854 -370437 -174701 -93492 -198843 -262538 144253
20568 -553468 209363 -477816 167717 -10238 151749 -199361 -106055 -120767 -48782 -16005
20557 -220885 62213 -81286 120971 32232 -212031 -369636 291184 -155063 -136554 -181057
20547 -181057 -62877 -151946 102767 55580 73085 2746 4800 -13268 -260285 -15259 -149068
20536 -149068 3577 -73726 13466 -259874 270777 -202373 156167 -60598 43163 -359297 31805
20524 -121482 -47353 78844 -50400 -150716 -208361 79151 -351748 -86865 -59219 -3857 -376828
20513 -376828 -233505 308780 -337001 74223 153457 -521527 -73658 230068 -96018 251717
20502 -31788 -146324 4550 -41667 -44277 -312157 -130629 -34867 55702 52609 -375149 -72010
20490 -215009 109719 -35403 6438 -231036 241466 240805 106439 208716 -371322 181096 43435
20478 -285150 -356750 308401 -162906 -190799 391451 -149136 76411 35278 -17546 88896 -240262
20466 -73921 131936 -147150 84675 245988 -13030 -73674 179239 -108977 244281 136784
20456 136784 -92617 -91386 373857 102389 118144 55740 -242631 -156189 155823 5688 -209276
20444 -72890 -299532 229224 16179 110846 310240 114954 338894 -387738 -152406 -194515
20434 -194515 -32550 212114 126071 47293 39473 -19562 131008 193292 -247564 -192484 -162072
20423 -162072 -118677 194526 -287297 -290461 25663 -258107 -50029 25454 258805 -133962 -527398
20412 -527398 -268856 -128827 -226482 11011 27426 -147312 59640 -463358 90505 -260380
20401 -138188 161222 -87217 69696 -56694 101869 -212326 278860 133386 -367831 -18428
20390 -15520 -92083 285706 101932 -109527 246673 157906 -244474 -38143 -271091 -185971
20380 -185971 -91541 102808 195672 105762 59485 -21676 -196011 -193155 -198612 -282548 -18317
20368 -369381 100849 -65642 -108379 -258470 -349158 -53644 100650 191025 -17462 -220770 -195892
20357 -195892 -163263 -287127 23640 30157 -191616 175887 196479 101620 99934 -22200 -10945
20345 -26534 -103942 8157 -91950 -131588 -47634 84248 171633 25011 -113224 196861 -46980
20333 -39722 73254 -156442 31432 -327929 -301598 -100967 -209745 -79006 91080 20760 89868
20322 89868 72644 -141472 -157478 135528 -369139 60682 53902 -246648 -134253 86513 33225
20310 -373740 7733 -68240 -374802 120809 -22474 121942 -254819 -191773 -239078 -14715 -176066
20299 -176066 242544 -8725 -7690 -386899 -182960 -51023 46988 65606 -489812 -275573 -238773
20288 -238773 -12273 -252984 -35176 -103850 -34337 259707 -123681 -275055 -108495 -50469
20277 49361 -117824 -122557 120924 92643 -132886 -120885 -38363 -114159 -123552 128146 -249836
20265 211218 179252 -137568 -402737 -28342 -50787 -264443 -120265 237137 -95595 -430579
20255 -430579 -337324 130602 39793 70109 -70539 -18293 77102 -5093 -67980 100750 81784
20244 81784 110370 -68570 46765 -1730 -197625 29995 136294 140079 -1289 -227093 123226
20232 -174808 172769 -39234 302443 -214127 -68 -405864 15967 121420 -374403 166429 -136222
20220 293353 76171 63199 -174763 -85289 22272 -150149 64949 21463 307398 -263534 92221
20208 -20166 9558 -78400 -62908 136464 -78370 231660 -27336 226166 -249929 -622126 -159547
20196 -211429 -324985 -189443 59701 -234642 -231598 80799 -68132 -263382 -25416 -444396 -175875
20184 203202 -370981 279 -147098 -37864 -66311 393821 -225783 6733 -129325 -24668 -229229
20173 -229229 488592 4156 40780 -123207 -81793 287785 22851 -34083 192429 97227 -30527
20161 -3946 233273 -81925 -154574 -151610 181879 -86782 -36051 14671 58291 78684 118343 241293
20149 241293 36431 70137 242576 496087 119857 -23030 274446 -276041 -175813 75426
20138 138360 24917 243104 211548 391494 510829 392304 260593 167265 180558 216693
20128 216693 133158 400421 323571 186251 437171 442589 54662 -45023 -180221 -75795 -258712
20117 -258712 -293842 128120 26999 15628 29053 51054 160634 -148452 176345 -224010
20106 -69579 -400501 89441 126452 -73778 104100 186662 -69748 -314769 -108457 -465254 113994
20094 25648 61433 68380 192925 87135 19312 93318 -307234 117163 -210664 167506 -27311
20082 -22474 157487 -241927 164766 194091 93220 -29825 198126 78406 -239837 -18773 -7326
20070 -289871 95777 60700 144841 93289 -164559 -131924 -8915 267810 356411 28696 286695
20059 286695 -125886 103406 165041 38855 -337189 39343 -74648 46817 -195164 -44778 -59302
20048 -59302 486108 -92161 -63881 -72025 26747 -74420 -118510 -159041 42108 -291300 -276894
20037 -276894 -191273 -271395 -180728 -131239 21176 83195 -33476 181697 36535 -430029 -66148
20025 115119 -235463 169319 -188077 150243 -229257 77413 97573 328198 64859 32736
20015 32736 81121 -65895 280685 249663 -6208 -84820 -14079 -31792 21241 -33387 -39774 -253325
20003 -253325 102948 108103 -162844 27237 37190 43347 1736 -424756 241649 -26064 -178856
19992 -178856 -282173 -88809 -165304 125686 212549 176778 12275 -23883 -142696 115854 -354721
19980 58222 -53021 109378 77787 223067 -154386 145294 -169040 67179 28543 -131428
19969 67821 -25668 158289 -108566 289038 -107018 561629 -260125 -50935 151731 -165635
19958 -278868 -18156 -108792 154485 30375 -199928 -294670 -73088 278261 125213 264651
19948 264651 75654 132515 227100 -15796 131937 596361 -83032 140162 245378 -33619 -66445
19937 -66445 186916 85593 -2917 -62869 -72447 5216 63124 274118 -33931 66920 -366205 86974
19924 121864 -36533 -387808 -34336 -246103 289815 -86822 -154887 -246206 280962 -265297
19913 89531 -157871 -87786 -53801 73932 -150669 120337 86818 93593 -14630 11266 -138340
19901 -99418 170590 54506 -255911 -144487 -50714 -303564 50501 -36452 -247412 36257 3133
19889 -196016 -183122 -60014 -341491 -322929 -45000 -359065 -227663 -180757 76882 -198628 -118202
19878 -118202 117193 -271964 -496725 -82718 103425 255009 -150954 -243400 -66191 -443738
19868 -443738 196902 -8737 135049 449394 181003 -370991 138807 -304859 -317272 -358487
19858 -358487 167697 333060 29723 -64434 -88454 -133452 -64501 -293322 -52128 -43177 -304435
19847 -304435 -200315 -83845 -153621 -425393 9049 44006 -140831 -357472 -75915 -108093 -33221
19835 -68568 -29615 158793 285821 -227151 -99542 79310 -159243 30356 -239814 82833 187043
19824 187043 -176751 146210 -153480 158996 -181758 -151137 7075 17070 160119 -38295 -54542
19813 -54542 105442 54077 -403423 151860 -433573 -86841 -106589 -112476 -150473 105168 -164383
19801 -24749 -7746 -186652 -128298 183980 -241788 -29597 -220764 -219163 -88920 -21610 -56752
19790 -56752 -20777 -154904 229203 34695 -155138 458549 -63358 -64091 -51992 -139825 -265568
19779 -265568 -207738 13239 37633 -119815 -196773 -210884 121153 19687 104742 244939 114118
19767 -241088 121957 -152041 537874 -6823 -59123 -242359 71269 102355 -263250 -66963 -6756
19755 14002 7731 -91324 -119131 -30752 281885 -246853 -228437 -15981 -187222 139477 85509
19744 85509 72403 -204815 233902 24181 228041 -204255 -85500 37256 552420 -140076
19733 -243248 37884 104397 -49833 -253465 170119 120427 -216586 -79904 90374 88965 -120382
19721 -144945 324420 196001 411118 480388 244769 370571 221411 56266 51621 -178957
19710 -224497 64494 -30025 18369 -214976 -70445 -23513 -9909 122325 -8611 -122612 358992
19698 172905 270734 67714 125958 153074 170287 -215735 -219949 225479 168373 25403 -103019
19686 448210 255208 188456 106817 558206 111649 -151715 -164578 -8121 -154655 -146217 -293443
19675 -293443 -94467 -390000 -223226 140302 237180 -254878 264837 123599 -332424 302370
19664 169327 110725 -256608 68919 -45041 -193048 82550 -271410 -263996 46124 2915 -43164
19652 22871 -145231 298068 202427 -9859 -154283 162548 28128 45982 -260120 -209295 158672
19640 -291574 -155029 -49546 -219712 -151563 227780 147916 -14178 -259704 -109984 -258875
19630 -258875 -192661 -24911 115980 -181679 316993 -111942 -49260 -302947 -252611 -62248
19619 -57019 -121833 81646 -286785 34529 -87172 58657 145200 155690 221391 -241324 -37186
19607 119177 -304142 -107699 -354908 219873 -75493 201242 143844 -61518 -8524 30552 -78709
19595 -259630 -114151 -298232 -233157 301706 -117337 -39405 113622 -300014 -501103 148457
19584 114552 32433 17649 -285496 -162547 -178742 -622153 -37573 111060 -375642 -19404
19573 -46048 -9714 -14522 237695 -135163 101476 -72391 140125 -119067 -55051 -163931 -101943
19562 -101943 31475 -236325 -35464 -179499 -357514 14528 55706 -233306 -184972 132252
19551 24796 -374003 -393746 -8812 -73930 -121829 -316860 33020 230472 -99328 -207413 -140980
19540 -140980 185968 22352 86782 -211371 275150 -228352 -202413 -231538 -137709 -113517 -22347
19528 -231717 -1791 65980 -179737 -163865 8996 65937 111785 96164 -122646 -66038 -319764
19517 -319764 -188830 -107 312741 -39306 -67577 -24977 191816 67430 -256890 72201 51449
19506 51449 -619432 -25505 63862 -211635 -12187 92055 -140874 -120415 -388909 -123181 -194607
19495 -194607 279687 59978 19101 -50893 139434 -49397 87012 167689 -313500 28168 -390846
19483 98959 303704 -78711 -11243 5083 -27588 -103828 98614 -202413 -6548 -198465 -113919
19472 -113919 150522 -279922 -54145 -91595 -348868 108789 -68946 -196208 192366 -56301
19461 -71470 -139762 -293045 -7561 -56424 -437645 -178575 64900 -260069 135850 -69314 -189592
19450 -189592 98337 55116 -137354 -59629 -251778 -248913 -266811 -32411 -240362 -348266 -232956
19439 -232956 11603 -106533 -166494 -222172 408477 304444 -140945 136588 -161313 -134774
19429 -134774 9258 113568 -332315 179478 -18695 -8092 -75524 -87896 47761 -160643 -400337
19418 -400337 -106190 -116772 -260548 161810 99600 172344 114354 -289169 -155151 -157187 -77220
19406 -2540 -374810 -291824 -78337 159190 422847 31651 -45196 -65299 176141 -153527 -254718
19395 -254718 -56164 -85175 -206413 96987 -236363 27176 -255108 -74150 -74232 208762 -183004
19383 99857 -150341 -519024 161207 -240797 -13206 -180131 -32799 -52688 93616 105708 89457
19372 89457 44006 -33230 89912 87032 -170980 -90057 -34607 174064 -322906 51990 324538
19361 324538 -191539 12801 173594 314769 47103 204649 -114466 190749 215932 -127751
19350 -39663 -145080 -584794 -139207 -116377 -67955 -50071 192319 -148481 99361 142868 -82940
19338 157545 -610255 -252154 -33418 134098 -126789 82701 40338 -165057 -10297 -117918
19328 -117918 -81078 26782 176823 -341155 -52446 -219835 29404 47178 -98515 -60580 -96319
19317 -96319 -29222 -241777 -302661 -135666 16789 -2778 -372034 105883 -321816 165825 143036
19306 143036 72680 -243023 -251 -33474 -190522 -23865 -181496 234906 -42036 -193347 -190044
19295 -190044 -164286 124402 -171902 -47510 -95528 -6349 64542 -114846 188031 163373 -211727
19283 95652 -14851 -191197 -116503 9791 -13591 -275825 -87703 -34212 62484 -287511 -114780
19271 -50191 -101547 -292040 -287318 982 -290198 171579 -81649 36744 -271141 -412044 345 310806
19259 310806 -94890 194488 -186932 -9150 -121422 91140 19339 -562626 -173497 -4070 -498231
19248 -498231 -38442 215034 104083 -115300 -116033 32663 43716 -220008 -331409 -13905 -83680
19237 -83680 -306244 -226374 -112641 -192405 -84987 -160521 -240622 161114 -110541 218448 -151201
19225 -69772 293510 -230430 -178711 -78522 22714 -204360 -139829 -178155 -465 -126733 -130455
19214 -130455 95551 90270 -85824 -160006 -197399 70720 -53185 -236691 -19105 95286 -146829
19202 78243 121017 -175993 -182459 295803 93208 139678 -152841 -233771 -124004 -31598 -320088
19191 -320088 -50558 194981 11944 18403 -55828 342133 142442 -175211 -42058 -710 -66610
19180 -66610 -509859 -169553 -192545 33011 213800 -53682 -120531 -52437 -64708 -123752 9742
19168 -208917 -103761 -279787 -175380 -306197 -407701 24770 -152102 -265549 -366059 -204787
19158 -204787 -16442 127436 -274234 11928 -55785 -237391 -299661 -371683 -12256 -377934 -247202
19147 -247202 -239926 263783 239855 180886 -7603 -320765 96558 -234682 168755 -190617 -124931
19136 -124931 -140816 -56792 -66977 171419 194696 227690 -197333 44846 -471270 132949 -185139
19124 -258211 -234141 -238786 80704 -139408 -280052 -44361 122686 -86714 -46218 -31991 -65285
19113 -65285 -125227 -123231 -34131 -39583 -38234 -22044 -252368 20282 -46480 -27475 -198040 124090
19100 -269325 282606 100918 26007 250432 229472 131005 -81790 76384 -14989 -46738 15146
19088 72041 -396085 59485 -16189 -58420 -360844 -18022 207549 -1662 -212079 125421 -97305
19076 -154790 -142462 214741 122047 -258995 -59598 -79627 -417434 -42551 -278769 65173 -347831
19064 68426 122564 125776 -14291 -123745 -201558 -7029 -73560 -11288 -122901 33317 -115672
19052 147475 -292937 9556 -142958 88405 16125 33700 -353112 128964 145524 -29092 -307472
19041 -307472 -87375 -245686 -353814 -114097 -158753 -120679 109099 -169061 -206231 -226464
19031 -226464 -16887 -150261 21798 38972 117131 80055 119873 -77693 -74412 111195 -207907
19019 91740 -164652 80302 -366357 -75185 -119854 -69996 148373 -233410 -84444 -103341 -57843
19008 -57843 -202133 -26897 42875 -38369 -8157 195239 -228644 -42689 215009 273429 -64487
18996 20779 279893 257510 195315 69466 -19533 348244 -5521 -494 -13020 -70503 26740 -66228
18983 -117874 324651 189180 -172141 154608 -59193 -315742 -68207 -40345 -58692 48163
18972 -129713 67901 -55595 127509 -381326 282895 154224 131774 13664 57128 -16657 -50884
18961 -50884 523640 229105 1800 337436 110894 -92176 -273100 102167 203108 27805
18950 49791 -342440 -122359 -139484 140343 -222148 -213268 -32096 -286887 -442092 195154
18939 81263 -388927 -471263 99194 77740 -52379 -168873 125666 -302159 -28309 -486731 -98029
18927 -37663 -269585 -108751 -164916 -60138 72658 -232352 -289161 134117 146939 104524 317235
18916 317235 194079 -74830 -137973 46538 246055 92108 -40441 -108131 -9217 -327791 -318069
18905 -318069 -70284 218513 13550 258305 42583 -56307 324488 325221 331898 642486 336307
18894 336307 52994 25350 172599 188642 74881 88049 -216871 -100922 131516 142962 20697
18882 -323659 -29578 -75333 -10063 41927 48947 49948 -74057 253519 101477 102109 -220959 125183
18869 -283047 -57485 -61319 28775 -93897 135575 367 177427 -116800 -517923 101139 -199512
18857 77215 34105 8862 385264 266903 103953 34564 176080 363676 -456928 292635
18846 -156010 87488 135921 14062 -59125 -275068 6079 -241283 -157235 13107 -95969 -219173
18835 -219173 -15981 -306890 57937 -232934 285330 221870 -112615 -91450 316438 -71631
18824 -269784 -276637 57725 -110676 -49794 86324 19030 167445 -123972 -114637 -4436 -178190
18813 -178190 -25892 226131 -171017 -203068 48083 105197 -195440 207080 -82822 175612
18802 12533 -210890 -106706 141987 -173914 -25016 -225733 -333252 -24004 98310 38910
18791 -34788 -74172 -170866 -293800 91499 -34525 -216163 79900 53477 52245 -234109 -906 -77136
18779 -77136 153861 48057 -67904 -212440 -89317 90943 -80746 -50951 -64599 145800 258319
18768 258319 145976 -29151 358516 232242 -187582 176660 -246396 58588 206120 -25874
18757 -398350 -13902 -89654 -67922 57837 -27433 35039 -241521 6020 168291 49526 109791
18746 109791 236369 -101660 -94978 -37520 -186966 -90375 36460 52772 -77510 21015 157942
18735 157942 206063 -351800 -3585 -204017 -108903 147845 -490928 -110449 -110752 -80237 -76851
18724 -76851 -290954 -99736 -209010 -167684 206800 -51182 -28255 94093 73909 69027 -263245
18712 1902 -56616 146562 -199996 -236573 123151 -37901 -63233 61352 83471 308792 -484
18700 -251271 -249573 131273 -281489 96269 65675 -23184 -126868 264097 -336562 -44791 -179442
18689 -179442 -46909 -214669 -246158 123877 216387 -38800 14768 -14964 -16561 74084 -126043
18677 -147606 -26322 -159464 -16907 8292 222034 -288857 5523 -5564 -109727 -295492 -13759
18665 -271463 -260621 -180838 -198158 -24745 34591 -189461 201914 30505 77511 142778 -134432
18653 117865 250819 -120851 -347362 252252 -136901 100428 -209577 -298015 -39808 -299411
18643 -299411 -104040 166621 -52415 80056 -34719 -15 -79089 170198 30748 197423 25499
18631 39121 -5131 34134 -143093 -296367 218450 173238 -269750 -11622 20382 -219444 -40433
18619 -222246 -153205 -189895 268279 128098 -106154 1480 -297477 -215517 -66637 -141411 -77087
18608 -77087 -186693 -46794 12179 -187924 -307249 -265382 -88211 65729 171971 194421 170528
18597 170528 -420082 -308353 16825 -169790 71578 78668 -147833 6897 -407840 -232077 119011
18585 -175788 -214176 -42419 123565 -123584 -378253 59372 -359202 195916 42369 145765
18575 145765 27863 -184587 -89652 -271917 -282766 -73885 225446 -248898 139434 -70402
18564 -141899 133509 -74091 -232049 -186590 145601 117503 -150887 -192439 367 -391478 38896
18552 15914 -145450 83795 -48373 -309543 113562 33880 195948 -46963 36101 8951 -235649
18540 -38281 45988 -43782 203149 87896 -34118 -183357 121413 -70072 174796 45597 172535
18529 172535 -281107 171022 57212 20310 -26982 -320681 154245 -357614 -291142 -100032
18518 -18767 44188 -127045 59589 103621 62092 99889 -149495 -60944 150497 -454396 -59181
18506 185325 -108257 14951 -87387 -305175 303962 -172606 -40538 -431866 -97216 -9515 4250
18494 38205 128038 146411 123641 16958 -82589 12350 -79726 -6010 -329688 32940 6466 -280858
18481 131182 65607 108880 93870 -32248 101799 -125248 -92340 -149388 -132545 153411 -162434
18469 -319372 -110527 -113350 -19559 -70774 37246 -91205 17282 -162364 -21544 -9205 -101809
18458 -101809 -39463 -241980 -64745 -174695 286085 -128958 -111010 -208000 20523 -309347
18447 -274817 -67847 -143477 348739 112002 209499 -305346 141058 -7171 129956 229053 25619
18435 -276238 254481 63682 32637 109867 -67480 -362274 273076 15521 75408 85540 -54409
18423 520271 45610 110183 92350 -212613 -190710 -259872 127201 197039 188280 -70042 -10711
18411 -319877 -116426 87007 57157 -346810 -183413 -375895 -111912 -82677 -137097 -182154
18401 -182154 119308 -106431 48360 -61682 310312 52628 15466 -5888 -381300 120080 -309308
18389 -143908 -212619 -511710 -180044 202583 -56576 20950 -281531 25134 -66594 -72572 -284125
18378 -284125 -7498 139908 -62199 -148226 49563 300283 64427 45332 -10613 -47316 -107853
18367 -107853 -122660 -17895 72297 -177585 -167796 92897 -360817 327600 -276616 -247239 -80603
18355 -360349 -284933 -2866 -106300 -155073 -139012 -313825 99398 119145 100929 -187910 -114040
18344 -114040 -118417 -259838 303819 6403 -303537 -233012 180227 -154349 23003 169103 70728
18332 -367937 -439619 88602 -243002 -63642 -310100 -66776 -266283 8037 80924 -248468 -177618
18321 -177618 -216998 -213336 99524 44513 -202664 -204806 152843 214256 -150235 -14600 -302162
18310 -302162 -238078 15247 327125 -366313 120708 831 -226693 -263768 -225870 -340011 -23260
18298 -306097 -166902 -151947 284731 -322556 -170919 -244795 -37461 -3653 15994 295908 -372131
18286 -300625 340638 -24940 -7629 -70000 130463 34492 -296903 124157 479909 78499 -119783
18274 106610 -244224 137719 160252 67361 111508 -146526 176756 -129945 117119 -87600
18263 3975 -103210 7945 253913 -158861 -91941 228881 -30949 -97232 -54258 -106364 -291702
18252 -291702 -311269 -116564 389976 226212 230393 -149662 -3339 22516 111392 -73288 -226733
18241 -226733 -15539 129900 -139584 -354816 -134673 255284 12680 -363557 386666 -155183
18230 -184557 55546 -4836 -135114 52484 99436 -44438 16099 72456 -33734 -229210 233918
18218 -7446 54150 3085 -305411 -202434 21969 113160 58582 -130471 137811 70038 -23062
18206 -52796 -4530 35089 -230983 -13755 134593 -18209 -240808 -87881 -91758 107991 26014
18194 -39894 153019 170100 113926 151801 -145887 210064 -33338 -422 -8214 -364569 -127571
18182 396947 139082 -134413 119010 35372 -259242 157535 -56500 -337972 -65736 88950
18171 -333152 -554667 -129488 356806 -92819 -135890 -257160 -316347 52578 680 383990 295885
18160 295885 99967 -105814 -29138 -242140 -11506 43048 -315833 1358 -70900 -184404 -311781
18149 -311781 -53071 -112586 -125683 173918 103415 -212479 -236335 103240 -23901 131557 297653
18138 297653 -31334 -293717 -60822 157831 -31257 271215 -183309 309257 78894 17179
18127 -9105 -54006 16739 -41620 -84281 -113876 -75848 -163104 241817 103861 173347 -127437
18115 -41226 -226368 174133 -146604 107475 88822 310669 639 55222 -217023 163248 -275712
18103 620735 -58177 -14285 195686 381991 -218773 564348 -17028 102759 28494 57592
18093 57592 -193373 -203092 -58028 97582 150433 68852 -98224 93051 -283126 -327629 -46515
18081 -170797 362253 -232691 45676 -64635 13834 -224901 113658 -115620 -27906 -1275 -60039
18070 -60039 -250094 -131443 -280603 376838 25764 140754 -11803 93187 298721 -187973
18059 -202480 -59079 12686 -296952 131052 258075 -185024 16178 99332 -50528 -66322 267362
18047 -156579 23657 179299 -182343 -268380 -20100 82303 -141035 -107781 -491299 -68115 66136
18035 171 -369845 -188617 142810 109505 142632 -47067 -147507 172238 -20200 2182 -152588
18023 298287 165021 327702 73869 30024 56425 148309 -116717 -144424 22880 -27781 163823
18011 -74355 -24332 -202417 209864 16596 -107927 65533 21049 205873 -190397 103602
18000 76943 47257 37093 180605 -76994 -52014 351045 143033 171535 54555 49304 -137917
17988 34010 229736 50550 -10947 76481 3998 61966 -147517 -40347 267750 72763 64418
17977 64418 -464691 -288088 189234 24072 -95074 -61559 -268468 208827 -71558 119367
17966 -21538 -240864 -24591 -21835 60416 202433 148208 -3382 -42686 116718 51334 -369079
17954 -137395 -36996 34278 -130717 -203915 -163335 199111 34413 -95784 -35719 -308443 157120
17942 -196884 221301 -387759 -154438 153957 85720 -80591 -213450 66006 165651 218187
17932 218187 -31921 5853 220353 181704 -151726 146585 18290 98982 55248 -135579 70155
17920 37001 387210 -71559 -53239 61913 113950 -251721 165364 -422 214421 -17173 -21298
17909 -21298 185114 21136 -44280 -351700 -328552 4495 -361889 -120689 105034 71430 -163267
17897 -60972 411636 -235201 -228083 110136 -112078 209069 111358 -209347 -385913 -417555
17887 -417555 219629 14732 100128 -115305 116598 109401 -208161 -114017 -8619 23955 249560
17876 249560 56838 -88597 132799 199652 239165 -34297 11442 99952 321432 201048 149198
17865 149198 60616 -134213 109161 73079 69239 -171560 73261 -63219 167527 136967 13821
17853 -149703 176471 -137993 45370 45716 381811 -42053 22621 -13210 115703 -41248 -117306
17842 -117306 -255538 47391 168690 11048 109429 9477 -314744 -103870 -109317 109762 -366566
17830 -46508 -114208 112597 80718 182105 217905 -1973 118095 138088 157431 -51028 -71621
17819 -71621 27699 316612 2982 68399 99450 330148 144903 254082 52003 -107823 -27935
17807 -140969 -3270 510 189008 191509 136314 -183607 -61874 10529 -80217 176783 -71023 18994
17794 49660 -34683 236995 61978 -348236 -337838 212035 314841 -17295 -84453 40437 17299
17782 33777 -79743 54568 293371 175309 -37899 241217 310011 -217256 389023 -87190 -6737
17770 56117 174986 90478 71709 -171867 181391 297509 30780 184125 -46517 -248698
17760 -248698 -198400 4373 51765 -213307 162354 -12734 -157969 70177 18461 9743 -82844
17748 93743 199731 -118988 -103135 -187194 10172 -92260 -223640 -24545 20085 -342072 456106
17736 206939 -36846 7524 -89065 -70079 -163030 15839 200990 567329 28086 -64770 -75659
17725 -75659 193418 -328208 333194 139586 150753 -100737 -70294 -938 -127487 -312750 112439
17713 117716 141359 179253 -102886 197095 -134129 6881 -13641 365721 52956 -5599 -174599
17702 -174599 403012 -91445 304916 363785 233901 -158343 290510 416987 224644 18810
17691 20763 -72243 -98491 -155859 167120 -306270 47020 134818 148767 208531 221673 407301
17680 407301 -336549 152153 316140 -18057 -198594 270225 184408 272216 18271 232551
17670 232551 59742 246359 33210 -37449 52047 -103735 -53420 -79820 -8536 162980 259102
17659 259102 -34909 320488 -59928 30451 63298 128378 22509 80676 171300 265428 113757
17647 -210807 -18876 -113694 115595 -130645 327176 215877 127376 3973 -251238 -218656 43856
17635 -23554 175236 137606 4007 109921 113969 -19745 -16822 -34808 144718 89188 116554 -35245
17622 221986 259757 54946 48806 -37066 -196075 236066 -79396 150671 111792 119031 -21333
17610 40114 97259 -346486 339542 158971 446486 158020 121626 8825 7220 290225 278444
17599 278444 -77922 192815 -139772 251340 227616 -246273 287450 166594 256353 154862
17589 154862 -112202 -106540 -337694 -270700 -162915 229439 -173308 302414 242595 -71196
17578 263054 -78412 125946 -143093 12800 22157 28387 -25983 28452 367680 -453065 305573
17566 216991 172298 296672 279700 44805 146011 504181 328892 119954 138373 275063
17556 275063 -1415 43032 -1734 90775 239418 175956 374953 187578 372933 -40530 -14786
17544 180207 373660 134707 57097 338119 204235 -241987 172102 384308 116083 232013
17534 232013 87248 54311 -52835 222017 102680 170235 190033 45219 266546 364617 114482
17522 269020 710217 495186 489474 317139 58756 222893 248323 253825 382444 379321 437113
17511 437113 175523 340490 140940 499133 586754 419732 198970 247664 368881 502055
17501 502055 132325 240471 227357 197185 166294 -24447 367844 -17783 157072 213537 214914
17490 214914 302471 -11412 398904 249637 240560 347301 326158 154111 -101144 -36160 407313
17478 269223 -27733 18265 371574 355382 128697 -101447 521333 157034 32433 -112697
17467 242209 445597 119144 70291 86924 -56714 145780 201977 78731 -36001 255391 89980
17455 553291 77998 423977 252911 245129 107990 108 554311 322669 442076 626132 288574
17443 726431 249952 376016 407323 63942 245727 342830 155976 156409 257354 376626 362303
17432 362303 628953 231114 533092 279315 -27289 21113 113506 369290 95544 664549
17422 664549 361378 563332 199441 206874 85865 462147 339575 232194 763406 295540
17411 218805 386331 200986 40691 449368 514460 -50349 19355 249537 298113 194593
17401 194593 -32718 265105 258370 207207 182371 375148 105031 133815 194622 357110 544763
17390 544763 487821 54014 -4272 124458 342896 46732 444473 313045 403899 -257001 163792
17378 -142425 313155 194715 263632 296684 272180 -24552 385956 207097 332305 224417
17368 224417 -322196 232227 175843 -71263 274271 142803 217457 191327 417443 196451
17357 429134 374204 -232282 75403 322767 -17175 233651 301822 279698 -163712 215442
17346 507481 65440 41053 627808 223945 207114 359969 189778 87169 75980 423190
17336 423190 165249 114706 249638 105502 265215 118665 320862 396965 118460 326487
17326 326487 104186 75747 128054 463170 57292 336529 261958 182314 196763 292425 167085
17315 167085 64712 87146 277216 165275 214809 230156 18135 159314 356431 -8507 308239
17303 26498 233548 221178 214149 245269 133225 503634 212313 216820 112711 224127 169064
17292 169064 159936 99262 -123380 437175 89301 454045 184801 227451 257021 488899 349498
17281 349498 182234 260916 -11989 172442 546154 144942 501524 295739 200962 -13930
17270 362942 157113 320908 441275 15436 335874 517417 126503 279550 410893 290044
17260 290044 592591 339077 -103739 442468 523416 347787 346443 276119 15996 205630
17250 205630 164296 227850 422856 290755 495277 304199 627119 143850 -40323 411429
17239 107378 93121 28548 141614 99022 -50791 371891 211836 119284 202221 296819 -50911
17227 476867 308415 7406 226582 453981 215867 304220 224281 412514 640980 267538
17216 444384 40557 285499 801101 -29488 254827 534354 88589 137765 438781 286521
17206 286521 382307 433040 553916 82243 380054 115282 505695 306087 228422 382566
17196 382566 289477 414378 34707 596192 117545 215607 310335 274553 311780 468872 417675
17185 417675 460195 334239 312108 438935 491249 11064 378504 471830 397319 269260 564950
17174 564950 368653 526667 430592 467072 818494 245480 315206 376386 383548 455429 734702
17163 734702 455378 322249 395272 117893 281492 297799 873771 565152 449270 525308
17153 525308 180498 424835 397163 569726 862408 436044 670625 99715 268536 279233
17143 279233 362921 273870 78453 152247 116107 346447 506423 277021 512403 303065
17133 303065 87399 674133 229143 528020 91420 799839 459556 377243 362806 328306
17123 328306 720015 790612 337827 581775 361251 344788 531822 215420 223009 532920
17113 532920 644186 538901 425140 608745 679545 525860 357929 951570 433848 623394
17103 623394 492177 465704 365384 514250 548386 244909 569846 654174 571070 572008 655228
17092 655228 545357 259625 699218 361971 368723 489964 570044 251338 555208 406747
17082 406747 864088 507999 672947 247412 415407 308923 557877 740435 482962 728250
17072 728250 598239 895292 716852 753197 823593 727591 729453 596363 946066 584960
17062 584960 669071 727733 514930 604976 372043 638887 679780 955325 503002 626318
17052 626318 545623 539168 776165 525383 777506 511335 821832 945746 609176 945002
17042 945002 810527 906949 673506 622270 648046 837465 678163 649418 934970 877602
17032 877602 737641 939905 896821 845458 823216 672861 843662 771198 998392 1051564
17022 1051564 1131127 763497 709118 1020016 811398 1127447 608699 1044110 983952 877564
17012 877564 1025239 808584 805365 869874 1030142 1135793 897341 657707 1084828 1075364
17002 1075364 828815 836027 848907 970148 883521 1231729 1068982 1319719 1312162 1067087
16992 1067087 1016119 922019 1022921 910627 1194769 856472 1070519 1287176 896516 1327616
16982 1327616 1211892 1000130 952983 942251 937042 1497481 1527037 1410890 1097350 1332092
16972 1332092 1291568 1321750 876282 1287765 1151687 1358366 1449537 1268630 1197702 1389645
16962 1389645 1503400 1542231 1703380 1125804 1646006 1417473 1300717 1641491 1631486 1484920
16952 1484920 1420819 1212983 1647956 1472753 1375419 1648394 1640321 1476683 1389725 1792560
16942 1792560 1425260 1582033 1568505 1561159 1539584 1216966 1859699 1731876 1736793 1774795 1845794
16931 1845794 1754644 1918196 1462959 1492549 1633289 1879873 1791332 1401813 1505176 2124982
16921 2124982 1837954 2069404 1958334 1912146 2183159 1889634 2292031 2215807 2104726 2129250
16911 2129250 2221517 2055478 2196083 2696578 2235156 2128046 2480362 2248794 2480769 2213114
16901 2213114 2192890 2055648 2798304 2366343 2616552 2743491 2268797 2723966 2607288 2892233
16891 2892233 2620277 2505070 2776290 2543076 2588062 2660892 2807890 2942468 2732552 3058905
16881 3058905 2867365 2989697 2903526 3223822 3087186 3377908 3084181 3427849 3008856 3404502
16871 3404502 3144037 3087838 3451833 3428876 3396125 3499228 3753398 3769828 3791633 3691952
16861 3691952 3247445 3778516 4189824 3876892 3785205 4140166 4373405 4229057 4251710 4429540
16851 4429540 4137127 4415750 4463763 4515770 4528655 4587167 4656668 5082890 4720273 5110331
16841 5110331 4967969 5123012 5467004 5250189 5305972 5434024 6065339 5760385 5818864 5632247
16831 5632247 6035688 6201681 6249615 6587004 6346648 6487070 6783128 6816580 7139162 7301613
16821 7301613 7172638 7439908 7683153 7572494 7649991 7949293 7775681 8307332 8489936 8622957
16811 8622957 9044704 9008507 9083497 9389146 9628047 9809104 9710295 10188962 10154151 10539445
16801 10539445 10625885 10872076 10922156 11635214 11596031 12120656 12365524 12835772 13350942 12977000
16791 12977000 13497456 13920587 14232336 14705755 15135610 15576056 15956730 16288024 17207374
16782 17207374 17478050 17868349 18141253 18959550 19079123 20157392 20512164 21071037 21973752
16773 21973752 22541915 23109757 23763450 24817966 25250502 26207991 27355042 28222593 28865912
16764 28865912 29972735 31060894 32286678 33466989 34626802 36230827 37260978 38395221
16756 38395221 40176613 41873171 43257151 45023950 46931058 48851248 50607260 52837553
16748 52837553 54885420 57327416 59698656 62118903 64480429 67597022 70331085 72942848
16740 72942848 76283386 78829781 82300323 85582219 89026245 92307657 95395832 98961174
16732 98961174 102296175 105424598 108691582 111904024 114885916 117785412 119857695 122391466
16724 122391466 124312964 125934997 127096917 127685509 128285954 128203641 127670419 126587629 125444917
16715 125444917 124094364 121744760 119568864 117200639 114711864 111372754 108053330 104966904
16707 104966904 101678696 98396463 94948069 91053960 87789429 84365292 81749464 78405255
16699 78405255 75133254 71839321 69364609 66606494 63532819 60894619 58841263 56213877
16691 56213877 54159075 51738843 50010912 47915581 46203552 44004142 42223331 40869149
16683 40869149 39399282 37421667 36252035 35059827 33918708 32670253 31360879 30446997
16675 30446997 29085064 28132910 27195555 26321857 25359899 24621176 23798179 23222612 22558430
16666 22558430 21892475 20960507 20565389 20004328 19326187 19000826 18019467 17628412 16924411
16657 16924411 16601498 16177507 15662402 15546440 14857944 14475617 14159008 13623102 13378845
16648 13378845 12947187 12509741 12222836 12220451 11538504 11276605 11223611 11078337 10445072 10336752
16638 10336752 10211646 9736011 9519083 9558085 9356106 9184821 8988662 8564955 8233008
16629 8233008 8146953 8440961 7971086 7474189 7708858 7268518 7644198 7337897 7056410 7424330
16619 7424330 6795244 6707178 6615363 6581122 6269309 6213105 5866534 6074438 6263069 5696004
16609 5696004 5968923 5713419 5396700 5298937 5517631 4968537 5205594 5106149 4835714 4682965
16599 4682965 4767163 4783427 4397326 4604125 4728119 4644092 3981038 4371657 4190362 3889598
16589 3889598 4165571 3964542 4243630 3601173 3823897 3773708 3803960 3661188 3536570 3793807
16579 3793807 3493994 3543062 3259976 3332214 3307862 3281552 2999090 3180431 3300227 3272118
16569 3272118 3193481 2920075 2737389 2696575 2849125 2996280 2822273 3105502 2626150 2793853
16559 2793853 2485519 2570207 2819795 2519700 2404962 2214269 2596758 2450364 2554145 2408783
16549 2408783 2475854 2498246 2592267 2289995 2516168 2321918 2155003 2544458 2150383 2148789
16539 2148789 2041016 1947351 1776772 1983102 2220414 2280688 1777116 1797373 2025227 1710531
16529 1710531 1944169 1847271 1854556 1971970 2076014 1782405 1777827 1831224 1803799 1933339 1504243
16518 1504243 1650460 1709922 1562092 1867730 1907761 1295032 1631008 1529804 1370004 1427139
16508 1427139 1821671 1259349 1340312 1361412 1386464 1547342 1408654 1361196 1724722 1473330
16498 1473330 1141316 1706389 1302598 1463546 1404544 1366026 1524098 1038769 1232748 1281460
16488 1281460 1098143 1302378 1147037 1057122 1636148 1381380 766299 871713 916235 1174171
16478 1174171 1076667 1233214 1471601 1422895 1056150 1176422 1136149 1241994 921566 705563
16468 705563 1039555 827100 1011733 849608 983170 974045 1002886 910035 1031136 966684
16458 966684 913735 1009291 1004055 922748 727510 1154365 1028351 687311 1071265 878264
16448 878264 630626 587257 546644 844042 939625 737115 1169868 951802 885550 556417
16438 556417 837474 678677 1014024 928370 959190 780875 1104856 439752 732436 908555
16428 908555 803765 596116 856598 544212 526024 752908 601186 711327 776112 480142
16418 480142 889862 591894 452890 856568 856599 1037409 781796 685845 692992 803390 457695
16407 457695 400271 777766 655193 825004 651115 1023546 626370 837133 744550 395422
16397 395422 555249 354320 545784 551749 763441 404887 443696 782343 1068575 623751
16387 623751 517411 542961 501328 474050 288626 739062 545522 600413 481782 432558
16377 432558 783753 466317 548112 532033 511843 451305 504244 815648 516265 570275 538460
16366 538460 324248 535232 343365 456520 144902 651004 585668 451025 695264 360426
16356 360426 480830 577951 180036 645642 547839 462260 342634 784098 346270 312180
16346 312180 742280 448334 216212 289486 251467 458360 354134 371313 556865 453836
16336 453836 598099 249347 332757 159677 426310 389854 540945 395997 380577 365995
16326 365995 376503 308638 306199 190286 287391 163213 266451 321298 643090 482956 126476
16314 272175 273321 197426 281913 344471 485642 425911 381636 309232 38419 314427 437950
16303 437950 267480 282376 262243 223178 42253 590567 216412 142889 316114 672302
16293 672302 291799 575331 669955 97948 129271 462457 290132 592534 477922 99020
16282 294059 449625 468844 620164 109749 122882 208644 359158 283435 213613 233742 -22735
16270 238453 489120 21463 -229127 288167 507735 330570 134428 601607 432561 134905
16259 225281 467070 289396 220777 79131 453357 121654 332496 182484 27767 442486
16249 442486 203717 331082 193782 171145 182743 221609 302391 -10404 101270 14164 41905
16238 41905 430590 -61932 11818 83154 132906 323503 332667 -49143 370732 271105 160676
16227 160676 296960 167673 361341 203687 219496 520351 113844 370568 52987 138429
16217 138429 118463 299093 298789 -71269 95495 206470 265740 315122 137387 197256 227691
16206 227691 324984 337514 57918 146771 350137 153878 608406 239843 251091 248817 10317
16194 218708 1463 151082 358647 -43457 -181159 151787 129016 -74166 206010 279852 252863
16183 252863 -86087 286022 13707 246635 338788 -217375 27671 204347 -18486 88811 136626
16172 136626 -125614 347307 88397 131271 381 66562 352614 298656 39780 181461 209152
16161 209152 -185387 -15235 138194 -12911 166242 16510 -169952 120300 140161 -95652
16150 -23645 103604 -252631 71062 24987 -164533 24304 29714 -215416 -88062 -66065 297550
16138 288915 366675 163673 142506 -106432 275032 -63598 71874 127526 -28231 395892 250119
16127 250119 -86775 174208 280879 144707 -28882 -115624 372064 93083 -206346 9849 -203557
16115 78058 51507 213787 147952 147882 86036 334623 75538 194041 193010 75171 -16947 269957
16102 73226 -49635 10300 286674 54263 148304 427867 151178 -193391 296387 28648 223880
16091 223880 103614 125476 -99299 -196712 106535 343452 140270 -183686 125291 402940
16081 402940 391348 89110 105988 34528 515662 -138296 267901 -89426 -40031 319222 -78143
16069 236854 191571 201637 188023 148782 75387 253692 -62619 -55021 227992 -100568 190491
16057 -136120 -258737 25369 203816 96662 -14404 206926 -309125 -100118 78422 -244125
16046 179207 -24373 267276 6948 151068 -117874 -50409 -66010 24734 -153658 242745 70968
16034 -89066 334464 150656 -187367 -208812 -227221 88167 356303 -142137 128340 -423434
16023 -181066 117961 -236411 -126756 -268517 303426 46021 67103 23874 86757 -11382
16012 99584 -396586 -247292 71036 -80390 178694 -22914 -138587 225850 -285879 296426
16001 -107145 49110 78347 64512 -160196 47790 259062 12587 -45629 132376 -142627 -278045
15990 -278045 -188222 252475 -117002 -13527 256984 20337 226694 -50041 140809 406256
15980 406256 336338 728020 867525 695002 488256 141002 -2828 222284 232471 597356
15970 597356 -210558 -6679 -128364 45631 -102044 -193932 -2614 981 203266 288232 -166997
15958 160769 -129498 -63574 -156151 -241816 3233 -167174 280370 -39828 192964 183243 -156910
15946 -278536 -68117 210797 -213431 -149160 23231 197122 61370 226583 34513 274580
15936 274580 25391 305718 -76993 -20148 -211711 17728 146734 -196835 -282216 -20379 92121
15924 20591 311958 -225655 87440 40512 124440 189449 -405554 280598 -220673 -155448 109285
15912 -20225 20263 -376839 -57524 -84525 31855 426447 -183873 305697 22208 -342158 111450
15900 -3089 -286679 61956 -445538 57407 -271662 -169238 12476 203922 -169121 32001 -28177
15888 -43807 -94254 271741 198969 -66335 -255307 1151 229089 -466339 -4651 121438 49936
15876 310810 -294761 -142289 -76777 -68437 162399 279982 -96386 -180777 -52473 75556 185574
15865 185574 88713 86290 -83609 156278 -31400 -25260 122222 235755 -217854 -250128 -156328
15854 -156328 68889 -60940 -46066 203263 -60804 75114 -77060 -155349 231005 -22038 -102375
15843 -102375 277341 -66323 -216884 -27212 482063 126746 59851 334744 -157688 91387
15832 -344720 19670 105014 -7982 140316 -30841 -180622 -268095 11304 -133222 6323 -409261
15820 -278847 241758 75938 -277148 -158073 359067 -52994 -326030 -265051 9607 194537
15810 194537 -98510 -583064 -365836 271346 312463 -54574 -148933 -96334 -80729 5038 -190510
15798 43403 43453 -128252 -161441 -19542 107801 -343453 50412 12457 -15991 397570 -44710
15786 -30779 188270 -13295 137788 57768 -131750 -208729 141940 152745 -216181 114566
15775 -165417 -341518 -11490 -66342 -83689 -227297 68483 25699 -71670 -103808 -319790 72188
15763 -2727 -399340 31534 180814 -148051 -237514 -56131 -10806 -33158 -16591 1234 -395618
15751 -369882 288156 -365979 6163 71105 -32768 27100 -181409 -210632 48973 -156790 34283
15739 310881 -21261 42637 -255129 -87684 -7899 80456 -45286 229460 1704 118122 -275758
15727 223714 -293386 139784 -35840 297932 -155444 207730 -119448 -107451 66121 187086
15717 187086 -5954 -1460 -45131 -101857 -68289 1613 -102795 134972 197295 -212796 153699
15705 -190415 -143632 -202722 -134910 -153860 -54350 -544894 237448 -59159 -339227 308661 -214983
15693 -50995 -98793 8857 -246229 63003 -10139 263043 -321235 159498 115590 -147719 -2164
15681 -337052 -253459 -93994 -34911 -93933 -182867 195632 -219186 -56951 -208440 109538 123672
15670 123672 164133 -72580 -62006 -369111 -5434 34536 33732 -42695 -77682 -39526 -120176 65029
15657 -168450 26071 -46110 -124444 229986 -22772 -21886 -263003 -327027 124361 62955 -206946
15645 -157002 189436 362125 21432 -46957 24726 238395 -22800 -103008 -54077 -17282 -95309
15634 -95309 118178 -472168 -332026 -22053 -220626 120942 -302826 -25375 81705 -176951
15623 16810 356747 76023 87933 -284021 -374675 142843 -32132 2072 -200028 21674 9897
15611 -103370 -186801 -156135 52320 -168466 19436 277811 -235173 -204315 174240 -37883 -322802
15600 -322802 53615 -306075 -344001 -88143 -14938 129734 102437 278287 -152212 50733 -188968
15588 37990 -204930 -5952 49981 1272 70870 34124 -248554 92352 -52524 -143929 156988
15576 152981 149958 -279219 -145144 150421 34567 162102 60483 139189 206334 9289 -62796
15564 98981 27871 175654 66140 197317 166000 34412 -79122 93097 235228 -41187 266609
15552 -117224 203569 208604 -41152 243146 -46215 -8189 -48934 44636 51057 412975 89420
15540 -122649 96618 125654 188664 256752 210303 186570 285920 312900 360269 288398 -203000
15528 164507 250918 352929 -56163 306947 19101 -350444 -81789 219269 -51027 -240194
15518 -240194 163575 114559 93619 229000 39716 187983 227433 10980 152163 -31388 -44101
15507 -44101 -24592 -171064 -57674 -24038 -23629 100550 -24078 18571 2901 81123 -171986 -117302
15495 -117302 298142 8473 80133 -40223 -95694 -191682 -186723 -64135 -184305 214341 81799
15483 -106410 141578 -174083 48203 181332 -200588 14991 -5668 -25167 338143 357105 58069
15471 292581 219896 -6289 78669 33318 173546 -270343 -18816 83528 118209 -159380 234465
15459 167281 -30050 -12637 43899 -245442 -121097 8491 119039 -168470 150585 -289537
15448 277542 147695 224517 -124840 22299 183446 46817 116724 114952 572731 395307 581516
15437 581516 180476 -136983 114743 287685 -78294 88761 191131 84465 -156835 -236340
15427 -236340 -18073 -192258 -40697 325741 19950 -161245 126535 100178 -109799 263536
15416 -445727 -125271 125488 13844 9416 -92606 -31781 12975 424399 74483 -283895 -57354
15404 -28163 -88760 284928 78174 -396037 148820 95473 52808 -126598 -179802 118191 -136986
15392 108581 -311462 260802 7837 112300 139399 -62572 -82766 154559 118443 -180103 327448
15380 -57622 60956 -4238 -208085 245204 259743 -188750 -85036 -155315 -109795 18454 -4823
15368 61319 111953 45047 174134 -245916 264345 23629 210949 98739 -172803 -74603 -69511
15357 -69511 29908 252832 95667 45679 -145828 304744 -196736 109749 26801 -215055
15346 204080 -222104 165365 342945 87932 64872 86235 -45372 288837 59073 -109642
15335 -94585 17457 -192893 63345 251601 9835 261492 -336259 147799 178500 22820 79849
15324 79849 -71912 57421 390537 -36153 -7458 346646 -237457 298461 251308 79351 -36451
15312 24453 178646 273933 -165542 87391 -99655 169467 -129522 -11135 300384 -62229 -36649
15301 -36649 212109 47398 37901 29257 612268 180654 -51353 180969 -122946 -193996 32465
15289 187367 257882 -16011 -388639 292403 24757 -45803 -116222 48824 -159210 -163253 -81168
15277 -93480 -36149 48996 -63935 122896 -76262 2956 140882 -45783 9096 -294547 33967
15265 -232905 79767 -98405 116571 6637 -37686 -32851 492845 40283 224558 -146637 19504
15253 -291151 -13950 -418204 -29891 224590 -75347 -188942 -121113 -82326 202238 -31703 -364406
15242 -364406 53460 146125 208087 29541 210203 808591 1426897 2755917 3100521 2607931
15232 2607931 3208695 1673830 422206 136060 270077 -41944 312675 346711 141267 365177
15222 365177 370718 -136787 -162626 27256 -125193 -231978 32638 -47924 -197454 105731 87417
15211 87417 292516 229257 -114952 24163 -172268 58157 36236 -181524 -268203 -93204 82726
15199 448246 -125517 47281 -142500 126600 239083 147168 117121 17259 411 -135424 165845
15187 -359992 -35379 118010 180298 -40304 193878 391218 369547 227236 182270 11179 130911
15176 130911 -53973 125244 -10191 -353466 132742 57088 334970 252503 -74312 75509 -250946
15164 -200158 -42284 -166121 -199799 214322 -107528 -78198 -161338 120926 12014 -99994 180152
15152 -132837 136495 -221855 199058 64180 108857 98047 155071 -114589 -98861 490790
15141 108692 -99004 144951 246848 56270 -19446 174590 304967 29942 83200 -280188
15130 291163 97432 238823 -3683 276773 -180385 -42034 371785 87077 611826 466142
15120 466142 111190 409234 -89383 204276 -246200 -84951 155166 77284 528660 169099
15109 55820 631924 651115 511743 145606 332681 124040 -110492 -153605 29506 11206
15098 -23348 233624 86024 -132809 -126075 157299 350391 171821 327427 20670 357681
15088 357681 71372 -58700 490833 363797 105516 169632 62868 201402 188073 20454 23855
15077 23855 -118413 47722 78528 122791 141595 49662 68476 156073 121469 382226 -6793
15065 284646 148289 234238 341884 378474 58886 172112 -9914 342248 20843 231413 231925
15054 231925 86468 361548 436446 151094 38155 -86607 359183 -38021 204444 255163 259186
15043 259186 359559 132792 182944 225007 212251 434712 431639 190460 427164 455519 191781
15031 485325 387998 142474 395227 304320 651254 162593 250886 234219 424163 -85976
15020 570079 361662 459588 -59747 133020 290780 291519 114337 336126 282773 344318 227102
15009 227102 264755 377382 16158 132611 25709 270434 338134 -119645 357240 314394
14999 314394 172455 411054 170164 632404 74158 269921 242223 199179 -195074 23624
14988 119992 244650 550114 240516 95676 427315 160091 238914 351158 465030 787902
14978 787902 244844 72469 787736 293304 302286 221663 423284 502348 269842 333274 190448
14967 190448 432459 392165 403665 243920 256065 248088 493110 98036 288477 306453 243117
14956 243117 459848 -96398 -133571 353070 256256 379585 -111098 555319 152336 259721
14946 259721 178190 246608 319172 305234 265870 399431 647551 197149 453969 67018 384772
14935 384772 478034 -94636 130174 554557 54424 376479 357227 522959 646960 836630
14925 836630 423190 729296 694743 971170 745244 664517 770000 383961 796332 856282
14915 856282 1246015 1408018 1071157 645477 421240 815962 457828 252307 675053 510365
14905 510365 388885 358898 369178 309163 349976 562722 248628 299661 168591 402105
14895 402105 379031 308515 163058 452673 368232 431490 393660 767146 281397 85700 425275
14884 425275 793729 650088 698188 840244 382938 321133 100846 497649 478362 460571
14874 460571 435251 641702 222622 642316 350196 535823 490375 398729 538901 300933
14864 300933 627058 498049 689084 370479 140662 143453 389055 67390 144378 319377
14854 319377 325299 542581 714068 415828 53912 405122 402800 459295 615390 492571 509414
14843 509414 351715 442565 609889 565313 500077 624975 880105 850829 657587 888127
14833 888127 656308 577477 120973 349239 529602 455544 267805 522015 610438 162997
14822 364801 459953 635656 472504 643704 256948 158189 218567 585338 621976 362166
14812 362166 466459 381294 481679 446532 361474 520934 570843 623956 890131 573438
14802 573438 653923 451515 779983 618986 631225 579228 562510 512908 533608 649974 243930
14790 649658 684810 387949 469232 861365 507020 664985 858694 392180 323353 556315
14780 556315 411109 429616 409854 638569 639337 559140 541499 613308 721434 779220 565018
14769 565018 168423 427340 551052 88358 593618 727270 797677 488388 497631 461719
14759 461719 733091 506250 867965 794050 740443 681029 888973 796135 409806 430913
14749 430913 595429 487285 440409 427805 332061 589416 629015 448391 611472 477796
14739 477796 646463 592036 674040 780993 840485 664531 848167 539437 765107 734991
14729 734991 853647 542103 819391 890069 516842 778575 1008896 1249845 1125443 721861
14719 721861 723255 643376 691050 962038 591438 721454 1131788 650851 837249 783333
14709 783333 1067996 638156 555164 1124763 871169 847453 1061065 610461 1106943 834813
14699 834813 1049355 1050696 929439 973464 1236681 929495 765330 749493 1309004 1009830
14689 1009830 1082914 785566 605143 539905 669421 1033850 977172 609477 957496 966784
14679 966784 769908 806263 560040 568031 892396 1052173 1120073 914150 844877 724170
14669 724170 532073 1158242 767900 1062963 890528 1186139 651050 797886 1120438 899509
14659 899509 832540 922739 981534 945758 1247804 1252460 1147326 1105791 982172 935679 777524
14648 777524 1366630 894196 1243545 876389 1043895 1072294 1276474 906521 1125766 900302
14638 900302 1191295 954778 940895 1339219 1241592 926668 920873 1028546 1120303 1334211
14628 1334211 1061203 992281 959126 1220767 1241187 1207723 1138942 1340622 1572207 1116514
14618 1116514 965193 1296587 1064021 1122469 1209471 1107776 1231972 1111291 1453622 1346418
14608 1346418 1387692 1212111 1329463 1315596 1430894 1646426 1228767 1441546 1373651 1547075
14598 1547075 1681981 1362350 1344747 1443122 1446852 1814022 1487737 1535299 1564140 1050963
14588 1050963 1531770 1573309 1699172 1835464 1375920 1653761 1648376 1796318 1431303 1576886
14578 1576886 1691365 1720275 1851290 1805322 1701943 1839085 1630954 2207758 1511348 2022384
14568 2022384 1831508 1805513 1790311 2095606 1936637 2144364 2457003 2254325 2393370 2202225
14558 2202225 2429536 2529422 2661037 2604930 2827918 3211856 3606160 3870316 5374044 7199987
14548 7199987 11112260 19112060 36275368 44091231 19327327 6553410 3422891 2270669
14540 2270669 2294058 1830605 1703152 1708788 1823620 1819411 2298367 2586160 3078443 4200175
14530 4200175 7425991 6022737 3023453 2096492 1978883 2152763 2187606 1792051 2255417
14521 2255417 1901036 2245082 2438529 2362266 2119124 1992418 2317153 2565579 2287140 2187771
14511 2187771 2160214 2551762 2195161 2008319 2272851 2570272 2767685 2483437 2583768 2786091
14501 2786091 2523329 2445337 2693889 2774307 2741887 2779527 2985151 3054267 2972149 2566574
14491 2566574 2801023 2845935 2911962 3179504 2873849 2991136 3381930 2919011 3394942 3130974
14481 3130974 3323521 3380447 3380383 3355335 3577629 3522242 3631369 3671745 3494397 3691067 3473945
14470 3473945 3685591 3755114 3916628 3923835 4020937 3405786 4022254 4127360 4177864 4352399
14460 4352399 4439452 4269770 4297999 4382546 4114212 4655847 4236418 4530028 4631429 4432314
14450 4432314 4778230 4744243 4895687 4477558 4950722 4712519 4579511 4912589 5315281 5035883
14440 5035883 5095569 5248466 5344109 5390250 5052887 5711951 5833171 5740226 5545390 5717813
14430 5717813 5906185 6220078 5846469 5989735 6226698 6136991 6587843 6545052 6531063 6509698
14420 6509698 6976862 6542426 7075688 6836578 7886350 7444955 7637957 7333015 7730669
14411 7730669 7700809 7745595 7697691 7748196 8250913 8532413 8554255 8519621 8554881 9236011 9417617
14400 9417617 9386548 9335879 9166276 9411217 9810254 9514238 10128979 10267721 10616781 10700781
14390 10700781 10689720 11025734 10825098 11090051 11303323 11741684 11862384 12013799 12226473
14381 12226473 12335957 12940524 13281840 13168515 13252363 13727734 14083726 13891917 14551298
14372 14551298 14561432 15099979 15362425 15674298 16114002 16370568 16533030 17234588 17369341
14363 17369341 17780704 18190981 18411621 18905838 19173158 19737817 19848487 20688684 20842343
14354 20842343 21368389 22069341 22526813 23009242 23434100 23855308 24825081 25219423 26007668
14345 26007668 26624173 27084080 28143053 28904516 29709051 30376739 31385891 32211941 33010467
14336 33010467 34051991 34961941 36119596 37480282 38011544 39486905 40934124 42259143
14328 42259143 43253017 44773323 46217352 47631390 49578551 51447985 53208129 54769698
14320 54769698 56960334 58893408 61027412 62972388 65707464 67851998 70636042 73916206
14312 73916206 76387227 79820159 82992406 86732559 90642308 94655998 99021022 103429346
14304 103429346 108239872 113510129 118937351 125070745 131271588 137875905 144624866 152609870
14296 152609870 160461929 169176737 178324694 188282433 198669757 209939858 221494497
14289 221494497 234241001 247575416 261691001 276018563 291939362 307357072 324084639
14282 324084639 341319564 358666373 376241401 393370990 410512068 426221554 441389935
14275 441389935 454500229 463003243 467657733 470995533 473158045 475164271 476778129 475598717
14267 475598717 472910199 464906278 454144360 441797364 428297099 412741224 396028546
14260 396028546 378481173 360799596 342761623 325374683 308328038 291835629 276353224
14253 276353224 261396379 247025313 233486936 220830036 209089700 197638079 187111548
14246 187111548 176908310 167578613 159101627 151089673 144218349 140742914 133425144 125961563
14238 125961563 120054962 114540353 108693495 103772238 98970996 94710639 90846362 87253465
14230 87253465 83797415 80293976 77158745 73787737 71011697 68233878 65492737 63125289
14222 63125289 60899669 58822947 56908308 54700096 52627139 50887614 49365937 47768281
14214 47768281 46303047 45264898 43399731 42192254 40765801 39322642 38657743 38001741
14206 38001741 36956070 35817976 34266271 33350046 32076723 31934675 31319053 30243700
14198 30243700 29043390 28347170 27817161 27032603 26600863 26094632 25144611 24220196 23791930
14189 23791930 23406731 22495823 22194106 21623743 21426019 20598437 20380568 19637547 19328842
14180 19328842 18918668 18313021 17916085 17585583 17408603 17037839 16591270 16111312 15853391
14171 15853391 15468757 15216765 15023667 14960706 14299727 14063095 13969004 13558548 13129069 13059070
14161 13059070 12970558 12453144 12058481 12336870 12113508 11966013 11566997 11066624 10866138
14152 10866138 10895059 10952756 10526099 10443969 10023706 10004261 9715615 9851142 9500229 9578643
14142 9578643 9454425 9299599 9014808 9033951 9095364 8769819 8684047 8448023 8320623 8477440
14132 8477440 7890859 7839706 7911726 8022965 7776744 7160009 7502491 7609939 7400661 7334071
14122 7334071 7047645 7018283 6885651 6831836 6676510 6551199 6162037 6266415 6034067 6288528
14112 6288528 6166134 6257914 6124636 6082241 6038425 5905070 5950435 5673065 5426236 5462286
14102 5462286 5493426 5520999 5122576 5284406 5234805 5257570 4966307 5087712 4938659 5136980
14092 5136980 4718173 5084350 4969851 4883026 4847252 4796245 4612862 4597867 4409424 4355558
14082 4355558 4454792 3965670 4106778 4207742 4126079 4118320 4040916 4048550 3770028 4210283 3837729
14071 3837729 4074051 4095214 3887429 3636246 3969893 3627639 3759714 3647059 3408074 3376500
14061 3376500 3560140 3595285 3058030 3635761 3317184 3517750 3378574 3220434 3272642 3441904
14051 3441904 2975692 2955852 3028731 3318712 3139292 2879626 2773331 2903452 2724982 2747749
14041 2747749 2826792 2575574 2605492 2884229 2618649 2533194 2985575 2693249 2525154 2739669
14031 2739669 2553510 2568566 2789090 2713208 2755671 3013142 2845208 2676491 2561541 2572092
14021 2572092 2496463 2367216 2574691 2130931 2098063 2118526 2154925 2444751 2124740 1864535
14011 1864535 2304433 2152902 2087638 2193050 1858481 1833582 1888678 1978639 1926882 2089263
14001 2089263 1948152 1985070 2029224 1596555 1881961 2027417 2218464 1460953 1695096 1649329
13991 1649329 1866004 2609529 3793389 6456163 13255099 29695675 46248984 26873227
13983 26873227 11643586 6668282 4918383 4002202 3299070 2987252 2955380 2786615 2543696
13974 2543696 2727932 2274756 2578422 2073353 2288254 2187077 1806789 2112948 2063695 2135291
13964 2135291 2158548 2110221 1663022 1842186 1964820 1699702 1898765 2156201 1843556 1526447
13954 1526447 1844965 1489779 1896199 1862430 1303075 1770490 1434797 1863937 1667023 1771050
13944 1771050 1929140 1533451 1459326 1516525 1606452 1651181 1448632 1619240 1246125 1541124
13934 1541124 1329615 1221861 1003580 1390154 1451911 1225967 1169468 1123733 1865885 980719
13924 980719 1217197 1659818 1578433 1045105 1560933 1244057 1400955 1414422 1396967 1450296
13914 1450296 1487202 1109435 753671 1292349 1356461 1410295 1249209 947667 1408873 1263186
13904 1263186 1091084 1098263 1249362 1331233 1211038 1014637 808359 1473920 1103599 1299196
13894 1299196 875666 1330655 1139760 1154004 1271010 1237714 932881 1146898 1166050 1132030
13884 1132030 971681 791871 1078565 666830 1224728 1201637 1037890 764047 1183547 768635
13874 768635 856541 951502 953299 1176654 1112031 829724 989574 984762 1287674 1095900 1116543
13863 1116543 1031609 749810 1104701 886835 1052156 986241 1086749 755064 837947 900357
13853 900357 570103 953695 969524 714336 809568 815450 525849 946628 972031 812286
13843 812286 991618 728768 927956 883517 728998 939721 872428 791293 892196 996801
13833 996801 490188 595274 1212270 1021254 625523 963096 869622 829080 890651 844107
13823 844107 393213 755623 838957 441057 866565 796658 837086 776824 457606 790924
13813 790924 449451 886514 922949 693482 665808 780543 542323 613082 764765 644442
13803 644442 751191 875474 728780 928187 624004 666404 212172 675705 424611 718174
13793 718174 778954 566294 594721 978161 459209 639303 780333 757408 801332 974542
13783 974542 596825 304271 814897 626096 635347 538358 347305 776217 627165 443461
13773 443461 687409 726284 546191 762906 581573 935124 421819 753931 861946 545334
13763 545334 717544 570359 652275 566877 968653 558732 723141 564310 362279 491606
13753 491606 654321 278360 722376 425704 367706 519643 650775 690527 440747 383573
13743 383573 513091 471455 357870 431230 541434 523689 460205 425938 364588 336639 332980
13732 332980 570870 577635 513435 446275 637790 456074 291228 564447 344467 224075
13722 224075 574990 280965 513703 394243 573831 275896 579025 236206 567821 349236
13712 349236 314304 269292 417822 388489 435600 347552 662069 753901 364161 444313 32784
13700 174081 667089 409977 897806 462933 -107006 659328 387463 765177 339733 467392
13690 467392 823902 504089 465342 8817 453148 838118 240473 673371 380788 449762
13680 449762 210878 575540 435829 422984 304121 233465 336273 566075 449241 109966
13669 349955 798050 622406 546100 503109 464567 244917 -68585 454868 644830 510853
13659 510853 389575 449841 338200 239880 468501 488824 349723 501520 168452 551956
13649 551956 559138 -32807 472118 677808 525926 359716 584602 84426 -163207 687454
13638 205343 295194 269565 332974 114862 125838 362304 89651 286820 194526 19243 -11823
13626 520583 58506 210711 534196 121779 252554 671119 196970 462366 591194 147787
13615 197113 432271 103464 448665 473415 275326 468040 385685 257623 381837 329484
13605 329484 38676 144887 93246 401445 271584 206296 46485 229150 369225 429227
13595 429227 409658 403527 400768 251449 209939 454239 260849 214552 566763 -739 282414
13583 109980 88798 326284 256595 175508 427827 47131 219114 185238 -30878 314755 531255
13572 531255 209013 8009 433017 273952 147953 336084 561661 132148 158203 347455
13562 347455 7805 -22776 453267 332361 192066 247238 291392 220835 279289 384664 283202
13551 283202 59824 99539 601498 331056 316474 220486 275029 535378 -53313 450635 22619
13539 286231 122790 275699 255556 174438 44925 244232 189991 120188 285489 476594
13529 476594 39713 143742 665108 486775 500792 62691 314161 336380 398108 172619
13518 19369 132464 -26696 379392 171024 221125 373402 199685 410227 274281 497788
13508 497788 22217 117381 639080 124887 137834 9170 597085 321728 357182 388709 212036
13497 212036 194670 339738 -60539 237369 92547 62408 211408 391969 -6328 425079 -45962
13485 180214 -212824 98066 151423 411929 -38851 286112 194720 -87441 228488 387337
13475 387337 228879 293098 148900 256987 143127 347146 290514 450689 430270 285901
13465 285901 175314 4525 -2323 141997 208063 735175 592339 165847 -62757 59162 253918
13454 253918 50617 98195 -157883 37519 106585 204259 108597 138111 -120650 175745 65773
13442 -144277 205638 233976 -37066 90544 216359 64842 68805 348988 270058 254477 422655
13431 422655 105731 448489 253124 182720 438705 48044 117680 266739 229108 490974
13421 490974 116836 227832 94575 320113 -131696 47964 168472 67588 44514 404859
13411 404859 320681 366303 330956 85060 137227 -96113 -50195 98816 332828 107643 110689
13400 110689 270865 122253 189834 57434 -18735 228165 15780 32716 -85308 101702 190036
13389 190036 348491 65179 204518 -279681 404641 -108086 409392 352767 235752 623105
13379 623105 58200 -3419 -22346 -9329 277605 79172 112401 163592 440977 335039 416605
13368 416605 429130 -291118 -9169 414459 443501 -20306 245027 153000 389822 381364 171554
13356 108 139797 145269 271140 317446 200269 281546 57887 235835 118274 -445574 393537
13344 151011 384605 222614 406692 340934 -210016 359404 532401 260383 243592 623641
13334 623641 62419 -23900 -28933 21131 365730 -232164 -20486 265943 326990 -23368 316185
13322 483345 192339 295857 151529 190657 175073 402122 146892 110358 200432 188834
13312 188834 170378 142573 262008 111971 56 62376 149514 242 -128480 15012 115999 150781
13300 150781 -32831 371083 58313 99552 125084 -41102 110667 179580 150855 -269077 -142652
13289 -142652 -104748 208032 -180496 3984 199794 6878 388819 173697 -111057 -58621 -173887
13278 -173887 11129 -130751 -145668 -9670 -234283 211055 89524 -7392 404143 598771 197572
13266 376151 15696 345369 142003 -67871 -22660 -221775 29378 -3166 -91864 54026 -144296
13254 -87225 -224498 -350452 152504 7999 -281347 54589 -68959 115665 59066 255196 21087
13242 311752 184732 177925 -18898 -139467 16944 160464 232222 72845 129052 28564 70582
13231 70582 181724 -26071 48802 -4045 -47462 217216 217074 40369 81205 -32307 -111894 193590
13218 -38749 -490187 203922 352909 227251 -36371 -95420 69566 31964 -93259 216866 249758
13207 249758 224393 104928 4931 162046 -2588 155041 -127081 183778 300547 240802 123972
13196 123972 19290 352158 119408 265691 -61933 299066 102532 34906 552490 6191
13185 274201 217368 -196186 169683 7564 -9547 97474 -597477 110681 35613 -261302 15233
13173 -141150 105064 409096 14516 51241 301235 -178706 161519 161075 -304714 -104821
13162 28086 38387 -51619 -470515 265559 6635 -87816 -129562 27798 -18436 374939 84976
13150 221396 46197 -27200 186003 194162 -115521 106845 55805 103472 -124907 270825 3568
13138 -37929 12564 391325 249603 -270209 99694 -107911 -8354 58277 196504 -229067 407742
13126 127639 33915 -60764 7233 -127944 457897 -269140 -63372 210170 -61496 144050 528911
13115 528911 -76242 -174132 249606 -137237 -28139 5350 157536 94038 55475 -165048 19349
13103 25685 118637 -311768 96252 -50827 17852 19334 269915 135579 21692 -107320 -69425
13092 -69425 -914 17512 -36921 46738 187953 139028 147868 -21348 83017 -181311 -41239 105231
13079 10488 186632 198514 -278660 59454 259610 144054 -30779 -10660 -386996 -56974 -17165
13067 155218 -57648 12816 230081 145051 -103915 42152 -39748 -133641 -16824 179216 -68287
13055 123276 -157563 118212 -274841 252283 222573 -512435 121896 -74008 59322 219326
13045 219326 -8773 -80114 -439062 -66334 -68911 53755 18160 -385308 -13222 -43076 -4103 -175375
13033 -175375 -191425 228123 2663 -17926 402328 137654 204016 -200539 -371497 98420 225352
13022 225352 -217508 -89833 3357 -49141 -206291 -61241 211869 310024 72201 -55934 386116
13010 -65377 381387 -308699 -189331 182464 -393679 99418 45177 -89535 -54733 117760
12999 273643 -30483 -57856 135067 -165249 107219 126916 -93463 16226 -122798 -196920 -319489
12988 -319489 -57559 152200 146171 13593 -202559 -97727 54818 -173016 -10812 -60090 182295
12976 27684 -184067 47635 185260 -74864 191650 217632 -143650 32946 43214 38953 58710
12965 58710 -57384 102037 258780 109870 53582 244802 -75340 -110405 124408 -6669 278769
12953 -103406 -34305 182064 16842 386123 122842 44563 150191 -122284 -394454 -5345
12942 50436 -324323 456263 -321852 325385 76485 201431 -165070 -144356 66753 -52445
12931 -134802 74888 206328 -154844 274359 -74230 62129 -190848 51967 4291 102155 212543
12920 212543 -106919 221476 63668 -70502 -70761 96168 85884 -217241 -62557 -248594 97977
12908 271002 13214 174580 -234292 -77566 19420 6792 -31352 -98323 85893 -153568 37839
12896 -56450 -28964 194077 -27305 90315 -296827 -251214 70142 122254 72206 -129684 -123866
12885 -123866 171568 229831 -23277 300013 -16833 -293900 45926 -96763 214627 -85799 220704
12873 -73144 129145 -55939 -114366 -166941 -127993 -239509 -99699 228955 -251619 -152164 -49814
12861 -20 -158345 33338 -174447 -131744 285612 -54415 163277 25201 -85027 110367 -89342
12849 -80052 4556 21810 270872 -380134 -61704 -204759 -5913 -403820 -61731 -103359 -21078
12837 214864 149920 8689 -201878 -234933 90569 -52600 133751 -310425 -176292 -19499 -180611
12826 -180611 192601 456001 297970 105592 118062 153598 -51961 -59428 -207540 -233341 141543
12814 86593 -232777 -53887 154127 -56564 154210 30658 212011 -450075 256293 69109
12803 344885 137225 -44956 -107387 235881 192291 231738 87770 -112708 -119157 -232159 -205815
12792 -205815 -243602 43764 14035 30605 -241088 144619 -138147 -381025 -330428 250601
12781 305339 138393 -35252 -253456 -143065 40514 255193 20309 -13780 92315 253728
12771 253728 62506 118510 -210431 -227303 154967 74238 -99544 191666 -11851 135469 -253761
12759 68852 -54786 27420 161225 -160744 -134071 346190 19997 -172844 292924 -59141 -257076
12748 -257076 105554 -341454 -229003 186251 83599 374082 245646 95171 -128020 -194283
12738 -194283 14939 -251167 81469 134100 84074 98530 216239 65380 195396 201500 -80121
12726 43579 160388 69549 -16954 -269756 196851 -179839 -20246 67653 67911 -166206 173005
12714 -41215 -382175 -291380 -78344 -115212 235965 160612 -37478 -117326 -227443 -254971 170123
12702 155672 179256 -491967 122291 -129576 7539 -71768 -250321 125342 351100 -30885
12691 24222 -25053 -89716 -95294 -493163 245932 -427203 -278749 -26089 53686 -301474 -72561
12679 -249055 314051 334051 19452 -6950 -12109 42096 -101406 -289043 -119425 -281600 55140
12667 124707 215475 204160 50545 68436 -67546 44933 398587 310725 -202530 340332 248284
12656 248284 398930 160631 73364 218163 -78477 -114785 379790 194107 357485 -301452
12645 -92808 236352 -74508 -261921 29526 -147044 -30010 275834 346764 82276 258288 318634
12634 318634 66734 116324 263028 58940 334984 317364 240906 -374316 -248997 -138669
12624 -138669 115154 250260 138445 91227 216632 -99059 248079 304583 268868 -115819
12613 -212472 69703 -11920 189283 75190 78166 -122556 117818 -141119 -61777 -20529 333676
12601 209319 319612 76122 17684 164572 102639 -148569 -19887 281841 205328 110222 324189
12590 324189 34470 -190149 117193 -11140 -38257 -113291 -141566 132944 234464 -238356
12579 -66290 171422 -56114 147355 -58626 -208665 31298 37305 90399 -137762 -110730 -450574
12568 -450574 -88011 -103703 -93945 78001 149019 -122107 -300010 265017 -36409 106117 34704
12556 -291314 208887 -74973 -195230 -224879 193140 -166581 359979 -164782 -151433 -61354
12545 -125843 -73585 102013 -232091 33708 -266563 49747 145051 -10523 -129144 12807 9047
12534 9047 84276 129420 142879 -96760 379474 -94615 -2210 70936 -148519 356796 308737
12523 308737 213237 67519 -161125 -346017 119546 140793 856 -51893 100332 91482 -139642
12511 188768 -74556 -278796 -254525 5668 80587 -123247 -75578 -91112 -35761 387098 278556
12500 278556 37445 -55717 295657 342691 158955 296700 -28549 344540 40833 34857 -149826
12488 -47309 -178324 -158507 -156823 -12659 30213 199305 -53572 -201779 151743 -353301 -12900
12476 -10758 -2946 -57267 256333 -188159 -418084 -181607 -127070 24824 258120 -38341 -10147
12464 -19741 388757 33256 -39802 209368 248396 98041 70270 -23572 41088 114033 -981 291175
12451 -45838 -519816 158181 -181903 -19135 183401 -12703 228741 -158709 -27040 405371
12440 -81969 -118140 113915 30444 -120303 -68045 168701 -115678 94906 160847 33540 -156914
12428 -77655 191535 -16194 -85581 33386 130152 81678 -369734 -11465 71912 -126637 131595
12416 53025 -44367 338167 70759 -110546 -146837 135115 -58203 348470 134185 23412 47828
12405 47828 99150 -175386 64531 -262875 -318520 20364 266475 -118336 167855 -24969 152881
12393 194644 -233720 -95539 -299652 27639 -81442 93340 49523 205831 -185116 -107349 172345
12381 234401 65239 -18246 170360 138831 -73173 413044 374404 -86747 175610 95348 155074
12370 155074 -168803 13279 176730 249995 79697 -341520 131787 -60426 137205 -34950
12359 -231529 211290 -86410 -78861 -245143 -57862 -48544 -79991 268847 171183 -53983 347115
12347 -428 124807 119815 358405 -199254 147719 112526 -42374 -31447 92326 10894 74224
12336 74224 4831 -66284 -17904 44620 -397237 -20497 253955 133991 285237 380385 124425
12324 120285 -6664 59448 190733 145984 -211380 422801 173332 134109 177083 3526 -41699
12312 -177169 187118 18284 131884 -43653 219535 47800 -21700 -64186 -108908 -41257 133829
12300 -52523 134241 -52163 -130660 163925 -319287 -136353 -44906 -154430 231733 89108
12289 -107286 -305040 148254 31737 -37667 332474 341370 221844 178902 99181 47744 198186
12278 198186 169614 -51595 -114928 -1809 143240 53134 -207628 458065 122038 -250191 -29678
12266 -130198 39096 -331301 29188 -228207 -238205 192579 276633 66945 330176 -60895 61724
12254 -42766 166028 62873 226888 52410 -47707 99491 49096 116639 162512 -174061 -36174
12242 -29386 375418 -52691 -19898 204007 -184546 14752 123986 -91562 390611 25812 189430
12231 189430 198030 224924 -149289 597848 319638 97000 54739 458977 -165094 86397 311295
12220 311295 72060 396982 451355 160713 123716 100493 298919 178078 26854 107560 236718
12209 236718 -31666 -29822 471880 284035 362838 93457 -95247 60624 244717 504892 324973
12198 324973 382256 172964 167826 147102 34555 258000 275425 72727 660626 139260 -84360
12186 544130 282215 304248 124613 111325 314092 58594 79938 166258 242149 321018 185668
12175 185668 194504 -30393 380702 240431 78542 261502 201135 64376 -91641 280660 436330
12164 436330 258640 155507 -170718 419571 -157962 30762 102822 317495 65562 102258
12154 102258 9562 -71278 -14360 428357 136461 270376 124287 253370 406187 -165339
12143 166008 -212955 549373 276003 284889 273926 119084 162047 314466 14407 58170 357537
12132 357537 -7461 334834 151376 110107 3791 149966 129317 -94010 225148 257489 295495
12121 295495 379350 -29046 -29653 513349 -266318 -63743 -67100 352241 -43188 118779 -147728
12109 140186 -240381 -408064 166415 69156 -132046 -62648 -111040 164920 -194726 297441
12098 -132203 -10756 212703 -123064 148614 -207920 87643 -151055 -281283 -127679 424888
12087 -98202 150996 163404 -74714 99356 -171969 167949 141681 304536 -41347 40155 270573
12076 270573 211415 149244 163778 29686 -118351 -25863 12268 -139389 -86178 56103 11332
12064 -99169 -309656 64310 440174 99667 125391 -187884 5124 -324419 31513 -152490 325133
12052 -18792 34733 147991 -35895 160460 -324546 155765 123347 1961 207440 -171421 21306
12040 271645 262532 -277900 72761 -86720 -580245 -117761 -92943 -143357 -11584 -164929 71207
12028 66349 -210107 25660 59913 33684 -58426 -82744 59782 -119231 194421 -67420 -386735
12017 -386735 -107020 62045 51365 96857 -167647 -110613 -57827 -115056 -87307 42611 -189393
12005 -17580 -122707 39800 122865 -286854 -170924 -219446 -250495 -30555 190660 -98519 -172072
11994 -172072 -221599 -87236 -64263 -103442 -88438 240565 -235817 -236843 276050 196150 -112575
11982 95976 -3179 -174852 -1482 -360966 -175778 -40383 69152 -253814 163537 -24509 128370
11970 -45229 -230865 -92007 -161521 413039 215462 -157166 354471 -110831 -70833 -311938
11960 -311938 278414 89835 284918 63177 -182684 -477861 175875 12294 -4385 141087
11949 -10616 -3211 -53412 -122664 -153544 -97048 -61238 -98304 -322290 -38004 9002 59653 -150811
11936 -24655 -17976 -293422 -320967 -536229 -22207 46417 -84765 7075 -146128 -290448 -249265
11925 -249265 37523 18415 226969 13322 -187620 -170568 18362 126012 -99716 -89527 149977
11913 -184846 -48767 138535 -251559 -194112 405162 39798 -16778 55544 -136484 220848
11902 -68324 78966 -200012 -309633 -133458 -403122 268658 -6017 -74942 14153 -202059 -46955
11890 359685 234289 -104558 15300 59741 80860 5417 -258560 -33829 -85411 212348 -268056
11878 -239177 106361 70459 10817 -68859 -8283 98619 64064 -159310 -112683 -413185 120740
11866 -165128 -110850 57997 -274819 -338573 122385 75686 -363655 -174150 -14286 -188786
11856 -188786 91812 -171885 101979 141521 89688 67366 196061 -306677 -203069 -237176
11846 -237176 216362 74707 -119546 -250032 134452 -234764 -105477 273 -77573 -78601 -347526
11835 -347526 -220216 -201839 -489166 -54501 -65890 -26811 60012 200140 -350996 -225407
11825 -225407 -42199 74914 105526 -121579 -4694 235149 -217852 61277 77218 36189 -219096
11813 -201320 359203 -9742 -87998 -132114 192442 -115862 169220 171059 -158831 65451 141407
11802 141407 -265448 -219509 40482 90382 -43714 137340 -393092 -46306 -84588 26353 28849
11791 28849 35297 -126081 121551 -7483 -228177 -110066 200156 -16997 43026 -265841 -90027
11779 -152085 -160609 -333636 -181475 229272 -161222 -191487 -23003 43240 -25844 -289752 -416051
11768 -416051 -77650 69980 -203882 -17179 -35675 -32474 -7986 197415 -74603 -275972 -153445
11757 -153445 -80259 -144207 -66489 -196957 -215147 24731 -167196 -375485 -228451 -25681 -19607
11746 -19607 227740 -367286 -145867 103488 -238797 -196380 -209047 -185829 240397 -142802
11735 -146690 3026 130709 -97907 296766 -151371 224647 24632 -275698 127605 -194759
11724 -113783 -124763 28810 29631 -133579 -188074 206253 -124148 -53413 196069 -230414 143617
11712 180818 -196727 161972 -24208 -204117 186322 -134832 -173258 -75003 56895 -151895
11701 -196988 168610 58181 78595 100584 39589 -133111 161583 84576 -139657 -381311
11691 -381311 -79139 236460 84320 137040 44065 -266369 256929 -202449 258878 120727
11680 70573 -28687 -132687 206846 -322993 -153243 58462 -102867 -252323 -207702 -1095 -399018
11669 -399018 -134673 25899 106779 173024 -60382 73913 -176215 79418 -84052 -17309 -74899
11658 -74899 3697 -243343 89100 -6338 -106604 160603 36021 30943 -83850 -193683 179507
11646 -264832 -280964 -190473 -96840 -597364 -182891 177593 -141750 210920 -297664 -290199
11636 -290199 132258 -231894 -54108 -316440 -350560 -64052 58028 99443 52027 -207918 -276584
11625 -276584 128063 5586 -58899 -27769 29605 165201 -141123 -185033 10384 86711 66378
11614 66378 -320314 98911 -300873 -149027 107715 -53497 -72688 212988 83422 -113035
11603 -16490 72113 1603 -23259 -34553 12374 66296 -225797 -103460 41002 233240 13054
11591 190790 11564 -11836 -93974 -226459 -13763 66533 -305231 10543 101322 -13159 -112711
11580 -112711 -315238 -194460 -63196 -283278 -160995 -22308 19686 -21369 -152605 362517
11569 -237872 -455940 -28816 44784 -65661 323897 -137251 -310578 -15200 -302034 -52878
11558 41209 -65911 -251566 -6393 86279 -218987 -510267 -82761 -24008 -243131 40584 -29959
11546 249688 -82497 -6749 151038 -160224 275166 -182789 -36327 -148104 5165 -211926 -17206
11534 110445 158379 53352 -120987 -7750 -162155 -282486 -219084 311374 -74714 148876 47791
11522 -21213 185641 326117 92962 110465 121416 -324142 124733 149553 4124 7693 333988
11511 333988 252294 302063 254292 132105 321500 142214 21720 231464 125356 -74229
11500 -114184 -40889 190307 -34134 147893 166051 26943 112961 -66683 87334 62369 184153
11489 184153 295662 34111 393060 153267 133887 327702 64170 237087 361711 -127842
11478 210463 -104580 170474 119768 304629 17704 171123 216630 300567 148022 30389
11467 199097 419841 104236 117668 -103996 34663 -175164 -92837 148332 -178201 -38928
11456 -318256 127369 66433 227918 241 355509 111933 177071 264521 -154896 -239839 296246
11444 106511 -137067 -652 -72132 95047 -58742 198646 83463 17706 -179690 -100683 181035
11432 94042 104071 -143540 -61930 171782 191766 -7810 30522 -115274 -160936 205998 -38778
11420 -175878 19783 120641 191894 328349 225894 -190187 50880 -57200 -17619 -202650
11410 -202650 226475 -237096 -59762 -246339 -145394 -37777 -110520 -28585 160738 115339
11400 115339 -79808 39484 -23978 17058 237425 -197024 140573 -3773 -279938 144510 -176641
11388 13955 186458 59074 -89721 -183172 125252 -183350 -376569 -252503 -8859 -120502 -297557
11377 -297557 -2539 142088 199925 14441 -20459 -391633 376232 -177253 168330 -2085 -209038
11366 -209038 -90528 32695 -277437 -292104 133695 68273 7755 40633 186975 -100060 64928
11354 108016 -33682 -99631 -66032 -44633 -159759 75898 -162761 57168 -77891 39263 10015
11342 -148457 16402 64483 -90095 -78607 -6688 -170314 -119357 -20618 -233890 43245 -8914
11330 241943 398 -269719 53436 -108975 -90926 -257841 -50536 20348 -29124 187832 154569
11319 154569 -63964 18050 79158 -97738 140491 -159641 39102 -53671 -127123 263171 156896
11308 156896 13562 -337391 69459 -377201 -237192 121595 -239249 -60970 95779 -88266
11297 69300 -154180 -124669 50014 25819 167391 -226226 -32325 146821 -115883 -94517 313208
11285 -47278 -341509 -68587 140800 152465 -55378 -69171 -177448 -389843 -186782 -31735 138509
11273 -168916 4911 271711 -147777 85190 79992 46552 -217782 -53885 -10384 -235225 -439950
11262 -439950 81358 -320462 38167 -324074 -280862 1143 39357 123537 17298 -289136 -178179
11251 -178179 -273238 -457478 193519 -264963 -138736 -19308 -71354 -123563 178390 -175147
11240 -344863 383259 -179227 -345433 38039 -56973 -40172 -112121 -69459 -134155 198672 -240837
11228 -105399 281865 7213 -315476 -449321 -279280 280456 -140296 -260549 7104 19657
11218 19657 291911 170604 -168086 176354 -288423 -156589 164371 324219 -74139 -202855
11208 -202855 -277490 -23369 -281685 -78453 39263 -264873 -109076 45609 113217 126894 248212
11197 248212 -166681 47221 231401 33800 -228371 -16916 335270 59831 165322 103547
11187 103547 254830 13738 62504 389985 14025 84260 -103901 53398 7712 -160273 22825
11175 -261969 99008 -204162 -32868 -173199 -215554 48805 66834 13290 84657 -173440 -301041
11164 -301041 -10684 -478538 83125 -37006 -275072 123191 -261248 -153156 46951 -472237
11153 34810 -80577 -206013 145795 3523 12626 6552 62077 -202480 -377160 -334702 70231
11141 -280667 -35870 -153089 233698 207947 158100 155178 26837 184229 179607 147604 -86809
11129 47030 213704 184430 17545 128209 -210125 391013 -125928 -86965 259501 -437519
11118 72295 -111951 215217 32026 -175771 -31707 -239332 261002 23320 -32848 -142880
11108 -142880 -52051 64464 409386 180770 515880 139311 106371 -98327 -200603 -47590
11097 192405 291551 447180 -292006 338408 138134 -47972 223196 285775 445258 750910
11087 750910 175600 469738 -350579 459901 82106 390321 502413 237667 551055 155181
11076 52203 152875 249389 432346 345768 194501 96304 241883 347401 397415 176092
11065 536348 474000 215656 491006 527553 274064 354245 189791 422503 204654 533628
11055 533628 447140 228423 734673 447698 643619 965817 716149 784175 307632 640104
11045 640104 695421 524915 509804 932508 977284 1092616 816698 1018889 1186566 1073600
11035 1073600 832560 634516 781726 971857 791871 809189 1140702 1098023 855037 818971
11025 818971 1013655 886541 623324 817819 323439 794798 735111 673224 403083 591068
11015 591068 457711 983417 625093 578921 704632 375808 675478 892989 454529 701111
11005 701111 748823 672741 344174 737856 637234 500594 979712 579622 934698 646580
10995 646580 773953 723537 779478 531573 452482 684513 644874 336194 649199 813698
10985 813698 1063595 839903 711794 928368 1216570 827312 1162333 1169380 1459314 1263098
10975 1263098 1214014 1551230 2086102 1947163 1841397 2685903 2902936 3017855 3124960 3432784
10965 3432784 3615005 3280401 3186956 2762058 2201794 1818285 1566602 1079185 997484 890477
10955 890477 690760 834784 921387 562536 905778 567465 331387 201401 438322 78816
10944 125331 465167 538930 299788 203572 190100 50973 -23225 97733 117599 -110009 38025
10932 -261856 10290 80608 35576 150918 38028 -241856 154046 325093 45626 14233 124858
10921 124858 65428 98789 374510 -104753 4023 -5891 -280986 280944 78254 -7769 -176436
10910 -176436 -63279 -33773 -148491 192610 -94166 -97026 129754 -203662 221079 -200935
10899 -191429 -205889 -51459 -177922 -29263 -15512 22188 -72722 -18560 -149428 237132 -307978
10887 -146156 -58510 313093 -104618 -241220 202694 65888 143364 -214670 -183333 184836
10876 -14064 -253558 14217 -106428 -80292 -75083 319631 -44887 66420 56154 86140 109814
10865 109814 -94762 161789 -301912 -66688 188506 -143928 -50912 -120110 102381 -138141
10854 -49763 332552 -7341 216845 -100807 91644 -284549 193846 -49932 114637 -452844
10843 288942 -101603 -86541 -263241 168281 -185287 -261117 39660 -369419 -96957 123701
10832 -174507 317347 -11940 263998 -138118 -40478 -71796 -71141 -257437 -158568 105368 150844
10821 150844 -18609 324298 -283015 92362 64699 -237454 59759 -67240 -160202 273685 -316905
10809 -63964 87927 63589 -66140 -115637 -81692 229375 -388227 3025 -195428 -182442 -502793
10798 -502793 -296827 -184634 -174903 -83881 -150456 -219726 -342510 81640 78789 25772 49442
10787 49442 -88455 -155802 -56555 -134177 -279772 -149281 30191 -171032 -33025 -28720 -219296
10776 -219296 66028 -35153 -300080 -237437 135934 -139500 235464 223397 -287570 327687
10765 3890 -125622 86836 17801 -62590 113558 -121139 -77911 -232671 36668 363223 517887
10754 517887 -14547 16042 -131232 426653 209945 -54947 -50446 31086 138585 -167059 120715
10742 -222692 2225 -48229 -276996 -108819 -183635 -163662 -10760 -127451 -227199 -223864 -70063
10730 -20170 -34524 108493 -176988 -19426 -162347 257481 46217 -78668 264244 -60951 393612
10718 -45727 122584 -270004 114065 769 -172243 -62944 112542 -68555 -193179 4554 -220887
10706 -245431 -52127 -55309 -91153 10267 -31605 -208164 -65367 111115 231541 75766 -154811
10694 -83337 -339771 123842 238277 -160515 -65127 166006 -158862 -120295 205671 -329166
10683 -242444 -9123 156085 -64860 27453 61639 -103406 -292665 -515047 47307 258485 -155232
10671 271636 -193272 -234183 -223692 -92414 -162941 142666 132387 -219829 372110 -38679 135447
10659 89785 98379 -297036 -69321 81797 156006 -255865 -19260 -31697 -317661 -338799 546673
10647 390585 -225122 -171488 112107 136440 -119325 -84076 -167848 -15613 -69786 -383340 -67402
10635 -256496 99449 -155460 248716 -50721 -27134 -191548 14927 449806 -311440 -177989
10625 -177989 -209888 -163528 -154880 81153 73775 -124455 134314 150861 -76209 21238 92677
10614 92677 107596 -9766 -236208 -69708 -79472 -317757 67452 94132 -211362 -84086 130585
10602 177097 -171073 59797 -384032 -43977 132050 -166093 -30990 -296824 439971 -238640
10591 -45531 -62526 53436 38202 -141454 156128 -129445 278497 156985 -100833 101880
10580 141756 -28141 292194 -110159 62932 -175634 -131452 -78557 84899 -14655 7137 -94424
10568 -232730 -253077 -42303 -239639 184373 -195356 116119 172308 -220216 -308631 -62921
10557 -234529 35144 49392 -82169 -247313 -91999 -214912 73219 86757 -200420 39227 24311
10546 24311 -46738 -353830 -103064 151325 -87004 78332 -438840 115058 -88009 -57465 -143905
10535 -143905 70206 -151748 -44041 3871 -130895 -95639 -108244 -115586 -136240 -105553 12198
10523 41817 -269674 -191303 -113720 56194 69107 -409307 84203 -547371 985 15816 103500
10512 103500 -142284 31384 -24936 -140670 84368 26633 33583 -291878 -40345 -236964 93082
10500 -48148 43896 136455 -67085 17404 -284772 -252437 95523 -157220 -194590 32210 163135
10489 163135 30548 -214667 221700 -417814 74678 261089 -174014 184521 20635 85994
10479 85994 -40668 -152802 -126852 -21474 339156 -38264 230892 -204810 -109909 -394076 154203
10467 47216 -146400 46527 -85877 -193705 144984 -148166 107788 70907 -325906 93718
10456 -175672 187945 -171851 91939 143061 2642 -110522 -39855 -269792 45766 151083 -461054
10444 -109072 -10991 -313446 -51423 57097 206122 -53894 -201849 -173605 -221557 79269 -490716
10432 -157335 -149920 -113729 -60986 185105 -50427 121225 -96146 147409 171490 -339610 -72739
10420 174511 -13175 -92706 61480 -92063 233674 -146308 -79072 -31802 14834 -121367 -329125
10409 -329125 -160495 -160046 -173428 -22951 79500 290709 163542 -152953 -53529 -36151 -57753
10398 -57753 -188788 53153 -113494 -77819 55635 -72811 86197 13480 98388 -28069 100627
10386 300685 71363 330459 -206264 183551 8182 315753 169682 226569 349140 -36642
10375 240845 49706 87446 285927 332116 -49814 236587 136181 107415 303170 635315
10365 635315 588110 396302 425810 323308 649192 191631 319794 205118 -189778 25960
10354 20397 192205 417089 149007 317699 111603 535433 499492 411960 330042 391728
10344 391728 313753 257491 281558 161005 -46817 416790 -13032 272886 532018 143995
10333 162455 438986 6007 -36485 -5438 214217 66982 69318 79383 -124422 279999 31719
10321 382599 190052 180510 319796 27527 212472 -179039 10630 276255 20196 -8353 -13654
10310 -13654 -349679 -309880 171844 30796 -198020 145008 8158 203952 225 333182 112081
10298 286859 -89706 -202107 -194853 -24581 201040 -34245 -120153 -422846 24751 -110620 -8967
10286 135583 -9244 -30249 120476 -134187 -337935 -182157 3807 -25998 6991 248231 194307
10275 194307 -332930 166794 43199 -203397 -42801 -145264 -81298 308124 113806 -347467
10264 -169581 -237759 134261 24551 -167344 9805 177126 286237 -56596 63073 79333 46299
10253 46299 -90835 -81449 169633 80380 -14823 -17615 91828 164398 -274165 -104990 277496
10241 329 -15678 -78273 -182821 -5012 64185 -41813 175078 202393 -408421 3439 -5401 123746
10228 -474979 -336263 232901 -86680 -218667 -193110 -62301 -156258 245370 137980 192326
10218 192326 151193 -395917 -149587 27685 -145528 133381 -150061 -65032 -161390 77673
10207 42728 -155625 -140816 40843 242797 182443 155580 9109 -116468 -107877 55344 -174501
10195 121694 -111925 41652 -319025 -134238 145882 295658 -189743 202747 -119174 -127433
10185 -127433 -70130 99235 -61585 9244 -82968 151327 159975 -240240 14474 -130923 15519
10173 -257731 -75277 -353368 64079 79448 2098 -359126 128893 -168111 -114640 103528 70278
10162 70278 -241700 236077 142860 -40191 -26073 58254 -66752 4749 -187777 162302 152621
10151 152621 -189434 -331369 -92541 -308396 100770 -116917 -506559 -33950 -119868 29358
10140 -163464 7673 -171299 9697 -64862 -150688 -123547 219083 -164064 -11967 -290227 -327994
10129 -327994 -186710 166553 -114970 457194 94311 -134231 130724 179516 196844 103418
10119 103418 28426 -74545 -150195 -62756 187711 25179 -484543 -30949 -205010 -31413 37826
10107 -125299 -239644 154766 62232 -327057 -190104 -356016 -240093 -420469 -329593 -104167
10096 -222689 133779 -21113 -79633 -55942 25052 48166 259727 -238823 -1934 106045 -176374
10084 -2280 119679 -1483 167366 -226988 -51850 51055 74034 -269426 273772 -138407 -150686
10073 -150686 525846 -352942 46761 -51956 -66946 -87000 -23745 -228049 28078 -263712 -185011
10062 -185011 -25544 155565 116120 -85605 -130208 156358 -153326 100464 20700 -425363
10051 -162830 -73249 -358235 -56960 -91815 -38829 85814 -335043 -111775 -216420 -279975 -808
10039 -322880 29702 181768 86996 25720 -335505 30577 104807 -257476 -349949 103589 -69140
10027 -116041 -12281 95346 -54194 37646 -18676 858 -99452 69699 -458423 -85636 -10914 -67806
10015 -67806 103083 232308 -5012 73932 22791 -354237 50544 -187294 -66755 -70310 -23128
10003 -216698 53312 260317 -17864 69194 -96819 -353103 -173708 83202 -114498 182957
9992 -228999 240717 299590 16274 -107094 -9078 9817 -111701 103694 -84965 -156559 258085
9980 -152267 -178267 -20882 29635 -186059 69501 115310 107220 -15791 -131865 -349498 -32538
9968 -277367 -171037 -36754 155434 -69973 -95717 49765 -92928 -159605 -418806 -99611 97073
9956 -251614 -138852 -381871 321455 -58328 -45409 -224456 -82845 103928 -344429 -10054
9945 -256318 -69198 -279098 -114469 -133542 -424191 -252780 89950 63820 159323 -91615 96634
9933 147116 -208445 -13107 -261237 -27245 -279085 126276 -356426 -255715 -136950 -57062
9922 -32667 6232 -104616 -125416 -235595 -228715 -77459 -122726 -125583 112800 68263 160680 254067
9910 254067 -277422 16881 -377406 81410 186865 92814 297709 -107611 -148915 108123
9899 -47625 -186012 54157 57128 158115 -199843 -211534 -254719 -225765 -96232 -70059 -403733
9888 -403733 129698 44920 -162186 57987 -2327 -115290 -105820 -10207 -79364 -308732 28024
9876 -58561 -217165 -190743 180563 299599 -210785 -90060 -160359 213924 57404 -26755 -172989
9865 -172989 178326 -148699 -890 544908 121900 297939 -143028 -29078 -43504 8364 98740
9854 98740 139800 -162889 -211272 -487727 -123037 -28879 -4035 -192787 36019 41872 198644
9843 198644 -153878 93854 73943 140306 51844 -49005 -58724 -130296 -88235 -335355 -239120
9832 -239120 238459 -56781 -198961 -269528 -411755 36578 52524 17205 -7183 -127242 210223
9820 -83683 -122892 50988 -112528 243308 -306149 -170254 -251532 -139522 306775 -243140
9809 -299695 -238044 -189585 33795 65044 -86927 13761 -111013 87457 178781 -48876 -79247
9798 -79247 189173 -108271 156479 17923 29084 53966 -300573 -102357 118030 -199277
9787 37279 20701 -693253 -392078 -387037 12171 -62495 -169911 -101058 151213 75832 -144810
9775 155179 -195886 -188110 229314 258302 -357524 49017 146097 129314 -105686 -93329 246299
9763 -8049 166736 30707 -18036 160158 -64488 -379971 32228 -110491 182020 -15594 -278468
9752 -278468 5309 -126837 -169371 -83042 -365235 356553 247885 -272093 -139902 -106653 81248
9740 323664 219078 82389 -177957 192721 111878 -264241 -181897 -211562 -105496 -202281 -49866
9728 44344 -149117 -112548 -328490 18221 -428314 -239917 -3336 -79402 -124655 -79504 -66886
9717 -66886 -286298 -7434 -102776 148759 56803 -308776 -114606 -4100 -26336 137014 -57130
9705 -255053 -4022 -38708 -273970 15806 -27201 -343200 -248928 -39494 56131 -456765 -216676
9693 -225580 -166904 146607 -292046 7925 -125117 -157592 59651 10784 -294256 -201813 -189401
9682 -189401 -301531 -250716 200296 -131669 -153745 -110402 147496 -145608 -20517 62171 -151020
9670 260477 -110884 -253157 -296973 289310 99588 89689 32671 30514 -84332 313884 -48838
9658 -181522 -113977 -86589 128423 -154426 90599 633 -281817 13354 -8459 -108178 47245 -281131
9645 -83299 -363471 -107063 -237136 4018 -366690 9104 14914 -151957 -150182 199432 56532
9633 -190333 306658 70414 -314840 124601 117694 -60582 -270304 92442 -47998 -136925 239417
9621 81609 248285 -167931 93416 279328 -337113 -85841 275049 152091 240108 204751 -258701
9609 -13439 45642 226980 60372 -157135 -232313 99933 -247971 -173506 -157074 124610 -226057
9597 64549 151524 288067 -35516 -25359 -81308 383405 111463 -203192 -154048 82613 -157930
9585 22797 -148138 -363041 28538 -30937 122600 131159 -106672 242175 -28705 -193095 -327162
9574 -327162 143922 -225561 3307 132098 -102525 126241 148294 -4875 -48525 -570024 -102883
9562 75085 -74570 -12340 98525 -69279 82959 -72318 -104521 78488 -310742 -46346 -169479
9551 -169479 96648 -125448 -57999 -248814 -1954 69965 20919 17354 -25895 9042 188010 -132550
9538 -61289 -103137 88612 -243156 194356 -66425 37087 221119 -73455 -158896 -150176 128716
9526 46045 276315 84634 -248353 -111569 83042 157798 -159410 8089 -335893 -415566 90572
9514 -29237 -399407 383395 62712 -3969 -282066 -236971 230910 -18471 -59016 -240309 91845
9502 -212264 -137127 -101418 73572 -351988 11401 1490 137140 77314 -183069 -33905 -234174
9491 -234174 200215 93805 -7883 -231812 -118301 45961 11474 107696 2493 -95735 -89219 -187902
9479 -187902 -349500 150111 -18046 -158799 156709 -180575 34166 -179140 62277 -117303
9468 18877 -411035 -155596 -61014 -70224 -255176 -18129 -32433 99252 159003 -285790 -12378
9456 -28263 -103505 -318955 -117517 -293332 -138956 -88366 -5749 140851 -143932 -51323 -427346
9445 -427346 173018 33160 228129 71615 155745 -31031 -147069 -217655 198578 -123923 -64615
9434 -64615 -36776 -389309 -144886 42130 55605 -77046 362933 20135 -208040 -85128 208140
9422 161188 -81867 -266305 26481 -324341 -293237 -2170 53586 -246632 -106911 46876 -143686
9410 -146432 278641 -63759 33678 -243944 -55453 -229646 20722 413882 167394 125195 44814
9398 -196536 -68653 114755 -53447 276103 139462 -80156 -54865 90734 -36901 97959 20251
9386 84308 -259839 -118760 36772 -422746 -61734 -224818 244689 -146894 -58601 -255779
9376 -255779 18318 -80701 27212 98663 -267368 -276152 -165132 -73636 111116 35971 -44176
9364 -110719 30799 70475 41496 -227519 57078 -135644 280073 271905 -276322 -98744 110676
9352 -153264 -229033 95293 -58255 -46052 -95378 -170337 -84285 91044 193634 -97835 -177478
9341 -177478 143139 -112907 193479 -451408 142923 -202277 -387609 -248618 29575 -215296
9330 93473 -83368 124076 143434 -155268 170002 -118785 -54410 -177312 -127534 -210479 -135163
9319 -135163 -287354 93898 -251552 203664 -96825 82698 -216795 -15713 -231996 -56121 44336
9307 -314522 -203858 -169427 -89772 -355656 -446676 -48017 -37843 -334124 -518079 -269227 9114
9295 364305 46801 174298 -181161 -196191 85231 -205739 -207205 -261766 42467 365817 47170
9283 -82199 -47022 -30033 -52415 22549 -80680 280585 -34730 -132041 218334 -274104 255170
9271 -93884 -105010 -52444 -153991 209940 2258 -181643 -26634 -212168 56700 353110 -85470
9259 -48169 -217825 9246 -256739 -38491 -67475 -101334 -273245 59821 -81855 -102646 -90743
9248 -90743 -155671 -28771 -230559 -130467 -99775 -22710 -173782 -205991 146035 -88073 -145843
9237 -145843 56530 -38613 20991 149999 -351270 -50061 -348927 -149329 195730 7822 -148344
9225 -107219 -162402 -124599 171290 -239676 186164 -38973 -15353 -272630 -68687 -58009 -69136
9214 -69136 201717 -59963 -166538 -97361 -94585 -91201 269249 -388913 -199130 -60178 -236449
9203 -236449 -149262 125519 178626 -17240 -330619 -23676 198327 27356 -253360 44304 -151357
9191 -4568 26191 -1680 4720 -56209 -70463 -162340 -240911 385154 -337479 181300 106629 -194739
9178 -150722 51735 244239 -70934 182840 -59997 -67872 15652 -60234 -44334 -124617 -299568
9167 -299568 132168 42411 4506 -437719 5410 40925 44279 119853 -25446 12437 237167 158979
9155 158979 69712 81547 171907 -69182 -162833 -320814 -135835 9700 -114424 -1009 80439
9143 32425 -101500 -302102 -57877 -210582 174673 -416601 170014 268396 64828 21647 5519
9131 -177041 -165062 -16883 -47245 -4281 -308940 181267 -188084 11276 -62165 -100971 196469
9119 -76786 91363 -30644 147766 158235 -92774 -9401 -102348 276172 -173999 -268041 -47914
9107 -51506 224858 -173579 160376 37783 -20013 23639 -168520 -73112 -52450 -254795 139516
9095 -18671 -197485 45819 -197733 -7713 60397 314581 34534 37713 -515286 8571 -170285
9083 -24781 -173849 213888 -154325 -225711 -295866 3538 246279 -124501 27548 82153 -83942
9071 2441 132453 -83474 69632 -1080 115138 -37207 -52963 -297961 -141609 80489 -197698
9059 -120085 -166641 -109332 -170032 -125230 289242 156539 153515 213737 -299282 235113 -5588
9047 -220420 -37034 99047 -76184 -151858 -12567 -377726 -257135 -165249 160938 278693 17658
9035 -15383 -160713 341139 -312862 76366 53683 180516 10198 -267968 -214074 -340346 -145842
9023 -192237 255737 -11088 47751 96300 191493 -45641 259053 127954 195130 38848 -295942
9011 -12632 -346906 -209326 -284195 -83291 -26641 49688 -28227 18705 14514 -174540 -480 -125725
8999 -125725 33074 -44359 19466 -111615 -223171 -206565 252657 -140228 -3845 228119 -160318
8987 100654 14494 -270102 85818 14154 107391 57310 23906 -40508 194685 -71561 -224239
8976 -224239 -167632 -234910 -3843 -321893 -278685 -340100 -151812 68958 -180359 167840 150548
8965 150548 174786 72411 -218988 44473 -219506 -107359 -209170 365373 187840 115235
8955 115235 87960 -175862 -244909 -69751 206104 36413 -87250 25339 -49551 161626 -165308
8943 61893 -84697 -61574 -279202 -184583 -21065 -325177 -185245 85281 171774 264456 333030
8932 333030 276419 -67141 -34081 65670 -247601 -138837 -337829 26761 25729 1048384 1115187
8921 1115187 3169449 8753168 15823394 4495455 857582 341597 157582 139808 -51516
8911 -4546 24618 -120074 223865 -29260 193138 396595 27564 74393 -268909 122163 -231893
8899 -20548 -227642 -167177 -251352 -9984 189816 -109246 207325 -237779 -79488 67279 -324296
8887 -161876 -254433 -178706 -197397 -398843 -68925 66241 -230421 -265140 -61529 -250368 -119499
8875 -38353 169373 -224734 -123588 -220404 56207 239071 11455 -63375 -42439 205824 23596
8863 -41179 -33273 -203092 -78445 109171 -56902 308529 -552550 18412 -230535 -88558 -27263
8851 -18628 -32023 79433 -146822 -178295 -17501 -196932 -65816 -258054 -183290 -90844 291025
8839 -206451 8433 -319562 105962 174341 -51901 -98954 93391 -272796 -171876 143401 258562
8828 258562 173272 138429 -26443 -61755 67460 -31161 -17809 -144106 -8082 152146 -288195
8816 -216457 -83893 -75185 -124610 -203982 77807 -43550 318108 5863 -106207 -313769 -221191
8805 -221191 -200493 7960 224707 -70301 166063 -174612 -74648 183435 59478 -183082 154831
8793 -355922 -103850 40034 -14192 -262759 -137448 -186231 -64541 82033 131711 -130306 56871
8781 -80641 -149827 -83071 -65257 -169589 -105377 -21801 -336994 -200201 -169651 -53273 86163
8769 176818 248849 39187 -82637 -56818 -3755 -3485 -136234 -341352 -238066 -324647 -26093 -65508
8757 -65508 -450253 12466 -66589 -17194 145821 182716 59985 -196556 88836 41461 200383
8746 200383 -412434 14234 28757 -354342 -109591 -96512 202831 -156778 22145 98978 186968
8735 186968 308368 207463 -89423 28210 -81741 -85348 -259969 64584 9236 237387 31268
8723 -195627 -72987 -60408 -282805 57240 165593 78189 -56005 146813 192998 -144268 -47677
8711 -164977 -157036 -2377 106314 -119404 122649 56555 235612 -26401 -29173 -317939 566212
8699 -191194 -77081 -17479 -499734 54309 -220770 -162233 -123310 -92050 -160893 -56471 -150680
8688 -150680 211735 90201 -113776 41897 152227 -112138 -684 49782 11862 -319961 -273
8676 105189 -57614 -114051 -287137 -118856 358720 -134711 -75073 -55385 87682 198871 -421200
8664 -294252 62147 179836 -66977 -10104 -63802 -56948 -247357 -200323 69832 -120206 -4218
8652 -141408 -218587 92345 122269 -270965 -237721 -334069 180359 -194592 226008 -28212 -130625
8641 -130625 -217192 -341302 316968 -263174 207797 -227904 -118510 -65711 -223050 -21025
8630 -175917 -9291 -195727 3339 -113573 -238392 -179142 -38981 -307623 -180865 -105306 -87744
8619 -87744 -110504 -37499 -762 -73884 -32693 112537 7309 -24622 80175 -228562 -40101 94197
8606 -60638 -212039 77717 -18471 8040 -189588 -238987 -133905 67393 58910 -392305 -114882
8594 -71902 85153 -7641 -256487 -137364 143903 150182 -49501 -292809 -146050 -30896 -31763 137170
8581 24152 -194489 -138203 10360 -52737 -139540 -128003 399359 34065 -211881 -195779 187446
8569 109683 -464034 17893 258202 -137380 -214429 219978 -256813 -44963 -250210 62702
8558 195592 -71454 57733 -7480 -221076 154912 120704 232055 77671 -20639 137196 -250011
8546 -78691 150595 -218753 18991 -103541 -14826 -314528 -135055 -68533 300986 -17866 -214643
8535 -214643 27076 203465 -5816 -5392 9590 -14584 140007 -210937 -84187 -48157 -243351 -70876
8522 -490214 111606 -26671 -129150 -66328 47954 -79836 37073 -440705 -271734 -373279 94081
8510 333344 -120570 -324823 -100087 172041 -157623 -122155 -299448 163573 301859 -115214
8499 482424 -331090 -265079 -208307 -127069 -324653 -165093 -52494 125681 -527008 -208939
8488 -192512 -15787 -34404 -1052 48718 -8044 531907 -186903 -187241 -136087 -84678 -38188 324167
8475 174069 -8921 -750 56866 9106 195067 -333841 162179 -444228 -181513 -24530 73812
8463 -195310 118081 -182485 -198711 -107568 -4568 142103 30161 -77143 -39421 221229 54824
8451 -92852 -119592 154277 -11303 -315469 -38848 292892 -163557 60869 23954 34215 -29250
8439 132521 49482 -241817 -163082 -28369 104321 224287 -136176 -189027 -149212 21120 53283
8428 53283 -319119 -96517 125280 47701 100320 -159782 170554 -44813 88791 -111890 -403423
8417 -403423 -144623 -176074 -52431 162629 -128066 -338668 -61379 -125953 -160568 -295721 -181811
8406 -181811 1012 228316 313601 69181 447421 -48176 181552 -111222 258891 -212740 -3360
8394 141086 2365 -265244 -52221 -12387 -37740 26135 301688 243350 -17247 -56548 75257
8382 -419925 77751 -161583 -220052 3624 -90322 -439966 250909 42436 7094 216523 168999
8371 168999 140318 -148601 -55441 35580 -16488 128776 -386636 89109 290547 -177959 65008
8359 -243993 28154 -4115 -252589 168898 -33287 16899 -170852 201239 89069 96619 120709
8348 120709 132311 129576 -21845 -213117 -271730 190494 102879 305482 -142831 98609 64115
8337 64115 111987 144234 130452 22150 350 175991 93644 -282772 -118660 254718 60199
8325 -3332 -144348 139752 138667 19539 17564 -171918 -50343 -161969 -185955 -40000 48306 -175924
8312 -248446 347711 -196152 -77575 -150691 -195484 -144309 -92203 251048 -42714 -248270 -309165
8301 -309165 -26585 -126147 -33175 260651 220583 -380418 261228 257995 -201314 -224041 -70638
8289 -392597 90933 -98911 -113349 21852 141194 -351380 -32304 -71888 164157 -282747 75086
8277 -243815 -142685 2077 125912 192396 78181 -387622 67958 -256458 -24540 81067 -220518
8265 164893 -208764 145956 -131820 -141872 -104276 68906 -196008 162871 -235986 38395
8254 -86267 284875 -5120 347277 199037 -445637 -301774 -176503 -132542 -121519 214230 103765
8242 -14009 14973 42695 -246566 -113683 -120951 -313735 -100435 -307069 -72491 114832 122324
8231 122324 -128510 -61628 127305 274597 30102 -100095 -45869 166272 -82821 123399
8220 -119729 -261821 62262 -155728 -130840 -154319 -6852 155597 170163 93915 -415520 31983
8208 -17022 -467761 -206923 187280 175205 -201913 -297760 -231873 -24422 130793 -63287 -235759
8197 -235759 110239 37083 347271 294437 137297 -239726 -194997 -65926 216006 64058 155416
8186 155416 66767 -65815 101085 138850 -50122 -181112 -90485 -151042 -264316 329399 -36449
8174 84745 70781 160991 -258584 -257265 -133879 -102383 -175819 188366 166812 -234374 -80825
8162 -171048 -202132 -35880 -364884 -41342 -146289 140839 223096 -22319 142534 24154 -217193
8150 -148669 -91282 226704 -104995 -56606 119060 156428 -334740 -41018 -35004 414777 143780
8138 -93624 440089 130240 -209157 -65017 150733 -206889 110020 319058 -180511 288599
8127 23823 -147907 133528 -52706 -145882 -195627 -164094 71348 119568 -135332 -244252 122302
8115 3726 -188057 -162262 -407484 -470899 -365461 -58740 53365 -27967 275839 297470 56547
8103 -112694 -176362 -227435 -167450 70398 192033 -267809 -286752 -48997 118777 -350963 -192173
8092 -192173 3377 293986 118040 115291 -213226 -62760 -41218 -143530 -72121 128524 -85663
8080 278647 11808 -69 162273 -41470 -292714 -344780 215837 42161 -2052 -212913 -151986 162375
8067 115131 -283899 -1386 95267 23545 -62154 112232 149882 -130105 134197 97784 -79956
8055 401229 -538830 68007 -237888 -181833 314397 -94229 -68630 -18466 100101 -292751 63931
8043 44372 81789 -291685 -72678 -85540 240617 36807 -90579 -47462 -198847 121008 59632
8031 -6617 124057 -259307 -240975 87652 -83096 -136447 -254233 -111920 -413373 -367624 153803
8019 -120226 -4594 123102 79241 314722 -132697 -104658 323806 -144813 -160742 -143651 352778
8007 72642 -61756 308 -1914 -149474 -142790 358332 -252613 43663 -298908 -267226 34800 -202916
7994 58328 -185018 -97320 276990 -154942 -204983 27938 -154999 -108158 -90504 162329 -2257
7982 448030 -335600 118967 205776 -236268 -412180 169910 -419983 -150601 -58851 -496550
7972 -496550 -78694 -43775 -52287 -273615 198819 -121439 -348935 -123896 -171265 236000 -65716
7960 151853 -207291 64337 170335 -170126 -11468 44252 393807 14951 194739 -18553 -110623
7949 -110623 63269 -246940 -123079 -207796 -69044 227424 183826 -129966 -112564 -48059 74091
7937 -190742 -2035 117511 -254456 -18088 -241175 -265318 225507 -32564 106634 293904 -185424
7925 60594 -60362 -128498 77760 -11866 136881 -200706 136071 72440 20439 -79434 -298404
7914 -298404 186384 17040 25630 -38919 4728 -160690 -28527 -194042 -209500 -1651 192079
7902 109346 30475 -167772 -176827 174849 438978 -186410 103545 21151 -133298 255286
7891 -150921 169709 -113791 -243097 -46022 335697 40464 13826 -28568 -31762 -161102 -215974
7880 -215974 -306468 -93538 219498 80350 -63891 618322 -110851 210995 -94157 -1132 316910
7868 -142832 76504 -102323 -49786 24138 -189323 -141848 -189415 162165 -103969 275984 -272151
7856 35308 -61861 375521 -96569 -344821 -16584 -119497 201037 -248586 306945 -207446
7845 -60678 -339827 170106 -229293 -231478 29071 16756 91062 358614 -15444 -204968 -191273
7834 -191273 -69899 -471790 128041 -350909 213008 -24249 -51811 157811 119356 -72984 100338
7822 -72060 -22678 35656 -22309 -537483 147841 -131205 -267969 96131 266994 19551 189438
7811 189438 -217327 57517 50915 52145 92130 120906 297410 39866 185254 -361240 167610
7799 -486583 16946 -111422 -106005 -421910 34861 -194038 -106786 -63024 262774 155125 -107783
7787 -91566 132700 -163954 -76698 32728 154396 -94748 -259246 43523 254993 -152370 155349
7775 332743 27504 7320 343871 -313230 -143481 -309592 -254532 -151266 -126138 -13832 55201
7763 -176342 63613 -227152 16416 -104796 -183392 -403578 84741 -23120 118825 -454975 -183159
7751 141455 -83952 572109 -9081 -58824 80619 120076 -96655 142660 74136 107504 -482598
7739 305611 19155 203101 -425993 124908 256206 -55368 212304 -100932 -366325 -367004 -117174
7727 -16402 356402 -58909 62469 -40425 216126 -55512 158718 -29388 27302 -36046 58035
7715 -301469 95321 52293 318467 -93984 -61732 53026 38200 -125229 -212375 183449 -298821
7703 -46085 137523 -80103 13032 -133334 35505 -94189 85173 -24696 -81708 20647 -88407
7691 -90436 -14871 -516908 -197586 41732 -178563 -119137 8793 7530 -97574 256811 -234139
7679 -67122 -60868 -130007 -80443 -77368 -279320 20123 -197210 86102 152172 -100667 125794
7667 -401661 -57320 -9986 164878 -68690 -118547 79048 -202754 -289956 -89305 221150 3139
7655 -192776 -203108 232270 -362511 127881 -51736 -31336 32665 125929 19466 72500 387550
7644 387550 104453 -131812 75873 78666 -53211 21209 -89693 -141546 65413 35280 -338624
7632 -238717 53765 168880 -18553 -52916 292350 -3554 29909 -235089 -140740 -71899 16277
7620 -141789 128594 -198106 60261 -2138 -184458 29609 260621 119532 66025 -82579 -66751
7609 -66751 -82138 42148 224906 210881 -89482 22175 -281228 28137 113083 -133578 -170245
7598 -170245 -13906 40151 324201 -75473 43698 -226577 -236034 -203406 39211 233715 194203
7587 194203 -478929 -42995 -18378 -61691 -50776 -189464 -350397 71471 -354334 -243660 113996
7575 -367275 14439 153245 26477 -24616 -165018 -65055 -244664 131921 -101831 2012 -332437
7563 -91753 -368456 -127904 -275397 56848 35251 34024 94495 137632 -117356 245240 -249805
7551 -32011 18699 22183 -59808 5832 -264052 648 -169349 -102240 -314837 25548 -4927 -210237
7539 -210237 98428 -157506 -29844 112227 189237 162483 234275 -89787 180810 -161772 215276
7527 228668 -135653 531427 -133250 -92906 -69706 96127 11198 -109738 188898 106224 -328011
7515 239623 -180051 123876 -193683 303815 -12118 163469 -146187 197040 146939 -39281
7504 43654 -65789 152423 -66998 35153 75724 17611 27901 -334676 -274972 -60885 160783
7492 155398 -166617 12602 71772 86764 -293287 51231 -245333 -27624 -12746 -51181 177293
7480 203432 -65917 -144853 -403171 281316 235792 -168832 -3365 -261672 -102065 -175451 27285
7468 83029 -180053 -195928 49306 47450 -145537 197168 182452 -90828 -183694 -107686 72598
7456 215002 19169 -228369 -238269 161930 159499 -156434 -20222 243442 -217862 -114040 -188843
7445 -188843 -201977 153090 -254454 -207449 -162443 15389 -199499 184323 165358 51398 28805
7434 28805 -422690 -78021 -168351 -62507 212188 209881 10420 -34195 -353465 -14984 -326147
7423 -326147 110504 -63548 -24318 67785 39818 -166441 -128450 -118589 -137525 -13321 -192060
7412 -192060 -219398 -228257 128927 131043 -162205 -188820 -49314 -8476 85992 114500 200456 -181725
7399 142938 17101 -7740 204116 -13167 143808 -410545 -465669 133368 89631 69904 -67037
7387 127627 -86963 189051 -401370 -151763 47335 -110466 -121409 136568 -175773 -94257
7377 -94257 -55421 369201 -30119 294228 -157220 242598 -49061 -161825 118540 -121128
7366 -370295 15228 133383 -108443 26882 130617 31251 37581 9186 108791 -243971 100867
7354 28942 -45262 68430 16036 -178488 -327399 64758 -189087 11210 -18478 -100666 18794
7342 126037 52692 -33879 27626 -406310 -35597 -86390 97317 -26147 128032 108530 -164390
7330 -105619 172275 -216035 79643 -41863 -134085 -124464 135316 88101 152812 -93407 -302576
7319 -302576 -26303 46413 -132753 203364 91178 150443 -360580 10338 -52758 23359 230859
7308 230859 -196955 243900 342509 385606 -82549 -255100 202663 -147789 363813 -52796
7297 77787 -209219 -128841 359297 -62934 244078 158296 95145 208718 -252518 92610 -85835
7285 11523 -104915 -199293 464793 -21154 254888 -477848 119355 -25225 -127624 12706 -108465
7273 90980 -164885 -285289 17302 87860 9829 229823 129290 -124125 -100 -87581 64318
7261 -45677 137600 15329 -179825 106671 -384444 -246995 3737 -50408 53556 147729 -82778
7249 161258 -144120 -292414 9208 -228950 -312501 103160 88726 165753 -356070 -54801 -70674
7238 -70674 -33127 -123220 49621 -315277 58291 -273010 -115460 -353495 139173 69292 35517
7227 35517 61805 93615 -40646 47808 -88806 -470135 -94358 126428 -176802 -270840 -170917
7216 -170917 793 -245629 146519 -34107 -34956 -23344 124450 -366092 154872 -404249 -67113
7204 -45248 -118175 -9345 115652 -120737 65307 -7899 -3915 -227253 4284 -112067 -149467 166382
7191 -99829 -254202 71230 177193 188392 -56024 15088 140572 95219 -41147 -9793 -152341
7180 -152341 393414 321824 -131976 -137878 192009 126474 -398620 96577 -39465 -73986 106762
7168 -193318 -378128 -390894 -191143 143887 -103311 178460 -155523 -17063 -174327 -211803
7158 -211803 -187027 331014 15039 -40756 -178529 -197300 38750 556552 255910 -238522 -159888
7147 -159888 -33605 259322 -10913 -93624 -56940 9846 -141708 -34164 -152295 -111383 -18227
7135 32082 -26025 -193263 215199 -82151 120698 55182 212394 -152862 -156043 170655 -216622
7123 -148108 111267 37424 -18323 63529 82250 182903 182641 80745 -265314 108654 18848
7111 -201328 -31767 31969 10711 -128493 -157702 88563 14204 147125 -29550 114951 73848
7100 73848 -96472 -16927 -14363 -280869 16289 -232121 -194490 -64339 -40884 164177 154734 -54246
7087 -36153 153807 -250023 -127962 -98699 -157379 -62462 215536 139422 -272321 -115794 -237997
7076 -237997 -302082 -83348 -165774 198759 -65934 278621 344387 -60465 -120123 -533883 -225919
7064 -372315 15651 279492 10269 -180146 117289 -200841 275566 105374 173565 7850 23508
7053 23508 45580 -208498 156375 39976 -251997 -92171 189532 -130339 19186 108869 -226150
7041 -149016 215019 9013 -300555 -23848 239683 103368 -32036 -9347 -234215 -27905 -79839
7030 -79839 112433 156093 -171195 56596 -116953 -165543 186560 -420981 -59589 -66627 23096
7018 -42789 82207 42900 16304 -345313 -8401 -43362 112791 24304 -184907 -43120 100827
7006 -283302 -58958 155929 -253153 -170491 -78552 -16319 -11909 -43762 214703 -208685 -16805
6994 232162 84319 171555 -274409 -31884 84977 -179034 -154633 149458 -214602 -57305 -2090
6982 -67332 56822 -51010 200054 137746 428977 22984 58253 237537 50457 121097 41671
6970 -42156 344223 -65403 149064 84752 161443 65538 59935 226108 6602 -393693 -95891
6958 -174063 216672 -185846 -79401 243757 -92818 -21563 122160 82010 -22306 -118677 92430
6946 -70130 144831 -81140 -119072 -158138 199214 -89827 84361 -39634 55088 -166477 -404797
6935 -404797 39133 4366 109665 -105288 -266626 199240 139823 -18009 35927 76907 96236
6924 96236 273446 -35031 57299 157 -305960 174901 -44977 2922 -16784 -292429 -22517 -494388
6912 -494388 -168065 79425 -35052 226549 350531 54958 255882 212043 -116711 192167
6901 110633 143043 -134378 89633 -312402 -7952 64089 -228280 32414 -159867 -244283 81114
6889 168967 -82036 74905 -168938 134113 -131252 84069 -176966 -247874 -318 63586 -17366
6877 115607 180078 -109190 -7041 -103592 -29099 -312082 9867 -261113 473422 -249588 147598
6865 -105969 -4797 -167203 -239376 -353276 172284 -57376 -39406 86773 -165665 246748 -98587
6853 -53945 -11482 14309 -135967 230926 3462 -43357 203973 -198678 202167 -128743 -173594
6842 -173594 -63187 -323801 106729 121738 126125 -49089 189909 95273 -399451 -32786 -187285
6831 -187285 49584 122633 -33135 -127174 -210583 207550 66500 -45770 164451 68870 -39645
6819 143969 -290397 41385 -413982 137212 -367573 133520 -98362 -154780 -52746 -142235 153
6807 35986 54068 9765 -439262 -197797 -66212 139210 -61107 37738 247992 -138346 137786
6795 266133 43215 -59492 -171865 -57321 -214088 -158703 2308 -187759 -177809 -143688 80869
6783 65182 -394410 112089 151926 193357 132435 87047 33988 258195 -37276 -152277 -83453
6772 -83453 335336 56726 -263963 -174911 180890 121238 72875 -61214 339094 368456 221972
6761 221972 87492 -3175 -202525 -191809 -134636 -323099 172590 118598 9402 109396 -156377
6749 63191 -23238 111173 -159731 133910 125800 -160708 138578 -118345 5236 155450 -273915
6737 2791 55541 268528 157465 181876 -13977 193077 -81784 -393375 68980 262711 -117033
6725 -78143 122714 -206038 -120401 -338602 181821 -119905 -65418 -149327 -129874 256132 106164
6713 96756 80018 -55805 -159113 -246045 -93363 15737 -4311 73435 -14692 -1693 -91882 -47584
6701 -47584 271782 154710 129002 -146359 79205 197153 353124 3629 298348 -272768 -72729
6689 13222 -112618 24970 70202 -114514 -225298 -12753 147285 -184119 -27153 224047 -236684
6677 147192 -274578 98622 -123838 92314 -68151 25194 -96487 135881 125374 350202 41458
6665 -216470 274745 190184 37630 -33799 -139524 -117722 -198952 -8723 -326051 -54254 157525
6653 139781 128251 18380 -11923 -81218 -41043 42564 86675 -119085 -155294 235698 112731
6641 40307 -7186 15747 -63098 -63813 -32438 317372 -335022 43852 44734 40143 -135942 37541
6628 27834 40864 125933 -275567 28261 117894 39580 -128124 -107514 -229054 -121575 32343
6616 -113635 124660 -364581 152040 137235 -51909 -31924 -2459 102069 -45548 -38600 -285795
6605 -285795 184718 -125440 151555 18842 83381 156581 34337 421393 -109653 -271573
6595 -271573 158026 -168937 46828 -163745 -70852 -341641 403627 140781 -29007 249819
6584 -125553 206609 -219228 -11246 5635 218705 21058 -124894 42949 229922 111720 137626
6573 137626 -274482 -223200 40160 -59863 75186 141717 144303 -131186 139960 95051 -156373
6561 205963 130005 204258 -336581 -50512 276943 57576 86641 268101 108250 -6118 -136107
6550 -136107 111596 80458 -13231 -306769 155881 -62983 77219 24419 -34222 -256780 -27305
6538 -261454 -178011 -108568 -300770 213967 516306 262532 -179436 -85578 -48961 330797
6527 50096 -209712 -19839 -530055 -75031 -148774 -38851 296639 72409 -101600 -45006 80568
6515 193651 -42696 -186103 -61701 -2499 360654 -185349 -120392 246652 132034 -221953 107683
6503 432904 -99856 40715 123926 -115145 118338 -272038 256 -123606 -10730 -234519 -52931
6491 -88991 25387 60488 75255 -76794 1379 78325 72725 -63021 37626 -156863 -187470 160405
6478 14349 -275218 49637 -162119 153240 144197 -320726 -287706 139052 280095 -83623 -284933
6467 -284933 -181957 5761 238979 88196 13841 12055 -235525 19634 64823 -281199 1854
6455 357334 -62356 133233 113696 -91114 -97745 -16528 88630 309194 -139639 169439 -93881
6443 19855 157521 85904 -189247 156877 -166026 -373958 124506 -191645 117423 -98423
6432 -312747 225127 -47671 -184685 -14218 8794 -197261 -143028 184452 -166258 168612 322853
6421 322853 26848 -274058 -122441 -35099 -162738 208449 -180887 -178855 -215013 252722 347497
6410 347497 1380 -124100 -335256 -652 -150130 84358 -31177 -174887 449443 -302640 -134446
6398 83206 256425 76488 -227753 -82067 -36096 57092 -162959 51697 -372038 -501296 -63487
6386 -316242 106534 28187 -356228 -253184 -171617 -107866 172168 25528 -191469 -187688 53056
6374 28589 77225 -139353 -247303 -58961 220788 -7422 384112 -16855 194090 34616 120576
6363 120576 121857 -59811 -235345 -5139 -273559 -248843 -111105 164222 62759 187154 -92114
6351 -164713 117768 -119951 -12332 110655 -284286 -285166 -161598 -37336 -34645 86613 -219391
6339 -145739 239222 -61060 90512 199191 148957 192425 87443 -332477 236559 -402708 224088
6327 -99152 121973 70402 96396 156979 131345 -4191 -18751 111070 161946 -126552 95123
6315 244056 -38475 118417 41968 -45287 486281 -108293 -424468 229062 -217690 39943
6304 214468 129047 -32080 -185370 -96064 122105 333655 55030 -35699 260773 11119 -146656
6292 -113416 132455 -301518 -161375 -35947 159188 157104 149774 -89243 -132963 -97860 37001
6280 -90759 -163629 83305 117488 -111285 -99117 81242 506115 -17611 -18061 102121 338673
6269 338673 139342 291167 119336 -137468 -74736 -49485 402355 149937 -71902 109338
6258 56855 -286233 398500 -59679 109786 -172681 -192098 -68729 -275427 -263808 144560 -70530
6246 215871 -104066 269206 -1023 274908 -156908 48008 -100096 41564 157111 57777 -8844
6234 32782 -99879 -111494 67163 222648 5303 59459 169786 -9992 -93836 -326728 -61217 -285894
6222 -285894 -12170 -111929 -71431 -330367 285767 -215791 -168173 -69445 -257694 -6176 80173
6210 -78000 -117368 77517 201781 -328214 112228 -56989 14042 98995 41324 -31644 405670
6198 -57700 -106818 155261 -75644 49635 484690 -141532 176446 -88030 62453 -328220 -45377
6186 -388895 -350351 26849 -124301 -52946 61498 195181 -354462 -155094 -125335 309862 -161628
6174 -112156 -159439 -154809 78440 159987 155906 -336825 -13107 -251436 -201522 90548 6582 -186349
6161 251772 479519 37407 -24416 135451 -153493 -178018 -233687 -69344 156459 81374 41779
6150 41779 21600 -144856 51843 107895 52871 149906 14300 80919 67702 136739 -265936
6138 -210106 59358 346217 269452 165090 -53892 -169476 -283934 173358 -17806 -430125
6128 -430125 -119156 -299270 131963 -215904 -284399 308971 -111203 74495 -5675 -382455
6118 -382455 -85433 69989 -273625 30770 -79537 -152797 138460 327950 -36276 299683 -135863
6106 -154369 340298 147537 -224955 -120545 -138944 178401 -57057 101217 -78653 -9818 -112480
6095 -112480 -26401 -51532 -18545 127442 -345977 58636 -206785 23457 -204015 425547 222485
6084 222485 321117 -116566 -226748 149846 -1837 -55115 293207 149951 -65943 12159 -509472
6072 12427 117309 128129 -10437 -64040 -61172 61979 138537 211114 199572 183833 134188 103820
6060 103820 -41858 190320 -98995 -161055 -66750 250875 -74496 225369 -148185 59584 -34986
6048 137620 -41105 -558960 72485 42710 13920 48947 174643 135162 -45147 -247007 -112335
6036 239589 245164 -40979 -325541 -75628 -182432 -162526 119224 -93385 -96695 -124531 -35014
6024 319584 28586 49061 107843 217552 -284386 -138360 -76491 -65585 -157479 -3630 88468
6012 200388 128211 49644 441214 -43729 -547418 124550 -230228 177917 35834 -18704 -6520
6000 104403 -209271 -196303 -122770 -132010 149140 248873 36718 -133813 228724 -301729 -39172
5988 3363 15764 61515 -173502 217723 163739 -28403 -95002 -44285 318999 -185415 -57779
5976 48129 98939 -298281 -199817 10080 -228815 285042 -170828 -1139 49111 -124811 -43566
5964 183574 -25271 90113 -214736 -64405 -113689 -135443 -75968 -51520 -104825 363142 -160059
5952 81985 -7252 131818 -256507 237075 -81681 -25004 88449 -291811 -198669 36487 142494
5941 142494 -90202 -26396 138013 12717 36815 -5054 116154 -63742 178409 65763 -103381
5929 42576 152214 37266 101363 -157703 389117 -232399 103240 -287166 -47624 208779
5918 75892 -69999 105446 -125389 119764 54287 101147 266070 -93011 -68534 172567 -20212
5906 146403 5979 -124492 -207062 -45368 -73932 135433 156620 -172392 223160 -23610 227228
5894 17308 39929 39439 321067 -61661 19224 -139914 103992 -133354 -159485 154865 -77606
5882 135005 -215083 -139276 113535 -63130 163787 175903 250910 58827 -36324 59701 -72431
5870 280734 257719 -65098 -4925 178976 188378 -46685 126333 -174380 -244299 100200 -64946
5858 283083 -338220 409520 -174724 -119336 -115992 50355 1693 65944 95724 203033 267491
5847 267491 55016 -170617 -135597 19915 -259912 -419586 29197 54720 -25188 2195 -58419
5835 174041 22917 -548321 191244 -146216 340505 -14808 245398 15945 -89211 -458946
5825 -458946 -49027 -69171 -467916 -304081 300403 93855 84761 -100443 -270282 -86011 -252758
5814 -252758 -32340 1833 47037 115587 72253 -175989 -131797 447577 159975 -177343 94494
5802 -167436 219034 223057 46827 -407704 303519 187512 -229661 183431 199497 169662 39861
5790 -152930 -121343 83399 28892 -68898 43082 263431 28226 54544 87760 6923 -102617
5778 -102674 -128228 211585 -33697 53550 -290826 33830 -250125 159344 -46227 -74747 -189867
5767 -189867 -150146 83852 299531 412827 377694 -12845 -82622 211578 290333 -171273 -300793
5756 -300793 391130 213706 -153212 135833 -178182 -93414 -103517 25661 -213032 -41935
5745 -216826 255945 -370698 -68181 -45966 -50009 -241633 90843 -259513 143875 129630 84059
5734 84059 -181398 194579 7644 -159498 119685 160989 -19822 -52253 -121213 -206088 -109366
5723 -109366 -2112 -161982 112323 -311339 325153 -203417 312394 -203432 -64390 53842
5712 -71443 407987 -48352 -244073 -71742 420147 -198218 -27205 172697 -242767 -340627 82705
5700 -62013 -175219 104982 -193168 75518 -166795 149881 -100261 -79586 322549 31516
5689 -64680 153668 -198223 -15734 187935 -54924 284057 -116179 -31194 269447 -126003
5678 -6838 17629 219782 -540 90487 4206 21727 67720 -136625 -135166 289131 157776 -262107
5665 -15315 -85037 26397 31245 -170070 34218 59145 -50231 60975 -59780 -57433 119613 -225823
5652 -56399 -84439 127310 -295158 396255 97481 44839 -34844 -145025 -112174 -156770 19731
5640 15171 -2857 111836 348719 -1828 244338 134951 -226658 29860 158739 -119208 16032
5628 -88425 -97925 130905 81357 -43043 34036 173861 -39889 -98168 176814 76584 212843
5617 212843 261985 101868 41265 -127185 297003 -64963 372345 86588 88906 -36325 89521
5605 -176189 209978 -166526 -87733 -11281 -236304 143511 -52063 -150718 -404281 62660 -31561
5593 5934 128141 -229690 -61762 40855 -154890 -39128 36368 46961 -267488 -1257 327702
5581 -192512 -155382 -147894 304571 -27517 -110271 104430 21137 79729 -46511 67029 -115533
5569 25161 78760 -30606 -127594 -37337 32367 -16483 -119052 7154 70956 48190 -183012 -78995
5556 319954 40368 -170004 161824 -52 -130910 96095 -327624 227814 -222466 -272370 -127450
5544 -10909 85016 221943 -24329 -51041 -53384 -17983 -110262 -64504 -11800 75445 171515 18759
5531 147772 -105703 -99860 94777 117272 -495022 74089 19576 -40448 -91062 14554 -46871
5519 168598 -73997 -79950 230031 -82987 -220027 317069 -195453 -68757 -289856 323256 -64754
5507 95777 5778 41432 140611 -165135 109611 280188 326972 -200053 -72841 327632 137232
5495 -53918 155853 -170326 209803 -225682 220592 -79352 -198970 -227996 190709 71375
5484 142335 -7070 -244218 142767 18760 -223331 -113072 -199338 140598 -142418 227531
5473 -347677 -204147 -26896 -75971 40613 101236 -360710 61245 -97565 -132624 -37295 -2986
5461 -142288 205134 18482 -194059 78570 93563 98027 43548 -155434 13891 -129200 193066
5449 -10836 -64012 -52462 88360 42818 -28988 154336 -261159 -111310 -65125 36172 94914
5438 94914 -16832 199555 -64845 313430 -23019 -34460 -96823 453045 262612 -77569 -23065
5426 -43467 -137715 -72682 51722 -103232 216014 126112 105575 36306 179744 -42474 100999
5414 148953 -120732 362396 -79974 206523 -45690 -84832 225134 3314 40614 57290 -107747
5402 31588 119470 -211234 14400 250359 -114605 -88274 373227 247059 291800 -423417 -16455
5390 72454 -69383 24387 41719 -25031 -91232 -321212 -243975 1925 -97353 -41807 28650 70503
5378 70503 147982 -65910 -145735 76040 19934 43368 34480 192117 -176364 286952 21366
5366 -49843 -148451 187460 -5372 -27874 378427 -145839 -345105 84136 -100632 20063 147968
5355 147968 -59800 148193 111433 -157543 15062 203331 104045 -218403 -145678 -428197 15125
5343 -51667 -166970 -42524 -385510 142834 142061 -64078 -158001 203359 171912 -125322 -72829
5332 -72829 -181030 64632 13220 118425 -105734 35467 -224077 2877 -27984 62143 55054
5321 55054 -292320 -92668 98943 -139510 -214989 -160624 28529 -172101 -17228 -227322 -272324
5310 -272324 -235450 136779 -111693 -98343 209550 -67626 206580 -254495 278306 268609 -109091
5298 -31321 -85880 -7610 -41981 -408327 -113903 164581 235477 123340 -129738 -10333 -103089
5287 -103089 130446 -202953 222544 63981 82591 11406 47592 -133066 -49056 -94682 18051
5275 -356468 -274796 249339 -15952 81036 -166148 32001 -176639 393540 -46307 -56481 114797
5263 -180239 53175 131928 -324674 -68482 -248472 -50130 37869 -13559 -66924 114109 -141557
5251 -84699 126180 52917 261290 155914 -220800 124022 -14747 -91014 2879 206485 170263
5240 170263 -48211 52028 -97956 32528 -248479 59677 -43286 -46635 -50463 142775 -150951
5228 -136591 -38354 -315363 -100968 28801 163835 -170201 -869 -108815 -258365 -202080 -44672
5216 205090 28433 -117305 -57606 140464 381860 -17698 -325594 -187739 -5095 132419 -140187
5204 315606 -156329 -189899 -76630 25404 235783 531000 -168870 321780 36383 -166357
5193 346926 226053 34566 -205118 84919 -120361 42911 347859 -119641 17367 -55147 -326893
5182 -326893 83673 27583 -48924 276077 -150559 29342 -63656 249258 -178501 6716 -384253
5170 259145 304430 105935 -43344 -216297 -38179 127205 -271361 -131661 519930 278633
5160 278633 -87417 36364 -219585 110891 53142 85049 84114 244304 96886 32316 -370844
5148 330399 19043 131614 -36672 227804 201021 91546 -15476 -107131 241520 -214959 247424
5136 -118109 -248185 38734 344716 204921 -17297 140869 -246350 104931 -27456 269001
5125 96728 -150844 -138696 29120 164489 98092 -48619 -127852 -196073 92722 64992 42738
5114 42738 -54372 -298459 -248171 -400299 25888 -167838 -72881 173406 -182031 -19618 484484
5102 -48775 9463 -202107 -103084 -43007 -122733 -476023 68013 32272 152395 283708 106870
5090 19016 -434 -120212 75751 51873 -92992 16670 -159453 -304975 -125073 -159497 124729
5078 -165975 337839 -98579 175533 83908 3488 -185185 70470 58314 -181632 219555 310381
5067 310381 -167833 206008 -363393 -10377 -400462 157331 -76690 257245 -105900 72761
5056 -534886 -41077 66023 229993 -6042 111778 81514 -103602 48203 108669 259609 -147193
5044 -86846 167069 89918 295052 -51126 -151420 -102540 150051 -22417 89916 -134970 -232474
5033 -232474 321170 -9512 -425755 -101038 -91702 124256 57083 19265 52423 420661 97971
5021 68561 -86999 16239 -47347 29233 -66806 112222 119969 50373 133875 15592 76329 63898
5009 63898 183552 -181047 135421 144726 57496 -88127 208073 45199 -146624 -26516 78698
4997 -142922 -58173 154352 -113372 107269 -10922 50230 76815 56712 189661 328286 -163467
4985 55133 -384755 -37639 94827 110594 -264915 -225126 -146567 267560 -86732 86950 161349
4974 161349 77720 -364008 206054 -261512 189354 -225211 -158099 301516 538431 -55628
4963 -423278 -287785 239152 -228420 34329 -203431 -76585 470140 -167283 -32108 62027
4952 -52262 47196 66174 4773 44362 149321 95281 152409 -97611 193390 -29960 -91482 67105
4939 228600 150386 174780 -226907 -290092 -217948 283583 112434 -223543 -171955 -163181 72651
4927 -22420 230939 -51651 204616 -251445 -52337 270408 -133833 -418819 201187 76316
4916 47632 44755 195732 151551 915 150473 -167472 -151456 -327915 233330 -145278 21301
4904 205147 227950 -64138 6672 234529 109099 -100713 122561 -22114 -349223 -227725 -10029
4892 -149412 -176705 -277470 74934 -28715 -19212 94718 -5929 106227 -35208 -181067 291443
4880 23797 -78387 123554 301007 10303 -146448 346764 -200668 -2906 -261121 -130377 6052
4868 -109859 42294 -6252 47073 110886 66511 130077 131239 102106 192150 -264045 -45198 -97497
4856 -97497 304244 779 -235252 -277588 167145 66038 86369 125829 -5177 34713 -47057 1136
4843 -35004 75965 263579 -83965 121998 177980 57425 -24494 339461 181916 -43562 -153
4831 -93755 -34903 88943 -52446 29054 -189247 -36631 -24846 -192521 -199048 -97402 -109353 270559
4818 129632 241535 -215576 16070 208852 -207092 -109043 -224588 66799 1570 214593 327571
4807 327571 117204 -90905 62696 162561 -122829 -165595 -25769 -92614 -154073 182869 17251
4795 -79383 173119 123037 301904 -174489 -126284 89000 48070 -53531 1886 65449 -11100
4783 36467 -35400 -164398 234619 148367 367775 171475 48930 38232 55557 -12903 -79095
4772 -79095 46340 -78738 42451 136770 -64388 244113 32552 -94645 145236 -143976 201240
4760 285536 81124 -76442 -56070 -76967 82076 -276676 -17727 328941 -30412 -130576 98442
4748 166052 98586 -73785 -517716 178229 144632 -97174 11802 -88066 46727 -147306 14291
4736 -278756 -19877 70157 -131249 -176043 -294676 54540 199623 14731 91238 -25449 -114580
4725 -114580 -155046 -96353 12216 172183 217861 -281833 63036 -141509 -31095 256097 -286095
4713 -14954 35906 147187 -56569 184892 -50942 -248268 -72207 88964 106605 316970 412820
4702 412820 12682 13001 -189687 -99682 -124530 140598 -30385 -56617 10746 41431 -257357
4690 171026 146494 -185025 -140784 -176781 22702 224598 268225 99299 -30314 194108 -14295
4678 59035 165743 369573 -4543 -11961 76768 142151 -50847 -113485 370157 30502 -12019 -300669
4666 -300669 -5107 -355788 -349002 286620 -186110 257924 105864 2609 9106 101254 317666
4655 317666 -58794 131960 -118406 190546 -72395 -31898 171981 -104295 120431 38855
4644 276516 -119153 285403 172356 -33682 -268140 33793 -34970 -218434 -236162 16832 104629
4633 104629 -69499 -39771 90850 9477 175581 14400 241060 -102629 342925 88264 56686
4622 56686 197579 -624310 22744 58812 164492 -10500 175243 330664 128834 -151247
4611 125446 -83023 239272 -13488 -206318 -968 -496888 -44966 282711 7648 -79370 -300241
4600 -300241 50600 71702 353156 -42136 -74599 -56097 73919 111821 20511 553147 159818
4588 -195770 -4942 -143195 30500 145615 139902 195286 -159038 -87768 -312254 109219 423239
4577 423239 -52623 30916 -255856 -283546 58470 84481 80835 92844 20576 -280581 -80499
4565 -126519 -191811 -77701 32695 -137606 339660 70571 82452 146728 166661 -96983 -42897
4553 74747 -220387 -189443 -440007 -50755 237661 286121 75383 -301813 -194793 152357 38721
4541 -64070 -291666 -36809 -334971 193595 255478 -128113 -109586 -98425 -211817 60877 -127266
4529 -86353 100414 93894 138651 -159131 172662 46821 68778 -38485 14222 146112 -72125
4517 -10362 -55052 32376 103827 154618 47587 21492 13354 -199292 -77178 180345 175130 204533
4505 204533 -215645 -288671 -244395 -110020 205709 -96763 139997 -132306 -69892 -42512 -144927
4494 -144927 -131025 -30061 -301465 -91200 266464 -393703 -273918 -59232 175560 3535 -101701
4482 -36804 248244 -402718 31208 -106061 -23495 149096 47952 134319 355202 -397775 106724
4470 -151760 196371 32249 -56609 206754 223882 -231034 -49834 -63882 408648 -26459 227289
$$ [...]
##END NTUPLES=NMR SPECTRUM
##END=
