
##TITLE=AC1251_CAMARS11069_6666575_Mi8tgwo5B0
##JCAMPDX= 6.0         $$ Bruker NMR JCAMP-DX V2.0
##DATA TYPE= NMR SPECTRUM
##DATA CLASS= NTUPLES
##ORIGIN= BRUKER
##OWNER= Administrator
$$ 1.72 TOPSPIN		Version 2.1
$$ 2012-08-13 20:05:53.750 -0500  Administrator@TOPSPIN
$$ Compression mode = diff/dup
##.OBSERVE FREQUENCY= 400.02188249412
##.OBSERVE NUCLEUS= ^1H
##.ACQUISITION MODE= SIMULTANEOUS (DQD)
##.ACQUISITION SCHEME= undefined
##.AVERAGES= 64
##.DIGITISER RES= 22
##SPECTROMETER/DATA SYSTEM= spect
##.PULSE SEQUENCE= noesygpps1d.comp
##.SOLVENT NAME= COFFEE_meoh
##.SHIFT REFERENCE= INTERNAL, COFFEE_meoh, 1, 14.96234
##AUDIT TRAIL= $$ (NUMBER, WHEN, WHO, WHERE, PROCESS, VERSION, WHAT)
$$ ##TITLE= Audit trail, TOPSPIN		Version 2.1
$$ ##JCAMPDX= 5.01
$$ ##ORIGIN= Bruker BioSpin GmbH
$$ ##OWNER= Administrator
$$ $$ C:\Bruker\TOPSPIN/data/COFFEE/nmr/AC1251_CAMARS11069_6666575_Mi8tgwo5B0/12/pdata/1/auditp.txt
$$ ##AUDIT TRAIL=  $$ (NUMBER, WHEN, WHO, WHERE, PROCESS, VERSION, WHAT)
(   1,<2012-08-13 20:05:47.609 -0500>,<Administrator>,<TOPSPIN>,<go>,<TOPSPIN 2.1>,
      <created by zg
	started at 2012-08-13 19:54:17.250 -0500,
	POWCHK enabled, PULCHK disabled,
       configuration hash MD5:
       6B 1B 68 BB D9 2E 58 E2 7F 35 AD 54 07 DF 0E 41
       data hash MD5: 64K
       85 7A 09 BC 51 94 BD 09 B9 B2 BA 6E BA F9 DD 9A>)
(   2,<2012-08-13 20:05:51.625 -0500>,<Administrator>,<TOPSPIN>,<proc1d>,<TOPSPIN 2.1>,
      <Start of raw data processing
       efp LB = 0.3 FT_mod = 6 PKNL = 1 PHC0 = 0 PHC1 = 0 SI = 128K 
       data hash MD5: 128K
       F5 E9 8B 71 54 1A 8A 08 E9 5E 7C E9 C1 55 89 58>)
(   3,<2012-08-13 20:05:52.750 -0500>,<Administrator>,<TOPSPIN>,<proc1d>,<TOPSPIN 2.1>,
      <pk PHC0 = 5.388794 PHC1 = 0 
       data hash MD5: 128K
       01 A5 FB DE FE 7D 3F 14 18 6A 34 AA 6B 67 EB E8>)
(   4,<2012-08-13 20:05:53.343 -0500>,<Administrator>,<TOPSPIN>,<proc1d>,<TOPSPIN 2.1>,
      <abs ABSG = 1 
       data hash MD5: 128K
       F6 91 69 6B 97 4B 1C EF 40 F9 CA 8B B6 18 E6 78>)
(   5,<2012-08-13 20:05:53.421 -0500>,<Administrator>,<TOPSPIN>,<proc1d>,<TOPSPIN 2.1>,
      <abs ABSG = 2 
       data hash MD5: 128K
       18 33 57 A3 28 4E CA 6A 06 4C B8 10 5D 76 84 AF>)
(   6,<2012-08-13 20:05:53.468 -0500>,<Administrator>,<TOPSPIN>,<proc1d>,<TOPSPIN 2.1>,
      <abs ABSG = 3 
       data hash MD5: 128K
       C4 1F E1 24 DA 0D EB 68 0C 79 60 81 E8 E3 AE 13>)
(   7,<2012-08-13 20:05:53.562 -0500>,<Administrator>,<TOPSPIN>,<proc1d>,<TOPSPIN 2.1>,
      <abs ABSG = 4 
       data hash MD5: 128K
       F4 39 46 16 0C 2A 4C 4D 40 91 A8 7F D9 87 B1 8F>)
(   8,<2012-08-13 20:05:53.625 -0500>,<Administrator>,<TOPSPIN>,<proc1d>,<TOPSPIN 2.1>,
      <abs ABSG = 5 
       data hash MD5: 128K
       50 89 22 07 A3 A7 BD 02 05 AD 5A A6 E3 86 0E 14>)
$$ ##END=
$$ 
$$ $$ hash MD5
$$ $$ 39 E7 D5 FE EF 72 1C C0 D6 8C D3 95 0E 37 E7 8F
##$RELAX= 
##$RELAX= 
##$RELAX= 
##$RELAX= 
##$RELAX= 
##$RELAX= 
##$RELAX= 
##$RELAX= 
$$ Bruker specific parameters
$$ [...]
150 150 150 150 150 150 150 150
##$TP07= 0
##$TPNAME0= <>
##$TPNAME1= <>
##$TPNAME2= <>
##$TPNAME3= <>
##$TPNAME4= <>
##$TPNAME5= <>
##$TPNAME6= <>
##$TPNAME7= <>
##$TPOAL= (0..7)
0.5 0.5 0.5 0.5 0.5 0.5 0.5 0.5
##$TPOFFS= (0..7)
0 0 0 0 0 0 0 0
##$TUNHIN= 0
##$TUNHOUT= 0
##$TUNXOUT= 0
##$USERA1= <user>
##$USERA2= <user>
##$USERA3= <user>
##$USERA4= <user>
##$USERA5= <user>
##$V9= 5
##$VALIST= <valist>
##$VCLIST= <CCCCCCCCCCCCCCC>
##$VD= 0
##$VDLIST= <DDDDDDDDDDDDDDD>
##$VPLIST= <PPPPPPPPPPPPPPP>
##$VTLIST= <TTTTTTTTTTTTTTT>
##$WBST= 1024
##$WBSW= 4
##$XGAIN= (0..3)
0 0 0 0
##$XL= 0
##$YL= 0
##$YMAX_a= 14101697
##$YMIN_a= -7845102
##$ZGOPTNS= <>
##$ZL1= 120
##$ZL2= 120
##$ZL3= 120
##$ZL4= 120
##$ABSF1= 14.96234
##$ABSF2= -5.595841
##$ABSG= 5
##$ABSL= 3
##$ALPHA= 0
##$AQORDER= 0
##$ASSFAC= 0
##$ASSFACI= 0
##$ASSFACX= 0
##$ASSWID= 0
##$AUNMP= <proc_prof1d_extract.lims>
##$AXLEFT= 0
##$AXNAME= <>
##$AXNUC= <1H>
##$AXRIGHT= 0
##$AXTYPE= 0
##$AXUNIT= <>
##$AZFE= 0.1
##$AZFW= 0.1
##$BCFW= 0
##$BC_mod= 0
##$BYTORDP= 0
##$COROFFS= 0
##$CY= 15
##$DATMOD= 1
##$DC= 0
##$DFILT= <>
##$DTYPP= 0
##$F1P= 0
##$F2P= 0
##$FCOR= 0.5
##$FTSIZE= 131072
##$FT_mod= 6
##$GAMMA= 0
##$GB= 0
##$INTBC= 1
##$INTSCL= 1
##$ISEN= 128
##$LB= 0.3
##$LEV0= 0
##$LPBIN= 0
##$MAXI= 10000
##$MC2= 0
##$MEAN= 0
##$ME_mod= 0
##$MI= 0
##$NCOEF= 0
##$NC_proc= -2
##$NLEV= 6
##$NOISF1= 0
##$NOISF2= 0
##$NSP= 0
##$NTH_PI= 0
##$NZP= 0
##$OFFSET= 14.96234
##$PC= 1
##$PHC0= 5.388794
##$PHC1= 0
##$PH_mod= 1
##$PKNL= yes
##$PPARMOD= 0
##$PPDIAG= 0
##$PPIPTYP= 0
##$PPMPNUM= 2147483647
##$PPRESOL= 1
##$PSCAL= 4
##$PSIGN= 0
##$PYNMP= <proc.py>
##$REVERSE= no
##$SF= 400.020009100978
##$SI= 131072
##$SIGF1= 0
##$SIGF2= 0
##$SINO= 400
##$SIOLD= 131072
##$SPECTYP= <>
##$SREGLST= <1H.CDCl3>
##$SSB= 0
##$STSI= 131072
##$STSR= 0
##$SW_p= 8223.68421052631
##$SYMM= 0
##$S_DEV= 0
##$TDeff= 65536
##$TDoff= 0
##$TI= <>
##$TILT= no
##$TM1= 0
##$TM2= 0
##$TOPLEV= 0
##$USERP1= <user>
##$USERP2= <user>
##$USERP3= <user>
##$USERP4= <user>
##$USERP5= <user>
##$WDW= 1
##$XDIM= 131072
##$YMAX_p= 414179992
##$YMIN_p= -13379
##$CURPLOT= <Network HP LaserJet P1505>
##$CURPRIN= <$Network HP LaserJet P1505>
##$DFORMAT= <normdp>
##$LAYOUT= <+/1D_H.xwp>
##$LFORMAT= <normlp>
##$PFORMAT= <normpl>
##$SURQMSG= 1
$$ End of Bruker specific parameters
$$ ---------------------------------
##NTUPLES= NMR SPECTRUM
##VAR_NAME=  FREQUENCY,     SPECTRUM/REAL,   SPECTRUM/IMAG
##SYMBOL=    X,             R,               I
##VAR_TYPE=  INDEPENDENT,   DEPENDENT,       DEPENDENT
##VAR_FORM=  AFFN,          ASDF,            ASDF
##VAR_DIM=   131072,        131072,          131072
##UNITS=     HZ,            ARBITRARY UNITS, ARBITRARY UNITS
##FACTOR=    0.0627417313425164, 1,          1
##FIRST=     8223.62146879497, 2815,         -56177
##LAST=      0,             3377,            -55523
##MIN=       0,             -13379,          0
##MAX=       8223.62146879497, 414179992,    0
$$ Real data points
##PAGE= N=1
##DATA TABLE= (X++(R..R)), XYDATA
$$ [...]
$$ plain form
63450 356377 354447 352981 352856 354041 355682 356844 357170 357223 358156 360704 364558 369113 374599 381803 390772
63435 390772 400545 410341 420417 431570 444300 458624 474266 490829 508245 527199 548653 572750
63423 572750 598644 625535 653424 682628 713044 744262 776111 808745 842189 875857 908256
63412 908256 937163 960488 977214 987526 992116 991669 986913 978752 968257 956630 944959 933608
63400 933608 921992 909316 895344 880054 862956 843509 822124 799979 777883 756016 734762
63389 734762 714919 696916 680583 665863 653053 642134 632738 625035 619841 617380 616781 617335 619518
63376 619518 624043 630440 637374 644081 650848 658271 666657 676126 686851 699055 712879 728180 744558
63363 744558 761793 780154 799895 820593 841658 863499 887364 913787 941787 969804 996581
$$ packed form
63450C56377j930j466j25J185J641J162L26N3R33K548L854M555N486P204Q969
63435C90772R773R796J0076J1153J2730J4324J5642J6563J7416J8954K1454K4097
63423E72750K5894K6891K7889K9204L0416L1218L1849L2634L3444L3668L2399
63412I08256K8907K3325J6726J0312M590m47m756q161j0495j1627j1671j1351
63400I33608j1616j2676j3972j5290j7098j9447k1385k2145k2096k1867k1254
63389G34762j9843j8003j6333j4720j2810j0919r396p703n194k461n99N54K183
63376F19518M525O397O934O707O767P423Q386R469J0725J2204J3824J5301J6378
63363G44558J7235J8361J9741K0698K1065K1841K3865K6423K8000K8017K6777
$$ plain form
63352 996581 1020872 1041158 1056311 1065965 1069844 1067478 1059168 1046523 1031422 1015031 998280 982345
63340 982345 967637 952989 936957 919536 901617 883148 862939 840222 815427 789467 763159
63329 763159 737378 712827 689425 666574 644238 623263 604573 588527 574993 563420 552815
63318 552815 542354 532120 522752 514269 505826 496784 487537 479067 472064 466527 461850 457175 451977 446362
63304 446362 440629 434737 428555 422346 416441 410612 404439 398201 392695 388095 383659 378715 373343 367930
63290 367930 362686 357859 353872 350830 348245 345522 342461 339153 335781 332687 330222 328312 326471 324423
63276 324423 322381 320561 318825 316999 315186 313495 311749 309718 307406 304925 302387 300122 298678 298267
63262 298267 298385 298247 297472 296193 294693 293197 291927 291115 290928 291402 292368 293476 294441 295288 296206 297257 298422
$$ packed form
63352I96581K4291K0286J5153R654L879k366q310j2645j5101j6391j6751j5935
63340I82345j4708j4648j6032j7421j7919j8469k0209k2717k4795k5960k6308
63329G63159k5781k4551k3402k2851k2336k0975j8690j6046j3534j1573j0605
63318E52815j0461j0234r368q483q443r042r247q470p003n537m677m675n198n615
63304D46362n733n892o182o209n905n829o173o238n506m600m436m944n372n413
63290C67930n244m827l987l042k585k723l061l308l372l094k465j910j841k048
63276C24423k042j820j736j826j813j691j746k031k312k481k538k265j444m11
63262B98267J18j38p75j279j500j496j270q12j87M74R66J108R65Q47R18J051J165
$$ plain form
63245 298422 299855 301656 303389 304316 304382 304612 306188 309312 313233 317241 321290 325626 330120 334192 337388
63230 337388 339858 342068 344122 345702 346784 347992 349870 352152 354220 356037 358001 360049 361620 362531
63216 362531 363150 363557 363352 362592 362175 362730 363772 364539 365141 366137 367406 368376 369188 370716 373236 375824 377404
63199 377404 377953 378406 379741 382365 385976 389772 393059 395955 399297 403649 408639 413441 417672 421507 425209
63184 425209 429005 433341 438753 445260 452169 458750 465039 471853 480019 489602 499755 509314 517683 525255
63170 525255 532900 540982 549018 556296 562525 567766 572043 575396 578117 580472 582312 583398 584088 585114
63156 585114 586462 587033 585768 582690 578405 573008 566101 557717 548574 539416 530591 522340 514925 508291
63142 508291 502042 496013 490530 485852 481713 477760 474201 471658 470470 470437 471214 472640 474638 476981 479262
$$ packed form
63245B98422J433J801J733R27O6K30J576L124L921M008M049M336M494M072L196
63230C37388K470K210K054J580J082J208J878K282K068J817J964K048J571R11
63216C62531O19M07k05p60m17N55J042P67O02R96J269R70Q12J528K520K588J580
63199C77404N49M53J335K624L611L796L287K896L342M352M990M802M231L835L702
63184D25209L796M336N412O507O909O581O289O814Q166R583J0153R559Q369P572
63170E25255P645Q082Q036P278O229N241M277L353K721K355J840J086O90J026
63156E85114J348N71j265l078m285n397o907q384r143r158q825q251p415o634
63142E08291o249o029n483m678m139l953l559k543j188l3P77J426J998K343K281
$$ plain form
63127 479262 481130 482600 484168 486416 489306 492048 493892 494988 496163 497856 499635 500872 501545 502095 502706
63112 502706 503116 503050 502419 501043 498641 495420 492339 490304 489150 487898 486073 484352 483622 483754 483707 482702
63096 482702 480899 478861 476757 474365 471699 469352 468100 468243 469381 470811 472105 473299 474660 476414
63082 476414 478700 481601 485040 488725 492446 496528 501836 509034 517802 526937 535382 543044 550443 557827
63068 557827 564974 571760 578279 584217 588659 591005 591687 591481 590388 587799 583570 578250 572289 565752 558888
63053 558888 552201 545650 538458 530171 521387 513048 505410 498209 491398 485145 479348 473647 467850 462100
63039 462100 456834 452795 450619 449973 449490 448120 446229 444843 444087 443154 441644 440185 439665 440490 442656 445835
63023 445835 449127 451311 451780 450955 449597 448047 446287 444345 442299 440196 438238 436861 436335 436434 436764 437249
$$ packed form
63127D79262J868J470J568K248K890K742J844J096J175J693J779J237O73N50O11
63112E02706M10o6o31j376k402l221l081k035j154j252j825j721p30J32m7j005
63096D82702j803k038k104k392k666k347j252J43J138J430J294J194J361J754
63082D76414K286K901L439L685L721M082N308P198Q768R135Q445P662P399P384
63068E57827P147O786O519N938M442K346O82k06j093k589m229n320n961o537o864
63053E58888o687o551p192q287q784q339p638p201o811o253n797n701n797n750
63039D62100n266m039k176o46m83j370j891j386p56r33j510j459n20Q25K166L179
63023D45835L292K184M69q25j358j550j760j942k046k103j958j377n26R9L30M85
$$ plain form
63007 437249 438062 439165 440280 441343 442685 444616 447032 449722 452935 457241 462677 468389 473479 478009
62993 478009 482757 488101 493615 498747 503377 507616 511607 515680 520176 524861 529077 532726 536470 540564
62979 540564 544171 546447 547671 548491 548583 546965 543385 538373 532036 523789 513370 501245 487804 472950
62965 472950 456804 440119 423627 407499 391781 376880 363193 350609 338739 327491 317181
62954 317181 308243 300935 295213 290805 287444 284927 282830 280597 278216 276443 275793 275647 275002 273814 272827
62939 272827 272269 271680 271007 270852 271396 271959 271914 271236 269904 267687 264929 262615 261083 259382 256552 252895
62923 252895 249353 246287 243600 241554 240569 240447 240479 240190 239518 238508 237342 236420 235939 235641 235365 235424 235960
62906 235960 236374 236081 235467 235354 235772 236022 235862 235752 235907 235942 235710 235822 236901 238726 240471 241507 241728 241373
$$ packed form
63007D37249Q13J103J115J063J342J931K416K690L213M306N436N712N090M530
62993D78009M748N344N514N132M630M239L991M073M496M685M216L649L744M094
62979E40564L607K276J224Q20R2j618l580n012o337q247j0419j2125j3441j4854
62965D72950j6146j6685j6492j6128j5718j4901j3687j2584j1870j1248j0310
62954C17181q938p308n722m408l361k517k097k233k381j773o50j46o45j188r87
62939B72827n58n89o73j55N44N63m5o78j332k217k758k314j532j701k830l657
62923B52895l542l066k687k046r85j22L2k89o72j010j166r22m81k98k76N9N36
62906B35960M14k93o14j13M18K50j60j10J55L5k32J12J079J825J745J036K21l55
$$ plain form
62888 241373 240859 240708 241361 242946 245269 248020 250978 253976 256669 258535 259443 260229 262305 266407 271926
62873 271926 277647 282982 288278 294151 300800 307812 314433 320113 324941 329378 333466 336619 338393 339121
62859 339121 339402 339243 338153 335995 333275 330535 327777 324629 320950 317168 314002 311803 310345 309432 309524
62844 309524 311216 314147 317070 319213 320972 322956 325035 326833 328558 330585 332634 334172 335407 337098
62830 337098 339423 341783 343762 345670 347987 350807 353940 357089 359795 361622 362524 362740 362336 361258 359833
62815 359833 358673 357840 356546 353950 350090 345800 341855 338260 334228 328859 322038 314673 307833 301764
62801 301764 296005 290352 285155 280626 276365 271966 267792 264724 263145 262347 261026 258332 254509 250584
62787 250584 247419 245117 243207 241204 238846 236081 233106 230325 227983 225890 223683 221304 219016 217059
$$ packed form
62888B41373n14j51O53J585K323K751K958K998K693J866R08P86K076M102N519
62873B71926N721N335N296N873O649P012O621N680M828M437M088L153J774P28
62859C39121K81j59j090k158k720k740k758l148l679l782l166k199j458r13R2
62844C09524J692K931K923K143J759J984K079J798J725K027K049J538J235J691
62830C37098K325K360J979J908K317K820L133L149K706J827R02K16m04j078j425
62815C59833j160q33j294k596l860m290l945l595m032n369o821p365o840o069
62801C01764n759n653n197m529m261m399m174l068j579p98j321k694l823l925
62787B50584l165k302j910k003k358k765k975k781k342k093k207k379k288j957
$$ plain form
62773 217059 215540 214555 214175 214304 214775 215465 216182 216646 216909 217537 218923 220576 221630 222060 222821 224630 227175
62756 227175 229845 232713 236238 240246 243869 246622 249086 252198 256129 260263 264189 268183 272441 276297
62742 276297 278807 280003 280964 282526 284399 285707 285895 284866 282813 280319 278101 276126 273393 269163 264109
62727 264109 259590 256085 252970 249594 245762 241238 235715 229587 224059 220095 217635 216033 214813 213779
62713 213779 212832 212041 211644 211737 212205 213052 214502 216600 218966 221130 222918 224458 226070 228252 231421 235512
62697 235512 240073 244916 250407 256988 264616 272817 281115 289375 298024 308014 320271 334947 351322
62684 351322 368428 385554 402223 418174 433565 448782 463724 477482 488958 497625 503456 506354
62672 506354 506001 502219 495262 485742 474315 461420 447228 431899 415859 399715 383891 368490
$$ packed form
62773B17059j519r85l80J29M71O90P17M64K63O28J386J653J054M30P61J809K545
62756B27175K670K868L525M008L623K753K464L112L931M134L926L994M258L856
62742B76297K510J196R61J562J873J308J88j029k053k494k218j975k733m230n054
62727B64109m519l505l115l376l832m524n523o128n528l964k460j602j220j034
62713B13779r47p91l97R3M68Q47J450K098K366K164J788J540J612K182L169M091
62697B35512M561M843N491O581P628Q201Q298Q260Q649R990J2257J4676J6375
62684C51322J7106J7126J6669J5951J5391J5217J4942J3758J1476Q667N831K898
62672E06354l53l782o957r520j1427j2895j4192j5329j6040j6144j5824j5401
$$ plain form
62660 368490 353490 338978 325201 312537 301348 291770 283737 277307 272629 269323 266250 262440 258094
62647 258094 254103 250720 247365 243765 240465 237929 235836 233624 231222 228829 226494 224389 223003 222502
62633 222502 222276 221709 221140 221358 222312 223014 222822 222172 221817 221808 221638 221134 220758 220972 221550 221772 221238 220298 219539
62614 219539 219101 218803 218763 219341 220405 221165 221129 220831 221242 222714 224857 227158 229267 230912 232185 233856 236790
62597 236790 240869 244996 248402 251502 255158 259509 264023 268496 273374 278915 284543 289424 293528 297700
62583 297700 302591 307851 312572 316316 319359 322030 324286 326095 327776 329526 330838 330916 329723 328150 326954
62568 326954 325984 324782 323536 322827 322566 321915 320476 318900 317858 316870 314852 311591 307965 304714 301734
62553 301734 298751 295943 293477 291016 288285 285691 283730 281984 279402 275575 271212 267337 264469 262523
$$ packed form
62660C68490j5000j4512j3777j2664j1189r578q033o430m678l306l073l810m346
62647B58094l991l383l355l600l300k536k093k212k402k393k335k105j386n01
62633B22502k26n67n69K18R54P02j92o50l55rj70n04l76K14N78K22n34r40p59
62614B19539m38k98m0N78J064P60l6k98M11J472K143K301K109J645J273J671K934
62597B36790M079M127L406L100L656M351M514M473M878N541N628M881M104M172
62583B97700M891N260M721L744L043K671K256J809J681J750J312P8j193j573j196
62568C26954r70j202j246p09k61o51j439j576j042r88k018l261l626l251k980
62553C01734k983k808k466k461k731k594j961j746k582l827m363l875k868j946
$$ plain form
62539 262523 260930 258754 255209 250433 245414 240981 237155 233635 230528 228222 226757 225674 224470 223045
62525 223045 221768 221210 221699 223010 224532 225850 227049 228409 229950 231472 232925 234502 236328 238229 239993
62510 239993 241824 244360 248128 253162 259300 266655 275441 285328 295429 305087 314414 323940 334081 345065
62496 345065 356843 368697 379361 387960 394539 399388 402388 403579 403828 404008 403719 401728 397683 392535
62482 392535 387137 381320 374710 367693 361025 354893 348885 342750 336856 331960 328601 326578 325019 323189
62468 323189 321094 319069 317051 314752 312357 310388 308965 307832 307026 306808 306946 306900 306803 307335 308473 309406
62452 309406 310030 311428 314203 317332 319586 321304 323631 326556 328857 329890 330318 331017 332069 333045 333572
62437 333572 333413 332498 331181 330073 329326 328262 325975 322330 318290 315180 313548 312852 312431 312516 313814 316193
$$ packed form
62539B62523j593k176l545m776n019m433l826l520l107k306j465j083j204j425
62525B23045j277n58M89J311J522J318J199J360J541J522J453J577J826J901J764
62510B39993J831K536L768N034O138P355Q786R887J0101R658R327R526J0141J0984
62496C45065J1778J1854J0664Q599O579M849L000J191K49J80k89j991m045n148
62482C92535n398n817o610p017o668o132o008o135n894m896l359k023j559j830
62468C23189k095k025k018k299k395j969j423j133q06k18J38m6r7N32J138R33
62452C09406O24J398K775L129K254J718K327K925K301J033M28O99J052R76N27
62437C33572j59r15j317j108p47j064k287l645m040l110j632o96m21Q5J298K379
$$ plain form
62421 316193 318587 320386 322222 324949 328499 332289 336204 340494 345092 349722 354468 359646 365366 371710
62407 371710 379056 387551 396559 405280 413771 422690 432202 441839 451367 461081 471196 481610 492359
62394 492359 503634 515208 526404 536849 546725 556095 564485 571490 577440 583081 588725 593958 598118
62381 598118 600966 602930 604675 606419 607875 609013 610578 613497 617982 623654 630477 639067 650048 663535
62367 663535 679310 697267 717561 740544 766552 795592 827436 862309 901219 945157 994054
62356 994054 1046877 1102583 1160448 1219547 1278466 1335588 1389219 1437444 1478430 1510990 1534530
62345 1534530 1548489 1552494 1547114 1533793 1513666 1486911 1453497 1414059 1369700 1321405 1270150 1217283
62333 1217283 1164304 1112339 1062192 1014792 971167 931998 897396 867153 840987 818509 799115
$$ packed form
62421C16193K394J799J836K727L550L790L915M290M598M630M746N178N720O344
62407C71710P346Q495R008Q721Q491Q919R512R637R528R714J0115J0414J0749
62394D92359J1275J1574J1196J0445R876R370Q390P005N950N641N644N233M160
62381E98118K848J964J745J744J456J138J565K919M485N672O823Q590J0981J3487
62367F63535J5775J7957K0294K2983K6008K9040L1844L4873L8910M3938M8897
62356I94054N2823N5706N7865N9099N8919N7122N3631M8225M0986L2560K3540
62345A534530J3959M005n380j3321k0127k6755l3414l9438m4359m8295n1255n2867
62333A217283n2979n1965n0147m7400m3625l9169l4602l0243k6166k2478j9394
$$ plain form
62322 799115 782075 766817 753206 741508 731933 724251 718004 713139 710193 709700 711489 714660 718269
62309 718269 722001 726273 731756 738810 747305 756782 766602 776034 784533 792086 799092 805845 812304 818372
62295 818372 823995 828908 832731 835580 838213 841255 844724 848654 853636 860097 867418 874520 881209 888283
62281 888283 896504 906070 916984 929092 941778 954415 967352 981821 998600 1017284 1037030 1057502
62269 1057502 1078919 1101778 1126743 1154345 1184558 1217154 1252470 1291177 1333155 1377470 1423869
62258 1423869 1473532 1527738 1586440 1648761 1714259 1782714 1852937 1922665 1989616 2051960 2107726
62247 2107726 2154533 2190343 2214314 2226849 2229155 2222799 2209365 2190223 2166497 2139095 2108619 2075460
62235 2075460 2040230 2004108 1968605 1935064 1904465 1877457 1854290 1834793 1818691 1805952 1796673
$$ packed form
62322G99115j7040j5258j3611j1698r575p682o247m865k946m93J789L171L609
62309G18269L732M272N483P054Q495R477R820R432Q499P553P006O753O459O068
62295H18372N623M913L823K849K633L042L469L930M982O461P321P102O689P074
62281H88283Q221R566J0914J2108J2686J2637J2937J4469J6779J8684J9746K0472
62269A057502K1417K2859K4965K7602L0213L2596L5316L8707M1978M4315M6399
62258A423869M9663N4206N8702O2321O5498O8455P0223O9728O6951O2344N5766
62247B107726M6807L5810K3971J2535K306o356j3434j9142k3726k7402l0476l3159
62235B075460l5230l6122l5503l3541l0599k7008k3167j9497j6102j2739r279
$$ plain form
62224 1796673 1790679 1787452 1786414 1787205 1789810 1794494 1801500 1810604 1821089 1832304 1844192 1857189 1871726
62211 1871726 1887922 1905543 1924095 1943158 1962794 1983443 2005284 2028014 2051518 2076390 2103321
62200 2103321 2132137 2161939 2192163 2223108 2255441 2289646 2325997 2364605 2405268 2447603 2491511
62189 2491511 2537282 2585090 2634739 2686075 2739228 2793898 2848590 2901042 2949552 2993546 3032870
62178 3032870 3067013 3095492 3118770 3138277 3155433 3170974 3185479 3200270 3217398 3238602 3264430
62167 3264430 3294383 3327681 3363811 3402498 3443420 3485964 3529074 3571161 3610228 3644223 3671512
62156 3671512 3691174 3703001 3707234 3704238 3694344 3677963 3655849 3629098 3598687 3564952 3527702 3487049
62144 3487049 3444081 3400494 3357671 3316270 3276627 3239130 3204099 3171554 3141392 3113642 3088392
$$ packed form
62224A796673n994l227j038P91K605M684P006R104J0485J1215J1888J2997J4537
62211A871726J6196J7621J8552J9063J9636K0649K1841K2730K3504K4872K6931
62200B103321K8816K9802L0224L0945L2333L4205L6351L8608M0663M2335M3908
62189B491511M5771M7808M9649N1336N3153N4670N4692N2452M8510M3994L9324
62178C032870L4143K8479K3278J9507J7156J5541J4505J4791J7128K1204K5828
62167C264430K9953L3298L6130L8687M0922M2544M3110M2087L9067L3995K7289
62156C671512J9662J1827M233k996r894j6381k2114k6751l0411l3735l7250m0653
62144C487049m2968m3587m2823m1401l9643l7497l5031l2545l0162k7750k5250
$$ plain form
62133 3088392 3065596 3045065 3026532 3009567 2993556 2977894 2962153 2946087 2929742 2913664 2898619
62122 2898619 2884856 2871804 2858752 2845564 2832527 2819826 2807565 2796022 2785312 2774804 2763359
62111 2763359 2750282 2735751 2720330 2704375 2687933 2670795 2652489 2632549 2611053 2588742 2566411
62100 2566411 2544248 2521839 2498866 2475759 2453611 2433326 2414825 2397299 2380297 2364304 2350090
62089 2350090 2337898 2327533 2318976 2312406 2307819 2305085 2304340 2305948 2310166 2317181 2327279 2340469 2355903
62076 2355903 2372125 2387958 2402820 2416270 2427797 2437247 2445145 2452412 2459934 2468404 2478336 2490132
62064 2490132 2504092 2519988 2536319 2550284 2558953 2560414 2553709 2538461 2515438 2487064 2456183 2423989
62052 2423989 2389624 2351504 2308142 2257882 2199297 2132567 2059806 1983632 1906083 1829116 1755016
$$ packed form
62133C088392k2796k0531j8533j6965j6011j5662j5741j6066j6345j6078j5045
62122B898619j3763j3052j3052j3188j3037j2701j2261j1543j0710j0508j1445
62111B763359j3077j4531j5421j5955j6442j7138j8306j9940k1496k2311k2331
62100B566411k2163k2409k2973k3107k2148k0285j8501j7526j7002j5993j4214
62089B350090j2192j0365q557o570m587k734p45J608M218P015J0098J3190J5434
62076B355903J6222J5833J4862J3450J1527R450P898P267P522Q470R932J1796
62064B490132J3960J5896J6331J3965Q669J461o705j5248k3023k8374l0881l2194
62052B423989l4365l8120m3362n0260n8585o6730p2761p6174p7549p6967p4100
$$ plain form
62041 1755016 1685404 1620382 1559374 1502474 1450415 1403630 1361913 1324724 1291299 1260722 1232369
62030 1232369 1206160 1182138 1160134 1140037 1121842 1105016 1088382 1071206 1053938 1037229 1020541
62019 1020541 1002526 982708 962198 942776 925700 911322 899274 888800 879200 870148 861730 854466
62007 854466 849351 847471 849276 854456 862644 873807 887742 903696 920891 938943 957330 974909
61995 974909 990446 1003165 1012228 1016168 1013664 1004686 990234 971141 947771 920691 890904 859439
61983 859439 827329 795932 766597 739965 716043 694896 676629 660833 646725 634002 622966
61972 622966 613777 606183 600030 595327 591677 588361 585318 583351 582883 583062 582696 581742 581298 582275 584645 587958
61956 587958 592044 597039 603080 610269 618852 629138 641218 654894 670044 686928 705995 727460
$$ packed form
62041A755016o9612o5022o1008n6900n2059m6785m1717l7189l3425l0577k8353
62030A232369k6209k4022k2004k0097j8195j6826j6634j7176j7268j6709j6688
62019A020541j8015j9818k0510j9422j7076j4378j2048j0474r600r052q418p264
62007H54466n115j880J805N180Q188J1163J3935J5954J7195J8052J8387J7579
61995I74909J5537J2719R063L940k504q978j4452j9093k3370k7080k9787l1465
61983H59439l2110l1397k9335k6632k3922k1147j8267j5796j4108j2723j1036
61972F22966r189p594o153m703l650l316l043j967m68J79l66r54m44R77K370L313
61956E87958M086M995O041P189Q583J0286J2080J3676J5150J6884J9067K1465
$$ plain form
61944 727460 751300 777629 806746 838679 872925 908810 945811 983401 1020924 1057980 1094706
61933 1094706 1131337 1167648 1203064 1237031 1268952 1298124 1324293 1348083 1370204 1390214 1406795
61922 1406795 1419492 1429702 1439649 1450865 1464185 1480904 1503232 1533335 1572299 1620283 1677520
61911 1677520 1744697 1822359 1910413 2008582 2117010 2235905 2364736 2502463 2648742 2804527
61901 2804527 2971451 3151045 3344533 3552535 3774461 4008484 4252019 4501041 4747989
61892 4747989 4980768 5184686 5345537 5451211 5492203 5462980 5363773 5200653 4983759 4725620
61882 4725620 4440163 4141229 3840550 3546867 3266680 3005012 2765127 2548178 2353771
61873 2353771 2180864 2028125 1893938 1776529 1674176 1585278 1508395 1442269 1385706 1337614
$$ packed form
61944G27460K3840K6329K9117L1933L4246L5885L7001L7590L7523L7056L6726
61933A094706L6631L6311L5416L3967L1921K9172K6169K3790K2121K0010J6581
61922A406795J2697J0210R947J1216J3320J6719K2328L0103L8964M7984N7237
61911A677520O7177P7662Q8054R8169J08428J18895J28831J37727J46279J55785
61901B804527J66924J79594J93488K08002K21926K34023K43535K49022K46948
61892D747989K32779K03918J60851J05674M0992k9223r9207j63120k16894k58139
61882D725620k85457k98934l00679k93683k80187k61668k39885k16949j94407
61873B353771j72907j52739j34187j17409j02353q8898p6883o6126n6563m8092
$$ plain form
61863 1337614 1297345 1264826 1240028 1222432 1211326 1206475 1208095 1216325 1231022 1251891 1278399 1309764
61851 1309764 1345446 1385353 1429018 1474907 1521229 1567116 1612141 1654791 1692432 1722922 1745328
61840 1745328 1758991 1763110 1757900 1745330 1727994 1707798 1686353 1665879 1648748 1636288 1628756 1626367
61828 1626367 1629676 1638860 1653051 1670426 1688597 1704901 1716730 1721999 1719431 1708520 1689258 1661849
61816 1661849 1626678 1584684 1537621 1487675 1436723 1386107 1337013 1290684 1248120 1209851 1176092
61805 1176092 1146937 1122348 1102286 1086882 1076256 1070206 1068385 1070731 1077283 1087622 1101038 1117410
61793 1117410 1137395 1161534 1189684 1221594 1257546 1298023 1343210 1393365 1449469 1512958 1584838
61782 1584838 1665462 1755290 1855627 1968559 2096218 2240136 2401313 2580958 2781092 3004347
$$ packed form
61863A337614m0269l2519k4798j7596j1106m851J620Q230J4697K0869K6508L1365
61851A309764L5682L9907M3665M5889M6322M5887M5025M2650L7641L0490K2406
61840A745328J3663M119n210j2570j7336k0196k1445k0474j7131j2460p532k389
61828A626367L309R184J4191J7375J8171J6304J1829N269k568j0911j9262k7409
61816A661849l5171m1994m7063m9946n0952n0616m9094m6329m2564l8269l3759
61805A176092k9155k4589k0062j5404j0626o050j821K346O552J0339J3416J6372
61793A117410J9985K4139K8150L1910L5952M0477M5187N0155N6104O3489P1880
61782A584838Q0624Q9828J00337J12932J27659J43918J61177J79645K00134K23255
$$ plain form
61772 3004347 3253339 3530410 3837730 4177116 4549589 4955189 5392701 5858440 6344525
61763 6344525 6838051 7321508 7773383 8168833 8481728 8688438 8771772 8723492 8545492 8249938
61753 8249938 7857692 7394811 6888481 6363882 5842198 5339459 4866514 4429947 4032903
61744 4032903 3675433 3355291 3069548 2815721 2591415 2393584 2218769 2063877 1926329
61735 1926329 1803780 1694329 1596923 1510974 1435519 1369041 1310085 1257705 1211311 1170350 1134212
61724 1134212 1102228 1073742 1048217 1025138 1003733 982935 961827 939912 916812 891960 864933
61713 864933 836008 806150 776481 747837 720682 695195 671517 649950 630783 613817 598311
61702 598311 583577 569463 556173 543843 532449 521888 511943 502375 493186 484581 476487 468367 459692
$$ packed form
61772C004347K48992K77071L07320L39386L72473M05600M37512M65739M86085
61763F344525M93526M83457M51875L95450L12895K06710Q3334m8280j78000k95554
61753H249938l92246m62881n06330n24599n21684n02739m72945m36567l97044
61744D032903l57470l20142k85743k53827k24306j97831j74815j54892j37548
61735A926329j22549j09451r7406q5949p5455o6478n8956n2380m6394m0961l6138
61724A134212l1984k8486k5525k3079k1405k0798k1108k1915k3100k4852k7027
61713H64933k8925k9858k9669k8644k7155k5487k3678k1567j9167j6966j5506
61702E98311j4734j4114j3290j2330j1394j0561r945r568r189q605q094q120q675
$$ plain form
61689 459692 450448 441060 432015 423659 416075 409012 402136 395397 388910 382610 376559 371487 368210 366181
61675 366181 363518 359077 353868 349674 346830 344254 341312 338578 336747 335740 335152 334928 335235 336094 337378
61660 337378 338850 340087 340723 340950 341473 342838 345066 348012 351748 356341 361497 366738 371919 377471 384086
61645 384086 392143 401331 410819 419741 427463 433453 437309 439192 439954 440436 440682 440148 438657 436858 435744
61630 435744 435980 437702 440663 444485 448984 454406 461191 469322 477887 485325 490165 491632 489722 484818
61616 484818 477323 467639 456325 444078 431540 419170 407134 395152 382741 369989 357963 347885
61604 347885 339926 333296 327427 322441 318361 314717 311317 308690 307131 305877 303997 301831 300785 301728
61590 301728 304197 307097 309704 311950 314235 317147 321029 325757 331037 336883 343549 351169 359702 369171
$$ packed form
61689D59692r244r388r045q356p584p063o876o739o487o300o051n072l277k029
61675C66181k663m441n209m194k844k576k942k734j831j007n88k24L07Q59J284
61660C37378J472J237O36K27N23J365K228K946L736M593N156N241N181N552O615
61645C84086Q057R188R488Q922P722N990L856J883P62M82K46n34j491j799j114
61630D35744K36J722K961L822M499N422O785Q131Q565P438M840J467j910m904
61616D84818p495r684j1314j2247j2538j2370j2036j1982j2411j2752j2026j0078
61604C47885p959o630n869m986m080l644l400k627j559j254j880k166j046R43
61590C01728K469K900K607K246K285K912L882M728N280N846O666P620Q533R469
$$ plain form
61576 369171 379660 391191 403770 417425 431976 447045 462506 478565 494994 510680 524555
61565 524555 536798 548552 560565 572623 584238 595220 605449 614686 622857 630195 636900 642947
61553 642947 648316 653153 657636 661956 666420 671207 675921 679734 682161 683510 684469 685435 686304 686644 685961
61538 685961 683951 680576 675856 669648 661894 653064 644103 635835 628493 621862 615767 610461 606585 604746
61524 604746 605092 607475 612014 619235 629483 642505 657881 675623 696084 719482 745960 775973
61512 775973 810277 849499 893951 943708 998666 1058681 1123962 1195256 1273415 1358859 1451451
61501 1451451 1550401 1653916 1759221 1863246 1962937 2054562 2133396 2195007 2236840 2258082 2258468
61490 2258468 2238243 2199278 2145160 2079769 2006274 1927569 1846763 1766681 1689358 1616399 1549400
$$ packed form
61576C69171J0489J1531J2579J3655J4551J5069J5461J6059J6429J5686J3875
61565E24555J2243J1754J2013J2058J1615J0982J0229R237Q171P338O705O047
61553F42947N369M837M483M320M464M787M714L813K427J349R59R66Q69L40o83
61538F85961k010l375m720o208p754q830q961q268p342o631o095n306l876j839
61524F04746L46K383M539P221J0248J3022J5376J7742K0461K3398K6478L0013
61512G75973L4304L9222M4452M9757N4958O0015O5281P1294P8159Q5444R2592
61501A451451R8950J03515J05305J04025R9691R1625P8834O1611M1833K1242L86
61490B258468k0225l8965n4118o5391p3495p8705q0806q0082p7323p2959o6999
$$ plain form
61479 1549400 1489515 1436880 1390880 1350861 1316444 1287449 1263844 1245678 1232797 1224725 1220922 1221000
61467 1221000 1224565 1231066 1239984 1251025 1264056 1278988 1295855 1314849 1335979 1358714 1382122 1405509
61455 1405509 1428867 1452457 1475903 1498054 1518193 1537272 1557399 1579943 1604525 1629913 1655308
61444 1655308 1680579 1705964 1731994 1759039 1786230 1811325 1832381 1849194 1862460 1872066 1877181 1877785
61432 1877785 1875034 1870072 1863337 1855090 1845808 1835842 1825302 1814328 1802947 1790812 1777800 1764681
61420 1764681 1752321 1740304 1727366 1713228 1698914 1685113 1671409 1657597 1644596 1633351 1623683
61409 1623683 1614885 1606673 1598779 1590311 1580378 1568957 1556451 1542873 1528173 1513055 1498738 1486156
61397 1486156 1475924 1468717 1465040 1464889 1468352 1476402 1490506 1511519 1539505 1574570 1617264 1668109
$$ packed form
61479A549400n9885n2635m6000m0019l4417k8995k3605j8166j2881q072l803P8
61467A221000L565O501Q918J1041J3031J4932J6867J8994K1130K2735K3408K3387
61455A405509K3358K3590K3446K2151K0139J9079K0127K2544K4582K5388K5395
61444A655308K5271K5385K6030K7045K7191K5095K1056J6813J3266R606N115O04
61432A877785k751m962o735q247r282r966j0540j0974j1381j2135j3012j3119
61420A764681j2360j2017j2938j4138j4314j3801j3704j3812j3001j1245r668
61409A623683q798q212p894q468r933j1421j2506j3578j4700j5118j4317j2582
61397A486156j0232p207l677j51L463Q050J4104K1013K7986L5065M2694N0845
$$ plain form
61385 1668109 1727163 1794261 1869438 1952969 2044987 2144925 2251226 2361761 2474558 2587831
61375 2587831 2699143 2804777 2900030 2979976 3040217 3077785 3091970 3084178 3056822 3012485 2953871
61364 2953871 2883636 2803823 2716004 2622203 2524973 2426150 2326318 2226257 2128247 2035066 1948129
61353 1948129 1867515 1793498 1726962 1668299 1616902 1572020 1533457 1501099 1474312 1452199 1434175
61342 1434175 1420043 1409646 1402576 1398083 1395238 1393297 1391890 1390881 1390262 1390363 1391766 1394687 1398711 1403546
61328 1403546 1409772 1418355 1429601 1443026 1458030 1474007 1489822 1503966 1515564 1524828 1532235 1537671
61316 1537671 1540709 1541550 1541256 1541059 1541521 1542354 1542903 1542761 1542018 1541031 1540033 1538942 1537517 1535649 1533539 1531445
61300 1531445 1529215 1526299 1522467 1518278 1514447 1510912 1507003 1502314 1496694 1489311 1478615 1463663 1444953
$$ packed form
61385A668109N9054O7098P5177Q3531R2018R9938J06301J10535J12797J13273
61375B587831J11312J05634R5253P9946O0241L7568J4185p792k7356m4337n8614
61364B953871p0235p9813q7819r3801r7230r8823r9832j00061r8010r3181q6937
61353A948129q0614p4017o6536n8663n1397m4882l8563l2358k6787k2113j8024
61342A434175j4132j0397p070m493k845j941j407j009o19J01J403K921M024M835
61328A403546O226Q583J1246J3425J5004J5977J5815J4144J1598R264P407N436
61316A537671L038Q41k94j97M62Q33N49j42p43r87r98j091j425j868k110k094
61300A531445k230k916l832m189l831l535l909m689n620p383j0696j4952j8710
$$ plain form
61287 1444953 1423630 1400573 1376671 1353274 1331543 1311743 1293789 1278055 1264872 1253629 1243293
61276 1243293 1233722 1225646 1219349 1214250 1209960 1207020 1206250 1207920 1212003 1218857 1229290 1243965 1262937
61263 1262937 1285731 1311841 1341189 1373892 1409483 1446587 1483659 1519890 1555256 1590079 1625065
61252 1625065 1661468 1700558 1742881 1788324 1836565 1886667 1936176 1981327 2018486 2045078 2059190
61241 2059190 2059025 2043325 2012140 1966882 1909809 1843595 1771176 1695687 1620332 1548041 1480888 1419792
61229 1419792 1364941 1316486 1274648 1239213 1209277 1183495 1160432 1138880 1118235 1098633 1080451
61218 1080451 1063766 1048587 1035418 1024937 1016977 1010336 1003903 997630 992123 987667 983997 980879 978463
61205 978463 977076 976923 978101 980652 984348 988397 991579 992947 992465 990850 988764 986394 983822 981461 979809
$$ packed form
61287A444953k1323k3057k3902k3397k1731j9800j7954j5734j3183j1243j0336
61276A243293r571q076o297n099m290k940p70J670M083O854J0433J4675J8972
61263A262937K2794K6110K9348L2703L5591L7104L7072L6231L5366L4823L4986
61252A625065L6403L9090M2323M5443M8241N0102M9509M5151L7159K6592J4112
61241B059190j65j5700l1185m5258n7073o6214p2419p5489p5355p2291o7153o1096
61229A419792n4851m8455m1838l5435k9936k5782k3063k1552k0645j9602j8182
61218A080451j6685j5179j3169j0481p960o641o433o273n507m456l670l118k416
61205I78463j387j53J178K551L696M049L182J368m82j615k086k370k572k361j652
$$ plain form
61190 979809 979000 978924 979756 982060 986344 992645 1000535 1009427 1018947 1029022 1039449 1049200 1056379 1059153 1056781
61175 1056781 1049790 1039423 1027008 1013495 999168 983836 967357 949805 931098 910879 889017
61164 889017 865897 842009 817701 793601 770754 749785 730347 711945 694976 680298 668073
61153 668073 657793 649315 643059 639095 636785 635533 635454 637101 640940 647142 655490 665418 676581 689431
61139 689431 704753 722444 741139 759088 774959 787590 795544 797557 793520 784813 773504 761199
61127 761199 748588 736039 724309 714235 705792 698047 690345 683049 676721 671115 665560 659945 654627
61114 654627 649622 644586 639480 634576 629837 624926 619843 614996 610611 606550 602697 599060 595581 592322
61100 592322 589748 588268 587607 587252 587432 588982 592213 596496 600996 605140 608324 609775 608914 605447 599147
$$ packed form
61190I79809q09p6Q32K304M284O301P890Q892R520J0075J0427R751P179K774k372
61175A056781o991j0367j2415j3513j4327j5332j6479j7552j8707k0219k1862
61164H89017k3120k3888k4308k4100k2847k0969j9438j8402j6969j4678j2225
61153F68073j0280q478o256l964k310j252p9J647L839O202Q348R928J1163J2850
61139F89431J5322J7691J8695J7949J5871J2631P954K013m037q707j1309j2305
61127G61199j2611j2549j1730j0074q443p745p702p296o328n606n555n615n318
61114F54627n005n036n106m904m739m911n083m847m385m061l853l637l479l259
61100E92322k574j480o61l55J80J550L231M283M500M144L184J451q61l467o300
$$ plain form
61085 599147 590127 579306 568067 557352 547565 539132 532383 526933 522023 517613 514400 512643 511750 511213
61071 511213 511202 511983 513478 515717 519035 523379 527945 531770 534330 535404 534958 533462 531851 530881 530778 531461
61055 531461 532634 533724 534390 535103 536641 539037 541764 544838 548876 554005 559675 565658 572293 579557 586878
61040 586878 594093 601585 609164 615919 621610 627279 633915 641403 649238 657345 665597 673462 680804 688257
61026 688257 696209 704148 711597 718907 726557 734467 742514 750864 759165 766304 771700 776062 780188 783854
61012 783854 786648 789003 791502 793876 795613 796960 798533 800482 802821 806081 810996 817988 827327 839017
60998 839017 852178 865578 879378 895303 914481 936210 959472 984317 1010931 1038850 1068316
60987 1068316 1100994 1138013 1178561 1221853 1269103 1321905 1379915 1442131 1509497 1584177 1666922
$$ packed form
61085E99147r020j0821j1239j0715r787q433o749n450m910m410l213j757q93n37
61071E11213j1P81J495K239L318M344M566L825K560J074m46j496j611r70j03O83
61055E31461J173J090O66P13J538K396K727L074M038N129N670N983O635P264P321
61040E86878P215P492P579O755N691N669O636P488P835Q107Q252P865P342P453
61026F88257P952P939P449P310P650P910Q047Q350Q301P139N396M362M126L666
61012G83854K794K355K499K374J737J347J573J949K339L260M915O992R339J1690
60998H39017J3161J3400J3800J5925J9178K1729K3262K4845K6614K7919K9466
60987A068316L2678L7019M0548M3292M7250N2802N8010O2216O7366P4680Q2745
$$ plain form
60976 1666922 1756972 1853879 1957521 2066796 2179962 2295756 2413000 2530624 2650307 2778087
60966 2778087 2921205 3084412 3271482 3488450 3741724 4033730 4364002 4734406 5150561
60957 5150561 5619860 6153451 6770764 7497793 8360532 9385070 10605056 12063856 13808742
60948 13808742 15891108 18376829 21347210 24874125 28978020 33582059 38461436 43204908
60940 43204908 47253665 50072629 51396105 51379665 50531936 49477291 48723909 48550480 48976904
60931 48976904 49744917 50333985 50104335 48562967 45593208 41479888 36730609 31850899
60923 31850899 27216141 23053206 19465729 16461975 13988054 11966205 10320184 8981067
60915 8981067 7887293 6988466 6246694 5631214 5113928 4671144 4285899 3945991 3641649
$$ packed form
60976A666922R0050R6907J03642J09275J13166J15794J17244J17624J19683J27780
60966B778087J43118J63207J87070K16968K53274K92006L30272L70404M16155
60957E150561M69299N33591O17313P27029Q62739J024538J219986J458800J744886
60948A3808742K082366K485721K970381L526915M103895M604039M879377M743472
60940D3204908M048757K818964J323476j6440q47729j054645p53382j73429M26424
60931D8976904P68013N89068k29650j541368k969759m113320m749279m879710
60923C1850899m634758m162935l587477l003754k473921k021849j646021j339117
60915H981067j093774q98827p41772o15480n17286m42784l85245l39908l04342
$$ plain form
60906 3641649 3366364 3117254 2892373 2688935 2504913 2340188 2194592 2066352 1953352
60897 1953352 1853922 1765013 1681589 1599596 1518404 1439130 1362123 1287558 1217072 1152862 1095718
60886 1095718 1045166 1000750 961912 927391 896028 867730 842664 820114 799043 779086 760056
60875 760056 741217 722155 703751 687130 672091 657593 643367 629993 617643 605830 594347
60864 594347 583644 574199 566014 558608 551147 542916 534086 525647 518229 511452 504839 498704 493495 488844
60850 488844 484015 478969 474377 470913 469018 468909 470224 472026 473704 475466 477560 479570 480959 481661 481505
60835 481505 479758 476050 471198 466336 461710 457156 453177 450537 449078 447825 446074 443749 441129 439027
60821 439027 438786 441097 445083 449435 454079 459743 466249 472486 477970 483223 488537 493541 498248 503459
$$ packed form
60906C641649k75285k49110k24881k03438j84022j64725j45596j28240j13000
60897A953352r9430q8909q3424q1993q1192p9274p7007p4565p0486o4210n7144
60886A095718n0552m4416l8838l4521l1363k8298k5066k2550k1071j9957j9030
60875G60056j8839j9062j8404j6621j5039j4498j4226j3374j2350j1813j1483
60864E94347j0703r445q185p406p461q231q830q439p418o777o613o135n209m651
60850D88844m829n046m592l464j895j09J315J802J678J762K094K010J389P02j56
60835D81505j747l708m852m862m626m554l979k640j459j253j751k325k620k102
60821D39027k41K311L986M352M644N664O506O237N484N253N314N004M707N211
$$ plain form
60807 503459 509643 516171 522080 527040 531285 535118 538724 542043 544738 546660 548222 549794 550846 550283
60793 550283 547551 542867 536668 529606 522708 516497 510093 502338 493789 486333 480745 475971 471177 467023
60779 467023 464209 462075 459676 457218 455317 453590 451225 448470 446409 445492 445297 445574 446515 447928 449002
60764 449002 449137 448514 447704 447181 447242 448037 449580 451960 455392 459804 464570 469096 473564 478655 484620 491070
60748 491070 497642 504389 511410 518427 524899 530422 534950 538684 541665 543317 542595 538829 532340 524033
60734 524033 514509 503822 491948 479206 466224 453724 442290 432078 422795 414091 405952 398528
60722 398528 391714 385163 378684 372438 366744 361876 357984 355004 352570 350143 347346 344211 341111 338350
60708 338350 335748 332722 328999 325171 322190 320260 318560 316167 312958 309530 306611 304688 303793 303371 302696
$$ packed form
60807E03459O184O528N909M960M245L833L606L319K695J922J562J572J052n63
60793E50283k732m684o199p062o898o211o404p755q549p456n588m774m794m154
60779D67023k814k134k399k458j901j727k365k755k061r17j95K77R41J413J074
60764D49002J35o23q10n23O1P95J543K380L432M412M766M526M468N091N965O450
60748D91070O572O747P021P017O472N523M528L734K981J652p22l766o489q307
60734E24033r524j0687j1874j2742j2982j2500j1434j0212r283q704q139p424
60722C98528o814o551o479o246n694m868l892k980k434k427k797l135l100k761
60708C38350k602l026l723l828k981j930j700k393l209l428k919j923q95m22o75
$$ plain form
60693 302696 301713 301218 301927 303669 305738 307663 309328 310746 312163 314083 316666 319389 321721 323918 326612
60678 326612 329896 333419 337188 341566 346465 351282 355787 360454 365686 371186 376362 380980 385174 389196
60664 389196 393419 398317 404185 410963 418415 426265 434158 441805 449380 457480 466555 476472 486688 496664
60650 496664 506088 514929 523317 531190 538097 543591 547689 550608 552158 551854 549614 545817 540608 533746
60636 533746 525320 516068 506715 497497 488649 480809 474438 469289 464866 461024 457609 454028 449950 446106
60622 446106 443522 442090 440765 439272 438658 439737 441780 443377 444087 444581 445414 446391 447190 448050 449574 452119
60606 452119 455619 459934 465186 471684 479568 488690 499020 511004 525185 541449 559045 577469 596863
60593 596863 617236 637748 657297 675479 692293 707036 718325 725381 728602 728520 724793 716696 704254
$$ packed form
60693C02696r83m95P09J742K069J925J665J418J417J920K583K723K332K197K694
60678C26612L284L523L769M378M899M817M505M667N232N500N176M618M194M022
60664C89196M223M898N868O778P452P850P893P647P575Q100R075R917J0216R976
60650D96664R424Q841Q388P873O907N494M098K919J550l04k240l797n209o862
60636E33746q426r252r353r218q848p840o371n149m423l842l415l581m078l844
60622D46106k584j432j325j493o14J079K043J597P10M94Q33R77P99Q60J524K545
60606D52119L500M315N252O498P884R122J0330J1984J4181J6264J7596J8424J9394
60593E96863K0373K0512J9549J8182J6814J4743J1289P056L221q2l727q097j2442
$$ plain form
60580 704254 688446 670630 652226 634640 618813 604772 592001 580195 569364 559424 550195 541773
60568 541773 534393 527987 522356 517745 514580 512470 510159 506828 502973 499542 496683 493894 491118 488958
60554 488958 487806 487297 486898 486640 487044 488464 490739 493436 496272 499286 502673 506538 510776 515107 519272
60539 519272 523341 527832 533336 539916 547084 554536 562637 571947 582539 594190 606988 621233 636882
60526 636882 653760 672378 693867 718926 747397 779169 815010 856122 903331 957106 1018084
60515 1018084 1087236 1165711 1254690 1354959 1466140 1586335 1712485 1840613 1965495 2080657
60505 2080657 2179444 2256458 2308472 2334777 2336968 2317866 2280256 2226885 2161449 2088377 2010966
60494 2010966 1930437 1847547 1764539 1684744 1610886 1544689 1487739 1441654 1407476 1385623 1376348
$$ packed form
60580G04254j5808j7816j8404j7586j5827j4041j2771j1806j0831r940r229q422
60568E41773p380o406n631m611l165k110k311l331l855l431k859k789k776k160
60554D88958j152n09l99k58M04J420K275K697K836L014L387L865M238M331M165
60539E19272M069M491N504O580P168P452Q101R310J0592J1651J2798J4245J5649
60526F36882J6878J8618K1489K5059K8471L1772L5841M1112M7209N3775O0978
60515A018084O9152P8475Q8979J00269J11181J20195J26150J28128J24882J15162
60505B080657R8787P7014N2014K6305K191j9102l7610n3371o5436p3072p7411
60494B010966q0529q2890q3008p9795p3858o6197n6950m6085l4178k1853r275
$$ plain form
60483 1376348 1379646 1395032 1422151 1461331 1512756 1575235 1646425 1723665 1803387 1879985 1946686
60472 1946686 1998022 2030854 2043451 2035256 2008213 1967252 1918592 1867867 1819764 1778111 1745382
60461 1745382 1722625 1710436 1709705 1721288 1745806 1784272 1838315 1909382 1998395 2106761 2237135
60450 2237135 2392552 2575263 2787045 3030418 3309120 3627711 3990970 4403162 4867031
60441 4867031 5383049 5948803 6557396 7194745 7837675 8454460 9007484 9457188 9767407
60432 9767407 9911283 9875539 9661741 9285519 8774784 8166325 7500440 6815334 6143136 5507628
60422 5507628 4923340 4396651 3928684 3517850 3160599 2851634 2585003 2355229 2157269
60413 2157269 1986184 1837694 1708691 1596592 1498543 1411954 1335388 1268156 1209228 1157132
$$ packed form
60483A376348L298J5386K7119L9180N1425O2479P1190P7240P9722P6598O6701
60472A946686N1336L2832J2597q195k7043m0961m8660n0725m8103m1653l2729
60461A745382k2757j2189p31J1583K4518L8466N4043P1067Q9013J08366J30374
60450B237135J55417J82711K11782K43373K78702L18591L63259M12192M63869
60441D867031N16018N65754O08593O37349O42930O16785N53024M49704L10219
60432I767407J43876l5744k13798l76222n10735o08459o65885o85106o72198o35508
60422E507628n84288n26689m67967m10834l57251l08965k66631k29774j97960
60413B157269j71085j48490j29003j12099r8049q6589p6566o7232n8928n2096
$$ plain form
60403 1157132 1110575 1068472 1029649 993335 959765 929539 902485 877707 854528 832682 811863
60392 811863 791891 773227 756527 741703 728120 715638 704624 694943 685773 676591 667553 658634
60380 658634 649160 638606 627301 615901 604571 593102 581593 570672 561057 553018 546160 539800
60368 539800 533759 528730 525578 524331 524133 524105 523974 523954 524321 525106 525875 525912 524836 522869 520240 516672 511893
60351 511893 506337 500779 495457 490173 485088 480761 477376 474576 472013 469538 466964 464314 462272 461648
60337 461648 462281 463179 463881 464988 467156 470324 474293 479304 485495 492248 498580 504001 508695 513211 518212
60322 518212 524180 531003 538128 545303 552876 561217 570267 579954 590626 602539 615095 626940 636811
60309 636811 644053 648476 649980 648389 643583 635798 625752 614361 602422 590710 580158 571522 564977
$$ packed form
60403A157132m6557m2103l8823l6314l3570l0226k7054k4778k3179k1846k0819
60392H11863j9972j8664j6700j4824j3583j2482j1014r681r170r182r038q919
60380F58634r474j0554j1305j1400j1330j1469j1509j0921r615q039o858o360
60368E39800o041n029l152j247j98k8j31k0L67P85P69L7j076j967k629l568m779
60351E11893n556n558n322n284n085m327l385k800k563k475k574k650k042o24
60337D61648O33Q98P02J107K168L168L969N011O191O753O332N421M694M516N001
60322E18212N968O823P125P175P573Q341R050R687J0672J1913J2556J1845R871
60309F36811P242M423J504j591m806p785j0046j1391j1939j1712j0552q636o545
$$ plain form
60296 564977 560382 557774 557084 557473 557625 556861 555419 553576 551201 548388 545733 543477 540975 537562 533493
60281 533493 529358 525012 519836 513963 508536 504645 502483 501610 501645 502527 504356 507120 510456 513677 516289
60266 516289 518468 520802 523560 526441 529148 531943 535436 539949 545348 551462 558364 566108 574475 583288
60252 583288 592898 603968 616800 631309 647725 666789 688943 713811 740942 770660 803572 839505
60240 839505 877661 917742 960281 1005700 1053608 1103129 1153431 1203733 1253266 1301437 1347709
60229 1347709 1391173 1430571 1464864 1493498 1516106 1532412 1542542 1547038 1546356 1540654 1530111 1515136
60217 1515136 1496341 1474891 1452885 1432643 1415220 1400140 1386918 1376305 1369638 1367559 1370027 1377201
60205 1377201 1389525 1407000 1429033 1455205 1485776 1521279 1561845 1607042 1656112 1708118 1761854
$$ packed form
60296E64977m595k608o90L89J52p64j442j843k375k813k655k256k502l413m069
60281E33493m135m346n176n873n427l891k162q73L5Q82J829K764L336L221K612
60266E16289K179K334K758K881K707K795L493M513N399O114O902P744Q367Q813
60252E83288R610J1070J2832J4509J6416J9064K2154K4868K7131K9718L2912L5933
60240H39505L8156M0081M2539M5419M7908M9521N0302N0302M9533M8171M6272
60229A347709M3464L9398L4293K8634K2608J6306J0130M496o82n702j0543j4975
60217A515136j8795k1450k2006k0242j7423j5080j3222j0613o667k079K468P174
60205A377201J2324J7475K2033K6172L0571L5503M0566M5197M9070N2006N3736
$$ plain form
60194 1761854 1815780 1868201 1917505 1962186 2000694 2031633 2054308 2068834 2075430 2073873 2063980 2046334
60182 2046334 2021940 1991362 1954954 1913987 1870908 1828237 1787699 1750590 1718308 1692143 1672950
60171 1672950 1661342 1657824 1662461 1674854 1694821 1722786 1759154 1803641 1855572 1914575 1980558 2053036
60159 2053036 2130713 2211601 2293375 2373756 2450663 2521900 2584748 2636169 2673427 2694315 2697073
60148 2697073 2680886 2646854 2598157 2539136 2474433 2408712 2346195 2289897 2241721 2203447 2177035
60137 2177035 2163603 2162750 2173440 2195209 2228243 2272864 2329474 2398552 2480075 2573239 2677195
60126 2677195 2791790 2917132 3052691 3197202 3349009 3505899 3664786 3822084 3974353
60117 3974353 4118415 4251286 4370540 4474492 4561571 4629740 4677064 4702693 4706838 4689912 4652103
$$ packed form
60194A761854N3926N2421M9304M4681L8508L0939K2675J4526O596j557r893j7646
60182B046334k4394l0578l6408m0967m3079m2671m0538l7109l2282k6165j9193
60171A672950j1608l518M637J2393J9967K7965L6368M4487N1931N9003O5983P2478
60159B053036P7677Q0888Q1774Q0381P6907P1237O2848N1421L7258K0888K758
60148B697073j6187l4032m8697n9021o4703o5721o2517n6298m8176l8274k6412
60137B177035j3432q53J0690K1769L3034M4621N6610O9078Q1523R3164J03956
60126B677195J14595J25342J35559J44511J51807J56890J58887J57298J52269
60117C974353J44062J32871J19254J03952Q7079O8169M7324K5629M145j6926l7809
$$ plain form
60106 4652103 4593713 4515559 4419184 4307015 4182216 4048126 3907938 3765046 3623308 3486526
60096 3486526 3357826 3239666 3133987 3041949 2963861 2899887 2850588 2816378 2796811 2790917 2798048
60085 2798048 2817835 2849397 2891003 2940299 2994443 3050187 3104356 3154373 3198151 3233679 3259089
60074 3259089 3273097 3275280 3266188 3247330 3220648 3187609 3148962 3105393 3057882 3007233 2953905 2898763
60062 2898763 2843413 2789371 2737500 2688781 2644863 2607145 2576030 2551990 2536755 2532314 2539159 2556691
60050 2556691 2585100 2625549 2678461 2742777 2817065 2900235 2990684 3085554 3181218 3273891 3359589
60039 3359589 3434369 3495237 3540614 3569820 3582708 3579935 3562917 3533069 3491371 3438738 3376262
60028 3376262 3304782 3224711 3136667 3042058 2942897 2841296 2739255 2638740 2541885 2451098 2368525
$$ packed form
60106D652103n8390p8154r6375j12169j24799j34090j40188j42892j41738j36782
60096C486526j28700j18160j05679r2038p8088o3974m9299l4210j9567n894P131
60085B798048J9787L1562M1606M9296N4144N5744N4169N0017M3778L5528K5410
60074C259089J4008K183r092j8858k6682l3039l8647m3569m7511n0649n3328n5142
60062B898763n5350n4042n1871m8719m3918l7718l1115k4040j5235m441O845J7532
60050B556691K8409M0449N2912O4316P4288Q3170R0449R4870R5664R2673Q5698
60039C359589P4780O0868M5377K9206J2888k773j7018k9848m1698n2633o2476
60028C376262p1480q0071q8044r4609r9161j01601j02041j00515r6855r0787q2573
$$ plain form
60017 2368525 2294942 2229559 2171555 2121654 2081398 2051062 2029270 2014863 2008255 2010538 2021962 2041844
60005 2041844 2069450 2104484 2146975 2197016 2254377 2318144 2386873 2459116 2533433 2607942 2680266
59994 2680266 2748004 2808778 2859975 2899257 2925617 2939446 2941295 2931076 2908605 2874252 2828654
59983 2828654 2772466 2707018 2634978 2559886 2485113 2413372 2346814 2287110 2235485 2192789 2159421
59972 2159421 2135230 2119963 2113886 2117512 2130517 2151361 2178275 2210273 2247004 2288042 2332668 2379994
59960 2379994 2428933 2478236 2526817 2573838 2618297 2658876 2694438 2724414 2748493 2766260 2777444
59949 2777444 2782342 2781671 2776162 2766532 2753825 2739704 2726510 2717032 2713960 2719449 2735229 2762871 2803539
59936 2803539 2857686 2925644 3008609 3108359 3225717 3359769 3508827 3671572 3846708 4031815
$$ packed form
60017B368525p3583o5383n8004m9901m0256l0336k1792j4407o608K283J1424J9882
60005B041844K7606L5034M2491N0041N7361O3767O8729P2243P4317P4509P2324
59994B680266O7738O0774N1197L9282K6360J3829J849j0219k2471l4353m5598
59983B828654n6188o5448p2040p5092p4773p1741o6558n9704n1625m2696l3368
59972B159421k4191j5267o077L626J3005K0844K6914L1998L6731M1038M4626M7326
59960B379994M8939M9303M8581M7021M4459M0579L5562K9976K4079J7767J1184
59949B777444M898o71n509r630j2707j4121j3194r478l072N489J5780K7642M0668
59936B803539N4147O7958Q2965R9750J17358J34052J49058J62745J75136J85107
$$ plain form
59926 4031815 4222847 4414387 4599849 4771730 4922302 5044383 5131657 5178964 5183149 5143966
59916 5143966 5064091 4948313 4802749 4634397 4450710 4259039 4066147 3877930 3699200 3533464
59906 3533464 3382829 3248224 3129986 3028379 2943548 2875093 2822191 2784324 2761527 2753635 2759754
59895 2759754 2778933 2810883 2855332 2910950 2975707 3048082 3126976 3210326 3294614 3375880 3450369
59884 3450369 3513968 3561977 3590180 3595885 3577771 3535481 3469947 3383688 3280289 3163630 3037733
59873 3037733 2906726 2774449 2644036 2517786 2397025 2282156 2173517 2072289 1979934 1896681
59863 1896681 1821465 1753654 1693874 1642625 1599019 1561738 1530527 1505780 1487053 1472928 1462206
59852 1462206 1454388 1449008 1445190 1441964 1438587 1434536 1429586 1423981 1418385 1413718 1411040 1411200 1414314 1419836
$$ packed form
59926D031815J91032J91540J85462J71881J50572J22081Q7274M7307M185l9183
59916E143966p9875j15778j45564j68352j83687j91671j92892j88217j78730j65736
59906C533464j50635j34605j18238j01607q4831o8455n2902l7867k2797p892O119
59895B759754J9179L1950M4449N5618O4757P2375P8894Q3350Q4288Q1266P4489
59884C450369O3599M8009K8203N705j8114m2290o5534q6259j03399j16659j25897
59873C037733j31007j32277j30413j26250j20761j14869j08639j01228r2355q3253
59863A896681p5216o7811n9780n1249m3606l7281l1211k4747j8727j4125j0722
59852A462206p818n380l818l226l377m051m950n605n596m667k678J60L114N522
$$ plain form
59838 1419836 1427273 1436296 1445922 1454226 1459441 1460927 1458573 1451698 1439347 1421462 1399156 1373949 1347223
59825 1347223 1320182 1293714 1268235 1243999 1221430 1200772 1181750 1164078 1148196 1134957 1124733
59814 1124733 1117339 1112801 1111722 1114839 1122554 1134794 1150991 1170343 1192439 1217508 1245662 1276188
59802 1276188 1308068 1340997 1375209 1410263 1444695 1477052 1506890 1534596 1560598 1584889 1606906
59791 1606906 1625534 1639414 1647705 1650914 1651221 1651937 1656384 1666944 1684957 1711047 1744917 1784822 1828018
59778 1828018 1872522 1918628 1968843 2026812 2096281 2180225 2280173 2396338 2528461 2675818 2835775
59767 2835775 3002503 3167234 3319086 3445415 3533004 3571440 3556739 3492050 3385473 3247780
59757 3247780 3091161 2927723 2767413 2616931 2480333 2359944 2256592 2169814 2098551 2041627
$$ packed form
59838A419836P437R023R626Q304N215J486k354o875j2351j7885k2306k5207k6726
59825A347223k7041k6468k5479k4236k2569k0658j9022j7672j5882j3239j0224
59814A124733p394m538j079L117P715J2240J6197J9352K2096K5069K8154L0526
59802A276188L1880L2929L4212L5054L4432L2357K9838K7706K6002K4291K2017
59791A606906J8628J3880Q291L209L07P16M447J0560J8013K6090L3870L9905M3196
59778A828018M4504M6106N0215N7969O9469Q3944R9948J16165J32123J47357J59957
59767B835775J66728J64731J51852J26329Q7589L8436j4701o4689j06577j37693
59757C247780j56619j63438j60310j50482j36598j20389j03352q6778p1263n6924
$$ plain form
59747 2041627 1997588 1964656 1941245 1926357 1919360 1919695 1926945 1940889 1961274 1987844 2020742 2060677
59735 2060677 2108480 2164605 2229107 2301944 2383222 2473320 2572952 2683057 2804563 2938257 3084810
59724 3084810 3244908 3419422 3609395 3815650 4038360 4277260 4532214 4802917 5087573
59715 5087573 5382127 5681128 5979095 6270834 6551139 6815246 7060007 7284631 7490769
59706 7490769 7682403 7865367 8046037 8229913 8421155 8622707 8835841 9059265 9288964
59697 9288964 9518920 9741856 9949711 10134281 10287927 10404046 10477740 10506973 10493204 10440544
59687 10440544 10354478 10241782 10111021 9971904 9833675 9704374 9591199 9500450 9436847 9403656
59677 9403656 9403827 9440490 9516207 9632452 9790167 9990187 10232768 10517127 10841622 11203498
$$ packed form
59747B041627m4039l2932k3411j4888o997L35P250J3944K0385K6570L2898L9935
59735B060677M7803N6125O4502P2837Q1278R0098R9632J10105J21506J33694J46553
59724C084810J60098J74514J89973K06255K22710K38900K54954K70703K84656
59715E087573K94554K99001K97967K91739K80305K64107K44761K24624K06138
59706G490769J91634J82964J80670J83876J91242K01552K13134K23424K29699
59697I288964K29956K22936K07855J84570J53646J16119P3694K9233j3769n2660
59687A0440544q6066j12696j30761j39117j38229j29301j13175r0749o3603l3191
59677I403656J71L6663P5717J16245J57715K00020K42581K84359L24495L61876
$$ plain form
59667 11203498 11597598 12015341 12445039 12872456 13280522 13649148 13956660 14182394 14308899
59658 14308899 14323482 14219792 13999242 13671262 13252222 12763674 12230111 11676017 11122949
59649 11122949 10588009 10084067 9620463 9202924 8832860 8507058 8218217 7955810 7706875
59640 7706875 7457114 7193018 6904755 6588486 6246909 5887982 5522624 5162195 4816398
59631 4816398 4492144 4193477 3922041 3677688 3459252 3265276 3094121 2943497 2810458
59622 2810458 2692334 2587513 2495031 2413718 2342266 2279927 2226486 2181344 2143068 2110063 2081435
59611 2081435 2057008 2036644 2019661 2004880 1991179 1977913 1964575 1950011 1932438 1910601 1884653
59600 1884653 1855491 1823512 1788548 1750896 1711734 1672394 1633686 1596083 1560111 1526252 1494665
$$ packed form
59667A1203498L94100M17743M29698M27417M08066L68626L07512K25734J26505
59658A4308899J4583j03690k20550l27980m19040m88548n33563n54094n53068
59649A1122949n34940n03942m63604m17539l70064l25802k88841k62407k48935
59640G706875k49761k64096k88263l16269l41577l58927l65358l60429l45797
59631D816398l24254k98667k71436k44353k18436j93976j71155j50624j33039
59622B810458j18124j04821r2482q1313p1452o2339n3441m5142l8276l3005k8628
59611B081435k4427k0364j6983j4781j3701j3266j3338j4564j7573k1837k5948
59600A884653k9162l1979l4964l7652l9162l9340l8708l7603l5972l3859l1587
$$ plain form
59589 1494665 1465226 1437830 1412646 1390227 1371242 1355855 1343377 1332796 1323719 1316620 1312232 1310870
59577 1310870 1312256 1315769 1320891 1327606 1336249 1346810 1358618 1370953 1383747 1397334 1411701 1426414
59565 1426414 1441154 1455999 1471285 1487572 1505587 1525844 1548515 1574018 1603355 1637175 1674733
59554 1674733 1714727 1757298 1804443 1858131 1918635 1985121 2057365 2136279 2222964 2317743 2420093
59543 2420093 2529146 2643955 2763350 2885732 3009240 3132131 3252801 3369505 3480467
59534 3480467 3584498 3681116 3769805 3849478 3918794 3976317 4019851 4046400 4054080 4044213 4020952
59523 4020952 3988900 3951659 3912299 3873943 3839348 3810648 3790078 3780616 3785459 3806939 3846019 3902520
59511 3902520 3975450 4062930 4161606 4266141 4369700 4465278 4546344 4606404 4639125 4639957 4607244
$$ packed form
59589A494665k9439k7396k5184k2419j8985j5387j2478j0581r077p099m388j362
59577A310870J386L513N122O715Q643J0561J1808J2335J2794J3587J4367J4713
59565A426414J4740J4845J5286J6287J8015K0257K2671K5503K9337L3820L7558
59554A674733L9994M2571M7145N3688O0504O6486P2244P8914Q6685R4779J02350
59543B420093J09053J14809J19395J22382J23508J22891J20670J16704J10962
59534C480467J04031R6618Q8689P9673O9316N7523M3534K6549P680r867k3261
59523D020952l2052l7241l9360l8356l4595k8700k0570r462M843K1480L9080N6501
59511C902520P2930Q7480R8676J04535J03559R5578Q1066O0060L2721Q32l2713
$$ plain form
59500 4607244 4541103 4441937 4311238 4153354 3974908 3782379 3581453 3378529 3180948 2994693
59490 2994693 2822710 2665961 2525033 2400094 2290404 2195003 2113451 2045246 1989116 1943598
59480 1943598 1907852 1881318 1863139 1852629 1849857 1855067 1867926 1888010 1915700 1951847 1996708 2049763
59468 2049763 2110529 2179033 2255635 2340723 2434307 2535408 2641925 2751423 2861850 2971142
59458 2971142 3076345 3173549 3258622 3327743 3377493 3405032 3408445 3387036 3341575 3274411 3189009
59447 3189009 3088981 2977491 2857466 2731938 2603948 2476419 2352283 2234281 2124165
59438 2124165 2022232 1927911 1840751 1760773 1688172 1622979 1564883 1513260 1467436 1426999 1391787
59427 1391787 1361639 1336351 1315696 1299219 1286204 1276232 1269560 1266442 1266291 1268224 1272224 1278995 1288601
$$ packed form
59500D607244o6141r9166j30699j57884j78446j92529k00926k02924j97581j86255
59490B994693j71983j56749j40928j24939j09690r5401q1552o8205n6130m5518
59480A943598l5746k6534j8179j0510k772N210J2859K0084K7690L6147M4861N3055
59468B049763O0766O8504P6602Q5088R3584J01101J06517J09498J10427J09292
59458B971142J05203R7204Q5073O9121M9750K7539L413k1409m5461o7164q5402
59447C189009j00028j11490j20025j25528j27990j27529j24136j18002j10116
59438B124165j01933r4321q7160p9978p2601o5193n8096n1623m5824m0437l5212
59427A391787l0148k5288k0655j6477j3015r972o672l118j51J933M000O771R606
$$ plain form
59414 1288601 1300181 1313211 1328253 1346190 1367401 1391943 1419801 1450576 1483406 1517270 1550641
59403 1550641 1580874 1605220 1623162 1637125 1650546 1666111 1686203 1713646 1750641 1797259 1851663
59392 1851663 1911264 1973032 2033592 2090445 2143362 2194226 2245881 2301417 2363739 2434681 2514675
59381 2514675 2603905 2703520 2815122 2939421 3076173 3225282 3387405 3563735 3755811 3965308
59371 3965308 4193411 4440410 4706066 4989787 5289807 5602529 5923073 6246022 6565230
59362 6565230 6873828 7165632 7436481 7683746 7905297 8100056 8269144 8415132 8539885
59353 8539885 8643807 8726989 8789856 8832272 8852689 8848660 8817875 8758564 8669320 8548867 8396291
59342 8396291 8212091 7999377 7763549 7510122 7243110 6965895 6683018 6400005 6121545
$$ packed form
59414A288601J1580J3030J5042J7937K1211K4542K7858L0775L2830L3864L3371
59403A550641L0233K4346J7942J3963J3421J5565K0092K7443L6995M6618N4404
59392A851663N9601O1768O0560N6853N2917N0864N1655N5536O2322P0942P9994
59381B514675Q9230R9615J11602J24299J36752J49109J62123J76330J92076K09497
59371C965308K28103K46999K65656K83721L00020L12722L20544L22949L19208
59362F565230L08598K91804K70849K47265K21551J94759J69088J45988J24753
59353H539885J03922Q3182O2867M2416K0417m029l0785n9311q9244j20453j52576
59342H396291j84200k12714k35828k53427k67012k77215k82877k83013k78460
$$ plain form
59333 6121545 5850661 5589619 5340719 5105940 4886425 4682517 4493955 4320109 4160538
59324 4160538 4015315 3884423 3767097 3662332 3569798 3489455 3420355 3360727 3309379 3266299
59314 3266299 3231552 3204185 3182567 3165333 3151592 3140523 3131092 3122155 3112658 3101748 3088648 3072398
59302 3072398 3051934 3026592 2996305 2961115 2920821 2875373 2825316 2771535 2714930 2656664 2598286
59291 2598286 2541050 2485341 2431232 2379307 2330491 2285435 2244660 2209038 2179530 2156637 2140546
59280 2140546 2131531 2129723 2134825 2146586 2165211 2190760 2222542 2259780 2302463 2350694 2403461 2458711
59268 2458711 2514333 2568285 2618168 2661559 2696574 2721334 2733292 2730226 2711869 2679770 2635817
59257 2635817 2581943 2520918 2455965 2389213 2321521 2254044 2189006 2128838 2075563 2031131 1997049
$$ packed form
59333F121545k70884k61042k48900k34779k19515k03908j88562j73846j59571
59324D160538j45223j30892j17326j04765r2534q0343o9100n9628n1348m3080
59314C266299l4747k7367k1618j7234j3741j1069r431q937r497j0910j3100j6250
59302C072398k0464k5342l0287l5190m0294m5448n0057n3781n6605n8266n8378
59291B598286n7236n5709n4109n1925m8816m5056m0775l5622k9508k2893j6091
59280B140546r015j808N102J1761J8625K5549L1782L7238M2683M8231N2767N5250
59268B458711N5622N3952M9883M3391L5015K4760J1958l066j8357l2099m3953
59257B635817n3874o1025o4953o6752o7692o7477o5038o0168n3275m4432l4082
$$ plain form
59246 1997049 1973180 1957943 1950445 1951695 1963271 1985489 2017193 2056122 2098529 2139163 2172886 2196785
59234 2196785 2210907 2217765 2221667 2227848 2241071 2264519 2299699 2346873 2405422 2474423 2553536 2643367
59222 2643367 2744884 2858827 2985746 3126170 3280471 3448927 3632025 3830202 4043007
59213 4043007 4268754 4504992 4748591 4994886 5237139 5467350 5677570 5860452 6009189
59204 6009189 6117796 6181914 6199402 6170283 6096290 5980672 5828644 5647777 5447088 5234998
59194 5234998 5018089 4801659 4590554 4388601 4197777 4018829 3852479 3699191 3558197
59185 3558197 3428047 3308156 3198724 3099043 3007129 2921530 2842490 2770756 2706091 2647624 2594979
59174 2594979 2548341 2507766 2472988 2443628 2419193 2399090 2382934 2370570 2361651 2355519 2351688 2350158
$$ packed form
59246A997049k3869j5237p498J250J1576K2218L1704L8929M2407M0634L3723K3899
59234B196785J4122O858L902O181J3223K3448L5180M7174N8549O9001P9113Q9831
59222B643367J01517J13943J26919J40424J54301J68456J83098J98177K12805
59213D043007K25747K36238K43599K46295K42253K30211K10220J82882J48737
59204F009189J08607O4118J7488k9119p3993j15618j52028j80867k00689k12090
59194E234998k16909k16430k11105k01953j90824j78948j66350j53288j40994
59185C558197j30150j19891j09432r9681r1914q5599p9040p1734o4665n8467n2645
59174B594979m6638m0575l4778k9360k4435k0103j6156j2364q919o132l831j530
$$ plain form
59162 2350158 2351195 2355110 2362166 2372167 2384269 2397770 2412934 2430226 2448782 2466595 2482387 2496269
59150 2496269 2508261 2517180 2521598 2520964 2515094 2503233 2484494 2458856 2427138 2390332 2349442 2305584
59138 2305584 2259653 2212098 2163367 2114285 2065679 2017987 1971522 1926790 1884323 1844550 1808065
59127 1808065 1775570 1747438 1723869 1705655 1694040 1689398 1690646 1696467 1706601 1721540 1741480 1766098
59115 1766098 1794843 1826853 1860993 1896632 1934189 1974405 2017191 2061519 2106197 2150384 2193572
59104 2193572 2235465 2275865 2314629 2352007 2389139 2427877 2469903 2516167 2566994 2622053 2679964
59093 2679964 2738283 2793966 2843377 2881905 2904406 2906550 2885690 2840773 2772385 2683137 2577157
59082 2577157 2458797 2332217 2202037 2073144 1949272 1832446 1724062 1625401 1536609 1456283
$$ packed form
59162B350158J037L915P056J0001J2102J3501J5164J7292J8556J7813J5792J3882
59150B496269J1992Q919M418o34n870j1861j8739k5638l1718l6806m0890m3858
59138B305584m5931m7555m8731m9082m8606m7692m6465m4732m2467l9773l6485
59127A808065l2495k8132k3569j8214j1615m642J248N821J0134J4939J9940K4618
59115A766098K8745L2010L4140L5639L7557M0216M2786M4328M4678M4187M3188
59104B193572M1893M0400L8764L7378L7132L8738M2026M6264N0827N5059N7911
59093B679964N8319N5683M9411L8528K2501K144k0860m4917o8388q9248j05980
59082B577157j18360j26580j30180j28893j23872j16826j08384r8661q8792q0326
$$ plain form
59072 1456283 1383034 1316736 1257529 1204496 1156360 1112893 1074528 1040955 1011056 984031 959727
59061 959727 938019 918614 901417 886521 873882 863384 854986 848464 843386 839693 837848 837929 839046
59048 839046 840122 840792 841095 840956 840681 841362 844007 848650 855066 863902 876269 892555 912429 935712
59034 935712 962355 991765 1022865 1054578 1085529 1113546 1136473 1153587 1165771 1174469 1181066 1186866
59022 1186866 1192702 1198443 1203408 1207138 1209197 1208670 1204876 1198592 1191737 1185763 1181028 1177623 1175890 1175900 1177228
59007 1177228 1179688 1183690 1189550 1196802 1204405 1211212 1216079 1217895 1215794 1209141 1197294 1179728 1156573
58994 1156573 1128842 1098102 1066047 1034233 1003791 975199 948490 923744 901364 882014 866321
58983 866321 854400 845544 838641 833101 829146 827122 827025 828954 833416 840641 849971 860564 872526 886810
$$ packed form
59072A456283p3249o6298n9207n3033m8136m3467l8365l3573k9899k7025k4304
59061I59727k1708j9405j7197j4896j2639j0498q398o522n078l693j845Q1J117
59048H39046J076O70L03j39k75O81K645M643O416Q836J2367J6286J9874K3283
59034I35712K6643K9410L1100L1713L0951K8017K2927J7114J2184Q698O597N800
59022A186866N836N741M965L730K059n27l794o284o855n974m735l405j733J0J328
59007A177228K460M002N860P252P603O807M867J816k101o653j1847j7566k3155
58994A156573k7731l0740l2055l1814l0442k8592k6709k4746k2380j9350j5693
58983H66321j1921q856o903n540l955k024r7J929M462P225R330J0593J1962J4284
$$ plain form
58969 886810 904103 924204 946323 969481 992647 1014882 1035433 1053646 1069038 1081566 1091494 1098803
58957 1098803 1103229 1105145 1105910 1106985 1109187 1113154 1119840 1129878 1142957 1158504 1176532 1197065 1219193
58944 1219193 1241590 1263736 1285807 1307507 1327987 1346955 1365191 1383837 1403798 1425890 1450847
58933 1450847 1478842 1509263 1541123 1573526 1605949 1638517 1672158 1708287 1748365 1793745 1845499
58922 1845499 1904096 1969538 2042124 2122812 2212578 2311853 2420917 2540412 2671102 2813622
58912 2813622 2968902 3138360 3323199 3523990 3741393 3976567 4230053 4500674 4786198
58903 4786198 5084595 5393730 5710053 6028289 6342046 6643868 6924961 7175750 7386863
58894 7386863 7549408 7655266 7698637 7677696 7594354 7452733 7258586 7019828 6746405 6449059
$$ packed form
58969H86810J7293K0101K2119K3158K3166K2235K0551J8213J5392J2528R928P309
58957A098803M426J916P65J075K202L967O686J0038J3079J5547J8028K0533K2128
58944A219193K2397K2146K2071K1700K0480J8968J8236J8646J9961K2092K4957
58933A450847K7995L0421L1860L2403L2423L2568L3641L6129M0078M5380N1754
58922A845499N8597O5442P2586Q0688Q9766R9275J09064J19495J30690J42520
58912B813622J55280J69458J84839K00791K17403K35174K53486K70621K85524
58903D786198K98397L09135L16323L18236L13757L01822K81093K50789K11113
58894G386863J62545J05858M3371k0941q3342j41621j94147k38758k73423k97346
$$ plain form
58884 6449059 6138208 5823311 5512222 5210776 4923138 4652106 4398723 4162330 3941957
58875 3941957 3737398 3548371 3373356 3210406 3058687 2918156 2788033 2666827 2553765
58866 2553765 2449092 2352958 2264976 2184727 2111579 2044022 1980323 1920021 1863755 1811407 1761427
58855 1761427 1712313 1664023 1617710 1574805 1536473 1503130 1474239 1449120 1427920 1411114 1398242
58844 1398242 1388084 1380080 1374665 1372164 1372262 1374571 1378807 1384363 1390739 1398567 1409244 1423340 1440287
58831 1440287 1459694 1482021 1507782 1537227 1571078 1610429 1655422 1704963 1758291 1816010 1879154
58820 1879154 1948158 2023314 2105407 2195181 2292696 2397801 2510819 2632469 2763665 2905726
58810 2905726 3060144 3227720 3408375 3602088 3809566 4031850 4269820 4524111 4794571
$$ packed form
58884F449059l10851l14897l11089l01446k87638k71032k53383k36393k20373
58875C941957k04559j89027j75015j62950j51719j40531j30123j21206j13062
58866B553765j04673r6134q7982q0249p3148o7557o3699o0302n6266n2348m9980
58855A761427m9114m8290m6313m2905l8332l3343k8891k5119k1200j6806j2872
58844A398242j0158q004n415k501R8K309M236N556O376P828J0677J4096J6947
58831A440287J9407K2327K5761K9445L3851L9351M4993M9541N3328N7719O3144
58820A879154O9004P5156Q2093Q9774R7515J05105J13018J21650J31196J42061
58810B905726J54418J67576J80655J93713K07478K22284K37970K54291K70460
$$ plain form
58801 4794571 5079280 5374583 5676180 5979350 6277739 6562714 6824440 7053231 7239852
58792 7239852 7375748 7454135 7470962 7424862 7316982 7151449 6935541 6678691 6391144 6083123
58782 6083123 5764170 5442444 5124580 4816158 4521736 4244267 3985026 3744362 3522187
58773 3522187 3317787 3129864 2957089 2798334 2652397 2518101 2394713 2281725 2178246
58764 2178246 2083202 1996061 1916649 1844257 1777756 1716680 1661372 1611994 1568204 1529902 1497378
58753 1497378 1470487 1448499 1431018 1418214 1410001 1405827 1405523 1409439 1417480 1428954 1443760 1462819
58741 1462819 1486849 1515378 1547265 1581320 1615890 1648420 1675806 1694819 1702494 1697314 1680466 1655126
58729 1655126 1624299 1590072 1554602 1520059 1486869 1453386 1418165 1381595 1344566 1306677 1266792
$$ packed form
58801D794571K84709K95303L01597L03170K98389K84975K61726K28791J86621
58792G239852J35896P8387J6827m6100j07880j65533k15908k56850k87547l08021
58782F083123l18953l21726l17864l08422k94422k77469k59241k40664k22175
58773C522187k04400j87923j72775j58755j45937j34296j23388j12988j03479
58764B178246r5044q7141p9412p2392o6501o1076n5308m9378m3790l8302l2524
58753A497378k6891k1988j7481j2804q213m174l04L916Q041J1474J4806J9059
58741A462819K4030K8529L1887L4055L4570L2530K7386J9013P675n180j6848k5340
58729A655126l0827l4227l5470l4543l3190l3483l5221l6570l7029l7889l9885
$$ plain form
58718 1266792 1224576 1180552 1135280 1089397 1043907 999676 957021 916338 878511 844084 812678
58707 812678 783877 758082 735908 717265 701615 688551 677535 667698 658533 650271 643015 636115
58695 636115 628991 621928 615362 608865 601562 593244 584516 576154 568711 562443 557262 553073 550270 549413
58681 549413 550400 552676 556294 561868 569370 578072 587918 599715 613414 627463 640674 653661 667569
58668 667569 682257 696587 709682 720945 729618 735346 738685 740299 740091 737697 733199 726773 718279
58655 718279 707767 695674 682042 666367 648728 630162 611438 592623 574464 558798 546556
58644 546556 536557 527545 520244 516013 514457 514045 514451 516659 521030 526703 532841 539321 546321 554169 563404
58629 563404 574080 585302 596285 607518 620021 633981 649108 665848 685077 706862 730666
$$ packed form
58718A266792m2216m4024m5272m5883m5490m4231m2655m0683l7827l4427l1406
58707H12678k8801k5795k2174j8643j5650j3064j1016r837r165q262p256o900
58695F36115p124p063o566o497p303q318q728q362p443o268n181m189k803q57
58681E49413R87K276L618N574P502Q702R846J1797J3699J4049J3211J2987J3908
58668F67569J4688J4330J3095J1263Q673N728L339J614k08k394m498o426q494
58655G18279j0512j2093j3632j5675j7639j8566j8724j8815j8159j5666j2242
58644E46556r999r012p301m231j556m12M06K208M371N673O138O480P000P848R235
58629E63404J0676J1222J0983J1233J2503J3960J5127J6740J9229K1785K3804
$$ plain form
58618 730666 756621 785696 818686 855871 897467 943590 993909 1048060 1106262 1168983 1236345
58607 1236345 1308481 1385952 1469067 1557119 1648839 1742992 1837730 1929882 2015720 2091978 2155511
58596 2155511 2202741 2230589 2237696 2224224 2191153 2140656 2076386 2002245 1921295 1836560 1751941
58585 1751941 1671076 1595814 1527003 1466179 1415151 1374286 1342513 1318793 1302533 1292888 1288811 1289618
58573 1289618 1294579 1302333 1311756 1322980 1336564 1352224 1369620 1389902 1415024 1445663 1481043 1520418
58561 1520418 1563064 1606507 1645844 1675120 1688818 1682631 1654460 1605309 1538710 1459293 1372238
58550 1372238 1283229 1197316 1117432 1044557 979022 920924 869744 824688 785342 751324 721785
58539 721785 696077 674411 656838 642085 628510 615782 604521 594785 586099 578537 572522 567795
$$ packed form
58618G30666K5955K9075L2990L7185M1596M6123N0319N4151N8202O2721O7362
58607A236345P2136P7471Q3115Q8052R1720R4153R4738R2152Q5838P6258O3533
58596B155511M7230K7848P107j3472l3071n0497o4270p4141q0950q4735q4619
58585A751941q0865p5262o8811o0824n1028m0865l1773k3720j6260r645m077Q07
58573A289618M961P754R423J1224J3584J5660J7396K0282K5122L0639L5380L9375
58561A520418M2646M3443L9337K9276J3698o187k8171m9151o6599p9417q7055
58550A372238q9009q5913p9884p2875o5535n8098n1180m5056l9346l4018k9539
58539G21785k5708k1666j7573j4753j3575j2728j1261r736q686p562o015m727
$$ plain form
58527 567795 563759 560494 558252 556323 553692 550555 547946 546073 544193 541906 539444 536993 534848 533819
58513 533819 534302 535356 535959 536584 538226 540488 542376 544437 548227 553795 559592 564980 571032 578644 587477
58498 587477 597209 608364 621507 636820 654801 676226 701228 729370 760668 795400 832916 871643
58486 871643 910086 946684 979044 1004792 1023188 1034770 1039709 1037806 1029628 1015876 995883 968528
58474 968528 934689 897140 858066 818418 779650 743961 712269 683680 657554 634621 615544
58463 615544 599825 586681 575860 567203 560482 555828 553220 551620 549882 548384 548329 549624 551099 552650
58449 552650 555209 558531 561063 562482 564392 567881 572119 576070 580023 584660 590011 595986 602824 610524
58435 610524 618958 628706 640455 653365 665386 675344 683351 689153 691787 691058 687720 682005 673644 663479
$$ packed form
58527E67795m036l265k242j929k631l137k609j873j880k287k462k451k145j029
58513E33819M83J054O03O25J642K262J888K061L790N568N797N388O052P612Q833
58498E87477R732J1155J3143J5313J7981K1425K5002K8142L1298L4732L7516L8727
58486H71643L8443L6598L2360K5748J8396J1582M939j903q178j3752j9993k7355
58474I68528l3839l7549l9074l9648l8768l5689l1692k8589k6126k2933j9077
58463F15544j5719j3144j0821q657o721m654k608j600j738j498n5J295J475J551
58449E52650K559L322K532J419J910L489M238L951L953M637N351N975O838P700
58435F10524Q434R748J1749J2910J2021R958Q007N802K634p29l338n715q361j0165
$$ plain form
58421 663479 653280 643690 634154 625060 617990 613522 610722 609235 609852 612515 615894 619654 625227 633533
58407 633533 643800 655324 668502 683264 698276 712562 726275 739117 749676 757006 761204 761909
58395 761909 758194 750691 741863 733382 725036 716786 709666 703748 697485 690352 684105 680174 677697 675437
58381 675437 673793 673518 674147 675144 677191 680924 685641 690339 694793 698730 701378 702736 703923 705517 707044
58366 707044 708721 711923 717108 722959 728375 733654 739173 744883 751735 761408 773711 786357 798239
58353 798239 810697 824608 838667 851894 865562 881088 897866 914491 930239 944159 954763
58342 954763 961919 967191 971194 972636 970979 967819 964553 961025 957608 956072 957043 959044 961517 966204
58328 966204 974037 983244 992234 1001787 1012680 1023747 1034228 1045638 1059347 1074580 1090567 1108242
$$ packed form
58421F63479j0199r590r536r094p070m468k800j487O17K663L379L760N573Q306
58407F33533J0267J1524J3178J4762J5012J4286J3713J2842J0559P330M198P05
58395G61909l715p503q828q481q346q250p120n918o263p133o247l931k477k260
58381F75437j644k75O29R97K047L733M717M698M454L937K648J358J187J594J527
58366G07044J677L202N185N851N416N279N519N710O852R673J2303J2646J1882
58353G98239J2458J3911J4059J3227J3668J5526J6778J6625J5748J3920J0604
58342I54763P156N272M003J442j657l160l266l528l417j536R71K001K473M687
58328I66204P833R207Q990R553J0893J1067J0481J1410J3709J5233J5987J7675
$$ plain form
58316 1108242 1128070 1148690 1169561 1192379 1217971 1244317 1269467 1293756 1317258 1337997 1354829
58305 1354829 1369282 1382305 1392155 1397848 1401857 1406851 1412546 1418178 1425190 1434847 1445962 1457554 1470988
58292 1470988 1487076 1504107 1521244 1540630 1563535 1587857 1612305 1639485 1671686 1707189 1744130
58281 1744130 1784406 1830128 1879801 1931901 1988774 2052907 2122722 2196224 2275406 2362505 2454907
58270 2454907 2547955 2639572 2727702 2806586 2870547 2918881 2952886 2971441 2974257 2966163 2953233 2937677
58258 2937677 2921055 2908783 2906096 2912776 2926921 2950349 2985105 3028474 3077152 3132662 3197095 3267606
58246 3267606 3341169 3420552 3509156 3604272 3702253 3805971 3919789 4041403 4166336 4296380
58236 4296380 4435788 4583359 4736534 4899005 5075700 5264407 5461110 5669184 5894262
$$ packed form
58316A108242J9828K0620K0871K2818K5592K6346K5150K4289K3502K0739J6832
58305A354829J4453J3023R850N693M009M994N695N632P012R657J1115J1592J3434
58292A470988J6088J7031J7137J9386K2905K4322K4448K7180L2201L5503L6941
58281A744130M0276M5722M9673N2100N6873O4133O9815P3502P9182Q7099R2402
58270B454907R3048R1617Q8130P8884O3961M8334L4005J8555K816q094j2930j5556
58258B937677j6622j2272k687O680J4145K3428L4756M3369M8678N5510O4433P0511
58246C267606P3563P9383Q8604R5116R7981J03718J13818J21614J24933J30044
58236D296380J39408J47571J53175J62471J76695J88707J96703K08074K25078
$$ plain form
58227 5894262 6134895 6387995 6658531 6953488 7271364 7608659 7971591 8369792 8803837
58218 8803837 9271434 9780533 10343290 10962940 11640768 12390328 13230261 14169884 15218362
58209 15218362 16402384 17759410 19323224 21135811 23263403 25776319 28719048 32122678
58201 32122678 36037937 40533132 45677806 51568414 58365886 66277847 75524598 86375782
58193 86375782 99213269 114504415 132725410 154377359 180042951 210244273 245040889
58186 245040889 283580764 323751005 361926752 393078520 411788023 414179992 399668152
58179 399668152 371173037 333675404 292304327 251151662 212974210 179296537 150620670
58172 150620670 126748187 107143788 91167334 78160874 67516501 58748680 51493492
$$ packed form
58227E894262K40633K53100K70536K94957L17876L37295L62932L98201M34045
58218H803837M67597N09099N62757O19650O77828P49560Q39933R39623J048478
58209A5218362J184022J357026J563814J812587K127592K512916K942729L403630
58201C2122678L915259M495195N144674N890608O797472P911961R246751J0851184
58193H6375782J2837487J5291146J8220995K1651949K5665592L0201322L4796616
58186B45040889L8539875M0170241L8175747L1151768J8709503K391969j4511840
58179C99668152k8495115l7497633m1371077m1152665l8177452l3677673k8675867
58172A50620670k3872483j9604399j5976454j3006460j0644373q767821p255188
$$ plain form
58165 51493492 45450238 40362948 36045642 32371962 29229197 26510356 24143577 22088869
58157 22088869 20301744 18729598 17341787 16130189 15077755 14155038 13347887 12659202
58149 12659202 12081375 11594301 11191633 10881049 10656328 10496298 10393977 10360153 10396439 10493464
58139 10493464 10659711 10924008 11305267 11808960 12458595 13300070 14368857 15686893 17302640
58130 17302640 19301507 21767849 24778852 28455476 32972493 38469017 44938746 52160843
58122 52160843 59608627 66340141 71088755 72717828 70798099 65824312 58893069 51163779
58114 51163779 43519378 36515551 30443880 25385616 21272352 17969070 15334405 13235238
58106 13235238 11549532 10180492 9062911 8149838 7400221 6781345 6271402 5851394 5498861
$$ packed form
58165E1493492o043254n087290m317306l673680l142765k718841k366779k054708
58157B2088869j787125j572146j387811j211598j052434r22717q07151o88685
58149A2659202n77827m87074m02668l10584k24721j60030j02321l3824L6286R7025
58139A0493464J66247K64297L81259N03693O49635Q41475J068787J318036J615747
58130A7302640J998867K466342L011003L676624M517017N496524O469729P222097
58122E2160843P447784O731514M748614J629073j919729m973787o931243p729290
58114E1163779p644401p003827o071671n058264m113264l303282k634665k099167
58106A3235238j685706j369040j117581r13073p49617o18876n09943m20008l52533
$$ plain form
58097 5498861 5193185 4921656 4676225 4448350 4230664 4020422 3817849 3623074 3436819
58088 3436819 3261626 3099871 2952015 2818152 2698892 2592490 2492693 2391834 2285517 2173328
58078 2173328 2056817 1938955 1824410 1717655 1620421 1532212 1452815 1382688 1321159 1266149
58068 1266149 1216064 1170651 1129691 1092203 1057430 1025534 996743 970647 946753 924860 904437
58057 904437 884485 864534 845010 826224 807824 789654 772213 755711 739591 723629 708562
58046 708562 694909 682079 669449 657393 646363 635875 625471 615826 607720 600607 593390 586011
58034 586011 579050 572331 565253 558089 551604 545624 539173 531815 523800 515211 506155 497472 490051 483647
58020 483647 477466 471628 466833 462878 458815 454452 450516 447499 445536 445127 446684 449525 452711 456717
$$ packed form
58097E498861l05676k71529k45431k27875k17686k10242k02573j94775j86255
58088C436819j75193j61755j47856j33863j19260j06402r9797j00859j06317j12189
58078B173328j16511j17862j14545j06755r7234q8209p9397p0127o1529n5010
58068A266149n0085m5413m0960l7488l4773l1896k8791k6096k3894k1893k0423
58057I04437j9952j9951j9524j8786j8400j8170j7441j6502j6120j5962j5067
58046G08562j3653j2830j2630j2056j1030j0488j0404r645q106p113p217p379
58034E86011o961o719p078p164o485n980o451p358q015q589r056q683p421o404
58020D83647o181n838m795l955m063m363l936l017j963m09J557K841L186M006
$$ plain form
58006 456717 462843 471126 480424 490609 503009 518347 535690 553912 572765 591971 610447 626964
57994 626964 640588 650051 653850 651505 643862 631790 615500 595464 573016 549589 526115 503406
57982 503406 482279 463029 445543 429988 416555 404594 393166 382550 374044 368054 363506 359358
57970 359358 355542 352184 349172 346954 346571 348318 351331 354876 359041 363806 368545 372913 377182 381187
57956 381187 383942 384757 383695 380533 374424 365283 354538 343864 334027 325331 318077 311924 305866 299569
57942 299569 293895 289584 286469 284523 284495 286720 290405 295036 301426 310282 320743 331526 342734 355142
57928 355142 368219 380155 389693 396877 402166 405871 408440 410461 412136 413203 413322 412198 409526 405255
57914 405255 399722 393202 385576 376662 366530 355273 342924 329926 317127 305072 293773 283441
$$ packed form
58006D56717O126Q283R298J0185J2400J5338J7343J8222J8853J9206J8476J6517
57994F26964J3624R463L799k345p643j2072j6290k0036k2448k3427k3474k2709
57982E03406k1127j9250j7486j5555j3433j1961j1428j0616q506n990m548m148
57970C59358l816l358l012k218l83J747L013L545M165M765M739M368M269M005
57956C81187K755Q15j062l162o109r141j0745j0674r837q696p254o153o058o297
57942B99569n674m311l115j946k8K225L685M631O390Q856J0461J0783J1208J2408
57928C55142J3077J1936R538P184N289L705K569K021J675J067J19j124k672m271
57914D05255n533o520p626q914j0132j1257j2349j2998j2799j2055j1299j0332
$$ plain form
57902 283441 274713 267695 261515 255402 249567 244336 239104 232985 226164 219787 214716 211041 208570 207135
57888 207135 206509 206567 207496 209511 212547 216630 222227 229712 238569 247571 255783 263097 269801 275848 280654
57873 280654 283690 285237 286275 287319 287621 285998 282207 276912 270612 263502 256313 250139 245136 240352
57859 240352 235269 230707 227693 226172 225373 224864 224848 225974 229219 235258 243491 252290 260674 269162 278650
57844 278650 289129 299935 310529 320491 329317 336730 342747 347151 349572 350312 350205 349182 345982 339922
57830 339922 332081 323976 315882 307359 298646 290489 283076 276145 269782 264285 259561 255484 252524 251248
57816 251248 251448 252448 253969 256026 258263 260066 261072 261078 259780 257201 253916 250293 245949 240556 234667
57801 234667 228974 223282 217035 210484 204418 199089 194304 190387 188108 187677 188540 190182 192512 195575 199449
$$ packed form
57902B83441q728p018o180o113n835n231n232o119o821o377n071l675k471j435
57888B07135o26N8R29K015L036M083N597P485Q857R002Q212P314O704O047M806
57873B80654L036J547J038J044L02j623l791n295o300p110p189o174n003m784
57859B40352n083m562l014j521p99n09j6J126L245O039Q233Q799Q384Q488R488
57844B78650J0479J0806J0594R962Q826P413O017M404K421P40j07j023l200o060
57830C39922p841q105q094q523q713q157p413o931o363n497m724m077k960j276
57816B51248K00J000J521K057K237J803J006Oj298k579l285l623m344n393n889
57801B34667n693n692o247o551o066n329m785l917k279m31Q63J642K330L063L874
$$ plain form
57786 199449 204251 209691 214871 219165 223099 227696 233108 238575 243532 248079 252428 256544 260464 264560
57772 264560 269469 275924 284287 293911 303354 311674 319140 326285 332857 338317 342718 346211 348113 347386
57758 347386 343866 338283 331310 323367 314998 306627 298063 288984 279651 270505 261503 252661 244810 238735
57744 238735 233867 228981 224098 220504 218915 218705 219072 219856 220970 222068 223151 224606 226265 227266 227306
57729 227306 227330 228508 231057 234442 238148 241900 245543 249144 252977 257223 261953 267404 273888 281349 289389
57714 289389 297690 306021 313972 321263 328302 335873 344280 353343 363144 374043 385922 398233 411076
57701 411076 425681 443624 466077 493846 527356 566135 608783 653897 700678 748225 794285
57690 794285 834917 865575 883088 887380 881487 869760 856002 843214 834243 831640 836965 851001
$$ packed form
57786A99449M802N440N180M294L934M597N412N467M957M547M349M116L920M096
57772B64560M909O455Q363R624R443Q320P466P145O572N460M401L493J902p27
57758C47386l520n583o973p943q369q371q564r079r333r146r002q842p851o075
57744B38735m868m886m883l594j589k10L67P84J114J098J083J455J659J001M0
57729B27306K4J178K549L385L706L752L643L601L833M246M730N451O484P461Q040
57714B89389Q301Q331P951P291P039P571Q407R063R801J0899J1879J2311J2843
57701D11076J4605J7943K2453K7769L3510L8779M2648M5114M6781M7547M6060
57690G94285M0632L0658J7513M292n893j1727j3758j2788q971k603N325J4036
$$ plain form
57678 851001 874749 909550 956234 1014798 1085038 1167028 1260986 1367233 1486312 1618477 1762957
57667 1762957 1918064 2081852 2252015 2425088 2595961 2757361 2898388 3003661 3055974 3042208
57657 3042208 2958611 2812381 2619676 2401309 2177231 1962054 1764064 1587214 1432956 1300522
57647 1300522 1187311 1090339 1007301 936240 875179 822574 777592 739553 707628 681271 660177
57636 660177 643515 629929 618756 610498 605688 603924 604512 607393 612867 620900 631208 643589 657817
57623 657817 673803 692248 714501 741227 771759 805253 841906 882543 927631 977426 1032553
57612 1032553 1093552 1160021 1230883 1305267 1382518 1461252 1538873 1611920 1676633 1729298 1766464
57601 1766464 1785031 1782513 1757961 1712943 1651243 1577291 1495082 1408214 1319823 1231919 1145542
$$ packed form
57678H51001K3748L4801M6684N8564P0240Q1990R3958J06247J19079J32165J44480
57667A762957J55107J63788J70163J73073J70873J61400J41027J05273N2313j3766
57657C042208q3597j46230j92705k18367k24078k15177j97990j76850j54258j32434
57647A300522j13211r6972q3038p1061o1061n2605m4982l8039l1925k6357k1094
57636F60177j6662j3586j1173q258m810j764N88K881N474Q033J0308J2381J4228
57623F57817J5986J8445K2253K6726L0532L3494L6653M0637M5088M9795N5127
57612A032553O0999O6469P0862P4384P7251P8734P7621P3047O4713N2665L7166
57601A766464J8567k518k4552m5018o1700p3952q2209q6868q8391q7904q6377
$$ plain form
57590 1145542 1062133 984008 912770 847931 788046 732789 683043 639251 600635 566055 534795
57579 534795 506406 480395 456387 434319 414412 397047 382475 370317 359538 349225 339208
57568 339208 329688 320613 311856 303676 296500 290329 284851 280037 276220 273589 271881 270534 268938 266765
57554 266765 264317 262420 261745 262387 264170 266989 270670 274935 279779 285475 291863 298124 303721 309048 314648
57539 314648 320257 325329 330139 335645 342421 350397 359460 369583 380435 391638 403554 417247 433522
57526 433522 452418 473710 497414 523670 552614 584603 620327 660576 706026 757098 813553
57515 813553 874212 937491 1002370 1068441 1134744 1198705 1256392 1303673 1337195 1354633 1354670 1337129
57503 1337129 1303261 1255776 1198356 1134864 1068712 1002484 937813 875662 816972 762908 714149
$$ packed form
57590A145542q3409p8125p1238o4839n9885n5257m9746m3792l8616l4580l1260
57579E34795k8389k6011k4008k2068j9907j7365j4572j2158j0779j0313j0017
57568C39208r520r075q757q180p176o171n478m814l817k631j708j347j596k173
57554B66765k448j897o75O42J783K819L681M265M844N696O388O261N597N327N600
57539C14648N609N072M810N506O776P976R063J0123J0852J1203J1916J3693J6275
57526D33522J8896K1292K3704K6256K8944L1989L5724M0249M5450N1072N6455
57515H13553O0659O3279O4879O6071O6303O3961N7687M7281L3522J7438L7j7541
57503A337129l3868m7485n7420o3492o6152o6228o4671o2151n8690n4064m8759
$$ plain form
57492 714149 670175 629833 592709 559449 530720 506402 485921 468713 454151 441584 430827
57481 430827 422135 415494 410432 406766 404774 404232 403982 403144 402236 402534 404835 409428 416636 426526 438449
57466 438449 451792 467024 485326 507341 532991 562319 595718 633334 674906 720289 769646
57455 769646 823105 880538 941433 1004391 1066873 1125864 1178703 1222919 1255750 1274585 1277801 1264702
57443 1264702 1235049 1189630 1131252 1064286 992962 920447 849187 781057 716899 656697 600601
57432 600601 549346 503487 462749 426351 393592 363992 337350 313869 293864 277146 262896
57421 262896 250148 238100 226101 213935 202224 192027 183777 176844 170257 163536 156839 150704 145737
57408 145737 142253 139991 138353 136911 135550 134263 133100 132239 131790 131571 131286 130826 130226 129632 129509 130449
$$ packed form
57492G14149m3974m0342l7124l3260k8729k4318k0481j7208j4562j2567j0757
57481D30827q692o641n062l666j992n42k50q38r08K98K301M593P208R890J1923
57466D38449J3343J5232J8302K2015K5650K9328L3399L7616M1572M5383M9357
57455G69646N3459N7433O0895O2958O2482N8991N2839M4216L2831J8835L216j3099
57443A264702k9653m5419n8378o6966p1324p2515p1260o8130o4158o0202n6096
57432F00601n1255m5859m0738l6398l2759k9600k6642k3481k0005j6718j4250
57421B62896j2748j2048j1999j2166j1711j0197q250o933o587o721o697o135m967
57408A45737l484k262j638j442j361j287j163q61m49k19k85m60o00n94j23R40
$$ plain form
57392 130449 132371 134309 135521 136470 138102 140478 142791 144521 145839 146999 148026 148989 149984 150841 151322
57377 151322 151470 151314 150527 149007 147435 146456 145564 143721 140908 138123 135864 133646 131100 128551 126235
57362 126235 123783 120818 117377 113630 109860 106752 104867 103690 102080 99832 97855 96613 95440 93812
57348 93812 92287 91601 91698 92232 93257 94683 95737 95725 94946 94285 94246 94816 95830 97003 97934 98496 98958 99559
57330 99559 100378 101703 103919 106810 109642 112133 114703 117542 120280 122879 125940 129622 133110 135779 138132
57315 138132 140938 144135 147305 150520 153956 157237 159965 162425 165032 167585 169833 172261 175492 179278
57301 179278 182933 186387 189994 193523 196222 197832 198975 200638 203740 208789 215298 221843 227351 232172
57287 232172 237374 243370 249848 256487 262900 268228 271833 274258 276638 279188 281107 281881 281810 281176 279758
$$ packed form
57392A30449J922J938J212R49J632K376K313J730J318J160J027R63R95Q57M81
57377A51322J48j56p87j520j572r79q92j843k813k785k259k218k546k549k316
57362A26235k452k965l441l747l770l108j885j177j610k248j977j242j173j628
57348I3812j525o86R7N34J025J426J054j2p79o61l9N70J014J173R31N62M62O01
57330I9559Q19J325K216K891K832K491K570K839K738K599L061L682L488K669K353
57315A38132K806L197L170L215L436L281K728K460K607K553K248K428L231L786
57301A79278L655L454L607L529K699J610J143J663L102N049O509O545N508M821
57287B32172N202N996O478O639O413N328L605K425K380K550J919P74p1o34j418
$$ plain form
57272 279758 277325 273885 269163 262459 253344 242141 229553 216106 202010 187244 171812 156169
57260 156169 141189 127385 114471 102190 91187 82302 75259 68846 62358 56109 50562 45793 41950
57247 41950 39368 37895 36643 34739 31962 28582 25057 22000 19898 18664 17818 17132 16659 16215 15498 14769
57231 14769 14658 15084 15115 14239 13187 12999 13792 14928 15947 16811 17507 17950 18215 18481 18822 19278 20040 21281
57213 21281 22906 24644 26331 27993 29687 31391 32945 34112 34868 35696 37345 40134 43606 47022 50127
57198 50127 53225 56561 59859 62672 65199 68450 73351 79790 86905 94195 101835 109839 117624 124845
57184 124845 132080 140101 148868 157851 167004 176629 186561 196313 206069 216686 228660 241779 255890
57171 255890 271203 287520 303915 319598 334653 349575 364685 380378 397304 415648 434598
$$ packed form
57272B79758k433l440m722o704r115j1203j2588j3447j4096j4766j5432j5643
57260A56169j4980j3804j2914j2281j1003q885p043o413o488o249n547m769l843
57247D1950k582j473j252j904k777l380l525l057k102j234q46o86m73m44p17p29
57231A4769j11M26L1q76j052j88P93J136J019Q64O96M43K65K66L41M56P62J241
57213B1281J625J738J687J662J694J704J554J167P56Q28J649K789L472L416L105
57198E0127L098L336L298K813K527L251M901O439P115P290P640Q004P785P221
57184A24845P235Q021Q767Q983R153R625R932R752R756J0617J1974J3119J4111
57171B55890J5313J6317J6395J5683J5055J4922J5110J5693J6926J8344J8950
$$ plain form
57160 434598 453213 471610 490679 510689 530765 549845 567715 584972 602321 620108 638293
57149 638293 656604 674775 692815 711074 729963 749638 770092 791561 814560 839313 865300
57138 865300 891743 918554 946445 975995 1007050 1039224 1072552 1107244 1143167 1180072 1218135
57127 1218135 1257784 1299123 1341962 1386294 1432273 1479851 1528941 1579846 1633058 1688719 1746858
57116 1746858 1808051 1873174 1942465 2015569 2092770 2175634 2266271 2366611 2478715 2605294 2749713
57105 2749713 2916207 3110718 3341303 3617551 3950014 4350124 4829300 5396941 6059739
57096 6059739 6824376 7701606 8707870 9863579 11190659 12711077 14445030 16407019
57088 16407019 18600645 21015788 23631705 26424751 29372258 32442572 35572136 38646592
$$ packed form
57160D34598J8615J8397J9069K0010K0076J9080J7870J7257J7349J7787J8185
57149F38293J8311J8171J8040J8259J8889J9675K0454K1469K2999K4753K5987
57138H65300K6443K6811K7891K9550L1055L2174L3328L4692L5923L6905L8063
57127A218135L9649M1339M2839M4332M5979M7578M9090N0905N3212N5661N8139
57116A746858O1193O5123O9291P3104P7201Q2864R0637J00340J12104J26579J44419
57105B749713J66494J94511K30585K76248L32463M00110M79176N67641O62798
57096F059739P64637Q77230J006264J155709J327080J520418J733953J961989
57088A6407019K193626K415143K615917K793046K947507L070314L129564L074456
$$ plain form
57080 38646592 41505754 43974393 45899510 47173075 47736845 47579703 46734223 45269173
57072 45269173 43275578 40852863 38103089 35132073 32049040 28960337 25960427 23125015
57064 23125015 20507664 18139418 16031390 14179633 12569899 11180916 9987183 8962331
57056 8962331 8081799 7323348 6666443 6092566 5586481 5136721 4734749 4373791 4048174
57047 4048174 3752937 3483658 3236797 3010245 2803221 2615336 2445748 2293135 2156224
57038 2156224 2034034 1925525 1829128 1742831 1664746 1593359 1527168 1464542 1404487 1347296 1293753
57027 1293753 1243722 1196131 1150319 1106517 1064811 1024623 985741 949025 915293 884198 855061
57016 855061 828236 804633 784176 765782 748826 733621 720392 708696 698151 688990 681508 675475
$$ packed form
57080C8646592K859162K468639J925117J273565N63770j57142q45480j465050
57072D5269173j993595k422715k749774k971016l083033l088703k999910k835412
57064B3125015k617351k368246k108028j851757j609734j388983j193733j024852
57056H962331q80532p58451o56905n73877n06085m49760m01972l60958l25617
57047D048174k95237k69279k46861k26552k07024j87885j69588j52613j36911
57038B156224j22190j08509r6397q6297p8085p1387o6191o2626o0055n7191n3543
57027A293753n0031m7591m5812m3802m1706m0188l8882l6716l3732l1095k9137
57016H55061k6825k3603k0457j8394j6956j5205j3229j1696j0545r161p482o033
$$ plain form
57004 675475 670459 666314 663071 660757 659644 660302 662989 667178 672080 677615 684641 694242 706980 722915
56990 722915 742135 765015 792008 823467 859810 901638 949579 1004353 1067126 1139264 1221367
56979 1221367 1313311 1416167 1533820 1672322 1838908 2043320 2299082 2620150 3013534 3472288
56969 3472288 3969376 4451367 4839701 5051979 5038925 4809975 4424788 3959754 3479098 3026372
56959 3026372 2627689 2294422 2025313 1811851 1643909 1511209 1402828 1308860 1223057 1142950
56949 1142950 1068119 999221 937496 883372 835473 791756 751242 714041 680330 650227 624160
56938 624160 602533 585319 572659 565484 564890 571151 583784 602113 625145 650965 676379 696844
56926 696844 707024 702833 683922 653890 617681 579143 540907 505159 473445 446194 423156 403911
$$ packed form
57004F75475n016m145l243k314j113O58K687M189M902N535P026R601J2738J5935
56990G22915J9220K2880K6993L1459L6343M1828M7941N4774O2773P2138Q2103
56979A221367R1944J02856J17653J38502J66586K04412K55762L21068L93384M58754
56969C472288M97088M81991L88334K12278j3054k28950l85187m65034m80656m52726
56959C026372l98683l33267k69109k13462j67942j32700j08381r3968q5803q0107
56949A142950p4831o8898o1725n4124m7899m3717m0514l7201l3711l0103k6067
56938F24160k1627j7214j2660p175n94O261J2633J8329K3032K5820K5414K0465
56926F96844J0180m191j8911l0032l6209l8538l8236l5748l1714k7251k3038j9245
$$ plain form
56914 403911 387608 373055 359798 348533 339785 332712 325881 318767 311897 305932 301144 297426 294343
56901 294343 291553 289459 288921 290054 291910 293595 294960 296024 296738 297798 300639 305967 313238 322274 334310
56886 334310 350452 369838 390178 409181 424517 433370 433603 425233 410059 390455 369305 350035
56874 350035 335057 324417 317039 312954 313223 318237 327531 341086 359439 382536 409768 441424 479101
56861 479101 524406 577861 638706 704373 769590 826723 867768 886637 880903 852949 809493 758773
56849 758773 707283 658902 616157 581061 554779 537528 529193 529593 538342 555281 581070 616819
56837 616819 663326 721346 792193 876829 973907 1078810 1183832 1278176 1348554 1382611 1374205
56826 1374205 1326125 1248016 1151962 1049241 948950 857504 778584 713576 662244 623439 595871
$$ packed form
56914D03911j6303j4553j3257j1265q748p073o831p114o870n965m788l718l083
56901B94343k790k094n38J133J856J685J365J064P14J060K841N328P271R036J2036
56886C34310J6142J9386K0340J9003J5336Q853K33q370j5174j9604k1150j9270
56874C50035j4978j0640p378m085K69N014R294J3555J8353K3097K7232L1656L7677
56861D79101M5305N3455O0845O5667O5217N7133M1045J8869n734k7954m3456n0720
56849G58773n1490m8381m2745l5096k6282j7251q335M00Q749J6939K5789L5749
56837F16819M6507N8020P0847Q4636R7078J04903J05022R4344P0378L4057q406
56826A374205m8080p8109r6054j02721j00291r1446p8920o5008n1332l8805k7568
$$ plain form
56815 595871 578700 571580 574461 587555 611192 645399 689920 744723 809644 882615 958176 1027880
56803 1027880 1081916 1110836 1107986 1072610 1010909 933120 849091 766221 689782 623063 567076
56792 567076 521371 485431 458704 439860 427354 420748 420454 426356 437894 455450 480277 512587
56780 512587 550494 590738 629226 660661 679107 680127 662601 628868 583832 533499 482873 434582
56768 434582 389873 350373 317650 291281 269050 249485 232972 219962 209533 200439 192460 185867
56756 185867 180430 175749 171827 168652 165782 162883 160082 157365 154376 151237 148818 147595 146937 146088 145104
56741 145104 144236 143109 141300 139223 137649 136695 135919 135222 135076 135918 137638 139510 140567 140376 139551 139086
56725 139086 139171 139173 138764 138303 137994 137525 136835 136361 136123 135362 133658 131643 130080 128965 128130 127988 128868 130128
$$ packed form
56815E95871j7171p120K881J3094K3637L4207M4521N4803O4921P2971P5561O9704
56803A027880N4036K8920k850l5376o1701p7789q4029q2870p6439o6719n5987
56792E67076m5705l5940k6727j8844j2506o606k94N902J1538J7556K4827L2310
56780E12587L7907M0244L8488L1435J8446J020j7526l3733m5036n0333n0626m8291
56768D34582m4709l9500l2723k6369k2231j9565j6513j3010j0429r094p979o593
56756A85867n437m681l922l175k870k899k801k717k989l139k419j223o58q49r84
56741A45104q68j127j809k077j574r54p76o97j46Q42J720J872J057j91q25m65
56725A39086Q5Km09m61l09m69o90m74k38p61j704k015j563j115q35j42Q80J260
$$ plain form
56707 130128 130756 130533 129938 129289 128656 128320 128536 128906 128644 127507 126022 124728 123573 122154 120354 118638
56691 118638 117702 117835 118690 119771 120895 121906 122332 121959 121538 122148 123835 125622 126900 127990 129191 130144
56675 130144 130532 130656 130917 131357 132107 133599 135879 138245 140019 141247 142295 143297 144333 145575 146907
56660 146907 147956 148808 150062 151828 153374 154253 155053 156492 158409 160284 162164 164310 166417 167963 169033
56645 169033 170104 171237 172142 172797 173432 173980 174104 173674 172786 171441 169590 167396 165074 162566 159728 156763
56629 156763 154168 152264 150973 150047 149376 149074 149283 149858 150477 151224 152771 155516 158730 161158 162386 163052
56613 163052 163824 164853 166251 168303 170939 173547 175548 176686 176794 175888 174506 173256 172041 170491 169117
56598 169117 169048 170500 172496 174299 176073 177801 178752 178616 178188 178261 178624 178811 178961 179311 179582 179604 179834 180622
$$ packed form
56707A30128O28k23n95o49o33l36K16L70k62j137j485j294j155j419j800j716
56691A18638r36J33Q55J081J124J011M26l73m21O10J687J787J278J090J201R53
56675A30144L88J24K61M40P50J492K280K366J774J228J048J002J036J242J332
56660A46907J049Q52J254J766J546Q79Q00J439J917J875J880K146K107J546J070
56645A69033J071J133R05O55O35N48J24m30q88j345j851k194k322k508k838k965
56629A56763k595j904j291r26o71l02K09N75O19P47J547K745L214K428J228O66
56613A63052P72J029J398K052K636K608K001J138J08r06j382j250j215j550j374
56598A69117o9J452J996J803J774J728R51j36m28P3L63J87J50L50K71K2K30P88
$$ plain form
56580 180622 181615 182506 183653 185284 186862 187997 189271 191347 193890 196297 198851 202186 205973 209175 211423
56565 211423 213274 215251 217424 219962 223417 228272 234479 241456 248536 255671 263728 273602 285005 296704
56551 296704 307984 319037 329758 339265 347186 354449 362063 369903 377381 384491 391308 397110 400948
56538 400948 402697 402840 401658 399305 396166 392385 387448 380903 373091 364613 355621 346236 337096 328686
56524 328686 320612 312233 303594 295066 286511 277516 268139 258900 250374 243091 237215 231912 225825 218751
56510 218751 212092 206997 202976 199058 195330 192338 189810 187163 184653 182913 181859 181085 180811 181299 181823
56495 181823 181410 180303 179618 179844 180633 181756 183166 184381 184879 184970 185348 185933 186093 185781 185564 185698 186110 187083
56477 187083 189003 191484 193626 195153 196590 198449 200940 204240 208251 212169 215079 216978 218705 221000
$$ packed form
56580A80622R93Q91J147J631J578J135J274K076K543K407K554L335L787L202K248
56565B11423J851J977K173K538L455M855O207O977P080P135Q057R874J1403J1699
56551B96704J1280J1053J0721R507P921P263P614P840P478P110O817N802L838
56538D00948J749J43j182k353l139l781m937o545p812q478q992r385r140q410
56524C28686q074q379q639q528q555q995r377r239q526p283n876n303o087p074
56510B18751o659n095m021l918l728k992k528k647k510j740j054p74k74M88N24
56495A81823m13j107o85K26P89J123J410J215M98R1L78N85J60l12k17J34M12R73
56477A87083J920K481K142J527J437J859K491L300M011L918K910J899J727K295
$$ plain form
56463 221000 224112 228027 232439 236730 240528 244047 247549 250957 254452 258790 264347 270454 276330 282034
56449 282034 287828 293275 297777 301390 304356 306587 308426 311035 314937 318912 321509 322964 324511 326479
56435 326479 328441 330605 333566 336979 339803 341652 342732 342759 341184 338264 334785 330962 326601 321934 317125
56420 317125 311404 304002 295664 287937 281250 274912 268725 263210 258403 253777 249301 245413 242024 238701
56406 238701 235643 233357 231528 229407 227094 225335 224237 223324 222552 222084 221398 219892 218080 216863 215950
56391 215950 214407 212501 211448 211504 211807 212042 212785 214117 215317 216007 216366 216288 215581 214926 215308 216580 217840
56374 217840 219017 220684 222572 223820 224501 225356 226174 226091 225429 225489 226479 227335 227667 228205 229155 229832 230101 230482
56356 230482 230647 229578 227480 225840 225248 224842 224263 224346 225441 226747 227894 229569 231967 234187 235725 237124
$$ packed form
56463B21000L112L915M412M291L798L519L502L408L495M338N557O107N876N704
56449B82034N794N447M502L613K966K231J839K609L902L975K597J455J547J968
56435C26479J962K164K961L413K824J849J080K7j575k920l479l823m361m667m809
56420C17125n721p402q338p727o687o338o187n515m807m626m476l888l389l323
56406B38701l058k286j829k121k313j759j098r13p72m68o86j506j812j217r13
56391B15950j543j906j053N6L03K35P43J332J200O90L59p8p07o55L82J272J260
56374B17840J177J667J888J248O81Q55Q18q3o62O0R90Q56L32N38R50O77K69L81
56356B30482J65j069k098j640n92m06n79Q3J095J306J147J675K398K220J538J399
$$ plain form
56340 237124 238682 240046 241552 244400 248902 254037 259228 264957 271110 276397 280122 283049 285803 287989
56326 287989 289607 291789 295242 299279 303132 306854 310342 313033 315420 319302 325511 332673 339158 344986
56312 344986 350862 356609 361667 366175 370547 374747 378709 382655 386463 389661 392390 395306 398119 399495
56298 399495 398889 397285 395651 393945 392117 390701 389792 388648 386882 384870 382568 379332 375321 371706 369013
56283 369013 366693 364649 363515 362986 361768 359915 359281 360725 362660 363534 364056 365668 368385 371553 375431
56268 375431 380541 386387 392064 397454 403009 409189 416748 426459 437905 449670 461411 474604 490642
56255 490642 509385 530094 552408 575836 599771 624637 651624 680661 710093 738819 767110
56244 767110 794811 820667 844116 865856 885803 902408 914919 924348 931252 934659 934383 932348 930167
$$ packed form
56340B37124J558J364J506K848M502N135N191N729O153N287L725K927K754K186
56326B87989J618K182L453M037L853L722L488K691K387L882O209P162O485N828
56312C44986N876N747N058M508M372M200L962L946L808L198K729K916K813J376
56298C99495o06j604j634j706j828j416r09j144j766k012k302l236m011l615k693
56283C69013k320k044j134n29j218j853o34J444J935Q74N22J612K717L168L878
56268C75431N110N846N677N390N555O180P559R711J1446J1765J1741J3193J6038
56255D90642J8743K0709K2314K3428K3935K4866K6987K9037K9432K8726K8291
56244G67110K7701K5856K3449K1740J9947J6605J2511R429O904L407k76k035k181
$$ plain form
56231 930167 927289 922997 918421 914998 912549 910390 908801 907956 906914 905057 903002 900791 896873 890276
56217 890276 882095 873354 863128 850369 835913 821018 805488 788877 772037 755808 739622 722919
56205 722919 706496 690965 675512 659735 644994 632333 620753 609248 598774 590414 583374 576713
56193 576713 571306 567994 565438 561949 557946 554577 551458 547936 544968 543417 541905 538788 535008 532645
56179 532645 531824 531376 531416 532871 535353 537782 540250 543233 545999 547888 550148 554304 559655 564442 568506
56164 568506 572736 576949 580502 584051 588552 593377 597450 601326 606094 611206 615437 619084 623175 627468
56150 627468 631213 634959 639621 644703 649338 654078 659899 666627 674141 683701 696070 709804 723577
56137 723577 738704 757074 778014 799661 822178 847237 875600 907644 945051 989582 1041417
$$ packed form
56231I30167k878m292m576l423k449k159j589q45j042j857k055k211l918o597
56217H90276q181q741j0226j2759j4456j4895j5530j6611j6840j6229j6186j6703
56205G22919j6423j5531j5453j5777j4741j2661j1580j1505j0474q360p040o661
56193E76713n407l312k556l489m003l369l119l522k968j551j512l117l780k363
56179E32645q21m48M0J455K482K429K468K983K766J889K260M156N351M787M064
56164E68506M230M213L553L549M501M825M073L876M768N112M231L647M091M293
56150F27468L745L746M662N082M635M740N821O728P514R560J2369J3734J3773
56137G23577J5127J8370K0940K1647K2517K5059K8363L2044L7407M4531N1835
$$ plain form
56126 1041417 1101057 1171509 1256141 1355789 1470551 1602917 1756138 1930341 2122438 2328108
56116 2328108 2540901 2750723 2946601 3120908 3269691 3391407 3488567 3568808 3640410 3706724
56106 3706724 3766459 3816894 3853724 3870406 3862613 3833205 3789734 3737855 3679633 3615675 3544046
56095 3544046 3457817 3348362 3212010 3051504 2872488 2682131 2489948 2305488 2134459 1979214
56085 1979214 1841822 1723594 1622816 1536340 1462709 1401011 1348285 1301517 1260778 1226964 1198068
56074 1198068 1171390 1147817 1129867 1116941 1106547 1098639 1094414 1092276 1089600 1087321 1088191 1091575 1094525
56061 1094525 1096923 1100915 1106326 1111400 1117054 1125591 1136090 1145887 1155588 1167696 1181418 1194026 1206321
56048 1206321 1221314 1238434 1254583 1270169 1288381 1309109 1329330 1348996 1370734 1394124 1416139
$$ packed form
56126A041417N9640P0452Q4632R9648J14762J32366J53221J74203J92097K05670
56116B328108K12793K09822J95878J74307J48783J21716R7160Q0241P1602O6314
56106C706724N9735N0435L6830J6682p793k9408m3471n1879n8222o3958p1629
56095C544046q6229j09455j36352j60506j79016j90357j92183j84460j71029j55245
56085A979214j37392j18228j00778q6476p3631o1698n2726m6768m0739l3814k8896
56074A198068k6678k3573j7950j2926j0394p908m225k138k676k279Q70L384K950
56061A094525K398L992N411N074N654Q537J0499R797R701J2108J3722J2608J2295
56048A206321J4993J7120J6149J5586J8212K0728K0221J9666K1738K3390K2015
$$ plain form
56037 1416139 1436960 1459554 1483914 1507578 1531396 1558679 1589065 1619377 1650043 1684141 1720615
56026 1720615 1755309 1788574 1824835 1864617 1904056 1942443 1983031 2026100 2068553 2110905 2157428
56015 2157428 2208837 2262037 2317439 2378992 2446518 2515666 2586032 2661512 2742198 2823999 2906905
56004 2906905 2995388 3090003 3187008 3286765 3393715 3507481 3623106 3740820 3866245 4000350
55994 4000350 4139026 4283278 4439530 4608982 4787249 4975378 5179994 5401633 5634728
55985 5634728 5880470 6147477 6438474 6749202 7082054 7447239 7848692 8282971 8754014
55976 8754014 9274059 9847952 10472642 11154823 11912670 12758065 13695805 14744234 15938817
55967 15938817 17313937 18903192 20760520 22955558 25541069 28548331 32019777 36021215
$$ packed form
56037A416139K0821K2594K4360K3664K3818K7283L0386L0312L0666L4098L6474
56026A720615L4694L3265L6261L9782L9439L8387M0588M3069M2453M2352M6523
56015B157428N1409N3200N5402O1553O7526O9148P0366P5480Q0686Q1801Q2906
56004B906905Q8483R4615R7005R9757J06950J13766J15625J17714J25425J34105
55994D000350J38676J44252J56252J69452J78267J88129K04616K21639K33095
55985E634728K45742K67007K90997L10728L32852L65185M01453M34279M71043
55976H754014N20045N73893O24690O82181P57847Q45395R37740J048429J194583
55967A5938817J375120J589255J857328K195038K585511L007262L471446M001438
$$ plain form
55959 36021215 40622109 45903083 51997115 59093067 67395896 77133621 88623928 102289200
55951 102289200 118590547 138008004 161101381 188457595 220376060 256420327 295023468
55944 295023468 333182534 366400773 389367949 397617346 389405070 366468255 333093279
55937 333093279 294307959 254454535 216635803 182713355 153484284 128961461 108721734
55930 108721734 92176072 78694689 67675085 58612015 51119941 44891576 39666000
55923 39666000 35241037 31475884 28257478 25479874 23060266 20946764 19095906 17459758
55915 17459758 16001879 14704992 13552790 12520277 11588730 10752923 10005639 9330111 8714310
55906 8714310 8157853 7657970 7202388 6782355 6399391 6052818 5733127 5433829 5157960
$$ packed form
55959C6021215M600894N280974O094032P095952Q302829R737725J1490307J3665272
55951A02289200J6301347J9417457K3093377K7356214L1918465L6044267L8603141
55944B95023468L8159066L3218239K2967176Q249397q212276k2936815l3374976
55937C33093279l8785320l9853424l7818732l3922448k9229071k4522823k0239727
55930A08721734j6545662j3481383j1019604r063070p492074o228365n225576
55923C9666000m424963l765153l218406k777604k419608k113502j850858j636148
55915A7459758j457879j296887j152202j032513r31547q35807p47284o75528o15801
55906H714310n56457m99883m55582m20033l82964l46573l19691k99298k75869
$$ plain form
55897 5157960 4906787 4673265 4452539 4248191 4062250 3889080 3724675 3572250 3433248
55888 3433248 3302164 3175664 3057900 2951534 2852044 2756193 2667757 2589511 2517318 2447556
55878 2447556 2383227 2327571 2278341 2233227 2194539 2163957 2138781 2117681 2104217 2100712 2104645 2114744
55866 2114744 2134309 2164284 2198819 2231453 2259700 2279696 2282777 2262550 2220760 2162256 2089249
55855 2089249 2004411 1914239 1824501 1736301 1650227 1569895 1497673 1431298 1368563 1311307 1261296
55844 1261296 1216483 1175000 1138793 1109623 1085312 1063480 1045328 1032416 1023448 1017573 1017159 1023889
55832 1023889 1035700 1050895 1071690 1100346 1135123 1173148 1213457 1253504 1285963 1303041 1301821
55821 1301821 1282928 1247491 1198887 1144169 1089605 1036619 984773 935914 892211 852904 816488
$$ packed form
55897E157960k51173k33522k20726k04348j85941j73170j64405j52425j39002
55888C433248j31084j26500j17764j06366r9490r5851q8436p8246p2193o9762
55878B447556o4329n5656m9230m5114l8688l0582k5176k1100j3464l505L933J0099
55866B114744J9565K9975L4535L2634K8247J9996L081k0227m1790n8504p3007
55855B089249q4838r0172q9738q8200q6074q0332p2222o6375o2735n7256n0011
55844A261296m4813m1483l6207k9170k4311k1832j8152j2912q968n875m14O730
55832A023889J1811J5195K0795K8656L4777L8025M0309M0047L2459J7078j220
55821A301821j8893l5437m8604n4718n4564n2986n1846m8859m3703l9307l6416
$$ plain form
55810 816488 783919 756529 733020 711737 693903 681535 673933 669087 666846 668059 672267 678721 688112
55797 688112 701030 716276 732549 749978 768167 784794 798062 808483 816467 820457 819374 814570
55785 814570 807530 798071 786732 776364 769184 764722 762680 765011 772727 783223 793309 802332 809782
55772 809782 812519 807471 795003 776879 753165 724027 692364 661394 631298 601184 572599 548014
55760 548014 527362 509088 493242 480542 469670 458543 447346 437600 429179 420870 412902 406308
55748 406308 400517 394135 387368 381336 375611 368672 360230 351080 341250 330272 318672 307467 296843
55735 296843 286848 278511 272730 268961 266445 265504 266134 266670 265642 263674 261790 259219 254737 248920 243071
55720 243071 237121 230479 223777 217824 212080 206109 201280 198876 197699 195792 193508 192628 193313 194237 195060
$$ packed form
55810H16488l2569k7390k3509k1283j7834j2368p602m846k241J213M208O454R391
55797F88112J2918J5246J6273J7429J8189J6627J3268J0421P984L990j083m804
55785H14570p040r459j1339j0368p180m462k042K331P716J0496J0086R023P450
55772H09782K737n048j2468j8124k3714k9138l1663l0970l0096l0114k8585k4585
55760E48014k0652j8274j5846j2700j0872j1127j1197r746q421q309p968o594
55748D06308n791o382o767o032n725o939q442r150r830j0978j1600j1205j0624
55735B96843r995q337n781l769k516r41O30N36j028j968j884k571m482n817n849
55720B43071n950o642o702n953n744n971m829k404j177j907k284q80O85R24Q23
$$ plain form
55705 195060 196635 199212 202368 206196 210788 215050 217611 218332 217584 214965 210272 204729 199611 194682 189587
55690 189587 185562 183800 183255 182217 181245 182467 186649 192868 200424 209091 217993 226156 233841 241774 249494
55675 249494 255721 259619 260393 256776 248586 237877 226914 215916 204253 192590 182041 172369 163026
55662 163026 154886 148961 144463 140214 136920 135839 136238 136494 136800 138384 140831 142752 144535 147790 152321
55647 152321 156065 157888 158260 157454 155325 152715 150834 149311 146861 143692 141084 138871 135628 131362 127778
55632 127778 125700 124254 122745 121361 119871 117611 114994 113216 112282 111074 109422 108247 107575 106283 104059
55617 104059 101840 100132 98614 97529 97644 98620 99194 99252 99970 101669 103336 104578 106212 108379 109817 109775
55601 109775 109189 109284 110176 111407 112701 113708 113996 113647 113102 112433 111735 111957 114049 117406 120520 123058 126010
$$ packed form
55705A95060J575K577L156L828M592M262K561P21p48k619m693n543n118m929n095
55690A89587m025j762n45j038r72J222M182O219P556Q667Q902Q163P685P933P720
55675B49494O227L898P74l617q190j0709j0963j0998j1663j1663j0549r672r343
55662A63026q140n925m498m249l294j081L99K56L06J584K447J921J783L255M531
55647A52321L744J823L72q06k129k610j881j523k450l169k608k213l243m266l584
55632A27778k078j446j509j384j490k260k617j778r34j208j652j175o72j292k224
55617A04059k219j708j518j085J15R76N74N8P18J699J667J242J634K167J438m2
55601A09775n86R5Q92J231J294J007K88l49n45o69o98K22K092L357L114K538K952
$$ plain form
55584 126010 129936 134593 140127 147042 154971 163115 171924 182719 195581 209391 224149 241497 262651
55571 262651 287497 316173 349775 388870 432818 481223 534645 593115 654907 717063 775881
55560 775881 826618 864259 885414 888936 874836 844064 799472 745363 685491 622531 559514 500008
55548 500008 446270 398463 356162 319318 287398 259150 233954 212214 193930 178135 164268
55537 164268 152721 143423 135146 126959 119241 112528 106490 100745 95681 91737 88620 85799 82968 79723
55523 79723 75735 71553 68204 65672 62912 59651 56892 55170 53679 51820 50347 50163 51100 52688 55133
55508 55133 58552 62068 64525 65577 65513 64712 63774 63483 64012 64799 65504 66396 67506 68282 68439 68234 67579 65953
55490 65953 63678 62150 62098 62580 62388 61591 60914 60444 59749 58679 57291 55552 53722 52487 52174 52298 52316
$$ packed form
55584A26010L926M657N534O915P929Q144Q809J0795J2862J3810J4758J7348K1154
55571B62651K4846K8676L3602L9095M3948M8405N3422N8470O1792O2156N8818
55560G75881N0737L7641K1155L522j4100l0772m4592n4109n9872o2960o3017n9506
55548E00008n3738m7807m2301l6844l1920k8248k5196k1740j8284j5795j3867
55537A64268j1547r298q277q187p718o713o038n745n064l944l117k821k831l245
55523G9723l988m182l349k532k760l261k759j722j491j859j473j84R37J588K445
55508E5133L419L516K457J052o4q01r38k91N29P87P05Q92J110P76J57k05o55j626
55490F5953k275j528n2M82j92p97o77m70o95j070j388j739j830j235l13J24J8
$$ plain form
55473 52316 52291 52396 52385 51962 51119 49820 47914 45668 43696 42149 40648 39222 38409 38163 37579 36193 34697
55456 34697 33874 33613 33449 33307 33181 32815 32251 32089 32706 33723 34609 35258 35702 35896 36054 36602 37543 38468 39242
55437 39242 39939 40164 39473 38525 38609 39710 40364 39894 39535 40627 42792 44754 45948 46425 46047 44834 43559
55420 43559 43104 43523 44288 44962 45186 44620 43490 42682 42836 43817 45368 47596 50506 53828 57688 62584 68269
55403 68269 73573 77895 82001 86663 91300 94649 96108 95793 93996 91232 88202 85070 81380 77114 73086
55388 73086 69830 66928 64037 61611 59845 57861 54919 51734 49566 48575 47964 47258 46512 45706 44813 44203
55372 44203 44233 44683 45100 45287 44927 43370 40542 37559 35643 34771 34056 33030 31876 30825 30107 30171 31181
55355 31181 32518 33377 33678 33869 34200 34719 35587 36807 37893 38329 38103 37449 36551 35900 36294 37775 39072
$$ packed form
55473E2316k5J05j1m23q43j299j906k246j972j547j501j426q13k46n84j386j496
55456C4697q23k61j64j42j26l66n64j62O17J017Q86O49M44J94J58N48R41R25P74
55437C9242O97K25o91r48Q4J101O54m70l59J092K165J962J194M77l78j213j275
55420D3559m55M19P65O74K24n66j130q08J54R81J551K228K910L322L860M896N685
55403F8269N304M322M106M662M637L349J459l15j797k764l030l132l690m266m028
55388G3086l256k902k891k426j766j984k942l185k168r91o11p06p46q06q93o10
55372D4203L0M50M17J87l60j557k828k983j916q72p15j026j154j051p18O4J010
55355C1181J337Q59L01J91L31N19Q68J220J086M36k26o54q98o51L94J481J297
$$ plain form
55338 39072 38921 37623 36573 36474 36757 36668 36210 35867 35840 35770 35163 34093 33310 33349 33719 33579 33151 33552 35141
55319 35141 36949 38029 38410 38293 37422 35976 35095 35613 36926 38016 38888 40007 40906 40566 38978 37294
55303 37294 36401 36101 35760 35132 34413 33859 33495 33088 32544 32245 32646 33615 34657 35770 37301 39019 40300
55286 40300 41360 43133 45552 47180 47124 46204 45462 44772 43779 43075 43178 43359 42768 41922 41707 41579 40281 37921
55268 37921 35872 34833 34378 34278 34864 35923 36472 36040 35321 35282 36201 37684 39029 39578 39266 38787 38732 38779
55250 38779 38289 37368 36678 36420 36277 36160 36255 36462 36470 36341 36394 36616 36715 36592 36265 35619 34785 34471 35271 36891
55230 36891 38597 40041 41056 41139 39994 38286 37019 36383 35972 35836 36437 37737 39149 40321 41215 41582
55214 41582 41089 39937 38759 38021 37973 38804 40158 40979 40616 39753 39425 39617 39799 40314 41866 43787 44306 42857
$$ packed form
55338C9072j51j298j050r9K83q9m58l43k7p0o07j070p83L9L70j40m28M01J589
55319C5141J808J080L81j17q71j446q81N18J313J090Q72J119Q99l40j588j684
55303C7294q93l00l41o28p19n54l64m07n44k99M01R69J042J113J531J718J281
55286D0300J060J773K419J628n6r20p42o90r93p04J03J81n91q46k15j28j298k360
55268C7921k049j039m55j00N86J059N49m32p19l9R19J483J345N49l12m79n5M7
55250C8779m90r21o90k58j43j17R5K07Qj29N3K22R9j23l27o46q34l14Q00J620
55230C6891J706J444J015Q3j145j708j267o36m11j36O01J300J412J172Q94L67
55214D1582m93j152j178p38m8Q31J354Q21l63q63l28J92J82N15J552J921N19j449
$$ plain form
55196 42857 40938 40245 40911 41990 42791 43157 43069 42608 42069 41760 41803 42185 42718 43024 42882 42558 42429 42412 42070
55177 42070 41106 39464 37260 35044 33740 33726 34238 34172 33246 31918 30703 30183 31104 33528 36183 37506 37164
55160 37164 35897 34318 32761 31884 32274 33503 34527 34957 35158 35295 35180 34886 34598 34057 33084 32389 32765
55143 32765 33671 33831 33174 32859 33302 33501 32715 31602 31196 31689 32699 33901 34943 35493 35738 36180 36735 36783
55125 36783 36326 36223 36934 37857 38288 38316 38420 38840 39752 41356 43425 45329 46820 48291 50055 51997 54062
55108 54062 56372 58576 59841 59790 58855 57443 55451 52913 50467 48815 48213 48613 49673 50507 50281 49352
55092 49352 49010 49743 50567 50549 50107 50186 50823 51348 51538 51815 52505 53431 54222 54652 54778 54856 54911 54360 52492 49451
55072 49451 46365 44347 43656 43825 44151 44043 43423 42878 43019 43695 44308 44675 44875 44438 42738 40316 38746
$$ packed form
55196D2857j919o93O66J079Q01L66q8m61n39l09M3L82N33L06j42l24j29j7l42
55177D2070r64j642k204k216j304j4N12o6r26j328j215n20R21K424K655J323l42
55160C7164j267j579j557q77L90J229J024M30K01J37j15k94k88n41r73o95L76
55143C2765R06J60o57l15M43J99p86j113m06M93J010J202J042N50K45M42N55M8
55125C6783m57j03P11R23M31K8J04M20R12J604K069J904J491J471J764J942K065
55108E4062K310K204J265n1r35j412j992k538k446j652o02M00J060Q34k26r29
55092D9352l42P33Q24j8m42P9O37N25J90K77O90R26P91M30J26P8N5n51j868l041
55072D9451l086k018o91J69L26j08o20n45J41O76O13L67K00m37j700k422j570
$$ plain form
55055 38746 38782 39514 39765 39505 39434 39945 41053 42644 44237 45064 44964 44727 45097 45877 46475 46781 47081 47583 48471
55036 48471 49941 51731 53074 53655 54105 55092 56321 57043 57208 57454 58167 59056 59653 59767 59442 58777 57910 57124
55018 57124 56850 57371 58355 59008 59060 59318 60706 62931 64854 66050 67226 69008 71106 72915 74257 75305
55002 75305 76297 77438 78585 79026 78256 76876 75982 75739 75433 74852 74438 74034 72806 70755 69041 68249 67586
54985 67586 66419 65380 65072 64857 63923 62688 62070 62134 62431 62929 63614 63815 63055 62024 61755 62316 63268 64793
54967 64793 67200 69756 71291 71785 72220 73003 73567 73525 73183 72841 72513 72451 73139 74581 76267 78004 80188
54950 80188 83177 86889 91033 95284 99310 103171 107610 113389 120352 127601 134541 141292 148216 155616
54936 155616 163802 172873 182345 191392 199419 206054 210753 212858 211916 207620 199733 188681 175990 163479
$$ packed form
55055C8746L6P32K51k60p1N11J108J591J593Q27j00k37L70P80N98L06L00N02Q88
55036D8471J470J790J343N81M50R87J229P22J65K46P13Q89N97J14l25o65q67p86
55018E7124k74N21R84O53N2K58J388K225J923J196J176J782K098J809J342J048
55002G5305R92J141J147M41p70j380q94k43l06n81m14m04j228k051j714p92o63
54985F7586j167j039l08k15r34j235o18O4K97M98O85K01p60j031k69N61R52J525
54967F4793K407K556J535M94M35P83N64m2l42l42l28o2O88J442J686J737K184
54950H0188K989L712M144M251M026L861M439N779O963P249O940O751O924P400
54936A55616Q186R071R472R047Q027O635M699K105r42m296p887j1052j2691j2511
$$ plain form
54922 163479 152030 141564 131976 123436 115871 108926 102543 97046 92567 88825 85603 83049 81392 80668
54908 80668 80725 81256 81876 82435 83111 84009 85004 86313 88799 93112 98809 104920 111221 118272 126413 135396
54892 135396 144960 154992 165056 174421 182714 189875 195304 197693 196035 190466 181903 171315 159613
54879 159613 147821 136902 127388 119306 112356 106201 100790 96440 93343 91022 88655 86067 84105 83752
54865 83752 85025 86924 88451 89490 90626 92249 94113 95853 97588 99626 101821 103785 105681 108154
54851 108154 111318 114533 117437 120482 123921 126928 128404 128202 126800 124179 119865 113953 107341 100912
54837 100912 95033 89750 84883 80008 74944 70236 66628 64118 62081 60252 58936 58266 57898 57537 57123
54822 57123 56397 54973 53144 51982 52208 53345 54418 55179 56136 57523 58719 58912 58114 57253 57217 57984 58926
$$ packed form
54922A63479j1449j0466r588q540p565o945o383n497m479l742l222k554j657p24
54908H0668N7N31O20N59O76Q98R95J309K486M313N697O111O301P051Q141Q983
54892A35396R564J0032J0064R365Q293P161N429K389j658n569q563j0588j1702
54879A59613j1792j0919r514q082o950o155n411m350l097k321k367k588j962l53
54865H3752J273J899J527J039J136J623J864J740J735K038K195J964J896K473
54851A08154L164L215K904L045L439L007J476k02j402k621m314n912o612o429
54837A00912n879n283m867m875n064m708l608k510k037j829j316o70l68l61m14
54822E7123p26j424j829j162K26J137J073P61R57J387J196J93p98q61l6P67R42
$$ plain form
54805 58926 59825 61188 63410 66005 67988 68817 68766 68608 69138 70668 72729 74582 76328 79147 84015 90474
54789 90474 97188 103474 109761 116728 124578 133158 142331 152183 163089 175399 188748 201888 213581
54776 213581 223427 231424 237109 239795 239503 236957 232649 226510 218556 209431 200221 192081 185919 182048
54762 182048 180155 179905 181315 184261 188087 192419 198015 205978 216290 227975 240467 253735 266840
54749 266840 277569 284081 286242 284944 280847 274429 266681 258926 252115 246724 243129 241605 241947 243460
54735 243460 245326 246868 247551 246880 244293 239241 231585 221848 210797 198833 186098 173145 160975
54722 160975 150224 140688 131821 123415 115663 108911 103566 99876 97472 95350 92623 89278 85991 83305
54708 83305 81176 79324 77772 76842 76612 76666 76578 76492 76821 77400 77505 76900 76330 76553 77356 78092 78788 80028 81890
$$ packed form
54805E8926Q99J363K222K595J983Q29n1j58N30J530K061J853J746K819M868O459
54789I0474O714O286O287O967P850Q580R173R852J0906J2310J3349J3140J1693
54776B13581R846P997N685K686k92k546m308o139p954r125r210q140o162l871
54762A82048j893k50J410K946L826M332N596P963J0312J1685J2492J3268J3105
54749B66840J0729O512K161j298m097o418p748p755o811n391l595j524L42J513
54735B43460J866J542O83o71k587n052p656r737j1051j1964j2735j2953j2170
54722A60975j0751r536q867q406p752o752n345l690k404k122k727l345l287k686
54708H3305k129j852j552r30k30N4q8q6L29N79J05o05n70K23Q03P36O96J240J862
$$ plain form
54689 81890 83713 84917 85480 85645 85709 86137 87340 89248 91452 93770 96253 98729 100902 102863 104990 107326
54673 107326 109624 112035 115072 118819 122759 126539 130305 134028 137170 139369 141037 142894 145310 148392
54659 148392 152297 156968 161865 166422 170829 176082 183222 192491 203211 214534 226480 240161 256834
54646 256834 276821 299521 324133 349928 376007 401379 425201 446378 462962 472616 473930 467015
54634 467015 452884 432818 408410 381551 353990 327175 302479 281031 263034 247708 234107
54623 234107 221754 210484 200244 191250 183878 178081 173252 168798 164499 160298 156226 152685 150250
54610 150250 148913 147872 146284 143852 140598 136614 132270 128191 124654 121357 118037 114888 112126 109533
54596 109533 106833 104215 102179 101000 100505 100195 99516 98309 97009 96108 95450 94488 93218 92211 91648 91033
$$ packed form
54689H1890J823J204N63J65O4M28J203J908K204K318K483K476K173J961K127K336
54673A07326K298K411L037L747L940L780L766L723L142K199J668J857K416L082
54659A48392L905M671M897M557M407N253P140R269J0720J1323J1946J3681J6673
54646B56834J9987K2700K4612K5795K6079K5372K3822K1177J6584R654J314o915
54634D67015j4131k0066k4408k6859k7561k6815k4696k1448j7997j5326j3601
54623B34107j2353j1270j0240q994p372n797m829m454m299m201m072l541k435
54610A50250j337j041j588k432l254l984m344m079l537l297l320l149k762k593
54596A09533k700k618k036j179m95l10o79j207j300r01o58r62j270j007n63o15
$$ plain form
54580 91033 90149 89672 90325 91843 93202 93632 93090 92061 91177 90797 90751 90684 90615 90790 91017 90813 90309 90306 91147 92214
54560 92214 92889 93374 94053 94700 94955 95118 95849 97337 99330 101747 104714 108183 111936 115856 119888 123981
54544 123981 128293 133215 138857 144884 151142 158129 166453 176106 186592 197469 208514 219699 231294
54531 231294 243530 255739 266189 273221 276284 275599 271375 263896 253941 242516 230344 217994 206058
54518 206058 194685 183367 171878 161064 152018 144728 138270 132202 126950 122826 119459 116400 113727
54505 113727 111747 110519 109864 109575 109408 109074 108383 107426 106638 106668 107854 109664 110976 111196 110861 110853 111332 111872
54487 111872 112442 113668 116038 119128 121763 122961 122898 122927 124341 127007 129604 131304 132631 134466 136854
54472 136854 139257 141336 142857 143408 143010 142697 143623 145749 147991 149449 149882 149324 148099 147061 146939 147404
$$ packed form
54580I1033q84m77O53J518J359M30n42j029q84l80m6o7o9J75K27k04n04lQ41J067
54560I2214O75M85O79O47K55J63P31J488J993K417K967L469L753L920M032M093
54544A23981M312M922N642O027O258O987Q324R653J0486J0877J1045J1185J1595
54531B31294J2236J2209J0450P032L063o85m224p479r955j1425j2172j2350j1936
54518B06058j1373j1318j1489j0814r046p290o458o068n252m124l367l059k673
54505A13727j980j228o55k89j67l34o91r57p88L0J186J810J312K20l35qM79N40
54487A11872N70J226K370L090K635J198o3K9J414K666K597J700J327J835K388
54472A36854K403K079J521N51l98l13R26K126K242J458M33n58j225j038j22M65
$$ plain form
54456 147404 147499 147029 146757 147102 147416 146899 145633 144380 143620 143033 141786 139367 136403 134367 134012 134332 133692
54439 133692 131769 129597 127854 126142 124108 122206 120829 119544 117890 116332 115703 115998 116397 116323 115939 115754
54423 115754 116155 117235 118689 119876 120326 120225 120191 120629 121468 122485 123656 125125 126954 128997 131055 133182
54407 133182 135714 138876 142427 145853 148821 151262 153145 154515 155773 157496 159796 162117 163810 164677
54393 164677 164805 164142 162513 160024 157223 154819 153286 152600 152251 151524 149894 147261 143959 140609 137853
54378 137853 136000 134848 133920 132912 131907 131165 130758 130386 129604 128354 127189 126734 126919 127026 126601 125939 125511
54361 125511 125313 125194 125435 126473 128139 129713 130790 131705 133064 135203 138122 141581 145069 147965 149960
54346 149960 151272 152359 153476 154492 155109 155256 155265 155448 155442 154261 151278 146939 142275 137927 133926 130200
$$ packed form
54456A47404R5m70k72L45L14n17j266j253p60n87j247k419k964k036l55L20o40
54439A33692j923k172j743j712k034j902j377j285j654j558o29K95L99p4l84j85
54423A15754M01J080J454J187M50j01l4M38Q39J017J171J469J829K043K058K127
54407A33182K532L162L551L426K968K441J883J370J258J723K300K321J693Q67
54393A64677J28o63j629k489k801k404j533o86l49p27j630k633l302l350k756
54378A37853j853j152r28j008j005p42m07l72p82j250j165m55J85J07m25o62m28
54361A25511j98j19K41J038J666J574J077R15J359K139K919L459L488K896J995
54346A49960J312J087J117J016O17J47RJ83oj181k983m339m664m348m001l726
$$ plain form
54330 130200 126829 123859 121212 118775 116336 113557 110330 107061 104303 102257 100917 100468 101015 101991 102361
54315 102361 101515 99638 97200 94524 91921 89789 88315 87282 86287 85049 83567 82169 81292 80922 80391
54300 80391 79124 77471 76298 75769 75106 73710 71964 70614 69729 68704 67146 65379 64065 63511 63395 63126
54284 63126 62400 61366 60262 59100 57786 56423 55307 54713 54751 55236 55637 55506 55114 55264 56197 57107 57145 56522
54266 56522 56091 56223 56785 57930 60038 62870 65494 67246 68295 69203 70424 72181 74303 76129 77052 77158
54250 77158 76860 76083 74520 72623 71461 71410 71741 71743 71546 71515 71563 71480 71326 71075 70400 69310 68466 68433 68968 69506
54230 69506 69942 70483 71122 71698 72151 72294 71671 70149 68374 67179 66748 66707 66737 66606 65873 64241 62195 60774
54212 60774 60542 61031 61304 60848 59910 59076 58631 58309 57709 56818 55919 55063 54054 52995 52355 52239 51996 50913
$$ packed form
54330A30200l371k970k647k437k439k779l227l269k758k046j340m49N47R76L70
54315A02361q46j877k438k676k603k132j474j033r95j238j482j398q77l70n31
54300H0391j267j653j173n29o63j396j746j350q85j025j558j767j314n54j16k69
54284F3126p26j034j104j162j314j363j116n94L8M85M01j31l92J50R33R10L8o23
54266E6522m31J32N62J145K108K832K624J752J049R08J221J757K122J826R23J06
54250G7158k98p77j563j897j162n1L31Kj97l1M8q3j54k51o75j090q44l3N35N38
54230F9506M36N41O39N76M53J43o23j522j775j195m31m1L0j31p33j632k046j421
54212F0774k32M89K73m56r38q34m45l22o00q91q99q56j009j059o40j16k43j083
$$ plain form
54194 50913 49102 47383 46454 46426 46973 47665 48206 48460 48243 47220 45289 43034 41352 40563 40312 40337 40741 41397
54176 41397 41782 41796 42043 42829 43433 43024 41810 40613 39686 38751 37954 37926 38864 40223 41474 42620 43824 44972
54158 44972 45755 45871 45093 43510 41737 40569 40323 40714 41351 42032 42641 43167 43872 45066 46580 47797 48333
54141 48333 48362 48157 47649 46711 45627 44926 44785 44851 44760 44657 45095 46418 48327 50038 50801 50355 49114 48041
54123 48041 48088 49411 51192 52470 53096 53587 54162 54435 54125 53523 53051 52797 52726 52908 53185 53031 52204 51223 50754
54104 50754 50767 50748 50567 50639 51348 52745 54736 57132 59512 61414 62721 63629 64283 64720 65048 65374 65640 65815
54086 65815 66120 66699 67246 67339 67020 66570 65847 64464 62643 61295 60988 61323 61613 61698 61754 61665 61087 60013 58917
54067 58917 58373 58745 60086 61980 63565 64095 63648 63064 63089 63677 64192 64115 63396 62297 61211 60651 61115 62744
$$ packed form
54194E0913j811j719r29k8N47O92N41K54k17j023j931k255j682p89k51K5M04O56
54176D1397L85J4K47P86O04m09j214j197r27r35p97k8R38J359J251J146J204J148
54158D4972P83J16p78j583j773j168k46L91O37O81O09N26P05J194J514J217N36
54141D8333K9k05n08r38j084p01j41O6r1j03M38J323J909J711P63m46j241j073
54123D8041M7J323J781J278O26M91N75K73l10o02m72k54p1J82K77j54q27r81m69
54104E0754J3j9j81P2P09J397J991K396K380J902J307R08O54M37L28L26K66J75
54086F5815L05N79N47R3l19m50p23j383j821j348l07L35K90Q5N6q9n78j074j096
54067E8917n44L72J341J894J585N30m47n84K5N88N15p7p19j099j086n60M64J629
$$ plain form
54049 62744 65188 67914 70541 72803 74379 75087 75165 75106 75189 75350 75477 75649 76135 77321 79521 82526 85505
54032 85505 87794 89761 92346 95703 98925 101328 103394 106051 109557 113611 118110 123093 128230 133055
54018 133055 137662 142515 147590 152259 156096 159250 161809 163349 163481 162607 161720 161531 161990 162613 163061 163307
54002 163307 163333 162834 161349 158677 155041 150904 146811 143396 141142 139833 138483 136096 132529 128510 124986
53987 124986 122529 121090 120014 118492 116309 114035 112258 110847 109266 107396 105587 103966 102187 99938
53973 99938 97438 95290 94024 93717 93890 93872 93530 93551 94686 96780 98817 99928 100029 99548 98955 98646 98932
53956 98932 99867 101222 102748 104333 105872 107245 108545 110118 112157 114342 116096 117230 118235 119843 122388
53941 122388 125724 129644 134097 138813 143077 146335 148968 152039 156208 161306 166909 172759 178438 183233
$$ packed form
54049F2744K444K726K627K262J576P08P8n9Q3J61J27J72M86J186K200L005K979
54032H5505K289J967K585L357L222K403K066K657L506M054M499M983N137M825
54018A33055M607M853N075M669L837L154K559J540J32q74q87j89M59O23M48K46
54002A63307K6m99j485k672l636m137m093l415k254j309j350k387l567m019l524
53987A24986k457j439j076j522k183k274j777j411j581j870j809j621j779k249
53973I9938k500k148j266l07J73j8l42K1J135K094K037J111J01m81n93l09K86
53956I8932R35J355J526J585J539J373J300J573K039K185J754J134J005J608K545
53941A22388L336L920M453M716M264L258K633L071M169N098N603N850N679M795
$$ plain form
53927 183233 186763 189342 191412 193013 194114 194967 195656 195719 194786 193210 191529 189705 187583 185787 185336 186455
53911 186455 188484 190885 193624 196643 199744 203106 207148 211738 216267 220703 225807 231995 238609 244774
53897 244774 250413 255879 260995 264995 267289 267894 267260 265875 263969 261462 258354 255134 252475 250469 248562
53882 248562 246303 243733 240897 237468 233145 228050 222409 216259 209772 203503 197900 192851 188073 183757
53868 183757 180339 177754 175287 172229 168449 164382 160624 157467 154627 151474 147612 143204 138741 134659
53854 134659 131241 128560 126363 124171 121721 119203 116933 115020 113402 112044 110894 109849 108922 108308 108138
53839 108138 108305 108560 108666 108414 107787 107165 107128 107853 108930 109885 110599 111107 111309 111146 110798 110443 110060 109607 109216
53820 109216 108977 108813 108743 108966 109461 109882 110183 110934 112488 114111 114613 113780 112601 112011 112025 112280 112840 113995
$$ packed form
53927A83233L530K579K070J601J101Q53O89O3r33j576j681j824k122j796m51J119
53911A86455K029K401K739L019L101L362M042M590M529M436N104O188O614O165
53897B44774N639N466N116M000K294O05o34j385j906k507l108l220k659k006j907
53882B48562k259k570k836l429m323n095n641o150o487o269n603n049m778m316
53868A83757l418k585k467l058l780m067l758l157k840l153l862m408m463m082
53854A34659l418k681k197k192k450k518k270j913j618j358j150j045r27o14j70
53839A08138J67K55J06k52o27o22l7P25J077R55P14N08K02j63l48l55l83m53l91
53820A09216k39j64p0K23M95M21L01P51J554J623N02q33j179n90J4K55N60J155
$$ plain form
53802 113995 115598 117119 118340 119591 121224 123175 125213 127436 130249 133843 137953 142196 146473 150849
53788 150849 155160 159023 162236 164968 167489 169857 171984 173834 175510 177175 178992 181027 183192 185272
53774 185272 186948 187808 187540 186324 184907 183963 183459 182840 181727 180081 177889 175210 172515 170380 168702
53759 168702 166803 164580 162884 162320 162222 161534 160407 160104 161319 163231 164460 164417 163478 162207 160847 159432
53743 159432 157982 156450 154615 152249 149405 146485 143937 141944 140497 139636 139381 139421 139169 138292 137029 135880
53727 135880 135140 134767 134483 133814 132318 130011 127466 125277 123511 121875 120308 119160 118792 119157 119746 119860
53711 119860 119052 117479 115871 115050 115410 116708 118227 119200 119360 119190 119439 120325 121455 122605 124234 126906
53695 126906 130440 133959 136739 138761 140475 142241 144026 145517 146441 146833 146994 147266 147973 149497 152084
$$ packed form
53802A13995J603J521J221J251J633J951K038K223K813L594M110M243M277M376
53788A50849M311L863L213K732K521K368K127J850J676J665J817K035K165K080
53774A85272J676Q60k68j216j417r44n04o19j113j646k192k679k695k135j678
53759A68702j899k223j696n64r8o88j127l03J215J912J229m3r39j271j360j415
53743A59432j450j532j835k366k844k920k548j993j447q61k55M0k52q77j263j149
53727A35880p40l73k84o69j496k307k545k189j766j636j567j148l68L65N89J14
53711A19860q08j573j608q21L60J298J519R73J60j70K49Q86J130J150J629K672
53695A26906L534L519K780K022J714J766J785J491R24L92J61K72P07J524K587
$$ plain form
53680 152084 155453 158851 161652 163735 165235 166280 167159 168388 170202 172161 173638 174610 175627 177021 178467
53665 178467 179387 179512 179041 178432 178159 178432 178973 179075 178149 176347 174618 173936 174363 175040 175194 174896 174589 174259
53647 174259 173567 172608 171843 171262 170297 168779 167332 166503 166104 165813 165832 166381 167054 167382 167663 168542 169886 170772
53629 170772 170589 169626 168590 168031 168217 169130 170492 172054 173753 175335 176175 176018 175663 176149 177340 178087 177960
53612 177960 178081 179806 183123 186840 190009 192675 195339 198160 200912 203544 206560 210600 215625 220782
53598 220782 225276 229110 232670 235925 238591 240880 243435 246442 249454 252261 255310 258966 262870 266415
53584 266415 269469 272252 274812 277025 278877 280369 281355 281852 282389 283661 285842 288490 291060 293261 294911
53569 294911 295773 295611 294332 292097 289387 286807 284623 282540 280175 277702 275744 274581 273748 272612 271167
$$ packed form
53680A52084L369L398K801K083J500J045Q79J229J814J959J477R72J017J394J446
53665A78467R20J25m71o09k73K73N41J02r26j802j729o82M27O77J54k98l07l30
53647A74259o92r59p65n81r65j518j447q29l99k91J9N49O73L28K81Q79J344Q86
53629A70772j83r63j036n59J86R13J362J562J699J582Q40j57l55M86J191P47j27
53612A77960J21J725L317L717L169K666K664K821K752K632L016M040N025N157
53598B20782M494L834L560L255K666K289K555L007L012K807L049L656L904L545
53584B66415L054K783K560K213J852J492R86M97N37J272K181K648K570K201J650
53569B94911Q62j62j279k235k710k580k184k083k365k473j958j163q33j136j445
$$ plain form
53554 271167 269982 269406 269175 268960 268953 269532 270452 270859 270298 269331 268889 269269 270079 270944 271818 272727 273686 274999 277175
53535 277175 280331 283904 287147 289791 292121 294577 297437 300769 304531 308742 313544 319033 325066 331384
53521 331384 337961 345059 352899 361446 370599 380526 391653 404300 418267 432821 447286 461747 476986
53508 476986 493582 511288 529540 548265 567755 587969 608576 629748 652314 676839 703001
53497 703001 730130 758034 786926 816791 847201 877687 908001 938067 967837 997234 1026137
53486 1026137 1054498 1082591 1111052 1140576 1171511 1203675 1236520 1269610 1303064 1337376 1372576
53475 1372576 1407744 1441690 1473911 1504418 1532765 1558029 1579954 1599416 1617288 1633372 1646984
53464 1646984 1658261 1668294 1678141 1688203 1698477 1708858 1719076 1728669 1737130 1743884 1748173 1749269
$$ packed form
53554B71167j185n76k31k15pN79R20M07n61r67m42L80Q10Q65Q74R09R59J313K176
53535B77175L156L573L243K644K330K456K860L332L762M211M802N489O033O318
53521C31384O577P098P840Q547R153R927J1127J2647J3967J4554J4465J4461J5239
53508D76986J6596J7706J8252J8725J9490K0214K0607K1172K2566K4525K6162
53497G03001K7129K7904K8892K9865L0410L0486L0314L0066K9770K9397K8903
53486A026137K8361K8093K8461K9524L0935L2164L2845L3090L3454L4312L5200
53475A372576L5168L3946L2221L0507K8347K5264K1925J9462J7872J6084J3612
53464A646984J1277J0033R847J0062J0274J0381J0218R593Q461O754M289J096
$$ plain form
53452 1749269 1746920 1741388 1733025 1721906 1707834 1690574 1670188 1647227 1622491 1596419 1568871 1539722
53440 1539722 1509381 1478402 1446756 1414016 1380285 1346427 1313218 1280621 1248178 1215848 1184091
53429 1184091 1153261 1123225 1093690 1064712 1036739 1010205 985196 961618 939637 919819 902784
53418 902784 888825 877933 870035 865050 862847 863324 866511 872455 881096 892465 906874 924572 945208
53405 945208 968002 992586 1019364 1048847 1080861 1114691 1149839 1186271 1224008 1262867 1302775
53394 1302775 1344070 1387259 1432546 1479816 1529067 1580713 1635433 1693738 1755601 1820355 1887001
53383 1887001 1954837 2023881 2094609 2167270 2241579 2317111 2393692 2471207 2549176 2626844 2703649
53372 2703649 2779348 2853645 2925896 2995281 3061045 3122447 3178650 3228930 3273174 3312104 3346940
$$ packed form
53452A749269k349n532q363j1119j4072j7260k0386k2961k4736k6072k7548k9149
53440A539722l0341l0979l1646l2740l3731l3858l3209l2597l2443l2330l1757
53429A184091l0830l0036k9535k8978k7973k6534k5009k3578k1981j9818j7035
53418I02784j3959j0892p898m985k203M77L187N944Q641J1369J4409J7698K0636
53405I45208K2794K4584K6778K9483L2014L3830L5148L6432L7737L8859L9908
53394A302775M1295M3189M5287M7270M9251N1646N4720N8305O1863O4754O6646
53383A887001O7836O9044P0728P2661P4309P5532P6581P7515P7969P7668P6805
53372B703649P5699P4297P2251O9385O5764O1402N6203N0280M4244L8930L4836
$$ plain form
53361 3346940 3378686 3407617 3433442 3455942 3475294 3491713 3504956 3514392 3519426 3519528 3513860 3501129
53349 3501129 3479875 3448703 3406341 3352003 3286049 3210186 3126853 3038455 2947048 2854250 2761056
53338 2761056 2667880 2575055 2483211 2393025 2304782 2218470 2134188 2052132 1972136 1893548 1815720
53327 1815720 1738656 1663124 1590154 1520314 1453406 1388926 1326872 1267924 1212830 1161829 1114867
53316 1114867 1072116 1034006 1000822 972554 949004 929738 913994 901104 891084 884436 881216 880588
53304 880588 881609 884174 888847 895843 904560 914164 924269 934892 946008 957537 969691 983015 997904
53291 997904 1014319 1032099 1051398 1072577 1095716 1120559 1147039 1175601 1206760 1240388 1275639
53280 1275639 1311668 1348331 1385999 1424676 1463452 1501052 1536912 1571469 1605313 1638373 1670141
$$ packed form
53361C346940L1746K8931K5825K2500J9352J6419J3243R436N034J02n668j2731
53349C501129k1254l1172m2362n4338o5954p5863q3333q8398r1407r2798r3194
53338B761056r3176r2825r1844r0186q8243q6312q4282q2056p9996p8588p7828
53327A815720p7064p5532p2970o9840o6908o4480o2054n8948n5094n1001m6962
53316A114867m2751l8110l3184k8268k3550j9266j5744j2890j0020o648l220o28
53304H80588J021K565M673O996Q717R604J0105J0623J1116J1529J2154J3324J4889
53291I97904J6415J7780J9299K1179K3139K4843K6480K8562L1159L3628L5251
53280A275639L6029L6663L7668L8677L8776L7600L5860L4557L3844L3060L1768
$$ plain form
53269 1670141 1700401 1729216 1756323 1781168 1803758 1825010 1845875 1866418 1886055 1904398 1921327
53258 1921327 1936327 1948302 1956305 1960181 1960251 1956532 1948516 1935741 1918343 1896825 1871323 1841244 1805802
53245 1805802 1764846 1719132 1669930 1618523 1565881 1512401 1457959 1402578 1347201 1293447 1242467
53234 1242467 1194267 1148390 1104866 1064117 1026154 990270 955452 920718 885177 848245 810054
53223 810054 771391 733043 695349 658463 622841 589224 558146 529632 503486 479811 459043
53212 459043 441384 426286 412757 400190 388700 378603 369785 361751 354113 346858 340267 334630 329922
53199 329922 325684 321350 316729 311974 307086 301860 296361 290987 285765 280137 273914 267987 263367 259722
53185 259722 255621 250221 244107 238351 233404 229154 225437 222069 218726 215207 211628 208094 204440 200590
$$ packed form
53269A670141L0260K8815K7107K4845K2590K1252K0865K0543J9637J8343J6929
53258A921327J5000J1975Q003L876P0l719q016j2775j7398k1518k5502l0079l5442
53245A805802m0956m5714m9202n1407n2642n3480n4442n5381n5377n3754n0980
53234A242467m8200m5877m3524m0749l7963l5884l4818l4734l5541l6932l8191
53223H10054l8663l8348l7694l6886l5622l3617l1078k8514k6146k3675k0768
53212D59043j7659j5098j3529j2567j1490j0097q818q034p638p255o591n637m708
53199C29922m238m334m621m755m888n226n499n374n222n628o223n927m620l645
53185B59722m101n400o114n756m947m250l717l368l343l519l579l534l654l850
$$ plain form
53171 200590 197006 194350 192734 191470 189599 186616 182788 178926 175763 173433 171536 169711 167981 166495
53157 166495 165107 163398 161042 158107 155058 152503 150786 149760 149022 148314 147580 146686 145437 143962 142755
53142 142755 142098 141607 140612 138901 136891 135165 134045 133562 133575 133820 133965 133797 133382 133017 132962 133192 133491 133775
53124 133775 134215 134913 135616 135907 135664 135155 134734 134604 134845 135400 136033 136512 136882 137331 137791 137921 137561 137009 136730
53105 136730 136946 137525 138138 138471 138501 138517 138650 138460 137341 135358 133268 131628 130331 129208 128571 128783 129712
53088 129712 131021 132743 135053 137664 140016 142062 144526 148217 153196 158586 162984 165243 165155 163444 161044
53073 161044 158509 156073 153869 151750 149266 146245 143198 140740 138823 136961 134997 133132 131336 129371
53059 129371 127332 125570 124034 122268 120175 118147 116276 114035 111072 107796 104764 101965 99143 96529
$$ packed form
53171B00590l584k656j616j264j871k983l828l862l163k330j897j825j730j486
53157A66495j388j709k356k935l049k555j717j026p38p08p34q94j249j475j207
53142A42755o57m91r95j711k010j726j120m83J3K45J45j68m15l65n5K30K99K84
53124A33775M40O98P03K91k43n09m21j30K41N55O33M79L70M49M60J30l60n52k79
53105A36730K16N79O13L33L0J6J33j90j119j983k090j640j297j123o37K12R29
53088A29712J309J722K310K611K352K046K464L691M979N390M398K259q8j711k400
53073A61044k535k436k204k119k484l021l047k458j917j862j964j865j796j965
53059A29371k039j762j536j766k093k028j871k241k963l276l032k799k822k614
$$ plain form
53045 96529 94739 94060 94147 94365 94192 93464 92394 91177 89595 87426 85325 84608 85694 87274 87635 86381
53029 86381 84235 81601 78338 74819 72073 70549 69543 68311 67088 66455 66235 65725 64752 63816 63181 62442
53013 62442 61096 59229 57428 56225 55749 55761 55906 55980 56086 56545 57621 59203 60678 61234 60518 59055 57818
52996 57818 57338 57382 57505 57563 57569 57412 57133 57222 58182 59746 60918 60896 59706 57942 56254 55237 55372 56581 57954
52977 57954 58336 57381 55873 54933 55061 55994 57230 58448 59445 60020 60037 59536 58691 57740 57056 57113 58182 60029
52959 60029 62028 63586 64456 64757 64895 65365 66348 67466 68167 68445 68950 70220 72021 73619 74586 75171 76008
52942 76008 77618 80120 83198 86422 89715 93392 97640 102105 106228 109860 113250 116482 119197 120931
52928 120931 121501 121030 119812 118245 116690 115264 113827 112174 110159 107674 104668 101285 97851 94628 91623
$$ packed form
53045I6529j790o79Q7K18j73p28j070j217j582k169k101p17J086J580L61j254
53029H6381k146k634l263l519k746j524j006j232j223o33k20n10r73r36o35p39
53013F2442j346j867j801j203m76J2J45P4J06M59J076J582J475N56p16j463j237
52996E7818m80M4J23N8Oj57k79Q9R60J564J172k2j190j764j688j017J35J209J373
52977E7954L82r55j508r40J28R33J236J218R97N75J7n01q45r51o84N7J069J847
52959F0029J999J558Q70L01J38M70R83J118P01K78N05J270J801J598R67N85Q37
52942G6008J610K502L078L224L293L677M248M465M123L632L390L232K715J734
52928A20931N70m71j218j567j555j426j437j653k015k485l006l383l434l223l005
$$ plain form
52913 91623 88646 85574 82567 80057 78347 77180 75912 74199 72326 70628 68919 66843 64586 62761
52899 62761 61667 61091 60825 60869 61080 61167 61133 61224 61266 60657 59317 58064 57555 57327 56486 55032 53845 53476 53527
52880 53527 53260 52382 51188 50250 49991 50308 50640 50641 50625 50996 51458 51347 50682 50308 50814 51805 52434 52300 51592 50716
52860 50716 50038 49751 49708 49602 49477 49805 50787 51855 52234 51914 51719 52394 53860 55427 56547 57249 57939 58850
52842 58850 59786 60422 60833 61536 62961 65020 67338 69716 72140 74368 75862 76278 75863 75190 74573 73950 73321
52825 73321 73007 73332 74214 75325 76580 78201 80245 82366 84216 85894 87749 89859 91915 93585 94832
52810 94832 95915 97179 98791 100522 101875 102530 102570 102161 101209 99593 97574 95615 93821 91871 89541 87003
52794 87003 84598 82577 81060 79896 78529 76398 73705 71438 70364 70224 70114 69466 68404 67329 66485
$$ packed form
52913I1623k977l072l007k510j710j167j268j713j873j698j709k076k257j825
52899F2761j094n76k66M4K11Q7l4R1M2o09j340j253n09k28q41j454j187l69N1
52880E3527k67q78j194r38k59L17L32Jj6L71M62j11o65l74N06R91O29j34p08q76
52860E0716o78k87m3j06j25L28R82J068L79l20j95O75J466J567J120P02O90R11
52842E8850R36O36M11P03J425K059K318K378K424K228J494M16m15o73o17o23o29
52825G3321l14L25Q82J111J255J621K044K121J850J678J855K110K056J670J247
52810I4832J083J264J612J731J353O55M0m09r52j616k019j959j794j950k330k538
52794H7003k405k021j517j164j367k131k693k267j074j40j10o48j062j075q44
$$ plain form
52779 66485 65846 65106 63795 61666 59078 56816 55429 54798 54369 53756 53156 53161 54176 55959 57749 58888 59296
52762 59296 59311 59190 58876 58281 57672 57559 58083 58668 58577 57849 57359 57768 58711 59328 59301 58911 58288 57276 56060
52743 56060 55277 55237 55507 55547 55336 55040 54563 53861 53351 53428 53740 53525 52626 51686 51277 51270 51204 50958 50824 51041 51413
52722 51413 51420 50786 49990 49973 51050 52344 52679 51989 51389 51836 53160 54648 56088 57783 59759 61499 62566
52705 62566 63081 63404 63603 63569 63526 64006 65132 66226 66448 65706 64607 63543 62269 60473 58402 56607 55342
52688 55342 54570 54402 55114 56651 58414 59712 60330 60557 60711 60735 60388 59833 59827 61016 63130 65230 66813 68275
52670 68275 70154 72396 74655 76912 79326 81825 84258 86722 89240 91379 92749 93694 94860 96145 96764
52655 96764 96362 95408 94360 93138 91648 90148 88710 86876 84308 81398 78801 76724 75066 73886 73229
$$ packed form
52779F6485o39p40j311k129k588k262j387o31m29o13o00NJ015J783J790J139M08
52762E9296J5j21l14n95o09j13N24N85r1p28m90M09R43O17k7l90o23j012j216
52743E6060p83m0K70M0k11k96m77p02n10P7L12k15q99r40m09po6k46j34K17L72
52722E1413Po34p96j7J077J294L35o90o00M47J324J488J440J695J976J740J067
52705F2566N15L23J99l4m3M80J126J094K22p42j099j064j274j796k071j795j265
52688E5342p72j68P12J537J763J298O18K27J54K4l47n55oJ189K114K100J583J462
52670F8275J879K242K259K257K414K499K433K464K518K139J370R45J166J285O19
52655I6764m02r54j048j222j490j500j438j834k568k910k597k077j658j180o57
$$ plain form
52640 73229 72713 71778 70298 68612 67092 65942 65247 64907 64679 64576 65006 66141 67405 68001 67822 67430 67271
52623 67271 67346 67587 68049 68664 69191 69452 69362 68780 67674 66347 65133 63953 62642 61655 61772 62987 64184
52606 64184 64244 63088 61438 60020 59269 59444 60528 62121 63738 65081 65966 66256 66115 66047 66395 66998 67550
52589 67550 68021 68429 68513 68092 67518 67298 67310 66861 65585 63912 62557 61876 61772 61917 61980 61873 61922 62596 63935
52570 63935 65384 66241 66193 65478 64697 64454 64939 65796 66537 67007 67313 67454 67374 67303 67597 68187 68614 68800 69331 70693
52550 70693 72524 73995 74715 74929 74962 74866 74604 74267 73979 73728 73358 72703 71817 71060 70827 71154 71825 72931 74958
52531 74958 78055 81479 84162 85675 86278 86231 85523 84320 83137 82442 82336 82715 83396 84019 84189 83959 83815
52514 83815 84020 84296 84415 84709 85480 86196 85936 84718 83772 84132 85372 86150 85792 84825 84002 83404 82782 82340
$$ packed form
52640G3229n16r35j480j686j520j150o95l40k28j03M30J135J264N96j79l92j59
52623F7271P5K41M62O15N27K61r0n82j106j327j214j180j311r87J17J215J197
52606F4184O0j156j650j418p51J75J084J593J617J343Q85K90j41o8L48O03N52
52589F7550M71M08Q4m21n74k20J2m49j276j673j355o81j04J45O3j07M9O74J339
52570F3935J449Q57m8p15p81k43M85Q57P41M70L06J41q0p1K94N90M27J86N31J362
52550G0693J831J471P20K14L3r6k62l37k88k51l70o55q86p57k33L27O71J106K027
52531G4958L097L424K683J513O03m7p08j203j183o95j06L79O81O23J70k30j44
52514H3815K05K76J19K94P71P16k60j218r46L60J240P78l58r67q23n98o22m42
$$ plain form
52496 82340 82567 83410 84116 84059 83327 82305 81086 79635 78314 77757 78166 79006 79483 79160 78138 76861 75799
52479 75799 75113 74595 74015 73475 73231 73268 73354 73515 74088 75097 75866 75532 73930 71842 70400 70250 71152 72285
52461 72285 72980 73198 73288 73452 73694 74149 75042 76205 76971 76811 75849 74629 73633 73211 73676 75066 76888 78362
52443 78362 78936 78502 77346 76069 75325 75331 75699 76039 76487 77335 78278 78554 77891 76867 76194 75989 75954 75963 76128 76463
52423 76463 76791 76998 77171 77462 77891 78373 78837 79300 79789 80269 80696 81065 81314 81181 80389 79101 77994 77622
52405 77622 77781 77808 77473 77232 77481 77930 78060 77989 78467 79913 81756 82933 82927 82126 81290 80910 81090 81698 82393
52386 82393 82685 82329 81665 81302 81449 81824 82226 82843 83803 84798 85444 85804 86213 86766 87374 88196 89561 91307
52368 91307 92630 92811 92023 91274 91588 93172 95244 96689 97043 96838 96907 97544 98480 99461 100393 101051 101184 101002
$$ packed form
52496H2340K27Q43P06n7p32j022j219j451j321n57M09Q40M77l23j022j277j062
52479G5799o86n18n80n40k44L7Q6J61N73J009P69l34j602k088j442j50R02J133
52461G2285O95K18R0J64K42M55Q93J163P66j60r62j220r96m22M65J390J822J474
52443G8362N74m34j156j277p44OL68L40M48Q48R43K76o63j024o73k05l5RJ65L35
52423G6463L28K07J73K91M29M82M64M63M89M80M27L69K49j33p92j288j107l72
52405G7622J59K7l35k41K49M49J30p1M78J446J843J177oq01q36l80J80O08O95
52386H2393K92l56o64l63J47L75M02O17R60R95O46L60M09N53O08Q22J365J746
52368I1307J323J81p88p49L14J584K072J445L54k05O9O37R36R81R32O58J33j82
$$ plain form
52350 101002 101147 101930 102990 103825 104317 104519 104353 103884 103580 103873 104643 105513 106463 107743 109288 110618 111296
52333 111296 111121 109974 107955 105699 104093 103476 103400 103284 103010 102743 102593 102652 102995 103318 102884 101266 98998
52316 98998 97133 96233 96075 96242 96558 96970 97456 98217 99534 101249 102704 103484 103980 104906 106395 107936 109133
52299 109133 110178 111527 113362 115505 117640 119550 121246 122998 125122 127704 130576 133527 136320 138504
52285 138504 139589 139590 139222 139265 139824 140487 141080 141936 143365 145194 147011 148626 150036 151044 151303 150799 150083
52268 150083 149816 150193 150960 151863 152812 153619 153915 153603 153184 153295 153992 154758 155290 155903 156999 158444 159786 160930
52250 160930 162237 163925 165736 167339 168880 170828 173269 175597 177065 177620 177967 178752 179889 180858 181527
52235 181527 182315 183577 185200 187032 189314 192313 195634 198357 199943 200750 201527 202581 203611 204279 204726
$$ packed form
52350A01002J45P83J060Q35M92K02j66m69l04K93P70Q70R50J280J545J330O78
52333A11296j75j147k019k256j606o17p6j16k74k67j50N9L43L23m34j618k268
52316I8998j865r00j58J67L16M12M86P61J317J715J455P80M96R26J489J541J197
52299A09133J045J349J835K143K135J910J696J752K124K582K872K951K793K184
52285A38504J085Jl68M3N59O63N93Q56J429J829J817J615J410J008K59n04p16
52268A50083k67L77P67R03R49Q07K96l12m19J11O97P66N32O13J096J445J342J144
52250A60930J307J688J811J603J541J948K441K328J468N55L47P85J137R69O69
52235A81527P88J262J623J832K282K999L321K723J586Q07P77J054J030O68M47
$$ plain form
52220 204726 205530 207183 209654 212380 214658 216143 217095 218188 219922 222050 223728 224405 224487 224898 226063 227627
52204 227627 229065 230187 230996 231583 232392 234158 237140 240680 243842 246298 248278 249963 251359 252556 253638
52189 253638 254464 255001 255785 257523 260229 263168 265655 267458 268462 268541 267960 267431 267485 268113 269156 270654 272519
52172 272519 274233 275172 275093 274164 272767 271469 270827 270909 271158 270949 270136 268915 267455 265894 264529 263677 263444
52155 263444 263736 264313 264710 264393 263264 261879 260908 260537 260531 260608 260499 259887 258651 257071 255530 254136 252843
52138 252843 251694 250659 249532 248388 247869 248397 249256 249125 247583 245496 243777 242422 241081 239924 239265
52123 239265 238704 237343 234924 232191 230022 228598 227638 227027 226791 226636 225979 224538 222660 220898 219483 218373
52107 218373 217584 217140 216758 216004 214898 214116 214312 215408 216762 217942 219042 220260 221467 222363 222916 223436
$$ packed form
52220B04726Q04J653K471K726K278J485R52J093J734K128J678O77Q2M11J165J564
52204B27627J438J122Q09N87Q09J766K982L540L162K456J980J685J396J197J082
52189B53638Q26N37P84J738K706K939K487J803J004P9n81n29N4O28J043J498J865
52172B72519J714R39p9r29j397j298o42Q2K49k09q13j221j460j561j365q52k33
52155B63444K92N77L97l17j129j385r71l71oP7j09o12j236j580j541j394j293
52138B52843j149j035j127j144n19N28Q59j31j542k087j719j355j341j157o59
52123B39265n61j361k419k733k169j424r60o11k36j55o57j441j878j762j415j110
52107B18373p89m44l82p54j106p82J96J096J354J180J100J218J207Q96N53N20
$$ plain form
52091 223436 224216 225240 226289 227226 228088 228999 230168 231923 234451 237395 240045 242150 244280 247014 250022
52076 250022 252478 254234 255918 257757 259074 259363 259257 259834 261364 263336 265393 267483 269172 269660 268790
52061 268790 267506 266967 267466 268445 269247 269596 269623 269747 270413 271641 272890 273597 273818 274087 274626 274990 274696 273989
52043 273989 273628 273919 274379 274640 275256 277027 279622 281601 282045 281576 281320 281371 280887 279424 277415 275389 273386
52026 273386 271297 269215 267235 265318 263522 261978 260491 258616 256373 254392 253058 251883 250191 248100
52012 248100 246302 245090 244170 243396 243110 243621 244746 246057 247268 248197 248666 248736 248841 249424 250474 251607 252508
$$ packed form
52091B23436P80J024J049R37Q62R11J169J755K528K944K650K105K130K734L008
52076B50022K456J756J684J839J317K89j06N77J530J972K057K090J689M88q70
52061B68790j284n39M99R79Q02L49K7J24O66J228J249P07K21K69N39L64k94p07
52043B73989l61K91M60K61O16J771K595J979M44m69k56N1m84j463k009k026k003
52026B73386k089k082j980j917j796j544j487j875k243j981j334j175j692k091
52012B48100j798j212r20p74k86N11J125J311J211R29M69P0J05N83J050J133R01
$$ [...]
##END NTUPLES=NMR SPECTRUM
##END=
