
##TITLE=AC1252_TOGORS11070_6642121_2JXIggf4cC
##JCAMPDX= 6.0         $$ Bruker NMR JCAMP-DX V2.0
##DATA TYPE= NMR SPECTRUM
##DATA CLASS= NTUPLES
##ORIGIN= BRUKER
##OWNER= Administrator
$$ 1.72 TOPSPIN		Version 2.1
$$ 2012-08-08 16:53:04.031 -0500  Administrator@TOPSPIN
$$ Compression mode = diff/dup
##.OBSERVE FREQUENCY= 400.02188249412
##.OBSERVE NUCLEUS= ^1H
##.ACQUISITION MODE= SIMULTANEOUS (DQD)
##.ACQUISITION SCHEME= undefined
##.AVERAGES= 8
##.DIGITISER RES= 22
##SPECTROMETER/DATA SYSTEM= spect
##.PULSE SEQUENCE= zg30
##.SOLVENT NAME= COFFEE_meoh
##.SHIFT REFERENCE= INTERNAL, COFFEE_meoh, 1, 14.98509
##AUDIT TRAIL= $$ (NUMBER, WHEN, WHO, WHERE, PROCESS, VERSION, WHAT)
$$ ##TITLE= Audit trail, TOPSPIN		Version 2.1
$$ ##JCAMPDX= 5.01
$$ ##ORIGIN= Bruker BioSpin GmbH
$$ ##OWNER= Administrator
$$ $$ C:\Bruker\TOPSPIN/data/COFFEE/nmr/AC1252_TOGORS11070_6642121_2JXIggf4cC/10/pdata/1/auditp.txt
$$ ##AUDIT TRAIL=  $$ (NUMBER, WHEN, WHO, WHERE, PROCESS, VERSION, WHAT)
(   1,<2012-08-08 16:52:56.328 -0500>,<Administrator>,<TOPSPIN>,<go>,<TOPSPIN 2.1>,
      <created by zg
	started at 2012-08-08 16:51:49.718 -0500,
	POWCHK enabled, PULCHK disabled,
       configuration hash MD5:
       6B 1B 68 BB D9 2E 58 E2 7F 35 AD 54 07 DF 0E 41
       data hash MD5: 64K
       AA 98 33 E6 1D AC 75 E9 A7 A4 CD 52 7D 43 D3 23>)
(   2,<2012-08-08 16:52:59.546 -0500>,<Administrator>,<TOPSPIN>,<proc1d>,<TOPSPIN 2.1>,
      <Start of raw data processing
       efp LB = 0 FT_mod = 6 PKNL = 1 PHC0 = 0 PHC1 = 0 SI = 32K 
       data hash MD5: 32K
       09 A9 8F 72 BC 83 14 1F 78 D7 06 5C 00 FD 67 60>)
(   3,<2012-08-08 16:52:59.968 -0500>,<Administrator>,<TOPSPIN>,<proc1d>,<TOPSPIN 2.1>,
      <pk PHC0 = 176.6382 PHC1 = 0 
       data hash MD5: 32K
       33 41 4B 83 37 96 F2 BE 97 4F 9C 4A EB 28 C5 8E>)
(   4,<2012-08-08 16:53:00.031 -0500>,<Administrator>,<TOPSPIN>,<proc1d>,<TOPSPIN 2.1>,
      <abs ABSG = 1 
       data hash MD5: 32K
       7C 81 0C F6 0B 06 71 D7 C2 CB EE EB A9 F1 84 B0>)
(   5,<2012-08-08 16:53:00.078 -0500>,<Administrator>,<TOPSPIN>,<proc1d>,<TOPSPIN 2.1>,
      <abs ABSG = 2 
       data hash MD5: 32K
       9C 87 F8 DF 86 BA A6 93 01 0E 1E CC 39 00 2F F2>)
(   6,<2012-08-08 16:53:00.109 -0500>,<Administrator>,<TOPSPIN>,<proc1d>,<TOPSPIN 2.1>,
      <abs ABSG = 3 
       data hash MD5: 32K
       ED D7 C2 C6 75 4E 0A 6A 8E A4 46 07 9A 26 BE E5>)
(   7,<2012-08-08 16:53:00.140 -0500>,<Administrator>,<TOPSPIN>,<proc1d>,<TOPSPIN 2.1>,
      <abs ABSG = 4 
       data hash MD5: 32K
       9B 4D 84 F9 7D 2A D5 26 B5 75 00 1C E0 7B E2 6B>)
(   8,<2012-08-08 16:53:00.171 -0500>,<Administrator>,<TOPSPIN>,<proc1d>,<TOPSPIN 2.1>,
      <abs ABSG = 5 
       data hash MD5: 32K
       3A 28 17 DE F9 DC 26 6E C3 74 34 4C 22 56 E5 B0>)
$$ ##END=
$$ 
$$ $$ hash MD5
$$ $$ 01 2F 3E F5 36 28 D2 9B 76 0C 35 88 D9 07 AD 8F
##$RELAX= 
##$RELAX= 
##$RELAX= 
##$RELAX= 
##$RELAX= 
##$RELAX= 
##$RELAX= 
$$ Bruker specific parameters
$$ --------------------------
$$ [...]
150 150 150 150 150 150 150 150
##$TP07= 0
##$TPNAME0= <>
##$TPNAME1= <>
##$TPNAME2= <>
##$TPNAME3= <>
##$TPNAME4= <>
##$TPNAME5= <>
##$TPNAME6= <>
##$TPNAME7= <>
##$TPOAL= (0..7)
0.5 0.5 0.5 0.5 0.5 0.5 0.5 0.5
##$TPOFFS= (0..7)
0 0 0 0 0 0 0 0
##$TUNHIN= 0
##$TUNHOUT= 0
##$TUNXOUT= 0
##$USERA1= <user>
##$USERA2= <user>
##$USERA3= <user>
##$USERA4= <user>
##$USERA5= <user>
##$V9= 5
##$VALIST= <valist>
##$VCLIST= <CCCCCCCCCCCCCCC>
##$VD= 0
##$VDLIST= <DDDDDDDDDDDDDDD>
##$VPLIST= <PPPPPPPPPPPPPPP>
##$VTLIST= <TTTTTTTTTTTTTTT>
##$WBST= 1024
##$WBSW= 4
##$XGAIN= (0..3)
0 0 0 0
##$XL= 0
##$YL= 0
##$YMAX_a= 473320
##$YMIN_a= -615040
##$ZGOPTNS= <>
##$ZL1= 120
##$ZL2= 120
##$ZL3= 120
##$ZL4= 120
##$ABSF1= 14.98509
##$ABSF2= -5.573092
##$ABSG= 5
##$ABSL= 3
##$ALPHA= 0
##$AQORDER= 0
##$ASSFAC= 0
##$ASSFACI= 0
##$ASSFACX= 0
##$ASSWID= 0
##$AUNMP= <proc_prof1d_extract_pilot.lims>
##$AXLEFT= 0
##$AXNAME= <>
##$AXNUC= <1H>
##$AXRIGHT= 0
##$AXTYPE= 0
##$AXUNIT= <>
##$AZFE= 0.1
##$AZFW= 0.1
##$BCFW= 0
##$BC_mod= 0
##$BYTORDP= 0
##$COROFFS= 0
##$CY= 15
##$DATMOD= 1
##$DC= 0
##$DFILT= <>
##$DTYPP= 0
##$F1P= 0
##$F2P= 0
##$FCOR= 0.5
##$FTSIZE= 32768
##$FT_mod= 6
##$GAMMA= 0
##$GB= 0
##$INTBC= 1
##$INTSCL= 1
##$ISEN= 128
##$LB= 0
##$LEV0= 0
##$LPBIN= 0
##$MAXI= 10000
##$MC2= 0
##$MEAN= 0
##$ME_mod= 0
##$MI= 0
##$NCOEF= 0
##$NC_proc= -8
##$NLEV= 6
##$NOISF1= 0
##$NOISF2= 0
##$NSP= 0
##$NTH_PI= 0
##$NZP= 0
##$OFFSET= 14.98509
##$PC= 1
##$PHC0= 176.6382
##$PHC1= 0
##$PH_mod= 1
##$PKNL= yes
##$PPARMOD= 0
##$PPDIAG= 0
##$PPIPTYP= 0
##$PPMPNUM= 2147483647
##$PPRESOL= 1
##$PSCAL= 4
##$PSIGN= 0
##$PYNMP= <proc.py>
##$REVERSE= no
##$SF= 400.02
##$SI= 32768
##$SIGF1= 0
##$SIGF2= 0
##$SINO= 400
##$SIOLD= 32768
##$SPECTYP= <>
##$SREGLST= <1H.CDCl3>
##$SSB= 0
##$STSI= 32768
##$STSR= 0
##$SW_p= 8223.68421052631
##$SYMM= 0
##$S_DEV= 0
##$TDeff= 65536
##$TDoff= 0
##$TI= <>
##$TILT= no
##$TM1= 0
##$TM2= 0
##$TOPLEV= 0
##$USERP1= <user>
##$USERP2= <user>
##$USERP3= <user>
##$USERP4= <user>
##$USERP5= <user>
##$WDW= 1
##$XDIM= 32768
##$YMAX_p= 449093957
##$YMIN_p= -662531
##$CURPLOT= <Network HP LaserJet P1505>
##$CURPRIN= <$Network HP LaserJet P1505>
##$DFORMAT= <normdp>
##$LAYOUT= <+/1D_H.xwp>
##$LFORMAT= <normlp>
##$PFORMAT= <normpl>
##$SURQMSG= 1
$$ End of Bruker specific parameters
$$ ---------------------------------
##NTUPLES= NMR SPECTRUM
##VAR_NAME=  FREQUENCY,     SPECTRUM/REAL,   SPECTRUM/IMAG
##SYMBOL=    X,             R,               I
##VAR_TYPE=  INDEPENDENT,   DEPENDENT,       DEPENDENT
##VAR_FORM=  AFFN,          ASDF,            ASDF
##VAR_DIM=   32768,         32768,           32768
##UNITS=     HZ,            ARBITRARY UNITS, ARBITRARY UNITS
##FACTOR=    0.250966925370066, 1,           1
##FIRST=     8223.43324360094, 128913,       -140263
##LAST=      0,             124418,          -137435
##MIN=       0,             -662531,         0
##MAX=       8223.43324360094, 449093957,    0
$$ Real data points
##PAGE= N=1
##DATA TABLE= (X++(R..R)), XYDATA
$$ [...]
19502a4775k66229f2537c0435J765I2240J02100i9499E4567a37108j39059B80999
19490A6246a96224o8656J05469l6670Q3443B11857r7174a85056k3399i3314j72936
19479b66250e8522k43724F3590g8176k638m9614j55055h4577L668L4854H4481
19467a01126H7974a96121B4143J7675c05807a15036K1088r5280G1790c85611A6669
19455B5059b66132O8634M6077F1393a23724J5904k99690a37545q3059E8496c61702
19443B382b15300J7616A05864L5244b88724A551R8710g8178B05311a45244A5028
19431c6685j04035A03715k7184K23766b6358n2089B9537b71173k2057A659K71575
19420B73234e152j22976J541B54500G012a71702A56612a65757A72146g1760H976
$$ plain form
19502 -14775 -281004 -62537 -30435 -28670 92240 194340 -99499 54567 -137108 -276167 280999
19490 16246 -196224 -264880 -159411 -196081 -112638 211857 114683 -185056 -208455 -93314 -266250
19479 -266250 -58522 -302246 63590 -78176 -80814 -130428 -285483 -84577 -80909 -46055 84481
19467 -101126 87974 -196121 24143 41818 -305807 -115036 -93948 -189228 71790 -385611 16669
19455 25059 -266132 -197498 -151421 61393 -123724 -107820 -407510 -137545 -220604 58496 -361702
19443 2382 -215300 -197684 105864 141108 -288724 1551 100261 -78178 205311 -145244 15028
19431 -36685 -140720 103715 76531 300297 -26358 -78447 29537 -271173 -293230 1659 273234
19420 273234 -5152 -128128 -126587 254500 7012 -171702 156612 -165757 172146 -71760 8976
19408a29882L2504e176E783a44697f7762J867c0281o8865I5193h3162M741a3118
19395c94911h3492B0454L7955c70899A26133c05910L0083J2250h9450e877A74291
19383C75675b02708L4112J0302F4134K6846e8159q5008d7042E4248r266b22890
19371a9154r3453r5658a4028m80407a11645A0795b94379B85608a99765P5421M9558
19360g4786A7730a09500A060e5766n2116B1505L0970k0278a42804k01248J24782
19349b19270F6788b18407a01314p2800L1719f6759P535A85011b25164n3250m1494
19338c19908f6612G0876a67435g6248A14125a86130L5510H6507c81216J39471
19328b41745H5717C2530h9866A34281b04428o9491A00228a46072A63712b1923
$$ plain form
19408 -129882 -97378 -5176 5783 -144697 -67762 -65895 -30281 -99146 95193 -83162 -78421 -13118
19395 -394911 -83492 20454 58409 -370899 126133 -305910 -275827 -263577 -89450 -5877 174291
19383 375675 -202708 -168596 -158294 64134 90980 -58159 -143167 -47042 54248 44982 -222890
19371 -19154 -112607 -208265 -14028 -494435 -111645 10795 -294379 285608 -199765 -124344 -74786
19360 -74786 17730 -109500 1060 -55766 -107882 21505 52475 32197 -142804 -344052 -219270
19349 -219270 66788 -218407 -101314 -174114 -142395 -66759 -59224 185011 -225164 -278414 -319908
19338 -319908 -66612 70876 -167435 -76248 114125 -186130 -150620 86507 -381216 -241745
19328 -241745 85717 32530 -89866 134281 -204428 -273919 100228 -146072 163712 -21923
19317b07329d888l85381B45105i3463C0459h7004m03128b39152A08404l8961b57560
19305d0785A3140b99685A66023m1210b82737D0628b71181e0649k59930H3949B875
19293a53815E7958j1579c71250J80881A02533G998P9506O3383a44608C34245a64592
19281b6450j12542k58171a92462a1426C7360e753j54154C9744e85464a06312A99748
19269b8067A31913b16726B22760a11123j15719B99699a04819a1321D4175c6262
19258A149a85182d5675A3677d914C309J07327f1229j09377q1498C0849a94184
19246F2700k7277b91340c4184k37552A50815K4536h6795G7293j0354b3795k14532
19235b38327L8742E8467F255P3480J75004f3676b4835A13566b5329j3483k5598
$$ plain form
19317 -207329 -4888 -390269 245105 -93463 30459 -87004 -490132 -239152 108404 69443 -257560
19305 -40785 13140 -299685 166023 124813 -282737 40628 -271181 -50649 -310579 83949 2875
19293 -153815 57958 46379 -371250 -190369 102533 7998 87504 150887 -144608 334245 -164592
19281 -26450 -138992 -397163 -192462 -11426 37360 -5753 -159907 39744 -585464 -106312 199748
19269 -28067 131913 -216726 222760 -111123 -226842 299699 -104819 -11321 44175 -36262
19258 1149 -185182 -45675 13677 -4914 3309 110636 -61229 -170606 -252104 30849 -194184
19246 62700 35423 -291340 -34184 -271736 150815 175351 -86795 77293 66939 -23795 -238327
19235 -238327 -199585 58467 6255 79735 254739 -63676 -24835 113566 -25329 -38812 -64410
19224f4410k33178A29511O4928a03279j4730g113j35719p8096n8272l7444J07928
19213b08716p2642j43759c0842k38368A9978J79990J03692F7625c35618E8853
19202a75218h2311A76045F0698k9782i1875L8190k31791g3350j79715A2873a9306
19190b44954j77994G8054C5842c1113k62280l894J8726A97538b28253a12811D279
19178C8076J83465O4612g7527j25385A15695K4701a80307f6354j4734A07858f0967
19166D70722a36234d5012j58275j25912G9701P1874b52852a23173k491j98300
19156c23964A60138a86511B5745g4718B18483c05963B02340a45419l1301C20516
19145E8470K0023a33058r2841A78574f0060C31239a98942h2533m4451A51486l2580
$$ plain form
19224 -64410 -297588 129511 194439 -103279 -118009 -7113 -142832 -220928 -279200 -316644 -208716
19213 -208716 -281358 -425117 -30842 -269210 19978 199968 303660 67625 -335618 58853
19202 -175218 -82311 176045 60698 30916 -91875 -53685 -285476 -73350 -253065 12873 -19306
19190 -244954 -422948 78054 35842 -31113 -293393 -297287 -278561 197538 -228253 -112811 4279
19178 38076 221541 286153 -77527 -202912 115695 140396 -180307 -66354 -81088 107858 -60967
19166 470722 -136234 -45012 -203287 -329199 79701 151575 -252852 -123173 -125664 -323964
19156 -323964 160138 -186511 25745 -74718 218483 -305963 202340 -145419 -176720 320516
19145 58470 78493 -133058 -225899 178574 -60060 331239 -198942 -82533 -126984 151486 118906
19134A18906A9294J32901a14602j7702a0828r9876c67C16427e1295r9529e6642
19122c3278j66928E553b61729A79567q1281A6187L9959a26253l8080A9693L44803
19111C64496i6571C65780a05951E3900b23490B15732r9586d29861A83045C3717
19100e26130E3956b69361k4086a40106B54465b86632d0130n7758I0680m3821b01884
19088A07591A6384M9071a87830E9719a12285C23262G454J39907c7021p8318k67350
19077c82689a53369G3966J69153A09320H45h3210H4479J048N0611h6241D7715
19065A84326J26306C784O756i9693l3971k37532J42134a3069j17916r4487Q3512
19054a41960k6349P0992K6239k8555q5374C2876b16074g6075j22427d028j7510
$$ plain form
19134 118906 19294 152195 -114602 -132304 -10828 -110704 -367 316427 -51295 -150824 -56642
19122 -33278 -200206 5553 -261729 179567 98286 16187 56146 -126253 -164333 19693 364496
19111 364496 -96571 365780 -105951 53900 -223490 215732 116146 -429861 183045 33717
19100 -526130 53956 -269361 -293447 -140106 254465 -286632 -40130 -97888 90680 46859 -201884
19088 107591 16384 65455 -187830 59719 -112285 323262 7454 147361 -37021 -115339 -382689
19077 -382689 -153369 73966 243119 109320 845 -83210 84479 85527 136138 -86241 47715
19065 184326 310632 3784 10540 -99693 -133664 -371196 -229062 -13069 -130985 -225472 -141960
19054 -141960 -168309 -97317 -71078 -99633 -185007 32876 -216074 -76075 -198502 -4028 -21538
19043b1538A7687J8576d49229a48562C21710A34417D7860b35246C28318A3841
19032A13797a03987a3282j21963D7380c17634A12560j2825e3433k8442o6920j1125
19021a59920D6173c08060R1524n3668B93784j32047i3330A69654b45695A65989
19010a82764q4959A43098b69461J29005E0946g4168L0623j64525E1280J11714
19000A62994o2233e2324j11089B08696a92891I7055J45257a09651M1077B29665
18989c61685c4540j7541A82392q0473a05691d61D0398b20735a7442C1749J42009
18978A73758J66742h3465r9557D0155b55060A14526J52614N9984j10250A5025
18967A84761b58461B33105C443K23446O2162K28999B47490E1625J32802N3013
$$ plain form
19043 -21538 17687 36263 -449229 -148562 321710 134417 47860 -235246 328318 13841
19032 113797 -103987 -13282 -135245 47380 -317634 112560 99735 -53433 -81875 -148795 -159920
19021 -159920 46173 -308060 -216536 -270204 293784 161737 -93330 169654 -245695 165989
19010 -182764 -267723 143098 -269461 -140456 50946 -74168 -43545 -208070 51280 162994
19000 162994 100761 -52324 -163413 208696 -192891 97055 242312 -109651 -68574 229665
18989 -361685 -34540 -52081 182392 101919 -105691 -461 40398 -220735 -17442 31749 173758
18978 173758 340500 -83465 -183022 40155 -255060 114526 267140 327124 216874 15025
18967 184761 -258461 233105 3443 226889 289051 518050 247490 51625 184427 237440
18957B37440f6559l65376J25510A77374A27b6056H9144c64874I1054b3996B6589
18945i1452K4665B40608n2961D6805M2793c19908A02058C5177a72989A30818a13854
18933A90709c63144B10761a65500A53533D2713J59396D7110J83904c42866C90771
18922b0636E1375a90237B85939g6478c7551o457B03094C5188J7385P6041J13222
18911B41836h2771j9788r0361l4312o398c7571G2566b7612A37274k4476A0964
18899B53126m1371J24667J20360A76721K66164F8589a5081C0072b46685a19295
18888A75523b19019c5206D134b00694M0152E0973a93797B71879d47847h2588F4036
18876c25490a15395K3749A0644K997d40582a36714D9161d8786j71190B8828f5239
$$ plain form
18957 237440 -66559 -431935 -306425 177374 127 -26056 89144 -364874 91054 -23996 26589
18945 -91452 -66787 240608 187647 46805 89598 -319908 102058 35177 -172989 130818 -113854
18933 190709 -363144 210761 -165500 153533 42713 202109 47110 231014 -342866 390771
18922 -20636 51375 -190237 285939 -76478 -37551 -44008 203094 35188 52573 128614 241836
18911 241836 -82771 -102559 -192920 -227232 -233630 -37571 72566 -27612 137274 112798 10964
18899 253126 211755 336422 456782 176721 442885 68589 -15081 30072 -246685 -119295
18888 175523 -219019 -35206 4134 -200694 -160542 50973 -193797 271879 -447847 -82588 64036
18876 -325490 -115395 -91646 10644 13641 -440582 -136714 49161 -48786 -219976 28828 -65239
18864C1855b99977h050F1224R5162a21749A04273L56856k03392D0204J81550Q1287
18853C03041E2955m697b66884G3496N9434d15627B4543a01850r5644p8287A30618
18841b7771k5792B39053c2191l01424A906N337i7633j8039j42164j40208a28202
18829C3109J68130b3461p3992D327a90397L6163k56075A2515a24797j0069l1328
18818a66194k7439f008r699A5401b0707l9314j78867A8834a71841A12664m5444
18807F7220a36182A88537m6713A7188b6533j81108a7429A32304K6767E0984A1182
18795B8287a4888C7906b1554n6368J3312k30277R7633M1968a122k58193j8209
18784b77524n0488o2531J44542B75290A17533P5132a11649k57286E0960d67144
$$ plain form
18864 31855 -299977 -8050 61224 156386 -121749 104273 461129 257737 40204 221754 303041
18853 303041 52955 48258 -266884 73496 132930 -415627 24543 -101850 -197494 -275781 130618
18841 -27771 -53563 239053 -32191 -333615 1906 7243 -97633 -115672 -257836 -398044 -128202
18829 33109 201239 -23461 -97453 4327 -190397 -154234 -410309 12515 -124797 -134866 -166194
18818 -166194 -193633 -6008 -15707 15401 -20707 -60021 -238888 18834 -171841 112664 67220
18807 67220 -136182 188537 141824 17188 -26533 -207641 -17429 132304 159071 50984 11182
18795 28287 -14888 37906 -21554 -77922 -64610 -294887 -197254 -155286 -1122 -259315 -277524
18784 -277524 -328012 -390543 -246001 275290 117533 192665 -111649 -368935 50960 -467144
18773A33187a93088j11650C25384A29549B721J18232b42515F2888g8415C4856
18762c33716A4686J1474b7535j26019A29876c88669A22133f2950A65487J01134
18752B66621C4493N1259f4202A7535b46447R3635l1712B01775a8071n8253B44451
18740H220K03925d3161G3324b70026d2008k9847A50080a49822a5153j50745K9106
18729a36792J4200N8421A2653Q2082J06890a16326k49029C6104J11133a91041
18718I0971J00194b09819H0111K93429G7794a07859C90288d4883k2759D4127a97120
18706D45587A47179d4523E2504c02787h0594C441L3348c12948O2787p997P710
18695b50448A31741a83898l05216a99366A88425H1481a03834k2253A10314b42963
$$ plain form
18773 133187 -193088 -304738 325384 129549 2721 120953 -242515 62888 -78415 34856
18762 -333716 14686 26160 -27535 -153554 129876 -388669 122133 -62950 165487 266621
18752 266621 34493 85752 -64202 17535 -246447 -152812 -184524 201775 -18071 -76324 244451
18740 8220 212145 -43161 73324 -270026 -42008 -71855 150080 -149822 -15153 -165898 -136792
18729 -136792 -122592 -64171 12653 94735 201625 -116326 -365355 36104 147237 -191041
18718 90971 191165 -209819 80111 373540 77794 -107859 390288 -44883 -67642 44127 -197120
18706 445587 147179 -44523 52504 -302787 -80594 3441 36789 -312948 -250161 -258158 -250448
18695 -250448 131741 -183898 -489114 -199366 188425 81481 -103834 -126087 110314 -242963
18684d0885A94734a35747l1955p0220B06824a02014o5693o1003D4169b05249B53408
18672d09847e9736B77130c13769f7495A31940E7784a14752p474q8555D009J15445
18661A19454e07524B27565b5097q7680A34504J26993c08699Q8291R9667j10599
18651b31340N8464C8580j7162g434m10339A52360a90802l3229P8639n740j11670
18640b62802O3102N4751m4387K9054j34823O6277i1528L1327g215A32415c08217
18628c92A52296b9579j70105C9528b68166E1982D034b85529d1804H285R1038C7196
18615F8877g3819k251c4252j05734A0340c94277A54130N990O8754b0048E4329
18603A27901K6381d61099J4106c6122A70239c7821k92154g8722i947l3834m5210
$$ plain form
18684 -40885 194734 -135747 -167702 -237922 206824 -102014 -167707 -228710 44169 -205249 253408
18672 -409847 -59736 277130 -313769 -67495 131940 57784 -114752 -122226 -210781 4009 119454
18661 119454 -507524 227565 -25097 -112777 134504 261497 -308699 -220408 -120741 -231340
18651 -231340 -172876 38580 21418 -7434 -417773 152360 -190802 -224031 -145392 -151132 -262802
18640 -262802 -199700 -144949 -189336 -160282 -295105 -228828 -91528 -60201 -7215 132415 -308217
18628 -392 152296 -29579 -199684 39528 -268166 51982 4034 -285529 -41804 8285 99323 37196
18615 68877 -73819 -76070 -34252 -139986 10340 -394277 154130 160120 228874 -20048 54329
18603 127901 154282 -461099 -446993 -36122 170239 -37821 -329975 -78722 -9947 -43781 -88991
18592h8991j7597A23939C2888C998R1733n845O881a57865D6336P5631a53988N0260
18580a03728A29315a02675B00946c1014A04860b4094k395E9653b70022A45140
18569i1842A03925k4932c31793E1510A6593Q594M9503a46516N5609h818j09653
18558a18471l4145g1200p9597e220l85737F144J65885a36994L4883o6767l7796
18547b06674l8784i0l59187d7277j37248o8548A08845h9644b8659B96238b49474
18535A2876i2633j99379B15302a74825e1917f145B28889r8031k193a24653A4845
18523a04785j48437g7869j80602J4696d5969A33571c90713A07323b68266B32855
18512B85064c10726d7620j29999b4891M415A88937c65790B0434a25328N5075G3064
$$ plain form
18592 -88991 -106588 123939 32888 3998 95731 89886 96767 -157865 46336 121967 -153988 -103728
18580 -103728 129315 -102675 200946 -31014 104860 -24094 -26489 59653 -270022 145140
18569 -91842 103925 78993 -331793 51510 16593 25187 74690 -146516 -90907 -8818 -118471
18558 -118471 -152616 -71200 -150797 -5220 -390957 6144 172029 -136994 -102111 -168878 -206674
18547 -206674 -245458 -90 -359277 -47277 -184525 -253073 108845 -89644 -28659 296238 -249474
18535 12876 -92633 -292012 215302 -174825 -51917 -6145 228889 130858 128665 -124653 14845
18523 -104785 -253222 -77869 -258471 -243775 -45969 133571 -390713 107323 -268266 232855
18512 285064 -310726 -47620 -177619 -24891 -20476 188937 -365790 20434 -125328 -70253 73064
18500a43225a8124H3004g5974n384c9319A47372a29515c189n3659j0318H948a1033
18487b87509b0247B98039b59345F6050J17915g5316A8525R742j572d7945F1325
18475h6488j79155Q4627F9528K34647b48222A62632c32094J01127h9068C7849
18464a38874i031B38661d29715H2201b1443a0372k16399F4348e5809H4499j5375
18453F9124a66031b3540B34322Q6790j01833C5230K9846c2451B69453c72780J22282
18442b50498F7649B3150K16501a94558j828B75906H2769a56325F705b01653j85644
18431c87297h6209L6840B58640b69978C85511a03702d6352A24465h161A85314
18420b9423m7992J3722l6685n5710A7031J78619b55459A43030K66090b5896A99757
$$ plain form
18500 -143225 -18124 83004 -75974 -81358 -39319 147372 -129515 -3189 -56848 -67166 8948 -11033
18487 -287509 -20247 298039 -259345 66050 183965 -75316 18525 28267 26695 -47945 61325
18475 -86488 -265643 -181016 69528 304175 -248222 162632 -332094 -230967 -89068 37849
18464 -138874 -9031 238661 -429715 82201 -21443 -10372 -226771 64348 -55809 84499 69124
18453 69124 -166031 -23540 234322 321112 219279 35230 65076 -32451 269453 -372780 -250498
18442 -250498 67649 23150 239651 -194558 -196386 275906 82769 -156325 6705 -201653 -387297
18431 -387297 -86209 -49369 258640 -269978 385511 -103702 -46352 124465 -8161 185314
18420 -29423 -77415 -63693 -100378 -156088 17031 195650 -255459 143030 409120 -25896 199757
18408b09525l0756H2894M844B5356P0195B055d11548L3539A04003C9339b1299
18396b49716F3825h2267m6018j533B67872g6661D6457K09071a78245D9342a52200
18384c2155j35037E4804O9645a85380m06A0521L99813b1384D44507d12080c6149
18372A65652g7544b6903j50288J4709j9770P2085k25280A05304a14651N0477j05182
18361a69356N1954A05054f2811j9419j90548A24267e8298k64449E3351a02120
18350a05141r0912j3567i1808J8052C9032J66807a08898B78300i0832n70952a97683
18338c778j58530A50981a26403j43872E0664h9747L0920B26764a6687n3283j57584
18327b27554A01545b21471e6077I5978e6172A55544G6262P8218A8540J58070o9685
$$ plain form
18408 -209525 -240281 82894 87738 25356 95551 2055 -411548 -378009 104003 39339 -21299
18396 -249716 63825 -82267 -128285 -129818 267872 -76661 46457 255528 -178245 49342 -152200
18384 -32155 -167192 54804 124449 -185380 -185786 10521 410334 -21384 444507 -412080 -36149
18372 165652 -77544 -26903 -177191 -162482 -182252 -110167 -335447 105304 -114651 -64174 -169356
18361 -169356 -117402 105054 -62811 -82230 -272778 124267 -58298 -322747 53351 -102120
18350 -105141 -196053 -209620 -91808 -73756 39032 205839 -108898 278300 -90832 -661784 -197683
18338 -3778 -162308 150981 -126403 -270275 50664 -89747 -58827 226764 -16687 -69970 -227554
18327 -227554 101545 -221471 -56077 95978 -56172 155544 76262 154480 18540 176610 106925
18316A06925l3598a85499l884K745C12478g1623F1365b40083F8941g67B98995
18304D0164i9918A1870c54465a07135A87059O4453j23446a42312k5774d5276H667
18292F4704b80163k566J38766B01022g7310A78905b25202B5918f0601G7509l3326
18281D4183a26270C7737J50119n3980K53604b67563B1210f4257K8678A5648a60990
18269A07017b45186H2348a32506j31280j81563C780a06906l732b9662a4315A29462
18257h1343j51892i9111L2654B29038B8222a12788A08790M2209a09458A11729
18246a37314K3387k3875A87703j966c28898A32453b19164E2870b50049n6715I2241
18234D9723J03922b16022A66924b2660k10152B92312b07848f2275n2621B08963
$$ plain form
18316 106925 73327 -185499 -189383 -186638 312478 -71623 61365 -240083 68941 -767 298995
18304 40164 -99918 11870 -354465 -107135 187059 251512 128066 -142312 -168086 -45276 8667
18292 64704 -280163 -282729 -143963 201022 -77310 178905 -225202 25918 -60601 77509 44183
18281 44183 -126270 37737 187856 133876 387480 -267563 21210 -64257 -35579 15648 -160990
18269 107017 -245186 82348 -132506 -263786 -445349 3780 -106906 -110638 -29662 -14315 129462
18257 -81343 -233235 -99111 -66457 229038 28222 -112788 108790 150999 -109458 111729
18246 -137314 -113927 -137802 187703 185737 -328898 132453 -219164 52870 -250049 -306764 92241
18234 49723 153645 -216022 166924 -22660 -232812 292312 -207848 -62275 -114896 208963
18223C29244c94323A8355L33408j59949D1256j8270J74359b42540g0835j30147
18213b00982g9125B13514B4969R9826b05023A14498a47124d3207C1691B57P0689
18202G0946k7680a7779m4124G0156P7586m2880d6646A27192f2290A34907E2426
18190E4946a59800L1653B37978A09379B1008H650b34716L2600b9388G9002a4379
18178I6914K6930g3494B6153K42917I9207c95425a3713A9695c55825A23943b38070
18166a99682Q5700C07085h0061k14830J16089B34091j15107M3230n7987a15178
18155b72947B69283c74538D04328F4810e2843B4155m390K3395O7139K3335R3828
18144B27462a01776B79380a35181I4089d42242J70763d355j22968H2081l4286
$$ plain form
18223 329244 -394323 18355 351763 191814 41256 22986 197345 -242540 -70835 -200982
18213 -200982 -79125 213514 24969 124795 -205023 114498 -147124 -43207 31691 257 70946
18202 70946 43266 -17779 -61903 70156 147742 104862 -46646 127192 -62290 134907 52426
18190 54946 -159800 -128147 237978 109379 21008 8650 -234716 -202116 -29388 79002 -14379
18178 96914 123844 -73494 26153 269070 99207 -395425 -13713 19695 -355825 123943 -238070
18166 -199682 -113982 307085 -80061 -294891 -178802 234091 118984 162214 104227 -115178
18155 -272947 269283 -374538 404328 64810 -52843 24155 19765 43160 110299 133634 227462
18144 227462 -101776 279380 -135181 94089 -442242 -271479 -4355 -127323 82081 47795
18134D7795G900h8174K859l7584B38113a79105E0351b77602a19841A17121K24650
18123C41771C2393J8083a1894j13357J5454D9117K87616c5826P417m1013J7144
18112e2278p7E5620a43783c093B14177b26911J08452A81944a50067j2841C9445
18100D6444J3410a5060j7253n6004n9169A12145h2048B84780p3701n3493R0147
18089B47733a09805k7537D41499a40834F0615N7768K13621a73345O9722k9092
18079a32715f650q8776B6416c45178a04081j34735M8073d4195i72A39712d2789
18067A10349b9690k29713H5661a48767D461b4018j98552d6613I8929d6947A17491
18055A31778a63476p4368c1025D6469J20170c78948a32826B04007n6920D2456
$$ plain form
18134 47795 7900 -88174 -85315 -122899 238113 -179105 50351 -277602 -119841 117121 341771
18123 341771 32393 50476 -11894 -125251 -109797 49117 336733 -35826 -28409 -69422 -52278
18112 -52278 -52355 55620 -143783 -3093 214177 -226911 -118459 181944 -150067 -162908 39445
18100 46444 59854 -15060 -32313 -88317 -147486 112145 -82048 284780 211079 157586 247733
18089 247733 -109805 -137342 441499 -140834 60615 118383 332004 -173345 -103623 -132715
18079 -132715 -6650 -95426 26416 -345178 -104081 -238816 -190743 -44195 -972 139712 -42789
18067 110349 -29690 -259403 85661 -148767 4461 -24018 -222570 -46613 98929 -46947 117491
18055 131778 -163476 -237844 -31025 46469 166639 -378948 -132826 204007 147087 42456
18044A87699d6532r4897D458b5848D3052d4835B59705r2899E1795Q3567K5403
18033A60765b82834i8826D4690a39912A55901e5314A01749N1686E7483O053a41263
18021A27523J37945a07995c6927E6722b7674k55218c5233j15053C16554B3333
18010H4691L7062n1482H084a86622C26857h997E0292K57877b6543j64378A86828
17998I2596H253J94299I9222a84802C6801a00298k08945h1291k99149B54888a82176
17986G7957K32955B0606P9012J5260c2220a4186q0597G6572B5880b86276B49185
17974g1066l3162I7709h8278A05618a09603p1795B40720b51776g866B46254I9055
17962B0059K4213j8715N3905b14560B43027B6233M0537J33505e0287I5503J45104
$$ plain form
18044 187699 -46532 -141429 4458 -25848 43052 -44835 259705 166806 51795 135362 160765
18033 160765 -282834 -98826 44690 -139912 155901 -55314 101749 153435 57483 63536 -141263
18021 127523 265468 -107995 -36927 56722 -27674 -282892 -35233 -150286 316554 23333
18010 84691 121753 70271 8084 -186622 326857 -8997 50292 308169 -26543 -190921 186828
17998 92596 8253 202552 99222 -184802 36801 -100298 -309243 -81291 -380440 254888 -182176
17986 77957 310912 20606 99618 114878 -32220 -14186 -94783 76572 25880 -286276 249185
17974 -71066 -104228 97709 -88278 105618 -109603 -181398 240720 -251776 -7866 246254 99055
17962 20059 44272 25557 79462 -214560 243027 26233 66770 200275 -50287 95503 240607
17951B40607C7021K5841b43574B935N6849j7368K04379g3518A97019b640j33628
17940a36268H5799h1601A93910e9669n038b8619C8459L31459A34968B258J80077
17929A82335P906E6065J48970r580a68883k5752B71125a49527B28303a95730p4641
17918b70371A30828N4404c397A46134a93373l8555E1380K3298a2082A00304a2957
17906d9667j38530a4162O431A83944o0239J88898A40241j1770A0408c5397p2942
17895a08339E0927K2891a77012d154D7647g9247G3295P1547J96115a16544c900
17883D12864b25635A87376l1364c96114G8550C5541f949J731I6060C0288J00495
17872A30783O8506a8678l47971P1408B50814a65286d5967E1157R1621E6228b147
$$ plain form
17951 240607 37021 62862 -243574 2935 59784 42416 246795 -73518 197019 -2640 -136268
17940 -136268 85799 -81601 193910 -59669 -64707 -28619 38459 369918 134968 2258 182335
17929 182335 190241 56065 205035 195455 -168883 -194635 271125 -149527 228303 -195730 -270371
17918 -270371 130828 185232 -3397 146134 -193373 -231928 51380 74678 -12082 100304 -12957
17906 -49667 -188197 -14162 -7731 183944 123705 312603 140241 128471 10408 -35397 -108339
17895 -108339 50927 73818 -177012 -4154 47647 -79247 73295 144842 340957 -116544 -3900
17883 412864 -225635 187376 156012 -396114 78550 35541 -6949 -5218 96060 30288 130783
17872 130783 199289 -18678 -366649 -295241 250814 -165286 -45967 51157 142778 56228 -2147
17860B54992b66610j35738A66985P426d0411r1061B2660K27623c9815B42523b316
17848a9063C05773d9029k88106f5589k53521c3566A01345d3774B67283a84973
17837D23655b25996Q6533M8919B14366b91552A42397G637J7415J3331L7519J95701
17826B71603i7062i504j6144n9753q1654b0955A45409b05802C6517L26165j23314
17815B39368J60600b01118e0733o9329A87099b54446H7534J0370R8783a38541
17804G1165g0339a4530B82979A20420a92840A5019J24550a22603C04974E0749
17793d1346p1326B55292E1478O4528l5071i2091L7106p992J9351A66602R406a71337
17780d7776A23853E9367J0961N8689A0637K45587f7951E5970Q7393J2151J54016
$$ plain form
17860 254992 -266610 -402348 166985 174411 -40411 -131472 22660 250283 -39815 242523 -2316
17848 -19063 305773 -49029 -337135 -65589 -319110 -33566 101345 -43774 267283 -184973
17837 423655 -225996 -139463 -90544 214366 -291552 142397 7637 25052 38383 75902 271603
17826 271603 -97062 -9504 -25648 -85401 -167055 -20955 145409 -205802 36517 362682 239368
17815 239368 399968 -201118 -50733 -120062 187099 -254446 87534 97904 196687 -138541
17804 71165 -70339 -14530 282979 120420 -192840 15019 139569 -122603 304974 50749
17793 -41346 -112672 255292 51478 116006 80935 -92091 -54985 -62977 -43626 166602 176008 -171337
17780 -47776 123853 59367 70328 129017 10637 256224 -67951 55970 143363 155514 309530
17769C09530j51357o1866g4938I0015A588J93176L5299A12631a06418A2520L69755
17758C82275h4610L4201A38839n5960C8915M319d0597m088P210o3212A87911A2165
17745E8324K61502a13293N3647G0137f7052C42018a00548B35231c10684A31218
17734i5063B30153p4914l4800B8893M3371M49574c2101B68583a98991A55774m9898
17723A05876D8155a40162l49839a144j18098A42107o7041K69307a25031j1588
17713a36619r0967A47584F7255J91009l2923J18827c5109D8215L36311j81523
17703B03003J74781G5641b8998B42863h879j05566C46749m56K4632B2328h2092
17691I5292o6E62P6016J25013g2147B32779g6769I3225f8434g697l2998A6499
$$ plain form
17769 309530 158173 96307 -74938 90015 1588 194764 230063 112631 -106418 12520 382275
17758 382275 -84610 -50409 138839 82879 38915 43234 -40597 -44685 -37475 -100687 187911 12165
17745 58324 319826 -113293 -59646 70137 -67052 342018 -100548 235231 -310684 131218
17734 -95063 230153 155239 120439 28893 72264 521838 -32101 268583 -198991 155774 105876
17723 105876 48155 -140162 -490001 -1144 -119242 142107 75066 344373 -125031 -136619
17713 -136619 -227586 147584 67255 258264 225341 344168 -35109 48215 384526 203003
17703 203003 377784 75641 -28998 242863 -8879 -114445 346749 346293 370925 22328 -82092
17691 95292 95226 562 76578 201591 -72147 232779 -76769 93225 -68434 -7697 -40695 16499
17678D0339J34978k1780l438o9520A0340d5501A52685J69660A55447K46132C5266
17666A03421B7488K29640b056j45704A39880A1223J50849P0306A06324O1974K8396
17655A96694l8988h3081A07635Q1637f8032c1478o1245j27221B90964A11376J21947
17644B33323j05859K0064P0321i2695M585F9756K59864a7195j76369D9897c72036
17632C55425f1139B22481G2979N1882l443a22939A92186J0731I0459C6178O7818
17621A03996R0321b42826B9851M27725b1131A96251D2239M8576d0028C13867A7684
17609A0329L2013q963E915K18287G7809J77947L5396j24367b30599A71586h051
17597f9586F6306K2063M62539e5045j52808B8072a96771D61025j08281A5524Q6559
$$ plain form
17678 40339 175317 153537 150099 80579 10340 -45501 152685 322345 155447 401579 35266
17666 103421 27488 257128 -2056 -147760 139880 11223 162072 232378 106324 168298 196694
17655 196694 157706 -83081 107635 189272 -68032 -31478 -92723 -219944 290964 111376 233323
17644 233323 127464 147528 217849 -92695 -88110 69756 329620 -17195 -193564 49897 -372036
17632 355425 -61139 222481 72979 124861 121418 -122939 192186 202917 90459 36178 103996
17621 103996 194317 -242826 29851 457576 -21131 196251 42239 90815 -40028 313867 17684
17609 10329 42342 33379 5915 224202 77809 255756 291152 166785 -230599 171586 -8051
17597 -69586 66306 88369 550908 -55045 -207853 28072 -196771 461025 352744 15524 102083
17586A02083K24224J02130A66417A0147K40949C4454K10350a30966E0180J95633
17576B45813L0122j21728B2307K42061a16239C07947J58705A84362b70194A26489
17565i5220j44720H5199J58921r161o9424K9761l957J36108A32003K44691j87741
17554A88953J27112I8347K03877j17873K44036f4759B57100R1910j51004O2082
17544B60088R7q7056J56442l0249J12366A83924K99106j68281i6235C12318r3564
17533B18754k0314j5412O59501C11815j7515E157J44687J49873J37032L32484
17523G69233k71745L22866r3158k54999r1874n6732A07613K98244j4639r0332
17513C00886M59580A24977L36055J55591k02989J02950J19413l16786K28239B7309
$$ plain form
17586 102083 326307 428437 166417 10147 251096 34454 244804 -130966 50180 245813
17576 245813 275935 154207 22307 264368 -116239 307947 466652 184362 -270194 126489
17565 -95220 -239940 85199 244120 234959 165535 195296 191339 327447 132003 376694 188953
17554 188953 316065 98347 302224 184351 428387 -64759 257100 349010 198006 260088
17544 260088 260185 173129 329571 299322 411688 183924 483030 314749 -96235 312318 218754
17533 218754 198440 183028 842529 311815 294300 5157 149844 299717 436749 769233
17523 769233 497488 820354 727196 472197 380323 323591 107613 405857 391218 300886
17513 300886 760466 124977 461032 616623 413634 516584 635997 319211 547450 27309
17502B73462M9043J26182N028Q3994B4753b1648n7748A2843J01190C3364M84599
17491E17963r9420A20734J79991J2011J33279b89187F40875E85J38851R1486r4853
17480A36069L0107K9170K50239A91870k2152q2411K17881D7695J03224Q1887N9920
17469B92726L36839k10506j48602F2087j6528J27258J60854J27716B02978K5810
17459B28788M3702M18157A91157I1991Q0504L15680A29067J94311J35541n8901
17449D00018b3845A71379M69165A30737J43600O5945L48608A0163J19875J93456
17439C23494J68351j69073Q5800k6546P5167J28138A59103J63906J56152B22515
17428A01423M09243B07486l8942J82465h8009C8197L90273A17525L25453A21798
$$ plain form
17502 273462 322505 448687 453715 537709 24753 -21648 -79396 12843 114033 33364 517963
17491 517963 418543 120734 300725 312736 446015 -289187 640875 585 139436 230922 136069
17480 136069 166176 195346 445585 191870 169718 87307 305188 47695 150919 232806 292726
17469 292726 629565 419059 270457 62087 45559 172817 333671 461387 202978 228788
17459 228788 272490 690647 191157 91991 172495 488175 129067 323378 458919 400018
17449 400018 -23845 171379 640544 130737 274337 340282 688890 10163 130038 323494
17439 323494 491845 322772 408572 382026 457193 585331 159103 323009 479161 222515
17428 101423 510666 207486 168544 351009 -88009 38197 428470 117525 442978 121798
17417D41550Q0831A74479J73496j21289L21342B70119L32804m9179C7510L24291
17407C61801P7533A73896J30000n8690O9889J59110q6519j47151J62138E8018
17396C21398A28716K01699m3999D7482K76729j22268L1203K27719k06014J558
17386B56409g435F91457B44720J91398A787L27849r1886f768B19863a44566F14654
17374A20347a52851A04797J63376K34453l5839j87916j10705A7815K78209r1589
17364B04435q6743M2316Q0430c0972B10985a1702C99707j76568n245o6534K98257
17353D49617j20680j53836p3066f7818C55832M0391K63571j99701J18429B83683
17342B92731G1286l2758K01670A14927g5002D65137A26110J01148H7349Q4547
$$ plain form
17417 441550 522381 174479 347975 226686 548028 270119 602923 553744 37510 361801
17407 361801 439334 173896 303896 245206 315095 474205 387686 240535 402673 58018
17396 321398 128716 330415 286416 47482 324211 201943 233146 460865 254851 256409
17386 256409 -7435 691457 244720 436118 1787 329636 237750 -6768 219863 -144566 614654
17374 120347 -152851 104797 268173 502626 466787 278871 168166 17815 296024 204435
17364 204435 117692 160008 240438 -30972 210985 -11702 399707 223139 217894 151360 449617
17353 449617 328937 175101 102035 -67818 355832 396223 659794 460093 578522 283683
17342 292731 71286 38528 240198 114927 -75002 465137 126110 227258 87349 171896
17332A71896J87213J95360B60249J01889m6589L7197n3325K06931r6969A49972
17321I7635J65559a5273C33171j60712J92713m2819j57881N00635j20536k27397
17311C17174P5567Q5135J7510B39521q765L33414c5764C87605a8665A38766K93031
17300D31797k08057J01483J64989A37463b9456B12377n4554p6318L68474m7866
17290D02113o7898K22395A74232m9212J0963d2065G9916L1820L2849K41306J98591
17279E84482m037j94068K88484B70821e9332E21915H0536Q9462J16476o7589J99838
17268D18723K93617k98805j2248J2053m9220F8602P9770J34727j3345r5522J74423
17257C48655J72080J03239M1053A38368o1162N31008p9148L3647j14240J6597
$$ plain form
17332 171896 359109 554469 260249 362138 315549 352746 299421 506352 409383 149972
17321 97635 263194 -15273 333171 172459 365172 322353 164472 665107 544571 317174
17311 317174 392741 477876 495386 239521 230756 564170 -35764 387605 -18665 138766 431797
17300 431797 223740 325223 490212 137463 -29456 212377 157823 81505 449979 402113
17290 402113 334215 556610 174232 125020 135983 -42065 79916 111736 144585 385891 584482
17279 584482 580445 386377 674861 270821 -59332 521915 80536 169998 286474 218885 418723
17268 418723 712340 413535 401287 413340 364120 68602 148372 283099 269754 174232 348655
17257 348655 520735 623974 665027 138368 77206 608214 529066 562713 448473 465070
17247D65070J99665k24656A71622M1059R2319P8689j7383J2295O910J27071K5967
17236E38549j13145A03848M19732j86117n9693B5788R3151f7862B88471R9383
17226C87854J0174j2047D7577J2337N05978j72652L10497C15461J7254L27167
17216F59882A77239J12720J94853j0325D5855L76531K61657l41384K63838k08251
17206C98246j35337L42466B60383J54016A94043M40687p4244m2239r9759Q84E2954
17194D15947r800J07714j64347n0520M25016k67144m2730K03751k53081J47208
17184E12014q5183J26183k66604M5561M28256l09994O7902j22087L9376J116N4217
17173D90757K64462l22691O6020j24690K54214C10238J96654k6010A98574L95893
$$ plain form
17247 465070 664735 440079 171622 212681 305000 383689 366306 378601 385511 512582 538549
17236 538549 425404 103848 523580 337463 277770 25788 118939 -67862 288471 387854
17226 387854 398028 385981 47577 59914 565892 393240 703737 315461 332715 659882
17216 659882 177239 289959 484812 474487 45855 422386 684043 342659 606497 398246
17206 398246 262909 605375 260383 414399 194043 634730 560486 518247 418488 419372 52954
17194 415947 406147 513861 349514 298994 724010 456866 414136 617887 364806 512014
17184 512014 426831 553014 286410 331971 760227 450233 518135 396048 435424 436540 490757
17173 490757 755219 432528 498548 373858 628072 310238 506892 480882 198574 594467
17163E94467B25561q2088K42662J23085J50328p5786P8656j66910K0752j35120
17153C81140L32204k20241j26709K023J45720m7993Q5906B38423M10174k61426
17143C87171K7625K42093j82542K58569k99873Q5803M8142J18933p6028m5999
17133E63894O4054J48111q5161o6307B50064K71038L1829k02964L7179R0697R9110
17122E76953n6287L45397k65451k29064J42714J14075j19119J33547J20123B16689
17111I83357k72046j16539j67194J52548P1553n0933L03475m48961L756L64615
17101H23631O455l57297J82507O3231l0780r9968J00160k53526J94491r4797J91996
17090G26103J32821R9438j20354j4891k79489J65166J75704K20852m14275J45421
$$ plain form
17163 594467 225561 143473 386135 509220 659548 583762 662418 495508 516260 381140
17153 381140 713344 493103 366394 368417 514137 466144 552050 238423 648597 387171
17143 387171 414796 656889 474347 732916 433043 518846 566988 685921 609893 563894
17133 563894 627948 776059 690898 624591 250064 521102 552931 349967 387146 477843 576953
17122 576953 520666 866063 600612 371548 514262 628337 509218 642765 762888 216689
17111 983357 711311 594772 427578 580126 651679 600746 904221 455260 459016 823631
17101 823631 830086 472789 655296 718527 687747 587779 687939 434413 628904 534107 726103
17090 726103 858924 958362 838008 823117 543628 708794 884498 1105350 691075 836496
17080H36496k5738j34901C28620N89850r3994O508j68784N8777Q6337j70868N72530
17069A208976k32173L0120k89197P7928J09386m13049M62289m13482P51675j52079
17059A140394l23668k19752M51828n03327M28944K3942o4081j16616n112J36128
17049I48680j08709l8268K25325k49601r6836K08942Q2436l15026K18962J04820
17039I80725L4728J23588k46302K99173k23232J00371K45645j97007J32285l75164
17029H74810L29255k90371J40882o4822n1482J55823K08321k48205j63966K81542
17019A171787N1243j22654J57080j25262Q0110k66073J64778k62701J56006J32972
17009A137286j4719K72654k66170k41187K43636J62228K62997m30493m4651K26601
$$ plain form
17080 836496 810758 675857 328620 918470 824476 830984 662200 720977 807314 636446 1208976
17069 1208976 976803 1006923 717726 795654 905040 491991 954280 540798 1292473 1140394
17059 1140394 816726 596974 1048802 545475 974419 998361 934280 817664 812552 948680
17049 948680 839971 801703 1027028 777427 680591 889533 971969 656943 875905 980725
17039 980725 1015453 1139041 892739 1191912 968680 1069051 1314696 1117689 1249974 874810
17029 874810 1204065 913694 1054576 989754 938272 1094095 1302416 1054211 890245 1171787
17019 1171787 1223030 1100376 1257456 1132194 1212304 946231 1111009 848308 1004314 1137286
17009 1137286 1122567 1395221 1129051 887864 1131500 1293728 1556725 1126232 1081581 1308182
16999A308182k37445K00214J5019p2627K1140p9802K36295k02994L050J77792
16989A368824L28574m22583J17560M1916j08406j46089Q0502l6967J19850j93228
16979A149953L33778J85333m01051j84809M64000m0631j32258L2531L94613l80888
16969A420571K04332j94050J00758k7944L83362n05418K12513J95038k87518J82222
16959A683866J65950m47717K27601K51444j54903J00136J4633j73284M16957k75341
16949A809342r8916J61051j9802J16405k87106K41282J95617k47495Q9686J8458
16939A978522K12122j90296J72576k31528j06184K74617n5862l03819N85151j4641
16929B320658Q0318j96016M39073n36900K47130k34132K24399j46139J57043P6212
$$ plain form
16999 1308182 1070737 1270951 1285970 1213343 1234483 1154681 1390976 1187982 1191032 1368824
16989 1368824 1697398 1274815 1392375 1434291 1325885 1179796 1260298 1223331 1343181 1149953
16979 1149953 1483731 1669064 1268013 1083204 1547204 1506573 1374315 1406846 1801459 1420571
16969 1420571 1624903 1430853 1531611 1503667 1887029 1381611 1594124 1789162 1501644 1683866
16959 1683866 1849816 1402099 1629700 1881144 1726241 1826377 1841010 1667726 2084683 1809342
16949 1809342 1710426 1871477 1851675 1968080 1680974 1922256 2117873 1870378 1960064 1978522
16939 1978522 2190644 2000348 2172924 1941396 1835212 2109829 2053967 1750148 2335299 2320658
16929 2320658 2400976 2204960 2644033 2107133 2354263 2120131 2344530 2198391 2355434 2431646
16919B431646N41836k54290n23678j41175O00826j11150Q5226j10862J51758M4822
16909B714959k34879M15467n07984O51757p8614j17454l4680K40866n6540K08620
16899C201518n19746K88489j96549L06607m3353O38042n68584K37451l4711k47771
16889C061393K89546J27553J43145k34415K03905j63877K02014j6396k09428M19717
16879C823157l02438K77938L01441J62920m20387L09573L12849k88409M51557
16870D628201j01994j65481N6993J88721k20600J23688J20645M48821j66632l48518
16860D563844L76319o4475J09424L067l5907O77318l39962K57099l01102K79669
16850E525294L06358j63983J38463K98305j84700K52294M1504q837K92552n5682
$$ plain form
16919 2431646 2973482 2719192 2195514 2054339 2655165 2544015 2629241 2518379 2670137 2714959
16909 2714959 2480080 2895547 2387563 3039320 2960706 2843252 2808572 3049438 2992898 3201518
16899 3201518 2681772 2970261 2773712 3080319 3036966 3675008 3106424 3343875 3309164 3061393
16889 3061393 3350939 3478492 3621637 3387222 3591127 3427250 3629264 3612868 3403440 3823157
16879 3823157 3520719 3798657 4100098 4263018 3842631 4152204 4465053 4176644 4628201
16870 4628201 4526207 4360726 4417719 4606440 4385840 4509528 4630173 5078994 4912362 4563844
16860 4563844 4940163 4875688 4985112 4988179 4952272 5629590 5289628 5546727 5245625 5525294
16850 5525294 5831652 5667669 5806132 6104437 5919737 6172031 6213535 6204698 6497250 6441568
16840F441568K30461L16961l82595J96879Q7897K55839K97258l5921J90638k38796
16830G360189O08560j08052K41347J00403J17630M63930J59478k15689K44367
16821H972163K37429J4027J22719K28756N4197K95183M45093l4862M02780K20679
16811A0958164K79082K18400p2702N14814N8641j2076O12277l34364J119895K95498
16801A3637629k76534O74232J87077M00506L39546N87777k63958Q64996K65044
16792A6416315m9164J035775P5658M20982P76642M3295Q40185O6710R94551K36172
16782B0857121L90847R51708M15730N24471R15275M18737M67210O82887O15042
16773B6239028Q60336R28472J054419O02703R56167Q55964P43468J213065O76210
$$ plain form
16840 6441568 6672029 6988990 6606395 6803274 6891171 7147010 7444268 7408347 7598985 7360189
16830 7360189 7968749 7860697 8102044 8202447 8320077 8784007 8943485 8727796 8972163
16821 8972163 9209592 9223619 9346338 9575094 9629291 9924474 10369567 10334705 10737485 10958164
16811 10958164 11237246 11455646 11382944 11897758 11956399 11944323 12556600 12222236 13342131 13637629
16801 13637629 13361095 14035327 14222404 14622910 14962456 15550233 15286275 16151271 16416315
16792 16416315 16367151 17402926 17478584 17899566 18676208 18719503 19559688 19626398 20620949 20857121
16782 20857121 21247968 22199676 22615406 23139877 24055152 24473889 24941099 25623986 26239028
16773 26239028 27099364 28027836 29082255 29684958 30641125 31497089 32240557 33453622 34129832
16764C4129832J458608P33431J227731J548877J275036J321683J046820J679018
16756D4421036J632982J544087J159686J797398J927959J467045J694429K049847
16748E7694469K222479K080564J998448K192712K389764K349142K405260K312350
16740G5645188K645337K108207K783258K645376K356653L060574K616824K111995
16732I5973412K689465K586180K085516K324976K133943K067174J312928J913089
16724A13086683J538914N56433O53133O33372L47765l51726o09833o06191j064845
16715A14183705j285877j697790j361342k204925j811876k600313k739029k322905
16707I8159648k774806k569926k727117l032197k712650k833355k756285k544495
$$ plain form
16764 34129832 35588440 36321871 37549602 39098479 40373515 41695198 42742018 44421036
16756 44421036 46054018 47598105 48757791 50555189 52483148 53950193 55644622 57694469
16748 57694469 59916948 61997512 63995960 66188672 68578436 70927578 73332838 75645188
16740 75645188 78290525 80398732 83181990 85827366 88184019 91244593 93861417 95973412
16732 95973412 98662877 101249057 103334573 105659549 107793492 109860666 111173594 113086683
16724 113086683 114625597 115182030 115835163 116468535 116816300 116464574 115854741 115248550 114183705
16715 114183705 112897828 111200038 109838696 107633771 105821895 103221582 100482553 98159648
16707 98159648 95384842 92814916 90087799 87055602 84342952 81509597 78753312 76208817
16699G6208817k737006k633873k740624k328692k271613k130029k468955k175190
16691E6722835j982692k121350j821241j805693k076006j080801k072085j609354
16683D2153613j437509j323852j347713j246890j242425j483666r47637j157501
16675C1966420j098544r91050j216059n17342p41688j052792q37617o14938p64497
16666B4131893j239031m70045k34735o40278q47127o03697k75962r18931n39664
16657A8362423n25334l74096k13885p68145m24747k21657n36376k28824l16091
16648A4753268q01598l9652m40504k80958k37494l19799o0652l45567l55206m38188
16638A1433650l07364M4502r08749K57332j90395k89682l61662J10192m41024
$$ plain form
16699 76208817 73471811 70837938 68097314 65768622 63497009 61366980 58898025 56722835
16691 56722835 54740143 52618793 50797552 48991859 46915853 45835052 43762967 42153613
16683 42153613 40716104 39392252 38044539 36797649 35555224 34071558 33123921 31966420
16675 31966420 30867876 29876826 28660767 28143425 27401737 26348945 25511328 24896390 24131893
16666 24131893 22892862 22422817 22188082 21547804 20700677 20096980 19821018 18902087 18362423
16657 18362423 17837089 17462993 17249108 16480963 16056216 15834559 15298183 15069359 14753268
16648 14753268 13951670 13912018 13471514 13190556 12953062 12633263 12572611 12227044 11871838 11433650
16638 11433650 11126286 11170788 10262039 10519371 10328976 10039294 9677632 9787824 9346800
16629I346800J04867n46797j79430K23544n74364K88694m87461p2032j62811k94464
16619G646546j13902k30738l6601j67663q737l26468J28544j17088k78643j8331
16609F476919j26232J30873n66101j13915Q724K02980K4349m15564j87059o8137
16599E366837J54313m65097m1742L61087k44232k55664J20613l39123K6710J59300
16589D843002n49402r8349J57181r7857M7330M0249p3806k48447J79127m24913
16579C774115K08783N6253k7088j35878J69985l02010J147m9815K66567m36103
16569C525956P2563m25611L10631k40962J09261j13062N8421l79176L24836l3885
16559C208972k01694N81182o37681J79258k20013O9576l03150K71147m917j66073
$$ plain form
16629 9346800 9451667 8904870 8725440 8948984 8374620 8663314 8175853 8103821 7941010 7646546
16619 7646546 7532644 7301906 7265305 7097642 7088905 6762437 6890981 6773893 6495250 6476919
16609 6476919 6350687 6481560 5915459 5801544 5810268 6013248 6037597 5622033 5434974 5366837
16599 5366837 5521150 5056053 5014311 5375398 5131166 4875502 4996115 4656992 4683702 4843002
16589 4843002 4293600 4195251 4352432 4254575 4301905 4342154 4268348 4019901 4199028 3774115
16579 3774115 3982898 4039151 4012063 3876185 4046170 3744160 3745307 3695492 3962059 3525956
16569 3525956 3598519 3172908 3483539 3242577 3351838 3238776 3297197 2918021 3242857 3208972
16559 3208972 3007278 3588460 2950779 3130037 2910024 2979600 2676450 2947597 2942680 2776607
16549B776607o2105j05728J93910j99778k12903Q6680l16546M33864o5928m68902
16539B059171R0796K21154J46965j74666j90037O8913L4366J2158k43108J40919
16529B166631J81973k86726J00419Q0397k73990k2373j43425M18492l90250K1760
16519A852908J96144n0232l041k14079O6700j42672J95642n0333m35865O03862
16509B019034k32159m1077l2929L13196k33177l26750P8110O1607m51761M46158
16499A600252J27923j46560j12077P3659k73582k7954L38702j76228l21683L75239
16489A457691K34800R015l00516R2247M7806q9494k15166J67970J34540k45522
16479A293371K65005l52643L5730j77528K73832n4626q2543q0294K13920K09251
$$ plain form
16549 2776607 2714502 2608774 2802684 2602906 2390003 2476683 2160137 2594001 2528073 2059171
16539 2059171 2149967 2371121 2518086 2343420 2153383 2222296 2256662 2268820 2025712 2166631
16529 2166631 2348604 2061878 2162297 2242694 1968704 1946331 1802906 2221398 1831148 1852908
16519 1852908 2049052 1998820 1995779 1781700 1848400 1705728 1901370 1851037 1415172 2019034
16509 2019034 1786875 1745798 1712869 2026065 1792888 1466138 1544248 1605855 1154094 1600252
16499 1600252 1728175 1581615 1469538 1543197 1269615 1241661 1580363 1404135 1082452 1457691
16489 1457691 1692491 1701506 1400990 1493237 1541043 1451549 1236383 1404353 1538893 1293371
16479 1293371 1558376 1205733 1241463 1063935 1337767 1283141 1200598 1120304 1334224 1543475
16469A543475m98750L2125J62725J28337J31475l53392l81315O10069n90850M54451
16459A238350j05492p6389J04059n5078Q5879k44482J01948j19059L46173k16061
16449A059848l96324K01471M6964o4839J32104j53746K25767l58984J64074R3732
16439I50067J33989k61633j08924Q9021O1492J05053Q7587l28469K11777j65908
16429G74052J41103j30022L72978k27207r013j27265r6598n9321K08115O7636
16419I14458l2910J71194j17134k37208J07294M3097j47280J74785k17215L65586
16409A024667j66504n946r2604J18696k38114J78852k92716L07632j36817j97429
16399D99717p8050J26062l5680L03131l14813R8829K93512l63196M9673r5371
$$ plain form
16469 1543475 1044725 1076850 1239575 1367912 1499387 1145995 764680 1374749 783899 1238350
16459 1238350 1132858 1056469 1160528 1105450 1191329 946847 1048795 929736 1275909 1059848
16449 1059848 663524 864995 911959 847120 979224 825478 1051245 692261 856335 950067
16439 950067 1084056 822423 713499 802520 864012 969065 1056652 728183 939960 774052
16429 774052 915155 785133 1158111 930904 921891 794626 698028 638707 846822 914458
16419 914458 881548 1052742 935608 698400 805694 848791 701511 876296 659081 1024667
16409 1024667 858163 852217 759613 878309 640195 819047 526331 833963 697146 499717
16399 499717 421667 547729 512049 815180 500367 599196 892708 529512 579185 483814
16389D83814q7223K84626K33407C04207M64948j8072J86543k43732j49896L17008
16379H61006k09172k87697M90459N4345l53941J37307k33747O2666R2757j69178
16369D44805k7146K82L42575J7807J915l29982N1295K9607M5533o0426J18702
16358F34967o0964o7308P1694J7845n7717P495l4993N4841m72B35847L15549j46049
16346D05347J6067K65903k56439J39537J20882k36512j32333j22108K77759o30
16336D77473p4627o0108L85512j95969N136j57453K5013O0785q6427J06935A85825
16324E80961J58063B24736J01350J81492j12785A20372K46470K58883C02136J03209
16314D05345K949J55669l7150K0117R5387k26011k1246P8144o8727m1154N6715
$$ plain form
16389 483814 396591 681217 914624 304207 769155 751083 937626 693894 543998 861006
16379 861006 651834 364137 854596 908941 555000 692307 458560 521226 613983 444805
16369 444805 417659 417941 760516 778323 780238 450256 501551 531158 576691 516265 634967
16358 634967 574003 506695 578389 596234 538517 546012 511019 565860 565388 235847 551396 405347
16346 405347 421414 687317 430878 570415 691297 454785 322452 200344 478103 477473
16336 477473 402846 342738 728250 532281 537417 379964 404977 465762 379335 486270 185825
16324 580961 739024 224736 326086 507578 394793 120372 366842 625725 302136 405345
16314 405345 408294 563963 526813 546930 642317 416306 395060 473204 404477 363323 420038
16303D20038r3498K24217k64416J6047J96278B30543a9435F06399k64873J07291
16293D48817k3174H9304D3861M32587j81321K95547k10032M1801I7632O9043l0544
16282A36131O2919O701K21141j18544J25377r0764Q6325A55909G3819L24936A54502
16270B79669P5071K08589A62303P6516K56700n6171A64064p1365j059K73948j1962
16259C53626J22893A21539J00104J56801Q165O4021F1190R5632J40934D4755K77819
16248C22574B408J02172M19362A25915m4909K22787b8276C10976a11400A80695
16237B99615j24519N3266B5675M48851M6266k52142M3500F6630K34834A50261
16226F1474J79351g2966A52759J34075A15934B3770L74048A39933l797F3801j9184
$$ plain form
16303 420038 326540 550757 286341 302388 498666 230543 -19435 606399 341526 448817
16293 448817 425643 89304 43861 476448 295127 590674 380642 422443 97632 166675 136131
16282 136131 199050 205751 426892 308348 433725 342961 429286 155909 73819 398755 154502
16270 279669 354740 563329 162303 238819 495519 439348 164064 92699 91640 365588 353626
16259 353626 476519 121539 221643 378444 386609 450630 61190 156822 297756 44755 322574
16248 322574 2408 104580 523942 125915 81006 303793 -28276 310976 -111400 180695
16237 299615 175096 228362 25675 474526 520792 268650 312150 66630 301464 150261
16226 61474 240825 -72966 152759 286834 115934 23770 397818 139933 136136 63801 44617
16215D4617e2523H3317J44768r7859o0320L82100a3498B62582j19513K46959L07099
16204F97127B8532J46090B1364M45107A38126J66407J44011k17378j04078n330
16194A21758K85725A01967a4254A27595K78895B02014j8758g1459C3583K12434
16184B46017q7370K0016R0664m7597j02346J0798I826K42402D2356M09140k05446
16173B46050P9598f8690A92037m2876Q6708J25638A45520J6844g4534B14009E0467
16161A18059R5148q3763K02952p6372c6269H5894K19014r2281e8274G5586J91589
16150B67175P365n4685j6968H5925A3112K11923C9123A2537J70207B1546M00282
16139D21828H9066J88046A9430K51459m605g8138j09598A25431j852J16665f5447
$$ plain form
16215 44617 -52523 83317 228085 130226 69906 452006 -13498 262582 143069 390028 697127
16204 697127 28532 174622 21364 466471 138126 304533 448544 231166 127088 121758
16194 121758 407483 101967 -14254 127595 406490 202014 183256 -71459 33583 246017
16184 246017 158647 178663 269327 221730 119384 130182 9826 252228 42356 451496 246050
16173 246050 325648 -68690 192037 149161 235869 361507 145520 162364 -74534 214009 50467
16161 118059 213207 129444 332396 256024 -36269 85894 304908 212627 -58274 75586 267175
16150 267175 274540 219855 202887 85925 13112 225035 39123 12537 182744 21546 421828
16139 421828 89066 277112 19430 270889 266284 -78138 -187736 125431 123579 240244 -65447
16127e2507B26026N4457c46846D9648O041P6466c0072j35339B07625a66155F9130
16115E0892i2608D7187K76023J03433R765j60916b02329N1620e4753C8027K13401
16104B51428J47538j6409A25384i1506E8681J01179J49973A41795k3549a88946
16093D14549H7510b8240B5026a4375A62858m4658C2485J66771a06618I5569d3763
16081A78878E4596k3797b0609D66992a10469n0161j79809C59126k3229A11761
16070A42657e8247o1881A24661a67243o09B11510D872K11049A526N552J65346
16059A72424A169a52773I7262K50595g2486k86456A97219D3023O0225L0823a03332
16047b5916A67257a42695H3605q81I154K01597d1500J3039l32087b909m0035J2999
$$ plain form
16127 -52507 226026 280483 -346846 49648 55689 132155 -30072 -165411 207625 -166155 69130
16115 50892 -92608 47187 323210 426643 436408 275492 -202329 -150709 -54753 38027 251428
16104 251428 398966 382557 125384 -91506 58681 159860 309833 141795 118246 -188946
16093 414549 87510 -28240 25026 -14375 162858 118200 32485 199256 -106618 95569 -43763
16081 178878 54596 30799 -20609 466992 -110469 -160630 -340439 359126 335897 111761
16070 142657 -58247 -120128 124661 -167243 -167852 211510 4872 215921 1526 7078 172424
16059 172424 1169 -152773 97262 347857 -72486 -358942 197219 43023 103248 134071 -103332
16047 -25916 167257 -142695 83605 82724 9154 210751 -41500 -28461 -360548 -2909 -42944 -29945
16035b9945j58986A97256k3871b78144a00304d2787j09873N2935B97886h3570
16024E6050L77478b32761j1796F7094a87508e5570k02985H1949N385c1736I3025
16012A64680P3221j14661d0537j04040D4544K44960f1396D3382J66149A03073
16001A77164b11576B22535C1756I473J0315J22126P2253g86A99999m4986J67506
15990C22519a37147g298B20651f0027A10645A1842f7579A04243L3115K0322L41277
15979D98957K27831k30228n2489J05292M17953m37527k597A04613j9580m460j2157
15968F8416b10318d6619A17748b20913I3667Q7894C5266K07786j20695b82740
15957A81894e3664A06227Q6602L20293a98042A22870n7677L1262a30745K1407
$$ plain form
16035 -29945 -188931 197256 173385 -278144 -100304 -42787 -152660 -99725 297886 -83570
16024 56050 433528 -232761 -244557 67094 -187508 -55570 -258555 81949 87334 -31736 93025
16012 164680 237901 123240 -40537 -144577 44544 289504 -61396 43382 209531 103073
16001 177164 -211576 222535 31756 9473 19788 141914 214167 -786 199999 155013 322519
15990 322519 -137147 -7298 220651 -60027 110645 11842 -67579 104243 137358 157680 498957
15979 498957 726788 496560 444071 549363 967316 529789 527192 104613 85033 80573 68416
15968 68416 -210318 -46619 117748 -220913 93667 181561 35266 243052 122357 -282740
15957 181894 -53664 106227 192829 513122 -198042 122870 65193 96455 -130745 -109338
15947a09338i282D12544i2446G2685J33461D1988b7486A48130b27722i2486j95322
15936b87808D4095i8198B50108D2542a86155B7805i7750D37326j82399A6246P343
15925B3589a4868o0534c4626C9435f3786B5843L8005a67250A34039a69116B55252
15913I1871J35347I0257f0354B18217D2073J27031b58801i2322a4059k95007a48091
15901D5003i285E2866c149A47967l8632a4895D7854K13421k9039a36971A58744
15889B3420b375m9982J6893G571Q0721J61518c37400M0244J00009E177b8475j62791
15877a91266c8511j3309A00512a87115R706m3161R8445M9790a6563O352K456k63398
15865b71153A01171G453a3293p9211j19950p1408a24518K9465H6311k0721a46397
$$ plain form
15947 -109338 -9282 412544 -92446 72685 206146 41988 -27486 148130 -227722 -92486 -287808
15936 -287808 44095 -98198 250108 42542 -186155 27805 -97750 437326 254927 16246 23589
15925 23589 -14868 -75402 -34626 39435 -63786 25843 63848 -167250 134039 -169116 255252
15913 91871 227218 90257 -60354 218217 42073 169104 -258801 -92322 -14059 -309066 -148091
15901 45003 -9285 52866 -3149 147967 109335 -14895 47854 261275 232236 -136971 158744
15889 23420 -2375 -52357 -35464 7571 88292 249810 -337400 -297156 -197147 5177 -28475 -191266
15877 -191266 -38511 -51820 100512 -187115 -177409 -220570 -122125 -72335 -16563 -10211 -7755 -271153
15865 -271153 101171 7453 -13293 -92504 -212454 -283862 -124518 -95053 86311 65590 -146397
15853a0966j66716i722l02774c2840j4913R867B22228j05764a047j03692F8881
15841I8100a68122B45512k1432g7451A21704L7514D4828a4759n8737j80213B28650
15829A95849O974K33195D627K21213c4536A31959E5140i2975E5612a41389j59463
15818c00852G8768a10087j66540a14204j3356K5136B14332C3263a47636H6904
15807E7623b11316R7826A6809M4159a86386k2845M3947j29082I6383C7838a72206
15795b51756A33999O5471B9708O9412a65861j46136E3750e6887A65197Q2213a28162
15783B25582c35901M5734a05346B35356A16222L862c36655a53450O358j44282
15773b91374A0642a68796c4942A46487J920c42755a7630A37366a98927B01202
$$ plain form
15853 -10966 -177682 -9722 -312496 -32840 -47753 -37886 222228 116464 -1047 -104739 68881
15841 98100 -168122 245512 224080 -77451 121704 159218 44828 -14759 -73496 -253709 228650
15829 195849 202823 436018 4627 225840 -34536 131959 55140 -92975 55612 -141389 -300852
15818 -300852 78768 -110087 -276627 -114204 -127560 -102424 214332 33263 -147636 86904
15807 57623 -211316 -113490 16809 60968 -186386 -209231 -165284 -294366 96383 37838 -172206
15795 -251756 133999 199470 29708 99120 -165861 -311997 53750 -56887 165197 247410 -128162
15783 225582 -335901 -290167 -105346 235356 116222 120084 -336655 -153450 -147092 -291374
15773 -291374 10642 -168796 -34942 146487 148407 -342755 -17630 137366 -198927 201202
15762A38060C643N5033g004q5408c0439m544j39421i246o1516C26561E9707b7725
15749i9770A04710b69429A50947G2845d5352A35278l167J38813C9310K09495b14588
15737A71836D7016e0673A70386a46363C7727a12501C5936f0749D1366J60555d0265
15725a16433B9092c28386A77855e6618j71100A81025R8007H2163b77930P9980
15715a97950C9556A424c16144a01039D4693j0780a15576A31404h9045G4386d5987
15703d9376j46342i0455A13134l1726K70459a64872d9487k04403h0929B08529
15692h9741a3526A33743c94704a24138D547a80037F343K70246A8776a0765A68104
15680a40163j33777e4025K654m53564B0506J06885E6736a10863G0719a23938m8800
$$ plain form
15762 138060 3643 58676 -7004 -92412 -30439 -34983 -174404 -9246 -70762 326561 59707 -27725
15749 -99770 104710 -269429 150947 72845 -45352 135278 132111 270924 39310 248805 -214588
15737 171836 47016 -50673 170386 -146363 37727 -112501 35936 -60749 41366 201921 -40265
15725 -116433 29092 -328386 177855 -56618 -227718 181025 279032 82163 -277930 -197950
15715 -197950 39556 1424 -316144 -101039 44693 33913 -115576 131404 -89045 74386 -45987
15703 -49376 -195718 -90455 113134 81408 351867 -164872 -49487 -253890 -80929 208529
15692 -89741 -13526 133743 -394704 -124138 4547 -180037 6343 276589 18776 -10765 168104
15680 -140163 -273940 -54025 -51371 -504935 20506 127391 56736 -110863 70719 -123938 -172738
15669a72738h2286B13181D20d53647A47352g8621N197k10586A13663j02j3354
15658A00207a08626Q934p6331B50515E3212a00380n1882A11188a33552i618A01726
15646B5981K9681a31984B8470b99236F426K03733n6199a09165A04429c44870i5469
15634A50427d3688n8533l5738a4730B31388a09381j28214a06237A22650c7554
15623A54554J5687h9911a9464j99858B13890a31724e2149m0019M0442k71699C9723
15611A7419N133O9556k9393J4793c12097a9756H6721l3607f3276G1080D473J8507
15599B2980g0271k62263h6158A42562f4718E7439P6203o4522O8745M6782h3270
15587c96865g0173E0778c16938a36952A31365a41082f1300B36810h3648n1467
$$ plain form
15669 -172738 -82286 213181 420 -453647 147352 -78621 -73424 -284010 113663 113561 100207
15658 100207 -108626 -99692 -176023 250515 53212 -100380 -152262 111188 -133552 -9618 101726
15646 25981 55662 -131984 28470 -299236 6426 210159 153960 -109165 104429 -344870 -95469
15634 150427 -43688 -102221 -137959 -14730 231388 -109381 -237595 -106237 122650 -37554
15623 154554 170241 -89911 -19464 -219322 213890 -131724 -52149 -92168 -51726 -323425 39723
15611 17419 22552 92108 62715 77508 -312097 -19756 86721 53114 -63276 71080 4473 22980
15599 22980 -70271 -332534 -86158 142562 -64718 57439 133642 69120 137865 184647 -83270
15587 -396865 -70173 50778 -316938 -136952 131365 -141082 -61300 236810 -83648 -135115
15577a35115b5706j54910C4300a32319A03736b69244A72797R277a46280A93732
15566c79234f6255k04029B36885l8886f7909Q824C41004I6077A212J48470c2765
15554b26966d1200l11292a18672j14073O1699A36471C4822c7738A04050J45928
15544B49978M8334c8486p880J5447F051d6147j71848A90315L710G2679b9253A15229
15531A83474d2771C67629G1289i7857A8779e9291N401B48788R0621o8839K62816
15520E33386k20771j25357K23184A56229J92813A55884K23220A53511L48382A18729
15509B13955J90332d82592D10905a66890A42023K1721l908C0353h4458A52767
15498D12477j35318a09178A97217c307G7206L5409b49478A35580e459m0787f868
$$ plain form
15577 -135115 -25706 -180616 34300 -132319 103736 -269244 172797 182074 -146280 193732
15566 -379234 -66255 -270284 236885 197999 -67909 -59085 341004 96077 1212 149682 -32765
15554 -226966 -41200 -352492 -118672 -232745 -171046 136471 34822 -37738 104050 249978
15544 249978 298312 -38486 -46366 -30919 6051 -46147 -217995 190315 194025 72679 -29253 115229
15531 183474 -42771 367629 71289 -97857 18779 -59291 -53890 248788 339409 270570 533386
15520 533386 312615 187258 410442 156229 349042 155884 379104 153511 501893 118729
15509 213955 404287 -482592 410905 -166890 142023 163744 159836 30353 -84458 152767
15498 412477 277159 -109178 197217 -3307 77206 112615 -249478 135580 -5459 -46246 -6868
15486B88166e218j2967l6232A57158d4124B70424G1367M6745J8604I741O1503
15475G1244O9129R3739K69983B19843L33739B21372H6022J10039C6267d0935p4661
15464a15596R383D6827J52357a40214M2277D4473c10948C4623J87177a65226f3296
15452a89798A48081O5689P029p8595K6299q2612b5704a2047D03517m403c1266
15440C18181M13277k70918e4061G25210A65540D4722J73806L0862j6268a71658
15429b14391f6571F6350J14278M8774b75172h7495B22346b4847m9730l32396A55690
15417b71650a16042A32698b56152A64568D1843a32151B28828F9784M1581a60490
15406C53229a29173K2869f819C3486f6149J5037B38031B501b74580I4788A1149
$$ plain form
15486 288166 -5218 -18185 -54417 157158 -44124 270424 71367 118112 136716 9741 71244
15475 71244 140373 234112 504095 219843 553582 221372 86022 196061 36267 -40935 -115596
15464 -115596 -106213 46827 199184 -140214 -97937 44473 -310948 34623 221800 -165226 -63296
15452 -189798 148081 213770 220799 142204 168503 85891 -25704 -12047 403517 399114 -31266
15440 318181 731458 460540 -54061 725210 165540 44722 218528 249390 233122 -171658
15429 -214391 -66571 66350 180628 229402 -275172 -87495 222346 -24847 -74577 -406973 155690
15417 -271650 -116042 132698 -256152 164568 41843 -132151 228828 69784 111365 -160490
15406 353229 -129173 -106304 -6819 33486 -66149 -51112 238031 2501 -274580 94788 11149
15394A66480a25515M3933C7695b8342D55863b51123g5081j98034B41268D5887
15383i3377k43601A00341D6625a50548N8652d2149I2913b18783B80646c5918j17636
15372a53554C31062K0446A00675J36692C3832J5288K99705A805a9762A10156M0268
15361A50424D6555J35402q9435K08711A11568E3296J02650j2870j9146l4115k9354
15350F0461a17394G8663j6307e9140A95665H421M0571L72173j87366M3091j15508
15339A61382B1330J01490a5189A39467J0167E0645K47454a24083J6819B63036
15328A59552b79881a19537C25898m5854A04461a75933M0965A16073b819F1544
15317g2627A43274J34413i7250A18703E9175b7940A70258b82653J08186L4086
$$ plain form
15394 166480 -125515 -81582 37695 -28342 455863 -251123 -75081 -273115 241268 45887
15383 -93377 -336978 100341 46625 -150548 -91896 -42149 92913 -218783 280646 -35918 -153554
15372 -153554 331062 351508 100675 237367 33832 49120 348825 1805 -19762 110156 150424
15361 150424 46555 181957 92522 301233 111568 53296 155946 143076 123930 89815 60461
15350 60461 -117394 78663 62356 -59140 195665 8421 48992 421165 233799 276890 161382
15339 161382 21330 122820 -15189 139467 149634 50645 298099 -124083 -107264 263036
15328 159552 -279881 -119537 325898 280044 104461 -175933 -134968 116073 -2819 61544
15317 -72627 143274 277687 -97250 118703 59175 -27940 170258 -282653 -174467 -140381
15307a40381N3850b0822B33667E8651d7451A42285j535Q1670q9436K0663Q0974
15296B34621a46461G6554J68815A5422j538K27228a4888j1334A75989M145a19328
15284A27214M3294K09922B5166L18298b0736I2045k6553b71577A7596K23549B9556
15272C54125c5422A57887A7457J09426c13046A59106L01F6512J11413q852C9434
15260A63684c64138a74262B96743A36203b14486P9727A3486h6522C54792a2214
15249H5236J11627j1907l500o87b08687a704B37614r5004f5493B66658A05220
15237A86337d8442B86681J65082L15476N61635Q65946O42803L8536j05916o99280
15227B070963o36478E59315k55355A50038D8924K4150j4224J26163N2226E2853
$$ plain form
15307 -140381 -86531 -20822 233667 58651 -47451 142285 140750 222420 132984 153647 234621
15296 234621 -146461 76554 245369 15422 13884 241112 -14888 -26222 175989 180134 -119328
15284 127214 170508 380430 25166 343464 -20736 92045 65492 -271577 17596 241145 29556
15272 354125 -35422 157887 17457 126883 -313046 159106 159407 66512 177925 169073 39434
15260 163684 -364138 -174262 296743 136203 -214486 -134759 13486 -86522 354792 -12214
15249 85236 196863 184956 181456 180769 -208687 -1704 237614 142610 -65493 266658 105220
15237 186337 -48442 286681 451763 767239 1328874 2194820 2837623 2876159 2770243 2070963
15227 2070963 1434485 559315 303960 150038 48924 73074 58850 185013 237239 52853
15216A91501h0849q5215B50089Q4549j60180J2450m5616C4706L5447R2370h3928
15204A69631g0771F2557K91583F2428P5002h1373A59523J11842I1463K70217j79931
15193A81749J7418i4184A94926h1384A59795J43302p1455e4149m7930B70506j19568
15182A50938J00n8359J5450N0690m4167b14190B40863J86517i6449c8973A79483
15170A33325P6883j605c06143A7304K15881e3266p2664a5405k76851A42231o7421
15159G4810M35730A24503c5077p7941A23042j3955a98929B59087D9154J64655
15149B13809j06503J6722n2600a8131n5658G273Q0665K33867j31249l5443G0819
15137b55213B49395c00362L6575F4283J28776O2553i1688b5911l54600C28151
$$ plain form
15216 191501 -80849 -166064 250089 334638 174458 186908 141292 34706 70153 162523 -83928
15204 169631 -70771 62557 354140 62428 137430 -81373 159523 271365 91463 361680 181749
15193 181749 199167 -94184 194926 -81384 159795 303097 231642 -54149 -102079 270506 150938
15182 150938 151038 92679 108129 158819 114652 -214190 240863 427380 -96449 -38973 179483
15170 133325 210208 208603 -306143 17304 233185 -53266 -125930 -15405 -292256 142231 74810
15159 74810 510540 124503 -35077 -113018 123042 109087 -198929 259087 49154 213809
15149 213809 107306 124028 71428 -18131 -73789 7273 87938 321805 190556 155113 70819
15137 -255213 249395 -300362 -263787 64283 193059 255612 -91688 -25911 -380511 328151
15126A52803p1227J98J47869b00078C24391D8128P934K45874j8670J8483J94965
15115D96714j58309b5623H14047n5198M0803B99803J250Q7635R5803O549k43905
15104B47135J47733A29888h8446H3073J58623b2670G2379j1318A49P0940e4746
15092B10158b31378A2070K14945B5287N7228k8364N1519j8961Q0550K02486G8531
15080C367a60934f3568d301p1658j9320m1996D08301a21121B0757K20532j11797
15069A29492b76332A2915J01861a97192E2476J58987F913L52056D55L17561J1262
15058C29278K6656O5674A18730K17982h8436C09446I6673J99385j08125K97310
15048D85243B42564j3725K83627E4301J17956m0826L3457M22154A61867M2507
$$ plain form
15126 152803 81576 81774 229643 -200078 324391 48128 56062 301936 283266 301749 496714
15115 496714 338405 -25623 814047 758849 799652 299803 301053 388688 484491 491040 247135
15104 247135 394868 129888 -88446 83073 241696 -22670 72379 61061 149 71089 -54746
15092 210158 -231378 12070 227015 25287 82515 54151 105670 86709 167259 369745 78531
15080 3367 -160934 -63568 -4301 -75959 -95279 -137275 408301 -121121 20757 241289 129492
15069 129492 -276332 12915 114776 -197192 52476 211463 6913 358969 455 318016 329278
15058 329278 355934 421608 118730 336712 -88436 309446 96673 296058 187933 485243
15048 485243 242564 228839 512466 54301 172257 131431 164888 587042 161867 204374
15038B04374J10859A29921K82764O0540B29853J20297l6549O6355L04532C12632
15027E07490k22876L76134j63607J31684A58557K65912a15083B09036L04118A84936
15016A9730K77688K03020J59698A98684J13252K18010A04288K79028K92523j51049
15006E24790A84369N50115k2260C04983k1445m8158o3263J20409q1883L21593
14996E32236q5489n6049j49055K4642q6513G512K18976K14935r8739n6974J06939
14985C92649A23066Q7143J96206L95600j9823C54201p9479J62782o0567J56151
14975E33088p0346r3801R3276q9128m1896D2676M74662M8458k81012K83620A73067
14963F35879k72756J42786j70953J46222E5255M43958k15575j24284P5963Q8133
$$ plain form
15038 204374 315233 129921 412685 473225 229853 350150 313601 379956 684488 312632
15027 507490 284614 660748 497141 628825 158557 424469 -115083 209036 513154 184936
15016 19730 297418 500438 660136 198684 311936 529946 104288 383316 675839 524790
15006 524790 184369 734484 712224 304983 283538 235380 172117 292526 210643 532236
14996 532236 446747 390698 241643 266285 179772 7512 226488 441423 342684 285710 392649
14985 392649 123066 210209 406415 802015 782192 354201 274722 437504 376937 533088
14975 533088 462742 368941 462217 373089 331193 42676 517338 565796 284784 568404 173067
14963 635879 363123 505909 334956 481178 55255 499213 283638 159354 235317 323450
14953C23450F2480L96851j14668r8651L16010B61353J7494b9500D38620k15562
14943B23058Q28677l87333B24931M12456j67390j95424q1212k5490K8232J51310
14933C47413M20846C31387M9261J85711L21975P8048k50980J73436J15160L203
14923A007201J36344j20821j435k8749J46126J37918l1421k63740j35186N89181
14913A435418F72073L47044m03894j92923K79005B78361K41950n4578o6851R3650
14903D92532L8144I4758K36726J1386m7498j6108J73104j06088j07454j12816
14893A26010R7541K98976j25098O0247L7941J0808j38868M10390p0413C25229
14882B34644N87994J12184A70959M27142K0095m2162J0366l1368n1521j23816
$$ plain form
14953 323450 62480 459331 344663 246012 562022 261353 278847 -29500 438620 223058
14943 223058 1051735 664402 224931 637387 469997 274573 193361 167871 196103 347413
14933 347413 768259 331387 380648 566359 888334 966382 715402 888838 1003998 1007201
14923 1007201 1143545 1022724 1021289 992540 1138666 1276584 1245163 981423 846237 1435418
14913 1435418 672073 1019117 615223 422300 701305 278361 520311 465733 398882 492532
14903 492532 530676 94758 331484 342870 295372 279264 452368 346280 238826 126010
14893 126010 223551 522527 397429 457676 495617 506425 367557 777947 707534 325229
14882 234644 822638 934822 170959 598101 618196 576034 586400 555032 503511 379695
14872C79695K04557o6408k40789L01541B16143K47858R4045J01792J74972C99123
14861B48337J97004k02103j2919K40942j2328I7628M06044r9419j40160J41306
14851D05399K84371j49260N4110L5019B66718K99283j15739M5432K15890j91510
14841E20074M8168K32926j2768j23293P7398k34581J02763o1902K5476n9892J98646
14830G13015j11850K11747L2693L3790l30731k03214R8444N52129l77288K74419
14820H93154l37424q4290J23795B96157L03246j88869K06649n0008J02656A93013
14809E01191J94597j46939k6353K03239j7622l0866K87997D23264O47329m56997
14799F13596j47121j47580K15795P057J96047j04638j62639M30966j88353J18037
$$ plain form
14872 379695 584252 517844 277055 578596 216143 464001 558046 659838 834810 399123
14861 248337 445341 243238 230319 471261 458933 97628 503672 404253 264093 405399
14851 405399 689770 540510 594620 629639 266718 566001 450262 495694 711584 520074
14841 520074 568242 801168 788400 665107 742505 507924 610687 548785 574261 514369 713015
14830 713015 601165 812912 845605 879395 548664 345450 443894 996023 618735 893154
14820 893154 555730 471440 595235 296157 599403 410534 617183 567175 669831 193013
14809 501191 695788 548849 522496 725735 708113 677247 965244 423264 1070593 613596
14799 613596 466475 318895 534690 541747 737794 633156 470517 901483 713130 831167
14789H31167P2878k1429l40204M71515m40047O41289n54210N9094k13079J1526
14779E18500J10995J64596N1936r0490J7640j66327j745L53043m18445J12235
14769F51938K98488k31193K25267l32812B58552O50777C52590J62823J50385j23573
14759E42225j04756m9001J33456M53247o7246k83732q5907J6337P0867j38185
14749D87305M93305k27733R6267l51294J20816K02528k06068M040j83272M34491
14739H70385k31242l6265Q356L77007l42214L44372q5238m29949K27636M06872
14729A109720r5638k08941K14969L73771k34168M14j7629O2982l1728l7526k25313
14718I10913k07023O36554m39119l73504J72340K35549k85120J32695Q0555M26239
$$ plain form
14789 831167 904045 882616 542412 1013927 573880 1215169 660959 720053 506974 518500
14779 518500 629495 794091 846027 755537 773177 606850 605105 958148 539703 651938
14769 651938 950426 719233 944500 611688 258552 909329 352590 515413 665798 542225
14759 542225 437469 388468 521924 975171 907925 624193 538286 554623 625490 487305
14749 487305 980610 752877 849144 497850 618666 821194 615126 619166 435894 870385
14739 870385 639143 602878 611234 988241 646027 990399 905161 475212 702848 1109720
14729 1109720 1014082 805141 1020110 1393881 1159713 1160127 1142498 1205480 1173752 1136226 910913
14718 910913 703890 1340444 901325 527821 700161 935710 650590 783285 863840 1290079
14708A290079j78431K1584l54241N0980L40561q9688J47669R2891J79788l93449
14698A107743p0619J98282R888L0943j76170j04906O1726q8822J1699p3713J49853
14687A055904j4579j6903p4423L4543J60908j02239j56623J25401k57954K62298
14677A016333J94383j40635M7702k51732m085P9078J75899k49337Q4897L6630
14667I89133J58030R4881n03984M70758o7016k63641J41554J20585j2640j1280
14657A116380K14494l83263J88144J89760k92511L70005k95484K07681j07566
14648A207640N1012O2314j79493R2690J81K32171k29331n3226K81564O2326m6829
14637A481019m17141K3426J32494J60668p8085P9174j38213M9165P6231l54352
$$ plain form
14708 1290079 1111648 1133232 778991 829971 1170532 1080844 1228513 1321404 1501192 1107743
14698 1107743 1037124 1235406 1245294 1276237 1100067 995161 1056887 968065 979764 906051 1055904
14687 1055904 1041325 1024422 949999 984542 1145450 1043211 886588 1011989 754035 1016333
14677 1016333 1210716 1070081 1117783 866051 861966 941044 1116943 867606 952503 989133
14667 989133 1147163 1242044 738060 1208818 1141802 878161 1019715 1140300 1127660 1116380
14657 1116380 1330874 947611 1135755 1325515 1033004 1403009 1107525 1315206 1207640
14648 1207640 1258652 1320966 1141473 1234163 1234344 1466515 1237184 1183958 1465522 1527848 1481019
14637 1481019 1063878 1087304 1219798 1380466 1302381 1381555 1243342 1292507 1368738 1014386
14627A014386M21711J91941j47447j99036K00912j83943L1584N0942K0165J79429
14617A580644Q3469r4470L2735j50662q7717M0724K63626N8307K5131l05855j099
14606A444833L26071M21079o51333K94298j51855R3567k38865O0227o3955L68275
14596A902342m3089L4513j51855q1628M3321k23300K38195M5551j11368P8962
14586A731644j32300K93816K41205l09736q607R893J54318J89302j13528P7214
14576B133221K92469q25467M53343L3786O00909N533k35808j22988l7826L59683
14566B656855j08058K78556n08836M57090K07391j16919R5123J68037O7182J33311
14556C329732j51722N05001K99584j21552Q10631O90676R13516K222745M478925
$$ plain form
14627 1014386 1436097 1628038 1480591 1281555 1482467 1298524 1330108 1381050 1401215 1580644
14617 1580644 1664113 1569643 1602378 1451716 1363999 1404723 1668349 1726656 1751787 1445932 1444833
14606 1444833 1770904 2191983 1540650 1834948 1683093 1776660 1537795 1598022 1534067 1902342
14596 1902342 1859253 1893766 1741911 1660283 1703604 1480304 1718499 1764050 1652682 1731644
14586 1731644 1599344 1893160 2134365 1824629 1816022 1825915 1980233 2169535 2056007 2133221
14576 2133221 2425690 1600223 2053566 2087352 2688261 2693794 2457986 2334998 2297172 2656855
14566 2656855 2548797 2827353 2318517 2775607 2982998 2866079 2961202 3129239 3196421 3329732
14556 3329732 3178010 3683011 3982595 3861043 4671674 5362350 6275866 8498611 12977536
14547A2977536P395738Q198407J022785j0775336n046268m991142l667734k068698
14539C045288l66688O0375n30796K01014l26891L14083K10639O4265r6407M19862
14529B994744O62886J072189J541616j85407j606784m65889p83677l06339l54651
14520B568688J62523L53085p31802N35230l93496R8690J27898j35393J70512K76147
14510C032082j78651K70993J43417m48518L83648Q518K5040j39230k1995j92197
14500B883107N17711o3278J02467p6512J63528J30234O5601j37396P4307J63827
14490C823596N9566m51442J53324N1699K77885q6829o5447R4459K48039J00796
14480D205646m03744N33588O1595j81802K67406l48866J83412j49488L33344k9659
$$ plain form
14547 12977536 20373274 28571681 29594466 18819130 13772862 8781720 5113986 3045288
14539 3045288 2678600 2738975 2208179 2409193 2082302 2396385 2607024 2671289 2574882 2994744
14529 2994744 3657630 4729819 6271435 6086028 4479244 4013355 3229678 2923339 2568688
14520 2568688 2731211 3084296 2352494 2887724 2494228 2592918 2720816 2585423 2755935 3032082
14510 3032082 2853431 3124424 3267841 2819323 3202971 3211489 3236529 3097299 3075304 2883107
14500 2883107 3400818 3337540 3440007 3363495 3527023 3657257 3722858 3585462 3659769 3823596
14490 3823596 3883162 3431720 3585044 3636743 3914628 3827799 3762352 3856811 4104850 4205646
14480 4205646 3801902 4335490 4397085 4215283 4482689 4133823 4317235 4167747 4501091 4471432
14470D471432J26947O5177K56377n08295M27840P9630J13853n300q8184J48648
14460E088125j86408O38383k66610J30265L22O8606P7186O034l5352Q7880L05402
14449E913833J79383l2631Q5310j75477N42996k82457J30689k01108L31660J09635
14439F601833L02997j12527J48821j02234k8298M32358k69242K92692J61313M8217
14429G475930J13012K46624J14981m01318O40452K8476k47212K07008L73016q697
14419H542272J35706M94546K41913k91170j31066L59667L06243j4856J19645k34078
14409I528822L64807M75610q0665N21342j41698J04899L13286K39075K12702K87599
14399A1825779m1640L08126l441J57773M06274O7738K74675J67862M53357L7378
$$ plain form
14470 4471432 4598379 4663556 4919933 4411638 4839478 4919108 5032961 5027661 4939477 5088125
14460 5088125 4901717 5540100 5273490 5403755 5404077 5472683 5549869 5555903 5520551 5608431 5913833
14449 5913833 6093216 6060585 6145895 5970418 6513414 6230957 6361646 6160538 6492198 6601833
14439 6601833 6904830 6792303 6941124 6838890 6810592 7242950 6973708 7266400 7427713 7475930
14429 7475930 7588942 7835566 7950547 7549229 8189681 8218157 7970945 8177953 8550969 8542272
14419 8542272 8677978 9172524 9414437 9123267 8992201 9351868 9658111 9643255 9762900 9528822
14409 9528822 9893629 10369239 10288574 10809916 10668218 10773117 11086403 11325478 11538180 11825779
14399 11825779 11784139 12092265 12088824 12246597 12652871 12720609 12995284 13163146 13616503 13653881
14389A3653881J33223K61968K67749L45934q2830O93466L57102K25400K87679
14380A6143572P5657M51829K24719L89545M97436L65285K22831L72300L95290
14371A9138464N12408M80525j22817N16732P95813O30377K62584K79228N22863
14362B3016177N14102L25169N66483N18555P65133Q03307L77102M13942R44842
14353B8244812O37794P07561O59902Q22468N36499Q94584P95309J143699O15366
14344C5057994J146863O44804J005138J388778R03874Q54194J042171J260257
14336D3304073J104215J307992J375309J282979J208337J985220J372082J619329
14328E4559536J550527J470441K279731J448182K151417J868986K323986K232607
$$ plain form
14389 13653881 13787104 14049072 14316821 14662755 14579925 15273391 15630493 15855893 16143572
14380 16143572 16219229 16671058 16895777 17285322 17782758 18148043 18370874 18743174 19138464
14371 19138464 19650872 20131397 20008580 20525312 21321125 21951502 22214086 22493314 23016177
14362 23016177 23530279 23855448 24421931 24940486 25705619 26508926 26886028 27299970 28244812
14353 28244812 28882606 29590167 30250069 31072537 31609036 32503620 33298929 34442628 35057994
14344 35057994 36204857 36849661 37854799 39243577 40147451 41001645 42043816 43304073
14336 43304073 44408288 45716280 47091589 48374568 49582905 51568125 52940207 54559536
14328 54559536 56110063 57580504 59860235 61308417 63459834 65328820 67652806 69885413
14320F9885413K088655K882903K188211L104224K538867K963559L231756L037675
14312I1921263L636441L633056L576516M038359M436099M142230M674652M778421
14304A24837037N092354N498252N856820O291197O193748O587578O906841P573413
14296A74837240P834786Q322480Q981053R180623R189248J0027360J0531649J1064667
14288B49969106J1624438J1886047J2190203J2042143J3592347J3382564J3947562
14281C38634410J4098943J4261133J4555374J4332705J3687664J3307549J2007806
14274D34885584Q800550M710711O97112j212733k259669o098768q511029o335730
14266D24676028l389492J494672o039143j1970840j4609040j5374339j5652625
$$ plain form
14320 69885413 71974068 74856971 77045182 80149406 82688273 85651832 88883588 91921263
14312 91921263 95557704 99190760 102767276 106805635 111241734 115383964 120058616 124837037
14304 124837037 129929391 135427643 141284463 147575660 153769408 160356986 167263827 174837240
14296 174837240 182672026 190994506 199975559 209156182 218345430 228372790 238904439 249969106
14288 249969106 261593544 273479591 285669794 297711937 311304284 324686848 338634410
14281 338634410 352733353 366994486 381549860 395882565 409570229 422877778 434885584
14274 434885584 443686134 448396845 449093957 447881224 445621555 439522787 431011758 424676028
14266 424676028 421286536 422781208 416742065 404771225 390162185 374787846 359135221
14259C59135221j6032123j6098289j6053924j5665051j5066023j4249923j3973208
14252B51996680j2989522j2489521j1414294j1018332j0720042j0018992q935026
14245A74410951q701903q185537p640113o857010p410365n870531m789705m093191
14237A20862596n324682m970611m811137n010302m289396l911771l842751l320562
14229H5381384l845104l036904l061004k668354k754368k760250k675302k045480
14221F2534618k100404k041587k148369j667077j844401j653303j455674j401075
14213D8222728j436885j442956j668471j293076r60058j396255j050181r71935
14205C8002911q86418j117143p87228j071868r27118o28508q45474q77490r45937
$$ plain form
14259 359135221 343103098 327004809 310950885 295285834 280219811 265969888 251996680
14252 251996680 239007158 226517637 215103343 204085011 193364969 183345977 174410951
14245 174410951 165709048 157523511 149883398 143026388 135616023 129745492 124955787 120862596
14237 120862596 115537914 110567303 105756166 100745864 96456468 92544697 88701946 85381384
14229 85381384 81536280 78499376 75438372 72770018 70015650 67255400 64580098 62534618
14221 62534618 60434214 58392627 56244258 54577181 52732780 51079477 49623803 48222728
14213 48222728 46785843 45342887 43674416 42381340 41421282 40025027 38974846 38002911
14205 38002911 37116493 35999350 35212122 34140254 33213136 32584628 31739154 30861664 29915727
14196B9915727o26840m92121j120143m04124q69021o50557k20638r91234p50569
14187B3790480k91017o37726n31034l52818o81470m68626j58685r29064J8251
14178A9758291n26086j04780n39605n14181J4642n75464j09778q20355o1918m90813
14168A6029953q8780n78641j26471k98362k09985k58834l60762l75242J41829
14159A3874705m82463Q1718n11414m32522L15131o29264J85748m24562J30781
14150A2107858j86528o35155K38718l31962m85132q0480k17478O440k30929k60447
14140I924905J88479P0800m86766k67771j51902j69470q670J81257l98731j1092
14130H871039m66214j37565k40998M34178m98315K68906k30198j52918k72206
$$ plain form
14196 29915727 29288887 28796766 27676623 27272499 26403478 25752921 25532283 24541049 23790480
14187 23790480 23499463 22861737 22330703 21977885 21296415 20827789 20669104 19740040 19758291
14178 19758291 19232205 19127425 18587820 18073639 18088281 17512817 17403039 16582684 16520766 16029953
14168 16029953 15941173 15362532 15236061 14937699 14727714 14468880 14108118 13732876 13874705
14159 13874705 13392242 13473960 12962546 12530024 12845155 12215891 12401639 11977077 12107858
14150 12107858 11921330 11286175 11524893 11192931 10707799 10627319 10409841 10416281 10185352 9924905
14140 9924905 10113384 10184184 9697418 9429647 9277745 9108275 9099605 9280862 8882131 8871039
14130 8871039 8404825 8267260 8026262 8460440 7962125 8231031 8000833 7847915 7575709
14121G575709J75556k14682m21285R9319j1371l11628R7181j83448j56409J53018
14111F801960j26603p8888K73891o97641L19695j85512p475o81874P39883n14497
14101E842939q5632J02259k4099k29393j79880J06470l33360o2654L17567Q2839
14091E537056n52499J17836J29540J0595k65284r5324Q6427j44573n43226N53248
14081D833796k8292k39077P2585k39677m6926K72684j4820l50109j90972J86794
14071D255986J66813j58741l44084k0830J67410J08787l56616J04637r4477K07444
14061D036329m30391J93391K64692m57092L12311k08401j98786j70267J43095
14052C484881K22512k15213k8162k73403M27550j15543m55176J80935J49277P7383
$$ plain form
14121 7575709 7751265 7536583 7115298 7214617 7203246 6891618 6988799 6805351 6648942 6801960
14111 6801960 6675357 6596469 6870360 6172719 6492414 6306902 6299427 5617553 6357436 5842939
14101 5842939 5757307 5859566 5835467 5606074 5426194 5532664 5199304 5136650 5454217 5537056
14091 5537056 4984557 5102393 5231933 5242528 4977244 4881920 4968347 4823774 4280548 4833796
14081 4833796 4805504 4566427 4639012 4399335 4352409 4625093 4610273 4260164 4069192 4255986
14071 4255986 4422799 4264058 3919974 3899144 4066554 4175341 3818725 3923362 3828885 4036329
14061 4036329 3605938 3799329 4064021 3606929 3919240 3710839 3512053 3341786 3484881
14052 3484881 3707393 3492180 3464018 3190615 3618165 3502622 3047446 3228381 3377658 3455041
14042C455041l52528J32503K6538k32875M34070m4943m78940J87092J61654o79160
14032B608452J89892L9433k85271K90648J33903j3191R9838l40186r067K92637
14022C007088j87330j28527j554n7073k14995J64622J47296j99952J26619k17369
14012B438825J20677k17366k85720M40407k04550J11752k5311l07043M14796j20658
14002B365809l77378N58193j91295j23805J94490j33093K98493m29487p3375N86002
13992B674554M2260j0716J039587J007195L708188O620400R802333N496798q834317
13983B1546282m105396n281920m304845k517763j015987q62245k61679k86614
13975B909833J39963l74614k46174K17295q0328j89871J5767J7068j79279J2709
$$ plain form
14042 3455041 3102513 3235016 3261554 3028679 3462749 3417806 2938866 3125958 3287612 2608452
14032 2608452 2798344 2837777 2552506 2843154 2977057 2963866 3063704 2723518 2714451 3007088
14022 3007088 2819758 2691231 2689677 2632604 2417609 2582231 2729527 2529575 2656194 2438825
14012 2438825 2559502 2342136 2056416 2496823 2292273 2404025 2378714 2071671 2486467 2365809
14002 2365809 1988431 2546624 2355329 2231524 2426014 2292921 2591414 2161927 2088552 2674554
13992 2674554 2716814 2706098 3745685 4752880 8461068 15081468 24883801 30380599 21546282
13983 21546282 17440886 12158966 7854121 5336358 4320371 3458126 3196447 2909833
13975 2909833 3049796 2675182 2429008 2646303 2565975 2376104 2391871 2408939 2229660 2242369
13965B242369K70799m56847J62857k33630J38525N955j29963J78445o9417M3709
13955B152802j39745j72614L28368p6038j79399p0251L17493m71117J20306J72633
13945A982438l31083J84197o1368k75438J02861R8438J98964o37210L57239J25138
13935A744176k75001J69926K82685o6645n24212K56403l8380l4620k09068M10050
13925A715314n03686K40046l6963L8551m8011K15932J28324k33153m25160L81033
13915A472227m85848K75388l0783K40763k23687k36155N24919j21410k60487o7648
13905A087279K63695j0719J58105j81262q0537M5496P1465J13214j11907j1203
13895A343626r3933J83683j16288l12931N4511L20633m06264M79957o14609K19699
$$ plain form
13965 2242369 2513168 2056321 2219178 1985548 2124073 2130028 2000065 2178510 2109093 2152802
13955 2152802 2013057 1840443 2168811 2092773 1913374 1843123 2160616 1689499 1809805 1982438
13945 1982438 1651355 1835552 1774184 1498746 1601607 1700045 1899009 1261799 1619038 1744176
13935 1744176 1469175 1639101 1921786 1855141 1330929 1587332 1548952 1514332 1305264 1715314
13925 1715314 1211628 1451674 1414711 1453262 1405251 1621183 1749507 1516354 1091194 1472227
13915 1472227 986379 1261767 1230984 1471747 1248060 1011905 1536824 1415414 1154927 1087279
13905 1087279 1350974 1340255 1498360 1317098 1236561 1282057 1353522 1466736 1354829 1343626
13895 1343626 1249693 1433376 1317088 1004157 1058668 1379301 973037 1452994 838385 1058084
13885A058084J90106J34781p7467J6054l96475j2162J98144j16896J73794j58109
13875A009854K46850L15270k62812L6904j60980j31273n9901k13494J30228K40166
13865A150812j88421M40616j82435m6307n2800k58894J49854Q2334L6763k4756
13855A106766L33642m16510J97335q6313l1415P5519k69389J33602k28205L78011
13845A193043j76444k09610O4322j366J82815j71091k00793L99352l86588J72523
13835H66163r8967J66727Q0980j37752m2935J85904o5254j52938j2104L2689k63941
13824E58572K17066p6292K47150k4853l7009j51975J89213O0509j03500N32335
13814A411216m26156k52226k4599K4310Q1172j14491j36348J16777K2161K0418
$$ plain form
13885 1058084 1248190 1382971 1305504 1321558 925083 912921 1111065 994169 1167963 1009854
13875 1009854 1256704 1571974 1309162 1346066 1185086 1053813 993912 780418 910646 1150812
13865 1150812 962391 1403007 1220572 1174265 1121465 862571 1012425 1094759 1131522 1106766
13855 1106766 1440408 1023898 1221233 1134920 1103505 1179024 909635 1043237 815032 1193043
13845 1193043 1016599 806989 871311 869945 1052760 881669 680876 1080228 693640 866163
13835 866163 767196 933923 1014903 877151 834216 1020120 954866 801928 789824 822513 558572
13824 558572 775638 699346 946496 921643 884634 732659 921872 982381 878881 1411216
13814 1411216 985060 732834 708235 732545 813717 699226 562878 679655 701816 722234
13804G22234P1353j19814j58028J83149J28721J32481j45779l9677n4516M1667
13794G61791J39839q3708k68034j34007M10326L23097l60474R180k75293P7636
13784F00353l6539J09805L87888l71045J67075j16224l05814R7660L73378R2884
13774I99421k35070N3428O2721O9465k67714l24476L03621j51823L02334k40365
13764E71542M32655m02091K47672l17943j43222K16473m5649M21109D64796L9501
13754E04297m3763P6789K4229K0419p259J69901L6859j2108L4632k51014K99706
13743H52688k72798j5760r6393N3276o864A45841M49936K38545l92117O346L8707
13732D87258J9234K57304l25178J94692j70309M77492C00859J70916L38109k75026
$$ plain form
13804 722234 793587 673773 515745 698894 827615 960096 814317 774640 720124 761791
13794 761791 901630 817922 549888 415881 826207 1149304 788830 798010 522717 600353
13784 600353 563814 673619 1061507 690462 857537 741313 435499 533159 906537 999421
13774 999421 764351 817779 880500 949965 682251 357775 661396 509573 811907 571542
13764 571542 1004197 602106 849778 531835 388613 605086 559437 980546 464796 504297
13754 504297 460534 537323 561552 581971 574712 744613 781472 769364 803996 552982 852688
13743 852688 579890 564130 467737 521013 514149 145841 595777 834322 442205 448551 487258
13732 487258 506492 763796 438618 633310 463001 940493 300859 471775 809884 534858
13722E34858L49310C95170K83913r5219B55890L86327k33208j24629N98442B15193
13711F90695k84603J18620p9639J90046J34785n8503q2067k73113J59623k43105
13701B72739L18257j55673K12594k58117K1243q8414J29541L83996m02695J03233
13691E36704J480k48372F9352M76389j07168k2067L41792j73372j75266K70520
13681F80180j12239B43648L29768J88052I3261O26556A73924K2511L6281m7942
13671A84774M63097l11071j24135J45826L69425j96579j46117J31790J49803k43838
13661D22975q1726J63280j59542J70587R4561B97929O7270L4303K88611k97005
13651C91108J34375j13650L5975K75265k73639J20450k69540o063K6563k0606
$$ plain form
13722 534858 884168 395170 679083 583864 255890 642217 409009 284380 882822 215193
13711 690695 406092 524712 445073 635119 769904 711401 629334 356221 515844 272739
13701 272739 590996 435323 647917 389800 411043 322629 452170 836166 433471 536704
13691 536704 538184 289812 69352 545741 438573 416506 758298 584926 409660 680180
13681 680180 567941 243648 573416 761468 93261 719817 173924 196435 232716 184774
13671 184774 647871 336800 212665 358491 727916 531337 385220 517010 666813 422975
13661 422975 341249 504529 344987 515574 610135 297929 365199 399502 688113 391108
13651 391108 525483 411833 447808 723073 449434 569884 300344 294281 320844 300238
13641C00238J88147j40748M8440r0611A43891L29359p1458P8422J79428j56117
13631E03525H3137K57222J8858R9951J77559B66347K48673j28223L3402P4133
13621D94332q2760J33822j26981j26389q3955M11197B28338J94241I3521R2348
13611A85869J58788n0899o487J31086A17232J40974J9347L64621A83553F4280
13600a0596F7888K72234J50288M9251j40567m3299k5277J46175k7292R80J20824
13589E71205k27903K04419B22555D7410L93944P5098A02282q507L84681r0249
13579C88207K42417A63112J72902A49075J73918L3185N4882R1591j74686A59335
13568C68915d6801j94475F1900J67714L9943K6427j9581p3639r3558L4609J59272
$$ plain form
13641 300238 488385 347637 396077 305466 143891 473250 401792 480214 659642 503525
13631 503525 83137 340359 359217 459168 636727 266347 515020 386797 420199 494332
13621 494332 411572 545394 418413 292024 208069 619266 228338 422579 93521 185869
13611 185869 344657 293758 287271 418357 117232 258206 277553 642174 183553 64280
13600 -10596 67888 340122 490410 539661 399094 355795 330518 476693 449401 450381 571205
13589 571205 343302 547721 222555 47410 441354 516452 102282 93775 478456 388207
13579 388207 630624 163112 336014 149075 322993 356178 411060 502651 327965 159335
13568 368915 -46801 -241276 61900 229614 269557 295984 276403 202764 109206 143815 303087
13557C03087m3906A16976J21442p8491K64810r0924b5657A76644J58841p0643
13547B64842G0315J75873p488J7838m1459l3278h3935A64776K49710r1892J90708
13536E13302k40080M7808j38944J5738J28376P9892o8609I3529L43884K7873j05576
13525C59710K0662D0502M10019A28385L54263D9108K52517j7083q2092P4532c0225
13513B64147m28K36946k21552d570B48393P4994J48795j33914J43711k15472j06704
13502A59803M21103A93273J25375p7460B4476L04542a5968E20646f2476A84862
13491E20741B44278M5161Q3687K1791j88741H4387g252B06745n5433J23782j23561
13480A51533m742A4617O0424L54554j89213J32038J49679A93621K13670j28317
$$ plain form
13557 303087 259181 116976 238418 159927 424737 333813 -25657 176644 335485 264842
13547 264842 70315 246188 238700 256538 215079 181801 -83935 164776 414486 322594 513302
13536 513302 273222 321030 182086 197824 326200 406092 337483 93529 437413 465286 359710
13525 359710 380372 40502 450521 128385 482648 49108 301625 284542 202450 276982 -30225
13513 264147 263719 500665 279113 -4570 248393 323387 472182 338268 481979 266507 159803
13502 159803 580906 193273 318648 241188 24476 329018 -15968 520646 -62476 184862
13491 520741 244278 289439 373126 394917 206176 84387 -7252 206745 151312 275094 151533
13480 151533 146791 14617 75041 429595 240382 372420 522099 193621 407291 278974
13470B78974A29227K31705F6548J29613K2878l9386K08610k9470J00964J34804
13460E94561B48119m502R6435j24248p7656L26331B03111G5046J72506L66738
13450F14290b6869A18624K13235D6073R8907J24384b1846D1806L55732R9882A92466
13438D5099L86294A64761O1381Q779J3321F2234L03589A59539Q5580j07412o2691
13427G5016L23475A55236N3563J4928q1998K49483A70405j4420L21777A88735
13416b1538B3039f9431f749j05026E39896i5335C07903f9413G6212c41484H0374
13404A71465o9846L53999q3583j56892J14851F3072L09685H2757a3450A04523
13393B76616n3923l9706a63477A43891J09564j18643b5923j54537d3829B36224
$$ plain form
13470 278974 129227 360932 66548 196161 219039 179653 388263 358793 459757 594561
13460 594561 248119 243617 340052 215804 138148 464479 203111 75046 247552 614290
13450 614290 -26869 118624 331859 46073 144980 269364 -21846 41806 397538 497420 192466
13438 45099 431393 164761 226142 234921 248242 62234 365823 159539 245119 137707 75016
13427 75016 398491 155236 208799 223727 141729 391212 170405 155985 477762 188735
13416 -21538 23039 -69431 -6749 -111775 539896 -95335 307903 -69413 76212 -341484 80374
13404 171465 101619 455618 372035 215143 329994 63072 372757 82757 -13450 104523
13393 276616 222693 182987 -163477 143891 253455 134812 -25923 -180460 -43829 236224
13382A22213K13483b89D07919j13098a91373d2954j37308e2725A60545n6104J68538
13371B72979a30529C31384e4499B28256p8435a57765C31272l6975J55024I4187
13360C07341A05208J15502k4819h471D7325N6937J12459k8019M9494r08j03473
13349A33815Q9536N8604F1732K61916l2126q1594B7329L37224A59318J97891a62644
13337B94728j43142K10723M7618B01456N7943j09345b41272B99077j09680q0473
13327A08924K50260C8884J36574H6560a12579G722J25299C4436J1861d3845F0063
13315C86197A44939R9910J82184A97461a03853B56278o3512q4694K00292a4488
13304D8609O1712a14528H754N43332B69328A32830o0580D546a02418C11395F7447
$$ plain form
13382 122213 335696 -289 407919 294821 -191373 -42954 -180262 -52725 160545 104441 272979
13371 272979 -130529 331384 -54499 228256 149821 -157765 331272 294297 449321 94187
13360 307341 105208 220710 195891 -8471 47325 104262 216721 188702 238196 237288 133815
13349 133815 223351 281955 61732 323648 291522 209928 27329 364553 159318 357209 -162644
13337 294728 151586 362309 409927 201456 259399 150054 -241272 299077 189397 108924
13327 108924 359184 38884 175458 86560 -112579 7722 133021 34436 46297 -43845 60063
13315 386197 144939 244849 427033 197461 -103853 256278 192766 108072 308364 -14488
13304 48609 110321 -114528 8754 552086 269328 132830 72250 4546 -102418 311395 67447
13292a36228A74972d1066C20094K3817j48096J58006f4123E8876j3510J07500
13282A52866f9281C34639J55618j13645A27181O0177N0331c09023B51869n8382
13272A93487B7857M63516j68188I8511k1433C1540J46611K67955i9750B80656
13261C44940a8979q2540B62939A07722b22892B08515b34288A12495J3846P1393
13251A97734F1819L5651J01087P4827D6182K22678a50962C2219O8578E0238J22192
13240A72430q1592a70000B23532a25134C77460H6788L0056D5143N0788b40304
13229A07535J27646h5773m7407p5537B21548E2175a22584B89371F4430f5948j27979
13218a93927A49523L2807o7313J43834m6486k7011k3711f7665F3425a90481I6885
$$ plain form
13292 -136228 174972 -41066 320094 343911 195815 353821 -64123 58876 45366 152866
13282 152866 -69281 334639 490257 376612 127181 187358 237689 -309023 251869 193487
13272 193487 27857 491373 323185 98511 77078 31540 178151 446106 -99750 280656
13261 344940 -18979 -101519 262939 107722 -222892 208515 -234288 112495 126341 197734
13251 197734 61819 97470 198557 273384 46182 268860 -150962 32219 100797 50238 172430
13240 172430 90838 -170000 223532 -125134 377460 86788 116844 45143 95931 -240304
13229 107535 235181 -85773 -133180 -208717 221548 52175 -122584 289371 64430 -65948 -193927
13218 -193927 149523 182330 115017 258851 212365 185354 161643 -67665 63425 -190481 96885
13206E3964a71729B19644b38107A02119O6098o2199O72O1742C9668P8004g3581
13194b47176D40178L0904f5088C14707j43498n9829b67763A57263g901D31070
13183h8451j25979d3149B29909H1486J66621r4379p0274R687J04055b27967C5981
13171C23881G2687h1275A74603q3463Q5329m2457n3687Q111P6260J54449k3281
13160B95864A41695g3423k80293A78082e3479K0329j0348B22276D3547a05358
13149A65828j2329b86435J10367B56031E8096K92850A56700O908G6264h2797I9251
13137B16252a57387d9252D42759a43584C01910b31172J04969E5739J01574l5609
13127A21704c4157O663P985p9524E34793A32571J6744a3214n09483G9430a41512
$$ plain form
13206 53964 -171729 219644 -238107 102119 168217 106018 106690 168432 39668 117672 -73581
13194 -247176 440178 471082 -65088 314707 171209 111380 -267763 157263 -7901 431070
13183 -88451 -214430 -43149 229909 81486 248107 153728 83454 93141 197196 -227967 35981
13171 323881 72687 -81275 174603 91140 176469 134012 80325 88436 164696 319145 295864
13160 295864 141695 -73423 -353716 178082 -53479 -33150 -43498 222276 43547 -105358
13149 165828 153499 -286435 -176068 256031 58096 350946 156700 163608 76264 -82797 99251
13137 216252 -157387 -49252 442759 -143584 301910 -231172 -126203 55739 157313 121704
13127 121704 -34157 -27494 -19509 -99033 534793 132571 149315 -13214 -522697 79430 -141512
13115a4874A49309n2151f6749A13818b08979A31425B1947J5607L35551a46862
13104C6873M18566k11476k7295a13282a312A33353a70913B07038b16551K1899
13094a94652D0963L84679b05066b4493q6532j00440j0851I9733a65858A00782
13083f0283A56565P3836E7040J36886b4158n7667B94014I012a05207A31592D7581
13071d274E6812J42061H2671a70220C13474c5253a3203C15012b25901a02833G4952
13059A32995N6013A0749K4389Q4809K43275H7804K5531J22936d3054B07466b76201
13047c3281j03757j06702i9104B34244a44272I046b98182B22675e6117D58317
13036a92534P0512B9118P6912g1874j17603O7605j08869g5456b1447C0823J80355
$$ plain form
13115 -14874 149309 97158 -66749 113818 -208979 131425 21947 37554 373105 -146862
13104 36873 455439 243963 216668 -113282 -1312 133353 -170913 207038 -216551 -194652
13094 -194652 40963 425642 -205066 -24493 -111025 -211465 -222316 99733 -165858 100782
13083 -60283 156565 230401 57040 193926 -24158 -81825 294014 9012 -105207 131592 47581
13071 -4274 56812 198873 82671 -170220 313474 -35253 -13203 315012 -225901 -102833 74952
13059 132995 189008 10749 35138 119947 363222 87804 113335 236271 -43054 207466 -276201
13047 -33281 -137038 -243740 -99104 234244 -144272 9046 -298182 222675 -56117 458317
13036 -192534 -122022 29118 106030 -71874 -189477 -121872 -230741 -75456 -21447 30823 211178
13025B11178b37038J5866a06497A96386D0644j0530K07322H2551a6395j22009
13015a38404K5911A11127g413q234I7061C3695K8128a38083A04917a53169b2572
13003G3905a58716N9834d4067j54115M4931K354k61092A59955i3821D2277d3286
12991b49712b4189e426m5954h5H9190a26354A02981b18163f779j33825l3479A64062
12978F4393J7093J03134b49087l8813A03796k9525d1830A93287a05966F8355J40992
12967B09347A3650j937K43721N0106A10129Q0223c0707r9093E743K31338N6100
12956B93181a0005l10016e8066H649e5135k51397J49697E750b55498B46772q6785
12945A59987c67442A11553J84514j11517b7142A3170J34228B7490a08378j19970
$$ plain form
13025 211178 -237038 -221172 -106497 196386 40644 30114 237436 82551 -16395 -138404
13015 -138404 -112493 111127 -7413 -15647 97061 33695 61823 -138083 104917 -153169 -22572
13003 73905 -158716 -98882 -44067 -198182 -153251 -150897 -411989 159955 -93821 42277 -43286
12991 -249712 -24189 -5426 -51380 -85 89190 -126354 102981 -218163 -6779 -140604 -174083 164062
12978 64393 81486 184620 -249087 -287900 103796 74271 -41830 193287 -105966 68355 209347
12967 209347 13650 11713 255434 305540 110129 190352 -30707 -129800 5743 237081 293181
12956 293181 -10005 -320021 -58066 8649 -55135 -306532 -156835 5750 -255498 246772 159987
12945 159987 -367442 111553 296067 184550 -27142 13170 147398 27490 -108378 -228348
12935b28348a7833A75916a06340e1290H035i6290B5544J7708f9225A87513i2357
12923F9583K5176K71290a25901e6671A07754D129c25904b6012B009J92963j3417
12912A81555i4883B22612j10809l9872R9837a99170j39905A69434c01223C40348
12901C61135F6284b4966q800A81666b98846E8045f8999D6225j8841L22149b38950
12889a17379a0306N70A8911c91803a37251B11909F491J29525o5461R678P7495
12878A57728k5187F2595P1920J70613a29906j24906A87740i6982J0110C22738
12867a04098D9259N3748a48601A24751i718k0067l3882B85935a09631k49984e7900
12855B14219G8981O1123g8979E4765N5571f6102B29706l0049b53987C41797e9737
$$ plain form
12935 -228348 -17833 175916 -106340 -51290 8035 -96290 25544 43252 -69225 187513 -92357
12923 69583 94759 366049 -125901 -56671 107754 4129 -325904 -26012 2009 194972 181555
12912 181555 -94883 222612 111803 71931 171768 -199170 -339075 169434 -301223 340348
12901 361135 66284 -24966 -33766 181666 -298846 58045 -68999 46225 27384 349533 -238950
12889 -117379 -10306 -9736 18911 -391803 -137251 211909 6491 136016 70555 80233 157728
12878 157728 132541 62595 134515 305128 -129906 -254812 187740 -96982 -86872 322738
12867 -104098 49259 103007 -148601 124751 -9718 -29785 -63667 285935 -109631 -359615 -57900
12855 214219 78981 140104 -78979 54765 110336 -66102 229706 199657 -253987 341797 -59737
12843B85529b52536h6512D7021g912A67008J42939a93434A09831B5013O1024b59717
12831A69146c8641A77061a94976A93681d8421k6269l1168A343a49968d0298k05101
12820b45399B0972d2674G8483e7048r8053n3377E6409P4309a58372N7542q003
12809a08833G5053m517J9692D5100J4989D03c3296K982j34185L8910C9062b92724
12796b25051a09271C1411b22290f9383A29920C0750a29246K019L6538j24067C0562
12784C2242b0930j66334R2573A68368b41981P6506P5228A59921A5380b67699a3707
12772F5664J65633h0296a8503k3017j01647A93883F256K89170a93145e524A23974
12760a64679A75875J32824b89380A69595n2959b16495F940d3917l6032F1137b04785
$$ plain form
12843 285529 -252536 -86512 47021 -7912 167008 309947 -193434 109831 25013 86037 -259717
12831 169146 -38641 177061 -194976 193681 -48421 -74690 -105858 1343 -149968 -40298 -245399
12820 -245399 20972 -42674 78483 -57048 -155101 -208478 56409 130718 -158372 -100830 -108833
12809 -108833 75053 70536 90228 45100 60089 403 -33296 -30314 -164499 -125589 39062 -292724
12796 -225051 -109271 31411 -222290 -69383 129920 30750 -129246 -127227 -90689 -214756 30562
12784 32242 -20930 -187264 -94691 168368 -241981 -165475 -90247 159921 15380 -267699 -13707
12772 65664 231297 -80296 -18503 -41520 -143167 193883 6256 295426 -193145 -5524 123974
12760 -164679 175875 308699 -289380 169595 116636 -216495 6940 -43917 -79949 61137 -204785
12748A34875c82019J76980j97510a04954F2963N0719a92000d4026C1L50196D8849
12736c38651G9301i2082b5223B24944a92586R1574B79861D2843c30H3409A0835
12724a15061j85092B87556e7195H1149g3772j53906E0045K56871B8699M3258J42845
12713B14802A05198C0395e8926A40158b33221M3016K0087B85739G1516a05871
12702B80028h8146E91N5776a34151Q395G8250a19133K0678H6375J0565l0088N38974
12690F05826c6069j6850j93749E5000J18173N3524a62167A48318n4532g0866j91732
12679b62598a4633I0867J0332K27352I8438A1704J48213b77960h6047n3352A98186
12667A7733L45508E3598b9821B11206D4954J43417k121a23985B08700O2153p8339
$$ plain form
12748 134875 -382019 -205039 -402549 -104954 62963 113682 -192000 -44026 31 350227 48849
12736 -338651 79301 -92082 -25223 224944 -192586 -101012 279861 42843 -330 83409 10835
12724 -115061 -300153 287556 -57195 81149 -73772 -227678 50045 306916 28699 71957 214802
12713 214802 105198 30395 -58926 140158 -233221 -190205 -170118 285739 71516 -105871
12702 280028 -88146 591 56367 -134151 -125756 78250 -119133 -98455 86375 96940 66852 605826
12690 605826 -36069 -52919 -246668 55000 173173 226697 -162167 148318 93786 -70866 -262598
12679 -262598 -14633 90867 101199 328551 98438 11704 159917 -277960 -86047 -139399 198186
12667 17733 363241 53598 -29821 211206 44954 188371 186250 -123985 208700 270853 192514
12656A92514o5846E4853L2761C7140J64843G6208k2771a91172A74587K4042a3655
12644D20682j20816a44983A28732a53361k601a2266C8598a00421b0127j22631
12634a42758C41132j69067J51447n496J9014B9700K06927r2295M3348J4593K98718
12623E00991B24671A3002L48142j31534b44712C21291j25262D0537d7784A82682
12612A6668a7168A16279J1249b936k73496A45235h8463A28910a2807A97405a44091
12600b6817j20914N8526B516O9528L1741a39013r1939B18894n5363H0104Q5225
12589A65329b41703A28515b70625B0675J11348a73813P5569A20304C5391J1317
12579D6708c16849A7163la08947d6743k07027N7026Q3142F1098c4756r9693B20050
$$ plain form
12656 192514 126668 54853 87614 37140 201983 76208 53437 -191172 174587 198629 -13655
12644 420682 299866 -144983 128732 -153361 -155962 -12266 38598 -100421 -20127 -142758
12634 -142758 341132 172065 323512 318016 337030 29700 236627 144332 187680 202273 500991
12623 500991 224671 13002 361144 229610 -244712 321291 196029 40537 -47784 182682
12612 16668 -17168 116279 127528 -2936 -276432 145235 -88463 128910 -12807 197405 -144091
12600 -26817 -147731 -89205 2516 72044 103785 -139013 -230952 218894 163531 80104 165329
12589 165329 -241703 128515 -270625 20675 132023 -173813 -98244 120304 35391 46708
12579 46708 -316849 17163 17160 -108947 -46743 -253770 -196744 -113602 61098 -34756 -134449 220050
12566E0138K0483a47699C90817B8150O6261c6543A16118b17201A90594L62303
12556E52897k47143a42271B2285c3905F2950h0216j40660b8800m7511m6547j18620
12545b41478E12043a30329H0518K08958b7171D0264n772J11586c7053k6401k53839
12534c17293J54451E0969K47577n4158C0526b29996b8762l20364c7989A88622
12523h9239A07036k4663i9858j81B77797H1046c776j93403h9882B45232a0748
12511d5834b0613j82525J1416B73867b77995A28963J05444G030K25331b02912
12500b30569A09263D9161a07394c5016G0742M53255A49648L7587J6571c9418A81424
12488B04235j3475c78451D9877a26233p419j67072i7011B03031M6287q7606a08906
$$ plain form
12566 50138 70621 -147699 390817 28150 94411 -36543 116118 -217201 190594 552897
12556 552897 305754 -142271 22285 -33905 62950 -80216 -220876 -28800 -76311 -122858 -241478
12545 -241478 512043 -130329 80518 289476 -27171 40264 34492 146078 -37053 -63454 -317293
12534 -317293 -162842 50969 298546 244388 30526 -229996 -28762 -349126 -37989 188622
12523 -89239 107036 82373 -99858 -100039 277797 81046 -3776 -197179 -89882 245232 -10748
12511 -45834 -20613 -203138 -191722 273867 -277995 128963 234407 7030 232361 -202912
12500 -230569 109263 49161 -107394 -35016 70742 523997 149648 187235 203806 -39418 181424
12488 204235 190760 -378451 49877 -126233 -133652 -300724 -97011 203031 249318 161712 -108906
12476a60215A02061m2073J10899a61923A0599J9220c5026B7684H202Q6109b6425
12464A31g7350D166J41608N2134G6925R9142J49977L6855a49800j36797g7953
12452a11783B6101k499f8123E7081k900b20825h7131A4217N9423d9682A15430
12440D8727B1937a3100A29183J34047G921e2033A6997a47120A80362k2288a40525
12428A27247F892J3671Q7227Q6872a90378D0404J28052K36911a35132B36677G4759
12416a27332a6537H39M7438q237a26406l51077f8304a8760r1314d0512A2088f2289
12403c56160A70730N5379M2980d0248J909D5351g6991k30733F1773i2992D3356
12391b68678a5377j30181A20203g2865E24983A18578a74618B70000a51580o6271
$$ plain form
12476 -160215 102061 59988 170887 -161923 10599 29819 -35026 27684 8202 94311 -26425
12464 131 -77350 4166 145774 197908 76925 176067 326044 362899 -149800 -286597 -77953
12452 -111783 26101 23602 -68123 57081 54181 -220825 -87131 14217 73640 -49682 115430
12440 48727 21937 -13100 129183 263230 7921 -52033 16997 -147120 180362 158074 -140525
12428 127247 6892 20563 107790 194662 -190378 40404 168456 405367 -135132 236677 74759
12416 -127332 -16537 839 48277 40040 -126406 -477483 -68304 -18760 -110074 -40512 12088 -62289
12403 -356160 170730 226109 269089 -40248 -38339 45351 -76991 -307724 61773 -92992 43356
12391 -268678 -15377 -145558 120203 -72865 524983 118578 -174618 270000 -151580 -217851
12381b17851C75007H9689D3917b943j27754l3946f0559b332j7298q322C78224
12369c4509k19262D4364M6894A9537a56792D7516P2944b04754l8544B06741n069
12358B01672e5170B16033I5274k630b21397r7624M3872a19836c7492I1210J99454
12347B90664a89101A19344a72305k39089a44291D3283L67360A1384K31583c7805
12336B67697A09566c6928A85371N1318I3352J96983e5816C1335J33281j3246K2175
12325A73545C4057a74591H8437K12410b6472C00864j7852a45370A23712J53150
12315B76862A3875K25164h851B69115m4727H3648b1142A4419L5129J52496k345
12304A99699i9694B00494h4622F3870J04884J6471J42848N1587B5623L83209j63390
$$ plain form
12381 -217851 375007 89689 43917 -2943 -130697 -164643 -60559 -2332 -19630 -27952 378224
12369 -34509 -253771 44364 91258 19537 -156792 47516 120460 -204754 -243298 206741 201672
12358 201672 -55170 216033 95274 92644 -221397 -319021 -275149 -119836 -37492 91210 290664
12347 290664 -189101 119344 -172305 -411394 -144291 43283 410643 11384 242967 -37805
12336 267697 109566 -36928 185371 236689 93352 290335 -55816 31335 164616 151370 173545
12325 173545 34057 -174591 88437 300847 -26472 300864 283012 -145370 123712 276862
12315 276862 13875 239039 -8851 269115 224388 83648 -21142 14419 49548 202044 199699
12304 199699 -99694 200494 -84622 63870 168754 185225 328073 379660 25623 408832 245442
12293B45442h6253D70864D537N0884L1478a00708C93929A54302m9871K62353a16985
12281c5257D2769J79753a45349D35161i8221p9780A24895b6798B47567a86842
12270B27729d6282j71313H7293J3385J87002j10753a70745f6536E2750P7067a94207
12258a23674M6662G0702a38377B90558Q7641b31807A48517J32141b81585E9024
12247G4840J03200p8353p97J36843O059c9878A00922j1289R7170a0742j26910
12236a37652B06762F9220r170K03460A31018h0194c2819C29460b7983A43349J02202
12225B45551D7417K25476o9813l8926K2492N0386A16422J43626L00405B15370
12214C36548Q7462G619a61749C39345A2495h4412H8323J84172B8992L9853B0477
$$ plain form
12293 245442 -86253 470864 4537 55421 86899 -100708 393929 154302 104431 366784 -116985
12281 -35257 42769 222522 -145349 435161 -98221 -178001 124895 -26798 247567 -186842
12270 227729 -46282 -217595 87293 100678 287680 176927 -170745 -66536 52750 129817 -194207
12258 -123674 -77012 70702 -138377 290558 378199 -231807 148517 280658 -281585 59024
12247 74840 178040 99687 98890 235733 241792 -39878 100922 89633 186803 -10742 -137652
12236 -137652 206762 69220 60050 263510 131018 -80194 -32819 329460 -27983 143349 245551
12225 245551 47417 272893 203080 164154 186646 237032 116422 260048 560453 215370
12214 336548 424010 7619 -161749 339345 12495 -84412 88323 272495 28992 68845 20477
12202C57314J37733E7947N3828J71358A16672k4545i3454a2645E16056p081B47526
12190C43093L3452A72549q1459c4235C17265K0649I4453J19631K1510f9026B72831
12178h1313B01017J76345B3538J16319J31660j10283J7325K0233r3450m6016O2305
12167A21631b40052g2223C15084A54654J48399H4942M07783A14740Q7586a8459
12156B8925c6337A7616L35279j58507p528L83653A46830P5804E7102e4536A45003
12144B53461b45821B97248J78419i5009B53584J08424I1456O7532L01661l2965
12134D27684e0204J4331B39158b9133A45475Q1335I7855P0126a41542F7039K41973
12123C09012n6219K51558b2862A83178A1631M89539F519P7357B8271a04082G05
$$ plain form
12202 357314 495047 57947 111775 283133 116672 92127 -93454 -12645 516056 508975 247526
12190 343093 376545 172549 91090 -34235 317265 337914 94453 214084 235594 -69026 272831
12178 -81313 201017 377362 23538 139857 271517 161234 178559 198792 105342 59326 121631
12167 121631 -240052 -72223 315084 154654 303053 84942 492725 114740 202326 -18459
12156 28925 -36337 17616 352895 194388 186860 570513 146830 222634 57102 -54536 145003
12144 253461 -245821 297248 475667 -95009 253584 362008 91456 158988 460649 427684
12134 427684 -50204 -35873 239158 -29133 145475 226810 97855 167981 -141542 67039 309012
12123 309012 252793 504351 -22862 183178 11631 501170 6519 83876 28271 -104082 705
12111B55387M9035A29868K25479j32839H368J88850a40045B50830f9210J8824
12101e0386A43608j956B6064K45769N3698B7312J88703P6622F1063b34423C54458
12089c984D50581i0650H141f4899A35258K02249A56097J55482G3545f5901m141
12078g0042A56424I360a60887A02678i7956A18756B7487K01933o7596j016A010
12066C06973A29692a0339n8348B10386B2973N3177f4857D5036K0124e0786C8214
12054a08148l41775g9829j85745J6803m0252l5986F0623g7908k6748D2083I710
12042d8475o5132m5774B52880e8873j96011f6527p6169d612j14044K6011a1254
12030a15742A79175f638j18765a3232B22491C6296N2052d3864j16324k0481j26375
$$ plain form
12111 255387 304422 129868 355347 222508 8368 197218 -140045 250830 -69210 -50386
12101 -50386 143608 141652 26064 271833 325531 27312 216015 292637 61063 -234423 354458
12089 -3984 450581 -90650 8141 -64899 135258 337507 156097 311579 73545 -65901 -70042
12078 -70042 156424 9360 -160887 102678 -97956 118756 27487 229420 161824 160808 1010
12066 306973 129692 -10339 -68687 210386 22973 76150 -64857 45036 65160 -50786 38214
12054 -108148 -449923 -79829 -265574 -248771 -289023 -325009 60623 -77908 -104656 42083 9710
12042 -48475 -113607 -159381 252880 -58873 -254884 -66527 -142696 -4612 -118656 -92645 -11254
12030 -115742 179175 -6638 -125403 -13232 222491 36296 88348 -43864 -160188 -180669 -307044
12019c07044C99896E621a48820B9247d8334J5042D18804F4191B4315i9422M7526
12008e1896j25529M1691o8770Q6039j35708a01905B02845l8692Q6814b34271d2767
11996b70532e3460j08087C3359a78002A9568e3382B0951a69113A496i0892B15819
11984G2934a1866k0285C4242Q826Q1922c33868H2243b64800A01886g5620D4465
11972b7445j32006D31125j65433L5390b95430E1632c32542q2230h6741E4749M3936
11961I8685a29653r8225B96318a51400a5863A26546a99448G172c280k5110A21781
11949c08463C27202c76081H7675a543l97450A26625f301j06648G2523k6841c3345
11937a90454l94809A13771k672J09139a03762A54627f6356E7129L3904c6662P954
$$ plain form
12019 -307044 399896 5621 -148820 29247 -48334 -33292 418804 64191 24315 -99422 -51896
12008 -51896 -177425 -135734 -204504 -118465 -254173 -101905 202845 164153 250967 -234271 -42767
11996 -270532 -53460 -161547 33359 -178002 19568 -53382 20951 -169113 1496 -90892 215819
11984 72934 -11866 -32151 34242 43068 124990 -333868 82243 -264800 101886 -75620 44465
11972 -27445 -159451 431125 265692 301082 -295430 51632 -332542 -414772 -86741 54749 98685
11961 98685 -129653 -227878 296318 -151400 -15863 126546 -199448 7172 -3280 -28390 121781
11949 -308463 327202 -376081 87675 -1543 -398993 126625 -6301 -112949 72523 45682 -33345
11937 -190454 -585263 113771 111099 220238 -103762 154627 -66356 57129 91033 -36662 -28708
11926b8708j49289B40385f7723j20129J7289M3558k27088d012H7928a36134H8972
11914G4795d7730E4653h6288C22549b2292D4119R2033a94910L6567B05538c29316
11902b02207C42012h3205j29059h1402C3109b05799C35698f2140J3489H115a56540
11890H4823e5587J9738q4365A77358O5147b4693A38125b20519j8258J06737c0144
11878G0073a16864c1915l8281k083j72152r9916J65485p9433a02861k6692G2201
11866a9403n787A54991a51422L5704A87776q7893J11839a10836r5633k05597a62639
11854b52842A32264a47825k05705J56569j01821E6926c26984d9879B97419b81105
11843b99218f992A99763c7922r5891n9684M4098r4477g9321j37935d4663q792
$$ plain form
11926 -28708 -177997 240385 -67723 -187852 -170563 -127005 -354093 -4012 87928 -136134 88972
11914 74795 -47730 54653 -86288 322549 -22292 44119 136152 -194910 -158343 205538 -329316
11902 -202207 342012 -83205 -212264 -81402 33109 -205799 335698 -62140 -48651 8115 -156540
11890 84823 -55587 -35849 -120214 177358 242505 -24693 138125 -220519 -238777 -132040 -30144
11878 70073 -116864 -31915 -70196 -72279 -244431 -344347 -178862 -258295 -102861 -129553 72201
11866 -19403 -25190 154991 -151422 -115718 187776 99883 211722 -110836 -206469 -412066 -162639
11854 -252842 132264 -147825 -353530 -196961 -298782 56926 -326984 -49879 297419 -281105
11843 -299218 -6992 199763 -37922 -133813 -193497 -149399 -243876 -79321 -217256 -44663 -53455
11832e3455l26801g0193A05168a38999o4069O0930q7101O7931G997b61568e1962
11820c16371J41970A04059b92930O6015J12927C53415b22474j4671A04356L634
11810A07990i709k48923E7152a83829A52458f0051H8613a30492N0342B56625F1631
11798c94176h9709A12646K13173F0162d4333j47862A4148b29222H1229i7096l686
11787a00782O536A02463N3226G6834b11362k36199c734B0818a96161N8596N9050
11776g8515A50437g5822j4052J5893q4942A5367d28353h7897j28705A34183N7699
11765A91882b18951E8666a04739F6046h2324I9618C7607K88433i381G8883E498
11753a27908j58413G8549a11429d1159A73312a52486Q547l2318J4553L428d1420
$$ plain form
11832 -53455 -380256 -70193 105168 -138999 -203068 -142138 -229239 -161308 7997 -261568 -51962
11820 -316371 -174401 104059 -292930 -226915 -113988 353415 -222474 -237145 104356 107990
11810 107990 -9709 -258632 57152 -183829 152458 -60051 88613 -130492 -80150 256625 61631
11798 -394176 -89709 112646 325819 60162 -44333 -192195 14148 -229222 81229 -97096 -100782
11787 -100782 -94246 102463 155689 76834 -211362 -447561 -3734 20818 -196161 -137565 -78515
11776 -78515 150437 -75822 -89874 -73981 -158923 15367 -428353 -87897 -216602 134183 191882
11765 191882 -218951 58666 -104739 66046 -82324 99618 37607 326040 -9381 78883 5498
11753 -127908 -286321 78549 -111429 -41159 173312 -152486 -143939 -176257 -161704 -158276 -41420
11741f105A33600c1964B95321j40256l0515a32090B85741G2524l4050a31457b8428
11729d07254a22837o0581G299a92010j60762A69217A1152N2328b76733k4697A6911
11717f4217l13309b798l55887C19273a45150J1327c7750p7625l88485a28212l8467
11706a66679E2257c26980O1246F1956K8869e1068A65683J7145a56397J1367i548
11694A19627a56482j07933J14672p1803j21976H7763K4939O7911a31662j12404
11684b44066A21064c31281a36143B37274g3130k5987d0337j63060h6274r8897
11674a85171g6175l5054F697J35019E0662e7356j84118O5652P3386j19755e8697
11662F2065J01846q0392a66302E68b44869A947h6663m74j01748J7662B82746b35393
$$ plain form
11741 -6105 133600 -31964 295321 155065 124550 -132090 285741 72524 38474 -131457 -28428
11729 -407254 -122837 -183418 7299 -192010 -352772 169217 11152 63480 -276733 -301430 16911
11717 -64217 -377526 -2798 -358685 319273 -145150 -133823 -37750 -115375 -503860 -128212 -166679
11706 -166679 52257 -326980 -265734 61956 90825 -51068 165683 182828 -156397 -145030 -9548
11694 119627 -156482 -264415 -149743 -221546 -343522 87763 112702 180613 -131662 -244066
11684 -244066 121064 -331281 -136143 237274 -73130 -99117 -40337 -203397 -86274 -185171
11674 -185171 -76175 -111229 6697 141716 50662 -57356 -241474 -175822 -102436 -222191 -58697
11662 62065 163911 83519 -166302 568 -244869 1947 -86663 -87137 -188885 -171223 282746 -235393
11649C01323a7929m0424B36879j16153e7415K112C3474a22175a0468j84248h9156
11637a46565O2279K490B22195a17472c0854B26226b32212L5641A54426d03326
11626E8584e0545k61311a37403A91550a23886A58037A1220l383f5764q3032j765
11615a50561C3843a82599N1336f5456j24088R1024K9465l5533k0507d955m699
11604i654r2266j45703h719k79537J41439L3412H1720a72002C23449A50104a28215
11592a9013l13581B26647c48104J07750G8425K20297B4426i6627k06611j44515
11582d47753J29161f9169a2949q6830H9390J296h9822l4212A08908d9120d780
11570b78869I3509h4670B23779a1468A7447G933b77296B9428g1927l64580f3876
$$ plain form
11649 301323 -17929 -58353 236879 120726 -57415 -55303 33474 -122175 -10468 -194716 -89156
11637 -146565 -84286 -81796 222195 -117472 -30854 226226 -232212 -196571 154426 -403326
11626 58584 -50545 -311856 -137403 191550 -123886 158037 11220 7837 -65764 -148796 -150561
11615 -150561 33843 -182599 -131263 -65456 -189544 -98520 -69055 -104588 -125095 -4955 -9654
11604 -9654 -101920 -247623 -8719 -288256 -146817 -113405 81720 -172002 323449 150104 -128215
11592 -19013 -332594 226647 -348104 -240354 78425 298722 24426 -96627 -303238 -447753
11582 -447753 -318592 -69169 -12949 -99779 89390 90686 -89822 -124034 108908 -49120 -4780
11570 -278869 93509 -84670 223779 -11468 17447 7933 -277296 29428 -71927 -436507 -63876
11558A76164L1152f7324A86075i7033G3708C3731c11577q7105a74627h4620E1092
11546a88658k9203B9160a92080E2758b48583C00526a58774A58399c68573i3916
11535f329B51686A486J49978n7724M5196b2477I2444C4287M7676a92761D7149
11523B17043d6319B43041b9694A3443n966b82391F3845L6262b44442D26136A46180
11511C60770H8755a08781N1161j10768B32229b5157C02150a13364m1377A88941
11500A45286Q8106K57553k31806D1385j6520J40550K2906p5163J9285K9346B1323
11488B2499M2079J83409M4601b2575B56554d895o7410D4610L930L65925A33935
11476C07767j05144c6837q3582N9921D8281L63740D181J73789f5276C29694a35745
$$ plain form
11558 176164 207316 -67324 186075 -97033 73708 33731 -311577 -398682 -174627 -84620 51092
11546 -188658 -217861 29160 -192080 52758 -248583 300526 -158774 158399 -368573 -93916
11535 -6329 251686 1486 151464 93740 138936 -22477 92444 34287 81963 -192761 47149
11523 217043 -46319 243041 -29694 13443 7477 -282391 63845 100107 -244442 426136 146180
11511 360770 88755 -108781 -57620 -168388 232229 -25157 302150 -113364 -154741 188941
11500 145286 233392 490945 259139 41385 24865 165415 188321 113158 132443 161789 21323
11488 22499 64578 247987 292588 -22575 256554 -4895 -72305 44610 48540 414465 133935
11476 307767 202623 -36837 -120419 -60498 48281 412021 4181 177970 -65276 329694 -135745
11464D60763b6369D0612J04181b68840G7295e519j8410j8068B45014H0374B3277
11452A09257J18084c6264H476J16647c21116b5113A23054K969B9993L40807e3190
11440B826d4792B44276J22989B5967L3273b18480Q6939M8017j44715A64908Q3574
11429B48482p6143p3116a21753j21033D49234B8627c00029a32785E2714O8300
11419A21014d7461m2587m2385C68848C6169P0236j1090a73185f1264r2492G0776
11407B6688e6592B83445F462c5189A60616d88706A8844D107a63894A71653c712
11395a42579A74903b96952l4953C63258A25567a5175F5649d6518j09230j26333
11385b82081G354c2627d565q6804L6882C41b68022P4102k967k0410C14758b08736
$$ plain form
11464 460763 -26369 40612 144793 -268840 77295 -5519 -23929 -41997 245014 80374 23277
11452 109257 227341 -36264 8476 125123 -321116 -25113 123054 126023 29993 370800 -53190
11440 2826 -44792 244276 367265 25967 59240 -218480 -131541 -83524 -228239 164908 248482
11429 248482 172339 99223 -121753 -242786 449234 28627 -300029 -132785 52714 121014
11419 121014 -47461 -90048 -132433 368848 36169 106405 95315 -173185 -61264 -153756 70776
11407 26688 -56592 283445 6462 -35189 160616 -488706 18844 4107 -163894 171653 -3712
11395 -142579 174903 -296952 -331905 363258 125567 -15175 65649 -46518 -155748 -282081
11385 -282081 7354 -32627 -4565 -91369 -54487 341 -268022 -193920 -196887 -217297 314758 -208736
11372b82860b8253k12066A55878b93332M1943E2184h9951j89766g8758H7003d9430
11360A4489d3373h265j4684n9643j3393l1124B12449B1931a43584C10109A06219
11348a23187b1755G8317J33020b5313k30150b7634C9267K63913c20589I9360f6006
11336c57285E40572I2306K64761c03380a42796j3600r6418c5445o1568E7954A1034
11324a19345j49908h3261I0346A5827J38359L4146E140K03976b9440D7066b73587
11312B24964r8794d52187b16581g2423A66566d4573G9282g7704B0852b27765g5527
11300b00443B14149b68886A94267a65664E2287a31760b0143A47785e8234D5933
11289a07577o2180E6462a30549B34235a65929P228F9355c0624p0399i183H8336
$$ plain form
11372 -282860 -28253 -240319 155878 -293332 -251389 52184 -89951 -279717 -78758 87003 -49430
11360 14489 -43373 -8265 -22949 -82592 -95985 -127109 212449 21931 -143584 310109 106219
11348 -123187 -21755 78317 211337 -25313 -255463 -27634 39267 303180 -320589 99360 -66006
11336 -357285 540572 92306 357067 -303380 -142796 -156396 -252814 -35445 -97013 57954 11034
11324 -119345 -269253 -83261 90346 15827 154186 188332 5140 209116 -29440 47066 -273587
11312 224964 126170 -452187 -216581 -72423 166566 -44573 79282 -77704 20852 -227765 -75527
11300 -200443 214149 -268886 194267 -165664 52287 -131760 -20143 147785 -58234 45933
11289 -107577 -169757 56462 -130549 234235 -165929 -158701 69355 -30624 -101023 -9183 88336
11277a80218d2344L029C3194d5620k64805I9497e45005a87382h3499D55090b41172
11265E4877k3303P8626K60539A1051b008j24599j30960A1443b47312H5632a15605
11253B8137J08961F7780a43544A60999b03285j26314a51589o3301n6653g5252
11242a07095l15031b08171A29358a4895q4227p5536k08509j1778Q9704J22750
11232a82491n9645C17773H6565k5441h9398N724H5043a46877B84822c30404J35186
11221a95218O3526I1495J85266j9359i2158j85070h7702r8978L2858A56017b3267
11209A28919e8474k60270D7684K5718b00451F9403d6010m2489j71320e6431J0132
11198d6299j17959c1605c04o7826L0601B67694i2664e78F1355a13937G3896a17322
$$ plain form
11277 -180218 -42344 -39315 33194 -45620 -310425 99497 -545005 -187382 -83499 455090 -241172
11265 54877 31574 110200 370739 11051 -2008 -126607 -257567 11443 -247312 85632 -115605
11253 28137 137098 67780 -143544 160999 -203285 -329599 -151589 -214890 -271543 -75252
11242 -107095 -422126 -208171 129358 -14895 -99122 -174658 -383167 -394945 -305241 -182491
11232 -182491 -242136 317773 86565 61124 -89398 -83674 85043 -146877 284822 -330404 -195218
11221 -195218 -131692 91495 276761 257402 -92158 -277228 -87702 -186680 -153822 156017 -23267
11209 128919 -58474 -318744 47684 73402 -200451 69403 -46010 -88499 -259819 -56431 -46299
11198 -46299 -164258 -31605 -304 -68130 -37529 267694 -92664 -578 61355 -113937 73896 -117322
11185i6891j65572C5167b29309j57108f3319A15333d13r2385F968g2076A81449
11173C1918b08569k75192a44415f1080k26778A91074E0209a74506p3058A5851
11162A22688a46843j38497a5506j42958B98261r8267i4621A06335a20143c1848
11151B02914b02035c261l46786C8047b10500C42451F0380L8287a91308a2230E8304
11139A1363Q4482C4534J47445i2531K2296G2307J4097f8269H8847c4031k9336
11128f3367j36043B02301I0975N9268n4065o64P4772b99056P8927e1669E8564
11116A77384I928a8294A81104a22141A69838a49199J7167A6392L21022j45419
11106A91995B0308J24010g4253j5225C2309M20860j69536A22464J94590O9978
$$ plain form
11185 -96891 -262463 35167 -229309 -386417 -63319 115333 -413 -92798 6968 -72076 181449
11173 31918 -208569 -483761 -144415 -61080 -287858 191074 50209 -174506 -247564 15851
11162 122688 -146843 -285340 -15506 -158464 298261 199994 -94621 106335 -120143 -31848
11151 202914 -202035 -3261 -350047 38047 -210500 342451 60380 98667 -191308 -12230 58304
11139 11363 95845 34534 181979 -92531 -70235 72307 86404 -68269 88847 -34031 -63367
11128 -63367 -199410 202301 90975 150243 96178 95514 170286 -299056 -220129 -51669 58564
11116 177384 9928 -18294 181104 -122141 169838 -149199 -132032 16392 337414 191995
11106 191995 20308 144318 -74253 -89478 32309 453169 283633 122464 317054 387032
11096C87032J33180H5758J63236o6654K59160j46633K3418G6772K67612A69469
11085H5329K65126j17183n9955j247J70540A31114c3513B98324n3568G7639J75211
11074B52850l3391a30915A15009a21439E66995j06527j04216j02453P5324J4688
11064C43811R8334P2451k20596R7022k1922J17732k10644L70118l4554J39480
11054G51232p3325A99901J54767J47444K16256r3185J0392K08008j96507P7744
11044G24820J5512B25105L44827L75430l03072M01210j87639j88537p9016J34977
11034G23285m3015P4341O1251j23019K70989j68840L5636j03802r4587K35859
11024H68098j03109q2402J33423j67084M21554k64970l721k85040J11846K0390
$$ plain form
11096 387032 520212 85758 248994 182340 441500 294867 318285 76772 344384 169469
11085 85329 350455 233272 173317 172070 342610 131114 -33513 298324 244756 77639 252850
11074 252850 219459 -130915 115009 -121439 566995 460468 356252 253799 329123 343811
11064 343811 442145 514596 294000 391022 369100 486832 276188 646306 611752 751232
11054 751232 677907 199901 354668 502112 718368 625183 635575 843583 647076 724820
11044 724820 740332 225105 569932 945362 642290 1043500 855861 667324 588308 723285
11034 723285 680270 754611 815862 692843 963832 794992 830628 726826 632239 868098
11024 868098 764989 682587 816010 648926 1070480 805510 801789 516749 628595 648985
11014F48985L2398j99878B31059N49403O4188o9302l16795J85017K03497l71001
11004D76066K87973K8445j2956j23372R310L6455j94938L57070l09018K97475
10994H52510k12328J517J39748j16407K48083K0495k95900J36937P4865k01730
10984F47790C06118O04607J78375J9260j35857j50549R9879L76342j12126K33497
10974A419546K38100j73789N92060j42798O87730n2573R6568Q7864J02663j52476
10964B702895K75192l99796q4447j78180n06829J075l26291k37124k10732l43624
10954F92139L879k46765K70913k52506K33842l7320j88581D3436K26293E174P1701
10943G6875a16585A96699A6737N9620J49407O1402j38804J19307H4972a09697
$$ plain form
11014 648985 681383 481505 231059 780462 844650 775348 458553 643570 847067 476066
11004 476066 764039 792484 779528 656156 665466 701921 506983 864053 555035 852510
10994 852510 640182 641699 781447 665040 913123 933618 637718 774655 849520 647790
10984 647790 306118 910725 1089100 1108360 972503 821954 921833 1298175 1186049 1419546
10974 1419546 1657646 1483857 2075917 1933119 2620849 2568276 2664844 2752708 2855371 2702895
10964 2702895 2978087 2578291 2493844 2315664 1808835 1809910 1483619 1246495 1035763 692139
10954 692139 696018 449253 720166 467660 701502 664182 475601 43436 269729 5174 76875
10943 76875 -116585 196699 16737 76357 225764 287166 148362 267669 84972 -109697
10932D7909e5890B35439q9489a09288B35361h896A75783J41697a63394q5209B61534
10920B98386a33106A81867C0181a01729J7631k80618M4671B15254D1291d2426
10909B35198j07955c39696f0346p6300K8157F5634j4840g7278l14494R3545C3929
10897b09707o1759B68079c1310E0406a95137j34229h9773c8595q391A77423B607
10885A07476R5892j7202a74949G1234f8794B88100b99884f148l2520r976B65967
10873a13554A19298a85146P9460j19008e2952m0798B87931k6426D3596P3358a04208
10861D7285c98119J54909c3637B64173j29713l9690l6863a68151f9822k83095
10851c52917a0403n2672o4982B5336L8965a69694N6187C83957c03960A85660p7824
$$ plain form
10932 47909 -55890 235439 145950 -109288 235361 -8896 175783 317480 -163394 -248603 261534
10920 298386 -133106 181867 30181 -101729 -84098 -364716 -320045 215254 41291 -42426
10909 235198 127243 -339696 -60346 -136646 -108489 65634 50794 -77278 -391772 -298227 33929
10897 -209707 -271466 268079 -31310 50406 -195137 -329366 -89773 -38595 -46986 177423 2607
10885 107476 203368 186166 -174949 71234 -68794 288100 -299884 -6148 -38668 -48644 265967
10873 -113554 119298 -185146 -105686 -224694 -52952 -93750 287931 261505 43596 116954 -104208
10861 47285 -398119 -243210 -33637 264173 134460 94770 57907 -168151 -69822 -352917
10851 -352917 -10403 -63075 -128057 25336 64301 -169694 -113507 383957 -303960 185660 107836
10840A07836c17604g7764j37313J04775b4860B42529a68218h2872K5330l8297
10830i5839k84193a66476A06454K31704a48204L4659A49703a59476e8282p7764
10820a36046G5850f8952a5597A59764i9178k32266I8228B3445b7775l1276B919
10808c39034B842Q2709b9868p7367A3913b265o0809j28028g6587k37099C5246
10796g0745I0895B1152J72449n7165a41857A2518b66943f5805l56233a74965G8454
10784a77055C3981f6523A4830a77669I9187a76979b6680q5819d7824A55021a85741
10772h4849B3767a78249b7961A74350i8200F0450a43765N8409o8565c2914k44565
10761b77479N7330f1546k22601J16126C28014a2251k0357k74363J36398M3905
$$ plain form
10840 107836 -317604 -77764 -215077 -110302 -24860 242529 -168218 -82872 -57542 -95839
10830 -95839 -380032 -166476 106454 338158 -148204 -113545 149703 -159476 -58282 -136046
10820 -136046 75850 -68952 -15597 159764 -99178 -331444 98228 23445 -27775 -59051 2919
10808 -339034 2842 85551 -29868 -107235 13913 -2265 -63074 -191102 -76587 -313686 35246
10796 -70745 90895 21152 193601 136436 -141857 12518 -266943 -65805 -422038 -174965 78454
10784 -177055 33981 -66523 14830 -177669 99187 -176979 -26680 -112499 -47824 155021 -185741
10772 -84849 23767 -178249 -27961 174350 -98200 60450 -143765 -85356 -153921 -32914 -277479
10761 -277479 -220149 -61546 -284147 -168021 328014 -12251 -32608 -306971 -170573 -126668
10751a26668j79192g2237D9106J37201J67332e7087K1821B11345h6332A58217
10740a00279h62j20707o7438n0512k4627a13770k8189L2267A12186b16753G0214
10728d03878a03066k5681n8759f4739p8337F1433h7941n3030B43714b41526k4667
10717b66193N4409h747k71139e0699E9490h2227A04284a40072k66290c4568A18365
10705a7146q4686d0534j33611l6914J0721j4623K9987B88144g0326e723j27977
10694a33700H892h7494n3360d899j20036I6571b43535B39890d1845r5296d9443
10682H7953c9044M270p9905n656m8255R184q9088A64922c8371A2970c1903k40038
10670b71941P1310f1367B40262D9307J03245m2423b7770A08468a14975p4874A6229
$$ plain form
10751 -126668 -305860 -72237 49106 186307 353639 -57087 -35266 211345 -86332 158217
10740 -100279 -862 -121569 -189007 -239519 -264146 -113770 -141959 -109692 112186 -216753 70214
10728 -403878 -103066 -128747 -187506 -64739 -143076 61433 -87941 -140971 243714 -241526 -266193
10717 -266193 -211784 -8747 -279886 -50699 59490 -82227 104284 -140072 -406362 -34568 118365
10705 -17146 -101832 -40534 -174145 -211059 -200338 -214961 -184974 288144 -70326 -5723 -133700
10694 -133700 8892 -87494 -140854 -4899 -124935 96571 -243535 239890 -41845 -137141 -49443
10682 87953 -39044 -34774 -114679 -120335 -168590 -159406 -248494 164922 -38371 12970 -31903 -271941
10670 -271941 -200631 -61367 240262 49307 152552 110129 -27770 108468 -114975 -189849 16229
10658F1207a18719n0092G5444J8597J22418J27178f6385J4380b32j97363A89205
10646A18534i1220A8039M5333b0596k09448a1524n5024E5967J20026G2979J84317
10635B57296A14320l6348d14927f7738k42122d0684F3324h8656B19646f1494m9305
10624a10799A8643J80245a3696j45610A30558J12169F5976a45172F1890a06889
10613A71577b15768j0587P6491n3389m3999O4927A39303e9930I1403f719A665
10601A43573a7396B74033B7955a86832h0869j44150o3620M5273a722k38515D04494
10589A11304m0483g6311L3394D65120b74907H4768a89679Q8339A15815c99948
10578E3443a4690G701a22470N1232c298n3602k76237R119J27369F3930F69a13436
$$ plain form
10658 61207 -118719 -168811 75444 94041 216459 343637 -66385 -52005 -232 -197595 189205
10646 118534 -91220 18039 63372 -20596 -230044 -11524 -66548 55967 175993 72979 257296
10635 257296 114320 77972 -414927 -67738 -309860 -40684 63324 -88656 219646 -61494 -110799
10624 -110799 18643 198888 -13696 -159306 130558 242727 65976 -145172 61890 -106889
10613 171577 -215768 -226355 -149864 -203253 -247252 -182325 139303 -59930 91403 -6719 1665
10601 143573 -17396 274033 27955 -186832 -80869 -225019 -288639 -243366 -1722 -240237 404494
10589 111304 70821 -76311 -42917 465120 -274907 84768 -189679 -101340 115815 -399948
10578 53443 -14690 7701 -122470 -71238 -3298 -56900 -333137 -324018 -196649 63930 669 -113436
10565A46924e1138A36300a72149j48119Q4007J0072B55973b95951J34516A38555
10554C41605b74453A95783a90603n406e616F893K88539a42115A52164a07111M2724
10543f4387m22238B62411a91058h1060r2487A37010b48171d5884A71842d5626
10532G5747q006a39604B93490c90206a37200A92897a25943F7949a48125A80190
10521c02058O0958c709j67347A5375b59855J19122r6931c2560B0279O029J30502
10510A56810J25985a08084j85125A76290a59900a6145A30221B0720d0189B91341
10499b16771K236a6365D3253b86622A04848e4157j44034i6869p7872A67479a22470
10487c05568g7362m6625N7612h907A46740c21081i6131b0503k89411P6436B43541
$$ plain form
10565 146924 -51138 136300 -172149 -320268 -236261 -226189 255973 -295951 -161435 138555
10554 341605 -274453 195783 -190603 -196009 -5616 6893 295432 -142115 152164 -107111 -64387
10543 -64387 -486625 262411 -191058 -81060 -173547 137010 -248171 -45884 171842 -45626
10532 75747 67741 -139604 293490 -390206 -137200 192897 -125943 67949 -148125 180190
10521 -302058 -241100 -3709 -171056 15375 -259855 -140733 -237664 -32560 20279 26308 156810
10510 156810 282795 -108084 -293209 176290 -159900 -16145 130221 20720 -40189 291341
10499 -216771 -214535 -16365 43253 -286622 104848 -54157 -198191 -96869 -174741 167479 -122470
10487 -305568 -77362 -123987 -66375 -8907 146740 -321081 -96131 -20503 -309914 -233478 243541
10475c49695A1807J68718e9612k72596C71943d4078C11959n4757b05448m705g7714
10463A3756p58O476d4085B24829G6021a54672A424L3584b33647E951a44434k1701
10451a66135C3426J10955m9695D3921b26477j5294r2390D5029j2658J7551a35314
10439A85504i2195A14184a07324L2616b2924B13210a17156d8349k03243J22699
10429a28893N704q7365A89781a38607D695O6048a77306r40n2076L2047a4757A8967
10416g0264j50031c8467A27920a51448A66341a34961A10252a88731A50375m0036
10406A10339a48879k2173G0809a89837q4974j89578a21192B2545d1315F9304a99601
10394d5971E2320J28324b14356B12334J74473A69634N5057C5480K14545a52360
$$ plain form
10475 -349695 11807 180525 -59612 -332208 371943 -44078 311959 257202 -205448 -210153 -77714
10463 13756 12998 19474 -44085 224829 76021 -154672 1424 35008 -233647 5951 -144434 -166135
10451 -166135 33426 144381 94686 43921 -226477 -241771 -334161 45029 32371 49922 -135314
10439 185504 -92195 114184 -107324 -74708 -22924 213210 -117156 -48349 -251592 -128893
10429 -128893 -123189 -210554 189781 -138607 4695 70743 -177306 -178246 -230322 -198275 -14757 18967
10416 -70264 -220295 -38467 127920 -151448 166341 -134961 110252 -188731 150375 110339
10406 110339 -148879 -171052 70809 -189837 -274811 -464389 -121192 22545 -41315 69304 -199601
10394 -45971 52320 180644 -214356 212334 386807 169634 224691 35480 250025 -152360
10383A50380p3436c0591j1060A94030a00022B41846R5107m8701k7845a12368d1409
10371D4966J23674h538j9010E7304K34694a08568C46476J32868K98054C87755
10360F56964l22289o1765N4714B4769J88461j7204q3678J04616J41111j68942
10350A89133L06674j18661L49573n1189B32221F2867K59516M1599j28461j1882
10340B23639g5603c2406A37902O2499M9819K02029j27891j31106R8216H5577b0940
10328A21011J25586q9574p6648P0506J8157b5548A15012L22277k02673E0882j8154
10317C2728J02023h328C6858O8649K23760b84418B08108b23796a11044n090A7957
10305d2219j87860a09364l6825O5336k0264k003A01453J10626B3242e4565a7550
$$ plain form
10383 150380 76944 -30591 -41651 194030 -100022 241846 336953 288252 260407 -112368 -41409
10371 44966 168640 -8538 -27548 57304 291998 -108568 346476 479344 777398 387755
10360 656964 334675 272910 327624 24769 213230 196026 112348 216964 358075 189133
10350 189133 495807 377146 726719 675530 232221 62867 322383 363982 235521 223639
10340 223639 -75603 -32406 137902 200401 250220 452249 324358 193252 291468 85577 -20940
10328 121011 246597 157023 80375 150881 169038 -25548 115012 437289 234616 50882 32728
10317 32728 134751 -8328 36858 105507 329267 -284418 208108 -223796 -111044 -116134 17957
10305 -42219 -230079 -109364 -146189 -80853 -101117 -103120 101453 212079 23242 -54565 -17550
10293b91421J04229k8715q949h8788j34905F347b9047l30971J79453g1568o0276
10282a31844d147D027b0995l1540A45890n3279A5551b75682e9899M322q5349j00681
10270b41607A28443J64068C5057J51754F1496O4573c4657l0767I7223a5814P723
10259h091B93571E2336g9049j32707a3320D3054b69617i5310j49104C27588c02286
10247B72013b36496c3405r660j80768d4613B23644b70588E3751K41270j32248
10237A62773A1208f9358a9859A27883m0404a57020p9942C7231N2379b99906A90783
10225f5467B27415a36971C9785j38M3352i727A82238b11564B33318a4500A24812
10213a08220k47760e428j11450E7146K83288a29105q3944i2080j4661D0945N2347
$$ plain form
10293 -291421 -187192 -215907 -224856 -88788 -223693 6347 -29047 -360018 -180565 -71568 -131844
10282 -131844 -4147 4027 -20995 -52535 145890 92611 15551 -275682 -59899 -55577 -140926 -241607
10270 -241607 128443 292511 35057 186811 61496 126069 -34657 -65424 97223 -15814 -8091
10259 -8091 293571 52336 -79049 -211756 -13320 43054 -269617 -95310 -244414 327588 -302286
10247 272013 -236496 -33405 -43065 -223833 -44613 223644 -270588 53751 295021 162773
10237 162773 11208 -69358 -19859 127883 87479 -157020 -236962 37231 89610 -299906 190783
10225 -65467 227415 -136971 39785 39647 82999 -9727 182238 -211564 233318 -14500 124812
10213 -108220 -355980 -5428 -116878 57146 340434 -129105 -213049 -92080 -106741 40945 93292
10202I3292Q386d8190G9345b62898k8341L9542E2299a04844A38824h6194j09923
10191a96117g8642j8414A26127C9136b09454A07567b52316d0643k03591k3484
10181b67718A37288d0714F50a74646m9780D2486K14460b12518A41448d01050G9079
10169c24804J08457M6959c7832A26999a46605P0236K6203q9928j6405e2820j00990
10158a53810n8278n627g6202F9502b34769A0209b92789B08525b2145o7003k9031
10147a18179j71331g3146m26348J95269F6733K9490a07015H0654f2599p3350l8286
10136a74235j28678r5414C67698a88284h3695o8823B0552b62346J05613l9138
10126a95871P590d5592B8047c7934k94292H0277b0699D07503a53785j20995D8780
$$ plain form
10202 93292 101678 -48190 79345 -262898 -291239 -251697 52299 -104844 138824 -86194 -196117
10191 -196117 -78642 -97056 126127 39136 -209454 107567 -252316 -40643 -244234 -267718
10181 -267718 137288 -40714 650 -174646 -224426 42486 256946 -212518 141448 -401050 79079
10169 -324804 -216347 -169388 -37832 126999 -146605 -76369 -50166 -140094 -156499 -52820 -153810
10158 -153810 -212088 -217715 -76202 69502 -234769 10209 -292789 208525 -22145 -89148 -118179
10147 -118179 -289510 -73146 -499494 -304225 66733 96223 -107015 80654 -62599 -135949 -174235
10136 -174235 -302913 -398327 367698 -188284 -83695 -152518 20552 -262346 -156733 -195871
10126 -195871 -188281 -45592 28047 -37934 -332226 80277 -20699 407503 -153785 -274780 48780
10114B16771d6528A2651J52706m762c83216h2353l2645A68011o8244b10372A05703
10102a02830J9757j03105F6497b63769d9458B61159a72450E3198a22893j06483
10092b29376J7500B2636b32742e519l1953A55522h5610j24249B8177c27030R7236
10081b29794Q4193N3341j29462C3831d49793i1649A22585g7735p1782f6723P824
10070e8899l93673a5789B2617J73252L7510a20602r0789C525L831R27a1837D01853
10057b95082M0153F1431c6932A01890J21712i1773A46599M2921a92783j09683
10047c02466d4103o9383H1752b23157Q17j11253i0257M3191j03392G349c8950
10035c01971g0271l0018r99m580c6597H8733A7406a81574o9065e2486m0359b3361
$$ plain form
10114 216771 -46528 12651 165357 160595 -383216 -82353 -114998 168011 99767 -210372 105703
10102 -102830 -83073 -186178 66497 -263769 -49458 261159 -172450 53198 -122893 -229376
10092 -229376 -211876 22636 -232742 -5519 -37472 155522 -85610 -209859 28177 -327030 -229794
10081 -229794 -145601 -92260 -221722 33831 -449793 -91649 122585 -77735 -149517 -66723 -58899
10070 -58899 -452572 -15789 22617 195869 233379 -120602 -211391 3525 7356 8283 -11837 401853
10057 -295082 -254929 61431 -36932 101890 223602 -91773 146599 189520 -192783 -302466
10047 -302466 -44103 -113486 81752 -223157 -222340 -333593 -90257 -47066 -150458 7349 -38950
10035 -301971 -70271 -100289 -101288 -105868 -36597 88733 17406 -181574 -250639 -52486 -92845 -23361
10022e9906K0965k49334F3500j096a28787m9830k2191A72369f4041A11004b74175
10010c17020A774d79417G0248B3509J2528a17366M3629j42950g337k08089B0956
9998c12385a53411j63587C94074a78960G2079J36925A9966J93384K20214b08226
9987f5640l7525J4761o7931F0920d26971J10602C37091n1354b27747B50285b24895
9975a46373A1735N3588J97976a44044E9281P7898a36694F9103a55950P1279I2119
9963a84338b3482j98208B9198J43684J48417b4806j35709j51660C15799h9905
9952b02082G7977b94310E6785b8570B16416b9727n6819I7241b73897O6711i5218
9940A90468h5774A0644a33243O0536K0788k51782a25516B90604c2959J4229j96938
$$ plain form
10022 -59906 -38941 -288275 63500 62404 -128787 -178617 -200808 172369 -64041 111004 -274175
10010 -317020 1774 -479417 70248 23509 36037 -117366 -73737 -216687 -7337 -215426 20956
9998 -312385 -153411 -316998 394074 -178960 72079 209004 19966 213350 433564 -208226
9987 -65640 -103165 -88404 -156335 60920 -426971 -316369 337091 285737 -227747 250285 -224895
9975 -146373 11735 65323 263299 -144044 59281 137179 -136694 69103 -155950 -84671 92119
9963 -184338 -23482 -221690 29198 172882 321299 -24806 -160515 -312175 315799 -89905
9952 -202082 77977 -294310 56785 -28570 216416 -29727 -86546 97241 -273897 -207186 -95218
9940 190468 -85774 10644 -133243 -72707 -51919 -303701 -125516 290604 -32959 -18730 -215668
9929b15668B60285L7376a33635j8130j55101n1849J00481a05742j96412a34997
9918b1546k61038J30264e5478J5891D0441h6848B3172a68338f4943k52454A95225
9906A39726a29516B96155a14968a61k90139A80631B2455c3361j59717h1681E8326
9894a8815A13643j1194l0253a80994F7054f8132r4292m5753c319k19527j46873
9883c69719a11522M6474j34003O1128B2586a38113B22551b55110H6515c9019A3000
9871A58942K85602A07550d15803a70930H4092b94097a43005d9757M579A3146a33347
9859a87096d61A22522k2386N8445b63506k6620A96333b19457c2882l54326A179
9847b14776A12264c02751P1666C45586j06707h1715c1442k46159H0362a31238
$$ plain form
9929 -215668 260285 297661 -133635 -151765 -306866 -358715 -258234 -105742 -302154 -134997
9918 -21546 -282584 -152320 -55478 -39587 40441 -86848 23172 -168338 -64943 -317397 195225
9906 139726 -129516 296155 -114968 -161 -290300 180631 22455 -33361 -193078 -81681 58326
9894 -18815 113643 102449 72196 -180994 67054 -68132 -162424 -208177 -3319 -222846 -369719
9883 -369719 -111522 -65048 -199051 -137923 22586 -138113 222551 -255110 86515 -39019 13000
9871 158942 444544 107550 -415803 -170930 84092 -294097 -143005 -49757 -45178 13146 -133347
9859 -187096 -461 122522 100136 158581 -263506 -290126 196333 -219457 -32882 -387208 1179
9847 -214776 112264 -302751 -231085 345586 238879 -81715 -31442 -277601 80362 -131238
9836g8206B32484c2081j85763a01823B8442f3921n9089F1185b53304i9169n4594
9825a53763j09383A71192d62442F6692J3798b6384o8576L6007C1631e8103F0616
9813F4844c27647I4662h9044j33668n1104A31651j9413B8810b61520J05146k02470
9802c58844l8439a22222j14914c5206H59g0954k33049O8743C3709n104K01935
9791B30540F0507c280o7025D5585g1233I4430h5173A06781J94632b72481E7670
9779b77709L5577Q6774N8516j3927B03015K11540G4121g7790A06587m8600Q6347
9768A44334g5100n269Q619j16955A69705a46725M2380B13128G0242e9240F4398
9756f7767k0050b6150C4846O7027a25619m4022N2241b4154A24112J6948L32159
$$ plain form
9836 -78206 232484 -32081 -217844 -101823 28442 -63921 -123010 61185 -253304 -99169 -153763
9825 -153763 -263146 171192 -462442 66692 80490 -26384 -94960 -58953 31631 -58103 60616
9813 64844 -327647 94662 -89044 -222712 -273816 131651 112238 28810 -261520 -156374 -358844
9802 -358844 -397283 -122222 -237136 -35206 859 -70954 -304003 -235260 33709 28605 230540
9791 230540 60507 -3280 -70305 45585 -71233 94430 -85173 106781 301413 -272481 57670
9779 -277709 -242132 -155358 -96842 -110769 203015 414555 74121 -77790 106587 57987 144334
9768 144334 -75100 -80369 -71750 -188705 169705 -146725 -104345 213128 70242 -59240 64398
9756 -67767 -87817 -26150 34846 101873 -125619 -169641 -117400 -24154 124112 141060 473219
9745D73219H5336d6856l81495f7164j58844A98112H1779h153j11745N9351D8586
9733D4793J667d4921j91643A74860a44751l9624a7156F4130f2420E1546c50586
9721b1747C9235g2861p2790B18510b463j57589L8710A8936J9311J88608b49616
9709i3744A79451N6216a60726m7467A77481a5254A57141G1302R4687b18705L0571
9698a88134a1143p4126n832D5367a4963A74443a12046B02204d73619a36315j64032
9687c00347p7792i2378j1228a455j50124A14581q912k8704A0970J3173g8626n8395
9675a37021L3497j38243J08327l7332m7638I4498o412a25074q9748a4061j22495
9664a36556c8925n0020C50741g8158m4540l8333J3945d6663A00401f6693l02280
$$ plain form
9745 473219 85336 -46856 -428351 -67164 -226008 198112 81779 -8153 -119898 -60547 48586
9733 44793 46460 -44921 -236564 174860 -144751 -184375 -17156 64130 -62420 51546 -350586
9721 -21747 39235 -72861 -145651 218510 -2463 -160052 -121342 18936 38247 226855 -249616
9709 -93744 179451 235667 -160726 -208193 177481 -15254 157141 71302 165989 -218705 -188134
9698 -188134 -11143 -85269 -91101 45367 -14963 174443 -112046 202204 -473619 -136315 -300347
9687 -300347 -378139 -92378 -103606 -1455 -151579 114581 105669 76965 10970 24143 -78626 -137021
9675 -137021 -103524 -241767 -133440 -170772 -218410 94498 88086 -125074 -214822 -14061 -136556
9664 -136556 -38925 -88945 350741 -78158 -122698 -161031 -147086 -46663 100401 -66693 -368973
9653c68973F710J63797b25219B8507K4574c4969j8628A31549c481A54708g0538
9641c93796a03134L7729k53344B7417R783a04842j02087B0229a87375G6313Q6265
9630A62578b75869B07797a09459F7207K6693c18605J12370d0395o1901C8476a38938
9618A56322a05909A85443J42444A36782b33446P5208A68382g8815A5901d56464
9607b67180P3567Q6056j54675a04605j32333A6060a51943P2636B8106b08654N5851
9596a52803C28481d6165k56461C6357J91539K5749J1795e779l26426E145a32963
9584c12159a15644l03239a92122g0991j11450N4104A30963a09585H2369b94867
9573a93678p6694a1458c887j92080B43001C5592Q8395D2523a64550A16253B3094
$$ plain form
9653 -368973 6710 170507 -225219 28507 53081 -34969 -53597 131549 -3481 154708 -70538
9641 -393796 -103134 -65405 -318749 27417 37200 -104842 -206929 20229 -187375 76313 162578
9630 162578 -275869 207797 -109459 67207 93900 -318605 -206235 -40395 -102296 38476 -138938
9618 156322 -105909 185443 327887 136782 -233446 -158238 168382 -78815 15901 -456464
9607 -267180 -193613 -107557 -262232 -104605 -236938 16060 -151943 -79307 28106 -208654 -152803
9596 -152803 328481 -46165 -302626 36357 227896 253645 265440 -5779 -332205 5145 -132963
9584 -312159 -115644 -418883 -192122 -70991 -182441 -128337 130963 -109585 82369 -294867
9573 -193678 -270372 -11458 -3887 -195967 243001 35592 123987 42523 -164550 116253 23094
9561B79471c82013d8109H0093K33645a63189E249a78568A46115e1453D4811b3623
9549b89615J4072Q2394a9498B24189B6535a04147L853C3331b94129G6827B9157
9537a83130A21857K0182A8455P4386g9233r7157h2059k8394J7833E7510a17797
9525B24506D0488b18608R8451c8919r5960L5806a099k10103A31911d6700B13340
9513a97483a4155n5659j89261A12559g9403j50295B0260b62857i0786r6333g647
9501B50099b0730p9491A44294a44063f6662K582A80512e8828A94027F7256a90042
9489b42731B20755a39686p0325h6726A20466D8113a31857d9882k2880l4167M2919
9478f4010l84053J2776a12094e4628K7083k36696I5280a59968m4546p9249A60637
$$ plain form
9561 279471 -382013 -48109 80093 313738 -163189 5249 -178568 146115 -51453 44811 -23623
9549 -289615 -275543 -193149 -19498 224189 26535 -104147 -100294 33331 -294129 76827 29157
9537 -183130 121857 142039 18455 92841 -79233 -176390 -82059 -110453 -92620 57510 -117797
9525 224506 40488 -218608 -120157 -38919 -134879 -99073 -1099 -211202 131911 -46700 213340
9513 -197483 -14155 -69814 -259075 112559 -79403 -229698 20260 -262857 -90786 -187119 -7647
9501 250099 -20730 -100221 144294 -144063 -66662 -64080 180512 -58828 194027 67256 -190042
9489 -242731 220755 -139686 -210011 -86726 120466 48113 -131857 -49882 -72762 -106929 -64010
9478 -64010 -448063 -435287 -112094 -54628 -27545 -264241 95280 -159968 -204514 -283763 160637
9466b04187Q1189p7392c7003k12023g5186C6045c90012I0015N6200a35254e6748
9454b30890R9946E2513A6894c83647c3365p8769j87476A29155g063k04594k25128
9443d36785b08204D04172a34582m4352A68664c8048B0037K93194f1094c756A62353
9431h5242l11658A36210L6052a17272b9744j09705q7104a10193k8943p8192k38683
9420d56011B0169a06010F9832e3028B42651a64104p869j69082A1115a6416A0083
9408A61040i8939a8706A08165J6447D3093I437J7461c46825J18618A32293g9591
9396a8588j38195j58140A21565a60500P2783j89454G4026a66427j12530J5275
9386b63682i4694a7097A34346l8916c11229A76993a84798A3196J68921M15d46969
$$ plain form
9466 -204187 -122998 -200390 -37003 -249026 -75186 36045 -390012 90015 146215 -135254 -56748
9454 -230890 -130944 52513 16894 -383647 -33365 -112134 -299610 129155 -7063 -211657 -436785
9443 -436785 -208204 404172 -134582 -178934 168664 -38048 20037 313231 -61094 -3756 162353
9431 -85242 -396900 136210 172262 -117272 -29744 -139449 -226553 -110193 -139136 -217328 -456011
9420 -456011 20169 -106010 69832 -53028 242651 -164104 -171973 -341055 11115 -16416 10083
9408 161040 -98939 -18706 108165 124612 43093 9437 26898 -346825 -228207 132293 -79591
9396 -18588 -156783 -314923 121565 -160500 -87717 -277171 74026 -166427 -278957 -263682
9386 -263682 -94694 -17097 134346 95430 -311229 176993 -184798 13196 182117 182532 -446969
9374d1969o0351c4715C10976e4163l9258m07440A5143a13982L8794A22599a31030
9362b74236h0553C2948e5058F0148a53900g0446o19B20839a46121i581l65776
9351c75357H6113b39362J16154d0395k3956K8264k84061M4431J25609D0473b25891
9339c04475i4714a0704j79737a82j85552A89501a43878P0577a608o5770L0323
9328c7055q8055L1264F3492B5163a3988C9654e6843j48833c5650q2875C23130
9316d8347I339a24964L3513k0556l1465d3391k6401A1926c9217A72082E6352G891
9303B9416a23802B09924L6600F7390b87135d1330B08073d8674G3714a71733j0366
9292a82099o7067I9072K7954L38a22618l12085a24602E2986K67919e6430I4057
$$ plain form
9374 -41969 -102320 -34715 310976 -54163 -93421 -500861 15143 -113982 -75188 122599 -131030
9362 -274236 -80553 32948 -55058 60148 -153900 -70446 -71065 220839 -146121 -9581 -375357
9351 -375357 86113 -239362 -123208 -40395 -64351 -36087 -320148 -275717 -150108 40473 -225891
9339 -304475 -94714 -10704 -190441 -182 -185734 189501 -143878 -73301 -1608 -67378 -37055
9328 -37055 -125110 -93846 63492 25163 -13988 39654 -56843 -205676 -35650 -118525 323130
9316 -48347 9339 -124964 -91451 -112007 -143472 -43391 -69792 11926 -39217 172082 56352 7891
9303 29416 -123802 209924 246524 67390 -287135 -41330 208073 -48674 73714 -171733 -182099
9292 -182099 -249166 99072 127026 127364 -122618 -434703 -124602 52986 320905 -56430 94057
9280b73818h4557c677H5777c0920p5447j95990j26143a30114K6095I5477c2670
9268C4053b82071A21321c13296I9332c3239B5156h9807n5246M6215j21619I1851
9256a70855j256j62160J41608A66461c9303l806b203E3014a9160n4646o0097j41801
9244b75704A79301d7773G4893a55384B49029e56554b19578Q8680f88k17019A52340
9232a57998c5322D6352e1141n8875K9070B1070b21460k06518b9358q7933c5462
9220C7515f3391q2420n8996a9647C5896b18381A40271i8959F2158P8077h1538
9208G2309b63039C2905M2073M7809C1429a41790J370D1467O6862d9062F9503A9560
9195A7247b76055j23136a59261l20758E4527Q7182c79916A9820b7264D56898c56127
$$ plain form
9280 -273818 -84557 -3677 85777 -30920 -106367 -302357 -428500 -130114 -104019 95477 -32670
9268 34053 -282071 121321 -313296 99332 -33239 25156 -89807 -145053 -98838 -220457 91851
9256 -170855 -172111 -334271 -192663 166461 -39303 -43109 -2203 53014 -19160 -73806 -133903 -275704
9244 -275704 179301 -47773 74893 -155384 249029 -556554 -219578 -130898 -688 -217707 152340
9232 -157998 -35322 46352 -51141 -110016 -80946 21070 -221460 -427978 -29358 -117291 -35462
9220 37515 -63391 -145811 -204807 -19647 35896 -218381 140271 -98959 62158 140235 -81538
9208 72309 -263039 32905 74978 122787 31429 -141790 -140420 41467 108329 -49062 69503 19560
9195 17247 -276055 -399191 -159261 -480019 54527 141709 -379916 19820 -27264 456898 -356127
9183E8564d06633J08613f1646R681m8621m4002n1995C09116b18636C62143F2421
9171A29583h4968j91805J29914A57005J152a70410A19172i3533j11492A28501
9160b47089A05379g5890k16293E7448a59085o8046c3112B54410a37535C03769
9149c16290f2379E7102h9415j88465E3433d65769E8954c0070l21296L9160F2261
9137A78094c11137A37318c5153j97066B37976a35946d0055j37968e4237b5582
9126a44011o838A22343e8809m8701j33787p3269m7274i9645C9693e766j00539
9115a06305j07518C46917A25787a23609m1897L2394A31743M977l1596m3903k5605
9104C5616b55949j24873a4563A14074k9711b8730k12763L8949k39200I944c53994
$$ plain form
9183 58564 -406633 -298020 -61646 -51965 -100586 -144588 -196583 309116 -218636 362143 62421
9171 129583 -84968 -276773 -146859 157005 158157 -170410 119172 -93533 -205025 128501
9160 -247089 105379 -75890 -292183 57448 -159085 -227131 -33112 254410 -137535 303769
9149 -316290 -62379 57102 -89415 -277880 53433 -465769 58954 -30070 -351366 -312206 62261
9137 178094 -311137 137318 -35153 -232219 237976 -135946 -40055 -178023 -54237 -25582
9126 -144011 -150849 122343 -58809 -107510 -241297 -314566 -361840 -99645 39693 -5766 -106305
9115 -106305 -213823 346917 125787 -123609 -165506 -133112 131743 136720 105124 61221 35616
9104 35616 -255949 -380822 -14563 114074 84363 -28730 -241493 -202544 -441744 9944 -353994
9092b54850j2339J8622A65765i7643A60878e2790l10980i7651A07878a18461A14854
9080a43839M5913d237A62561n7704k1657c6510H8780b50613K2232j43111B4863
9068H1651a71921A4437i7326j17672L0253G8456L9603O3271f460m05720B76240
9056c53802g2555n2635N7776m9151E6989J13911j3004a83174q75f9339A16472
9044a3131m1935A2379b8342j95318f704A63587L6104d03563a25269F7677a37752
9032a35782C01432D547D06c8468j8368D7314c4273H6723b20206I2279a02330A12941
9019G7988L7367a96983j99737d9866J4348B33985F8335b8096r7962B6326J54930
9008A81256a00021A76327a5548A45208f8545m7535k43399N0584O3470K4507j25585
$$ plain form
9092 -254850 -267189 -248567 165765 -97643 160878 -52790 -363770 -97651 107878 -118461 114854
9080 -143839 -97926 -4237 162561 104857 83200 -36510 88780 -250613 -228381 -371492 24863
9068 81651 -171921 14437 -97326 -214998 -184745 78456 118059 181330 -6460 -412180 276240
9056 -353802 -72555 -125190 -67414 -116565 56989 170900 157896 -183174 -184049 -69339 116472
9044 -13131 -55066 12379 -28342 -223660 -6704 163587 199691 -403563 -125269 67677 -137752
9032 -135782 301432 4547 406 -38468 -56836 47314 -34273 86723 -220206 92279 -102330 112941
9019 77988 115355 -196983 -396720 -49866 -35518 233985 68335 -28096 -126058 26326 181256
9008 181256 -100021 176327 -15548 145208 -68545 -116080 -359479 -308895 -245425 -220918 -346503
8997c46503a14458j98143A95773B032c74860H2113K36185d7139J9621I4661A9324
8985B16150e7381q1445j01847h0477k25338a05775j26974g8668q0592B74264a29548
8973g3634l0347k8860j97061c931l3825q3147M4663A21096E6971a43365B27595
8961A11747a3350k82430A29392J02143h4090L2900o1161G8806R1606e3298k76748
8950c30046I264a02275M3427A17939m8943K92210A28765K18316d2930r9108d2413
8938i3268B52447b02992j11743A63964a15851B0521J89556c5421k54073D0677
8927E7548k6277b98039H015J49303a31144A11343O89027J330359O35111o46437
8917B119403r88202j90048B52075n7842a44235A00310f0000j4015j63315A776
$$ plain form
8997 -346503 -114458 -312601 195773 2032 -374860 82113 318298 -47139 -27518 94661 19324
8985 216150 -57381 -138826 -240673 -80477 -305815 -105775 -232749 -78668 -159260 274264 -129548
8973 -73634 -103981 -132841 -329902 -3931 -37756 -120903 -76240 121096 56971 -143365 227595
8961 111747 -13350 -295780 129392 231535 -84090 -51190 -112351 78806 170412 -53298 -330046
8950 -330046 9264 -102275 -58848 117939 68996 361206 128765 347081 -42930 -142038 -42413
8938 -93268 252447 -202992 -314735 163964 -115851 20521 210077 -35421 -289494 40677
8927 57548 31271 -298039 8015 157318 -131144 111343 800370 2130729 2765840 2119403
8917 2119403 1131201 941153 252075 194233 -144235 100310 -60000 -74015 -237330 1776
8906h2772B38719F3051J18128f4037j36309c4084o3310A30351m0278O6040G5332
8894h687j27248r6329I7792j1430b2030Q238n2839j80752k23846E08e3102A55191
8881A45466m9529b20345C76085c02158D341b17513i7353n17079A37175a04705
8870a37831c1667k64483B00183F892g3870A16465N7010c02969A17016D5956Q4125
8859A30081q671B1463i3447A71752a42421b070k29556E0212a51916q5553N285
$$ plain form
8906 -82772 238719 63051 181179 -64037 -200346 -34084 -97394 130351 90073 156113 75332
8894 -8687 -135935 -232264 97792 86362 -22030 -13792 -66631 -247383 -471229 508 -53102 155191
8881 145466 95937 -220345 376085 -302158 4341 -217513 -97353 -614432 137175 -104705
8870 -137831 -31667 -296150 200183 6892 -73870 116465 173475 -302969 117016 45956 130081
8859 130081 121410 21463 -93447 171752 -142421 -2070 -231626 50212 -151916 -237469 -232184
$$ [...]
##END NTUPLES=NMR SPECTRUM
##END=
