
##TITLE=AC1256_INDRH11073_6533999_sNlIztne0f
##JCAMPDX= 6.0         $$ Bruker NMR JCAMP-DX V2.0
##DATA TYPE= NMR SPECTRUM
##DATA CLASS= NTUPLES
##ORIGIN= BRUKER
##OWNER= Administrator
$$ 1.72 TOPSPIN		Version 2.1
$$ 2012-07-16 22:02:04.531 -0500  Administrator@TOPSPIN
$$ Compression mode = diff/dup
##.OBSERVE FREQUENCY= 400.02188249412
##.OBSERVE NUCLEUS= ^1H
##.ACQUISITION MODE= SIMULTANEOUS (DQD)
##.ACQUISITION SCHEME= undefined
##.AVERAGES= 8
##.DIGITISER RES= 22
##SPECTROMETER/DATA SYSTEM= spect
##.PULSE SEQUENCE= zg30
##.SOLVENT NAME= COFFEE_meoh
##.SHIFT REFERENCE= INTERNAL, COFFEE_meoh, 1, 14.98509
##AUDIT TRAIL= $$ (NUMBER, WHEN, WHO, WHERE, PROCESS, VERSION, WHAT)
$$ ##TITLE= Audit trail, TOPSPIN		Version 2.1
$$ ##JCAMPDX= 5.01
$$ ##ORIGIN= Bruker BioSpin GmbH
$$ ##OWNER= Administrator
$$ $$ C:\Bruker\TOPSPIN/data/COFFEE/nmr/AC1256_INDRH11073_6533999_sNlIztne0f/10/pdata/1/auditp.txt
$$ ##AUDIT TRAIL=  $$ (NUMBER, WHEN, WHO, WHERE, PROCESS, VERSION, WHAT)
(   1,<2012-07-16 22:01:57.562 -0500>,<Administrator>,<TOPSPIN>,<go>,<TOPSPIN 2.1>,
      <created by zg
	started at 2012-07-16 22:00:50.906 -0500,
	POWCHK enabled, PULCHK disabled,
       configuration hash MD5:
       6B 1B 68 BB D9 2E 58 E2 7F 35 AD 54 07 DF 0E 41
       data hash MD5: 64K
       08 7B 93 44 9F D8 54 1F C9 71 C5 EA 18 9E BF 6A>)
(   2,<2012-07-16 22:02:00.250 -0500>,<Administrator>,<TOPSPIN>,<proc1d>,<TOPSPIN 2.1>,
      <Start of raw data processing
       efp LB = 0 FT_mod = 6 PKNL = 1 PHC0 = 0 PHC1 = 0 SI = 32K 
       data hash MD5: 32K
       41 95 48 43 26 E7 11 E4 A0 70 64 31 4C DF 55 5F>)
(   3,<2012-07-16 22:02:00.625 -0500>,<Administrator>,<TOPSPIN>,<proc1d>,<TOPSPIN 2.1>,
      <pk PHC0 = 178.1873 PHC1 = 0 
       data hash MD5: 32K
       9C 53 C5 1E 00 80 2C F7 06 20 49 6C 2D 02 45 44>)
(   4,<2012-07-16 22:02:00.750 -0500>,<Administrator>,<TOPSPIN>,<proc1d>,<TOPSPIN 2.1>,
      <abs ABSG = 1 
       data hash MD5: 32K
       D6 B3 80 A3 1B E3 EA B5 68 0F 23 DE 8C 30 2F 52>)
(   5,<2012-07-16 22:02:00.781 -0500>,<Administrator>,<TOPSPIN>,<proc1d>,<TOPSPIN 2.1>,
      <abs ABSG = 2 
       data hash MD5: 32K
       52 F4 10 12 9C 11 D3 0C A0 4E 58 B2 40 5E 09 79>)
(   6,<2012-07-16 22:02:00.812 -0500>,<Administrator>,<TOPSPIN>,<proc1d>,<TOPSPIN 2.1>,
      <abs ABSG = 3 
       data hash MD5: 32K
       8F 52 56 BA 43 3C 18 96 C9 25 05 6F 06 C3 8E BC>)
(   7,<2012-07-16 22:02:00.843 -0500>,<Administrator>,<TOPSPIN>,<proc1d>,<TOPSPIN 2.1>,
      <abs ABSG = 4 
       data hash MD5: 32K
       46 20 9C 4E 7F 9C 19 E7 31 C5 6B 8A 2C 56 97 BC>)
(   8,<2012-07-16 22:02:00.875 -0500>,<Administrator>,<TOPSPIN>,<proc1d>,<TOPSPIN 2.1>,
      <abs ABSG = 5 
       data hash MD5: 32K
       59 15 03 2A 85 DC BA BA C3 72 D8 C6 B3 80 90 D9>)
$$ ##END=
$$ 
$$ $$ hash MD5
$$ $$ 93 51 0A 23 B5 CB B7 5B F0 60 58 2A F1 D5 23 4A
##$RELAX= 
##$RELAX= 
##$RELAX= 
##$RELAX= 
##$RELAX= 
##$RELAX= 
##$RELAX= 
$$ Bruker specific parameters
$$ --------------------------
$$ [...]
##$TP= (0..7)
150 150 150 150 150 150 150 150
##$TP07= 0
##$TPNAME0= <>
##$TPNAME1= <>
##$TPNAME2= <>
##$TPNAME3= <>
##$TPNAME4= <>
##$TPNAME5= <>
##$TPNAME6= <>
##$TPNAME7= <>
##$TPOAL= (0..7)
0.5 0.5 0.5 0.5 0.5 0.5 0.5 0.5
##$TPOFFS= (0..7)
0 0 0 0 0 0 0 0
##$TUNHIN= 0
##$TUNHOUT= 0
##$TUNXOUT= 0
##$USERA1= <user>
##$USERA2= <user>
##$USERA3= <user>
##$USERA4= <user>
##$USERA5= <user>
##$V9= 5
##$VALIST= <valist>
##$VCLIST= <CCCCCCCCCCCCCCC>
##$VD= 0
##$VDLIST= <DDDDDDDDDDDDDDD>
##$VPLIST= <PPPPPPPPPPPPPPP>
##$VTLIST= <TTTTTTTTTTTTTTT>
##$WBST= 2048
##$WBSW= 25
##$XGAIN= (0..3)
0 0 0 0
##$XL= 0
##$YL= 0
##$YMAX_a= 503056
##$YMIN_a= -643761
##$ZGOPTNS= <>
##$ZL1= 120
##$ZL2= 120
##$ZL3= 120
##$ZL4= 120
##$ABSF1= 14.98509
##$ABSF2= -5.573092
##$ABSG= 5
##$ABSL= 3
##$ALPHA= 0
##$AQORDER= 0
##$ASSFAC= 0
##$ASSFACI= 0
##$ASSFACX= 0
##$ASSWID= 0
##$AUNMP= <proc_prof1d_extract_pilot.lims>
##$AXLEFT= 0
##$AXNAME= <>
##$AXNUC= <1H>
##$AXRIGHT= 0
##$AXTYPE= 0
##$AXUNIT= <>
##$AZFE= 0.1
##$AZFW= 0.1
##$BCFW= 0
##$BC_mod= 0
##$BYTORDP= 0
##$COROFFS= 0
##$CY= 15
##$DATMOD= 1
##$DC= 0
##$DFILT= <>
##$DTYPP= 0
##$F1P= 0
##$F2P= 0
##$FCOR= 0.5
##$FTSIZE= 32768
##$FT_mod= 6
##$GAMMA= 0
##$GB= 0
##$INTBC= 1
##$INTSCL= 1
##$ISEN= 128
##$LB= 0
##$LEV0= 0
##$LPBIN= 0
##$MAXI= 10000
##$MC2= 0
##$MEAN= 0
##$ME_mod= 0
##$MI= 0
##$NCOEF= 0
##$NC_proc= -8
##$NLEV= 6
##$NOISF1= 0
##$NOISF2= 0
##$NSP= 0
##$NTH_PI= 0
##$NZP= 0
##$OFFSET= 14.98509
##$PC= 1
##$PHC0= 178.1873
##$PHC1= 0
##$PH_mod= 1
##$PKNL= yes
##$PPARMOD= 0
##$PPDIAG= 0
##$PPIPTYP= 0
##$PPMPNUM= 2147483647
##$PPRESOL= 1
##$PSCAL= 4
##$PSIGN= 0
##$PYNMP= <proc.py>
##$REVERSE= no
##$SF= 400.02
##$SI= 32768
##$SIGF1= 0
##$SIGF2= 0
##$SINO= 400
##$SIOLD= 32768
##$SPECTYP= <>
##$SREGLST= <1H.CDCl3>
##$SSB= 0
##$STSI= 32768
##$STSR= 0
##$SW_p= 8223.68421052631
##$SYMM= 0
##$S_DEV= 0
##$TDeff= 65536
##$TDoff= 0
##$TI= <>
##$TILT= no
##$TM1= 0
##$TM2= 0
##$TOPLEV= 0
##$USERP1= <user>
##$USERP2= <user>
##$USERP3= <user>
##$USERP4= <user>
##$USERP5= <user>
##$WDW= 1
##$XDIM= 32768
##$YMAX_p= 471033386
##$YMIN_p= -727387
##$CURPLOT= <Network HP LaserJet P1505>
##$CURPRIN= <$Network HP LaserJet P1505>
##$DFORMAT= <normdp>
##$LAYOUT= <+/1D_H.xwp>
##$LFORMAT= <normlp>
##$PFORMAT= <normpl>
##$SURQMSG= 1
$$ End of Bruker specific parameters
$$ ---------------------------------
##NTUPLES= NMR SPECTRUM
##VAR_NAME=  FREQUENCY,     SPECTRUM/REAL,   SPECTRUM/IMAG
##SYMBOL=    X,             R,               I
##VAR_TYPE=  INDEPENDENT,   DEPENDENT,       DEPENDENT
##VAR_FORM=  AFFN,          ASDF,            ASDF
##VAR_DIM=   32768,         32768,           32768
##UNITS=     HZ,            ARBITRARY UNITS, ARBITRARY UNITS
##FACTOR=    0.250966925370066, 1,           1
##FIRST=     8223.43324360094, 143062,       89246
##LAST=      0,             -90448,          59161
##MIN=       0,             -727387,         0
##MAX=       8223.43324360094, 471033386,    0
$$ Real data points
##PAGE= N=1
##DATA TABLE= (X++(R..R)), XYDATA
$$ [...]
23842 102432 159951 -2014 245445 -35273 115617 34293 -34447 -165847 386223 -152389 213452
23830 32769 39219 -311716 118969 -285707 -216485 -210581 187414 188181 -83208 11808 14062 272960
23818 272960 -131712 31551 177496 26660 -137390 -236543 -147133 243568 -42316 -34814 183772
23806 38027 -31929 167561 -171656 -73909 21181 299578 160182 -64295 88040 28050 -222135
23794 282447 -401432 -148912 -4396 -173247 -100680 207217 -87842 -182439 -35578 430968 34746
23782 -141663 90496 -103892 -275978 21862 146767 -337307 35615 -27401 130673 47209
23771 -91966 -149416 91948 3537 -140061 -237801 -80195 21513 55154 110077 182549 -96716 -172489
23759 -172489 -232078 283171 -212098 -94377 17310 268861 -230811 26373 160525 -115516
23748 -16128 16185 223865 -302466 43056 12512 -202280 134201 -396216 75248 72015 200360
23737 200360 -94600 196285 -193080 16861 -376252 97636 -322575 -170769 -112013 122019
23726 -105924 147167 25798 -347025 145657 -252112 61115 177540 -93405 160774 8935
23715 -275518 172252 45265 -145140 66239 -308451 -45608 -189589 136101 -261694 42790
23704 -114848 14289 -65145 155704 -198694 45703 -54875 -580076 -198489 -164614 -86100 -200379
23693 -200379 125367 -78772 -102063 -333496 -3619 139704 89727 69579 24144 -24878 132747
23681 92085 138747 9047 40047 188920 -43312 360670 136337 -321322 -124363 -24917 -251441
23670 -251441 -105482 -115694 -29018 -23006 -47819 83341 391280 -370484 16826 -277168 -8486
23658 125723 -72317 -95924 78506 -43057 8679 -47551 -328005 -407500 -22371 -116564 171092
23646 74911 -248118 227864 -118557 227230 256660 -213115 -12326 -186563 382003 233878
23636 233878 149583 -92682 -50012 105112 144320 313115 18165 -295103 -149770 22274 -132333
23624 -96253 -25703 -109782 401804 -213763 48724 -64537 -180938 -14576 209983 -17163 187639
23612 183416 -49435 51679 -137060 -25531 134208 51356 -158202 -25381 -162700 81751 298269
23601 298269 66386 -37067 430912 -166631 124877 -27573 104834 -106291 266012 11208
23590 -154485 -154282 -128737 -6093 -364028 167187 169277 115121 -182080 -187243 32770 -37597 221670
23577 -72057 -27819 135816 236180 -118522 107104 -142668 -183638 124067 -130943 -182887
23567 -182887 28206 21043 176849 -95813 -37810 169242 -10503 -195101 -109741 -506522 -38348
23555 -143924 -130242 -95523 -34376 -299608 159932 56458 -99582 -231636 247875 60647 -127765
23543 68384 -270247 -173067 -170884 -58569 114539 -77418 -93681 264465 -137285 56875 -41319
23531 69947 26357 271863 -40619 302055 -22428 310535 -97483 -426745 96970 81109 -105820
23519 73951 85767 21143 212459 180280 169772 -233293 -48219 -140590 281874 -117072 -165472
23508 -165472 -293077 -281442 -289316 -77841 -94783 -216727 -162612 -55114 -40585 66078 -413964
23496 -19111 -46148 -81620 28339 120396 29359 103397 -129734 66910 68201 -48196 -128714 2442
23483 268058 92524 -65251 -129623 204097 -274713 -212958 -404976 627233 24569 -247365
23472 -172837 -43391 -208338 401420 -226218 200195 330678 -79011 -154895 300903 -390044
23461 -97067 205212 33238 -103308 339451 64813 93052 306267 -17108 243834 59752 158297
23450 158297 -186717 345055 -259057 147854 -157256 -170362 67571 23772 -5335 -160595
23440 -160595 48627 -245084 -139175 -6347 104864 -27024 145476 242678 69930 -67985 174648
23428 -98024 -52286 22164 -108378 241945 -167167 45609 260714 -93909 -209981 -172430 135253
23416 -328948 -320946 -134566 34675 -54238 68401 100903 87575 109408 -14808 76101 -466203
23404 45033 -273480 392773 108250 384375 254446 161051 116153 352524 -208373 96800
23393 226314 67559 -80385 88889 -49726 13879 -79520 30567 21768 -79003 19143 -102133
23381 -111036 -225565 -295445 -125937 90134 46690 174184 -193654 203242 -40948 -114970
23371 -114970 -113847 -161195 -82747 49838 360515 147616 76954 -116137 -25727 -72561 -442900
23360 -442900 -86599 397447 128822 -285173 170925 40235 17845 -119266 -4512 -196851
23350 -196851 363300 44879 -64051 166797 -202007 125905 246128 -13311 81689 -256695
23339 -12330 -192504 -50080 12319 96916 -109757 -203709 -152291 -308934 30247 285073 474763
23328 474763 -386437 -70257 97539 -66049 -238317 65559 29197 115585 39090 171523 -109689
23316 -94243 304856 -290141 27386 -57946 -136943 62360 285156 -76368 22947 72814 9856
23304 140780 -250950 -58961 28793 -104887 59050 -26442 -121227 -340458 21590 -42766 280332
23292 112614 -56444 116138 -9454 -264934 -302638 -12579 147609 7453 -147467 -103966 -207520
23281 -207520 91013 359284 -173887 -303114 139202 -38429 -178053 150974 -23578 -76642
23271 -76642 -530652 -293082 -171313 -29918 205252 -39614 -122420 41665 166796 -197726
23260 -239256 -160920 -183433 -36657 -13411 201273 -108869 -120164 76191 -11620 -60247 -84198
23249 -84198 -241538 -141210 -175077 166459 -61995 -156315 -124190 -52301 25936 -56747 330559
23237 2097 -160002 28494 99085 -224488 -54450 -100030 -106809 221909 -207889 21483 18439
23226 18439 -179549 -305264 -156285 -342833 -132041 322903 42238 -132412 -164279 76684
23215 9285 -151266 260712 -105892 13773 -3106 -388956 53495 167177 20884 -158236 -144116
23204 -144116 -63419 -160379 -286097 -737 575719 120368 -109733 -146509 182310 -239760 273686
23192 -83055 102096 -130319 -77724 -171687 -65442 32665 15642 137958 47869 186143 -311941
23180 8002 -15189 88218 -88017 14181 43320 28993 -110124 -48730 -61293 -171879 41688
23168 69584 191043 -29357 163207 14245 120813 145008 5592 73583 -158250 1482 -158625
23156 -127309 62138 -316736 158409 34060 123456 92894 -172292 -109072 -261367 18591 -10588
23144 224865 -26436 373223 -130784 81426 108879 147903 -92171 32490 -80656 164806 234262
23133 234262 -217655 92189 2367 52395 97922 48502 -30392 146858 -15839 80138 7112
23121 -109646 72440 -117171 -57760 166304 -86977 -327329 383082 150795 -209236 145940
23110 -355431 236239 226159 -522483 -226788 -265256 216185 -39649 -63255 -101562 -217378
23100 -217378 -200912 -288237 -39494 -14036 -124104 -22036 12424 70785 -257856 46345 42628
23089 42628 170934 310729 180152 226802 -445569 53960 325545 148613 119692 -80617
23078 -124632 93162 213630 -95634 -181656 -295038 132407 232606 235662 53763 -368812 -242150
23067 -242150 -273868 129149 -15018 -6496 164797 40455 208548 -98059 72309 -214718 177993
23055 -28805 141930 -49002 29195 -23327 152967 -83035 127307 -101630 180442 -281823
23044 -146605 42974 203865 -141999 -75377 -89092 -171568 -83165 96858 -107876 -128412 127383
23032 -83425 -130013 80267 -132585 14225 -149810 180797 -126328 -306713 359422 -208774
23021 -180312 -47861 -100516 209430 -235422 -87081 -63340 3808 -74355 43670 -8680 -33926
23010 -33926 -34930 -4343 -171902 -80133 -240089 -333572 -119013 -221675 2873 -142677 -270444
22999 -270444 -51355 50887 -102641 118961 224836 8064 100955 217725 79878 104481 68147
22988 68147 156764 -565780 -172853 -154998 16116 -179391 231888 63155 79116 18210 -15664
22976 -55298 -144938 44855 61679 -239484 15441 -47813 37821 17161 13031 -55549 -45193 -165621
22964 -165621 223711 5874 -312781 -246881 -128248 -76404 127021 99690 -203342 -39835 51650
22952 -41834 132663 -46985 -103625 75946 -157165 193966 4278 264353 436304 106680 -16640
22940 -119129 -91979 -276263 -3646 -186545 101547 110854 -239558 -112802 -225754 -235760 193774
22928 -213496 -22789 146222 -169380 -51440 61467 198004 -142942 167727 73621 -127069
22917 -124788 38818 -292182 134016 141715 307780 -73 2417 -372398 -392924 -6451 -450929 -180066
22904 -36619 383821 83817 21055 -56539 35373 173624 123562 94576 -79130 -85092 28602
22892 123830 53432 -242795 -248165 144309 30050 -90225 113202 -6238 -68658 -346904 -143081
22880 -11680 91960 435890 -13466 -207185 182885 141872 104263 -137165 120410 14131 -235623
22868 -60977 95958 79160 -54427 93665 -113902 -133065 -77520 -345896 -77673 -334716 -203010
22857 -203010 -63889 72871 18282 243801 126877 -150130 -121934 155546 270421 -149781
22846 -235953 -62108 -160053 76746 190592 299283 127095 113299 321522 27071 -29083 481676
22834 124932 -263903 189470 -44656 -25237 35476 105954 307467 10250 112571 -248869
22823 274385 -80079 273443 -242504 -146891 413205 -55925 -278588 37780 124633 -305946
22812 14409 99772 141198 -224697 87260 -21168 -231835 -9777 -52471 -4247 -6045 110957 -95222
22799 -118715 -125695 210930 9559 203131 -134917 -187636 167785 -247420 68897 -179989 -76350
22787 -127303 -41599 -40373 -336244 -218969 -77212 -65141 -169370 -136003 -232225 -286080 -11376
22775 -97397 -106515 299655 45924 -20097 74184 119533 -320585 123251 200275 144026 51127
22763 -221181 -62377 34085 196353 2132 -163015 38551 -72850 -78294 2416 -209350 -33430
22751 -49604 -253846 -156126 -241163 74327 -39771 -294583 63951 30873 -396008 393452 159715
22739 300066 112070 316802 297535 -109612 -80629 26930 -223974 -132349 -191560 138700
22728 188104 270475 144982 266062 -138029 -183346 -179578 -231353 -351524 -161696 21902 -118057
22716 134514 37560 -245023 380958 -228828 266310 -217328 70768 -317425 -146098 75953
22705 63449 -88656 -76036 -208663 -144168 -106193 103813 134427 -240555 73462 -87198 27093
22693 140448 123662 5020 -4629 -268089 -222008 46208 -172269 -103521 -80091 110043 -158732
22681 -85855 166108 133215 144320 -161233 -57278 -279179 -97780 173722 -325858 -31133 -18170
22670 -18170 -41175 228540 -37435 -123299 -100658 -167289 -337895 -37979 -346897 -911 263165
22658 31725 -66966 79260 96195 68937 -154710 194204 122299 -223494 -130378 -91898 54572
22646 -137039 -153690 -177783 199300 309148 -64225 250415 -179045 107749 144911 -203753
22635 -29440 89339 -27487 -142935 -303387 -24511 279780 59431 -436562 -77325 -186943 53870
22623 156664 -10960 -31554 -6553 -144774 -35211 -243923 82053 -139096 2926 -110190 -71180
22612 -71180 179352 16519 -100617 335596 -204334 26062 -196905 -93476 -27039 -68973 -265331
22601 -265331 -29905 -71819 -87113 75111 177302 -139887 -12935 -243511 221782 -88977 -91886
22590 -91886 -173186 19520 -13915 -169569 295450 -120523 -329659 2024 165966 261737 -138300
22578 157601 49935 -122980 -382540 -238250 -137251 -265501 -185799 -5674 57366 -278822
22567 -394849 120946 -58080 -71302 207136 9838 -68472 -99713 -129385 -292374 150404 129625
22556 129625 231523 -1640 -278710 203671 -38985 -44269 -64272 -224638 73194 -205164 77508
22544 29120 209057 -122973 -18227 -234683 36086 220663 194615 73114 156319 -422443 41567
22532 -23902 -250106 -163228 -85454 100346 -53546 -192359 -220713 -451702 224361 109197
22521 -63251 843 -107168 117377 75992 264400 -142424 -57680 -45350 -102344 75737 -89602
22509 -71543 -126660 248609 -213669 252172 246841 -138527 -102298 168221 7786 72723 -33006
22497 7046 -63123 -37128 15564 -77107 64062 339570 -107322 -76216 305888 -386275 127724
22485 -58798 -154059 528748 -236833 256378 -109987 -50905 -74663 253748 191539 48140 -67328
22473 -149746 134084 83568 114563 -197740 -182016 -30732 -422138 101390 -345865 249325
22462 209494 -112202 -152730 -46415 74170 -100776 43716 -403921 -175687 87896 -301664
22451 -328457 238111 99780 -115602 -445638 -32018 -256779 -125502 -89255 7860 40958 15373
22439 1405 89549 -303871 -380093 16634 11191 141262 661367 124845 208183 -214369 -97435
22427 300381 -110662 -185587 250382 23100 308292 144738 201899 79769 302569 133408
22416 117031 46156 251816 -101055 69380 -399597 237078 -334391 52348 221975 24800
22405 -117949 -300775 47439 134869 213231 -210593 -143203 -79780 -29960 -240297 -262844 -220558
22394 -220558 -212375 -46622 -5708 -46121 25020 -146795 64320 -93269 116875 -62864 -58120 -146888
22382 -146888 -136362 -66124 10224 -481882 -72093 88045 166704 -93305 66471 -325556 -270828
22371 -270828 68758 257488 -82704 -42006 -47848 -138038 -200609 29543 160779 -192400 -81941
22359 -186659 82461 -4000 253540 293573 -296044 -25034 -4972 -135334 -228149 31187 -122164
22347 44397 -92564 -74805 15824 -35758 227796 13826 -62053 -33652 -131640 -67571 -168249
22336 -168249 43903 -238555 -193587 240860 75496 -4369 151158 81387 -117843 337310 -177666
22324 -399015 221883 -112166 102050 -122262 -203567 66671 -13831 362475 115246 -18037
22313 2102 16036 -33177 -166440 16316 -60398 -8894 109820 -295877 -70188 121473 -135154
22301 -48261 -220178 7034 236339 -95658 291552 80485 25496 -28532 -94834 66525 90913
22290 90913 175496 68771 3907 -177282 3118 -119963 204708 -288331 -219473 52655 -27643
22278 128610 91541 -187836 -171712 137616 -71693 -250786 -43202 71871 -287775 -83425 -304444
22267 -304444 -491154 -89810 49557 -15753 -75386 -21285 24539 -66409 -98026 270155 161178
22256 161178 314351 -53649 -113043 249693 -175192 -224639 -204906 -83269 -264544 -35461 -17481
22244 -178 41703 -124574 132622 159014 228338 297678 -162734 80087 78308 33271 209174
22233 209174 -46362 -142024 -292580 23945 54946 -116967 41932 -327391 78499 -116181 -30182
22221 -121773 -306291 56998 -178936 -187641 -65506 138901 -132170 -258844 -108734 59397
22210 -42655 -55607 -72039 -82925 -98180 20896 -257755 95500 186000 114057 -157444 177298
22198 -216553 108628 268962 39350 -325651 -172808 -493425 58087 262664 -129557 -276676
22188 -276676 -57098 -173717 -255164 224725 -58572 160448 -319083 28094 85300 -149481
22177 191083 -167235 -78815 46822 -49137 170625 -162487 27263 9311 -510120 -81618 -105394
22166 -105394 220696 -304162 -127046 127586 72393 -164397 -231468 -137528 -210565 14352
22155 -157567 168455 178953 -282450 -145456 -288164 -290233 -148256 -146239 -375131 53940 123500
22144 123500 -258927 -43147 -353104 382150 94462 31445 229055 5746 -237720 -21866 33166
22132 -249488 77541 -183491 44830 207758 -27493 -240220 399198 -34895 207563 -146009
22121 70856 26569 30216 -279210 392827 312624 87278 320190 241611 85656 9356 -80350
22109 175779 -100652 -169164 11752 -121042 -107465 141395 -60977 -53965 -93613 11099 156735
22098 156735 208680 -18861 108608 -41347 69870 -137155 -201654 244243 -340469 1044 115481
22087 115481 -90922 314575 -300550 26337 86875 -232432 57225 145916 27294 321432 296534
22076 296534 -74317 -78019 4423 -10712 75915 74203 13989 -23 -204730 -95160 -91924 -255466
22064 -255466 -125164 3792 53153 -50989 -186894 -405308 -232341 -89370 -153582 186809 77236
22052 -225010 -184038 -75995 -62923 -257671 89429 -255158 8369 204268 -10621 -168826 -102164
22041 -102164 -508 -170608 -66894 126456 -168748 14010 -65146 -40248 -351 219268 -119917
22029 -355467 77600 -18510 -129096 -110890 240291 242496 -85275 -272608 169493 140401 -128156
22017 -8528 -98588 105091 134457 -314116 -96849 -265910 74205 34914 -35756 -124244 -276768
22006 -276768 -248122 24951 -188904 18457 262199 259123 400 173060 80861 169174 91099
21995 91099 -177547 -242919 -164039 127851 -309218 31594 80719 355186 -112614 -108077 111256
21983 38154 -422087 18024 5088 -228937 237026 95165 -507816 -325418 -97324 -143857 123855
21971 -392909 47496 121632 31471 12671 -48339 31909 -38914 -169201 -250155 332695 23588
21959 144592 -169927 -44846 -62098 -70116 -79219 -417997 113885 -296088 113579 137140 87740
21948 87740 -472619 58426 -22150 -155254 -247784 257905 -16003 -176193 15512 -61017 120510
21936 27839 119791 -31007 91765 -259495 75337 -32411 -112582 -247336 -114349 -61690 -61339
21925 -61339 63687 286384 -275800 -259306 69117 -85297 18067 -138120 -161044 275154 97261
21913 -315127 170842 26960 -172680 -106151 -297667 66260 -87282 -125716 219919 -69319 -179911
21902 -179911 -63198 162533 -433797 145622 -361 59276 -275442 -239624 54729 16163 25055
21891 25055 27213 -298509 -91180 -153227 -77970 39714 102082 -198552 -177621 -334183 -267480
21880 -267480 61720 -29904 181105 54190 145026 120714 -427007 52073 -72645 -83337 -234833
21869 -234833 -64789 -252978 -394054 -212992 -358217 -20538 -245106 -129477 -304021 133228
21858 -20085 227644 -191255 -29047 128469 38442 228959 82914 186821 486527 112346
21847 -145255 116193 67474 -718 -61583 -40 -236949 182386 262313 228441 -59547 211694 91192
21834 -17540 273229 -238962 -62251 -245619 5715 -251082 -301851 -2801 250574 111901 -66243
21822 85008 13358 31325 111199 -50768 -143738 -197619 204437 -282702 -120272 9670 261686
21811 261686 -213500 -83289 148726 -181317 68120 -67735 2818 74900 50364 70643 -241915
21799 -318346 73614 -205452 209709 -140286 59221 -109561 -83207 -50438 -97525 -49485 -121104
21788 -121104 209893 -128528 -198329 -90104 -186507 97229 178900 -70063 -13441 84332 -216563
21776 -47679 -54009 -237364 31370 -273808 -104156 5245 -110288 -110653 31151 -7895 -192695 85053
21763 47278 380799 -267510 -138190 38853 -73816 114339 -440260 -6167 -69064 -190589 -268161
21752 -268161 295630 15418 38124 -34157 -125483 316335 78610 -146203 148700 -206900
21741 81965 -75839 -162247 -68020 53909 82150 -2431 51771 -249079 -140354 -165460 -131399
21730 -131399 332468 4781 78959 314977 -7774 197836 -11439 -198217 65258 47379 -128378
21718 173793 -71743 -104383 -168375 -105781 -344423 93425 -457692 57666 41825 179451 70401
21706 -61114 -84706 127139 221629 -271216 -15106 -185372 13269 -13625 71679 97795 155600
21695 155600 -240728 138734 -3179 -345724 31061 55966 -76283 -140666 38755 30835 72755
21684 72755 -31584 -22415 -31464 -131493 -230933 51225 64476 10268 85870 -32604 -85151 -203933
21672 -203933 -52318 -91469 -71802 -148644 -221312 -326980 -73029 -91255 466504 -169479 -118284
21661 -118284 1648 167324 -5429 -237409 -56037 129217 128321 435875 -6809 -224223 -112301
21650 -112301 -85912 -146016 -213911 122432 -218186 43916 59630 -295807 42722 98675 16144
21638 78517 354144 77144 -231847 -15857 58530 -171478 -2960 -22415 -1649 91276 13623
21626 16806 59677 -339283 106832 -86937 -62270 -263654 -75421 -1092 22833 -109634 138249
21614 -14260 78265 186784 1694 -55142 -212537 -197222 -207589 350257 -20498 -3187 146987
21602 168509 21750 -113285 76795 72885 -39653 -277253 39850 -178702 -234135 135618 -197382
21590 -51693 116611 23436 -136654 -128356 -153773 -257503 -146053 143474 -222956 -316967 -11343
21578 -238553 279127 -181732 -175063 -70618 -373115 -28607 55510 -41484 -205900 439891 -330397
21566 178361 -33007 -147174 24271 -45754 249460 -188287 -195998 -247995 106878 57276 -131280
21554 159868 -178276 -228844 -59884 -54267 94422 104936 -340132 -258424 84925 -32252 -3698
21542 214411 7538 -103914 -177298 -88532 -22864 377597 -56071 -193398 -51473 -185205 -430598
21531 -430598 97955 -240308 -30776 -277312 -55671 -171812 -124150 3427 73500 -73869 -245068
21520 -245068 -66524 43553 -363764 -205839 153924 -133110 -183417 133415 -180919 -205424
21510 -205424 -227505 -88468 163474 -183997 -167500 -28508 -24919 -100369 41719 203475 -47923
21498 -19522 299890 -7049 105760 -236622 233612 -85389 23936 -214546 -171991 -61588 -158449
21487 -158449 105166 280690 -68194 9190 -189302 -106837 -221420 -125921 73367 192452 -183864
21475 -285487 -152367 -61333 -188012 -205607 36030 168914 38988 -68328 214923 -143738
21464 -373421 -163684 -43489 -141823 174630 -76212 -22322 -83446 -433008 -215573 45803 17405
21452 -216917 66778 40495 -125664 -220702 -585 -165524 -12401 64004 -274885 189262 -246066
21440 -42738 18700 145481 241928 -73800 250830 388813 500417 257658 347352 389838 -27286
21428 76760 377725 305541 60074 -88731 21911 209134 -35870 112374 -353549 -105386 70933
21416 -327213 -26797 103758 -168411 -202081 75683 225743 -124390 -73247 -1473 -27388 -89839
21405 -89839 18081 -138197 -147540 22840 -102401 183391 60959 81278 -17597 -40601 -23092
21394 -23092 -69046 62005 386174 185744 43652 71750 -265583 -88850 -68405 119910 -27014
21382 -296087 85096 -160738 -1457 -24397 -215050 -172840 -46764 -120173 156102 79084 79569
21371 79569 91407 43655 -65752 -50174 203228 345714 104058 205235 -3940 -256814 60396
21359 -2990 -254557 -122690 99695 82643 88586 64725 211410 -67796 -116183 80863 -150630
21347 -306804 -226007 -144804 136305 -248870 -255648 250128 -136217 124309 32706 -57884 -112181
21336 -112181 281605 -219777 -61912 126324 -30294 83997 -142210 -244453 87804 7959 -7462
21324 98175 -118722 -184692 -105363 -160855 -41796 -78923 -321882 100481 292114 -104696 4360
21312 -226086 -152737 -113108 -294485 -305914 50649 -36288 981 -72162 27314 -140423 -264155
21301 -264155 -151905 176615 95938 -152213 104221 72908 -160190 -55293 -30709 -76394
21291 -76394 -169142 236012 -207922 -118122 22796 -142514 -177079 57611 -8413 -85447 62817
21279 98693 -95537 -309349 165335 8268 128872 264221 171832 41232 -49379 498229 -3993
21267 -100530 -119683 132565 -172663 256253 219604 -30515 -60647 -241261 -302421 187421
21256 -140145 -194294 85223 -356207 63711 41005 -7215 -265942 -152232 108012 -47729 -274244
21245 -274244 -99666 -177847 -74593 -98151 -92885 278552 -178967 25693 93434 -10110 183491
21233 51853 -80690 105623 171391 -189717 -259139 175687 -210690 -46213 -156288 -213934 -139871
21222 -139871 -20439 272121 -168884 7046 -48376 315056 85750 -121152 66341 -225165 -171957
21211 -171957 47609 -287097 -107830 -177693 -67688 -73178 1400 151152 -267237 -319264 -160737
21200 -160737 -430588 -110146 127414 269230 -220150 18799 -163255 114038 -229870 -158196
21190 -158196 -330940 133071 -210677 109854 380382 -150099 36254 -521993 98145 58447
21180 58447 176173 84824 -49136 73006 -71583 -4569 170324 246049 236169 247690 -233478
21168 -85053 -103933 -350099 204303 -353874 12755 134881 -317143 -90736 218382 -155664
21157 -105952 -58433 2448 218239 18641 -624688 -245947 -260035 -53196 260076 -263381 -172064
21146 -172064 -190649 -140366 66937 -120386 -157525 274156 -311369 -5872 -453140 -85216 10195
21134 2884 181860 -118814 -159290 -26998 -3819 -399579 36564 37716 -45029 115518 -203926
21122 -58354 -51137 10403 -327214 -122355 58789 -16194 -229088 -163680 12236 -83830 -146675
21111 -146675 3750 -26909 -71730 160727 -46347 -73083 44306 5557 -286836 -347293 -194828
21100 -194828 -178691 225431 -457726 312969 -76065 137102 -5983 59248 -58471 -57096 66717
21088 -13804 -82896 -114095 159760 -461507 -72090 -174792 -228718 144213 -305923 -255130 48912
21076 -71676 -428741 -109181 286512 -108092 44734 -67426 -234552 16008 108622 -28221 -261264
21065 -261264 -23576 -116598 -276208 -149925 -74140 223 -3485 -34866 154461 -33312 -27921 -172908
21053 -172908 100923 199073 -221329 -4831 50773 163834 -131376 75810 -212508 -191831 166121
21041 -62225 224996 142470 43791 254526 -87494 208313 -90836 -22580 -41860 -163781 103772
21029 -343610 -263338 108387 82410 390575 148536 -287593 130952 100684 -3437 -408324
21019 -408324 -159063 -53984 153176 19389 -5106 -12562 339732 112332 13870 136734 -345830
21007 -106110 51140 -305055 93918 232212 87669 -70862 -210509 242303 87622 -78143 -54617
20996 -54617 -66077 -209683 -73111 -250084 56391 -171624 165193 -284293 239919 103960
20985 256907 -155475 -229723 -222665 152837 77357 -16484 -208566 26771 -276902 189949 225743
20974 225743 151228 -201576 -478081 101897 -204613 188442 -54519 121284 -128358 -499664
20964 -499664 -193726 83296 -155995 -308240 168976 -178509 49938 239560 20164 -104669
20953 -351025 66478 114192 -158103 213946 -181129 -107373 -127908 -142433 86757 96823 -29656
20941 -29079 111814 43142 120791 -324301 -514954 -109087 82088 192256 4845 168 -314530
20929 -338183 -103759 -38856 -262581 -135052 70446 125398 -154607 -259980 -241265 296251
20918 -338823 8601 71846 -209921 -47757 -4437 -22595 367748 -202736 192438 -322341 150168
20906 -117597 -284495 -100791 124492 60506 -7746 -15224 -43552 -120319 -257459 -216278 -124976
20895 -124976 108206 136278 109657 -138703 -125345 -5534 195157 105843 81285 -206008 17224
20883 -30056 -371745 272718 -71641 -15912 -313265 162697 6110 -201334 -93001 -143253 -333117
20872 -333117 180505 70736 43965 280743 -208366 151851 33967 171478 -53904 -53822 -138276
20861 -138276 212987 143105 -172287 -99603 -60859 -51934 -314842 -123774 -82073 -119049 -166331
20850 -166331 194255 -251356 -38767 143046 201630 -148368 -166336 -183621 -88670 -193787
20840 -193787 -123281 -53209 -161235 -17702 -231527 -336904 157862 -112125 152946 87025
20830 87025 -128865 -322395 -277901 -91388 -271962 -22027 -101009 13631 115525 -85173 -38265
20818 -79177 -191491 -130418 146775 37646 -131067 97375 -41972 339586 -342553 95226 -145176
20806 -112974 15058 38557 -253671 149830 -147213 62900 97454 -144883 27477 5283 553
20794 91806 -554903 -124647 8405 233676 320615 -217561 214897 -301217 -63116 72872 49615
20783 49615 -79348 97218 -49781 -77539 403473 -45810 89717 -104908 181491 110960 -334898
20771 77729 -7589 -362838 13497 35738 -399895 -102479 74554 -78629 -77093 -45765 15830
20759 -62079 -81544 -252548 -49375 200812 -341700 20138 -231599 64388 -59051 -184744 -252656
20748 -252656 -187675 -349027 -41795 118909 -210236 207750 35187 -216137 -398111 -117780
20737 173617 234516 209987 -486795 77480 -177588 -268 -318220 -22945 72957 -207626 -17613
20725 -103472 62683 40062 -55814 -182688 103816 -9609 -89795 -216733 -133196 -219481 -305000
20714 -305000 98058 -411429 225398 52367 -169630 -129467 -153646 85695 -34050 -22754 -46021
20703 -46021 -168364 -1356 -129559 86528 -207817 -92420 -82728 21170 38688 -204452 71483
20691 -132749 -19263 -252162 -418551 -152097 -151050 -35117 -388827 -144567 169009 133259
20681 133259 -87203 -41345 -111279 -20438 -229790 -304016 124788 -532420 -491691 -220973 -36367
20669 -155393 309824 -44122 -400247 174827 -77814 11093 -486544 -276442 49583 -195901
20658 -278984 -244259 -154628 -110497 -267732 -199283 -104444 -277651 -15807 -154533 -298711 -44303
20646 -122403 -91108 246216 -122563 45935 -172598 -402539 -94970 -371166 111653 184971
20636 184971 64661 229863 7336 -212030 -10912 108544 189581 121293 16208 -21986 421386
20624 -449 285392 -40892 61547 42603 185472 -105067 -119995 -227796 -137726 -120384 -124664
20613 -124664 -397782 151677 -293460 -78432 143095 101406 -111877 -243980 88406 -81236
20602 -214155 131978 -143863 108271 5705 63997 -88384 169050 39444 -169182 11324 -220875
20590 83911 103450 -285554 -113540 -164111 -362607 40231 -288995 282386 -106273 68908
20579 141937 337303 8726 -87001 195251 -283399 -49618 205056 -4250 265577 111243 141591
20568 141591 -15984 136690 -198354 -163116 -114753 -55749 229758 51698 -333330 -298754 203013
20556 215384 -431389 105970 258061 -66682 42444 -153501 -337804 90932 -138697 -167177
20546 -167177 72564 50590 -153542 424761 -112112 17043 98066 -325291 206004 24868
20535 -91494 121070 -336221 414953 -31631 -223335 -319896 165748 163506 -192010 18275 -123997
20523 173559 261527 482 79615 -148752 28337 -76736 467671 31880 181861 -93543 -91296
20512 -91296 -137765 163525 -82724 -30115 107066 211567 -6078 188052 -174079 4773 114189
20501 114189 321179 -292529 -213467 37315 -147450 110998 39184 -186493 -51557 -127167
20491 -127167 -76683 55146 -116549 -207877 -107164 -136634 88291 -212383 -212296 131388 -8294
20479 -481936 7204 -284950 -77489 -59648 -108733 -176157 -164315 -176657 -233118 -155137 -94345
20468 -94345 -170832 324569 -85039 179239 216510 139341 181307 308597 188734 119388 -349153
20456 77584 49362 -26634 90876 -81561 127229 23902 -56344 -344171 274685 285596 -394428
20444 -52608 208456 91293 613 -289177 -278167 126505 43243 -141687 -173780 58261 -203675
20432 -342914 -206219 -11253 -365182 -269712 -171508 -221671 -89620 -232259 144062 -25976 236554
20420 -252983 65707 -62028 121637 195325 -292133 143672 49705 122084 -204556 -167514 -183333
20409 -183333 155638 14069 -58258 -272708 162138 -100485 -90609 -57708 -154038 -205631 -118655
20398 -118655 -123540 122229 32093 254800 -81168 47798 -241719 -205210 -38564 -61453 -122763
20387 -122763 76007 -280591 -95704 -469713 -66046 18224 -185629 -109157 -258902 -55484 -217459
20376 -217459 -61508 -401697 -20277 -129954 90575 -163885 -144455 -82056 -138296 -377131 104451
20364 -265932 -225327 -110827 -102493 -111431 -460418 133898 -82881 -97440 -2268 24104 -120233
20352 107694 -210602 -141864 -96531 -119183 -337731 -70444 63442 -52165 49947 -56917 21180
20340 5613 -23759 111546 -200657 -264392 198944 -181175 -117191 -308063 -225627 -82690 -61833
20329 -61833 117715 -151788 -63325 -109097 30834 -182725 123751 23675 -358939 265537
20318 -147533 18739 -227621 -173119 -375181 -114269 20995 -125654 81446 -139643 -141368 -160345
20307 -160345 26618 -92344 99276 -320569 15344 -60452 -46556 201881 -202637 24566 -141666
20295 -501471 -204700 -162161 -230813 3665 20913 -253611 305327 -77282 -42183 -8430 -155193
20284 -155193 193855 -91169 -40190 96435 375400 52150 146946 122880 6388 -91277 -142672
20273 -142672 -137106 -3911 32008 -247640 -195693 394400 79386 -2589 403425 -172650 -277886
20262 -277886 79969 -540729 -249523 -182965 -89095 50208 -107187 -114053 194318 -67620 -38134
20251 -38134 -94216 -198035 -21878 59574 -70242 102771 -25729 -164748 128480 29704 -353078
20239 -73246 154536 88542 13736 -102952 17023 -175714 260385 -254777 -77427 -285396
20229 -285396 78796 -113484 61798 376622 198508 -178197 -43520 284996 -110625 49388
20218 -83807 -15394 -307887 -177075 -15351 -58265 -98775 189035 -109898 -250206 -94322 -188199
20207 -188199 -59204 18294 -8892 -12736 -75900 -102512 189210 109772 93370 186522 16339 -362635
20194 -92407 12368 378355 70797 13743 -72779 58701 105765 49649 -140289 -208725 144216
20182 -267554 166884 334490 -102948 48703 -217099 -176769 25431 -21603 25837 -31354 -191887
20171 -191887 152545 82568 -177953 222080 108169 152097 31186 -46539 496689 -105748
20160 88538 -27371 90396 -63532 -17282 -276126 -32913 -178203 -266450 -177163 -443745 -183273
20148 -456173 31745 -75217 -506144 -54288 100509 -50686 297740 222999 46926 -123366 434
20136 -262517 4700 -218085 -65690 -1533 -103032 -55142 -180329 138086 120159 -127693 -326860
20125 -326860 91028 52742 76504 -34596 28472 18856 -70940 -120084 -240111 -122671 -131179
20114 -131179 121740 310673 -275572 -69157 -50211 121598 -204779 -30668 -66008 -21072
20103 -254776 -70042 53264 19641 -354059 -5826 216113 110714 -29744 85180 -115480 -70505
20092 -70505 177096 -166067 -273585 173294 211049 -7200 32812 143476 96147 -100568 -71319
20081 -71319 -180231 109316 -231820 377476 -102574 -31252 516968 -355228 -195046 -146393
20071 -146393 -108832 -58774 -376151 -518 41869 -130230 -83498 -209199 -175549 -188575 237158
20059 66680 3070 237748 -43725 2025 83129 25125 -130148 -134784 -163038 58135 -326147 -158599
20046 137146 -85894 29896 147926 -212743 -224742 -79493 -79338 96042 -242126 -237196 -185638
20035 -185638 48936 7252 -22842 55869 59108 -111114 -174753 27889 56873 -519915 55740
20023 -147235 -345801 88563 -128573 -146379 37256 -17922 -207734 18465 -190375 90768 -109179
20011 -236676 -258931 -29001 -255852 -7552 -311995 10215 43810 116346 -53244 460228 -161732
19999 92873 -243517 -95930 -115239 -78037 49153 95435 98137 -226257 69986 26626 -93425
19987 -173337 -86069 -70429 -83724 4811 55568 -81019 78573 77571 -207117 -46164 -301220
19976 -301220 -86225 209383 -8047 298453 -5164 225284 -142595 121783 603 70244 -137735
19964 -169535 -163549 115773 -111306 -276112 55236 -375565 285418 -339776 169735 113102
19954 113102 -181799 126815 -101061 2273 129068 -62920 -192053 172976 57596 -119315
19943 -37742 -27589 -155812 -1305 -457018 125829 -207314 -117546 334514 -191809 -108985 214165
19931 44260 -421725 18987 -144466 38994 -49706 -295213 216465 183776 -156899 38589 106247
19920 106247 50508 -220713 -512866 159524 430991 334755 67228 -257385 -265316 -268359 179094
19908 106393 191621 -20806 -181414 101279 183160 -452101 -75576 -138105 -33419 38569 -16840
19896 -151657 149500 62050 6946 90741 117835 -44633 -129888 57979 107612 -123911 121321
19884 72542 42916 -114336 31411 92259 -61616 -178068 -152457 72744 216247 -170578 -31391
19872 -12273 -271085 95067 -121072 -145325 -158281 -45845 -53538 -133068 -73491 -17522 -12147 188607
19859 77343 -245149 -21065 19156 -238690 301184 -180599 81910 -142062 -224097 -61216 -132848
19848 -132848 -338058 71795 181430 205856 46179 144867 -302247 104202 -92941 149561
19837 -273331 -211621 41638 -29781 96471 180924 -309319 -182631 170790 -20292 -56504 537262
19825 110854 149660 34153 -133169 12277 97939 249277 159297 -53436 99364 -50763 112014
19813 -199134 -90220 -227056 -169617 14042 -260947 -140979 -35584 -95851 265661 -10712 53981
19801 95137 152700 -243252 -172132 302981 -185234 -41285 -75361 7779 -23645 41940 -148505
19789 -31242 -80840 39032 -11652 61591 -281682 -325655 -39412 -62225 -206296 -82099 -250061
19778 -250061 -143236 -463 -102650 64609 241601 -180689 29021 72906 -10760 35413 -37623
19766 89708 137955 -145658 -17441 -486397 -8718 82984 -28576 -333743 191670 114656 51871
19754 48246 313963 126213 27414 -36719 -25260 95577 -136354 -174857 -109336 63159 36815
19743 36815 24501 -77030 -107511 -263194 -374945 -178112 181346 -15219 -129319 97638 192396
19732 192396 -12258 -28365 41981 28560 152537 -154414 -74711 -272941 -55470 82727 -62721
19720 -43500 28287 -355360 126696 -104398 -106859 91647 -91990 -103814 -372018 20145 108055
19709 108055 327486 -298490 -102823 -50324 -62049 176696 262883 -43535 -39737 89774 -70377
19697 -29034 -104257 101169 -163410 180657 112279 -110287 33628 -40010 378281 -58963 151735
19685 -85735 315953 3547 -170711 -269730 -106388 197184 -228094 3064 2287 216092 84515
19673 -110978 -156781 225324 139281 -332273 -57601 215629 114355 -25985 198807 72425
19662 -151929 -162830 -445 97033 -140255 -90560 -167711 -134410 44013 -59861 114487 133515
19651 133515 -61353 7273 -47773 -116586 12929 306667 -7729 -337555 9786 65489 -208620
19639 -390123 45875 -369433 417162 -314652 -143196 10964 -169681 141209 -201652 32425
19628 -426567 92474 -245285 -193930 -144530 -214120 -117918 -86833 21902 -5246 -184383 -30974
19616 -44350 -23672 15701 -270736 102565 98308 5393 -50587 -441506 -116398 68099 -370830
19604 -190529 -137890 -363310 -133706 -220574 208595 -130319 -99916 190048 -57846 -87062
19594 -87062 -111141 56990 -234694 -306488 -38288 -102260 -161137 19790 -164795 179939 -155056
19582 396705 -92097 -221194 -303955 -250925 221739 26398 -41214 84618 117679 149433 -107809
19570 -229496 25389 12035 -168626 -12183 -156880 21560 -30132 -281561 14876 279890 -190840
19558 -54917 -191698 116966 266526 -53639 166149 -36805 -42975 -283820 -8648 -313234 91805
19546 162251 7130 -228586 18350 83006 51736 -41648 50530 321906 -153274 -141649 2960
19534 -104452 -17543 -271535 64032 167401 -13324 123255 8844 139991 52139 -127426 -12335
19522 -62043 -127397 -19547 -248637 -97570 -166074 -205168 -80230 -437016 -241144 -44047 -40298
19511 -40298 64445 -76416 7192 252112 -18507 -129754 -308093 177443 -160203 -111508 30603
19499 37596 91990 -274262 116347 -422716 -51928 75288 3278 -148897 194289 -228837 56224
19487 -143858 -308412 54266 -36201 -175299 66735 -88986 51805 61665 145005 -132142 123424
19475 -76289 134434 -190166 -56694 71545 -46742 16179 -53270 142356 149634 80388 88037
19464 88037 56528 50780 111840 -297213 -345284 10814 129024 -16708 -224122 44830 -285391
19452 17189 -132468 -149616 -295448 43554 195591 -282369 318682 -317018 36885 188818
19442 188818 59818 -231818 -229876 66122 201979 375875 -129332 115863 -40723 -97073 135586
19430 81732 69741 -250585 -161291 -275811 127475 126206 -17034 43900 107497 -163284 415107
19418 -126200 -15839 -21243 123965 -208835 185527 -140404 -45499 -33606 -29433 -187556 -77080
19406 -173775 -9363 -218471 238397 285867 -65836 -5946 -94710 70666 -131980 39284 111637
19395 111637 -88865 -127099 -97275 -157773 94393 296441 -297044 -58547 -137977 -159763 -164542
19384 -164542 107377 31620 -125618 -122758 47994 309018 -171286 -148015 87599 123832 94609
19373 94609 120244 -350810 131863 -27225 43488 -112529 -292391 54501 122213 -263278 91950
19361 100626 -275589 -141113 -19780 -182976 -140386 41972 -326166 -78449 -121125 -17410 -256032
19350 -256032 -85259 -192505 -170471 -309516 -201 -144024 -89230 -596776 6515 -171353 21473
19338 -87915 -317126 -201837 -86318 -103881 -59541 194148 -86455 -218225 -158770 -298155 5602
19326 -46257 -125303 -219236 32514 -150137 -128551 -32672 182777 -338251 -217653 -105419 119086
19314 193919 27304 -209911 -367657 75617 -247556 -46986 -6461 180823 -477944 -219416
19303 -115697 -317149 -89023 10193 -235480 169811 -122521 -6855 266826 -436890 49199
19292 -146315 9618 15582 22224 232870 -100438 107115 -129178 -84019 34992 -7801 -230268
19281 -230268 -236035 60564 -8685 -269286 -193106 -101555 -171139 -320505 -169281 177333 133452
19270 133452 -275055 -195904 -277926 106825 124264 -157255 200170 341472 -195843 -74755
19259 23983 -51391 -67595 33535 -112980 -58109 -133865 -230584 154044 -68220 80661 212557
19248 212557 131264 -107313 39637 194391 6072 -9489 46271 -233639 -221756 4160 154091
19237 154091 -239923 -124771 -3903 -117367 106594 225461 -53973 72281 362 -362237 62390
19225 -252453 -208565 -6422 -114444 84925 -97063 -205001 -179456 215098 60317 -84835 -103209
19214 -103209 -101885 -2202 207987 138530 -16002 -138554 -146619 29587 -193171 8038 -5254 -57902
19202 -57902 50619 209781 229372 -12433 -184439 82935 -136032 277708 -123229 13545 -148621
19190 -72950 245040 164674 10585 -85548 -69603 43834 -88125 -309576 127712 -71138 -46969
19179 -46969 -109238 367402 -33802 34480 -255783 261898 -130016 -172237 112497 -278191
19168 -110697 -138513 71200 -312722 -145458 -160721 -293889 -83255 38609 41506 11432 252733
19157 252733 186899 -72282 126796 -216026 -110479 -197079 -508338 150467 42897 -237267
19146 -245346 191156 110102 40776 -413898 113862 -150705 -1268 -108097 30521 -145436
19135 65137 51136 30269 -191345 18905 -85156 -63461 -218799 217945 4963 250395 -56262
19123 171142 -7886 233129 -40976 -256002 72922 70522 46422 -362339 20671 73551 -10238
19111 83967 -61373 -65812 -46908 -250162 -25658 248955 119138 -638429 -377152 53624 89153
19100 89153 144362 -249069 2750 -468910 -102089 -278130 -100458 -76667 -406397 -20931 76329
19088 -156577 6867 -239517 94864 -27338 -52319 -375629 -76974 -152687 138332 -38963 -145065
19077 -145065 108407 -79162 197860 96494 -247969 224984 -213738 -121761 717615 -94999
19066 -240340 -47409 -316801 108603 -8402 -112466 -224040 100084 293624 213608 -246280
19055 -64384 -63560 129237 -237017 -334416 -111302 352867 -22879 30391 -2100 -203386 -351382
19044 -351382 140290 -92323 -193229 174349 -60164 -206503 -116440 -145090 66232 5122 -268138
19032 -83833 -99080 -32814 225414 -77344 447865 -307772 -189309 -38622 -87636 8323 -31146
19020 14023 -79818 -169456 66007 -302477 92614 -167363 6692 -137543 11502 -153642 82229
19008 447809 -219287 -109685 31131 201600 -24684 -243322 -278612 -306324 -1540 -68851 -213048
18997 -213048 -6201 -227987 -58166 -377915 -318779 -526961 9594 -77598 68319 -47236 -19078
18985 -291874 247318 -67646 -220069 -22696 -9852 -102559 70319 -42 -100207 -328135 77221
18973 151993 -58402 -224005 -329202 48485 161976 -18829 -213263 43530 -178916 -180910 -179311
18962 -179311 -40735 -106230 56218 -348389 89670 141771 -88174 100882 -55780 84004 -56597
18950 -350972 -158329 -90622 32646 274925 179151 104839 -20546 -157023 -91568 -234196 -410623
18939 -410623 111666 86170 265791 221839 175559 -58500 -27897 -112713 -56236 -15330 147435
18927 42405 -75363 -186230 326838 290823 -3516 79580 -39200 59683 255046 40859 -135296
18915 141605 58990 74175 -76027 -214833 76400 291217 -230315 -114968 -51898 -126734 119005
18903 157516 -72938 151296 -77009 118790 -58655 -147266 -118141 4685 201911 -112402 61523
18891 11969 -12764 -28608 43904 13795 -109927 -203396 -66076 -110944 -176480 158812 -8368
18879 -13368 -158300 241077 -67018 279628 13856 187529 -114599 27783 89902 -334993
18868 -66101 -228461 -186534 234221 -32949 -119926 107807 14896 -67568 -163382 -141564 -220438
18857 -220438 -198016 -129140 52453 92130 -58865 -6392 2527 7545 139576 -64533 56196 -310298
18844 -304746 145141 156700 239236 -154982 -445053 45461 -82470 162427 513 -337289 326960
18832 51149 -325629 -294421 117499 -267581 379905 -4158 265894 -18792 -30527 -22669 116063
18820 248947 -533150 -280642 -40693 8507 -170758 -155539 140883 14776 19473 -119518 117406
18808 88918 36799 46008 -162264 -98474 -54653 97117 211546 116437 -294033 101896 -170908
18796 -337494 -172082 -232437 -58295 139381 27135 -89230 -245874 -120732 -6206 -62201 -41160
18785 -41160 -52742 -166882 23233 246321 -149869 -44177 -93684 -43746 12768 -241086 -138332
18774 -138332 -173529 -182053 -17769 -46836 -69413 -159049 -36990 175761 -306281 -21987 -239806
18763 -239806 -205835 -101693 168586 1725 133705 14335 -22985 -35879 -295543 -135539 -243495
18752 -243495 -72302 189572 88319 -119326 -273810 142274 -91615 171265 33572 -107748
18741 -25563 256707 -267554 -116537 100267 121845 -11600 -38785 -90618 252975 157343 -16591
18729 -20522 54848 -22138 261028 -186466 139373 36158 29064 -101735 -37606 57711 41746
18718 41746 -36929 -382299 -90823 5107 -8683 197594 90058 -62598 -256927 -365755 -261454
18707 -261454 -180033 -254232 -210679 -323525 -48063 -132141 -419626 -234043 78170 -161397 -122603
18696 -122603 -270731 103883 -43170 -104827 19750 -16055 39688 265621 13427 -123707 -274347
18685 -274347 98244 -40648 158405 -29187 -135653 -178987 -25349 -141376 112562 -50800 2101
18673 17859 -115767 -239606 -384226 -319804 -291408 -140354 100638 -25729 -128490 -233147
18663 -233147 36301 -84135 -60278 -358049 263049 -334917 221582 9729 160810 -25090 -27003
18652 -27003 -18544 -198146 -269291 95464 109429 57124 -182491 -212356 83649 -21603 -344743
18641 -344743 -27818 -1845 -295329 -92080 -334408 -264997 -89592 -97699 -48096 83307 -497343
18629 -136214 -263519 -112070 -193091 -176986 374064 143338 -210612 165047 41882 -179288
18618 -161981 16482 -55632 -38285 99927 -263399 181517 18027 226134 -158148 -62753 71767
18606 21302 -171037 122458 -23491 216704 46193 94845 -292439 150291 74631 16477 198226
18595 198226 134885 -384565 207006 -23260 25788 -82309 -76830 45425 106625 -350813 104191
18583 -234345 -40710 13795 -45257 -161348 50466 154045 -356703 -154387 -231869 161955
18572 379748 18345 18942 89719 -182090 -75221 135691 71226 -346065 -433110 55618 83931
18561 83931 -39109 -176112 -161863 49602 -81444 -90945 28732 67043 -193954 121979 62360
18550 62360 53155 71258 -68792 169648 26790 -147048 -6074 -238197 -133813 119031 -303618
18538 -332829 -53935 13462 22521 12645 -45065 122596 164927 221662 -441188 -158152 182134
18526 61217 -70015 229283 -56324 -201875 14885 -44971 112921 31810 18678 -317856 63053
18514 183885 86735 -75550 100168 -54875 14496 -102994 104824 122080 -226887 130873
18503 -41655 -88636 410606 -31167 -78167 91644 54727 65195 276884 -380561 52733 -65791
18491 -143740 -303251 -2367 -83095 -48191 126885 -300707 43556 -46463 58390 -22211 11704
18479 134061 -445012 333982 137791 15454 -35307 144804 227042 -195685 -113721 -14927
18468 -63655 -525028 -237526 22380 -77459 -67493 157161 94549 -31570 329574 -210373 -96765
18456 30004 -363194 -123226 -263426 165253 1226 -142267 -14814 7715 345595 100265 -159484
18444 -418408 88949 161361 -42121 -17694 214530 -46498 163307 -11200 -277282 -150732 -242493
18433 -242493 43567 -39792 -242906 -228131 -412520 -271142 -46338 -66405 399639 39842 -61531
18421 120663 -127529 -121449 223262 -43682 -469802 -212250 5924 43625 -52827 -271891 -126536
18409 -174801 60049 -39078 -134226 67803 151381 -211417 264063 95452 4004 -196721 -166362
18398 -166362 -184252 -317135 59253 -58477 -452386 -75517 121559 -172215 304786 -225288
18387 12667 -89837 -3345 -67253 57764 -26817 -76289 192586 142741 -6456 278105 38683 189218
18375 189218 11355 -156291 318456 -232108 31797 144805 -118134 -23260 -50102 -171318
18365 -171318 121931 -153547 -35182 -411984 143751 62182 266998 -106060 -385876 -139606
18354 -38698 168463 -36326 -43399 72680 -79469 -176805 -173197 7811 206899 -198309 279762
18342 -134737 46110 -250412 -296724 29569 -186905 -20299 48530 217841 139544 -16381 -21126
18331 -21126 -42706 -203326 -110077 407871 80701 248816 297734 237082 -81633 -99198 -450316
18320 -450316 -270142 -355515 -170283 -261035 -248720 -206035 51984 -146066 -177508 105080 119183
18309 119183 140376 -56455 -211289 75352 -39832 -196879 111347 146838 279943 -198503
18298 28696 -406160 108377 106836 86140 -29036 -218591 -171706 34597 -10984 -136098 147785
18286 -36194 -275367 67876 -154170 104291 -57544 -243858 -91103 -84225 111350 -2715 -69023
18275 -69023 -167009 94380 -67953 134775 13435 55708 -79532 20055 -376430 46824 -58689
18263 -74531 -50448 -540750 15407 -244472 -307183 417130 -109461 84225 -33839 73744 187144
18252 187144 -57159 -96628 -32454 13111 -138238 271001 276208 375036 78892 40792 44131
18241 44131 -191596 357 -46122 124844 -41991 -152422 -183932 121000 -45492 -85920 -6699
18229 -75437 120103 -136307 -203007 168143 -39093 -55098 -147186 32238 -181285 -20615 -560621
18218 -560621 -261903 6359 -472 -272340 55705 -217034 -52448 42380 -81721 -341983 -77545
18206 -131875 -112962 237506 -180595 155300 38498 -60007 85701 29002 -354363 181585
18195 -55964 -272359 -153868 -73578 258210 89553 -105081 -274207 -83180 -81897 105049 155274
18184 155274 -68387 -209343 35710 -221055 -101690 -100118 91633 -103788 -204915 -181116 76371
18172 30341 57205 61006 242208 -73246 -5055 61616 -81946 -103615 -223563 275666 -293514
18160 22394 56674 165832 2406 -20053 323285 42359 -451420 74766 228863 -359661 251422
18148 16812 -185342 -62432 150574 -48771 -158744 -166255 -249897 224510 53864 112603 -336839
18136 -77264 -149754 -24569 -288062 118670 79724 -229295 153836 -258892 166489 3852 -216986
18124 311460 32782 -91916 -120881 -131726 -225575 -1446 106920 -108511 157895 181145 253290
18113 253290 251 81952 263154 45888 18042 -111994 -429922 -230655 41172 -107955 -33449
18101 -86289 16686 -225914 306924 -200032 -193842 98679 -85805 77732 59804 97115 -102220
18089 -153129 -39938 79784 -180080 -16295 22767 -229237 -129412 55716 159864 -95336 12000
18077 -200390 -55401 -45256 286353 151645 179085 60243 -10672 67411 -58563 72309 173537
18066 173537 153468 -253946 -290379 116928 -269258 -144521 145731 -12730 -23044 127147
18055 349055 337259 61147 332013 262965 -10952 9685 -30944 196032 -184206 -38412 -12523
18043 -54506 -283128 -103867 237539 -193759 49129 131981 -186547 170590 -153064 306214
18032 169780 -25188 -132712 158321 -17069 2343 -82690 -201055 57632 -319969 175598 -100975
18020 -85823 -20566 319222 -171892 -130741 -15358 -135603 94555 150135 235284 279529 66202
18008 285540 27619 -49618 124491 312593 39262 17973 124180 18845 -22606 -253785 -101620
17996 -290051 144926 -36083 105346 164841 401895 150678 -165800 -101209 -101901 88078 -180553
17984 -66778 201064 -87521 -99134 -197683 -241024 -288372 -8568 68328 -177050 -360260 -357002
17973 -357002 -55357 -142546 -250949 289035 -28449 195742 148102 -125590 186467 -147259
17962 -176744 -166899 174246 -193185 36069 -217312 63579 -137224 88189 37184 -205942 -215220
17951 -215220 -331166 -223190 141641 69963 -101659 75647 17917 17304 180140 -14251 -215333
17940 -215333 -129076 -111729 -201275 -127945 22350 210295 84574 28158 -193262 -87356 21792
17928 170438 232390 328221 -186911 -118067 20531 -269011 -37605 190220 -78164 251236 -283021
17916 20282 138519 198990 -237264 -67182 -50504 340400 -131640 79923 20045 -3937 -248121
17905 -248121 -345890 -180061 -23261 -253975 -181733 -48544 131264 26271 43046 -32436 26899
17893 -334130 -79633 -244712 -21457 -18882 -98432 -28266 31277 172380 296136 -71407 -175274
17882 -175274 67026 -90228 -229150 -117408 44145 -68407 -66505 -1522 -56941 -81223 -259268
17871 -259268 121146 -9131 -276140 -275278 61636 259670 -229658 3756 32514 107172 194804
17860 194804 -287624 24499 20045 242644 286921 144141 106826 -438131 18906 132379 78236
17849 78236 -171502 99489 -301137 -151583 104703 -658 -8017 231491 -125751 183958 27083
17837 160545 137133 107833 194456 16492 41276 -123988 -169961 -1848 -41880 -25937 218656
17825 -149616 36782 138333 204363 -292932 69143 -11841 -14427 189772 62402 182978 205043
17814 205043 24999 -466555 -99685 230916 21439 -222874 171945 -177953 122314 -43788
17803 -308052 90743 167097 85097 141750 -21984 -171586 -76654 36929 131236 -11629 60583
17791 160337 4986 -341273 -201524 -288004 -236200 -368011 358151 -199697 -144805 -85365 19812
17779 62498 -307269 -46718 -173824 31551 -425220 4564 107012 93353 9009 -208509 -189008
17768 -189008 241885 399 61384 80252 43331 147640 -336525 91250 -148738 -315808 73891
17756 -305521 -213479 209744 9884 -113623 -8944 177595 73984 78025 -31095 152706 1336
17744 -204088 87220 -173409 96272 6234 -13152 97981 -7230 92890 13931 118678 255133
17733 255133 -197912 192907 75070 -141507 189053 172576 53224 -79087 -110648 -459638
17723 -459638 101861 88214 66697 247127 -176582 152886 329422 -136587 5397 41183
17713 41183 49160 186194 157778 -187066 -72693 -123839 -200339 -36797 -6051 -62414 -240865
17702 -240865 102668 234732 -104732 49253 98635 -132260 -211441 -82145 24856 11215 63465
17691 63465 86837 99654 149076 18640 -366233 112296 129013 -240586 62406 221675 118936
17680 118936 36685 -127227 1477 84532 112320 -92379 -312596 -177402 46280 240412 326482
17669 326482 104409 -191101 188893 89101 250694 258685 -52369 216598 -3760 -189775 94087
17657 71640 264376 -45028 338885 -68365 342484 -93263 88696 -148696 232445 266331 -275085
17645 -11451 -181943 96357 -172720 -36973 -101146 -39706 -7117 161587 303557 338150 -77372
17633 -48831 -38188 192203 114240 -38019 -233995 99336 -151396 -291531 -140754 -32111 -137309
17622 -137309 3252 -303962 1062 -17937 166952 225083 241827 12928 267714 158351 236810
17611 236810 16920 -370048 -102217 -413356 164676 -289504 30348 218997 186397 184056
17601 184056 43052 70194 -206678 -75212 118149 -46638 -67452 69183 92816 125702 22397
17589 111211 33984 -40933 22471 255475 256880 142974 443729 -244628 170861 39369 183152
17578 183152 22020 -200724 47339 315544 -391976 89275 202475 123390 266420 145597
17568 145597 32762 -89730 146285 -53809 17727 21656 -414314 -110730 206062 81857 2670
17556 198140 -51868 457109 206530 248888 -38841 173639 286635 -7303 -67968 113677 -101884
17544 52549 262818 88869 404645 -48336 -3013 -7148 191633 141604 104149 185242 231604
17533 231604 39114 266558 -73964 -138624 5563 82850 101059 51218 184378 -42787 5484
17521 -142087 -74865 -73561 -17 101134 -57612 149905 54070 245439 179675 244561 -35446 -34662
17509 -34662 -24928 -129487 49843 29575 -24753 -3261 -46345 14795 91828 25663 -187143 -40247
17496 109242 -60043 20110 278785 199338 45118 -166314 415934 172393 15867 -16574 -73574
17485 -73574 -45691 283561 -198826 57465 -249243 82617 327719 201780 281476 389650
17475 389650 62688 99317 188855 184831 -304389 29391 115976 -169369 -54000 -133300 72877
17463 -144360 58841 355776 230941 40770 309901 -41182 330405 114480 189913 128255
17453 128255 279095 209937 45982 344717 -12047 448477 78178 281571 454013 488333
17443 488333 74729 403798 105931 114633 93195 27307 109080 140304 239553 64987 242949
17432 242949 164781 356977 297017 19027 98776 -17967 -16301 334066 281260 270002 421058
17421 421058 286800 177389 73061 -32351 92208 214954 29371 84824 349674 190369
17411 190369 323325 459441 -122782 -76554 322292 75906 -104197 372409 79249 44474
17401 44474 95416 417771 -18435 187358 55407 325430 47052 -242272 159103 355029
17391 355029 203780 159049 312719 94942 92043 -61054 165255 -117859 -54278 -52380 133579
17379 225353 66251 133161 127659 57120 -6591 421770 -10290 38842 96254 193029 210515 228698
17367 228698 198998 -220556 -23037 204180 -3097 80913 232408 401668 323858 -309792 -81236
17355 138742 155471 115335 -55462 -131061 378513 131468 246924 71813 54870 278273 -116441
17343 28613 272335 201376 101047 108560 193638 184705 225961 219256 309524 -28044 -139714 -35409
17330 302528 503135 16874 85257 88946 256375 -4564 148874 -385661 100425 316955 -75864
17318 107954 233071 257994 92255 79271 176092 41975 310608 151741 -6971 449151 146253
17306 144016 151077 -90057 304963 -40564 -80347 22648 74802 -305257 211870 150206 145758
17295 145758 441005 -54851 156950 301294 265349 156569 86595 -162048 269925 -128426
17284 73651 -244377 31261 441955 117127 151338 102714 -96514 -147829 442122 94341 273726
17273 273726 7718 104543 -285923 175236 -6586 137985 313212 588886 166914 324289
17263 324289 209242 125253 122052 240770 123958 569468 276676 365905 416294 194803
17252 52552 81570 286218 -127907 369296 375563 191238 98836 279384 224865 365539 7384
17240 457357 409521 61486 97602 129131 348125 421796 50099 459195 -1945 155533 74134
17228 -99134 81898 456693 -52253 -61065 204899 313986 330876 469995 422948 197925 261224
17217 261224 114399 249740 122139 495729 281161 221371 -19671 181900 173156 286887
17207 286887 85225 281095 250263 503080 555385 89987 20540 205007 81144 63533 102491
17196 102491 11160 285143 122939 682164 301412 375172 -80327 230398 80676 74478 210219
17185 210219 301486 535416 242789 170576 462779 75954 346561 434017 69616 198451
17175 198451 155709 27598 317495 248625 -29088 217089 109404 179363 551795 333981
17165 333981 385503 277120 80978 362480 127352 230584 477015 486622 119820 390122
17155 390122 417224 280355 406836 104656 241812 398929 57444 199099 485709 413027
17145 413027 260940 301502 342179 268009 407982 248778 267649 306422 238671 469175 254411
17134 254411 22249 350862 345277 506218 75130 273088 364878 275995 407134 294949 321126
17123 321126 451246 342665 274221 577134 -126221 563965 376904 270391 48338 639631
17113 639631 531769 287949 401794 246022 219922 400995 277997 294847 416448 489209
17103 489209 311575 221604 463744 313818 311222 205739 311995 372882 200489 -13034
17092 474277 359258 551373 433367 507705 337822 489479 369128 260504 444781 480261
17082 480261 325299 73852 374149 383453 315240 681587 353646 510934 330036 504161
17072 504161 277110 195224 263628 409454 443743 434665 290461 576305 529407 498671 761503
17061 761503 495770 328308 528816 448738 294555 389024 346720 576644 129803 595412
17051 595412 743398 323171 617879 560060 625623 400828 568760 480816 619842 410581
17041 410581 873281 557543 799550 315947 819218 346935 544791 630461 525144 652901
17031 652901 697633 907745 298167 542539 749720 587370 258293 840683 478334 568291
17021 568291 482677 899116 525405 779868 764230 614296 469946 330013 538729 697914
17011 697914 519970 479783 569027 279643 721099 616713 674949 442021 583189 840089
17001 840089 359166 708191 763325 748402 504195 762344 442085 609458 589119 424053
16991 424053 824133 737648 653356 738769 1000911 457544 624890 706768 704152 807540 669297
16980 669297 1226168 589696 883504 985922 643507 817324 704475 989914 942111 804636
16970 804636 999450 798299 886765 1117846 728818 966734 937583 943675 661018 895560
16960 895560 824943 746198 1193557 1074561 1013323 983657 1042978 1328664 1031226 680108
16950 680108 867977 922204 972856 945703 856920 1178093 1059738 1088005 957013 1225678
16940 1225678 805414 1275166 814933 1051261 1584196 877025 1049395 1460750 1123884
16931 1123884 1146295 1086488 1426281 1417815 1355920 1491135 1271569 1353476 1304163 1000633 1381289
16920 1381289 1636596 1295971 1025887 1208376 1269456 1412315 1326021 1257443 1348554 1158505
16910 1158505 1307966 1337916 1418159 1150456 1476278 1154743 1598242 1472469 1468347 1661925
16900 1661925 1652355 1768286 1519345 1845485 1799218 1392680 1591139 1786708 1783472 1567559
16890 1567559 1844559 1978285 1872045 2090188 1687247 1593465 1945041 1784400 1865470 2121214
16880 2121214 2170586 2061067 2178966 1947540 2280275 2144448 2204248 2611557 2184240 2255433
16870 2255433 2514640 2512411 2156548 2388257 2358726 2497098 2481945 2593959 2500635 2848989
16860 2848989 2607982 2873112 2469278 2448307 2865153 2884906 2816026 3123862 3120784 3037050
16850 3037050 3370910 3194881 3107103 3278885 3381964 3386896 3669627 3099761 3670580 3391252
16840 3391252 3474598 3824364 3808785 3513987 4010898 4058504 4098665 3994196 4216927 4307270
16830 4307270 4501299 4444578 4166501 4786870 4588721 4911508 4879572 4840589 4591673 4676901
16820 4676901 5201566 4856014 5172928 5162526 5192429 5676368 5668076 5536735 6028943 6176458
16810 6176458 6149517 6521652 6455479 6122116 6990234 6983078 6758526 7446470 7616587 7288064
16800 7288064 7864003 7845044 7965034 7936785 8192970 8146241 8742792 8961351 9486048 9674930
16790 9674930 9603568 9997848 10292858 10648568 11029976 11178601 11346913 11906834 12030889 12234605
16780 12234605 12737430 13428715 13758775 13925174 14608603 14816962 15447664 15820974 16223718
16771 16223718 17130930 17538893 17911905 18938382 19295063 20255729 20829851 21433744 22426101
16762 22426101 23332420 24584770 25375340 25931779 27399723 28498026 29441702 30954929 32361269
16753 32361269 33955645 35282436 37184792 39096094 40808394 42962420 44916332 47782985
16745 47782985 49781018 52552807 55376818 58429089 61630968 65684958 69051566 73345121
16737 73345121 77598490 82707186 87807571 93213447 98930604 105109820 111924988 118876071
16729 118876071 126420816 134352860 142190735 150361084 158785818 166964402 175303760 182776872
16721 182776872 190027806 196380044 201464543 205720377 207584107 208863422 208296312 205973418
16713 205973418 202317445 197790671 191835211 184741137 177038558 168723651 160545428 152104429
16705 152104429 143549089 135218333 126735759 119595855 112240854 105417760 98534873 92953969
16697 92953969 86867348 81769319 76810334 71888500 67786755 64262822 60377466 56859700
16689 56859700 53812968 50785597 47849393 45492206 43150397 40952424 39084090 37178719
16681 37178719 35448131 33447969 32166185 30725500 29396577 28027689 26652846 25533586
16673 25533586 24499357 23569177 22754859 21762232 20912491 20254002 19353820 18630941 17773312
16664 17773312 17287183 16689226 15945004 15445322 15198774 14629525 13919794 13646209 12963931
16655 12963931 12918942 12545357 12053880 11590928 11180336 10983839 10491099 10183900 9748631
16646 9748631 9858832 9451010 9543759 8818009 8547140 8647830 8102271 7712055 8012510 7973519
16636 7973519 7319565 7107319 6887730 6893031 6886502 6430320 6557507 6417314 6187142 6207537
16626 6207537 5633393 5632438 5498800 5478555 5598907 5195805 4960979 5124364 4783887 4774631
16616 4774631 4830801 4920400 4378565 4389792 4384821 4503144 4088836 3815352 3927704 3789185
16606 3789185 3653285 3984196 3767586 3437161 3718085 3207760 3427331 3347009 3500753 3233633
16596 3233633 2968589 2904251 3194591 3294378 2808816 3040293 2919251 3026000 2599759 2512635
16586 2512635 2884713 2828720 2894570 2659233 2445273 2460921 2527677 2705655 2372759 2089012
16576 2089012 2243555 2238603 2415867 2553117 1985569 1924968 1958109 2365493 1934536 1915057
16566 1915057 1884064 2101870 1921302 1945677 1931990 2051612 1918814 1633451 1981632 1998149
16556 1998149 2107742 1507722 1834774 1886971 1914877 1555344 1786477 1640669 1509211 1416671
16546 1416671 1330393 1559686 1791323 1303704 1237266 1565699 1285660 1439262 938891 1372045
16536 1372045 1360839 1088966 1700923 1424374 1356348 1124809 1302252 1719751 1064172 1016854
16526 1016854 1276770 1157570 1217812 1112122 1331899 1181568 1068466 1228873 1376420 1087018
16516 1087018 899541 933620 1298103 1102578 1254915 1560175 910256 699199 803807 1054916
16506 1054916 1235667 1068153 1089564 667009 931196 690547 1090689 888296 1086561 1023709
16496 1023709 767213 1036538 1380814 871230 855118 898153 861275 779150 800270 600781
16486 600781 571118 632278 757205 959279 454928 516590 955206 1004779 697923 776683
16476 776683 684136 681560 708623 898221 641587 919330 665553 829041 906892 496527
16466 496527 887158 874611 461732 796393 626991 534869 445506 588661 640243 445567
16456 445567 849456 623173 534348 856541 838767 551348 595041 728236 440825 588007
16446 588007 655837 366815 352351 339410 562811 462365 703921 533908 528450 536392 397060
16435 397060 737102 716233 730759 398248 537105 450298 575934 676354 308910 462528
16425 462528 475021 377715 567482 65596 86611 190938 733234 695957 504823 332271
16415 332271 324391 350290 514666 192547 591900 415682 666647 305771 140597 37698
16404 508889 433900 409530 350777 408075 114053 445864 629637 253480 -11773 230254
16393 622550 522014 342913 -58464 332187 373107 399320 200465 335401 492381 726758
16383 726758 494255 286264 399339 379269 738230 72565 623961 538839 691721 386614
16373 386614 374685 251474 75768 444484 444173 169132 335158 454968 537941 488579 391449
16362 391449 192023 260876 321326 105684 633821 395568 5126 62437 440617 169100
16351 377978 332904 261075 221755 24851 614913 342474 37975 358872 202113 491331
16341 491331 257667 240881 501364 589048 274546 2276 439312 190840 373144 468537
16331 468537 496785 376395 322326 316316 -21384 277938 252132 299035 37833 157877 68214
16319 13664 7787 297032 221824 460935 175091 380549 269189 216772 328192 376370 489655
16308 489655 -163777 171460 -63457 333511 255865 251065 346224 -68894 442298 -34353 348472
16296 14336 351364 183162 276217 224074 344187 245535 62306 214631 287643 142362 204091
16285 204091 -149432 -245545 229763 157618 176627 -109729 185554 69798 360129 57436
16274 246583 117667 451443 -33249 321894 -89374 30807 157712 67926 117714 567577
16264 567577 196891 -4137 136318 -46503 212880 301529 -8777 259360 -66525 76942 438682
16253 438682 106679 287942 343288 -316087 138343 187411 150393 314744 386248 66955
16242 -307929 153958 33313 241127 346912 199105 263360 -238432 76319 132774 258577
16232 258577 -129405 70878 81774 96761 -40233 456754 -24501 -15365 16464 297728 203849
16221 203849 -101438 -172925 134205 -112617 271389 214440 429064 103973 -196135 247234
16210 356201 -9172 -95294 155660 47953 425947 130037 74923 -125895 -119369 -151500 185855
16198 311245 -95404 17454 373827 98291 182435 266201 54825 -126266 108020 70567 198930
16187 198930 -97316 239778 -77245 180063 -13673 -30578 180951 -72898 218651 18972 334184
16176 334184 -176540 67822 51905 -104857 257393 56082 272575 -885 -66840 63962 298657
16165 298657 -117217 37677 -137020 6138 -91107 -72413 7337 126377 -49023 375851 244826
16154 244826 127071 4691 195802 -101146 106309 87537 13470 -268079 166990 -69347
16143 20290 -116424 -51936 219472 138722 20971 195253 223866 142317 266982 -34176 221353
16131 -52004 254533 51310 -238804 75139 -202267 -97644 -236227 273063 -258034 247172
16120 554475 -68825 45807 -251427 38105 -51276 -182931 101223 -82569 27396 305075 25602
16108 41377 -45201 -349607 -159741 -100647 259378 -94564 242592 86670 51504 76954 -348408
16096 271310 276763 30889 217185 182115 88808 -359447 179265 169320 -217754 229991 78031
16084 173563 86964 142685 22037 320350 -15199 65858 -18481 -13624 -124844 162037 -23786
16072 -217361 47199 -209754 -51636 84122 -194031 133191 -128412 234922 -4581 152415
16061 -182219 58733 -58029 47187 -407688 -209466 -213015 52577 144271 92652 -117483 -82533
16050 -82533 -105956 130554 -31476 -104392 -86553 -199546 -96675 -242533 76719 -35775 108035
16038 258068 300456 -168423 136894 66598 -91533 273508 -223354 34509 -83435 -147413 -127709
16027 -127709 212791 277313 -324287 113643 -127479 -157632 -258170 29144 -13605 148384
16016 232317 153478 -184645 -113332 -8528 23557 -47340 126956 62885 -296326 -218674 220803
16004 -121160 80375 -331168 -11606 6746 164626 -565642 195184 -252566 -59716 47810 -31970
15992 340395 -103324 -76858 44475 -272298 390225 207455 18610 189366 137242 155628
15982 155628 -188022 -133467 -34067 384572 -151580 89217 -54294 43119 93487 -257875 5154
15970 -33029 173703 -63184 118060 -26170 66235 -325012 135634 -9670 -212236 86558 -75411
15958 -344437 39573 -223238 -243878 -280700 38391 26744 -206116 -305828 -190667 203134 -115208
15946 -38870 -366350 -233677 49491 -256257 214378 93165 -104226 -215968 -473831 68379
15935 62333 -403640 25313 -84513 -336411 -202505 -292097 -121746 118964 -24801 76931 -95779
15923 -114449 -163747 233613 112549 -260848 -75646 -394981 -62911 28478 -88200 47638 -175911
15911 2855 -121979 -110465 129421 -23266 -86316 -30979 -115754 -96925 -33265 -242381 -36065
15899 321652 -27577 45911 169662 14777 -24523 26172 -323073 -111049 -16194 -415550 -131986
15887 248084 43990 -280671 -11061 -97986 75462 214205 -48180 -42103 249641 -33750 111933
15875 -105066 -138694 262913 -80932 -149666 306496 -224276 364683 -108323 15303 -4710 -115473
15864 -115473 106337 -127443 45182 -231340 -71686 -240364 -60431 254427 80437 -26918
15853 -155816 41098 -56736 50676 -52917 -114438 344566 -189556 -54595 -101051 -41280 -360830
15842 -360830 -200888 113785 -265810 -93520 44843 305496 61346 -19163 -7261 -30623 82400
15830 -205523 206363 -247380 22974 -95920 -75371 -212982 40947 -239707 263678 143459
15820 143459 21407 80478 -372037 83848 -286040 13986 -65423 231484 -9754 186211 32140
15808 249184 -110027 159759 -172006 259677 -169447 199686 -9276 -48140 21485 -162395
15797 47730 -2013 -406540 -260122 175997 -169315 -109425 -95193 516 -225138 -148317 -67356
15785 143876 -66893 -359124 -358427 -36069 4059 -355709 146295 -53822 35387 -95955 107604
15773 62016 63167 223152 40486 -115839 84821 63667 -33386 -137476 -134667 80858 102208
15762 102208 246298 63635 -83629 106656 -7104 -137285 -266167 -18854 -29405 -29778 177366
15750 56758 -88823 139040 -272035 24060 -104275 19893 -85324 -469375 -136814 -242149
15740 -242149 34207 -125008 -224303 -35444 336420 7070 183994 -205482 -508294 -135181
15729 62740 170923 -260692 85407 156731 -82102 -121120 -255349 380696 -151696 13682 19303
15718 19303 318886 579527 -47046 36816 33068 -32959 -197164 -216571 -94227 -34646 123569
15706 -45570 282241 -258736 -17508 -319624 152784 55273 -191066 -116202 54651 -154307
15695 -27708 -225624 -135981 93366 -190620 -137109 -49002 -121998 201973 92664 -259792 -9572
15683 -372334 -82425 -139362 -18324 -32152 235495 -584055 -81948 -3970 90339 67957 -90892
15671 -84633 307237 267682 -77796 -126479 607352 78629 72278 61152 -212881 97954 -179568
15659 -147160 -54222 1824 -73001 -151192 20152 -430661 -253160 283529 -128681 53039 208524
15648 208524 -72948 -81688 153203 -76658 230368 274683 134961 -206046 -248643 42862 -3434
15636 215761 -343595 255637 29774 190 -152354 -167155 28606 -215643 -275897 -197852 13885
15624 72368 43344 -7524 -65938 -189445 62768 32398 78819 -235501 29192 -90425 169543
15612 175257 -451710 265586 186909 40808 120754 -55851 146151 63938 -112186 -121122 -354519
15601 -354519 -245466 -42347 295312 -261038 -229834 158223 95701 -193034 23765 -57051
15590 83015 -125888 -403949 -213575 -185226 -3386 -40704 -347 -112679 60715 -12203 -454667
15579 -454667 -68857 -172790 -98622 16196 82098 2922 225412 -213560 168509 -19410 191329
15567 -54475 -39234 -32758 60120 -35635 -43078 -80848 88667 -305987 364017 328370 -61397 -138562
15555 -138562 75077 56941 86220 -138950 83792 180421 180685 71762 59111 16984 96051 -59555
15542 136842 -37082 -76429 -42558 182560 157887 14246 10415 212937 -230979 -276575 368950
15530 84708 33479 29170 -540 -93993 -368577 -69864 -121134 -201015 160062 127030 -55145 -247612
15518 -247612 310323 253057 157175 315915 -237541 -285495 192638 -113295 179306 -169655
15507 147780 -43385 -191425 275133 264293 194396 104917 -43320 6850 212016 148786 65140
15495 -72997 7953 168175 -42182 148280 391556 -8978 330270 190817 92035 -157786 47810
15483 -2703 36963 -417773 -345907 -353209 -68853 -532027 91510 -125824 165679 -311954 -328717
15472 -328717 69669 -75698 -123911 -262578 66938 -236872 30421 -117756 -44555 -94567 14788
15460 -295091 -63547 76805 120259 -75767 55527 31720 -4836 -33264 214824 187366 -103299
15448 -20134 148047 -50613 70514 184518 64660 -109985 -458291 -108792 -340812 116241
15437 -316460 -155371 -18232 -142600 215438 -99131 -57782 17676 69709 -303114 282675
15426 -7196 79884 -70159 -203993 -121609 -53005 -262008 280908 106402 225421 15276 23668
15415 23668 -161461 94071 53109 107735 233118 198860 -44261 422465 -60850 -251635 -206057
15404 -206057 9191 -226452 -114527 -110765 120486 275599 -331926 -128871 -170201 -326720
15394 -326720 -4178 159681 -236313 -355791 100510 -43546 -108603 10964 -120185 -21821 -73873
15383 -73873 37158 271013 -68561 201980 -223629 30258 412890 26800 171402 -76270 -144199
15372 -144199 280419 39542 -81959 -43120 -147423 446245 109592 212689 -193277 -18297
15361 438444 -65418 107700 71425 37751 79683 118239 35243 99391 -96225 244948 208966
15350 208966 -169491 -32274 -55563 -143659 50769 -197316 359740 183949 -96553 -128991 309594
15338 -109637 -87130 -266785 91067 -165753 5241 132028 233164 371196 45755 140466 -3706
15326 532882 15880 509146 367281 138868 -14662 -176682 -83820 601600 133667 -80171
15315 150107 -61289 -356639 -62748 156331 118801 -6423 135393 72869 13038 37019 -232737
15303 139057 115237 15509 2626 -70522 200101 145189 106266 -30885 -239696 -72609 -17168
15291 57935 -166613 182944 -19566 -315148 5971 235391 -501 245754 -121314 168268 178861
15280 178861 -103623 236919 -67190 56571 107515 227185 -44218 429235 419364 93433 88742
15269 88742 216253 -215886 55461 -85221 349758 87690 -36805 79796 -34190 -143258 17302
15257 -89707 -6644 -16204 22468 357085 -9661 232868 377952 55992 370428 484285 1857776
15246 1857776 2096889 1732429 2391998 1584352 997045 276399 201444 93422 -335894 1441
15235 5633 43182 -31474 322893 152901 35263 185815 144349 -141318 140965 253265 242516
15224 242516 -280917 38718 -6172 -219633 -13811 174672 52288 -224798 43570 54840 7242
15212 78171 105086 43942 -30257 -217962 208377 70361 165645 -85556 -64040 64287 283825
15201 283825 15249 55378 -67189 264963 -188628 45079 -35599 134978 5763 -53381 22805
15189 -7737 397739 -158011 -57938 26019 -106643 -99246 -171035 69043 81259 423497 191587
15177 -63892 43295 144059 -81567 -134428 -54752 -158128 -28365 79479 228448 58739 32598
15166 32598 -46215 180038 258883 -137668 59398 94881 -121172 -57932 164750 103595 200962
15155 200962 76371 9809 10311 110543 76680 155773 100582 307022 38991 204799 -54333
15143 -1292 234479 166420 -80213 193946 439549 195869 -25772 143997 426138 -8271 -134580
15132 -134580 -24694 309801 -66965 372751 248259 10262 234119 -13292 40351 52579 132730
15121 132730 58672 531887 151569 57498 203401 -139215 124308 254673 268994 179018
15111 179018 64548 211249 362452 102636 172579 510418 351116 172045 80663 32831
15100 224047 -8611 36475 -162109 234372 -156767 127324 207638 62187 342404 -131392
15089 -25657 42251 170380 247711 -177298 72865 513098 133864 -272283 -11957 -111122 239098
15077 146204 -149860 -92031 429057 137986 163181 71738 -5521 6815 90736 25824 591733
15066 591733 74048 637146 388633 99491 59154 393089 -166173 299738 91515 359700
15056 359700 67805 384048 428257 -36582 350123 79769 88064 230472 92515 333031 458637
15045 458637 -19625 176039 344970 145314 30557 116756 236505 298367 93888 -129123
15034 415076 149451 342829 58791 -195810 411045 355722 115236 30658 468002 237521
15024 237521 208222 177996 -142574 317915 205931 -87040 65973 470969 196126 78837
15013 34069 120140 245017 170942 314934 8086 37931 33018 30702 360712 40481 306062
15002 306062 -80746 -120405 84191 230141 219310 257558 358739 -226367 303449 204714 343388
14991 343388 417204 46378 125200 139144 435923 290815 328832 274345 -42085 241378 -23515
14979 -136910 43689 149945 316151 -19678 279317 255340 375769 132163 224800 151721
14969 151721 161977 438653 242943 249369 171505 105152 110441 270951 404911 206322 107302
14958 107302 528434 63638 353231 400142 442641 663355 501139 284456 222277 466237
14948 466237 270245 518650 521400 416874 184709 578601 208588 97119 465631 301417
14938 301417 459576 153465 148840 285043 314102 95255 238933 435134 359353 434041 284874
14927 284874 353530 188678 344607 187392 307208 -108921 -89669 434425 223099 420505
14917 420505 335603 287160 279174 197529 118142 -270740 329735 409092 338785 207084 361955
14906 361955 301093 394161 433541 279860 645194 506977 457584 435198 620749 421816
14896 421816 562886 281708 393728 323895 498808 234893 267582 251210 466803 199849
14885 269653 477382 331691 529240 246496 186968 334605 278900 704699 482476 213057
14874 105259 227830 547974 384918 -28124 203089 572295 385118 63692 620590 467562
14864 467562 596085 547225 497096 467872 442142 583640 378265 376918 271143 542796 185625
14852 217017 773021 516074 631192 429469 683873 430701 794029 340337 695000 -31583
14841 335662 395530 588566 512948 120284 443940 441956 330835 61544 644651 323045
14831 323045 604341 534989 687011 250373 473720 416289 585761 813305 394552 331888
14821 331888 439692 599863 522361 672859 213786 410376 383256 237797 590182 312605
14811 312605 721212 674755 353097 412331 503801 492788 575821 485290 230258 645651 760789
14800 760789 979102 622798 479929 387391 513080 408382 841403 478601 422105 841758
14790 841758 742580 369591 724369 596920 510935 633167 648001 236404 660610 571076
14780 571076 814211 644332 454586 927558 670373 398934 245298 693319 968530 608350
14770 608350 825750 193500 448216 860162 840769 445236 631462 540077 437566 1064521
14760 1064521 611937 706792 525019 597401 612531 538906 393969 567099 646606 711924
14750 711924 359344 672092 492790 466503 798137 610717 761825 791528 309556 521848
14740 521848 640653 523881 567527 967587 993825 528023 719500 342692 823756 736430
14730 736430 1052660 929657 1109072 665780 979457 583059 772141 1125930 763221 739335
14720 739335 536596 805214 1251141 958697 993889 1071198 898045 813083 1023740 904115
14710 904115 726785 665871 911463 917866 1158686 818439 969989 817411 901816 1037229
14700 1037229 968831 834191 1013829 892026 932012 1431900 862508 884293 871259 895963
14690 895963 1123590 1097253 1079615 1050510 915527 914156 1255422 1217628 929912 1007371 1134129
14679 1134129 990900 1306470 1022288 898016 1106615 1065017 1003937 713890 922865 1027280
14669 1027280 952977 1305341 979716 705833 1309248 982544 1106304 960762 1217842 687466
14659 687466 899690 1503819 1216088 1117700 1163708 1147895 1231128 1240764 1150726 1079581 1476940
14648 1476940 1429302 984988 1239541 1114494 1243348 1268749 975306 1101506 1363293 1388941
14638 1388941 1215080 1459238 1363230 1348329 1598712 1174136 1198262 1350828 1453411 1534462
14628 1534462 1087621 1551041 1190129 1234587 1778205 1417553 1270023 1793006 1393707 1303959
14618 1303959 1532426 1204015 1428094 1558688 1601939 1503036 1408655 1523369 1628496 1719015
14608 1719015 1521053 1673489 1662033 1596087 1528290 1834473 1756183 1710305 1675612 1971614
14598 1971614 1745247 1791739 1807432 2029319 1881802 1684125 1878177 1626110 1760104 1961528
14588 1961528 2140915 1911261 1922940 2014405 2019209 1894589 2271780 1845023 2345488 2251480
14578 2251480 1993232 2082455 2303562 2435590 2403351 2170222 2243414 2269321 2371396 2159217
14568 2159217 2113297 2672800 2284230 2519260 2355489 2473087 2791423 2521428 3237778 2980755
14558 2980755 2894466 3424766 3096734 3307684 3588493 4222762 4089943 5140450 5974694
14549 5974694 7743192 11085842 20534403 40880558 41807783 21123008 11777168 10092928
14541 10092928 5750970 3557591 2590688 2186171 2110492 2325278 1942120 2065591 2057495
14532 2057495 2203185 2430541 1880340 2179189 2283328 2460891 2491867 2206177 2536894 2635623
14522 2635623 2391468 2456411 2506797 2522662 2450173 2570166 2617853 2879766 2865869 2912476 2927548
14511 2927548 2970108 2942620 3029636 2995629 2775271 2817404 3217976 3151278 3265868 3481008
14501 3481008 3406359 3546568 3332660 3287249 3111242 3527581 3407893 3478164 3499800 3831172
14491 3831172 3781633 3678659 3554333 3694068 3816856 4126179 3896853 4254133 4137835 3775641
14481 3775641 3902934 4103635 3998930 4222403 4363008 4367782 4186151 4312283 4281388 4221946
14471 4221946 4391561 4681171 4722285 4307981 4890583 4949649 5135407 4825444 4807955 4843731
14461 4843731 5313187 4942126 5352425 5162406 5513289 5193798 5421501 4907680 5334042
14452 5334042 5224906 5776106 5922952 5678761 5526011 6058745 5936477 5971121 6247984 6424075
14442 6424075 6494693 6328972 6379349 6437413 6452939 6609422 6917477 6927286 7078523 6731476
14432 6731476 7225802 7334128 7309655 7227332 7590341 7955965 7664634 8142484 7900534 8028595
14422 8028595 8161913 8052732 8274859 8887814 8701378 8630805 9361277 9288967 9064757 9231192
14412 9231192 9432016 9284702 9899865 9888320 10174465 9999674 10305663 10481705 10465267 10630922
14402 10630922 10937975 11066415 11362338 11493198 11900257 12075658 12128895 12375486 12359552 12691881
14392 12691881 12795633 12801712 13284007 13346828 13875851 13704051 14417874 14470849 14635702 15189708
14382 15189708 15140049 15641398 15724318 16015635 16046268 16745617 16863574 17346078 17644399 18177860
14372 18177860 17986580 18861155 18845724 19453388 19715241 20287803 20573921 21244901 21156173 21960686
14362 21960686 21983053 22770034 23290001 23980446 24551767 25113861 25628390 26300928 26687232
14353 26687232 27397374 27831195 28685878 29424165 30229852 30796292 31670555 32258855 33117698
14344 33117698 34218125 34855865 35859684 37201344 38012172 39162664 39955827 41146844
14336 41146844 42308709 43871951 44913730 46465535 47500862 49211539 50696293 52275427
14328 52275427 53617370 55608654 57658945 59004191 61180220 63292098 65248832 67635567
14320 67635567 70282175 72475201 75571972 78147286 81068516 84151630 87209009 90888633
14312 90888633 94012057 97965968 102131229 106286973 110731081 115589926 120494292 125747528
14304 125747528 130829978 136809184 143173789 149976266 156839848 163916757 171848413 180238429
14296 180238429 189063189 198090536 207784240 218205386 228888571 240416910 251810012
14289 251810012 264245765 277118440 290440235 304277341 318315192 332798989 347646052
14282 347646052 362279937 377217314 391546516 405519844 418988893 431164067 442607430
14275 442607430 452241280 460367623 466896575 470778295 471033386 467168755 463351725 458943697
14267 458943697 454061743 447235401 438659961 428626122 416634944 403302327 388738090
14260 388738090 373574798 358296588 342958641 327566625 312285602 297703222 282956970
14253 282956970 270330864 258314384 245712339 233415998 221868467 211133642 201082324
14246 201082324 191138432 182590541 174335589 166066066 158386832 151173462 144104838 137667685
14238 137667685 132069632 126527706 121018561 115674614 110957300 106353391 102246770 98641612
14230 98641612 94488961 90609246 87249010 83929143 80775493 78034858 74982580 72204151
14222 72204151 69892591 67562319 65520728 63451834 61097553 59117721 57038909 55135306
14214 55135306 53758776 51973173 50625981 48975740 47387993 46155987 45044429 44300811
14206 44300811 42986102 41194658 40182875 38965011 38275478 37362073 36591872 35418841
14198 35418841 34265576 33524386 32507752 31900439 31306459 30518805 29600494 28785632 28063775
14189 28063775 27395710 26822726 26231882 25448261 25175843 24620069 24035995 23392211 22817797
14180 22817797 22575691 22100874 21566557 21186386 20844551 20073767 20031602 19104628 18899963
14171 18899963 18678287 18222253 18102922 17624888 17190970 16727483 16514046 16558448 16114868
14162 16114868 15878414 15496692 15133744 15113982 14552158 14196785 14142637 14093689 13597454 13364700
14152 13364700 13468187 12854262 13110391 12744344 12511936 12302761 12112705 11691314 11837749
14143 11837749 11377618 11131185 10832060 10929010 10638666 10343915 10220653 10471868 9995730
14134 9995730 10005395 9873340 9485882 9555961 9492720 9532590 9431541 9011368 8655357 8739190
14124 8739190 8551220 8674601 8576677 8486229 8352660 7919741 8025329 7758760 8078661 7702914
14114 7702914 7569777 7390882 7559380 7340199 7433403 7300913 7125173 6861217 6889731 6880076
14104 6880076 6860630 6457727 6515417 6514154 6657243 6346169 6104765 6401918 6067010 6131121
14094 6131121 6148341 5925246 6078739 5611354 5756227 5766223 5408206 5532904 5496609 5038382
14084 5038382 5369584 5260044 5373369 5228497 5214533 5080106 5176547 5314727 5059856 4724685
14074 4724685 4746798 4764826 4623190 4707421 4878420 4649867 4597273 4237892 4118339 4714187
14064 4714187 4397288 4364441 4541002 4218901 4081101 4108976 3970960 3921081 4233102 3894079
14054 3894079 4236043 3879580 4054963 3907680 3874529 3834269 3666024 4026693 3574777 3826520
14044 3826520 3797414 3505186 3217794 3503052 3477270 3434949 3238228 3328488 3422214 3222112
14034 3222112 3197275 3241704 3417367 3106192 3277009 3285747 3114457 3235452 3170203 3207419
14024 3207419 3098700 2766875 3073255 2748940 2934054 3041361 2751783 3052273 2502277
14015 2502277 2631499 2511307 2967493 2762522 2402716 2445552 2634961 2581220 2340790 2723964
14005 2723964 2331306 2256818 2459174 2539303 2231271 2310766 1980684 2276151 2366493 2352851
13995 2352851 2431814 2495448 2531115 2763361 2740259 2782973 3927383 6094327 12949829 34402893
13985 34402893 43923624 26379098 14908793 9545235 6847324 5673318 4518047 4124433
13977 4124433 3745367 3250835 2970429 3082811 2762657 2860748 2771570 2663139 2733049 2725762
13967 2725762 2628251 2819347 2462688 2296709 2453026 2363096 2522373 2265130 1955794 2269895
13957 2269895 1850342 2423029 2272032 2192344 2321612 1928390 2278959 1843029 2142974 2061264
13947 2061264 2010901 2001779 1998938 2092159 1845958 1960011 2014862 1813924 2041959 1925052 1933695
13936 1933695 1902289 1592437 1821321 1847828 1791490 1569454 1665163 1809141 1704766 2072269
13926 2072269 1540357 1607628 1686807 1659721 1287589 1788084 1696366 1667494 1676097 1373750 1769719
13915 1769719 1687973 1545781 1394965 1491379 1826520 1723691 1870216 1320738 1749868 1428292
13905 1428292 1573463 1722675 1639918 1305224 1486585 1327940 1360357 1453579 1639143 1393378
13895 1393378 1378992 1393806 1713519 1511906 1470890 1096202 1648759 1224937 1165621 1489869
13885 1489869 1250828 1067654 1399035 1403595 1499127 1055201 1096712 1319770 1442243 1675279
13875 1675279 1356877 1203912 1073248 1116074 1176951 1135701 1445610 1184552 882956 954220
13865 954220 1114413 1105410 1082829 1458701 1429943 989344 1203862 880934 768098 1188968
13855 1188968 1149157 1127954 1034352 950652 953183 1406352 1307295 1141988 711290 1006026 947976
13844 947976 796098 1025826 1137739 929547 827118 1132045 997800 974105 1035798 1156419
13834 1156419 1084343 987801 1271216 921919 389314 1062855 810251 1108596 968736 899702
13824 899702 876150 1035542 1101506 1123426 1139011 852647 981370 846916 1093288 843511
13814 843511 826959 641305 1231192 772384 877590 1095626 1111946 1010047 763043 1152923
13804 1152923 726497 835768 847257 861997 776259 1044072 944718 1316354 929361 961710
13794 961710 563299 917202 812792 714563 829807 836799 725705 973074 707580 797202
13784 797202 567844 764895 1045036 401330 731496 872540 1041823 964743 746663 241876
13773 870858 709753 870626 854999 976687 735575 613480 597960 621799 824196 1088012
13763 1088012 967994 529104 600196 732375 864080 357094 990413 770226 756247 389916
13753 389916 421117 647288 557683 510771 894904 841691 767943 644840 870986 746276
13743 746276 569907 1047424 537129 670189 640422 703186 741977 691641 634242 432734
13733 432734 774276 1074422 660771 795170 929029 534907 583522 1105940 484201 683253
13723 683253 794843 455671 642347 593758 829996 917022 848763 858529 523035 721468
13713 721468 548186 680496 347143 419894 725137 542823 327989 430593 554048 772138
13703 772138 732885 896839 530736 538703 482402 517895 406696 523306 542092 553204 699431
13692 699431 457476 764917 355989 346279 653913 331296 551370 691568 535030 584972
13682 584972 566697 647479 297510 629671 499980 726816 673868 156225 467281 367469
13672 367469 66867 462198 547140 586295 452840 387639 110093 294512 445172 554354
13662 554354 201141 391611 566457 287893 131943 437728 480924 481789 342816 459849
13652 459849 616894 343069 628520 491509 260230 554026 376584 457880 464646 -3963
13641 681481 565825 309990 654052 380796 313732 738843 448075 366495 305286 513689
13631 513689 485027 408534 452275 510466 342030 655308 748761 476139 257491 387580
13621 387580 581169 355213 674154 266382 313963 544736 489778 8327 311524 611171
13611 611171 597182 377261 761412 460574 197059 578325 329835 419467 606729 389129
13601 389129 220402 590119 427588 705319 322458 308800 243382 267412 579683 308300
13591 308300 393819 483793 646118 534548 311287 680838 548104 280192 356017 322345
13581 322345 559511 500549 250971 348588 310604 427954 216580 462559 376220 425097
13571 425097 142751 620820 147835 360164 482025 427462 314589 221419 304957 255727
13561 255727 451325 511687 281082 300240 102073 76529 254406 234292 359305 108507
13550 687088 264430 289413 114537 437328 528453 536799 90329 432189 291188 100654
13539 330498 331399 152059 287491 -343229 469809 401632 426588 398334 142228 275744 52983
13527 344233 133629 163321 411886 315110 158361 85885 472680 413058 279131 406804
13517 406804 203504 283759 571649 -14122 -19015 293821 176211 428716 177319 607241
13507 607241 526681 484516 -246467 -79557 488506 332681 224975 102919 83889 347602
13497 347602 69716 621626 355986 186437 186431 16647 134728 344678 424028 440548 506954
13486 506954 295517 626617 67439 738908 428646 479521 244086 271444 216289 447694
13476 447694 100467 167311 -71588 147540 273366 272799 255615 188040 584074 64780 98987
13465 98987 414393 447146 465324 413994 46385 171840 -24625 433097 193887 -74321 356199
13453 337938 238843 19211 266294 108201 130810 171870 150002 424273 125892 95216 287254
13442 287254 222214 151906 316909 116071 477586 364024 484587 448241 174336 -39276
13431 180225 145410 461929 259607 142911 -70000 328435 171755 231084 421665 127443
13420 200407 192212 52511 142488 358268 73816 278410 552010 382616 142464 85007 -14532
13408 397400 -356625 385493 -144522 465010 -30879 284312 242997 261961 282117 117802
13397 219515 52203 136941 224787 590580 178065 205455 -42562 -15326 334481 384415 22542
13385 161433 195341 342169 362435 140743 351703 281033 478600 207394 649627 -57766
13374 376918 116181 -376815 -73060 278343 81322 -10189 26611 116588 -106518 377189
13363 123697 147327 80389 167346 378493 180149 311297 407094 78380 255461 80247 82774
13352 82774 198333 592722 132346 244620 96629 651562 413752 272144 95380 640612
13342 640612 677149 517181 349446 345308 90905 412484 273705 305149 -71245 435968 8972
13330 463129 257360 190408 -70367 110228 220229 313425 -64070 274841 52780 67955 -78657
13318 442517 254379 555776 403958 146597 488835 265695 373235 229628 129018 159496
13308 159496 93314 -111392 296244 24292 146482 245610 105923 269099 245136 -39926
13297 96850 -52963 327927 291318 -54924 -88410 337082 360157 190847 445784 397157 -128587
13285 217327 133347 423030 6059 174717 376156 112129 74119 460678 222610 78844
13274 117422 169461 9988 244652 172237 474263 2428 107740 122109 -108617 -61011 154573
13262 82252 14922 202762 153837 -13192 31439 269726 65600 -20199 12962 146508 282074
13251 282074 115022 33478 349715 187570 226500 13876 114804 22511 -77943 115 259896
13240 259896 124229 281886 53777 -148632 179040 -26386 239224 448903 -52829 348633
13229 346620 276668 37183 251716 392397 -87062 -42591 32517 178079 204382 380773 -164517
13217 226968 124235 201993 312846 241735 179292 24031 -185431 -204152 224319 35022 351207
13206 351207 -353747 22935 291066 99045 152999 327686 209881 -29263 -59334 148993
13195 309614 280300 247611 275603 165435 86265 216712 -106052 272828 201013 -23576 -185225
13184 -185225 413567 210350 9951 369212 176003 276371 -164395 -37139 67973 81229
13174 81229 -49665 -72536 166174 500236 -258814 -58732 1796 263206 28820 2354 99447
13163 99447 49172 -75482 -115255 -222776 298118 354863 170127 117815 -63866 297350 -318707
13151 -221141 266610 317549 -9815 323236 182893 97721 176106 99612 76336 104780 326293
13140 326293 -49847 382423 356492 96806 -56410 257910 188442 426223 -11816 -6682 -77119
13129 -77119 153135 249903 58520 204682 44283 45565 89449 140196 34290 108900 256471
13118 256471 -232963 155752 218867 366175 143991 -70475 -155289 -357932 303697 296510
13108 296510 331871 180544 39680 27745 -65287 152994 -70200 268115 14851 44902 162433
13097 162433 280116 60298 -26756 98151 161023 114259 12933 -15018 86903 210377 205594
13086 205594 -20837 317293 20090 -35373 -72238 281841 106905 250053 -105418 200599
13075 44883 273261 124048 -26390 93558 156394 98222 234759 13667 20110 335838 255108
13064 255108 -19444 -112009 164037 272488 190538 125418 28141 126633 -292892 237569 17568
13052 319593 52936 12075 430546 220172 102779 106994 207014 12477 239010 -74803 -77091
13041 -77091 249533 3309 42188 333661 -108842 -52131 -36306 -257921 224388 -73659 166743
13029 -295320 134646 68655 -34115 96927 102484 -30152 10143 140428 164086 -14243 191375
13017 -63982 56167 -95912 -78200 -133957 295117 -29364 324438 113525 158892 254363 110167
13005 8210 72828 -22821 -151441 587162 -55078 109117 221616 38875 160049 49751 168263
12994 168263 307214 -259243 61369 102291 25454 43289 -213597 53392 148184 -192748 -173294
12983 -173294 34325 -31105 -90478 107503 -36185 -11204 -91303 141728 -111903 68282 58202
12972 58202 27534 205486 -61786 -71585 78865 84233 -167445 99252 -150036 -179820 59186
12960 -50329 300789 -107079 373015 -201503 -154999 243800 183321 53680 1168 142709 97827
12949 97827 59690 59059 206886 -63422 126435 -245557 -62843 55313 159543 -83579 51410
12937 -72640 5688 134565 -15220 372387 134005 66307 2538 -184258 262086 25122 206901
12926 206901 204405 228852 -80486 -375 137198 -193227 197952 -27273 -81483 139165 48867
12914 160528 98061 229277 231877 -10001 -164677 228323 7045 54044 209920 103172 261839
12903 261839 173560 186369 -104575 204759 -310616 74377 67976 -269941 -232990 -16731 -130821
12892 -130821 -108959 289230 44530 50347 43419 167860 73619 386218 190198 50045 131319
12881 131319 140259 -28771 -237002 -90204 237850 54352 112309 -294337 -131135 208802 -7413
12869 131058 109926 130327 128003 20845 298283 223818 -78357 -204745 237890 -23395 107964
12857 196398 -433451 591996 85222 152638 73719 10838 233497 108809 -330583 -105334
12846 123041 76062 199275 -741 51438 213593 -127345 -81225 170144 -172136 81339 42533
12835 42533 -3626 14196 -198627 -74522 -25455 -83437 95996 40110 -122808 329994 79957
12823 -21074 283928 154861 144008 119244 61934 -155858 -83284 201588 20886 259280 134061
12812 134061 -114453 67176 -3534 342075 -261107 -253768 447190 -247853 398558 46560 -134993
12800 -48125 225357 287322 -11124 256895 88315 82234 -309834 359803 254554 252061 168877
12789 168877 -236874 -29170 146981 29308 117253 -86543 -141063 161808 136542 410841 55018
12777 -47380 13726 -51134 -65650 126870 230349 50779 -79376 198584 -99488 176451 -151681
12765 -180054 -143680 315072 298979 178837 193548 210027 247888 218538 -149390 -94871 -72508
12754 -72508 -83002 22766 -181445 -24385 -43449 326340 -5210 211764 164438 -161423 -82940
12743 -82940 -178262 -16868 87921 128469 -429878 -64872 59329 292244 -54874 229074 -280586
12731 143287 -133173 95006 335467 -54261 -73726 -118764 112630 -3242 -280517 -406334 -197600
12719 291027 -141289 -46038 178488 106608 82404 -129868 119119 -136477 175499 161785
12709 161785 66869 -229888 -162035 137250 -5415 196041 -106117 252441 179891 335441
12699 335441 296921 116191 -32828 90481 -55663 -11887 97956 220951 91991 133455 21876
12687 197754 47015 252963 17990 -178403 -43612 153339 -97237 -98231 39413 -240657 461932
12675 41884 -101185 101691 24275 -40652 106949 -139910 184491 -91478 369895 425081
12665 425081 94360 84963 -54920 -51487 -125106 382332 307022 101734 -176900 459531 212343
12653 56963 135586 146619 62860 276627 129181 -155732 -2842 10412 126071 -214169 248152
12641 82659 -267525 27727 -286199 -202973 -245154 15114 407506 -24810 206587 200183 245000
12630 245000 73997 466986 269068 370972 74462 560 52212 185722 -1326 248776 185999
12619 185999 321564 306522 57756 94000 -194047 258123 6124 -80690 71148 270530 147563
12608 147563 179369 -466727 -74982 41828 -27591 -71938 157101 30925 -65942 271909 -4156
12596 345323 243309 -75955 210951 182291 -40895 245988 209170 -27094 80913 -186371 -77072
12584 -55000 -11234 128226 90984 -185080 -142907 101816 95070 17642 -360845 21148 53336
12573 53336 -22072 -75231 -137972 326218 -366486 74902 -54406 442763 -225106 -59939 25363
12561 -54407 -7629 -17830 4841 112165 304990 42405 -90328 173440 -109792 199965 117645
12550 117645 -418320 159327 27215 82137 211405 -263288 -21765 126381 -77204 -8007 -14307
12539 -14307 17325 129208 19772 -262656 -64344 -337455 -188707 -69188 -52617 310979 248722
12528 248722 -190855 -101188 145684 153540 103566 -215699 93945 114155 233865 -258030 39326
12516 167992 263831 276606 379978 -84526 122798 182527 207174 202457 48165 -320077 427638
12504 178373 136823 197900 5485 -55 55228 361970 -102877 -222278 78636 8847 50162 -267570
12491 -20682 201499 -10051 -109611 -36709 325284 -3567 153142 314641 382953 151955 161821
12480 161821 591995 -140963 274674 60379 266486 81272 43007 41303 62961 -96774 -170975
12469 -170975 -29805 109479 -165361 1723 -199858 -9092 146334 -116065 76676 16164 -29616
12457 -14287 200589 -59710 -83984 -169718 -72479 64310 86975 -291623 -124985 297959 -173835
12445 -197612 -96442 -41156 -49724 -97150 51633 -175117 -76192 123878 -8653 20461 309454
12434 309454 39340 -61820 -168295 233650 36023 -108503 51429 43637 -149842 -338202 -36658
12422 18983 -34127 -237369 105010 236409 -178121 -224895 -21940 45302 125644 -201607 -35337
12410 195338 -78621 -44514 44212 -159048 224185 -235758 60132 251965 51608 -61172 3819
12398 -40275 -241089 108114 -235998 -121291 19002 28085 85075 175817 -354329 -89061 454283
12386 -78351 -125603 77261 -75880 88815 -267424 236266 -171567 59105 -19810 -365592 -86696
12374 43822 27908 179005 -59198 212042 -44676 60164 -211615 -102654 71696 137388 -57324
12362 -106912 87131 249042 -160018 -62406 -143755 -354204 -172201 -58379 161329 -261227
12351 -57109 -41363 157061 250544 81466 369194 210855 -215050 -150084 -23407 83891 68816
12340 68816 -144233 31613 60566 -94572 -52227 -249684 -49634 -146357 -296366 -76137 4147
12328 -32677 41460 -361424 107915 204874 -2051 132961 -372126 186031 339811 100546
12317 -101623 179100 -303646 33754 -371100 -171948 -109844 27177 -40342 -111786 -6087 139113
12305 -277508 -7153 -74574 11820 83960 14102 152326 -66816 131241 107851 -116017 -20566
12293 -121335 -43939 7003 57765 -28998 -20542 273010 -15722 -126205 -224530 -31299 183005
12281 88713 -26660 124708 -131220 -253085 129024 216710 -35619 -13987 403813 236999
12271 236999 359152 232328 142004 197585 -134119 -18860 -107255 104502 55048 -153493
12260 63436 160855 -170692 147717 -218738 214320 190651 -81153 194250 317169 163667
12250 163667 300007 -86247 6594 38193 202593 250772 -62733 151160 -146489 98856 85992
12239 85992 23217 148121 28961 -127949 -48736 36250 410806 -159015 240392 346456
12229 346456 19428 2142 157830 60418 305727 218236 19371 373583 105709 119712 247614
12218 247614 312259 412208 156233 368443 157418 137661 262245 136517 192844 394162
12208 394162 -1228 340891 250411 77247 163645 100099 154144 381477 61889 436259 31627
12196 371539 265868 333852 217052 185431 121790 489924 -42147 216001 255868 110667
12185 46635 -62546 169339 225209 77069 72317 -180363 -14544 -17437 -9923 -164288 324576
12173 50913 -254715 250327 238503 500803 426910 172496 122303 -206724 8355 318190 -163992
12161 -189696 83306 289205 276960 129634 -22628 -60160 -154960 -49125 -30360 -335320 448196
12149 137236 202343 30398 -26228 64359 18070 67569 365744 124681 178945 -29529 120924
12137 109197 108169 -291242 -96866 257651 -69283 -167051 16346 -35514 -123871 90449 185692
12126 185692 36255 -248883 215523 511559 -124744 133245 112732 112005 35039 309463 320600
12115 320600 -29000 -94211 -157047 -206388 325867 -142670 -33811 20283 155221 -71781 -99984
12104 -99984 -153453 342143 -120776 -65521 -15367 145407 27904 24772 -31398 393958 43281
12092 110218 202585 -53312 -510106 301852 -36565 272078 -174347 46677 -24841 -101280 -14666
12080 101251 -136720 -105657 -331729 -131234 79307 -65685 207745 29559 72367 -93566 105662
12068 -237466 -134257 -295936 -171863 115405 121088 -70833 -144800 209213 122353 135359 128081
12057 128081 277681 1377997 725738 281895 126247 302393 235496 20515 -132283 -241817
12047 -241817 -80942 -120555 -103589 106646 57312 -45830 -7915 -779 73286 11194 -420827 -98150
12034 56162 418017 102265 9640 68571 -297728 73862 -15402 -190213 108951 -182265 -105111
12023 -105111 242609 34145 -295261 -110965 -315957 -23875 -431710 61150 -375977 18336
12012 -392594 -167845 4924 51254 -30870 -85765 -133776 146630 218516 8804 -13603 153806
12000 301140 -58666 156416 -48937 112839 -147329 19681 92494 54815 234608 102329
11989 8718 -137242 87106 -93417 67356 16013 -16350 -22624 67299 259997 95479 47306 -165481
11976 -155572 24647 -28994 -101243 -75783 -5123 101671 183732 161913 4041 -194177 -13532
11964 -120433 320127 -90801 -413426 -91039 -176925 -32675 -135871 -54459 73146 159540 -160003
11952 96761 511285 46622 -118765 -66523 -86821 -170640 76880 -313724 61114 29553 -29100
11940 -203415 -48174 -170821 144198 278343 -229425 -144078 -30298 -76488 -132352 -285945
11930 -285945 374284 138382 -168812 -5283 -217664 72051 -84732 108631 -85567 -113281 -38471
11918 301572 -251595 316568 -155747 59744 105043 76617 -216816 -104495 58019 -61247
11907 71796 -187671 -356 149537 146696 -99154 196431 22161 -213392 -13130 -320369 -35329
11895 1759 199861 73345 157485 59416 151377 -320277 60470 -35869 153910 72724 241536
11884 241536 72006 -73039 66829 -65019 93768 -235367 61625 -243301 -170860 -106670 -50187
11872 -249135 195711 31715 -187234 44066 251650 -313514 -82401 -158208 145089 295899
11862 295899 -56952 63732 -119101 213655 -58275 -200276 -237346 -172569 159260 -47782 -171388
11851 -171388 18705 -86108 -204281 303431 -63304 36578 -198905 -99119 -25266 473354 -211639
11839 -43220 199796 -82257 61397 -36756 114928 234225 -28966 -286822 98768 149603 -407296
11827 -303129 -260461 -44688 -182285 218081 -46385 83376 -64991 -259957 -146337 -323640
11817 -323640 -310543 -300461 18064 -299682 312957 -36527 -26097 274361 -104547 -122706 -79323
11806 -79323 -30657 1724 -346423 -92699 11008 188596 377721 15634 -405531 -207677 217559
11794 -379131 -138320 12249 3606 -109983 -148859 -284533 28622 -335376 -176221 30293 -53509
11782 7465 99702 102301 71068 -71701 -230306 200115 -80541 -233181 130348 270937 77368
11770 -95751 53130 78221 -60774 57293 -515876 -284933 229269 -121327 397876 -193576
11759 -574528 -183436 52777 203886 41305 12159 -512902 84266 37580 -99162 -31454 266939
11747 -3178 383391 151292 38613 136622 -43197 -100830 62254 -57035 -373811 -144749 39736
11735 334042 34276 113880 -80183 -296119 329794 -262597 212321 305770 35570 -283023
11724 69605 -17625 -126794 -125683 -232725 -90312 -65340 -89100 -328890 -26989 -71448 -174377
11713 -174377 56115 -80826 -39400 347916 -106329 -200527 -195340 31037 -193370 139783 136989
11702 136989 131308 -214263 -62318 -51818 -170398 30414 -233213 147314 23788 155508 -106351
11690 -27932 -153480 -225276 204339 -548588 109961 -118706 35991 25933 219906 -162273
11679 13794 229617 -366684 -125855 -114343 232042 427342 -138457 90316 -144023 -441078
11669 -441078 -126871 -96681 -116777 -113724 15184 40317 205896 276684 159903 302707 -46144
11657 33505 -100278 242023 -140829 -356498 222156 -90053 46934 -490294 249520 3448
11646 74815 7263 -200386 -180455 146487 235652 273650 -131352 -130467 240291 -124981 30379
11634 -225671 245470 76348 160128 109506 -122233 -2302 348248 152369 71543 -245143 -175184
11623 -175184 240334 430 13634 139947 -296199 137526 237145 363441 159165 106568 18674
11611 -365149 76564 55651 -288658 -432766 116999 -210076 98835 147959 192401 -404433
11600 68265 -29692 -94687 -6658 121576 -421173 78908 141847 -13435 -25507 -197080 -174612
11589 -174612 192746 37035 -51282 10502 131407 67188 34994 -27157 -41552 143605 30541
11577 -180813 -52876 115353 202268 409744 -240240 -440410 -37663 228493 -1061 -240039
11567 -240039 -39888 280850 168475 101046 34141 -189299 184694 -56025 128337 66732
11557 66732 77210 124307 127314 145661 104449 40947 198471 -88422 -308204 336974 140992
11545 -13184 -258688 -156360 47294 -6094 33769 259805 64987 -25219 211351 3531 358866
11534 358866 312211 -64138 18691 344637 -382322 -220941 146544 92116 50120 223063
11524 223063 7055 290120 -49816 139463 141909 210581 -193760 -32271 -163263 46894 283663
11513 283663 -55804 116648 370960 110592 86189 -51658 59497 -27482 378442 52216 -170372
11501 -141467 334331 7902 118424 -136489 -59885 259293 113808 9388 215697 124054 308591
11490 308591 76482 312842 -111582 50116 -16873 5404 -21727 184023 -62418 112030 227188
11479 227188 308513 92669 61406 -313918 -92057 -154117 86998 107950 -35094 -244351 165893
11467 -104251 1820 -25025 339961 -63279 510778 52268 543155 -189247 22163 39937 103873
11456 103873 -218937 278764 -209881 180004 -82832 43269 68648 322160 -29546 173937
11445 -10750 -393850 -155845 -126742 186449 136056 -69018 -259729 68125 11947 -44135 -108582
11434 -108582 -248368 499 -304110 -171759 304755 280932 151485 331121 59856 158705 222497
11423 222497 17398 55420 222484 212816 261035 -285959 -168150 218163 173907 -8655 -103400
11412 -103400 62266 -118175 -96290 -71037 -123675 249187 -187932 -117417 -43990 316330 73565
11400 -50640 -302482 277782 -275585 -12372 -209781 -108027 80657 29164 -119872 -69655
11390 -69655 32555 -217628 -45452 241664 261992 208522 151940 -148092 73008 209055 -82758
11378 124501 -105326 93324 -335074 -71356 -107376 -317364 237059 272425 171109 -123088
11367 -2709 170803 98390 -39980 60257 -457076 134315 -259361 66607 -42743 68496 -165573
11355 -354820 241343 88596 -43284 48490 187650 -29402 12136 -107875 238591 210472 122667
11344 122667 2426 -105515 63980 37716 -164664 -269444 -274156 88709 -57885 230594 -14018
11332 4796 77787 -217033 -80287 -248600 366558 154700 103432 -221524 -246182 4479 -124905
11320 -197629 177193 -38960 -48730 -238324 256986 -103887 -22566 -35452 -147757 32365 -30931
11308 -424 61844 121707 -78220 -18563 58174 64386 -76665 -272126 -204071 451737 -2573 -28156
11296 -28156 88613 -92516 52914 -302832 104644 94760 -405603 146429 -463150 280166 71392
11284 -231665 -170559 -285673 -300109 114817 211428 -20996 102201 34516 -213252 -84781 -103856
11273 -103856 271340 -112612 -52214 20442 241269 -153748 -65946 191807 -96800 -180872
11263 -180872 -86479 -52321 78037 -54451 -248495 391163 -54454 336196 -251763 94282 -385667
11251 38232 388983 139584 42189 -1282 189217 34984 -17701 20704 113434 -97439 51702
11239 -228113 -11251 95968 -393920 -14766 -53978 -34922 41728 -78868 26512 -8500 -3915 -220613
11227 -220613 43075 -82450 -139162 52455 -100096 -10012 168776 -145407 9389 -187940 -108994
11216 -108994 -156297 252456 -144868 -168865 225844 131679 215990 96791 24762 -201342 199558
11204 -20403 -29131 -298545 -43431 -199381 169160 146430 -266364 335068 -327911 -9090 -127415
11193 -127415 -78038 -84811 -215319 -9773 -112333 132543 216471 -222732 149152 236384 137845
11182 137845 80019 -24682 -73758 -283599 -59125 -77923 160547 7444 -175610 115331 138136
11171 138136 -168273 -49215 -181396 -268539 -338830 -182586 -319732 -5383 40197 -9640 52862
11159 -230348 -190108 40994 72436 -412145 -64734 -28866 -161880 -35841 -11697 -108444 -107162
11148 -107162 11071 -131669 123462 -271621 -388112 113768 -65068 136514 263599 -42862
11137 -371786 32018 50711 -189213 206211 407854 17775 -82954 209730 -182112 5965 -511305
11125 170190 -25895 52166 -22122 -42258 187350 -97654 95811 -45827 110840 97718 -42512
11113 70776 61043 -93988 179367 101337 -197976 190151 26271 27204 31418 238505 -1150 -32795
11101 -32795 64461 290082 -3736 208793 103407 211608 282796 115319 80728 116249 8606
11089 234802 -66714 9490 129787 65804 349391 85897 235668 250095 46970 218455 314943
11078 314943 349073 47898 395530 389415 307646 441359 273940 550879 269106 183388 441698
11067 441698 370598 86535 167075 307695 172684 447744 227944 554077 590799 364577
11057 364577 464991 316884 510283 510553 479076 545347 457600 707425 618249 798983 592973
11046 592973 404868 910672 584735 868506 656922 700037 618535 613786 511415 624799
11036 624799 804342 553310 127205 856779 620249 519935 382371 408064 736275 771182
11026 771182 550224 520151 502207 607749 530975 561448 392126 570477 543026 570725 258697
11014 390954 295258 541088 649684 611749 1029551 363321 338230 246381 597042 779078
11004 779078 410301 628925 690724 659455 622525 905567 614246 473544 677128 579895
10994 579895 374132 717648 501627 478415 727551 587328 639920 823674 756751 991884
10984 991884 1227452 939942 697207 1195588 1049736 1490438 1501359 1436367 1729407 1703053
10974 1703053 2596764 2790946 2580889 2861820 2760131 2371001 2604632 2113056 1818294
10965 1818294 1557672 1217202 1300169 1363936 1263046 882566 1125496 796640 1013948 616566
10955 616566 1105415 679637 538549 550097 427576 166504 434928 391502 186818 150741
10945 150741 329379 -23601 183683 137704 -71518 149217 154628 53522 99854 41458 86992
10934 86992 -41770 -53581 452409 -65968 -18365 -12612 -124656 -47418 -244415 91326 -111194
10922 202281 38820 -133978 -131704 -67671 -80999 365522 172633 61880 -68243 -318296 -183007
10911 -183007 -4618 -211918 -113965 -74230 123024 449906 166350 124483 -203010 323801
10900 19876 -42109 10345 -109397 249285 186667 -229327 -129487 -233599 221421 49640 57837
10889 57837 158630 -34904 -59162 -15 235587 19815 -171062 -181357 -52795 -86763 83097 -89292
10876 226288 -50179 133294 192728 -47922 -481013 244380 -69427 -389207 9665 413779 8063
10864 295866 -10914 126670 -123389 -96740 -195172 166805 -227870 79671 -233012 -80773
10853 90936 25236 -41045 -119823 144520 -301347 -17031 -34222 215565 -20861 18078 196899
10842 196899 -141677 111077 -190023 -47544 -69963 87098 -244963 131642 2299 -61931 -118635
10831 -118635 -161419 -255062 -17998 -83734 -280348 142404 -105490 -4032 327263 125264 147755
10820 147755 -79114 216676 95102 -182090 16367 -121229 62086 494253 158188 -129672
10809 22576 -4540 152724 -301591 19234 -161875 -151404 179690 188874 -134 31412 211941
10798 211941 259104 103755 -59110 -10998 44294 -370319 173684 -190462 443411 40116
10787 -12838 -25950 -52072 -106707 -166303 218082 20683 135438 210774 -445612 -91585 -273397
10776 -273397 43605 -7347 -177665 -172336 -237689 153923 -174537 200649 -125465 24654 -146923
10764 -101048 -133337 -82622 237171 11626 159526 -143226 -102925 4813 -81309 -300256 69034
10752 -88556 -145940 -131276 -37498 -193454 -89411 -27309 48952 128639 -156243 -92632 65652
10740 -75036 -84622 114631 -91579 -382417 981 -172740 11380 -93201 -283366 -266912 -273370 129924
10727 -38689 -218533 -240932 -99281 95637 -199236 -689784 143572 -213356 211172 79404
10716 -141164 208858 27029 -119821 -208311 -4005 -241166 -43599 12028 81084 130349 12166
10704 -30577 79235 -77194 163023 -579893 -106916 -344658 -194009 -265143 30921 -36875 194561
10692 -91259 187622 209793 21604 2883 27004 59214 3581 -168665 31754 34155 141567 -139298
10679 156213 276602 248708 -111372 -193659 55692 -247038 -117037 94304 -118425 84138
10668 -148381 -106475 106806 -104073 -295036 -68702 125313 9726 -179730 159730 -149007
10657 -230920 140493 -406413 124046 -1025 -42607 533884 -55192 99080 358898 106120
10646 -12716 -252674 112586 -282651 248450 -270639 -153882 -57356 116483 101821 -59474
10635 6641 3478 411112 91173 322622 38680 -239765 -38581 -278541 229425 53196 -160538
10623 -252276 23959 -97307 -107272 15851 98399 -5661 37073 -100482 178212 17961 -187142
10611 81466 108450 91847 -95115 -89706 -33447 -92312 37485 -245630 142944 87244 -193502
10599 -114683 -139138 127965 228043 -75252 55555 -167200 -15933 30028 -97728 12377 -87341
10587 -28076 -49488 -290900 -199299 -138107 -150042 -137325 -581931 -211032 24324 -93522 -71711
10576 -71711 -382083 -231125 70756 277703 -160050 -81762 -23093 -69696 -104420 54696 -199002
10564 269082 4878 -112630 46732 140345 -172273 26298 -162849 -138757 -157444 128851 -234778
10552 306534 192682 -31936 85248 -28840 58147 -65982 30274 -131358 -217073 86940 -127023
10540 162891 -33972 -200269 -29741 -176694 49090 -100804 -32177 -241088 -313725 -177762
10530 -177762 -4312 -189449 -4829 -208690 50536 -19076 71130 -119899 -239875 -59905 -79293
10519 -79293 191139 155916 -88454 70376 -118446 200407 94868 -152118 43481 -195358 -315817
10508 -315817 -37021 -292760 -484329 78065 -97620 -119778 49764 382202 -60602 -125588 151920
10496 -9266 127403 -320808 -113109 209586 10716 -39881 -192416 -20235 258142 -31328 -78658
10485 -78658 -367613 -244643 -202311 84290 20713 -195037 -64769 229257 -90969 282048 -86762
10473 188391 175192 -119403 -195227 -80426 21384 -51446 10173 -116310 60994 -190284 -147976
10462 -147976 -68141 15017 -112629 -39471 -60410 34763 60899 -189120 -114507 -202102 -29731
10450 -3692 77022 20529 203376 -26602 -371096 -348644 -135899 24449 -83498 -53061 -350484
10439 -350484 43440 -142031 -215776 18665 152699 -40482 -103370 -37962 -355002 37384 -17341
10427 143735 72693 62744 -228614 227975 -60644 -393450 -184070 -213021 160045 119962 -60192
10415 -222084 41627 99081 -203841 -137641 -46031 -12568 101520 -14341 36195 -38231 -68532
10404 -68532 63356 -129021 -300288 239702 -266121 -178369 -153830 232709 -112295 -34683
10393 191416 -5210 323269 -99689 226041 75496 214940 53790 37063 215506 239897 -24758
10381 -262484 106839 195659 128737 -26834 18900 -3130 194770 -55168 379391 17681 241595
10370 241595 200311 362597 518941 402166 387597 188274 430684 652771 264569 285362
10360 285362 -111128 427284 262633 108737 412467 250741 148509 121665 605800 694097
10350 694097 487181 213899 332060 346474 304190 148443 92793 359536 -45233 83874
10339 260178 109595 187423 36166 195719 -93148 43243 70217 -82484 162435 225554 -354439
10327 113398 215797 166459 77765 389038 447515 157352 144117 198215 -63120 -21785 253098
10315 -207983 2973 -221056 175866 293247 441956 114740 -169944 184910 -246648 -52225
10304 145807 -190978 -76367 3700 -179197 236023 47843 11926 18375 67213 -67244 -444960
10293 -444960 -30137 105665 227593 -65457 -71610 -79670 89905 -165748 -102215 -103532 -196937
10282 -196937 -424458 206046 -68740 -119457 -50389 -74855 16894 -97657 -110478 -95061 46707
10270 170458 -124531 197467 31453 7848 -178668 -129748 -44978 -223444 -22129 -195409 210042
10258 205661 -172439 88464 -76280 262037 307970 285285 154288 -145825 403262 -205336
10247 288215 -226117 -308010 -72133 -8554 -297089 282841 174110 31525 -194200 49183 -19097
10235 -80638 8435 -20950 -145782 -4239 -19214 -192665 -268389 -241883 -100679 249944 -25570
10223 -76294 -153586 -54703 59818 -253985 -79703 -154008 -215793 -302820 -131657 -76183 -316551
10212 -316551 91704 232250 65845 -37755 -88717 -238439 -245692 -95670 182283 -77225 -29721
10200 223673 124541 -144111 46588 -927 83784 -354412 -101836 42968 -22057 295794 298629
10189 298629 119112 -20800 37802 -41171 -89033 270382 7923 -126378 -4423 -96583 -335948
10178 -335948 -261275 -34029 227214 -49982 -182956 -35669 -142028 -79622 -169285 34354 7513
10166 -222813 -165821 -96850 72882 27603 295175 -279290 17213 -410221 -73556 -31112 -151487
10155 -151487 -191577 -187453 -215943 -117716 -161850 -126582 -101673 -26457 7147 -229049 20017 15151
10143 15151 -99573 37346 62660 12124 7161 -90207 -54412 -10066 234682 207803 -93351 -105044
10131 -105044 -233786 -141002 -159274 51814 -146576 220181 -124058 169274 65179 -248776
10120 -253969 27394 -300904 226051 -140601 -44184 -35604 140076 -268669 49410 -96516 -229687
10109 -229687 -228816 310161 -270827 -305930 325883 -164583 101565 94528 240687 -378539 -277507
10098 -277507 -263653 93644 81948 -83023 -13235 -341475 -55763 -245935 -108848 133067 45997
10086 -216621 45978 -376885 226744 -289937 -484359 -114058 -129070 62630 -355739 -129440
10075 103241 -67789 -3605 -46091 189985 155324 -85224 -724 62116 6774 -573400 247600 133046
10063 133046 -209291 17577 -24835 -265571 -138833 242453 -85535 -4240 -74488 -31601 268687
10051 -216667 48429 24885 297825 -227944 228635 -121730 -278938 -281296 -203550 -73664 -43359
10040 -43359 -435305 -151821 6117 88106 -54097 -169613 -17688 -220089 173995 57885 134954
10029 134954 -240335 -75635 -273900 -4967 -156660 -165307 -45825 -19311 -52086 -72668 -26064
10017 -66158 -117442 111537 15099 -293270 -210916 204447 -10600 -322894 29151 -17070 -166618
10006 -166618 208380 -33811 -346827 -55385 -129266 -22695 -5780 193686 -206371 -143361 -178525
9995 -178525 -16390 107192 -209283 -387256 441925 -267480 96555 -146223 133118 -285407
9984 119123 74846 -156652 149167 -120045 22318 85491 86071 -135299 -47601 150067 -315634
9972 -180890 172037 70922 -19049 28217 -212660 -9979 91003 -74144 244128 -148763 11461
9960 -142874 391720 150376 -113787 -1666 -4786 -122089 -146356 203288 -121914 -144316 232722
9948 186120 17998 -109560 129078 -47882 -55133 16122 -115386 57852 97120 88159 -249927
9936 -117857 203782 97000 -266139 55606 14626 -17502 -25795 199730 -52512 -275026 61471
9924 31660 -40556 -182957 214075 -68833 -286035 -147076 37560 -31766 64493 14924 3322
9912 102361 193067 -201396 -71145 34646 -167335 -43577 -13145 -146746 -341573 70471 17753
9900 -30762 -318805 129019 38277 -312464 -293636 39229 2613 -230994 -113081 -44888 143181
9888 -178166 67070 23834 -188228 181596 -295210 -165636 -54166 -23407 48869 -32902 113893
9876 -200313 247319 -157458 145565 245240 -183811 211274 252536 -184624 195476 26822
9865 22042 -88532 -111781 127375 -304853 -75817 -193731 -307960 -143517 108987 -283637
9854 -9965 62009 178508 32448 -287903 -204074 486491 47085 -431573 -76513 -83344 -98300
9843 -98300 119782 -35260 19971 -94353 37412 98386 -176513 -95097 -41862 -268885 156322
9831 -253510 82170 340420 -346612 -272190 -101056 -215614 41227 -157554 -174488 -126092 13641
9819 11027 143398 13539 -201117 -291116 131251 -32853 -68797 -194305 -177495 -64489 198595
9807 -215650 102903 -123699 131627 -45298 -286810 -168994 -249444 -124513 -31255 204644
9796 95128 -98199 -151551 -211433 280327 -377077 -322004 -195179 30988 35754 -186140 7097
9784 -18155 -95093 137256 314178 -340171 -136366 -119948 -70864 -116537 -73696 -233919 -12420
9772 -346370 -95719 -204269 154983 32503 -168603 -61253 -153200 -201161 -36106 -16380 -154535
9761 -154535 -6080 22490 -189401 -52264 -260201 437 29391 -97599 97746 -141317 34077 -68727
9748 569 -257934 -34919 -115530 188159 154591 -211620 -99573 40649 220635 25944 142472
9737 142472 157183 -130118 38992 23189 -16775 -133720 85418 -142809 18104 -243480 46058
9725 119809 -38825 -71064 -66005 -3525 -33544 -175180 57477 -48780 -104390 -163083 -499077 -57513
9712 -116785 -88124 -213738 102014 100984 225116 108825 -181614 -151979 154669 -108295
9701 -125519 18975 137977 -136027 99307 -342781 32987 7723 12120 -41589 -23463 -282213
9690 -282213 -234938 -134570 247062 -193049 -137827 -93507 -299026 41532 -51155 -33956 -273540
9679 -273540 186077 207577 84441 -30862 129671 -181566 24017 -134128 229152 -204674
9668 -171769 162335 -301084 -450930 -340808 -180543 45774 -182029 -13692 -56583 -196245
9658 -196245 -376398 -313930 -78068 125362 -100948 -26 -227512 46760 -274126 -47004 42989
9646 -155960 152638 58093 26499 93594 219986 4596 -170302 -23888 68858 228166 -5466
9634 107860 280 -48416 -108474 341537 172361 -169855 97496 122542 203964 -104839 -211336
9623 -211336 -227199 -149032 -188951 74571 7235 -147068 167052 -107308 179757 -89817 24593
9611 -144023 33146 49817 33224 141917 263670 -268874 213804 -65978 -174402 -60874 66137
9599 -179327 -260234 8806 244694 -173918 -413764 33776 259548 -141227 -156538 -7450 68520
9587 253161 25376 27210 -186206 182770 57068 284007 -301091 136641 -375365 276613
9576 23687 172938 -284424 -459831 -200430 -136333 99631 -119953 -31815 -44371 177373 -341769
9564 -58569 -160187 -311225 -188 -416921 -139852 176614 210084 225399 -256609 36944 -124973
9552 -8254 70453 -328191 -352857 173066 -286329 13207 -114423 68827 33504 -129066 -77864
9541 -77864 -131139 -62086 -392992 -161142 -231341 -129459 -102009 -294280 -184170 -254326 -123783
9529 -28077 -232932 -314354 -326798 95419 -70373 -10231 -129231 -214950 112820 -38865 -241493
9518 -241493 -95077 -6263 -322179 -153870 -160188 11730 -263882 -316700 -113083 -177079 -116079
9507 -116079 1052 -165922 3815 105514 25874 -133297 98726 2116 -207778 87749 -14494
9495 41973 -143045 -181450 -280280 149243 -397352 58085 -170912 3119 -203311 -166509 22072
9483 -112295 -67618 93346 200025 391474 -39832 -19514 -154956 -258806 -76765 189097 -136213
9471 -3585 -420835 -318209 147711 54606 -313550 25130 152817 151043 161265 -23478 198550
9459 -45135 -18849 24642 216336 -228211 -167909 248448 -37322 -149796 -407166 93029 -45095
9447 -178035 234176 160471 149572 -169077 130182 169165 -47866 -28853 -6048 -13597 170837
9435 -125298 85839 -113368 49028 -83090 133554 -47505 200373 -18585 116767 -209434 54670
9423 189516 147440 32535 -27906 -164622 165738 -135199 -236103 47705 -34882 160180 -6897
9411 35865 39240 -172340 -121205 -175808 -32997 -248598 -51418 145950 115045 -131940 -43781
9399 -126556 -82373 81741 4547 181660 -104915 202942 -225509 -60232 177418 -40841 -62347
9388 -62347 75218 -39558 105761 -182905 -160331 -73585 -63613 262919 -237047 61742 -142868
9376 -115658 -162156 96801 -315196 -131916 -88075 -164156 -268670 192714 -290221 -109866
9365 17018 325151 57853 -92034 36058 -224414 46017 -87644 107552 -231647 -2600 1111
9353 -46264 -128167 66297 -179829 -620293 -429345 169764 -119916 -244925 58258 117664 -41488
9341 -529359 -375753 77793 -20115 -38397 73422 -160651 -309716 68564 25414 97312 -269822
9329 -111657 -214301 -264575 13223 123948 -18404 8967 -378838 -14157 -128092 -277924 -130609
9317 123259 -104722 -171822 -449503 153111 -148446 157797 -275226 152911 -434209 372110
9306 -162200 -122569 -54144 41958 -35176 -118861 78802 59675 196282 444354 86117 143905
9295 143905 -197696 146588 -84996 -85568 -104960 -159531 173956 -270743 272708 -39302 214309
9283 156969 -34405 -349304 21545 -10949 122426 -48533 65509 71450 -151447 -193060 -157541
9272 -157541 -150228 -29617 -210883 -312 73347 199188 -141477 40546 -223993 -379764 -136248
9260 172448 30734 227557 -279233 442548 -123875 -39294 106127 -274723 -393194 -558789
9250 -558789 -106579 117941 174378 -123914 29855 -113124 -180201 -306040 -381016 -334749 -48022
9238 -122384 -40925 -8008 143393 -77007 -19164 -165082 -84796 -234884 133100 -357057 -163093
9226 124323 148477 110067 -144325 202049 184197 -34174 -317048 -183590 162363 131695 15209
9214 4708 192839 56603 195620 -245009 -130249 81101 -96218 -73782 139250 -222757 -648362
9203 -648362 25772 -83848 -34408 22977 -5287 133410 -213231 -111694 -153118 -456745 -215334
9191 -463902 54280 -229463 -222357 -125570 157146 9918 35236 -183230 -8955 -134083 456044
9179 -21506 30755 -184235 -2404 97860 -301377 -291170 -289186 116368 -256298 -4571 -126869
9168 -126869 217032 -18224 56891 -234632 -24245 127100 127307 83488 70184 16924 23110 -497194
9155 -324059 116126 -39351 36367 -237308 148404 -35078 -96982 337720 -149350 42099 -173537
9143 -26616 -94862 -50303 -120869 -22398 -37719 -11588 49312 -25588 -148638 -19576 -111974 28910
9130 -162936 -188108 36753 -240980 -17803 -92092 30788 205047 101272 -41296 142647 -23610
9118 5211 -203202 -211484 -226996 52310 120020 -74462 -385837 -314916 -40357 -278812 -158327
9107 -158327 267328 -238248 161887 238200 92654 -282615 43124 -193804 -301496 -324722
9097 -324722 73177 193182 -28036 120290 -14973 -399232 10631 184449 -107512 -4309 316471
9085 6864 -266604 -9595 113364 102875 -157649 -218370 -127065 -374527 -340621 -95646 -133969
9074 -133969 -319032 -390709 -98402 127736 13685 -15292 -181277 -161381 -226639 -184822 173562
9062 -279426 71179 91882 58976 -144792 26778 52694 -68481 342434 311852 3917 -51324
9050 181778 51841 67167 -87586 38622 -291182 -419179 97003 -132258 204066 6660 -140565
9038 -182226 108862 185956 -188166 -84246 -12627 168 -28682 31893 132035 25267 -56645
9026 108280 -155740 -356372 -429647 -13458 272525 22950 30880 3669 -138959 -63616 -50414
9015 -50414 -210820 -176452 379692 -116262 -218156 96227 -272331 233545 -123249 -61345
9004 255677 -305853 -16860 -238026 -272530 58678 -204731 -107820 -216767 -377094 -288338 -96376
8992 25711 -27061 6662 -57926 136416 -146135 -133098 7817 -70853 58867 -178736 -174310 78484
8979 -327101 37755 3126 -225884 -79415 -138782 67394 93961 -49158 -68804 88474 -128329
8967 30448 393729 -118559 284137 -302103 174956 65823 415544 -127133 -62608 -72074 -364327
8956 -364327 144043 -130451 -70471 16061 -19422 -34447 -555741 -2504 261214 241266 -182077
8944 -386492 11901 -25993 117723 -167186 -180587 316524 311500 -570730 -292125 382238 249657
8933 249657 192142 197481 -65151 136660 32249 -374688 207804 175909 417315 361308 1228836
8922 1228836 7447767 6318830 1915085 492407 557305 369616 212937 45678 193753
8913 193753 -252112 118776 -19715 -257720 2719 149629 -297708 -384367 96999 -203054 -42685
8901 39174 88865 -39560 -89921 -178121 105956 159049 73208 68213 -294206 -39220 25203 80158
8889 80158 -241311 333249 -346974 -106382 -75912 -61540 -50600 -190317 -158125 128223 -101467
8877 -12644 94000 94856 202868 -102545 -518160 -39977 -184279 -105428 40139 -35061 112708
8865 290311 73166 445256 81362 -60160 -42337 -479355 -118788 112865 121526 -49236 41927
8853 -83593 -219206 -2276 -85970 -68934 152707 112459 -44400 150042 170617 -99460 104924
8841 147489 -163767 118161 -1849 -284183 -169749 -110384 -35069 -38630 -199960 -138089 -272328
8830 -272328 236057 248260 -130501 -248957 -249536 70166 -548627 -209953 -304240 24855 -74262
8818 93327 127253 -103046 -156939 -49511 27594 -133149 -104643 15507 -147477 -192454 124964
8806 248948 -76189 -195851 239589 440365 -90465 -12662 -221536 75813 172762 42382 -39105
8794 -79168 -164554 120807 2566 -391806 215871 31172 316539 265790 109730 -86846 -138989
8783 -138989 -255735 -35879 -163234 82481 -59515 94058 -114721 -40833 -67836 127193 -26292
8771 215238 -43071 12031 233023 -37788 146573 97877 -158345 151401 -389728 87370 -126964
8759 -42046 -139757 -81490 -247524 -196987 -24069 -84724 -19908 -87281 286448 157218 -303884
8747 -61881 -8937 96511 271175 172187 -159742 -330002 75915 28733 -179668 -301113 -187360
8736 -187360 -123410 -175443 -167386 -120166 54556 -143004 -309714 -81662 -123061 92832 -64255
8724 -116106 10987 -91060 -306730 -75899 -74376 -171805 -427347 46101 68312 18679 -23153
8712 205690 -186714 -246929 -89956 -282569 -99336 -52312 116558 -401578 201008 17747 -150788
8700 38381 18945 -36911 53873 -4061 67731 -47627 -176219 -113238 -151563 35529 104687 31328
8687 -89312 -249104 228549 9335 -26896 127394 96836 -318176 76072 -78976 42872 -112202
8675 -218091 -112831 -71035 72870 -60137 86057 211902 123267 -242330 -129126 -151305 97982
8663 -68151 -66556 23710 -33500 104437 117658 -292447 -62502 218902 -106458 342382 101106
8651 50374 -43131 -447508 524776 -174898 53867 -29253 -166965 230850 -148446 -41947 10732
8639 106005 -123915 104637 -224622 -153343 125096 -137424 -157594 -157262 -291840 182308 -164800
8627 -207421 125324 -115800 -307984 -30635 -60963 212954 210030 -136664 -69663 -137273 -21260
8615 -49292 -97364 -65039 38419 -25361 16868 72205 -263491 -34732 -40684 172114 -98839 -162025
8603 -162025 -123155 -141120 -184409 162556 73416 -121754 -186251 -89533 -31068 -107912 -218167
8592 -218167 -61030 186954 61193 72528 -241620 -19874 -74874 -401707 140640 13690 -64134
8580 -163712 219142 28087 26258 -119107 97856 174937 -236371 151890 -114621 89268 -82171
8568 111704 -73137 -97331 65268 207347 -283654 -86719 -268141 159244 29768 16156 -232639
8556 -7160 166179 -26403 -59586 -265930 -176152 -23370 -316113 -372772 -46640 48597 -42648
8544 -282638 17717 -62951 -10625 -16101 238104 -163129 -178875 -129818 -247395 -180944 -165548
8533 -165548 -122851 -117840 -185536 125881 38436 5794 -262703 -130934 -64464 -239589 -51639
8521 99804 68851 -103070 -147451 80037 -314102 -44467 -212848 -254898 -372999 83491 -133519
8509 125593 -206262 -73106 -484342 360093 -145485 222942 53012 -117666 -155949 -146143 59194
8497 -286616 -304081 -57221 -12016 305979 -159418 36476 373859 -151752 -68634 -285401 -80977
8485 -41424 74505 -111316 -104463 84643 -256655 112107 -48559 293570 253522 -124497 -117320
8474 -117320 16680 -246297 -70505 -7092 -33275 1573 -219466 -356647 -284556 20836 160110
8463 160110 -111462 -272604 -8117 7488 -21038 -112244 -117733 -48667 72204 -306880 -293367 56959
8450 -12486 55120 39572 -133114 -76838 64909 -187365 -74129 80942 73326 -311058 -195418
8439 -195418 57829 240970 -376446 -147788 -577195 142350 -294776 -86905 -32782 -117224
8429 -117224 -261532 107513 25343 409271 -192073 -455184 -77137 151898 52292 -43954
8418 30724 28674 -30813 -69976 -258871 -137937 -103988 -101741 -126724 -148546 11534 140075 -247279
8405 -262864 -59679 -173223 80858 -85058 -133706 -13926 -54650 264096 -64007 -155235 -8267
8393 31071 -80728 31568 -55707 -195355 -350772 149185 -125968 -165600 212012 -97745 291105
8381 94767 -189242 130023 150062 37451 70961 -60989 302911 261290 71190 -132160 -14432
8369 -27453 31326 111637 -146105 42366 -327296 189441 73672 280251 129539 -242185 -191275
8358 -191275 -36999 100329 -100550 220994 86386 -147015 -293195 57603 23159 -79549 -51357
8347 -51357 -239566 -110232 -235035 -67056 8949 -176194 -438615 -135937 51534 -182066 -52291
8335 -71900 -66050 -29101 -246880 -25921 67281 -357242 242846 -79695 114116 -327371 -171362
8324 -171362 -212868 -171101 -339306 108172 -317644 203181 -334726 47239 118874 -317826
8313 78621 -69949 -138788 337862 366330 331007 -150958 -334443 -199029 106275 -160474 -126513
8302 -126513 -274649 -228271 410835 -10290 -163927 -338363 241343 -31652 -243446 99286
8291 -290737 412428 193804 101783 -78436 -124542 -47149 -11743 -192679 -163568 23680 259748
8280 259748 2367 -182862 -130330 164043 -11263 -148404 -125541 28245 83638 -5120 390787
8268 -197353 114664 50725 21511 15936 -42219 -136876 239196 -44485 -66599 -210173 -54390
8256 -353659 36952 39159 -138611 11089 -101353 45276 204345 -133679 318052 32866 224136
8245 224136 -124398 -208699 40709 203893 -157875 -163310 -145638 282794 294200 -66586 83148
8233 -289869 -113902 -45963 -22252 -362701 -137421 -69743 -239359 218535 30321 238709
8223 238709 -165438 -158346 -345117 -19879 -109625 -185168 -225971 -106168 -309782 30886 108489
8212 108489 -272284 -342555 -39322 -115388 133170 -184119 -308285 48757 84003 -382220 -120492
8200 166600 43172 -454548 -11678 9266 4160 170715 40825 -244080 -85951 15036 -155355
8188 -373444 -413304 -57121 -21047 -64553 -175039 -166581 40222 29963 -223924 -59818 -91224
8177 -91224 36101 -372948 -72981 -43768 130684 146911 -168248 -200820 82314 -50204 -4151
8165 -141460 -89287 -203740 -376483 159080 193595 -257213 -168665 127708 141098 -172626
8154 78038 -130192 -303536 -317322 -32003 -64815 443228 -60990 -124314 80593 -33463 -168407
8143 -168407 64143 -201638 -22448 51081 13800 -47430 63104 -31882 19304 -176988 326776
8131 -292498 119439 -57562 -87060 48709 -18787 -38984 20550 -97614 -83704 -145264 -20054
8119 -102651 -6813 336761 -261738 -121296 -15459 166316 -211757 -37452 127992 -84205 34356
8107 -135924 154200 -44003 106341 -32731 68584 -193862 -116997 76835 -28220 -165142 124877
8095 -108879 111813 100009 232265 147049 42940 7325 -42135 -139429 335098 -20746 205904
8083 133316 -163280 -20305 -336848 -130681 242536 71845 -175890 149171 -36639 343075
8072 -182584 -165961 -122198 -8848 -58471 98503 85418 -245291 9628 314261 -116445 -349374
8061 -349374 36220 39991 -157627 -43481 -43057 12189 111502 -37982 -179924 -228807 -266885 73701
8048 -121535 -100031 5079 -60505 154236 -173292 -61689 174505 -80802 -74657 -286544 -314151
8037 -314151 50252 -121794 -256049 -95823 126296 152180 -73328 -81350 -136253 258890 66810
8025 -31456 -26402 -76297 -247998 241971 15921 250642 -67574 349215 81825 -223022 -28679
8013 -54345 173999 -414768 -240054 10284 -146560 54760 -309375 1606 -158197 180127 -409458
8001 -325883 -142470 -55464 16248 -84959 144885 -17292 -160987 459093 186084 31089 229436
7990 229436 61216 -361795 -58870 -18568 202574 150448 83492 23799 -34179 -237728 148041
7978 17373 -39796 -187292 -384313 -287672 -115549 47591 -390365 -180502 -187638 75172 -49015
7966 -112205 21617 -437437 30647 -124870 30213 -45668 -62979 343964 3391 48496 181903
7955 181903 54920 -81386 -127256 -71788 25881 9780 -323067 -148954 -219852 -199067 66215
7943 -13118 266959 200972 84050 -18698 53814 -127229 403582 119192 -47058 -275172 -73289
7931 423293 -77563 304179 51035 -106774 181349 48195 -185226 218987 -40917 -164632
7921 -164632 -237484 -268718 -252701 -170501 123876 -221283 16812 -163162 -59429 -44191 13556
7909 79943 -174738 125144 102419 -241902 115691 27940 -342804 -129919 -137835 84807 269128
7898 269128 -79542 103368 -250963 334453 -118528 -100722 72987 -356724 -349774 52909 -35414
7886 -228351 -102498 -99990 113269 3217 -27263 -61865 210730 170235 91958 33737 -5391 153348
7873 -261366 189396 -77086 -90804 533572 -243335 224979 -222979 66055 122985 284701
7863 284701 39762 67285 140764 -186798 -233252 -27801 -181159 -1940 153562 -51293 64606
7851 14973 -84998 -56225 -271023 -397590 105578 -144674 74200 -8919 -143740 -28771 -74088
7840 -74088 147134 -349633 22883 132435 8397 221831 -216485 -147184 85718 -149376 -353300
7829 -353300 -68574 -154799 -166464 -81387 64435 247477 -177029 -35188 118017 -133264 -86185
7818 -86185 49776 69390 -176931 335638 -281752 138199 59955 50927 107556 -296232 167923
7806 -61161 -266294 -211886 369832 4182 -129552 -197839 -180804 -86870 185581 226925 -16585
7794 -106825 149716 175340 237333 163918 -62915 38141 -187345 24530 -21650 -155251 -141130
7783 -141130 -8588 -175960 339219 -138227 69061 -11963 -9419 117943 59574 22054 21402 -85127
7770 112646 30638 -5659 -93628 47545 -273347 -114114 252167 195571 -233766 169130 -186551
7758 -133258 -272 -307271 109829 209668 -224163 -303464 124247 12223 97735 -137027 -162450
7747 -162450 -135763 -9443 -66617 -182716 -83871 41838 83438 49728 49435 -271275 -102051 64467
7734 -27875 -167295 135394 79875 59123 119070 279012 63846 115738 -137198 3444 -201638
7722 -78153 -159166 123849 -177770 50051 -529481 -91644 74183 -8634 111700 78073 -106962
7710 -36260 -316498 -162124 -143870 -152328 44110 -139289 47711 116868 -168682 41200 -96919
7698 -129785 -142291 2013 -76795 -187525 -42927 -297575 -342466 204084 -56137 26934 -181940
7686 464243 -183108 -197947 38589 -2996 31101 -50328 63429 6961 -3598 13563 -103288 -408899
7674 -408899 -116634 -105194 -82323 -94258 124413 8583 8319 -131622 70357 6946 -70243 -207633
7662 -207633 67699 -54351 83659 94707 97065 142448 61031 -201163 -31623 -320085 53075
7650 -410001 -16059 33116 -79286 -76546 -150638 220007 1131 43924 -139060 136971 -10311
7638 169729 -185718 -299941 -247555 222230 -168307 -424824 -37949 39312 -71057 93107 -531337
7626 90924 -230973 279 24418 107976 14792 119394 -167768 -87964 -378931 -223728 -24879
7614 -127619 -105570 44988 313169 -157188 193635 24721 -166153 -133430 -28213 -73137 -76048
7603 -76048 -138 -77722 31948 -100855 -208385 163990 -39326 120948 41487 -168428 -15629
7591 175905 -167592 6514 201445 190888 15274 -21877 -87490 105451 133759 180741 -9640
7579 -32992 -206253 -90660 -497875 42106 -343450 -7678 248999 59935 -18939 -153361 24530
7567 -54382 205391 199759 92706 26745 -107364 -172361 -37693 -395119 -196554 15055 80162
7556 80162 -143937 -234825 78290 -58341 147621 217014 7309 155077 -206667 517859 110371
7544 31552 105707 -33247 -176813 117581 43112 82975 -194438 -331745 36059 374556 -15238
7532 63000 -293906 11561 67461 237554 48890 -26948 -221724 -223751 6724 -156841 -63662
7520 -354836 -366748 356365 101487 -182372 10929 -125225 -243155 90362 123737 -162484
7509 76651 -81077 -68959 -133828 54150 -145780 -51391 -35353 66739 -85948 45438 -379071
7497 -425051 -34083 271256 104335 -15339 245512 100538 97277 -72780 56045 379 21179
7486 21179 175318 -215717 272354 7533 37092 -11704 -277430 58791 169207 -409535 -372054
7475 -372054 150234 146791 -95293 -54574 -199830 2057 83248 39940 -2807 -290601 -537425
7464 -537425 186006 -180053 256116 91303 -297771 38451 298584 -52740 22684 -364969
7453 249818 -69906 -152228 -49215 -189099 -234619 103602 203610 -234273 146514 208944 72050
7441 -29262 -92537 62395 -66333 36266 -49378 99508 -238366 -321018 131932 61955 143948
7430 143948 -382669 2817 101521 -139686 30608 146649 -257745 138431 70241 -113282 -66361
7419 -66361 187750 151801 -197271 -45102 -220153 6109 -330299 107687 -239441 -84372 66555
7407 -445955 -147858 -371067 196482 159182 12291 -15189 -135025 237137 344212 20953
7396 81537 -242923 -19854 116544 100967 -21600 -41186 189916 -233313 73301 -64199 65482
7384 -40737 -71172 370271 54783 -62351 -156537 73586 -105789 -327885 115869 -160796 -151778
7373 -151778 212484 -105261 50797 -215928 -46427 199418 -407234 -317207 -35324 -136462
7363 -136462 -76447 -236873 141445 219527 -68329 -123465 -154993 282894 -67374 -34566 153769
7351 12705 -236465 34435 -308998 36174 51514 53492 -193889 -310893 31384 269624 65301
7339 -344634 147387 136553 -21706 373857 -284915 -229303 -90453 9788 -123153 -100873 -159947
7328 -159947 -80443 -153599 60651 -165364 130672 116240 -131607 -357792 188759 41645 -238136
7316 -67681 -69285 183169 -237048 -163349 66605 82089 149680 1772 272059 131220 182478
7305 182478 -16303 -219883 95743 58533 -21815 -60499 -36082 205630 -93000 -42723 -216656
7294 -216656 -32084 72557 104130 149170 -173407 250225 94615 -30165 -23458 110279 -120681
7282 -120921 15755 -18194 -100174 168336 -161744 -54329 170053 -92479 203304 -163900 44173
7270 -642400 24820 -72163 -216753 -47717 226128 -24543 227459 -133771 194294 24323 240433
7259 240433 -120890 8231 -236943 7567 227063 -51448 57870 44459 -262754 -363591 -342545
7248 -342545 210322 126867 -475548 -63310 185585 -111911 169011 188399 93525 -28188 -337488
7237 -337488 -357863 116573 -75369 -164714 -317393 -37914 30188 256742 -37827 -120580 -258926
7226 -258926 65649 -181219 117744 198376 -134290 310256 -47996 -99559 138220 10068 -5110
7214 -158685 -198963 15717 78628 287372 -148416 113226 -8915 -258576 -156784 -174558 67375
7202 -159072 -392134 135344 225185 122110 109949 -291155 85095 86747 184645 333231 -41189
7190 -181774 -41132 -122824 -143970 -56954 -101505 70510 -157216 -81202 241109 78449 -261223
7178 145030 -134576 294139 -249458 -188610 55148 150149 224587 272067 34090 -247952 -134916
7167 -134916 47630 147243 37459 -97570 -248777 -51938 -277956 233295 249322 -448555 -28785
7155 -128803 9653 -61194 153151 -23845 26252 134641 8884 -48208 45875 -179677 -135752
7144 -135752 -244410 -136423 -132748 -30478 23127 -120575 -282708 -459267 -30004 42610 -217400
7132 85252 -109185 62164 188071 171500 50497 36590 41890 70922 124039 -221651 -317010
7121 -317010 173960 -215118 261644 -1113 -346553 -65891 -124897 89049 -408899 57889 -264930
7109 -312446 32522 -333840 -1456 -25574 -122938 33734 -134655 -32900 114374 -120039 116340
7097 158919 -47644 -3200 79911 -209830 -212680 -141511 -287828 -13256 -16245 -91579 45470 -302653
7084 81933 74596 -44759 589 148654 128842 -125834 -339566 -51961 -157981 81325 46308 68050
7072 68050 -194394 70708 -244828 102999 -497754 -391884 -177569 3636 -36594 -213175 -20125
7060 109290 -102042 -61875 100365 -7249 142291 -344378 -78687 -81685 173431 250683 256076
7049 256076 289126 145100 -111378 -34059 64492 18691 12059 40518 347072 88978 -158057
7037 119721 -11657 -84062 -230397 -52314 74713 11389 -32606 -46525 -23455 193500 -202616
7025 -61992 196226 -39395 -127590 -149902 -47293 -222356 26420 106235 175018 -133195 177298
7013 68360 -440901 130912 202387 -192498 -132651 48579 49861 38256 -12687 -318023 -51712
7001 86792 -122978 -128969 241715 4456 100517 -175559 61455 -171846 8599 -111168 -282576
6990 -282576 164541 -148052 105094 69178 39641 210348 190249 -327579 -70291 -51222 -105104
6979 -105104 -85330 227941 -49846 -196896 66754 89612 -26322 106071 53929 164316 -30380
6967 -402754 -181891 70426 -193783 23386 183823 -74865 -255425 186663 -61356 342784
6956 -67460 -27874 -136615 6401 -7884 -59687 -273014 -291822 315937 33870 -62754 -229112
6945 -229112 -370976 -188433 37365 326712 -51860 330136 -299570 -312831 136601 -8107 -14908
6934 -14908 77907 269213 228002 -2059 -45695 117083 -13114 -272329 -69292 113773 -195018
6922 -239648 149239 73474 47565 -34943 -113696 222376 145341 -163500 -90408 93992 252157
6911 252157 50942 233965 176656 -33245 -6241 67701 -356848 -78082 3418 115501 -230695
6899 63466 -115506 7886 61818 34353 119603 -124194 316357 -151712 141408 2546 -5722
6887 -84181 159168 84211 -324433 14593 -10868 329820 -375295 -49716 -44079 -38601 -151057
6876 -151057 -117148 -208749 -72448 49599 159585 -43043 -23157 127077 10334 -23624 169541
6864 -253416 -88738 250319 83249 -544243 116251 -275024 -162676 -301622 -20139 37220
6853 276258 186376 172519 -212458 -188902 90702 170709 -61733 -64276 -23952 99403 146836 277227
6841 277227 -2891 -77774 -411266 -243660 -236184 251995 -340518 40058 -323822 -1131 -129592
6830 -129592 74173 -362862 69308 -136065 -185925 -127958 120033 53038 -306800 143362 -42255
6818 77112 -136469 174965 -3822 -33167 -76724 -56244 148626 -294341 756 83242 166804 -12008
6805 -86333 -349111 106946 -103600 -149807 235201 -32112 269534 -96593 -90944 357285 29183
6793 -71693 83060 48407 -202045 115422 -1995 -35573 -399217 107271 82122 -153235 -119224
6782 -119224 90381 -57011 -253163 -54465 277918 -133192 137239 -151862 -232614 98175 -287534
6770 -227831 -80155 88886 -127519 -336536 16370 -137097 -396518 -59284 -39046 -170124 -74142
6758 -97297 179195 -98234 83111 -45910 271257 -55500 -138862 -266914 260823 -96729 -321819
6747 -321819 -71246 60323 87464 -48743 194510 -53002 -28959 -57577 -106568 10929 86455
6736 86455 16934 -284847 121710 76412 289494 220258 246352 -43250 -65133 349930 148606
6724 -78959 -165235 -77936 -49477 102889 -78102 29519 64182 42450 11887 -452 130244 142882
6712 142882 -258696 -107798 -150437 -77567 121793 -242817 -417512 -101234 88062 -124671
6701 -56236 -58107 -40695 137217 123879 -99237 -124847 -195031 51558 -107738 -141333 -19551 -63568
6689 -63568 351274 -124781 -249211 -5740 320665 113863 182020 31732 -188167 -241057 57022
6677 192200 233841 52264 118401 -128201 -284925 34776 227441 -199564 -289164 -144440 26079
6665 -186649 219234 12589 18880 95578 -211644 51158 69868 -93448 -108843 151872 95169
6654 95169 -16638 -74587 255327 189876 -104966 -58567 212147 -78136 -110984 -122162 -38390
6642 -54963 -251532 -79914 84898 182581 -177547 -140704 -60930 -10387 -20848 -7661 153419
6630 36436 -10738 58301 -22436 -126292 -286210 -188750 25620 399358 -59687 -115791 77567
6618 -33096 -178777 -62959 55052 843 -232905 32927 -252857 106449 -220003 -140582 -38907
6606 18158 -25480 163777 53720 41969 71556 15778 326098 -128139 -1367 -116496 -38558
6594 12893 34249 -146490 62300 52781 36793 124307 -171557 -6201 51304 78678 -35686 -205989
6582 -205989 30872 220471 161119 70052 84275 -308929 126624 60843 -15202 49532 -123248
6570 -225509 133049 -178557 186696 -86632 -64316 -194709 -184143 190363 25065 -88 189155
6558 -290278 -363111 90619 47255 154949 -473204 93597 -249120 -370826 283198 -67002 17704
6546 -173404 -5452 -85868 -229224 19297 34217 -137937 -32157 -384544 -20510 175374 -64165
6534 43345 -553 109612 -110837 66003 72806 27771 -40771 198054 5062 -146375 383101 -21055
6521 -14707 489487 -145417 -66389 -434903 -154342 -65668 -282915 -114228 359123 98429
6510 24362 -634159 111344 101060 -37225 -2275 248935 -100298 36874 391 -222405 -68576
6498 170040 39461 5599 -99200 227759 -13293 -18733 -76043 82702 -71852 -191200 135385
6486 44760 -106248 -117870 -86474 270540 44110 -152857 389107 96283 -351678 33598 -170490
6474 145594 496219 -454679 -219150 -204571 -174330 -24422 -38901 -375651 -61739 79521 -27007
6462 26095 -127914 -340817 -527310 -61255 -145063 10223 237609 -183062 -152418 98222 -213350
6450 18478 51321 -21919 -39252 -134785 268238 -342588 283291 167491 -54793 70430 -239731
6438 -300020 53018 -53070 86637 64570 71414 -170867 248984 -158414 156098 185566 -183442
6426 177072 112197 -95296 109751 -82435 -33764 385129 53495 53501 -52467 -77857 96369 191357
6414 191357 -104881 -86330 -56070 -8381 -4362 -187422 61886 113179 -490910 7662 -129314
6402 -35901 337756 -22206 48344 -63611 -4208 -132941 -216533 41967 -55137 -68925 -2227 -140746
6390 -140746 103856 17164 36753 199395 113957 -230855 159592 63322 -124441 386970
6379 -237556 -208632 -85441 222174 -134089 -239959 75023 -15731 -48333 -75714 -71805 -476882
6368 -476882 -227485 -36066 394929 -108751 -7809 -114703 -118510 -49222 39169 -377217 -171584
6356 157603 -82484 -329421 224234 -259506 -116386 99962 -70037 66609 186123 -66672 -240934
6345 -240934 -98962 -132137 -53845 200590 39749 89369 306101 -245529 81885 -288940 136640
6333 -158994 173226 -355066 -40366 32682 172702 -5546 114427 5736 121381 -43302 299725
6321 -17172 276102 -308074 -135800 428851 43624 -51298 -84160 157409 -10445 48187 26197
6310 26197 -225387 150925 5221 41740 41236 -210875 -145527 61621 264562 -11556 88182 10991
6297 -72483 4761 338492 -77135 -113964 -152037 153827 94936 203677 -120099 -135853 37200
6285 142649 162266 189168 -58339 285401 -296070 -208335 8677 -183514 -192979 40794 45362 110368
6273 110368 -198873 236843 115844 -75874 301841 -220542 -278763 -151760 -374365 -173340
6262 8031 143650 -25366 -209959 -131572 133440 -32404 310566 -48984 25216 -24181 109474
6250 -98467 124716 -90448 -12922 -7289 2879 141658 177913 -44210 66294 -139407 -244581
6239 -244581 108259 50208 21810 -165428 -193061 -109584 276810 -37153 -99589 170474 224893
6228 224893 91360 88590 -16420 -138149 453565 -262119 41140 -44290 -461368 -156938 -4848
6216 -135102 249796 80814 -101621 11021 4699 -104556 157213 163084 -256688 353040 -137691
6204 30076 97366 -152824 54843 -229103 -426107 -318048 -159412 -158199 -12667 -283708 175053
6192 -191182 -44527 -123496 117891 -180450 -117388 48475 75677 -89329 377070 34827 -241034
6180 115152 102262 84705 -711 25880 -231668 -212982 -9379 285546 -97021 41276 60966 5379
6167 110494 -179757 -17469 129104 -148179 -44114 196433 227676 195178 53828 -50537 -22898
6155 -131663 102934 71093 -90454 169294 -20247 -79799 -90224 169151 165077 277848 -246971
6143 -36643 49259 116922 -78924 -64775 -169439 116766 -181588 -151393 -129471 -12365 245344
6131 -190697 119043 -62366 184389 -145237 -233278 -135079 -20040 90391 -172458 48306 -148869
6119 -127405 -44153 -225566 -28085 -2522 -246966 -152181 -283791 -170494 -150037 -126571 268106
6107 82410 101935 396132 44148 -123483 11857 -98420 -82965 203880 253607 223081 -495765
6095 -284319 71001 -145172 272793 43827 -126969 131400 -17968 -83486 -103100 -102109 -135828
6084 -135828 -161942 -167892 -146277 -29167 257952 52823 229422 -163646 -186693 -109798 -341982
6073 -341982 143512 -221325 208030 -56751 133422 -87647 -15939 -71590 325687 -200206
6062 -72414 277888 -490774 110508 92903 -216943 -82165 -108596 75149 -159570 -196053 89553
6050 -139782 -86039 61695 -253342 -255825 -216555 317342 185514 23656 -69624 66443 -176791
6038 -123696 55308 42852 -141981 28072 -37322 -218411 157881 -32696 86310 154804 87629
6027 87629 46803 -38139 -159827 94646 -108117 -112349 -170198 114950 39673 -92101 111492
6015 103174 349600 96854 115311 -103773 -1830 -101047 16221 -295003 84769 46802 13564
6003 14717 63247 245047 35906 52810 -276903 62499 34904 121620 264036 -166588 -112097
5992 -112097 -73330 -184595 -148079 52814 -116206 -75888 -291253 -64095 123728 16096 -35390
5980 -138996 166981 1887 107943 -243911 -37563 -16844 143995 255294 -20148 -118937 -452035
5969 -452035 -182759 201775 -115627 164368 -209346 3371 -262254 86697 379873 -321202
5958 -113364 -81823 -11650 137748 -175998 -51409 -61829 13411 65043 -240565 -75145 80105
5946 156130 6765 -196903 11773 -155278 92037 239178 306638 138120 -79561 -137937 -33009
5934 218538 8296 29539 223106 -177617 -10835 -340084 135874 351304 140695 352622
5924 352622 -110671 -5806 -304161 -218481 -4389 21298 285539 15035 107121 382507 209433
5913 209433 40146 -38117 -31532 228046 -50477 55667 -26088 -146723 -150845 -101716 8638 55595
5901 55595 -104622 318885 -247130 42006 242838 -32973 -107697 251012 66980 33000 81957
5890 81957 169843 182518 146939 -109385 -89774 -192584 735 110979 286866 7624 150352
5879 150352 -240674 -149559 51188 -69082 63523 -33900 -175527 115800 20251 80263 -97544
5867 -229183 70367 177348 19439 -32277 132214 -50644 96577 -116354 -68944 -250088 -40425
5855 -33622 103003 68542 193524 133185 -45248 -286724 300890 286129 -237176 68564 -37370
5843 -17183 15980 49877 -77027 50098 -4854 -82622 -256895 5689 172766 79130 -74968 -86518
5831 -86518 -186639 -224449 -31217 -106600 -370468 64437 -58587 38902 -122656 -20180 -227331
5820 -227331 -6064 31954 89650 -18869 116807 66291 58871 -268343 148874 86139 -27680
5808 217533 -83018 188195 44151 -196843 228531 175705 75954 -219008 35815 43864 320234
5797 320234 -320916 -517752 287518 -156193 -262344 18608 -74164 -81829 277436 -145391
5786 33899 86069 -8877 61329 -5849 -146106 132260 -356648 -373453 -96528 -44496 128479
5774 88801 220069 253284 22919 255138 -46687 -226670 13879 -203436 117369 -96996 -302155
5763 -302155 -77064 51701 -134746 -209060 -4371 -234969 310267 62417 -182391 -72071 120267
5751 -49680 131432 -209971 -53742 60176 -21099 -93194 -63673 -189389 -39531 -40565 54468
5739 -86607 -227840 -19536 270072 7821 124130 -82715 63826 -92284 -150433 -201351 244300
5727 -91487 78865 -92307 82293 -103474 278790 -207855 100638 72659 167196 -43547 220321
5715 -219152 -75554 48602 -60986 -77001 390580 -171495 -300190 -58697 153272 -110444 -272788
5704 -272788 69985 180252 144474 289280 126684 -149577 86329 5922 -105217 25053 179505
5693 179505 -259011 -384574 -52997 134716 43834 167784 107598 -74351 279242 96750 67853
5682 67853 -242825 -169286 67575 180273 -64635 -194002 179139 68021 -403885 43619 -10796
5670 172795 -71047 -208098 -67196 -209369 57562 254031 -107714 157897 -217992 84370
5659 9571 73992 78103 55565 49205 -306888 7726 230388 -123141 279380 -2677 67131 -135087
5646 113468 -197522 242294 27862 -29522 216873 71786 102806 -173375 -6453 -252181 137090
5634 -85040 115057 -65078 -83804 -179200 -15872 66561 -145177 83689 -247577 48039 264333
5623 264333 -266028 461424 -76164 -186594 -76002 -195015 -297583 127658 42130 -82091
5612 -90810 -102654 183221 113727 187978 32278 -138429 137258 101375 -200053 183159 -16862
5600 -277191 -251153 -22803 -72916 -212409 47541 -163974 132486 184760 100613 164192 -139430
5588 119418 154441 351964 -133849 48922 -329478 -135881 -103740 231091 -145595 -65286
5577 98197 14390 -107822 47162 284171 -118089 -88656 -397046 -147082 -37727 -46531 156330
5565 -194519 180436 -3080 109797 190303 -18125 -9523 -55380 -206511 136376 113458 377520
5554 377520 -25350 94278 131590 -101942 256988 16218 -8553 266435 -256425 291286 86410
5542 -36281 -96218 -162446 46316 84004 178188 185060 270749 429 -225090 -95188 -161051 4658
5529 220824 -98541 75631 109998 -167031 166865 301484 60653 -179578 -147618 166336 105868
5518 105868 -237359 -201239 13613 -42050 -145674 126225 133140 -107898 -229176 205250 153643
5507 153643 241807 -64730 -116143 308974 -37505 -321041 -72803 -171082 19834 44231 -168184
5495 37582 -50711 41927 -196531 -198474 -82113 29374 -27624 -288672 -299834 -90372 -225237
5484 -225237 -37620 139093 -65402 71051 89571 68385 -212119 49464 -74904 68609 -160814
5472 -102208 280853 279627 -211899 233637 -37832 -81161 19868 160545 -65898 -311833 -209467
5461 -209467 -16265 -77482 135048 -56583 373743 -106994 -18135 -19855 2353 -90996 -169137
5450 -169137 -123739 34411 69241 255230 328 242064 165763 219565 -447586 -5148 14739 33878
5438 33878 423551 94457 385061 97286 -99208 142938 36425 46924 -660 80282 179064 2451
5425 271527 167737 -163311 -96379 -24219 20844 -83982 134863 25054 34620 -85681 -25775
5413 92845 -317733 -66171 -115972 -164644 -6418 16734 131520 -201245 -247617 165214 25812
5401 -124033 -71924 -104648 -211126 255037 -128835 40437 148534 254960 113560 -49392
5390 5439 35749 -41181 33988 146549 -7625 234207 -48280 67706 -283725 393736 -82698
5378 73370 -320428 -49868 -433727 45725 40490 504500 245587 -66737 -122782 82626 101415
5367 101415 -112352 -2214 45604 -170021 -6959 67636 -340937 -108028 85588 -65814 42587
5355 -164798 92802 -61763 -10158 94269 13330 -176411 -37929 -71344 134528 -14166 29427
5343 -127104 -20233 170596 44465 -294367 130967 132020 -392937 -77292 168438 -135859 6505
5331 215504 -34138 91479 -46872 1813 -31891 115509 212792 -224430 75982 -154780 82787
5319 95377 -398221 -360747 -5129 -366255 -161582 -166884 -34516 -139789 -3067 59255 216529
5308 216529 -135521 134324 12341 -53823 103500 144772 -138423 -267590 193531 205030
5298 205030 1458 28462 145902 163453 -150124 -35064 -351371 20535 183549 -51455 -319194
5287 -319194 -291064 122284 86224 251436 -27790 248691 -274987 -171995 154162 107284
5277 107284 186152 16559 52090 -235765 -53904 80207 -58866 103117 -98031 -92093 267461
5265 21093 -2779 506314 -219677 -115150 54448 165207 231942 106949 -31712 150991 -45341
5253 184726 -68457 -1117 213086 -135063 326953 193628 171129 190060 -428096 135601 -218613
5241 -33204 -79965 -3248 -185119 241465 -16900 481821 63525 -183457 -110843 107937 9421
5229 126320 120061 -4181 -380385 348732 23443 26486 -210139 108577 -345278 -388395 -15565
5217 -124422 12400 47296 40119 91364 198443 -234904 -125235 65919 42522 -31595 -202186
5206 -202186 217933 -90028 -310965 75289 -27804 258027 113482 144173 116482 17620 -192726
5194 2333 4548 -28193 -168421 -242816 123273 234843 233324 -58368 71621 -237622 -37994 74904
5181 15438 -91750 -184323 -30886 74842 216415 166253 8149 340273 -88899 -148649 33454 -25518
5168 37101 -104700 65501 354249 -114191 332044 -93221 -85612 214689 -95485 36719 135750
5157 135750 -164637 -187981 -48265 -211963 -268864 97798 -254986 1595 -142769 -75247 28710
5145 110075 96850 26135 72398 -465686 -8962 2870 -102113 -70873 -79878 -207127 -126082 149762
5132 264898 -193192 66304 -287831 41202 39550 -238697 113572 17542 -5752 -101515 -241671
5121 -241671 -49492 217287 112261 97143 112443 -63443 54436 -157364 -26104 134220 -46238
5109 -228838 166643 231236 -7723 -46170 327854 175278 116261 61251 -209084 401451 69124
5097 -342853 22730 -204565 76616 -33791 66511 78213 20820 18026 90047 174865 226777 156204
5085 156204 -231111 157836 104679 166865 204068 -113206 464341 71633 -77980 -124502 -48950
5073 152097 -323167 -11443 -31947 124704 -1973 -15235 19116 41401 -37605 62819 116655
5062 116655 -45407 -199327 -12274 -240698 -61023 326389 161749 55118 -203233 150291
5051 -151519 -222750 -130639 -267467 435895 86960 -7063 51131 24311 -126098 83417 125374
5040 125374 327803 -125090 -237151 23737 -9013 36073 57884 28770 -99819 -34442 -92368
5029 -92368 -167070 365829 221033 94458 305972 -419447 119906 -192339 -138956 -217347 336232
5017 -2817 3498 174329 17773 40291 28406 70199 305786 354851 -5551 -264145 -42320 -387170
5005 -387170 139131 176538 52185 -185689 -152322 97483 -7472 -54180 -119383 -16014 57311
4993 -15019 -113192 -287507 57113 -286821 69311 -95943 14133 -93424 -175950 -217314 -286834
4982 -286834 -128391 111201 -107023 -66006 318890 -99343 -21512 102761 -18072 86512 -154478
4970 -52710 121858 14983 -319879 107518 -173554 184014 -210283 -104323 79078 104678
4960 104678 39912 -108776 -3773 230316 133801 -215844 179282 25619 -179424 102011 -22905
4948 -19304 -144503 -50315 22736 180962 87839 -63377 -39357 -22136 -50763 -62378 306280
4936 -50242 208469 -10307 -32392 -48179 -60538 -197229 96183 -164285 144080 -71362 71486
4924 -1363 41226 -85326 -73513 230343 -333130 -70782 -152201 -227756 -822 171019 38255 -26254
4911 323008 -186644 -47291 51344 5626 -4719 119349 -325218 -24728 -218920 -57951 -80188
4900 -80188 -66656 -20767 -224764 -3244 -234341 -110777 -67757 34303 104943 -102496 -21826
4888 6181 186923 -145238 203304 -9504 42541 191120 -205202 -127833 -164943 -20291 -144580
4877 -144580 1554 105358 191721 -113027 -21184 69744 56230 231417 40430 -247411 146602
4865 -126486 210337 298536 321981 -254174 300925 107973 -272457 -97205 -124054 -133610 -80602
4854 -80602 113267 257686 400394 -61531 -138120 -34000 -170423 -240763 212438 -168301 154027
4842 -74815 124348 176830 -61312 123116 -25805 21340 -17097 81246 -18371 56852 -31982
4830 280836 -38100 367837 91716 -201008 -74334 163596 188698 -76510 175670 61059 301349
4819 301349 -362389 214173 -71861 115583 -200050 182989 125585 -187243 47584 67627
4809 67627 -566831 88382 -116470 55018 202585 -39028 21424 240061 433215 -52169 66126
4797 251613 186100 134672 -144822 -132110 5966 -29684 -57684 177824 -107559 120640 400996
4786 400996 -74031 -290722 9201 15911 66998 -242912 7279 -1153 -38373 -85048 -39608 44528
4773 -116240 29911 8934 358425 -14267 -289009 -130254 -84433 -246762 33865 90591 -186767
4761 -186994 -62345 -149687 -162192 -113919 11604 -73914 -77366 325577 325581 54278 300418 80152
4748 111250 333295 171 91780 200663 31293 77320 -161413 -119176 -195999 224737 20354
4736 -35684 -198377 -119512 -164264 -213364 -96703 -365351 -122042 79629 -348310 283921 129811
4724 360123 -61741 -5827 289759 178644 125530 74914 37171 -149714 -340823 178469 -182093
4712 113235 101391 -251538 -199516 -21012 -113632 43604 -13479 -49309 216317 158855 -147785
4700 64908 -213442 119887 170189 7428 142723 -443566 -27183 -190145 -99936 -181625 -46843
4688 144335 5919 31414 -193522 -85183 -228846 151804 -145084 -128880 -27245 -167911 -2654
4676 -30125 -80978 397487 -136431 -47212 124855 -48900 190253 41681 152315 -133230 43516
4664 108374 263515 201892 -362058 -4294 54066 -75993 173356 -58201 55746 2513 241851
4653 241851 22953 -116414 -216005 368355 -135779 -138384 -121715 143013 -220319 -53798 -202368
4642 -202368 340779 109013 -339417 -271290 -165757 19762 235414 162888 -42083 231513
4631 335978 71881 7407 33822 53246 -5604 62115 -89609 -23581 -110685 51127 -143046 346242
4618 230828 8505 126384 159831 -37113 -41280 -138087 123915 -31440 -167965 -214595 -103017
4606 -81789 -44589 235800 -390931 -159142 21849 -156817 34584 79546 38767 -25940 56108
4594 -52271 -296246 -84487 186726 98903 -28534 90762 149051 -119876 81774 13844 -182556
4582 156298 -36274 -131992 -159428 -81382 -102041 24556 -12605 -157529 473505 142326 -358836
4570 72215 -40433 138476 90195 199294 47883 -379379 -148310 -242352 -71260 -111204 -113587
4559 -113587 113552 -127310 115684 -272436 617738 -213925 60068 495723 -201606 192434
4548 -108841 -35640 31319 -307638 139912 -21749 -142222 -142133 133469 90951 211638 -270708
4536 274214 -2321 210341 -91494 39317 -203905 211264 160299 -87468 120979 -57355 260361
4524 213057 270718 260300 118471 102315 169567 -421055 96487 -408972 111586 -94016 86583
4512 64033 -321249 -28526 -152506 -173947 121916 489768 -43380 -155622 -67384 -52850 70790
4500 298134 77801 -141252 -239272 86165 127142 -92883 -247082 53722 -51673 -170632 222359
4488 -23779 73263 207219 2464 177005 -63780 -127150 -111108 310996 166357 101412 -64619
4476 436447 159870 36731 -237648 -335975 5556 204438 -325156 -15221 55868 67488 92923
$$ [...]
##END NTUPLES=NMR SPECTRUM
##END=
