
##TITLE=AC1256_INDRH11073_6533999_sNlIztne0f
##JCAMPDX= 6.0         $$ Bruker NMR JCAMP-DX V2.0
##DATA TYPE= NMR SPECTRUM
##DATA CLASS= NTUPLES
##ORIGIN= BRUKER
##OWNER= Administrator
$$ 1.72 TOPSPIN		Version 2.1
$$ 2012-07-16 22:15:09.171 -0500  Administrator@TOPSPIN
$$ Compression mode = diff/dup
##.OBSERVE FREQUENCY= 400.02188249412
##.OBSERVE NUCLEUS= ^1H
##.ACQUISITION MODE= SIMULTANEOUS (DQD)
##.ACQUISITION SCHEME= undefined
##.AVERAGES= 64
##.DIGITISER RES= 22
##SPECTROMETER/DATA SYSTEM= spect
##.PULSE SEQUENCE= noesygpps1d.comp
##.SOLVENT NAME= COFFEE_meoh
##.SHIFT REFERENCE= INTERNAL, COFFEE_meoh, 1, 14.96088
##AUDIT TRAIL= $$ (NUMBER, WHEN, WHO, WHERE, PROCESS, VERSION, WHAT)
$$ ##TITLE= Audit trail, TOPSPIN		Version 2.1
$$ ##JCAMPDX= 5.01
$$ ##ORIGIN= Bruker BioSpin GmbH
$$ ##OWNER= Administrator
$$ $$ C:\Bruker\TOPSPIN/data/COFFEE/nmr/AC1256_INDRH11073_6533999_sNlIztne0f/12/pdata/1/auditp.txt
$$ ##AUDIT TRAIL=  $$ (NUMBER, WHEN, WHO, WHERE, PROCESS, VERSION, WHAT)
(   1,<2012-07-16 22:15:04.140 -0500>,<Administrator>,<TOPSPIN>,<go>,<TOPSPIN 2.1>,
      <created by zg
	started at 2012-07-16 22:03:33.906 -0500,
	POWCHK enabled, PULCHK disabled,
       configuration hash MD5:
       6B 1B 68 BB D9 2E 58 E2 7F 35 AD 54 07 DF 0E 41
       data hash MD5: 64K
       9F 06 28 C8 0E E5 BB 21 1F 66 BD 31 57 9A 9B D2>)
(   2,<2012-07-16 22:15:06.828 -0500>,<Administrator>,<TOPSPIN>,<proc1d>,<TOPSPIN 2.1>,
      <Start of raw data processing
       efp LB = 0.3 FT_mod = 6 PKNL = 1 PHC0 = 0 PHC1 = 0 SI = 128K 
       data hash MD5: 128K
       12 14 50 CE BC A0 BF 43 5C 55 2D 33 CA 9F B9 E0>)
(   3,<2012-07-16 22:15:08.000 -0500>,<Administrator>,<TOPSPIN>,<proc1d>,<TOPSPIN 2.1>,
      <pk PHC0 = 0.9942627 PHC1 = 0 
       data hash MD5: 128K
       D3 F6 86 40 98 97 53 8E 1E 80 74 A4 7C 7D 44 E1>)
(   4,<2012-07-16 22:15:08.828 -0500>,<Administrator>,<TOPSPIN>,<proc1d>,<TOPSPIN 2.1>,
      <abs ABSG = 1 
       data hash MD5: 128K
       EB A5 51 CF 63 05 C7 5E B3 7B A5 E7 AC 43 5D 76>)
(   5,<2012-07-16 22:15:08.921 -0500>,<Administrator>,<TOPSPIN>,<proc1d>,<TOPSPIN 2.1>,
      <abs ABSG = 2 
       data hash MD5: 128K
       59 3C A6 45 C0 93 3E 6F D1 84 5C A0 55 E2 D9 90>)
(   6,<2012-07-16 22:15:08.984 -0500>,<Administrator>,<TOPSPIN>,<proc1d>,<TOPSPIN 2.1>,
      <abs ABSG = 3 
       data hash MD5: 128K
       C8 AB AE 11 4C 15 A6 47 D2 07 5A 35 57 E2 A4 A9>)
(   7,<2012-07-16 22:15:09.046 -0500>,<Administrator>,<TOPSPIN>,<proc1d>,<TOPSPIN 2.1>,
      <abs ABSG = 4 
       data hash MD5: 128K
       2C AE 66 92 6B 32 5E 66 C7 45 CA CA C5 69 0A 4E>)
(   8,<2012-07-16 22:15:09.093 -0500>,<Administrator>,<TOPSPIN>,<proc1d>,<TOPSPIN 2.1>,
      <abs ABSG = 5 
       data hash MD5: 128K
       E8 36 22 5D 20 8D C0 D7 9E 30 41 25 83 8D 9D E3>)
$$ ##END=
$$ 
$$ $$ hash MD5
$$ $$ 65 D7 1E 09 D3 59 0B EC 65 BE 9A 56 D9 E3 E8 76
##$RELAX= 
##$RELAX= 
##$RELAX= 
##$RELAX= 
##$RELAX= 
##$RELAX= 
##$RELAX= 
##$RELAX= 
$$ Bruker specific parameters
$$ [...]
##$TP07= 0
##$TPNAME0= <>
##$TPNAME1= <>
##$TPNAME2= <>
##$TPNAME3= <>
##$TPNAME4= <>
##$TPNAME5= <>
##$TPNAME6= <>
##$TPNAME7= <>
##$TPOAL= (0..7)
0.5 0.5 0.5 0.5 0.5 0.5 0.5 0.5
##$TPOFFS= (0..7)
0 0 0 0 0 0 0 0
##$TUNHIN= 0
##$TUNHOUT= 0
##$TUNXOUT= 0
##$USERA1= <user>
##$USERA2= <user>
##$USERA3= <user>
##$USERA4= <user>
##$USERA5= <user>
##$V9= 5
##$VALIST= <valist>
##$VCLIST= <CCCCCCCCCCCCCCC>
##$VD= 0
##$VDLIST= <DDDDDDDDDDDDDDD>
##$VPLIST= <PPPPPPPPPPPPPPP>
##$VTLIST= <TTTTTTTTTTTTTTT>
##$WBST= 2048
##$WBSW= 25
##$XGAIN= (0..3)
0 0 0 0
##$XL= 0
##$YL= 0
##$YMAX_a= 10811607
##$YMIN_a= -7916616
##$ZGOPTNS= <>
##$ZL1= 120
##$ZL2= 120
##$ZL3= 120
##$ZL4= 120
##$ABSF1= 14.96088
##$ABSF2= -5.597301
##$ABSG= 5
##$ABSL= 3
##$ALPHA= 0
##$AQORDER= 0
##$ASSFAC= 0
##$ASSFACI= 0
##$ASSFACX= 0
##$ASSWID= 0
##$AUNMP= <proc_prof1d_extract.lims>
##$AXLEFT= 0
##$AXNAME= <>
##$AXNUC= <1H>
##$AXRIGHT= 0
##$AXTYPE= 0
##$AXUNIT= <>
##$AZFE= 0.1
##$AZFW= 0.1
##$BCFW= 0
##$BC_mod= 0
##$BYTORDP= 0
##$COROFFS= 0
##$CY= 15
##$DATMOD= 1
##$DC= 0
##$DFILT= <>
##$DTYPP= 0
##$F1P= 0
##$F2P= 0
##$FCOR= 0.5
##$FTSIZE= 131072
##$FT_mod= 6
##$GAMMA= 0
##$GB= 0
##$INTBC= 1
##$INTSCL= 1
##$ISEN= 128
##$LB= 0.3
##$LEV0= 0
##$LPBIN= 0
##$MAXI= 10000
##$MC2= 0
##$MEAN= 0
##$ME_mod= 0
##$MI= 0
##$NCOEF= 0
##$NC_proc= -2
##$NLEV= 6
##$NOISF1= 0
##$NOISF2= 0
##$NSP= 0
##$NTH_PI= 0
##$NZP= 0
##$OFFSET= 14.96088
##$PC= 1
##$PHC0= 0.9942627
##$PHC1= 0
##$PH_mod= 1
##$PKNL= yes
##$PPARMOD= 0
##$PPDIAG= 0
##$PPIPTYP= 0
##$PPMPNUM= 2147483647
##$PPRESOL= 1
##$PSCAL= 4
##$PSIGN= 0
##$PYNMP= <proc.py>
##$REVERSE= no
##$SF= 400.020009684771
##$SI= 131072
##$SIGF1= 0
##$SIGF2= 0
##$SINO= 400
##$SIOLD= 131072
##$SPECTYP= <>
##$SREGLST= <1H.CDCl3>
##$SSB= 0
##$STSI= 131072
##$STSR= 0
##$SW_p= 8223.68421052631
##$SYMM= 0
##$S_DEV= 0
##$TDeff= 65536
##$TDoff= 0
##$TI= <>
##$TILT= no
##$TM1= 0
##$TM2= 0
##$TOPLEV= 0
##$USERP1= <user>
##$USERP2= <user>
##$USERP3= <user>
##$USERP4= <user>
##$USERP5= <user>
##$WDW= 1
##$XDIM= 131072
##$YMAX_p= 414981144
##$YMIN_p= -12511
##$CURPLOT= <Network HP LaserJet P1505>
##$CURPRIN= <$Network HP LaserJet P1505>
##$DFORMAT= <normdp>
##$LAYOUT= <+/1D_H.xwp>
##$LFORMAT= <normlp>
##$PFORMAT= <normpl>
##$SURQMSG= 1
$$ End of Bruker specific parameters
$$ ---------------------------------
##NTUPLES= NMR SPECTRUM
##VAR_NAME=  FREQUENCY,     SPECTRUM/REAL,   SPECTRUM/IMAG
##SYMBOL=    X,             R,               I
##VAR_TYPE=  INDEPENDENT,   DEPENDENT,       DEPENDENT
##VAR_FORM=  AFFN,          ASDF,            ASDF
##VAR_DIM=   131072,        131072,          131072
##UNITS=     HZ,            ARBITRARY UNITS, ARBITRARY UNITS
##FACTOR=    0.0627417313425164, 1,          1
##FIRST=     8223.62146879497, 1038,         -49263
##LAST=      0,             2376,            -49131
##MIN=       0,             -12511,          0
##MAX=       8223.62146879497, 414981144,    0
$$ Real data points
##PAGE= N=1
##DATA TABLE= (X++(R..R)), XYDATA
$$ [...]
63907B176242j71725j65457j56642j45945j34060j21645j09547r8353q7855p7467
63897I07546o7177n7651m9508m2865l7490l2978k8886k5048k1735j9174j7089
63886E07945j5065j3160j1707j0638r580q529p868p639p300o400n088l812k826
63873C98333k048j178J26J851L464M465N070N962P390R048J0815J2946J5376J7417
63859D89037J8606J9321K0213K1393K2606K3862K5349K6947K8232K8899K8864
63848G53329K8130K6844K5334K3694K1542J8477J4746J1033P703M485Q53l533
63836I32637q576j3579j7492j9785k1034k2297k3984k5707k7152k8468k9675l0220
63824F64668k9534k7707k5351k3014k1013j9613j8930j8652j8216j7382j6517
$$ y = [2176242, 2004517, 1839060, 1682418, 1536473, 1402413, 1280768, 1171221, 1072868, 985013, 907546, 840369, 782718, 733210, 690345, 652855, 619877, 590991, 565943, 544208, 525034, 507945, 492880, 479720, 468013, 457375, 447795, 439266, 431398, 423759, 416459, 410059, 404971, 401159, 398333, 396285, 395107, 395233, 397084, 400548, 405013, 410083, 416045, 423435, 432483, 443298, 456244, 471620, 489037, 507643, 526964, 547177, 568570, 591176, 615038, 640387, 667334, 695566, 724465, 753329, 781459, 808303, 833637, 857331, 878873, 897350, 912096, 923129, 930832, 935317, 936170, 932637, 924061, 910482, 892990, 873205, 852171, 829874, 805890, 780183, 753031, 724563, 694888, 664668, 635134, 607427, 582076, 559062, 538049, 518436, 499506, 480854, 462638, 445256, 428739]
63813D28739j6134j6166j5895j4689j2782j1103j0282j0007r505q446p166o124
63801B90440n450n021m703m441m252m213m319m444m475m351l881k755j133O6m4
63786B37024j220k259k347j822j434j380j374j282j236j232j045n95k00l02r67
63771B18329j688j838j376r40j006j152o15M80J059M75n81r36l38M66P69M96j10
63754B11494q04j231r54J2R11Q77o8q95o91K59R09Q72Q70J453J999J672R18R65
63736B18568J880K283J360J59J59J353K540K964K758K177J374R34J637L454N355
63721B48955O415O626O577O687O953P080O687N619M197K923J988J200L39o90j958
63706C09598l401m637n250n212m806m211l470k766k322k034j634j127p32l98J51
$$ y = [428739, 412605, 396439, 380544, 365855, 353073, 341970, 331688, 321681, 312176, 303730, 296564, 290440, 284990, 279969, 275266, 270825, 266573, 262360, 258041, 253597, 249122, 244771, 240890, 238135, 237002, 237068, 237024, 235804, 233545, 231198, 229376, 227942, 226562, 225188, 223906, 222670, 221438, 220393, 219798, 219598, 219296, 218329, 216641, 214803, 213427, 212487, 211481, 210329, 209714, 210194, 211253, 211728, 211147, 210211, 209873, 210339, 211108, 211604, 211494, 210690, 209459, 208505, 208517, 209428, 210305, 210237, 209342, 208651, 208910, 209819, 210691, 211561, 213014, 215013, 216685, 217603, 218568, 220448, 222731, 224091, 224250, 224409, 225762, 228302, 231266, 234024, 236201, 237575, 238509, 240146, 243600, 248955, 255370, 261996, 268573, 275260, 282213, 289293, 295980, 301599, 305796, 308719, 310707, 311907, 312246, 311556, 309598, 306197, 301560, 296310, 291098, 286292, 282081, 278611, 275845, 273523, 271489, 269855, 268728, 267996, 267598, 267749]
63691B67749Q73J370J461J402J381J291J100J105J492J942J952J398O72L06N47
63676B86041J164J698J999K368K994L546L684L746M313N200N563N112M586M653
63662C36667M922M459L028J372L25q5o02j879l660n029n510n585n858o140n932
63647C10493n404n147n108m684l806l063k598j880p97k2J71N36J664K959L536
63632B86850L498L536L784L943M155M902O111P079P239O620N708N299O103P968
63618C62795R743J0528J0730J1331J2484J3610J4631J6197J8594K1264K3614K5669
63606E51190K7776L0081L2531L4915L6682L7074L5597L2185K7018K0459J3129
63595H78637N726j201p049j0996j2622j2570j2162j2266j2904j3810j4870j6093
$$ y = [267749, 268622, 269992, 271453, 272855, 274236, 275527, 276627, 277732, 279224, 281166, 283118, 284516, 285188, 285494, 286041, 287205, 288903, 290902, 293270, 296264, 299810, 303494, 307240, 311553, 316753, 322316, 327428, 332014, 336667, 341589, 346048, 349076, 350448, 350773, 350688, 350086, 348207, 344547, 339518, 334008, 328423, 322565, 316425, 310493, 305089, 299942, 294834, 290150, 286344, 283281, 280683, 278803, 278006, 277984, 278155, 278691, 280355, 283314, 286850, 290348, 293884, 297668, 301611, 305766, 310668, 316779, 323858, 331097, 337717, 343425, 348724, 354827, 362795, 372538, 383066, 393796, 405127, 417611, 431221, 445852, 462049, 480643, 501907, 525521, 551190, 578966, 609047, 641578, 676493, 713175, 750249, 785846, 818031, 845049, 865508, 878637, 884363, 883162, 876113, 865117, 852495, 839925, 827763, 815497, 802593, 788783, 773913, 757820]
63583G57820j7562j9408k1340k2464k2111k0769j9542j8727j7557j5360j2304
63572E50676q946n843l636k659k235j153Q18K652L627M296N334O333O606O507
63558E62377O898P708Q082P861P844Q461R127R361R815J1614J4982J9146K3473
63545G06749K8158L3641L9669M5272M9471N1591N0703M5373L4764K0203N066p291
63533A103369j5399j9605k0855k0056j8150j6001j4038j2408j1482j1912j3994
63522I29469j7240k0678k3508k5561k7205k8759k9933l0048k8951k7377k6023
63511F44186k4603k2329j9186j6107j3842j2234j0861r792r339r430r614r514
63499D77335q897p643o010m753m458m796m866m313l621l301l222l008k686k549
$$ y = [757820, 740258, 720850, 699510, 677046, 654935, 634166, 614624, 595897, 578340, 562980, 550676, 541730, 535887, 532251, 529592, 527357, 526204, 527022, 529674, 533301, 537597, 542931, 549264, 555870, 562377, 569275, 576983, 585065, 592926, 600770, 609231, 618358, 627719, 637534, 649148, 664130, 683276, 706749, 734907, 768548, 808217, 853489, 902960, 954551, 1005254, 1050627, 1085391, 1105594, 1110660, 1103369, 1087970, 1068365, 1047510, 1027454, 1009304, 993303, 979265, 966857, 955375, 943463, 929469, 912229, 891551, 868043, 842482, 815277, 786518, 756585, 726537, 697586, 670209, 644186, 619583, 597254, 578068, 561961, 548119, 535885, 525024, 515232, 505893, 496463, 486849, 477335, 468438, 460795, 454785, 450032, 445574, 440778, 435912, 431599, 427978, 424677, 421455, 418447, 415761, 413212]
63485D13212k590k427j806q55J02Q83J532K228L086L938M452M581M689N032N242
63470D41299M715L416J927O61n77k074l646m830n414n539n447n360n449n677n784
63455D02221n615n277m858m157l019j739q14k88K17Q84J435J707K129L289N134
63440C91249O909P949Q348Q747R645J1203J3574J7042K1648K6934L2271L7062
63428E92581M0258M0185L5692K7614J8440J0374M212M7j841j313J220N350J1049
63415G83868J7877K4432K9513L3394L6992L9946M0613L7935L2274K4402J4844
63404A116090M612m455j0926j4848j7041j7913j7584j6716j6374j7158j8941k1423
63392I47323k4384k7430k9857l1045l0850k9658k8096k6521k4711k2285j9456
$$ y = [413212, 410622, 408195, 406389, 405534, 405636, 406519, 408051, 410279, 413365, 417303, 421755, 426336, 431025, 436057, 441299, 446014, 449430, 451357, 452018, 451441, 449367, 445721, 440891, 435477, 429938, 424491, 419131, 413682, 408005, 402221, 396606, 391329, 386471, 382314, 379295, 377556, 376742, 376454, 376671, 377555, 378990, 380697, 382826, 386115, 391249, 398158, 406107, 414455, 423202, 432847, 444050, 457624, 474666, 496314, 523248, 555519, 592581, 632839, 673024, 708716, 736330, 754770, 765144, 769356, 769403, 767562, 766249, 767469, 772819, 783868, 801745, 826177, 855690, 889084, 926076, 966022, 1006635, 1044570, 1076844, 1101246, 1116090, 1120702, 1116247, 1105321, 1090473, 1073432, 1055519, 1037935, 1021219, 1004845, 987687, 968746, 947323, 922939, 895509, 865652, 834607, 803757, 774099, 746003, 719482, 694771, 672486, 653030]
63381F53030j7015j5358j3883j1786r199p042n792m861l373j255P72K190L396
63368E69824N164P506R469J0302J0554J1478J3483J5691J7181J8100J9323K1412
63356G29487K4312K7680L1142L4328L7006L9124M0519M0700L9105L5404K9503
63345A108310K1632J2624L785l900j0247j5355j8923k0564k0582j9935j9419j9294
63333I98132j9668k0755k2601k4814k6871k8521k9764l0437l0084k8382k5731
63322G10504k3046k0653j7649j2923o793r68L267N990P313O090J097o755j4574
63309F30900k0008k2743k3403k2175j9263j5872j3511j2422j1548j0163q808q311
63297D42673q538q639q220p694p524p587p489p078o467n773n165m886m975n030
$$ y = [653030, 636015, 620657, 606774, 594988, 585789, 578747, 572955, 568094, 564721, 563466, 564238, 566428, 569824, 574988, 582494, 591963, 602265, 612819, 624297, 637780, 653471, 670652, 688752, 708075, 729487, 753799, 781479, 812621, 846949, 883955, 923079, 963598, 1004298, 1043403, 1078807, 1108310, 1129942, 1142566, 1146351, 1142451, 1132204, 1116849, 1097926, 1077362, 1056780, 1036845, 1017426, 998132, 978464, 957709, 935108, 910294, 883423, 854902, 825138, 794701, 764617, 736235, 710504, 687458, 666805, 649156, 636233, 629440, 628472, 631739, 637729, 645042, 651132, 652229, 645474, 630900, 610892, 588149, 564746, 542571, 523308, 507436, 493925, 481503, 469955, 459792, 450984, 442673, 434135, 425496, 417276, 409582, 402058, 394471, 386982, 379904, 373437, 367664, 362499, 357613, 352638, 347608]
63283C47608m611l806l125k895l044l331l466l096k192j429j562k400k894k430
63269C07327j448n92P3N69N09k89j178j442j286j389j719j668j172p68n59n9P42
63252B95651J030L91l66k03P72J555J522R30K74k01m21l24J1L85P41J228J921
63235C04896K591K899K762K438K221K156K148K259K648L146L216K573J701J406
63221C39060J931K745L192L010K334J598J416K142L337M065L915L383L106L110
63207C78344L032K741K266J448J93j086j772j817j719j703j466q79l92l60l76
63192C76454K53J552K984M253N492O644P360P686Q239R344J0545J1396J2180J3232
63178D77614J3976J3572J2350J1617J1952J2556J2564J2131J1722J1170J0150
$$ y = [347608, 342997, 339191, 336066, 333171, 330127, 326796, 323330, 320234, 318042, 316613, 315051, 312651, 309757, 307327, 305879, 305287, 305360, 305929, 306438, 306149, 304971, 303529, 302243, 300854, 299135, 297467, 296295, 295527, 294968, 294909, 295651, 296681, 297072, 296706, 296503, 297275, 298830, 300352, 301282, 301556, 301355, 300934, 300610, 300621, 301006, 301747, 302975, 304896, 307487, 310386, 313148, 315586, 317807, 319963, 322111, 324370, 327018, 330164, 333380, 335953, 337654, 339060, 340991, 343736, 346928, 349938, 352272, 353870, 355286, 357428, 360765, 364830, 368745, 372128, 375234, 378344, 381376, 384117, 386383, 387831, 388024, 386938, 385166, 383349, 381630, 379927, 378461, 377582, 377190, 376830, 376454, 376707, 378259, 381243, 385496, 390988, 397632, 404992, 412678, 420917, 430261, 440806, 452202, 464382, 477614, 491590, 505162, 517512, 529129, 541081, 553637, 566201, 578332, 590054, 601224, 611374]
63167F11374R049Q475Q228P554O233M655K867L38l070o591r343j1306j3180j5489
63153E99794j8016j9966k0622j9905j8402j6737j5099j3447j1936j0772r890r057
63141D15945q242p477o597n509m537l973l465k464j187m65n27o34j16Q64J826
63126C73442K630L213L306K903K608L017L964M865N519O122O641O706O178N444
63112D36558N038N100N327N292M923M550M485M584M536M428M612N057N324N324
63098E05138N596O461P440P879P839P873Q236Q727R163R468R435Q691P044M636
63084F13626J944l71j895k923m070n344o091o195o615q117j0047j1121j1030j0416
63070E31335r587q311o780n676n081m348l281k603k751l034k573j429k19Q55J933
$$ y = [611374, 620423, 628898, 637126, 644680, 650913, 655568, 658435, 658773, 655703, 649112, 639769, 628463, 615283, 599794, 581778, 561812, 541190, 521285, 502883, 486146, 471047, 457600, 445664, 434892, 425002, 415945, 407703, 400226, 393629, 388120, 383583, 379610, 376145, 373681, 372494, 372029, 371502, 370868, 370752, 371616, 373442, 376072, 379285, 382591, 385494, 388102, 391119, 395083, 399948, 405467, 411589, 418230, 424936, 431114, 436558, 441596, 446696, 452023, 457315, 462238, 466788, 471273, 475857, 480393, 484821, 489433, 494490, 499814, 505138, 510734, 517195, 524635, 532514, 540353, 548226, 556462, 565189, 574352, 583820, 593255, 601946, 608990, 613626, 615570, 615199, 613304, 610381, 606311, 600967, 594876, 588681, 582066, 573949, 563902, 552781, 541751, 531335, 521748, 513437, 506657, 500981, 495900, 491552, 488271, 485668, 482917, 479883, 477310, 475881, 475662, 476517, 478450]
63055D78450K921L625M258N103N977O509O870P612Q839J0072J0909J1346J1397
63042E73888J0955J0164R544R500R943J0447J0643J0459J0194J0341J1015J1571
63030F98664J1130R597P820O628N975N218L920K197L63j462l451n790q264j0164
63016G22381j0820j0337r541r085q789q048o610m736k784r45O77K116L717N928
63002F63124Q769J1628J3783J5040J5767J6383J6958J7440J8038J9077K0347K0929
62990H57283K0086J8303J7008J7082J7999J8603J8393J7584J6272J4194J1283
62979A044090P878M187Rm784r819j4606j8963k2827k5940k8111k9582l0689l1281
62966H39562l0959k9797k8362k6945k5237k2979k0510j8377j6721j5347j4219
$$ y = [478450, 481371, 484996, 489254, 494357, 500334, 506843, 513713, 521325, 530164, 540236, 551145, 562491, 573888, 584843, 595007, 604551, 614051, 623994, 634441, 645084, 655543, 665737, 676078, 687093, 698664, 709794, 719391, 727211, 733839, 739814, 745032, 748952, 751149, 751512, 750050, 746599, 740809, 732545, 722381, 711561, 701224, 691683, 682598, 673809, 665761, 659151, 654415, 651631, 650686, 651363, 653479, 657196, 663124, 671893, 683521, 697304, 712344, 728111, 744494, 761452, 778892, 796930, 816007, 836354, 857283, 877369, 895672, 912680, 929762, 947761, 966364, 984757, 1002341, 1018613, 1032807, 1044090, 1051968, 1056155, 1056164, 1051380, 1041561, 1026955, 1007992, 985165, 959225, 931114, 901532, 870843, 839562, 808603, 778806, 750444, 723499, 698262, 675283, 654773, 636396, 619675, 604328, 590109]
62955E90109j3360j2463j1068r319q091q104r115j0248j0910j1101j0914j0243
62943D65173r133q141p952q574r205r061q231p506p308p090o016m133k511k107
62929C68205k796l733m280m261l627k459j292p68q28q28n91p31j548k318k264
62914C35881j714j434j249l66J052J794J341O95Q72J430J275L73k33J06R46J576
62898C42345J892K269L007M099N316O366P113P701Q348Q961R139Q526P165N536
62884D27783M218L441K886K045Q03n22j711k874m087n140n856o339o651o593o090
62869C95313n558n423n526n339m726m087l867m174m810n333n246m430l341k509
62855C30944j981j515j053p11m13k3L38M77N14O80Q36O10Nn37o12j30P38J468
$$ y = [590109, 576749, 564286, 553218, 543899, 535808, 527704, 518589, 508341, 497431, 486330, 475416, 465173, 456040, 447899, 439947, 431373, 422168, 413107, 404876, 397370, 390062, 382972, 376956, 372823, 370312, 368205, 365409, 361676, 357396, 353135, 349508, 347049, 345757, 344989, 344161, 343333, 342742, 342011, 340463, 338145, 335881, 334167, 332733, 331484, 331118, 332170, 333964, 335305, 336000, 336872, 338302, 339577, 339950, 339717, 339823, 340769, 342345, 344237, 346506, 349513, 353612, 358928, 365294, 372407, 380108, 388456, 397417, 406556, 415082, 422247, 427783, 432001, 435442, 438328, 440373, 441176, 440654, 438943, 436069, 431982, 426842, 420986, 414647, 407996, 401403, 395313, 389755, 384332, 378806, 373467, 368741, 364654, 360787, 356613, 351803, 346470, 341224, 336794, 333453, 330944, 328963, 327448, 326395, 325684, 325271, 325248, 325586, 326063, 326577, 327257, 328093, 328703, 328708, 328171, 327559, 327429, 328167, 329635]
62837C29635J338K17r08q83K17J226J436J246J201J162Q14L20K8p3j25j5M04R16
62819C38156J153J053Q34O86O55O60N09P9m53p69q56j017j349j558j364q58l55
62802C35206j31k63m92k94M74J234J458J580K346L379L389J994M00k34j22%K26
62785C50150J061K286L181L604M055M879O016P391Q877J0066J0705J1223J2206
62772D35700J3515J4471J4772J4597J3951J2588J0638Q662O965N299L420J430
62760E56008n68k738n184p637r586j0662j0900j0736j0644j0739j0819j0891j1165
62747D43739j1425j0934r475p977p474p797p952p524o927o479o029n510n048m466
62733C38722l489k447k043k221k082j222l43r7o7M67J309J634J260R61J493K756
$$ y = [329635, 330973, 331190, 330282, 329399, 329616, 330842, 332278, 333524, 334725, 335887, 336701, 337021, 337049, 336976, 336851, 336836, 337240, 338156, 339309, 340362, 341196, 341882, 342537, 343197, 343706, 343785, 343332, 342563, 341707, 340690, 339341, 337783, 336419, 335561, 335206, 335075, 334812, 334320, 334026, 334500, 335734, 337192, 338772, 341118, 344497, 347886, 349880, 350280, 350046, 349924, 349924, 350150, 351211, 353497, 356678, 360282, 364337, 369216, 375232, 382623, 391500, 401566, 412271, 423494, 435700, 449215, 463686, 478458, 493055, 507006, 519594, 530232, 538894, 545859, 551158, 554578, 556008, 555440, 552702, 547518, 539881, 530295, 519633, 508733, 497997, 487353, 476614, 465795, 454904, 443739, 432314, 421380, 411905, 403928, 396454, 388657, 380705, 373181, 366254, 359775, 353746, 348236, 343188, 338722, 335233, 332786, 330743, 328522, 326440, 325218, 324875, 324778, 324711, 325178, 326487, 328121, 329381, 330342, 331835, 334591]
62717C34591L968M426M109L671L782M412M938M964M831N203O407Q268J0328J2088
62703D15986J3357J4532J6270J8703K1226K3263K4953K6763K8744L0538L2005
62692F66340L3441L5130L6953L8489L9296L9055L7536L4642L0448K5235J9389
62681A035954J3201O725j45p386j4670k1417k7068l1421l4725l7316l9119l9759
62669H02854l9208l8003l6544l4586l1825k8719k6139k4286k2565k0527j8386
62658D82066j6425j4497j2455j0660r631r282q954q152p052o238o010o076n945
62645C60689n530n168n051m890m352l487k499j410l32L61N59P76J394J942J791
62630C34793J257J050R33K7j501k312j779q50n48o85p55j047j914k721k611j862
$$ y = [334591, 338559, 342985, 347094, 350765, 354547, 358959, 363897, 368861, 373692, 378895, 385302, 393570, 403898, 415986, 429343, 443875, 460145, 478848, 500074, 523337, 548290, 575053, 603797, 634335, 666340, 699781, 734911, 771864, 810353, 849649, 888704, 926240, 960882, 991330, 1016565, 1035954, 1049155, 1055880, 1055735, 1048349, 1033679, 1012262, 985194, 953773, 919048, 881732, 842613, 802854, 763646, 725643, 689099, 654513, 622688, 593969, 567830, 543544, 520979, 500452, 482066, 465641, 451144, 438689, 428029, 418398, 409116, 400162, 392010, 384958, 378720, 372710, 366634, 360689, 355159, 349991, 344940, 340050, 335698, 332211, 329712, 328302, 327970, 328331, 328890, 329666, 331060, 333002, 334793, 336050, 337100, 338033, 338060, 336559, 334247, 332468, 331618, 331070, 330385, 329630, 328583, 326669, 323948, 321337, 319475]
62614C19475j417j440j267o12J28O63J019J060O54K46M42R45P48l45j284j097
62598C17918o8Q98J484K056K918L981N012N869O461O692O515O032N587N567N932
62583C82854O046N321L909K476J309N8j573l282m489m897m681m311m256m622n071
62568C64791n244n199n198n155m770m139l733l699l625l231k853k900l134k880
62554C09031j867o42o1m09j038r96j75M30m6j118j514q44L4M16O79J376K170K354
62536C07780K006J827K038K197K076K023K259K389J958J204Q64J376K490L665
62522C36152M707N861P254Q479Q968Q830Q897R758J1126J2455J3868J5898J8467
62509D70720K0701K1919K2341K2695K3368K4131K4439K3846K2259J9888J6908
$$ y = [319475, 318058, 316618, 315351, 314739, 314867, 315530, 316549, 317609, 318263, 318509, 318951, 319896, 320644, 320299, 319015, 317918, 317850, 318748, 320232, 322288, 325206, 329187, 334199, 340068, 346529, 353221, 359736, 365768, 371355, 376922, 382854, 388900, 394221, 398130, 400606, 401915, 401973, 400400, 397118, 392629, 387732, 383051, 378740, 374484, 369862, 364791, 359547, 354348, 349150, 343995, 339225, 335086, 331353, 327654, 324029, 320798, 317945, 315045, 311911, 309031, 307164, 306522, 306461, 306052, 305014, 304018, 303843, 304273, 304227, 303109, 301595, 300751, 300785, 301201, 301880, 303256, 305426, 307780, 309786, 311613, 313651, 315848, 317924, 319947, 322206, 324595, 326553, 327757, 328621, 329997, 332487, 336152, 340859, 346720, 353974, 362453, 371421, 380251, 389148, 398906, 410032, 422487, 436355, 452253, 470720, 491421, 513340, 535681, 558376, 581744, 605875, 630314, 654160, 676419, 696307, 713215]
62498G13215J3288R165N202K026n95l444o538q721q958p564n709m045k315p5K792
62483F97724O183R844J3331J6318J8982K1774K4745K7409K9212K9771K8761K6048
62471I50102K2033J7385J2356O738N34n853j2254j8912k5688l1648l5908l8532
62459H40353m0119m0895m0771l9921l8670l6883l4158l0674k7229k4312k1555
62448D65166j8371j4840j1753r865r208q995q338p094n898n183m541l421k083
62435C55576j288j197j298j340j575k000k096j617j038q56r84j130j266j351j072
62420C35468l68L00N32N64P84J047Q97J69r35k062k653k214j057k47l49p05n36
62403C28635j19p5j04M91J402J637J132Q25J069J221J034J244K205L056K977K429
$$ y = [713215, 726503, 735668, 740870, 742896, 742301, 738857, 732319, 723598, 714640, 707076, 701367, 697322, 695007, 694932, 697724, 703907, 713751, 727082, 743400, 762382, 784156, 808901, 836310, 865522, 895293, 924054, 950102, 972135, 989520, 1001876, 1008614, 1009148, 1003295, 991041, 972129, 946441, 914793, 878885, 840353, 800234, 759339, 718568, 678647, 639977, 603094, 568936, 538262, 511033, 486721, 465166, 446795, 431955, 420202, 410337, 401129, 392134, 383796, 376702, 370804, 365621, 361080, 357659, 355576, 354288, 353091, 351793, 350453, 348878, 346878, 344782, 343165, 342127, 341271, 340287, 339157, 337891, 336540, 335468, 335100, 335400, 335932, 336496, 337280, 338327, 339224, 339393, 338458, 336396, 333743, 331529, 330472, 330225, 329876, 329171, 328635, 328516, 328441, 328337, 328828, 330230, 331867, 332999, 333824, 334893, 336114, 337148, 338392, 340597, 343653, 346630, 349059]
62387C49059K334K745L147L522M177M916N315N565O307P648Q981R736R812R449
62373D32713R162R555J0655J1616J1732J1481J1915J3241J4762J6110J7651J9673
62361E90266K1989K4522K7498L0868L4343L8230M3330M9605N5754O0643O4369
62350A041417O7121O7825O4992N8566M9939M0247K9663J8413P503k088j0339j7906
62338A415353k5178l1901l7479m1484m4043m5775m7147m7880m7288m5203m2196
62327I59779l8883l5510l2294k9573k7318k4969k2235j9736j8343j8088j8211
62316F74619j8197j8193j8402j8522j8069j6993j5702j4591j3714j2866j1811
62305D97559j0454q882p384o304n785n518m939l821k614j923j691j256l17N73
$$ y = [349059, 351393, 354138, 357285, 360807, 364984, 369900, 375215, 380780, 387087, 394735, 403716, 413452, 423264, 432713, 441875, 451430, 462085, 473701, 485433, 496914, 508829, 522070, 536832, 552942, 570593, 590266, 612255, 636777, 664275, 695143, 729486, 767716, 811046, 860651, 916405, 977048, 1041417, 1108538, 1176363, 1241355, 1299921, 1349860, 1390107, 1419770, 1438183, 1445686, 1443598, 1433259, 1415353, 1390175, 1358274, 1320795, 1279311, 1235268, 1189493, 1142346, 1094466, 1047178, 1001975, 959779, 920896, 885386, 853092, 823519, 796201, 771232, 748997, 729261, 710918, 692830, 674619, 656422, 638229, 619827, 601305, 583236, 566243, 550541, 535950, 522236, 509370, 497559, 487105, 478223, 470839, 464535, 458750, 453232, 448293, 444472, 441858, 439935, 438244, 436988, 436671, 437244]
62291D37244P36L00L4M18J267K146K779L049K944K668K535K688L019L379L719
62276D68925L990M168M288M371M353M369M911O279P971R130R690J0504J2121J4068
62262E69138J5715J7392J9950K3557K7647L1966L6932M2788M8993N4763N9763
62251I48604O3944O7020O8463O7720O4223N7429M7335L4955K1903R503j690j1642
62239A437767k0511k8471l5524m1469m6257n0228n3684n6285n7276n6326n3810
62228I37926n0245m5997m1608l7774l4662l1675k8317k4870k1843j9208j6749
62217E84978j4757j3629j2975j1946j0351q764p515o375n306m750m787m764m158
62204D74901l275k662k326j983j608j286q41r1Q56J892L104M358N154N352N613
$$ y = [437244, 437980, 438280, 438314, 438732, 439999, 442145, 444924, 447973, 450917, 453585, 456120, 458808, 461827, 465206, 468925, 472915, 477083, 481371, 485742, 490095, 494464, 499375, 505654, 513625, 522755, 532445, 542949, 555070, 569138, 584853, 602245, 622195, 645752, 673399, 705365, 742297, 785085, 834078, 888841, 948604, 1012548, 1079568, 1148031, 1215751, 1279974, 1337403, 1384738, 1419693, 1441596, 1451099, 1449409, 1437767, 1417256, 1388785, 1353261, 1311792, 1265535, 1215307, 1161623, 1105338, 1048062, 991736, 937926, 887681, 841684, 800076, 762302, 727640, 695965, 667648, 642778, 620935, 601727, 584978, 570221, 556592, 543617, 531671, 521320, 512556, 505041, 498666, 493360, 488610, 483823, 479059, 474901, 471626, 468964, 466638, 464655, 463047, 461761, 460920, 460829, 461685, 463577, 466681, 471039, 476193, 481545, 487158]
62189D87158O535P788Q707R341J0156J1026J1394J1273J1267J1584J1748J1461
62177F09438J1010J0618R917Q416O195M008K901L654O168R479J2748J6124K0257
62164G30933K5204L0427L5646M0859M5593M8861N0055M9136M5917L9996L1671
62153A174298K2232J2963M345l499j0341j6188k1526k6724l1585l5723l8980m1158
62141I88114m1910m1265l9797l7915l5417l2056k8137k4221k0671j7739j5582
62130F53404j3839j1658q599n221k459p43J42P95J962L950O047P159P282P643
62116F45865R002J0732J2006J3052J4504J6246J7692J8459J7971J5148R707L308
62104H03692j720m515n672n609m306k509j832l217o132r487j2531j4709j5526
$$ y = [487158, 493693, 501481, 510188, 519529, 529685, 540711, 552105, 563378, 574645, 586229, 597977, 609438, 620448, 631066, 640983, 649399, 655594, 659602, 662503, 666157, 672325, 681804, 694552, 710676, 730933, 756137, 786564, 822210, 863069, 908662, 957523, 1007578, 1056714, 1102631, 1142627, 1174298, 1196530, 1209493, 1213838, 1210339, 1199998, 1183810, 1162284, 1135560, 1103975, 1068252, 1029272, 988114, 946204, 904939, 865142, 827227, 791810, 759754, 731617, 707396, 686725, 668986, 653404, 639565, 627907, 619308, 614087, 611628, 610885, 611027, 611822, 613784, 617734, 623781, 630940, 638222, 645865, 654867, 665599, 677605, 690657, 705161, 721407, 739099, 757558, 775529, 790677, 800384, 803692, 801972, 797457, 791785, 786176, 781870, 779361, 777529, 774312, 768180, 758693, 746162, 731453, 715927]
62091G15927j5023j3796j2186r865o501k458J382M268O070P374R022J1351J4027
62078G09592J6751J9605K2382K4292K5033K5611K7074K8921K9827K9699K9711
62067I88498L0381L0906L0646L0062K9890L0289L1280L3000L5072L6457L6323
62056A342804L4433L0451K3856J5066N836k077q161j2834j6681k0407k4685k9362
62044A338239l3454l6391l8637m0630m1941m2161m1769m1234l9992l7388l4148
62033I10494l1723l0328k8725k6043k2833k0109j8072j6200j4078j1789r710q171
62021F72713p211o581o055n692n652n888o212o590p166p984q714q759p736o008
62007E76465m468l507k483p40J193K220K378K869M268N776O666P311Q068Q158
$$ y = [715927, 700904, 687108, 674922, 665057, 658556, 656098, 657480, 661748, 667818, 675192, 684214, 695565, 709592, 726343, 745948, 768330, 792622, 817655, 843266, 870340, 899261, 929088, 958787, 988498, 1018879, 1049785, 1080431, 1110493, 1140383, 1170672, 1201952, 1234952, 1270024, 1306481, 1342804, 1377237, 1407688, 1431544, 1446610, 1452446, 1450369, 1442208, 1429374, 1412693, 1392286, 1367601, 1338239, 1304785, 1268394, 1229757, 1189127, 1147186, 1105025, 1063256, 1022022, 982030, 944642, 910494, 878771, 848443, 819718, 793675, 770842, 750733, 732661, 716461, 702383, 690594, 680884, 672713, 665502, 658921, 652866, 647174, 641522, 635634, 629422, 622832, 615666, 607682, 598968, 590209, 582473, 576465, 571997, 568490, 566007, 565267, 566460, 568680, 571058, 573927, 578195, 583971, 590637, 597948, 606016, 614174]
61993F14174O770M523K752J747P84m67j672k830m466o670q805j0282j1013j1095
61979E73450j0730j0390j0378j0273r515q385p617p123o188m951m508n140n554
61966D72698m601k906j926k055k497k601k356j776p14O23J610J945J977K159K560
61951D62140L033L592M332N181N949O613P402Q605J0308J2336J4432J6451J8372
61938E78746K0208K2005K3869K5810K7517K8478K8516K8071K7748K7603K7054
61927H65625K5592K3388K1035J8752J6144J2792Q827M665L60m348r247j3366j5746
61914I54473j6400j6109j5426j4089j1582p946l803L54M635R350J4265J8563K1556
61901I37841K3136K3361K2003J8880J4414R290L678k560q906j4121j7518j9690
$$ y = [614174, 620944, 625467, 628219, 629966, 630750, 630283, 628611, 625781, 621315, 614645, 605840, 595558, 584545, 573450, 562720, 552330, 541952, 531679, 522164, 513779, 506162, 499039, 492851, 487900, 483392, 478252, 472698, 468097, 465191, 463265, 461210, 458713, 456112, 453756, 451980, 451266, 451889, 453499, 455444, 457421, 459580, 462140, 465173, 468765, 473097, 478278, 484227, 490840, 498242, 506847, 517155, 529491, 543923, 560374, 578746, 598954, 620959, 644828, 670638, 698155, 726633, 755149, 783220, 810968, 838571, 865625, 891217, 914605, 935640, 954392, 970536, 983328, 992155, 996820, 997180, 992832, 983585, 970219, 954473, 938073, 921964, 906538, 892449, 880867, 872921, 869118, 869472, 874107, 883457, 897722, 916285, 937841, 960977, 984338, 1006341, 1025221, 1039635, 1048925, 1052603, 1050043, 1041137, 1027016, 1009498, 989808]
61889I89808k1586k3313k4456k5079k5647k6055k5484k3529k0913j8863j7960
61878G36923j7822j7746j7424j7026j6748j6451j5839j4888j3792j2568j0963
61867E65656q924o762m735k763p35J230L039M819O611Q265R936J2265J5553J9160
61853F22615K2249K4853K7645L0859L4131L7276M0579M4092M7214M9183M9733
61842A030429M9147M7926M6257M3548L8661L1070K1645J1869K492o492j4719k1185
61830A280648k5187k6773k6085k3026j7920j1786n433J148Q005J4340J9070K1861
61818A208862K2985K2348J9388J3984O886r31q940j6966k4706l1658l7404m1831
61806A132017m5001m6874m7242m6102m3939m1409l8678l5445l1697k8080k5228
$$ y = [989808, 968222, 944909, 920453, 895374, 869727, 843672, 818188, 794659, 773746, 754883, 736923, 719101, 701355, 683931, 666905, 650157, 633706, 617867, 602979, 589187, 576619, 565656, 556732, 549970, 545235, 542472, 541737, 542967, 546006, 550825, 557436, 565701, 575637, 587902, 603455, 622615, 644864, 669717, 697362, 728221, 762352, 799628, 840207, 884299, 931513, 980696, 1030429, 1079576, 1127502, 1173759, 1217307, 1255968, 1287038, 1308683, 1320552, 1323044, 1316552, 1301833, 1280648, 1255461, 1228688, 1202603, 1179577, 1161657, 1149871, 1144438, 1145586, 1153591, 1167931, 1187001, 1208862, 1231847, 1254195, 1273583, 1287567, 1294453, 1293522, 1284582, 1267616, 1242910, 1211252, 1173848, 1132017, 1087016, 1040142, 992900, 946798, 902859, 861450, 822772, 787327, 755630, 727550, 702322]
61795G02322k3064k1087j9162j7540j6269j5027j3615j2206j0954r748q513p501
61783E27636o999o859o641o149n602n223m917m400l582k650j923j658j894k368
61769D66771k667k601k388k313k315k069j462o96K6O27R86R75Q13R95J671K384
61753D58737K773L151M030N206N865N491M321K933J755R66N52L54K59M00R20J659
61737D99372K273K574K541K092J307P41R83J857K530K527K223K198K580L231M066
61722E33095M918N483N710N978O543P152P484P589P533O960N590L885K637J990
61708F12547J407N00o86k203m201o260p359p073o270o077o446o427n664m929n001
61693E45858n646o028n776n207m689m217l561k622j529n89p0M3n2l29j037k186
$$ y = [702322, 679258, 658171, 639009, 621469, 605200, 590173, 576558, 564352, 553398, 543650, 535137, 527636, 520637, 513778, 507137, 500988, 495386, 490163, 485246, 480846, 477264, 474614, 472691, 471033, 469139, 466771, 464104, 461503, 459115, 456802, 454487, 452418, 450956, 450260, 450286, 450913, 451899, 452874, 453687, 454682, 456353, 458737, 461510, 464661, 468691, 473897, 479762, 485253, 489574, 492507, 494262, 495228, 495780, 496134, 496393, 496793, 497713, 499372, 501645, 504219, 506760, 508852, 510159, 510900, 511883, 513740, 516270, 518797, 521020, 523218, 525798, 529029, 533095, 538013, 543496, 549206, 555184, 561727, 568879, 576363, 583952, 591485, 598445, 604035, 607920, 610557, 612547, 613954, 614454, 613768, 611565, 607364, 601104, 593745, 586672, 580402, 574325, 567879, 561452, 555788, 550859, 545858, 540212, 534184, 528408, 523201, 518512, 514295, 510734, 508112, 506583, 505994, 505924, 505967, 505915, 505586, 504549, 502363]
61677E02363l186l346k690j857j304r93q79j128j617j781j350q75r75j370j245
61662D77767m74J71J06k94l07J51N70O49O68R82J520J936K111K281K716L479M516
61645D98548N702O650O821O126N288N195N938O815P239P155O582N365L589J752
61631E78765J92j222k496l165k986k587k766l464m013m133m037l721k892j674
61617E39801o60j70J2m4o41j711k415k062j186j117k497m584o133o676o765p054
61601D96098p477p528p086o607o425o328o009n546n097m462l420k307j744j879
61587D24183k308k723l140l507l539l118k544k187k109k143k145k090k025k008
61573C88597k042k162k576l393m143m005k870j814j891k749l045k161q74k65n33
$$ y = [502363, 499177, 495831, 493141, 491284, 489980, 488987, 488108, 486980, 485363, 483582, 482232, 481357, 480382, 479012, 477767, 477293, 477464, 477570, 477276, 476969, 477120, 477690, 478339, 479007, 479989, 481509, 483445, 485556, 487837, 490553, 494032, 498548, 504250, 510900, 517721, 523847, 529135, 534330, 540268, 547083, 554322, 561477, 568059, 573424, 577013, 578765, 578957, 577735, 575239, 572074, 569088, 566501, 563735, 560271, 556258, 552125, 548088, 544367, 541475, 539801, 539141, 538971, 538983, 538939, 538298, 536587, 534172, 532110, 530924, 529807, 527310, 522726, 516593, 509917, 503152, 496098, 488621, 481093, 474007, 467400, 460975, 454647, 448638, 443092, 437995, 433533, 430113, 427806, 426062, 424183, 421875, 419152, 416012, 412505, 408966, 405848, 403304, 401117, 399008, 396865, 394720, 392630, 390605, 388597, 386555, 384393, 381817, 378424, 374281, 370276, 367406, 365592, 363701, 360952, 357907, 355746, 354872, 354607, 354074]
61558C54074j113j465j524j557j799k089j949j200l47j7j71k57m1J71R8j82m45
61541C40187n33l70j04j00m16n03J24J130J817K128K572L322M015M323M116L199
61525C64907J627J52n13p28j436k680l613l876l863l605k624j230o16j121j599
61510C39182j181m95l69m58k16j87j031k043k012j114n70p48q61m80r1k8K9K23
61492C27550K14mJ58Q35J182N16o15j127q45o23j148k123k760k641j909q41L35
61475C16154J268J533J127O32N18N43K17l53o29n33m65m95k45K08J92m86j065
61458C18121q56j70L12M59M38J38m51p59l30M06O74M73M43Q58J353J557J410J017
61440C25093O72Q25J541K199K242J986K141K835L619M229M617M510L666K514J836
$$ y = [354074, 352961, 351496, 349972, 348415, 346616, 344527, 342578, 341378, 341031, 341014, 340843, 340586, 340545, 340716, 340814, 340632, 340187, 339654, 339284, 339180, 339080, 338664, 338161, 338285, 339415, 341232, 343360, 345932, 349254, 353269, 357592, 361708, 364907, 366534, 366686, 366173, 365445, 364009, 361329, 357716, 353840, 349977, 346372, 343748, 342518, 341902, 340781, 339182, 338001, 337506, 337137, 336679, 336463, 336276, 335245, 333202, 331190, 330076, 329506, 328758, 327897, 327417, 327326, 327298, 327327, 327550, 327764, 327760, 327918, 328753, 329935, 330451, 329836, 328709, 327864, 327241, 326093, 323970, 321210, 318569, 316660, 315819, 316154, 317422, 318955, 320082, 320714, 321232, 321775, 321992, 321639, 321010, 320477, 320012, 319517, 319272, 319480, 319672, 319186, 318121, 317265, 317095, 317407, 317866, 318304, 318442, 317991, 317232, 316902, 317308, 317982, 318455, 318898, 319756, 321109, 322666, 324076, 325093, 325765, 326590, 328131, 330330, 332572, 334558, 336699, 339534, 343153, 347382, 351999, 356509, 360175, 362689, 364525]
61425C64525J804J885J696J379J153J078J287J869K552K940L068L252L424L210
61411C95122K668K283K123J533k0k174l915m452l819k866k575l123l687l500k828
61396C70770k515k732k820k266j317n31j95k96o14p66m61J53O14O30L24J16M95
61379C58589J538K495K315R86j18J62J327K058J969J681J499J181Q23R02J250
61364C78657J109M10j7K06M57L08K96R11J648J873J885K341L124L628L858M358
61348D05052N268O174P003Q313J0433J2713J4031J3989J3364J3173J3327J2611
61336E35451J0246P196N272N018N166M267K295K46j180k033k670l381m274n090
61322E56529n382n189n189n813o504o351n266l990l064k404j868j607j633j576
$$ y = [364525, 366329, 368214, 369910, 371289, 372442, 373520, 374807, 376676, 379228, 382168, 385236, 388488, 391912, 395122, 397790, 400073, 402196, 403729, 403709, 401535, 397620, 393168, 389349, 386483, 383908, 380785, 377098, 373598, 370770, 368255, 365523, 362703, 360437, 359120, 358589, 358394, 358098, 357484, 356718, 356257, 356410, 357024, 357654, 357978, 358094, 358589, 360127, 362622, 364937, 365923, 365805, 365967, 367294, 369352, 371321, 373002, 374501, 375682, 376505, 377407, 378657, 379766, 380176, 380159, 380365, 380822, 381130, 381426, 382337, 383985, 385858, 387743, 390084, 393208, 396836, 400694, 405052, 410320, 416494, 423497, 431810, 442243, 454956, 468987, 482976, 496340, 509513, 522840, 535451, 545697, 552893, 558165, 563183, 568349, 572616, 574911, 575157, 573977, 571944, 569274, 565893, 561619, 556529, 551147, 545958, 540769, 534956, 528452, 522101, 516835, 512845, 509781, 507377, 505509, 503902, 502269, 500693]
61308E00693j185p67p59j109j309r33J64J883L819N283N919O207O865P674P467
61293E39912N574K740J59j869l765n507o568o862o892o821o166m704k996j676
61279D94559p83j71P1jJ02P41J697K669L756N009O038O575O987P691Q468Q883
61263E52291Q926Q732Q194P466P311Q197R500J0393J1106J2500J4637J6728J8183
61250F94164J8921J8766J7488J5313J2628R275N082Q21k342m358o296q724j1015
61237G59723j2394j2803j2520j1737j0759r903r002p647o035m886m405m118l748
61224F49766l515l407l055k474k107j914j325m18j58j017k194k737k726k757k909
61209F17053k820k383j781j183q06q63j189j283j045j018j571k278k401j664k99
$$ y = [500693, 499508, 498741, 497982, 496873, 495564, 494631, 494795, 496678, 500497, 505780, 511699, 517906, 524771, 532445, 539912, 545486, 548226, 548385, 546516, 542751, 537244, 530676, 523814, 516922, 510101, 503935, 499231, 496235, 494559, 493776, 493605, 493676, 493675, 493777, 494518, 496215, 498884, 502640, 507649, 513687, 520262, 527249, 534940, 543408, 552291, 561217, 569949, 578143, 585609, 592920, 601117, 610617, 621010, 632116, 644616, 659253, 675981, 694164, 713085, 731851, 749339, 764652, 777280, 786555, 791637, 792458, 790116, 785758, 779462, 770738, 759723, 747329, 734526, 722006, 710269, 699510, 689607, 680605, 672958, 666923, 662037, 657632, 653514, 649766, 646251, 642844, 639789, 637315, 635208, 633294, 631969, 631551, 631393, 630376, 628182, 625445, 622719, 619962, 617053, 614233, 611850, 610069, 608886, 608080, 607217, 606028, 604745, 603700, 602682, 601111, 598833, 596432, 594768, 594469]
61194E94469J357L116N033P366J0173J3008J5403J7483J9546K1276K2045K1858
61182G52133K1122J9660J6946J3424J0486Q904Q197P806P854Q319Q518P956O884
61169H98209N595L969K116N36p86k507m604o039o346o590p895r935j1758j3237
61155H40728j4665j5617j5454j4500j3687j3149j2190j0484q549o913n532m038
61143G05950k225k76J295K054K092J735Q12j211m226p255r480j0773j1039r974
61129F57479p962o247n467m817l334j323L27J521K753M085N243O436Q167J0350
61115F67211J2379J4013J5573J7346J9151K0537K1189K1352K1777K2865K3889
61104H77282K3814K2801K1991K1660K0778J8821J6834J5893J5500J4390J2039
$$ y = [594469, 595826, 598942, 603975, 611341, 621514, 634522, 649925, 667408, 686954, 708230, 730275, 752133, 773255, 792915, 809861, 823285, 833771, 842675, 850872, 858678, 866532, 874851, 883369, 891325, 898209, 903804, 907773, 909889, 910425, 909639, 907132, 902528, 896489, 890143, 883553, 875658, 865723, 853965, 840728, 826063, 810446, 794992, 780492, 766805, 753656, 741466, 730982, 722433, 715520, 709988, 705950, 703725, 703449, 704744, 706798, 708890, 710625, 711437, 710226, 706000, 698745, 689265, 678492, 667453, 657479, 649517, 643270, 637803, 632986, 629652, 628329, 628656, 630177, 632930, 637015, 642258, 648694, 656861, 667211, 679590, 693603, 709176, 726522, 745673, 766210, 787399, 808751, 830528, 853393, 877282, 901096, 923897, 945888, 967548, 988326, 1007147, 1023981, 1039874, 1055374, 1069764, 1081803]
61093A081803Q576M032j293o371j0268j3088j5404j7303j8633j9527k0004j9678
61081I52842j8590j7641j7515j7812j7875j7753j7638j7180j6140j4914j3722
61070G66062j2120j0060q430p658o841n268l746l175k848j553L71J619J931K211
61056G10495L023M156N399O629P517P954Q367R001R591J0276J1776J3973J5592
61043H23749J6281J7418J9702K1640K2052K2437K4753K8206L0556L1554L2702
61032A091050L4366L5653L6595L8138M0249M2134M4073M7038N0843N4593N8416
61021A573148O2793O6722O8699O9053O9273O9757P0473P2966P9213Q8957J00597
61010B391651J13724J28219J42074J53483J64337J78426J97309K21765K55901
$$ y = [1081803, 1090379, 1094411, 1093118, 1086747, 1076479, 1063391, 1047987, 1030684, 1012051, 992524, 972520, 952842, 934252, 916611, 899096, 881284, 863409, 845656, 828018, 810838, 794698, 779784, 766062, 753942, 743882, 735452, 727794, 720953, 715685, 711939, 708764, 705916, 704363, 704734, 706353, 708284, 710495, 713518, 717674, 723073, 729702, 737219, 745173, 753540, 762541, 772132, 782408, 794184, 808157, 823749, 840030, 857448, 877150, 898790, 920842, 943279, 968032, 996238, 1026794, 1058348, 1091050, 1125416, 1161069, 1197664, 1235802, 1276051, 1318185, 1362258, 1409296, 1460139, 1514732, 1573148, 1635941, 1702663, 1771362, 1840415, 1909688, 1979445, 2049918, 2122884, 2202097, 2291054, 2391651, 2505375, 2633594, 2775668, 2929151, 3093488, 3271914, 3469223, 3690988, 3946889]
61001C946889L04869L69291M47762N44860O71117Q36044J049656J331296J703789
60992A1205573K167896K683304L172918L531836L629050L336154K612616J593349
60984C3932696N71601j48656m16694k78232J07332N57693Q85868Q97756M57747
60975C6567111m01858j453659k393915l013268l272440l248057l040216k729262
60967A7014436k377944k033492j720143j442580j200790r96557q28155o88790
60959E725985n73158m80177m07960l51202l05156k68092k38502k13544j91460
60950B696734j72293j55207j38024j20304j04022r0433p8973o9772o4274o2449
60940A640983o2095o1795o1927o2080o0353n6446n2694n0693m9178m6596m3484
$$ y = [3946889, 4251758, 4621049, 5068811, 5613671, 6284788, 7120832, 8170488, 9501784, 11205573, 13373469, 16056773, 19229691, 22761527, 26390577, 29726731, 32339347, 33932696, 34504297, 34355641, 33938947, 33660715, 33768047, 34325740, 35211608, 36109364, 36567111, 36165253, 34711594, 32317679, 29304411, 26031971, 22783914, 19743698, 17014436, 14636492, 12603000, 10882857, 9440277, 8239487, 7242930, 6414775, 5725985, 5152827, 4672650, 4264690, 3913488, 3608332, 3340240, 3101738, 2888194, 2696734, 2524441, 2369234, 2231210, 2110906, 2006884, 1916451, 1837478, 1767706, 1703432, 1640983, 1578888, 1517093, 1455166, 1393086, 1332733, 1276287, 1223593, 1172900, 1123722, 1077126, 1033642]
60929A033642m0830l8208l5071l2177l0185k8391k6143k4042k2510k0737j8232
60918G17116j6045j5177j5033j4567j3771j2902j1519r430p502o437n735m719
60906E84279l589k671j787j067j186j910j780j17J868K869L069L025K449J305
60892E84757P29J385K014J086r13k230k175j508j155j675l288n415o788o965p024
60877E50835p897q924r102q716q578q575q282q189q825r384q745p292o267n744
60863D36315m834l516k677k350j561k5J336J936K304L036L915M535M874M980M794
60848D53062M579M830N528O016N926N628N607N815N833N357M411L319K486J915
60834E20312J113k79j890k966l136k549j565o71l59o75j076j086p87m16K0L57
$$ y = [1033642, 992812, 954604, 919533, 887356, 857171, 828780, 802637, 778595, 756085, 735348, 717116, 701071, 685894, 670861, 656294, 642523, 629621, 618102, 608672, 601170, 594733, 588998, 584279, 580690, 578019, 576232, 575165, 573979, 572069, 570289, 570172, 572040, 574909, 577978, 581003, 583452, 584757, 585486, 586871, 588885, 589971, 589058, 586828, 584653, 583145, 581990, 580315, 577027, 571612, 564824, 557859, 550835, 542938, 534014, 524912, 516196, 507618, 499043, 490761, 482572, 473747, 464363, 455618, 448326, 442059, 436315, 431481, 427965, 425288, 422938, 421377, 421352, 422688, 424624, 426928, 429964, 433879, 438414, 443288, 448268, 453062, 457641, 462471, 467999, 474015, 479941, 485569, 491176, 496991, 502824, 508181, 512592, 515911, 518397, 520312, 521425, 521146, 519256, 516290, 513154, 510605, 509040, 508369, 508010, 507335, 506259, 505173, 504386, 503970, 503990, 504347]
60818E04347L3j178k698l953n154o620p903q380q312q399q636q513q051p715p466
60803D11402o849n866m921l993k776j541r07q22p30p49j456k508k660j600n49
60788C73475n19r46q36k83PJ0K43P33J092J317J776K456K994L293L506L469K918
60771C94705K289K519L815N225N881O122O835Q067Q944Q869Q171P414O646N634
60757D81136M496L661L330L309L245K822J858N56m00m32L15J196J873K438K812
60742E12215K588J644M18p21j943l493n166o585p664q424q638q157p358o795o511
60727D45410o078n280m335l437k506j489o40k44j52K09J272K745L769L834L431
60712D36509L531M494N811O937P857Q764R617J0366J1207J2304J3515J4656J5733
$$ y = [504347, 504380, 503202, 500504, 496551, 491397, 484777, 476874, 468494, 460182, 451783, 443147, 434634, 426583, 418868, 411402, 404553, 398687, 393766, 389773, 386997, 385456, 384549, 383727, 382997, 382248, 380792, 378284, 375624, 374024, 373475, 372956, 372010, 371174, 370891, 370898, 370908, 371151, 371884, 372976, 374293, 376069, 378525, 381519, 384812, 388318, 391787, 394705, 396994, 399513, 403328, 408553, 414434, 420556, 427391, 435458, 444402, 453271, 461442, 468856, 475502, 481136, 485632, 489293, 492623, 495932, 499177, 501999, 503857, 504413, 504013, 503581, 503896, 505092, 506965, 509403, 512215, 514803, 516447, 516865, 516144, 514201, 510708, 505542, 498957, 491293, 482869, 474231, 466074, 458716, 451921, 445410, 439332, 434052, 429717, 426280, 423774, 422285, 421645, 421401, 421249, 421458, 422730, 425475, 429244, 433078, 436509, 440040, 444534, 450345, 457282, 465139, 473903, 483520, 493886, 505093, 517397, 530912, 545568, 561301]
60699E61301J6713J7384J7758J8204J8868J9374J9503J9735K0600K1804K2528
60688G73772K2443K1913K1373K0946K0527J9698J7707J4082R297M374j81m615
60676I41336r139j3419j6992j9801k2097k4025k5414k5963k5630k4907k4440k4232
60664F85277k3520k1747j9394j7519j6590j6227j5820j5027j3811j2399j1174
60653E02049j0230r189p767o261n072m053k827j537n93P1P32J060M28q90j805
60638D54116j885j850k221k379j657n86j58k87O5J301K617L155L006K816K865
60623D58918L001L194L642M252M411L560J948N28k8j8k54j099k258l306m076m484
60607D67931m426m035l769l872m033l780l100k357j779j386j326j816k595k917
$$ y = [561301, 578014, 595398, 613156, 631360, 650228, 669602, 689105, 708840, 729440, 751244, 773772, 796215, 818128, 839501, 860447, 880974, 900672, 918379, 932461, 941758, 946132, 945951, 941336, 932197, 918778, 901786, 881985, 859888, 835863, 810449, 784486, 758856, 733949, 709509, 685277, 661757, 640010, 620616, 603097, 586507, 570280, 554460, 539433, 525622, 513223, 502049, 491819, 482630, 474863, 468602, 463530, 459477, 456650, 455113, 454520, 454591, 455323, 456383, 456811, 455921, 454116, 452231, 450381, 448160, 445781, 444124, 443538, 443380, 443093, 443158, 444459, 447076, 450231, 453237, 456053, 458918, 461919, 465113, 468755, 473007, 477418, 480978, 482926, 483454, 483426, 483408, 483154, 482055, 479797, 476491, 472415, 467931, 463505, 459470, 455701, 451829, 447796, 444016, 440916, 438559, 436780, 435394, 434068, 432252, 429657, 426740]
60593D26740k419j672j448j604j369o31k59p80j464j308n26k20p59j332j173m46
60577D09330L38J127K146L426M874O417P732Q282Q048P845Q552J0330J2892J6051
60563E07390J9518K2641K4823K6016K6265K5248K2639J8624J3532P418O38n617
60551G09135j0181j2968j4434j4388j2348q902n521k827N4M113R299J4898K0354
60538F76284K5360K9799L3942L7953M0915M1049L7363L0567K2043J2583K598p061
60526I83395j5132k0555k2792k2061j9593j7084j5245j3368j0782q199o911p034
60514H04639p404p016n840m248k370l15J573L025M225N649P628J0118J2826J5637
60500H38127J8881K3105K8618L5501M3977N4251O5801P7375Q8012R7683J06473
$$ y = [426740, 424321, 422649, 421201, 419597, 418228, 417597, 417338, 416558, 415094, 413786, 413260, 413040, 412281, 410949, 409776, 409330, 409668, 410795, 412941, 416367, 421241, 427658, 435390, 443672, 451720, 459565, 468117, 478447, 491339, 507390, 526908, 549549, 574372, 600388, 626653, 651901, 674540, 693164, 706696, 714114, 714752, 709135, 698954, 685986, 671552, 657164, 644816, 635914, 630393, 627566, 627620, 631733, 641032, 655930, 676284, 701644, 731443, 765385, 803338, 844253, 885302, 922665, 953232, 975275, 987858, 990456, 983395, 968263, 947708, 924916, 902855, 883262, 866178, 850933, 837565, 826783, 818584, 811673, 804639, 797235, 790219, 784379, 780131, 777761, 777446, 779019, 782044, 786269, 791918, 799546, 809664, 822490, 838127, 857008, 880113, 908731, 944232, 988209, 1042460, 1108261, 1185636, 1273648, 1371331, 1477804]
60489A477804J13521J17302J16616J10811R9369Q2047N9401L2678L199k7589n7518
60478B127641q3847j04310j17875j24624j25407j21599j14608j05364r4587q3401
60468A052019p3104o4178n6078m8360m1503l6279l2611k9526k6123k2358j8954
60457F02945j6688j5621j4943j3729j1870j0018q608p412o154n064m497m389m455
60444D79497m552m543m138l351k804l019l606l659k840j605m76L49P68P88P31
60429D47540Q71Q32lj472k704l378m060m982n334m404k821j855j860k093j832
60414D12445j025p9M19mj040j486n30J031J632R08l6l06k18l64n51k00P80J942
60396D13318K725K677J689K85p15j019q91l64P79K095K491J678P72Q39J506J767
$$ y = [1477804, 1591325, 1708627, 1825243, 1936054, 2035423, 2117470, 2176871, 2209549, 2212748, 2185159, 2127641, 2043794, 1939484, 1821609, 1696985, 1571578, 1449979, 1335371, 1230007, 1135420, 1052019, 978915, 914737, 858659, 810299, 768796, 732517, 699906, 670380, 644257, 621899, 602945, 586257, 570636, 555693, 541964, 530094, 520076, 511468, 504056, 497902, 492838, 488341, 483952, 479497, 474945, 470402, 466264, 462913, 460109, 457090, 453484, 449825, 446985, 445380, 444904, 445253, 446021, 446809, 447540, 448411, 449243, 449240, 447768, 445064, 441686, 437626, 432644, 427310, 422906, 420085, 418230, 416370, 414277, 412445, 411420, 411341, 411760, 411756, 410716, 409230, 408700, 409731, 411363, 412271, 412235, 411929, 411711, 411347, 410796, 410596, 411376, 413318, 416043, 418720, 420409, 420694, 419979, 418960, 418069, 417705, 418484, 420579, 423070, 424748, 425520, 426359, 427865, 429632]
60380D29632J478J203J116R91R22J189J649K029K476L075L195K330J273J340K532
60365D56430L524L499K880K212J503R55J203K215K951K622J553L23j005k208k387
60350D76270j096N95J146M11l65j75Q49J981K708K979L140L674M590N225M976
60335E06908M085L298K888K448J612N13m52j035j240j169q85l62K54M46k77j663
60319E15369k792l062k701k135j305l3J437K721L785M726N379N668O091P378R852
60304E50378J3473J8146K3585K9219L4799M0525M5850M8641M6683L9890L0051
60293I21240J8504N266r269k3079l3724m0037m2143m0669l6715l1891k7333k2926
60281F37224j8206j3810j1074j0320j0373r942q860p755p024o555o045n339m545
$$ y = [429632, 431110, 432313, 433429, 434420, 435342, 436531, 438180, 440209, 442685, 445760, 448955, 451285, 452558, 453898, 456430, 459954, 463453, 466333, 468545, 470048, 471003, 472206, 474421, 477372, 479994, 481547, 481870, 480865, 478657, 476270, 475174, 475769, 476915, 477326, 476961, 476786, 477635, 479616, 482324, 485303, 488443, 492117, 496707, 501932, 506908, 510993, 514291, 517179, 519627, 521239, 521752, 521300, 520265, 519025, 517856, 516971, 516609, 516863, 517309, 517032, 515369, 512577, 509515, 506814, 504679, 503374, 503341, 504778, 507499, 511284, 516010, 521389, 527057, 533148, 540526, 550378, 563851, 581997, 605582, 634801, 669600, 710125, 755975, 804616, 851299, 891189, 921240, 939744, 945010, 935741, 912662, 878938, 838901, 796758, 756089, 719374, 687483, 660150, 637224, 619018, 605208, 594134, 583814, 573441, 563499, 554639, 546884, 539860, 533305, 527260, 521921, 517376]
60268E17376m005m006m371m537m106l217k337j773j465j111m62L05O24J14q99
60253D86130j748k188k458k553k065r92j51k55r36j212p48m9M54P84Q97N36j33
60236D73313m02M4N60M54k4q5M89J269K006K881L918M715M917M509L611K363J123
60219E05661K84j69n16n76K53J974L523L824L027K201K047K378K764L102L454
60204E33231L756L895L869L739L508L191K840K427J850J164O67O19Q35P96J98
60189E66585o98j325j392j032n15m0J95%n29r75j122j310j989l035l822l941l478
60172E41577k694j781r84n36l78k12RK7k49n31o06n79n22j93O03J681K708L509
60154E40849L955L931L672L680M015M060L404K518K025J742J226R57J860L590
$$ y = [517376, 513371, 509365, 504994, 500457, 496351, 493134, 490797, 489024, 487559, 486448, 485986, 486291, 486915, 487029, 486130, 484382, 482194, 479736, 477183, 475118, 474126, 473975, 473720, 472784, 471572, 470824, 470775, 471229, 472013, 472910, 473446, 473313, 472911, 472955, 473515, 473969, 473945, 473860, 474349, 475618, 477624, 480505, 484423, 489138, 494055, 498564, 502175, 504538, 505661, 505945, 505776, 505260, 504684, 504937, 506911, 510434, 514258, 517285, 519486, 521533, 523911, 526675, 529777, 533231, 536987, 540882, 544751, 548490, 551998, 555189, 558029, 560456, 562306, 563470, 564137, 564756, 565591, 566387, 566585, 565887, 564562, 563170, 562138, 561623, 561583, 561778, 561778, 561249, 560274, 559152, 557842, 555853, 552818, 548996, 545055, 541577, 538883, 537102, 536118, 535582, 535204, 534992, 535001, 535028, 534779, 534248, 533642, 533063, 532541, 532348, 532951, 534632, 537340, 540849, 544804, 548735, 552407, 556087, 560102, 564162, 567566, 570084, 572109, 573851, 575077, 576034, 577894, 581484]
60140E81484M418L420J882J677K820L746L785M114N753P676P925O160M014K839
60126F41713K125O31j694l712m677m859m734m316l603k939k536k011q64P95K367
60111F11686L406L952M315M756N278N582N421N009M774M575L615J478j099k974
60097F59774l825m230m673n026n015m674m200l659l044k345j411j4J756L287L907
60082F26608L575K958K742K982L220L160K902K517J692J39j881l745n031n663
60068F36175n698n421n398n838o092n490m544m421n133n369m528l808m473n951
60054E64011o705o380n971o143o549o690o439n665m279k779j937j685j134J07
60040E01762J350J903K038K425L148L788M064L915L284K286J463J424K160K915
$$ y = [581484, 585902, 589322, 591204, 592881, 595701, 599447, 603232, 607346, 613099, 620775, 628700, 634860, 638874, 641713, 643838, 644469, 642775, 639063, 634386, 629527, 624793, 620477, 616874, 613935, 611399, 609388, 608524, 609319, 611686, 615092, 619044, 623359, 628115, 633393, 638975, 644396, 649405, 654179, 658754, 662369, 663847, 662748, 659774, 655949, 651719, 647046, 642020, 637005, 632331, 628131, 624472, 621428, 619083, 617672, 617658, 619414, 622701, 626608, 630183, 633141, 635883, 638865, 642085, 645245, 648147, 650664, 652356, 652495, 650614, 646869, 641838, 636175, 630477, 625056, 619658, 613820, 607728, 602238, 597694, 593273, 588140, 582771, 578243, 574435, 569962, 564011, 557306, 550926, 544955, 538812, 532263, 525573, 519134, 513469, 509190, 506411, 504474, 502789, 501655, 501762, 503112, 505015, 507053, 509478, 512626, 516414, 520478, 524393, 527677, 529963, 531426, 532850, 535010, 537925]
60026E37925K781J433n71k254l118l528m125m954n579n888o250o754o808n920
60012D86390m509l536l422l658l486k728j816j129n65J67R84J498J620J679J869
59997D69358J977J938K146K834L574L939M210M821N379N061L879K765K349K399
59983E16629K532K743L008L046K689K005R17o28k015k213j156j46m27j787l032
59968E22165l413l067k458j912j583j407j145o63n7O24J441K250K692K682K572
59953E18721K590K511K146J750J603J513J140N35N3p8J31N29Q25O89R7o39j301
59936E32815j939k558l020l365l749l956l569k807k471k721k603j424J26Q60O77
59921E00296M38O75J163J562J729J568J184J055J431J785J544J148J569K834L848
$$ y = [537925, 540706, 542139, 541568, 539314, 536196, 532668, 528543, 523589, 518010, 512122, 505872, 499118, 492310, 486390, 481881, 478345, 474923, 471265, 467779, 465051, 463235, 462106, 461541, 461708, 462692, 464190, 465810, 467489, 469358, 471335, 473273, 475419, 478253, 481827, 485766, 489976, 494797, 500176, 505237, 509116, 511881, 514230, 516629, 519161, 521904, 524912, 527958, 530647, 532652, 533569, 532941, 530926, 528713, 527557, 527411, 526984, 525197, 522165, 518752, 515685, 513227, 511315, 509732, 508325, 507180, 506517, 506460, 507084, 508525, 510775, 513467, 516149, 518721, 521311, 523822, 525968, 527718, 529321, 530834, 531974, 532509, 532562, 532484, 532615, 533144, 533969, 534658, 534755, 534116, 532815, 530876, 528318, 525298, 521933, 518184, 514228, 510659, 507852, 505381, 502660, 500057, 498633, 498759, 499619, 500296, 500734, 501409, 502572, 504134, 505863, 507431, 508615, 509670, 511101, 512886, 514430, 515578, 517147, 519981, 523829]
59906E23829L854L281K887K748K459J923J498J553K110K792L110K943K653K545
59892E60185K466K217K107K549L317L800L915M124M524M623M113L242K270J233
59878F04685M87P45K128L708M450M199L354K098N53q01j559k038k887m052m799
59863F10271m765m385m151l919l289k297j377q44o47n49k78L32J148J745J874
59848E88869J858K233L055L954M885O343Q562J0923J2594J3423J3639J2951J0698
59835F93987O986K985o4j604j411N90L573N533M688J116l497p588j0714j3100
59821F81480j4953j6347j7221j7292j6325j4645j3018j1858j0815r279p133m916
59809E27678l365k886l249l757l837l440k925k574k375k141j759j446j671k616
$$ y = [523829, 527683, 530964, 533851, 536599, 539058, 540981, 542479, 544032, 546142, 548934, 552044, 554987, 557640, 560185, 562651, 564868, 566975, 569524, 572841, 576641, 580556, 584680, 589204, 593827, 597940, 601182, 603452, 604685, 605172, 605917, 608045, 611753, 616203, 620402, 623756, 625854, 626407, 625606, 624047, 622009, 619122, 615070, 610271, 605506, 601121, 596970, 593051, 589762, 587465, 586088, 585244, 584597, 584048, 583770, 584102, 585250, 586995, 588869, 590727, 592960, 596015, 599969, 604854, 611197, 619759, 630682, 643276, 656699, 670338, 683289, 693987, 700973, 703958, 703894, 702290, 700879, 701469, 705042, 710575, 715263, 716379, 712882, 705294, 694580, 681480, 666527, 650180, 632959, 615667, 599342, 584697, 571679, 559821, 549006, 539727, 532594, 527678, 524313, 521427, 518178, 514421, 510584, 507144, 504219, 501645, 499270, 497129, 495370, 493924, 492253, 489637]
59795D89637l681l968l322k448j797j057q9L93j30q79p10J71M31m87j696k241
59779D68127k202k097j996j724j389j273j518k102k822l216k926k175j447p84
59765D40456oN20J72p12q88J45J401J846J787K184L184M092M401M159L676L399
59749D69816L765M583M994M582M138M598N585N802M751L222K128J622J432J331
59735E22349J083M74k73o46o29q45j672k572k751k205j671j610j686j393q73p50
59719E04330j246j870k131k170k379k619k386j636q36j72P14J943K965L250K997
59704D98754K781K873L203L605L782L455K915K919L647M320M318M167M679N591
59690E51009N925N301M090K543P46p34j223j063j295k103k483j808p36j03J91
$$ y = [489637, 485956, 481988, 478666, 476218, 474421, 473364, 473275, 473668, 473538, 472659, 471949, 472120, 472551, 472064, 470368, 468127, 465925, 463828, 461832, 460108, 458719, 457446, 455928, 453826, 451004, 447788, 444862, 442687, 441240, 440456, 440450, 440970, 441142, 440430, 439542, 439687, 441088, 442934, 444721, 446905, 450089, 454181, 458582, 462741, 466417, 469816, 473581, 478164, 483158, 487740, 491878, 496476, 502061, 507863, 512614, 515836, 517964, 519586, 521018, 522349, 523432, 523906, 523633, 522987, 522358, 521513, 519841, 517269, 514518, 512313, 510642, 509032, 507346, 505953, 505080, 504330, 503084, 501214, 499083, 496913, 494534, 491915, 489529, 487893, 487057, 486885, 487599, 489542, 492507, 495757, 498754, 501535, 504408, 507611, 511216, 514998, 518453, 521368, 524287, 527934, 532254, 536572, 540739, 545418, 551009, 556934, 562235, 566325, 568868, 569614, 568880, 567657, 566594, 565299, 563196, 560713, 558905, 558169, 558066, 558257]
59675E58257N68Q41N96Mn38j197k366l720m373m001l239k834k906l131l303l401
59659E25257l347k924k078j136n43k33M86K101M012M911M256K897K160K515L409
59644E41743L979L616K128j83k620m548n768o326o195n402m294l373k830k451
59630E07476j942j195l26M04P33O14K65p1k77k64J3L27K01n77j634k329k356j934
59612D97128j581j835k792l755l674k283o03J17k56p83o52J41J097J708J599P78
59596D84354j72n16j60K74K38j71n21n37k12K55N06L13j00l51n38j071j822k083
59578D77686j655j359j877k734l075k987l228l862m141l702k972k262j407n41
59564D41884l36r38j445j113l88kL05J240K527L130K741K067J637J288J004J202
$$ y = [558257, 558825, 559666, 560262, 560266, 559728, 558531, 556165, 552445, 548072, 544071, 540832, 537998, 535092, 531961, 528658, 525257, 521910, 518986, 516908, 515772, 515229, 514996, 515482, 517583, 521595, 526506, 530762, 533659, 535819, 538334, 541743, 545722, 549338, 551466, 551283, 548663, 544115, 538347, 532021, 525826, 520424, 516130, 512757, 509927, 507476, 505534, 504339, 504013, 504417, 505150, 505764, 506029, 505958, 505681, 505417, 505430, 505757, 505958, 505381, 503747, 501418, 499062, 497128, 495547, 493712, 490920, 487165, 483491, 481208, 480605, 480722, 480466, 479683, 479031, 479172, 480269, 481977, 483576, 484354, 484182, 483666, 483506, 483780, 484018, 483847, 483326, 482789, 482577, 482832, 483338, 483651, 483551, 483200, 482662, 481591, 479769, 477686, 476031, 474672, 472795, 470061, 466986, 463999, 460771, 456909, 452768, 449066, 446094, 443832, 442425, 441884, 441548, 440610, 439165, 438052, 437664, 437662, 437967, 439207, 441734, 444864, 447605, 449672, 451309, 452597, 453601, 454803]
59548D54803J874K273J989J534J434J476J459J896L190M850O357Q282J1452J5464
59534E18333J9073K1701K3262K2663J8109R592m5p339j0839j1136r318o342l264
59521E84450q86Q35K404L887M898N288N268M941M235L224K024M89j525l636n203
59506F10693o150o990p995q812r025q694q147p591p113o754o407n863n118m437
59492E11597l996l632l099k344j482o60p2J40J39L58J003J797K353K689L162M028
59476E11981N284O795Q316R375R491Q705P653O871O134M730K373m16k833m370
59462E80089m794m022k416q76m6M79J632L562N441O712P831R465J1502J3395J5022
59447F42976J6646J8273J9574K0276K0103J8546J5170J0106L905k836r263j4134
$$ y = [454803, 456677, 458950, 460939, 462473, 463907, 465383, 466842, 468738, 471928, 476778, 483135, 491417, 502869, 518333, 537406, 559107, 582369, 605032, 623141, 632733, 632688, 625349, 614510, 603374, 594056, 587714, 584450, 583564, 584399, 586803, 590690, 595588, 600876, 606144, 611085, 615320, 618544, 620568, 621057, 619532, 615896, 610693, 604543, 597553, 589558, 580746, 571721, 563027, 554880, 547289, 540176, 533422, 527015, 521152, 516034, 511597, 507601, 503969, 500870, 498526, 497044, 496384, 496312, 496452, 496591, 496949, 497952, 499749, 502102, 504791, 507953, 511981, 517265, 524060, 532376, 541751, 551242, 559947, 567600, 574471, 580605, 585335, 587708, 587292, 584459, 580089, 575295, 571273, 568857, 567981, 567935, 568414, 570046, 573608, 579049, 585761, 593592, 603057, 614559, 627954, 642976, 659622, 677895, 697469, 717745, 737848, 756394, 771564, 781670, 785575, 782739, 773476, 759342]
59435G59342j6627j7258j7255j7096j6318j4786j3244j2366j1868j1003r453p534
59423E94534n833m798m284l411j388J472M128O243Q503J1406J4634J7986K2060
59410F61252K7276L2665L6169L5731K9972J8932M999p685j5918j9391j9511j7053
59398G67438j2005n063K053P659J0339Q459J090j0086k0998k8143l0841l0510
59386F59392k8661k6062k2972j9390j5385j1621r058p838o997n695m179l073k321
59373D96140j428l64M40P49O97M94L70N78J053J322J095P36P25R59J000P96O89
59356E06051R16J476K353L472M573N452O197O902P440P847Q552R834J1338J2655
59342E95058J3998J5745J7562J8748J9240J9495J9514J8726J6970J4750J2394
$$ y = [759342, 742715, 725457, 708202, 691106, 674788, 660002, 646758, 634392, 622524, 611521, 602068, 594534, 588701, 583903, 579619, 576208, 574820, 576292, 580420, 586663, 595166, 606572, 621206, 639192, 661252, 688528, 721193, 757362, 793093, 823065, 841997, 846996, 839311, 823393, 804002, 784491, 767438, 755433, 750370, 752423, 760082, 770421, 778880, 779970, 769884, 748886, 720743, 689902, 659392, 630731, 604669, 581697, 562307, 546922, 535301, 526243, 518405, 511408, 505713, 501534, 498461, 496140, 494712, 494348, 494788, 495537, 496234, 496728, 497098, 497676, 498729, 500051, 501146, 501882, 502607, 503566, 504566, 505362, 506051, 506967, 508443, 510796, 514268, 518841, 524293, 530490, 537392, 544832, 552679, 561231, 571065, 582403, 595058, 609056, 624801, 642363, 661111, 680351, 699846, 719360, 738086, 755056, 769806, 782200]
59331G82200R675O523L387N99k045m658o826q262r342j0537j1652j2173j2051
59318G24838j1606j0893r728q256p026o376o071n568m535l152j968j319q94j48
59304F47298Q08J213Q15M45R51K039K847L386M547O720R215J1317J3297J5988
59290G20886J9755K4023K7317K7529K2852J3330J439r415j7106k1490k3282k2933
59278G62905k0742j7378j3778j0447p249l858l61K716M906O294P535R286J1559
59265G31388J3649J4792J4880J4351J3429J1769R044N665K502q3k542n314q093
59252H15437j0182j1384j2109j2633j2705j2090j1131j0428j0068r586q744p980
59240F86397p767p710o817m799k617j447j314j295p64J03J015J967K743K730J777
$$ y = [782200, 791875, 798398, 801785, 802384, 800339, 795681, 788855, 780593, 771251, 760714, 749062, 736889, 724838, 713232, 702339, 692611, 684355, 677329, 670953, 664882, 659314, 654779, 651627, 649659, 648340, 647446, 647298, 648106, 649319, 650134, 650579, 651530, 653569, 656416, 659802, 664349, 671069, 680284, 691601, 704898, 720886, 740641, 764664, 791981, 819510, 842362, 855692, 857131, 847716, 830610, 809120, 785838, 762905, 742163, 724785, 711007, 700560, 693311, 689453, 689092, 691808, 696714, 703008, 710543, 719829, 731388, 745037, 759829, 774709, 789060, 802489, 814258, 823302, 828967, 831469, 831386, 828844, 823530, 815437, 805255, 793871, 781762, 769129, 756424, 744334, 733203, 722775, 712707, 703121, 694377, 686397, 678630, 670920, 664103, 659304, 656687, 655240, 653926, 652631, 651867, 651970, 652985, 654952, 657695, 660425, 662202]
59225F62202O81K23L8q43k538m224n426o617q214r696j0201r635q747q293q379
59210E80331q507q051o832n286l978k997k182j748k079k844l007k196j317j305
59196E28002j736j474l00Q54J257J123J013J151J618K568L936N235N944N928N495
59181E60614N182N475O316O958O698N741M888M421L956L463L593M644N854O319
59167F34122O172O206O698P269P720Q368R457J0736J1748J2173J1903J1076J0019
59154G53667Q935P601N617K939Rk570m379n433o275p541r094r959r483q283p484
59139G08267p343p246o845o381n883n033m036l760m547n482n426m266k601p72
59125F38646J256L280M913O109P118Q001Q673R337J0361J1704J2864J3434J3504
$$ y = [662202, 662883, 663106, 663144, 662301, 659763, 655539, 650113, 643496, 635282, 625586, 615385, 605750, 597003, 588710, 580331, 571824, 563773, 556941, 551655, 547677, 544680, 542498, 540750, 538671, 535827, 532820, 530624, 529307, 528002, 526266, 524792, 524492, 525346, 526603, 527726, 528739, 529890, 531508, 534076, 538012, 543247, 549191, 555119, 560614, 565796, 571271, 577587, 584545, 591243, 596984, 601872, 606293, 610249, 613712, 617305, 621949, 627803, 634122, 640294, 646500, 653198, 660467, 668187, 676555, 686012, 696748, 708496, 720669, 732572, 743648, 753667, 762602, 770203, 775820, 778759, 778768, 776198, 771819, 766386, 760111, 752570, 743476, 733517, 724034, 715751, 708267, 700924, 693678, 686833, 680452, 674569, 669536, 665500, 661740, 657193, 651711, 646285, 642019, 639418, 638646, 639902, 643182, 648095, 654204, 661322, 669323, 677996, 687333, 697694, 709398, 722262, 735696, 749200]
59112G49200J3524J4079J5472J7233J8081J7021J4459J1863J0230R378Q731Q141
59100I07412P648O960N702L989K285Q07o18k069l244l780l740l606l834m481n317
59085I04114o148o886p366p452p473q160r861j2006j3756j4918j5792j6387j6398
59072G61511j5939j5513j5121j4105j2210j0192q899q303p903p553p227o438m807
59059F27301l025k333k945l764l840l397l120l052k753k098j416j034j088j540
59045E91896k047k060j427o86l79l53j50J43Q4j96M4J112K395L207L647M212M984
59028F04426N632N986O184O458P039Q127R580J0871J1760J2721J4248J5864J6527
59015G35423J5982J4967J3943J2354R662O430L714J676m60l082n458o489n818
$$ y = [749200, 762724, 776803, 792275, 809508, 827589, 844610, 859069, 870932, 881162, 890540, 899271, 907412, 915060, 922020, 927722, 931711, 933996, 934803, 934185, 932116, 928872, 925092, 921352, 917746, 913912, 909431, 904114, 897966, 891080, 883714, 876262, 868789, 860629, 850768, 838762, 825006, 810088, 794296, 777909, 761511, 745572, 730059, 714938, 700833, 688623, 678431, 669532, 661229, 653326, 645773, 638546, 632108, 627301, 624276, 621943, 618998, 615234, 611394, 607997, 604877, 601825, 599072, 596974, 595558, 594524, 593436, 591896, 589849, 587789, 586362, 585676, 585297, 584944, 584794, 584937, 585021, 584825, 584869, 585981, 588376, 591583, 595230, 599442, 604426, 610058, 616044, 622228, 628686, 635725, 643852, 653432, 664303, 676063, 688784, 703032, 718896, 735423, 751405, 766372, 780315, 792669, 802331, 808761, 812475, 814151, 813691, 810609, 805151, 798662, 792844]
59002G92844m009j929j35J302K555L736M797N696O377O559N818M156K229P28k91
58987H30433j208k203l227m413n927p512q741r720j0961j2424j3327j3077j1924
58974G25769j0323q298n844l444j577m6J626L350M635N491O450P676Q676R123
58960G43264R415J0039J0719J0662R512P636N502L095J69l142o234q674j0618
58947G81345j2398j3820j4274j3613j2460j1451j0461r029p181n391l885k517
58935F64865j412j075j654k565l172l499l887m282m327m011l743l756l861l892
58921F19729l989m197m156l575k832k669l188l552k874j210N33J568J873J956
58907E93417K253K830L508M170N014O428Q517J0823J2687J3907J4760J5341J5240
$$ y = [792844, 788835, 786906, 786771, 788073, 790628, 794364, 799161, 804857, 811234, 817793, 823611, 827767, 829996, 830724, 830433, 829225, 827022, 823795, 819382, 813455, 805943, 797202, 787482, 776521, 764097, 750770, 737693, 725769, 715446, 707148, 701304, 697860, 696283, 696237, 697863, 701213, 705848, 711339, 717789, 725465, 734141, 743264, 752679, 762718, 773437, 784099, 793611, 801247, 806749, 809844, 810013, 806871, 800637, 791963, 781345, 768947, 755127, 740853, 727240, 714780, 703329, 692868, 683839, 676658, 671267, 667382, 664865, 663453, 662378, 660724, 658159, 654987, 651488, 647601, 643319, 638992, 634981, 631238, 627482, 623621, 619729, 615740, 611543, 607387, 603812, 600980, 598311, 595123, 591571, 588697, 587487, 588020, 589588, 591461, 593417, 595670, 598500, 602008, 606178, 611192, 617620, 626137, 636960, 649647, 663554, 678314, 693655, 708895]
58894G08895J4081J2216J0546R707R571R673R967J1105J3789J7864K2128K5244
58882H74786K6797K7234K6867K5376K2420J8330J3872R558N428J300l011p536
58870A041421j1951j5733j8653k0841k2140k1909j9993j7470j5722j4893j3999
58859H48117j2547j1241j0881j1327j1987j2762j3895j5165j5838j5434j4242
58848G02798j2974j2097j1468j0583r237p846o920o372n724m971m691n138n739
58835E99038n818n376m797m212l611l255l412l818l953l779l769m114m411m153
58821E40560l256j992p67J2J68J5J28O70J227J436J523J954K668K967K358J215
58805E50886M42M16N58J10p94j235p43M0J88l45p78n52J46Q24J231J366J340J365
$$ y = [708895, 722976, 735192, 745738, 755445, 765016, 774689, 784656, 795761, 809550, 827414, 849542, 874786, 901583, 928817, 955684, 981060, 1003480, 1021810, 1035682, 1045240, 1050668, 1051968, 1048957, 1041421, 1029470, 1013737, 995084, 974243, 952103, 930194, 910201, 892731, 877009, 862116, 848117, 835570, 824329, 813448, 802121, 790134, 777372, 763477, 748312, 732474, 717040, 702798, 689824, 677727, 666259, 655676, 646439, 638593, 631673, 625301, 619577, 614606, 609915, 604777, 599038, 593220, 587844, 583047, 578835, 575224, 571969, 568557, 564739, 560786, 557007, 553238, 549124, 544713, 540560, 537304, 535312, 534545, 534557, 534725, 534740, 534868, 535538, 536765, 538201, 539724, 541678, 544346, 547313, 549671, 550886, 551328, 551744, 552302, 552412, 551618, 550383, 549640, 549680, 549868, 549523, 548745, 548193, 548339, 549163, 550394, 551760, 553100, 554465]
58787E54465J559J715J544J276J612K803M187M985N357O153P676R166R640Q860
58773F20998P322N616M074K809J686L18j546l553m953n410n325n227n098m618
58759F07093l804l013k398j829j368j316j563j347r2J807L365M112M354M481M452
58744F12934M102L598L375L714M555N610O599P465Q344R271R986J0218J0174J0386
58730G10331J0982J1424J1208J0590J0205J0058R425P916O112M894M365L915L223
58717H14648K723K985M083N648P199Q232Q360P765P222P302P615P196N550K999
58703H99527J12k807n706q604j1510j4266j6546j8234j9688k1213k2437k2645
58691G35983k1712k0191j8472j6582j4759j3490j2625j1250q939o543n232n221
$$ y = [554465, 556024, 557739, 559283, 560559, 562171, 564974, 569161, 574146, 579503, 585656, 593332, 602498, 612138, 620998, 628320, 633936, 638010, 640819, 642505, 642823, 641277, 637724, 632771, 627361, 622036, 616809, 611711, 607093, 603289, 600276, 597878, 596049, 594681, 593365, 591802, 590455, 590363, 592170, 595535, 599647, 604001, 608482, 612934, 617036, 620634, 624009, 627723, 632278, 637888, 644487, 651952, 660296, 669567, 679553, 689771, 699945, 710331, 721313, 732737, 743945, 754535, 764740, 774798, 784223, 792139, 798251, 803145, 807510, 811425, 814648, 817371, 820356, 824439, 830087, 837286, 845518, 853878, 861643, 868865, 876167, 883782, 890978, 896528, 899527, 899639, 896832, 891126, 882522, 871012, 856746, 840200, 821966, 802278, 781065, 758628, 735983, 714271, 694080, 675608, 659026, 644267, 630777, 618152, 606902, 597963, 591420, 586188, 580967]
58679E80967n877o586o903o386n088l885l547l632l048j553O0J253K438M194O408
58664E48815Q455R823J0404J0540J0803J1370J1584J0568Q252N380K575j4k163
58651F46392l351l461l178l285l830m251m066l280k366k020k654l967n106n391
58637E96186m709l311j575k3Q25Q65N47N05J083K120L010L127K425J494P90R0
58621F03449q85j697j698j045m80j43N77K012L816N674P588R242R956R615Q932
58606F54913Q351P444N809L879K260R06m18j460j913k150k741l571m072m134m160
58591F58943m302m252l725k771j616m18Q66K576M983P660R615J0354J0488J0840
58577F99241J1325J1145R940Q273P027O607O617O281N371M729N388P170Q858R952
$$ y = [580967, 575090, 568504, 561601, 555215, 550127, 546242, 542695, 539063, 536015, 534462, 534522, 535775, 538213, 542407, 548815, 557270, 567093, 577497, 588037, 598840, 610210, 621794, 632362, 640614, 645994, 648569, 648555, 646392, 643041, 639580, 636402, 633117, 629287, 625036, 620970, 617690, 615324, 613304, 610650, 606683, 601577, 596186, 591477, 588166, 586591, 586568, 587393, 588258, 588805, 589310, 590393, 592513, 595523, 598650, 601075, 602569, 603359, 603449, 602564, 600867, 599169, 598124, 597644, 597501, 598078, 600090, 603906, 609580, 617168, 626410, 636366, 645981, 654913, 663264, 670708, 676517, 680396, 682656, 683562, 683144, 681684, 679771, 677621, 674880, 671309, 667237, 663103, 658943, 654641, 650389, 646664, 643893, 642277, 641859, 642725, 645301, 650284, 657944, 667559, 677913, 688401, 699241, 710566, 721711, 731651, 739924, 746951, 753558, 760175, 766456, 771827, 776556, 781944, 789114, 797972, 807924]
58563H07924J1382J3982J7154J9761K1672K3397K4716K4763K3326K1106J8645
58552A027828J5793J2316Q459M674J261j739m551p479j0379j2596j3734j4174
58540A005679j4427j4424j4037j3824j4540j6112j7766j8911j9307j8735j7294
58529H26302j5755j4711j3610j1510q668o395n254m362k750o10J123J853J752
58516G47405J425J389J585J491J013Q45J456K135J895J024P46J484K440K941L208
58501G72482L549L705L337K533J533M95l58q88j383k130k790k833k511k499k666
58486G69576k213j047l9L70P97J894L591N597P768R658J0696J1104J1784J2851
58472H42387J3282J2475J1111R905Q366N635J881j919n056p314q601r027q999
$$ y = [807924, 819306, 833288, 850442, 870203, 891875, 915272, 939988, 964751, 988077, 1009183, 1027828, 1043621, 1055937, 1064396, 1069070, 1070331, 1068592, 1064041, 1056562, 1046183, 1033587, 1019853, 1005679, 991252, 976828, 962791, 948967, 934427, 918315, 900549, 881638, 862331, 843596, 826302, 810547, 795836, 782226, 770716, 762048, 755653, 750399, 746037, 743287, 742677, 743800, 745653, 747405, 748830, 750219, 751804, 753295, 754308, 755153, 756609, 758744, 760639, 761663, 762409, 763893, 766333, 769274, 772482, 776031, 779736, 783073, 785606, 787139, 787634, 787276, 786388, 785005, 782875, 780085, 777252, 774741, 772242, 769576, 767363, 766316, 766277, 766647, 767444, 769338, 772929, 778526, 786294, 795952, 806648, 817752, 829536, 842387, 855669, 868144, 879255, 889160, 897526, 903161, 905042, 903123, 898067, 890753, 882152, 873125, 864126]
58459H64126q746q053o724m947k977r36R17K297L401M635N733N935N203M297L489
58444H67650K174J29j984l703n246o354o027m224k534k167k241j249P41K553L730
58429H41248M598N139N142N137N874P162Q228R006J0036J1379J2640J3785J4921
58416I54295J5464J4590J2395R672O671L128o19l543n130n818o129o152n977n862
58402I76985n803n490m862m161l421k452j333m28J95Q74J772K600K969K756K137
58387I62338J492J125R29N23j83q24j141j259j197o77K32Q90R60J002J698K989
58371I68897M465O023P564Q609Q880Q843R097R571R891J0060J0310J0745J1562
58358A084517J2989J4545J5081J4248J3124J2746J2773J2349J1473J0504R147
$$ y = [864126, 855380, 847327, 840603, 835656, 832679, 831743, 832660, 834957, 838358, 842993, 848726, 854661, 859864, 864161, 867650, 869824, 869953, 867969, 864266, 859020, 852666, 846639, 842415, 839881, 837714, 835473, 834224, 834965, 837518, 841248, 845846, 850985, 856127, 861264, 867138, 874300, 882528, 891534, 901570, 912949, 925589, 939374, 954295, 969759, 984349, 996744, 1006416, 1013087, 1016215, 1015596, 1012053, 1006923, 1001105, 994976, 988824, 982847, 976985, 971182, 965692, 960830, 956669, 953248, 950796, 949463, 949035, 949230, 950104, 951876, 954476, 957445, 960201, 962338, 963830, 964955, 965884, 966407, 966224, 965400, 964259, 963000, 961803, 961126, 961358, 962248, 963208, 964210, 965908, 968897, 973362, 979385, 986949, 995558, 1004438, 1013281, 1022378, 1031949, 1041840, 1051900, 1062210, 1072955, 1084517, 1097506, 1112051, 1127132, 1141380, 1154504, 1167250, 1180023, 1192372, 1203845, 1214349, 1223496]
58347A223496P073M993M013M276N244O722Q612J0141J0585J0421J0689J1488J2192
58334A329945J2837J4087J5902J7347J7785J7415J6702J6010J5721J5907J5984
58323A505642J5346J4233J3385J3037J2793J2267J1384J0345R658R749J0300J0541
58311A648680J0495J1101J2738J4660J6254J7755J9186J9921J9972K0327K1313
58300A832402K2068K2446K3609K5648K6534K5003K2745K1917K2234K2419K2894
58289B089919K4637K6802K7843K8112K8968L0330L1314L2340L4278L6348L7186
58278B428077L7212L7671L8246L7954L7518L8364M0038M1198M2413M5394N0019
58267B874104N4642N8776O2968O6778O9439P1879P5554P9923Q3498Q6503Q9940
$$ y = [1223496, 1230569, 1235562, 1239575, 1243851, 1249095, 1255817, 1264429, 1274570, 1285155, 1295576, 1306265, 1317753, 1329945, 1342782, 1356869, 1372771, 1390118, 1407903, 1425318, 1442020, 1458030, 1473751, 1489658, 1505642, 1520988, 1535221, 1548606, 1561643, 1574436, 1586703, 1598087, 1608432, 1618090, 1627839, 1638139, 1648680, 1659175, 1670276, 1683014, 1697674, 1713928, 1731683, 1750869, 1770790, 1790762, 1811089, 1832402, 1854470, 1876916, 1900525, 1926173, 1952707, 1977710, 2000455, 2022372, 2044606, 2067025, 2089919, 2114556, 2141358, 2169201, 2197313, 2226281, 2256611, 2287925, 2320265, 2354543, 2390891, 2428077, 2465289, 2502960, 2541206, 2579160, 2616678, 2655042, 2695080, 2736278, 2778691, 2824085, 2874104, 2928746, 2987522, 3050490, 3117268, 3186707, 3258586, 3334140, 3414063, 3497561, 3584064, 3674004]
58256C674004R3083R4744R5846R7817R9600R9535R8961J00484J03748J06657J09613
58245D774092J14646J21298J27589J34189J43251J53735J62458J69478J77909
58236F078645J88588J99368K09584K20862K33601K46864K61407K78683K97432
58227H215034L15640L34830L57930L84196M11196M40190M74019N11521N50092
58218A1994648N91908O40954O96033P53994Q17637Q92499R78046J070823J173998
58209A9610540J294413J432819J587576J765400J977054K225638K512257K850433
58201C5256130L261109L757770M353799N081898N989379P121288Q532705J0315958
58193H3670036J2593458J5488752J9118312K3557534K8698423L4063529L8751248
$$ y = [3674004, 3767087, 3861831, 3957677, 4055494, 4155094, 4254629, 4353590, 4454074, 4557822, 4664479, 4774092, 4888738, 5010036, 5137625, 5271814, 5415065, 5568800, 5731258, 5900736, 6078645, 6267233, 6466601, 6676185, 6897047, 7130648, 7377512, 7638919, 7917602, 8215034, 8530674, 8865504, 9223434, 9607630, 10018826, 10459016, 10933035, 11444556, 11994648, 12586556, 13227510, 13923543, 14677537, 15495174, 16387673, 17365719, 18436542, 19610540, 20904953, 22337772, 23925348, 25690748, 27667802, 29893440, 32405697, 35256130, 38517239, 42275009, 46628808, 51710706, 57700085, 64821373, 73354078, 83670036, 96263494, 111752246, 130870558, 154428092, 183126515, 217190044, 255941292]
58186B55941292M1552164M1134962L6339864K6739178J3273684j693852j5288413
58179C97998879k5412405l1379800l3579408l2812237k9954339k5898161k1449961
58172A97512568j7216394j3675603j1286199j0330863j0608470j1431010j2047801
58165A10916228j2074818j1535960j0620959r501654q313114p168359o134717
58158D5566647n227682m444707l785601l240577k786223k402888k082021j814570
58150A9782378j586816j390366j224814j088439r74953q79778q01372p36372o80102
58141A0419366o31039n88740n49103n07560m65159m25813l89544l53805l19233
58132F189370k88552k61744k37535k17781k05314j98838j94452j90523j87000
$$ y = [255941292, 297493456, 338628418, 374968282, 401707460, 414981144, 413287292, 397998879, 372586474, 341206674, 307627266, 274815029, 244860690, 218962529, 197512568, 180296174, 166620571, 155334372, 145003509, 134395039, 122964029, 110916228, 98841410, 87305450, 76684491, 67182837, 58869723, 51701364, 45566647, 40338965, 35894258, 32108657, 28868080, 26081857, 23678969, 21596948, 19782378, 18195562, 16805196, 15580382, 14491943, 13516990, 12637212, 11835840, 11099468, 10419366, 9788327, 9199587, 8650484, 8142924, 7677765, 7251952, 6862408, 6508603, 6189370, 5900818, 5639074, 5401539, 5183758, 4978444, 4779606, 4585154, 4394631, 4207631]
58123D207631j81956j73428j63055j53758j45222j35513j25446j17383j11077
58114B900793j04516r7634r1618q5911p9372p3208o9317o6824o3473n9391n6409
58103B053120n4672n3018n1608n1233n0909m9122m6674m5562m5709m5325m3857
58092A515431m2085m0037l7222l4286l2232l0566k8243k5707k4043k3015k1846
58081A176149k1014k1224k1565k0807j9601j9361j9799j9684j9247j9592k0381
58070I53874k0315j9478j9106j9373j9302j8636j7918j7048j5393j3213j1400
58059G62692j0017q514p202p119q476j0310j1591j1914j1444j0876j0922j1293
58047F43014j0949r803r052r208r184q232p242p047o971o360n986o425o528n271
$$ y = [4207631, 4025675, 3852247, 3689192, 3535434, 3390212, 3254699, 3129253, 3011870, 2900793, 2796277, 2698643, 2607025, 2521114, 2441742, 2368534, 2299217, 2232393, 2168920, 2109529, 2053120, 1998448, 1945430, 1893822, 1842589, 1791680, 1742558, 1695884, 1650322, 1604613, 1559288, 1515431, 1473346, 1433309, 1396087, 1361801, 1329569, 1299003, 1270760, 1245053, 1221010, 1197995, 1176149, 1155135, 1133911, 1112346, 1091539, 1071938, 1052577, 1032778, 1013094, 993847, 974255, 953874, 933559, 914081, 894975, 875602, 856300, 837664, 819746, 802698, 787305, 774092, 762692, 752675, 744161, 736959, 729840, 721364, 711054, 699463, 687549, 676105, 665229, 654307, 643014, 632065, 622262, 613210, 604002, 594818, 586586, 579344, 572297, 565326, 558966, 552980, 546555, 540027, 534756]
58033E34756l806l801m921n787o367p448q637q938q677q940r615r747r261q687
58019D30124p755o063m547m450n269n445m793m445m708m707m075l354k787k107
58005C65619j480j313j280p44N5M37N91J214K165K725K910L192L319K721J875
57990C82006J829K453K540J615M44k58n07m42PP08J293J546J315M69n83r92p21
57973C92722p86j551j905j159n21j212k238j845l66L23k93r85j042j043j383j762
57957C74954k200l104m135m461m164m185m799n366n604n808n779m834l054j446
57943C16015p17p69j193j420o60J166K802L134K949L866N902P550Q150Q508R167
57928C64450R605R417Q963Q517P905P175O531N637M050K352J548J368M58j642
$$ y = [534756, 530950, 527149, 522228, 516441, 510074, 502626, 493989, 485051, 476374, 467434, 457819, 448072, 438811, 430124, 422369, 416306, 411759, 407309, 402040, 396595, 391802, 387357, 382649, 377942, 373867, 370513, 367726, 365619, 364139, 362826, 361546, 360802, 360857, 361294, 361885, 363099, 365264, 367989, 370899, 374091, 377410, 380131, 382006, 383835, 386288, 388828, 390443, 390887, 390629, 390122, 389680, 389687, 390395, 391688, 393234, 394549, 395018, 394435, 393443, 392722, 391936, 390385, 388480, 387321, 386800, 385588, 383350, 381505, 381139, 381462, 381169, 380184, 379142, 378099, 376716, 374954, 372754, 369650, 365515, 361054, 356890, 352705, 347906, 342540, 336936, 331128, 325349, 320515, 317461, 316015, 315298, 314529, 313336, 311916, 311256, 312422, 315224, 318358, 321307, 325173, 331075, 338625, 346775, 355283, 364450, 374055, 383472, 392435, 400952, 408857, 416032, 422563, 428200, 432250, 434602, 436150, 437518, 437976, 436334]
57914D36334l982n806p325q658r337r269r046q937q563p845p322p251p291p335
57900C28367p654q160q418q447q541q380p384n939n038m665l897k651j895j831
57886B45467j427k44O78N16O4N24J889L240L974M038L559K871K365J985J362O22
57870B71483L49N42L81o74k244l643m485m570l988l380l270l129k044l31P10Q16
57854B42523J274K968N057O229O252N763N356N535O674Q361R370R009P921P141
57840C29433O785O267N197L702K134Q32j47j204k721m452n787o596p162p461p242
57825C11578o724o397o152n476m426l513k667j358K09J179J472J988L111M102
57811B86926M368M253M278M491M864N292M941K799p32l889n664o662p462p495
$$ y = [436334, 432352, 426546, 419221, 410563, 401226, 391957, 382911, 373974, 365411, 357566, 350244, 342993, 335702, 328367, 320713, 312553, 304135, 295688, 287147, 278767, 271383, 265444, 260406, 255741, 251844, 249193, 247298, 245467, 244040, 243796, 244474, 244990, 245054, 245578, 247467, 250707, 254681, 258719, 262278, 265149, 267514, 269499, 270861, 271483, 271832, 272374, 272755, 272081, 269837, 266194, 261709, 257139, 253151, 249771, 246501, 243372, 241328, 240997, 241707, 242523, 243797, 246765, 251822, 258051, 264303, 270066, 275422, 280957, 287631, 295992, 305362, 314371, 322292, 329433, 336218, 342485, 347682, 351384, 353518, 354350, 354203, 352999, 350278, 345826, 340039, 333443, 326281, 318820, 311578, 304854, 298457, 292305, 286829, 282403, 278890, 276223, 274865, 275074, 276253, 277725, 279713, 282824, 286926, 291294, 295547, 299825, 304316, 309180, 314472, 319413, 322212, 321480, 317591, 311927, 305265, 297803, 290308]
57797B90308o374n064m658m921n008m876m938m995m539l671k908k400k001j771
57783B32184j830k072k395k837l168k861j840o33M44J622K879L643L772L980M815
57768B35703N944O908P770Q450Q277O939N136L628K292P61p36j961l336n193o945
57753B73637p786p805p617p349o729n845n046m395l751l138k553j827j058p27
57739B08011q88q74k80L31K69k70p10r52j083q19QQ68J252J469K021K559K318
57722B13230J369O33P37J498K377K867K613J683O60M0l18p72j270j478j317r38
57706B21614m37P3L58L40K52L01M88R43J895L130M010M296M362M392M022L159
57690B53198K324J738Q53n79j766j943j534j467j767j686q65M36J919L503N124
$$ y = [290308, 283934, 278870, 274212, 269291, 264283, 259407, 254469, 249474, 244935, 241264, 238356, 235956, 233955, 232184, 230354, 228282, 225887, 223050, 219882, 217021, 215181, 214548, 214992, 216614, 219493, 223136, 226908, 230888, 235703, 241647, 248555, 256325, 264775, 273052, 279991, 285127, 288755, 291047, 291808, 291072, 289111, 285775, 280582, 273637, 265851, 258046, 250429, 243080, 236351, 230506, 225460, 221065, 217314, 214176, 211623, 209796, 208738, 208011, 207123, 206249, 205969, 206300, 206569, 206299, 205589, 204637, 203554, 202735, 202743, 203611, 204863, 206332, 208353, 210912, 213230, 214599, 215232, 215969, 217467, 219844, 222711, 225324, 227007, 227667, 227707, 227389, 226617, 225347, 223869, 222552, 221614, 221177, 221250, 221608, 221948, 222200, 222501, 222989, 223932, 225827, 228957, 232967, 237263, 241625, 246017, 250039, 253198, 255522, 257260, 258113, 257534, 255768, 253825, 252291, 250824, 249057, 247371, 246506, 246942, 248861, 252364, 257488]
57675B57488O887R149J2143J5863K0622K7155L5768M6016N7502P0003Q1910Q9223
57663G29729Q7277P3558M8933J7188j5808m3646o2080p0766p2075o8610o2264
57652E61436n4658m7100m0084l3700k8278k3962k0093j6019j2190r531p943o468
57640B61410m786l513l044l017k967k794k436j856j332j101p57K52J548K015J184
57625B38806j73j021j088q39q74j411k008j913j004j31q9n93q19o58o93j064j251
57608B23177r35l69J53N85Q14O45J70k87o14q51q14m01j40o79j695k024j188j44
57590B15403j44j285k543l048k861k541k303j887j219p98j038j457j165j83M40
57575A93371P1o14o29L2O47P58L85l61j287j948k026j638j023k72L76M92J28o9
$$ y = [257488, 264375, 273524, 285667, 301530, 322152, 349307, 385075, 431091, 488593, 558596, 640506, 729729, 817006, 890564, 939497, 956685, 940877, 897231, 835151, 764385, 692310, 623700, 561436, 506778, 459678, 419594, 385894, 357616, 333654, 313561, 297542, 285352, 275821, 267878, 261410, 256624, 253111, 250067, 247050, 244083, 241289, 238853, 236997, 235665, 234564, 233807, 234059, 235607, 237622, 238806, 238633, 237612, 236524, 235685, 234811, 233400, 231392, 229479, 228475, 228344, 228255, 227662, 226843, 226185, 225492, 224428, 223177, 222242, 221873, 222026, 222611, 223425, 224070, 224240, 223953, 223339, 222488, 221674, 221273, 221133, 220454, 218759, 216735, 215547, 215403, 215259, 213974, 211431, 208383, 205522, 202981, 200678, 198791, 197572, 196774, 195736, 194279, 193114, 192931, 193371, 193442, 192828, 192199, 192231, 192878, 193636, 194021, 193660, 192373, 190425, 188399, 186761, 185738, 185466, 185842, 186334, 186462, 186393]
57557A86393K25N33N19N93J049J363J133J004J696K781L377L470L510L233K091
57542B12970N56k02J73J047J890K586K838K352J579J276J331J017L06o2J39L10
57526B30106J01j25m7K00M91Q28R95P99O03Q70J284J191P09M77M64R1n31o75l22
57507B37509k19m22j02Q95J512J075L24K27O87J098J331J492J338P35R4j65j91
57490B47218k39j75Q4J87l0m8O42J682K256K131J853K006K592K999K514J115k06
57473B66581l46N82J328J050K72K6N51J228J522J478J490J792K184K183J641J129
57457B84691J359K314L265L638L507L185K896K845L122L391L154K462K007K295
57443C24131L035L488L198K353J616J552K064K529K693L060M000M897M869M073
$$ y = [186393, 186618, 187151, 187670, 188263, 189312, 190675, 191808, 192812, 194508, 197289, 200666, 204136, 207646, 210879, 212970, 213526, 213324, 213497, 214544, 216434, 219020, 221858, 224210, 225789, 227065, 228396, 229413, 229719, 229657, 229796, 230106, 230207, 230082, 230035, 230235, 230726, 231554, 232549, 233348, 233951, 234821, 236105, 237296, 238005, 238482, 238946, 239037, 238506, 237831, 237509, 237290, 236868, 236766, 237661, 239173, 240248, 240572, 240799, 241486, 242584, 243915, 245407, 246745, 247480, 247574, 247409, 247218, 246979, 246804, 246888, 247075, 247045, 246997, 247639, 249321, 251577, 253708, 255561, 257567, 260159, 263158, 265672, 266787, 266581, 266235, 266817, 268145, 269195, 269467, 269493, 270044, 271272, 272794, 274272, 275762, 277554, 279738, 281921, 283562, 284691, 286050, 288364, 291629, 295267, 298774, 301959, 304855, 307700, 310822, 314213, 317367, 319829, 321836, 324131, 327166, 330654, 333852, 336205, 337821, 339373, 341437, 343966, 346659, 349719, 353719, 358616, 363485, 367558]
57429C67558L489L566L828L830L666L475L137K682K419K452K596K805L171L501
57415D12175L483L287L376L659L471K555J507J113J687L013M441N136M860M420
57401D58183M666N246N131M255L635L851M358M541M538M695N082N769O841P775
57387E28566P717O715N903O016O492O501O149O070O416O804O898O578N920N286
57373F18031N109N313N357M975M452M050L763L753M341N345O043O077N872N915
57359F88396O210O622P128P496P402P099P318Q150Q747Q507P910P731Q036Q389
57345G95141Q588Q671Q600Q387Q241Q297Q471Q675Q799Q566P914P532Q211R612
57331I13705J0436J0067R255Q886Q923Q948Q972R179R424R559R710R904R960J0036
$$ y = [367558, 371047, 374613, 378441, 382271, 385937, 389412, 392549, 395231, 397650, 400102, 402698, 405503, 408674, 412175, 415658, 418945, 422321, 425980, 429451, 432006, 433513, 434626, 436313, 439326, 443767, 448903, 453763, 458183, 462849, 468095, 473226, 477481, 481116, 484967, 489325, 493866, 498404, 503099, 508181, 513950, 520791, 528566, 536283, 542998, 548901, 554917, 561409, 567910, 574059, 580129, 586545, 593349, 600247, 606825, 612745, 618031, 623140, 628453, 633810, 638785, 643237, 647287, 651050, 654803, 659144, 664489, 670532, 676609, 682481, 688396, 694606, 701228, 708356, 715852, 723254, 730353, 737671, 745821, 754568, 763075, 770985, 778716, 786752, 795141, 803729, 812400, 821000, 829387, 837628, 845925, 854396, 863071, 871870, 880436, 888350, 895882, 904093, 913705, 924141, 934208, 943463, 952349, 961272, 970220, 979192, 988371, 997795, 1007354, 1017064, 1026968, 1036928, 1046964]
57317A046964J0679J1884J2755J2542J1523J0515R997J0096J0807J1886J2878
57306A172526J3554J3975J4025J3532J2895J2820J3218J3235J2636J2220J2524
57295A317160J3001J3073J3079J3552J4262J4703J4908J5122J5246J5188J5252
57284A474546J5611J5880J5777J5674J5946J6338J6512J6644J6946J7100J6844
57273A653818J6678J7342J8831K0377K1146K0783J9561J8322J7793J7808J7611
57262A860070J7007J6532J6519J6749J7130J7781J8354J8243J7738J7765J8272
57251B052160J8150J7147J6479J6842J7318J7151J7093J7854J8575J8273J7664
57240B244706J7919J8534J8196J7127J6777J7520J8289J8435J8436J8716J9078
$$ y = [1046964, 1057643, 1069527, 1082282, 1094824, 1106347, 1116862, 1126859, 1136955, 1147762, 1159648, 1172526, 1186080, 1200055, 1214080, 1227612, 1240507, 1253327, 1266545, 1279780, 1292416, 1304636, 1317160, 1330161, 1343234, 1356313, 1369865, 1384127, 1398830, 1413738, 1428860, 1444106, 1459294, 1474546, 1490157, 1506037, 1521814, 1537488, 1553434, 1569772, 1586284, 1602928, 1619874, 1636974, 1653818, 1670496, 1687838, 1706669, 1727046, 1748192, 1768975, 1788536, 1806858, 1824651, 1842459, 1860070, 1877077, 1893609, 1910128, 1926877, 1944007, 1961788, 1980142, 1998385, 2016123, 2033888, 2052160, 2070310, 2087457, 2103936, 2120778, 2138096, 2155247, 2172340, 2190194, 2208769, 2227042, 2244706, 2262625, 2281159, 2299355, 2316482, 2333259, 2350779, 2369068, 2387503, 2405939, 2424655, 2443733]
57229B443733J9470K0067K0497K0094J9146J8744J9193J9579J9276J8867J9044
57218B657710J9351J8799J7281J5728J4974J4956J5121J5275J5630J6057J5871
57207B836753J4772J3596J3410J4074J4613J4846J5562J6955J8064J8327J8473
57196C009445J9208K0020K0140J9845J9857K0185K0385K0400K0318J9899J9096
57185C228798J8503J8549J8806J8729J8393J7896J6859J5354J4382J4492J4664
57174C415425J3704J2003J0847J0564J0498J0289J0051R692R045Q443Q189P837
57162C536587O827N361L960K665J474P97N90j81k214m700o554q059j0060j2258
57148C514235j3613j3943j3837j3440j2548j1453j0561r604q268o961n928m419
$$ y = [2443733, 2463203, 2483270, 2503767, 2523861, 2543007, 2561751, 2580944, 2600523, 2619799, 2638666, 2657710, 2677061, 2695860, 2713141, 2728869, 2743843, 2758799, 2773920, 2789195, 2804825, 2820882, 2836753, 2851525, 2865121, 2878531, 2892605, 2907218, 2922064, 2937626, 2954581, 2972645, 2990972, 3009445, 3028653, 3048673, 3068813, 3088658, 3108515, 3128700, 3149085, 3169485, 3189803, 3209702, 3228798, 3247301, 3265850, 3284656, 3303385, 3321778, 3339674, 3356533, 3371887, 3386269, 3400761, 3415425, 3429129, 3441132, 3451979, 3462543, 3473041, 3483330, 3493381, 3503073, 3512118, 3520561, 3528750, 3536587, 3543414, 3548775, 3552735, 3555400, 3556874, 3557671, 3558261, 3558080, 3555866, 3551166, 3544612, 3536553, 3526493, 3514235, 3500622, 3486679, 3472842, 3459402, 3446854, 3435401, 3424840, 3415236, 3406968, 3400007, 3394079, 3389660]
57136C389660k074j49L4r18j701k691n187q910j2236j4617j6804j8861j9877j9541
57122C266128j8273j5879j1900p199l417q31J527L831N320O214P870J0962J5316
57109C259669K1398L0011M0453N1104O2103P5447R2331J12542J36756J67232K05666
57098D254712K52487L08882L77447M60282N58414O73362Q06834R57920J122454
57089I772794J295252J470256J638022J786210J904097J985300K027559K034650
57081B3914140K016828J977679J891609J700755J349743Q33531K12593m18345
57073C3478533r76854j418120j732466j931075k033361k059180k025651j947605
57065A9354221j838567j710056j570770j427623j286888j153481j029729r16105
$$ y = [3389660, 3387586, 3387437, 3387471, 3386553, 3384852, 3382161, 3376974, 3368064, 3355828, 3341211, 3324407, 3305546, 3285669, 3266128, 3247855, 3231976, 3220076, 3212877, 3209460, 3208629, 3210156, 3213987, 3219307, 3225521, 3233391, 3244353, 3259669, 3281067, 3311078, 3351531, 3402635, 3464738, 3540185, 3632516, 3745058, 3881814, 4049046, 4254712, 4507199, 4816081, 5193528, 5653810, 6212224, 6885586, 7692420, 8650340, 9772794, 11068046, 12538302, 14176324, 15962534, 17866631, 19851931, 21879490, 23914140, 25930968, 27908647, 29800256, 31501011, 32850754, 33684285, 33896878, 33478533, 32501679, 31083559, 29351093, 27420018, 25386657, 23327477, 21301826, 19354221, 17515654, 15805598, 14234828, 12807205, 11520317, 10366836, 9337107, 8421002]
57057H421002q12994p20984o39718n67617n03151m45802l95535l51802l13544
57048C669855k79801k49889k23104j98919j77487j59374j44401j31313j18977
57039A986590j07381r6873q7106p7714o9449o3429n9355n5618n1187m6247m1032
57028A231199l5337k9438k4124j9367j4076p432P75J1485K6353M5700O7892R1045
57016A344675J12964J27848J25622R8485M8890j0330o3985j02393j23315j29569
57006A428892j25959j16807j04723r1198p7864o6329n6974m8993m1764l5466l0289
56995F32526k5895k2017j8908j6807j5395j4094j2665j1281j0163r132p547m882
56983D63740j516J224K053N94k642o735j0676j3721j5737j6874j6860j5270j2611
$$ y = [8421002, 7608008, 6887024, 6247306, 5679689, 5176538, 4730736, 4335201, 3983399, 3669855, 3390054, 3140165, 2917061, 2718142, 2540655, 2381281, 2236880, 2105567, 1986590, 1879209, 1782336, 1695230, 1617516, 1548067, 1484638, 1425283, 1369665, 1318478, 1272231, 1231199, 1195862, 1166424, 1142300, 1122933, 1108857, 1101425, 1102200, 1113685, 1140038, 1185738, 1253630, 1344675, 1457639, 1585487, 1711109, 1809594, 1858484, 1848154, 1784169, 1681776, 1558461, 1428892, 1302933, 1186126, 1081403, 990205, 912341, 846012, 789038, 740045, 698281, 662815, 632526, 606631, 584614, 565706, 548899, 533504, 519410, 506745, 495464, 485301, 476169, 468622, 463740, 462224, 463448, 465501, 466095, 463453, 456718, 446042, 432321, 416584, 399710, 382850, 367580, 354969]
56970C54969j0305r169q538p357n459l297j145Q84K770N059Q581J3066J6835J8672
56956C75566J9101J8860J7047J2253N079k009p278j0962j3828j5798j6291j5129
56944C66611j2738r991p905o848n980m104j106J962M274O137Q505J2078J6773
56931C67668K1494K4455K4340K1170J5728Q463l27r456j6961k1528k3282k3092
56919C88672k1720j9829j8058j6637j5202j3387j1384r716q606p770o819n746
56907B33798m951m750m912m921m605m142l483k314p83L99R33J505K776M314N189
56892B14053N402O042Q037J1266J4896J8130K0536K1917K2004K0280J6400J0852
56880C89815M864n24m993q422j0487j1152j0956j0253q643n774k299P24L177N885
$$ y = [354969, 344664, 335495, 326957, 319600, 314141, 310844, 309699, 310583, 313353, 318412, 326993, 340059, 356894, 375566, 394667, 413527, 430574, 442827, 447906, 445897, 438619, 427657, 413829, 398031, 381740, 366611, 353873, 343882, 335977, 329129, 323149, 319045, 317939, 319901, 324175, 330312, 338817, 350895, 367668, 389162, 413617, 437957, 459127, 474855, 483318, 482991, 473535, 456574, 435046, 411764, 388672, 366952, 347123, 329065, 312428, 297226, 283839, 272455, 262739, 254133, 246363, 239544, 233798, 228847, 224097, 219185, 214264, 209659, 205517, 202034, 199720, 198937, 199336, 200269, 201774, 204550, 208864, 214053, 219455, 225497, 233534, 244800, 259696, 277826, 298362, 320279, 342283, 362563, 378963, 389815, 394679, 394155, 389162, 380740, 370253, 359101, 348145, 337892, 329249, 323475, 321176, 321900, 325077, 330962]
56866C30962R389J3376J7454K1827K6974L2907L8904M3686M5733M3639L6550K4687
56854F86088R835n018j7116k5370l0198l2184l1500k8585k4471j9994j5178r750
56842D56559l770K610R396J6575K4187L2829M3259N4990O5901P3649P6760P3903
56830I26848O3309M4295J9176p303l0559m8031n9111o4264o4341o0314n3499m5687
56818F20519l8358l1534k4230j6271q759k242M474J2836K2621L2500M1638M9498
56806F62692N4496N4153M6871L3018J4643n200k3246l7210m6454n1300n2132m9585
56794F00746m4947l9484l3729k7905k2498j7702j2939p748k603J985O543J1829
56782D11548J7449K2263K5592K6915K4937J8405P931m076j5223k4078k9786l2060
$$ y = [330962, 340351, 353727, 371181, 393008, 419982, 452889, 491793, 535479, 581212, 624851, 661401, 686088, 695923, 690905, 673789, 648419, 618221, 586037, 554537, 525952, 501481, 481487, 466309, 456559, 452789, 455399, 464795, 481370, 505557, 538386, 581645, 636635, 702536, 776185, 852945, 926848, 990157, 1034452, 1053628, 1046325, 1015766, 967735, 908624, 844360, 780019, 719705, 666206, 620519, 582161, 550627, 526397, 510126, 501367, 499125, 503599, 516435, 539056, 571556, 613194, 662692, 717188, 771341, 818212, 851230, 865873, 860673, 837427, 800217, 753763, 702463, 650331, 600746, 555799, 516315, 482586, 454681, 432183, 414481, 401542, 393794, 391191, 393176, 399719, 411548, 428997, 451260, 476852, 503767, 528704, 547109, 555040, 550964, 535741, 511663, 481877, 449817]
56770D49817l1744l0297k8524k6411k4030k1695j9354j6704j3968j1782j0340
56759B14968r323q511p754o669n158l927l571l449k501q66L03M57l5r57k367l717
56743A56923m096l511k867k546k087j395j107j423j670j374q84n70k74O9R6l08
56727A32976o98p62p31q01p14k58L98R79J314J175M25n60j117j026n91q5L74O03
56709A30901N70O48J106J584J599J292J001N50k43q60p75m43m91m86K79J159Q40
56692A38231n07j309r31l82m57o70n61o07j157j561j153k90K18L1p05j522j656
56675A25012o84O20J010M48Q8L80M29l39j121r74j38O51J199J576J564J075N43
56658A31339K84Q6j24L0O07R69P42M82Q08J497K016K279K288J658K39j129j282
$$ y = [449817, 418073, 387776, 359252, 332841, 308811, 287116, 267762, 251058, 237090, 225308, 214968, 205645, 197134, 189380, 182711, 177553, 173626, 170055, 166606, 164105, 163239, 163542, 163999, 163964, 163007, 160640, 156923, 152827, 149316, 146449, 143903, 141816, 140421, 139314, 137891, 136221, 134847, 133963, 133393, 133119, 133188, 133284, 132976, 132278, 131516, 130785, 129984, 129270, 129012, 129410, 130389, 131703, 132878, 133303, 132743, 131626, 130600, 130009, 129924, 130298, 130901, 131471, 132119, 133225, 134809, 136408, 137700, 138701, 139251, 139008, 138148, 137373, 136930, 136439, 135953, 136232, 137391, 138231, 137724, 136415, 135484, 135102, 134645, 133975, 133414, 132807, 131650, 130089, 128936, 128646, 128864, 128895, 128190, 126668, 125012, 124328, 124948, 125958, 126406, 126494, 126874, 127303, 126964, 125843, 124869, 124731, 125382, 126581, 128157, 129721, 130796, 131339, 131623, 131709, 131585, 131615, 132222, 133191, 133933, 134415, 135223, 136720, 138736, 141015, 143303, 144961, 145200, 144071, 142789]
56641A42789l1J554K182J386j69j269j174j57J005J829K155J869J235J131K075
56626A56410L268L477K770K281K389K252J280k2r31j306j253q35l29j9L15Q90
56610A70637J111L53o43n51L35L18j072k266k099j422j476k029k198j968j802
56595A55228j645j319j138j283j272p98l99n22p17m65n1J29L23P33Q55L15l14
56578A47660l55m3J29L52R30J420J232P16P21J397K109K298J937J442J507K533
56562A65985L958M752M853N365O915Q738R843J0151R815Q467O049L570K076J450
56548B51987J059Q82J096J234P37j15p06j096j657k198k346k373k787l393l604
56533B36720l401l203l077k834k652k883l409l793l885l739l240k359j489j059
$$ y = [142789, 142758, 144312, 146494, 147880, 147711, 146442, 145268, 145111, 146116, 147945, 150100, 151969, 153204, 154335, 156410, 159678, 163155, 165925, 168206, 170595, 172847, 174127, 174105, 173174, 171868, 170615, 169780, 169451, 169432, 169747, 170637, 171748, 172101, 171458, 170907, 171242, 171560, 170488, 168222, 166123, 164701, 163225, 161196, 158998, 157030, 155228, 153583, 152264, 151126, 149843, 148571, 147773, 147374, 146852, 146135, 145670, 145619, 145748, 146071, 146804, 147659, 147974, 147660, 147305, 147262, 147391, 147743, 148673, 150093, 151325, 152041, 152762, 154159, 156268, 158566, 160503, 161945, 163452, 165985, 169943, 174695, 179548, 184913, 191828, 200566, 210409, 220560, 230375, 238842, 244891, 248461, 250537, 251987, 253046, 253928, 255024, 256258, 256995, 256880, 256174, 255078, 253421, 251223, 248877, 246504, 243717, 240324, 236720, 233319, 230116, 227039, 224205, 221553, 218670, 215261, 211468, 207583, 203844, 200604, 198245, 196756, 195697]
56519A95697j044j251j700k285k583k383k035j818j497r36n46o26q01o94n43o05
56503A74350n93k78o6k37k87K62R28R49M23m1l82q68j256r80r5P53J096Q91K26
56484A74795o17j077r11n81n77o53k74M30Q63Q21O44O43P90R09P81L88K01Q26
56466A77401K020K634J949O82R6N16J200J397J044N81N10R85J709K293K644K734
56450B00395K264J174K55M19J442K273K541K689K694J891L49q92j331j581j971
56435B12611j885j121o13r41j271p17K00M81J02l30o72j048j222r80n66j14O81
56418B02595J756K283J743O72j60n62n43j3N84L60p63j803k127k022j588m55R66
56401B00923J459R34O98J117Q15p30j765q67P74J380J259J593K075J766J199J471
$$ y = [195697, 194653, 193402, 191702, 189417, 186834, 184451, 182416, 180598, 179101, 178165, 177619, 176993, 176192, 175498, 174955, 174350, 173757, 173479, 173413, 173176, 172889, 173151, 174079, 175028, 175451, 175410, 175028, 174160, 172904, 171924, 171829, 172582, 173678, 174569, 174795, 174178, 173101, 172190, 171609, 171032, 170379, 170105, 170535, 171398, 172219, 172863, 173506, 174296, 175205, 175986, 176374, 176575, 177401, 179421, 182055, 184004, 184686, 184782, 185298, 186498, 187895, 188939, 189520, 190030, 191015, 192724, 195017, 197661, 200395, 202659, 203833, 204088, 204507, 205949, 208222, 210763, 213452, 216146, 218037, 218386, 217494, 216163, 214582, 212611, 210726, 209605, 208992, 208051, 206780, 206063, 206263, 206744, 206846, 206516, 205844, 204796, 203574, 202594, 202028, 201914, 202595, 204351, 206634, 208377, 209049, 208889, 208327, 207784, 207771, 208355, 208715, 207952, 206149, 204022, 202000, 200412, 199957, 200923, 202382, 203316, 204014, 205131, 205946, 205216, 203451, 202584, 203358, 204738, 205997, 207590, 209665, 211431, 212630, 214101]
56385B14101K127J995J374J413J896J646O91R0M0q4j23O25J753K080J516J060
56369B32200J102J137J028J075J056N47N3M44J395J715J098K92k84q03j084o53
56353B40318K76R40J093J070R79O75K44k00p56j146o34P33J688J434P86O96P99
56336B48995N55N08J122J598J365J382K315K874J907P96J494L349M287M159M244
56321B80950M334L153J307Q00J698J997J006K07L95M87j72o72m10j37l74n58l87
56304B93624l62m66J06J384K249K122J664J496J537J800K463K935K315Q16m96
56289C13187j391k358l020k349n60Q42J115Q83P27O50Q86J706K492K458K125K475
56273C19868L053K662J596J228J623J698J478J963K841K740J836J826K972L663
$$ y = [214101, 216228, 218223, 219597, 221010, 222906, 224552, 225243, 225333, 225373, 225289, 225166, 225791, 227544, 229624, 231140, 232200, 233302, 234439, 235467, 236542, 237598, 238145, 238198, 238642, 240037, 241752, 242850, 243142, 242858, 242055, 240971, 240318, 240594, 241534, 242627, 243697, 244676, 245351, 245595, 245395, 244639, 243493, 242859, 243592, 245280, 246714, 247500, 248196, 248995, 249550, 250058, 251180, 252778, 254143, 255525, 257840, 260714, 262621, 263417, 264911, 268260, 272547, 276706, 280950, 285284, 288437, 289744, 290544, 292242, 294239, 295245, 295452, 295847, 296334, 296162, 295490, 295080, 294943, 294569, 294011, 293624, 293262, 292796, 292902, 294286, 296535, 298657, 300321, 301817, 303354, 305154, 307617, 310552, 312867, 313683, 313187, 311796, 309438, 306418, 304069, 303509, 304351, 305466, 306349, 307076, 307726, 308612, 310318, 312810, 315268, 317393, 319868, 322921, 325583, 327179, 328407, 330030, 331728, 333206, 335169, 338010, 340750, 342586, 344412, 347384, 351047]
56259C51047L304L242M122M756M443M234M921N682N796N960O925Q272R414J0441
56245D32559J1422J2101J2702J3693J4633J4774J4664J5429J6475J6105J4453
56234E89010J3519J3848J3647J1703Q962O421L696O37j770l098m214n511o240
56221F40610o326o881q079q541p714o977p353p998p943p532p162o354n133m619
56207E41998n251n938n867n609n646n420m622l864l327k355j068o31j217j406
56193D89777l38J117K016K432K430J738J006J528L067L803L017J975J654J561
56179E16783J363J586K123K122J810K359L463L458K269J791K632L142K418J667
56165E48986J719J833J886K971M853N628N073N423P520R136Q678P725Q083R071
$$ y = [351047, 354351, 357593, 361715, 366471, 370914, 375148, 380069, 385751, 391547, 397507, 404432, 412704, 422118, 432559, 443981, 456082, 468784, 482477, 497110, 511884, 526548, 541977, 558452, 574557, 589010, 602529, 616377, 630024, 641727, 650689, 657110, 660806, 661443, 659673, 656575, 652361, 646850, 640610, 634284, 627403, 619324, 610783, 603069, 596092, 588739, 580741, 572798, 565266, 558104, 551750, 546617, 541998, 536747, 530809, 524942, 519333, 513687, 508267, 503645, 499781, 496454, 494099, 493031, 492400, 491183, 489777, 489439, 490556, 492572, 495004, 497434, 499172, 500178, 501706, 504773, 508576, 511593, 513568, 515222, 516783, 518146, 519732, 521855, 523977, 525787, 528146, 531609, 535067, 537336, 539127, 541759, 544901, 547319, 548986, 550705, 552538, 554424, 557395, 562248, 567876, 572949, 578372, 585892, 595028, 603706, 611431, 619514, 628585]
56151F28585R593J0307J1796J2948J3052J3347J4702J5998J6465J7333J9467K1676
56139H05269K3114K5060K8624L3127L8496M6675N8656P2487Q6137R9842J13497
56128A430984J24228J28950J27282J20113J07740R1774P6535O5819N9645N5821
56118B388891N2574M7981L9528K6816J2875Q10q877j6251k0234k1331k3455l0335
56106B448992m1936n6364p2668q9379j02881j10147j11466j08413j01380r1148
56096A563210q0211p0077n9619m8347l8633l2185k7168k1477j6150j2705r887
56085A146751o124k688j180l43J569L629M487N323P489R640J0293J0804J2573
56072A202223J3873J2811J0987J0788J1415J1061J0660J1814J3302J3325J3136
$$ y = [628585, 638178, 648485, 660281, 673229, 686281, 699628, 714330, 730328, 746793, 764126, 783593, 805269, 828383, 853443, 882067, 915194, 953690, 1000365, 1059021, 1131508, 1217645, 1317487, 1430984, 1555212, 1684162, 1811444, 1931557, 2039297, 2131071, 2207606, 2273425, 2333070, 2388891, 2441465, 2489446, 2528974, 2555790, 2568665, 2569475, 2560598, 2544347, 2524113, 2502782, 2479327, 2448992, 2407056, 2350692, 2278024, 2188645, 2085764, 1975617, 1864151, 1755738, 1654358, 1563210, 1482999, 1412922, 1353303, 1304956, 1266323, 1234138, 1206970, 1185493, 1169343, 1156638, 1146751, 1140627, 1137939, 1136759, 1136416, 1137985, 1141614, 1146101, 1151424, 1158913, 1168553, 1178846, 1189650, 1202223, 1216096, 1228907, 1239894, 1250682, 1262097, 1273158, 1283818, 1295632, 1308934, 1322259, 1335395]
56061A335395J4884J7741J9583K0524K1650K2379K2196K2661K4568K5670K4327
56050A571578K2640K2781K3324K2644K2531K4581K6351K5374K3810K4676K6660
56039A836950K7120K7075K8477K9710K8673K7376K8461L0201L0015K9931L3229
56028B157218L8507M2483M5838N0816N5806N8010N8860O1254O4010O4598O4624
56017B762024O7059P0756P3183P5498P9514Q3078Q4230Q6181R2070R8710J02043
56006C674346J04570J10386J17187J20875J23885J30807J39699J46118J51911
55997D819784J61331J72338J80655J88587K00594K14096K24273K33887K48287
55988F643832K64965K78692K92722L13481L38307L60503L82494M11556M46324
$$ y = [1335395, 1350279, 1368020, 1387603, 1408127, 1429777, 1452156, 1474352, 1497013, 1521581, 1547251, 1571578, 1594218, 1616999, 1640323, 1662967, 1685498, 1710079, 1736430, 1761804, 1785614, 1810290, 1836950, 1864070, 1891145, 1919622, 1949332, 1978005, 2005381, 2033842, 2064043, 2094058, 2123989, 2157218, 2195725, 2238208, 2284046, 2334862, 2390668, 2448678, 2507538, 2568792, 2632802, 2697400, 2762024, 2829083, 2899839, 2973022, 3048520, 3128034, 3211112, 3295342, 3381523, 3473593, 3572303, 3674346, 3778916, 3889302, 4006489, 4127364, 4251249, 4382056, 4521755, 4667873, 4819784, 4981115, 5153453, 5334108, 5522695, 5723289, 5937385, 6161658, 6395545, 6643832, 6908797, 7187489, 7480211, 7793692, 8131999, 8492502, 8874996, 9286552, 9732876]
55979I732876M80600N16624N61053O11677O62419P17488P85692Q64751R47092
55970A5880272J036958J145105J271086J408811J565056J753358J974877K226467
55962B8261990K522678K887185L328932L853109M490858N291193O292623P538309
55954F4466877R115880J1147408J3746392J7015929K1044954K5785619L0858686
55947A93181745L5481237L8566332L8869149L5207581K6964695J4754881O14224
55940C83639844j2744966k3164993k9782607l2858285l3165736l1560486k8830831
55933A91531940k5617236k2340915j9229087j6408374j3948274j1851307j0073753
55926G2062994q575527p329308o294365n419838m674827m048619l523610l073054
$$ y = [9732876, 10213476, 10730100, 11291153, 11902830, 12565249, 13282737, 14068429, 14933180, 15880272, 16917230, 18062335, 19333421, 20742232, 22307288, 24060646, 26035523, 28261990, 30784668, 33671853, 37000785, 40853894, 45344752, 50635945, 56928568, 64466877, 73582757, 84730165, 98476557, 115492486, 136537440, 162323059, 193181745, 228662982, 267229314, 306098463, 341306044, 368270739, 383025620, 383639844, 370894878, 347729885, 317947278, 285088993, 251923257, 220362771, 191531940, 165914704, 143573789, 124344702, 107936328, 93988054, 82136747, 72062994, 63487467, 56158159, 49863794, 44443956, 39769129, 35720510, 32196900, 29123846]
55918B9123846k683153k353468k075813j833265j619171j437573j284942j149028
55910A4687433j025584r19848q31251p51542o78265o16104n64618n17462m73776
55901H308983m38175m09497l81125l52400l28542l09375k88901k66232k46562
55892E288174k30909k14657j96782j81151j68100j53480j36812j22056j09655
55883C774572r5612p8968o2688m6727k7595n398J5480L2931M7616N6801N4585
55872C664997L9032J3340j9850n8927r8306j29837j50270j62066j66860j63910
55862B767343j54929j44238j33350j20714j07104r5908q7708p9887p1994o6271
55852A705240o2562n7935n2024m7772m6217m5146m3388m1940m0527l7468l3409
$$ y = [29123846, 26440693, 24087225, 22011412, 20178147, 18558976, 17121403, 15836461, 14687433, 13661849, 12742001, 11910750, 11159208, 10480943, 9864839, 9300221, 8782759, 8308983, 7870808, 7461311, 7080186, 6727786, 6399244, 6089869, 5800968, 5534736, 5288174, 5057265, 4842608, 4645826, 4464675, 4296575, 4143095, 4006283, 3884227, 3774572, 3678960, 3599992, 3537304, 3490577, 3462982, 3457584, 3473064, 3505995, 3553611, 3610412, 3664997, 3704029, 3717369, 3697519, 3638592, 3540286, 3410449, 3260179, 3098113, 2931253, 2767343, 2612414, 2468176, 2334826, 2214112, 2107008, 2011100, 1923392, 1843505, 1771511, 1705240, 1642678, 1584743, 1532719, 1484947, 1438730, 1393584, 1350196, 1308256, 1267729, 1230261, 1196852]
55841A196852l0895k9942k8256k5752k4483k4142k2288j9183j7750j8360j8206
55830I37595j6339j4845j4512j3745j2373j2303j3579j3945j3007j2889j4105
55819G85953j4742j4348j4624j5629j5239j3134j1471j0896r747p885p286p991
55807F42961p474n086l292l290l164j665j85L64J204K803L647L210L119L978M123
55792F41253K880K009K514K870J846M63k31q20j688k000j684k107l859o093q773
55777F26580j2917j7899k1169k1654k0777j9305j6060j0872n860k409N61L786
55765D82005N651M624J555j876n074p684q805q364p518o786n578m212m196n696
55751D28046o920p015p339q877j0565j1315j1617j1957j1648j0395r127q225o820
$$ y = [1196852, 1165957, 1136015, 1107759, 1082007, 1057524, 1033382, 1011094, 991911, 974161, 955801, 937595, 921256, 906411, 891899, 878154, 865781, 853478, 839899, 825954, 812947, 800058, 785953, 771211, 756863, 742239, 726610, 711371, 698237, 686766, 675870, 666123, 658238, 650952, 642961, 635487, 630401, 627109, 623819, 620655, 618990, 618805, 619169, 620373, 623176, 626823, 630033, 633152, 637130, 641253, 644133, 646142, 648656, 651526, 653372, 653835, 653604, 652784, 651096, 649096, 647412, 645305, 641446, 635353, 626580, 613663, 595764, 574595, 552941, 532164, 512859, 496799, 485927, 480067, 477658, 478219, 482005, 487656, 492280, 493835, 491959, 486885, 479201, 470396, 462032, 454514, 447728, 442150, 437938, 433742, 428046, 421126, 414111, 406772, 397895, 387330, 376015, 364398, 352441, 340793, 330398, 321271, 313046, 306226]
55738C06226m737l180k557j698k14N20k05j072r88p63j337k244k975l972n167
55723B75637n447m657m266m889n174m291l466l676l879l036j982j612r96R43L379
55708B32588M928N682O335O519N623M098K563O43j975m433n912o798p543p549
55694B34769o429n142m634m456l902l340l218k901j838q65j006j851k277k008
55680A90902j335k26J224K303K579K476K191J092r15k618l131l203l778m313l767
55665A79481k368j156m92j26r9m19m78K31J241J794J873J848J806J856K408L418
55649A90818M027L605K615J857J543J528J824K329K702K781K520J517m52k514
55635B16700l534l871m841o350o813n793m843n074n614n411m773m154l042j277
$$ y = [306226, 301489, 298309, 295752, 294054, 293840, 294360, 294155, 293083, 292095, 291332, 289995, 287751, 284776, 280804, 275637, 270190, 265533, 261267, 256378, 251204, 246913, 243447, 239771, 235892, 232856, 230874, 229262, 228266, 229209, 232588, 237516, 243198, 249533, 256052, 261675, 265773, 268336, 268979, 267004, 262571, 256659, 249861, 242318, 234769, 228340, 223198, 218564, 214108, 210206, 206866, 203648, 200747, 198909, 198044, 197038, 195187, 192910, 190902, 189567, 189341, 190565, 192868, 195447, 197923, 200114, 201206, 200291, 197673, 194542, 191339, 187561, 183248, 179481, 177113, 175957, 175465, 175339, 175240, 174821, 174343, 174574, 175815, 177609, 179482, 181330, 183136, 184992, 187400, 190818, 194845, 198450, 201065, 202922, 204465, 205993, 207817, 210146, 212848, 215629, 218149, 219666, 219214, 216700, 213166, 209295, 204454, 198104, 191291, 185498, 180655, 175581, 169967, 164556, 159783, 155629, 152587, 151310]
55621A51310k4j24p55p80k60L75J268K125J756j75k158k873k837k830k272p58
55605A40988K81n92k402l056k283j457j161q18l44l11o01m27K62O64M17m5l48
55588A28767m76l86j20o4l96o23k93K29M43N53R20J329J541J947K862L846M453
55571A44532N037O033P132P951Q775R719R927Q605O224L816J666m26k293l759
55557B12939n160o657p688p910p933q264q371p728o866o381n803m619l520l285
55543A22754l276k495j421j271j898k024j308o47o13q53j110j597k218k429k010
55528I7584j237l93K79L48k95r51q06L3P65Q45K57o59j188p15K72M14o42j565
55510I2346j309p08r94j786j823j015l21r0P3K23J26P6M79R73J003Q50J013J098
$$ y = [151310, 151286, 151162, 150407, 149627, 149367, 149742, 151010, 153135, 154891, 154716, 152558, 149685, 146848, 144018, 141746, 140988, 141269, 140677, 138275, 135219, 132936, 131479, 130318, 129500, 129156, 128845, 128244, 127817, 128079, 128743, 129160, 129115, 128767, 128291, 127905, 127785, 127721, 127325, 126702, 126409, 126638, 127081, 127634, 128554, 129883, 131424, 133371, 136233, 140079, 144532, 149569, 155602, 162734, 170685, 179460, 189179, 199106, 207711, 213935, 217751, 219417, 218991, 216698, 212939, 207779, 201122, 193434, 185524, 177591, 169327, 160956, 153228, 146362, 139981, 134178, 129559, 126039, 122754, 119478, 116983, 115562, 114291, 112393, 110369, 109061, 108414, 107801, 106948, 105838, 104241, 102023, 99594, 97584, 96347, 95954, 96233, 96581, 96286, 95335, 94529, 94562, 95327, 96172, 96429, 95770, 94582, 93867, 94139, 94553, 93911, 92346, 91037, 90329, 89335, 87549, 85726, 84711, 84390, 84300, 84373, 84596, 84722, 84798, 85277, 86250, 87253, 88103, 89116, 90214]
55492I0214N19k11k31J15j42q64j028n09j05pL55R22R33L77J91P47J297J147M68
55473I4188k69p76p58j33N10M91l2m11o20j059j463j134k02M12L80L02O13J071
55455I1110J377J476J206M54l08m86k72k83m49k60Q2j72r62j303o79L71J144J370
55437I3416R16j63j114j015k0P01M68k31o33n39r0M71O65J54n83p15k64j06n87
55418I0731r00k07J264K599L203L156K837K531K224J807J415J287J165L89j075
55403A12426k263k361j752j357j501j930k377k435j612k27M65q9p50l66M13K76
55387I4560n56p92k18K24K32M09Q19P92K93J7L2l00r21j026n73n17j197j771j677
55368H7830j392j305r84j09Q23J232J069M27o62j706j928j265m92j32J3J61K16
$$ y = [90214, 90733, 90522, 90291, 90406, 90264, 89400, 88372, 87863, 87758, 87751, 88106, 89028, 89961, 90338, 90529, 91276, 92573, 93720, 94188, 93919, 93143, 92385, 92252, 92762, 93253, 93221, 92810, 92190, 91131, 89668, 88534, 88332, 88744, 89124, 89426, 90039, 91110, 92487, 93963, 95169, 95623, 95315, 94829, 94557, 94274, 93825, 93565, 93647, 93475, 92513, 91210, 90531, 90902, 92046, 93416, 94332, 94169, 93055, 92040, 92020, 92721, 93189, 92958, 92325, 91786, 91696, 92167, 92832, 92986, 92403, 91688, 91424, 91318, 90731, 89831, 89624, 90888, 93487, 96690, 99846, 102683, 105214, 107438, 109245, 110660, 111947, 113112, 113501, 112426, 110163, 107802, 106050, 104693, 103192, 101262, 98885, 96450, 94838, 94611, 95076, 94987, 94237, 93871, 94284, 94560, 94004, 93212, 92994, 93218, 93450, 93859, 94678, 95470, 95763, 95780, 95812, 95512, 94591, 93565, 92992, 92475, 91278, 89507, 87830, 86438, 85133, 84149, 84040, 84863, 86095, 87164, 87591, 86929, 85223, 83295, 82030, 81538, 81406, 81419, 81580, 81796]
55351H1796K73N95R55Q43L74J60K92L54L53O09P80K15p59j094p10n16o90l78O01
55332H4053J232R98O64P21M96m36j156p63K07O59M32Nm91j092j367q83M8O94O97
55313H4718K58j80j68L14O44L14j69PN06K12q71j439q58m1J53Q5K74M18K45K64
55293H4686P89J181Q87L18j3l39p73o64K65J025P26K5Q2O62N22o00j590j494o12
55274H5083N2o7o04p19j21M29J20n74m32N77J098M57k58O5Q57Q70J1q00j034q36
55254H4174m18oP2j48j26L22O35M49J65M6l37j064j231l04Q26J115Q78R01Q73
55235H6822M2j125j426p34k0K43M44O92N62O7j89nK19M16J075K303L321L197J763
55216I7667k55j657j558k42Q96P72k51j007r34l06M52R60P62j31q59o61K2K00
$$ y = [81796, 82069, 82664, 83619, 84462, 84836, 84996, 85288, 85642, 85995, 86604, 87384, 87599, 86840, 85746, 85036, 84520, 83830, 83452, 84053, 85285, 86283, 86947, 87668, 88164, 87728, 86572, 85809, 86016, 86675, 87107, 87112, 86621, 85529, 84162, 83279, 83327, 84021, 84718, 84976, 84796, 84628, 84942, 85586, 85900, 85731, 85738, 86244, 86456, 85585, 84146, 83288, 83247, 83400, 83485, 83759, 84177, 84422, 84686, 85475, 86656, 87543, 87861, 87848, 87509, 86736, 86072, 86337, 87362, 88088, 88113, 88195, 88857, 89379, 88779, 87189, 85695, 85083, 85135, 85068, 84464, 83745, 83624, 84053, 84173, 83599, 83167, 83744, 84842, 85299, 85041, 85106, 85963, 86833, 86844, 86044, 85010, 84174, 83756, 83750, 83822, 83674, 83548, 83870, 84505, 84954, 85119, 85165, 84828, 83764, 82533, 82229, 83055, 84170, 85048, 85949, 86822, 86864, 85739, 84313, 83579, 83559, 83802, 84246, 84938, 85500, 85567, 85378, 85373, 85592, 86008, 87083, 89386, 92707, 95904, 97667, 97412, 95755, 94197, 93955, 94851, 95623, 95372, 94365, 93431, 93125, 93577, 94537, 95299, 95168, 94309, 93648, 93670, 93870]
55198I3870j43j09O28J291J130K82o07j051q44j09O21Q19M97J14k7L3J71K55J43
55179I6964l2R0M88N57oo05n72j54J0o3N0K99L79M98R80J341P72n09j368j264
55159I7855o70OR76K172K767K092N42q43j358r87k00L80M29J54j20m51j034j603
55141A00107j672j233p01k64J78M54K08m13q04p71p87j168j493j137q5R84J300
55124I2703O89j52k43N65J325J201N62K94M05J54o04j087q29l56l28o26o62j83
55106I2828N83J219J354R22L38J13K53L47K50K84O79J234J637J746J515R98N15
55089A06815L95M62K11m09q11m98K96R52J106Q59N08K60P4k15o05q47q47r08j258
55070A05540j584j441r98q70j272j748j720r94K15J347J695J017j13r12j227j322
$$ y = [93870, 93727, 93618, 94246, 95537, 96667, 96949, 96342, 95291, 94447, 94338, 94959, 95778, 96275, 96389, 96362, 96395, 96566, 96821, 96964, 96932, 97022, 97510, 98067, 98061, 97456, 96884, 96730, 96740, 96677, 96727, 97026, 97405, 97903, 98883, 100224, 100996, 100487, 99119, 97855, 97185, 97191, 98167, 100339, 103106, 105198, 105740, 104897, 103539, 102552, 102352, 102732, 103161, 103315, 103195, 102744, 101710, 100107, 98435, 97202, 96501, 96237, 96415, 96869, 97077, 96664, 95860, 95089, 94302, 93134, 91641, 90504, 90419, 91403, 92703, 93392, 93240, 92997, 93562, 94887, 96088, 96650, 96944, 97349, 97503, 96899, 95812, 94983, 94627, 94299, 93673, 93011, 92828, 93411, 94630, 95984, 96906, 97244, 97357, 97610, 97957, 98207, 98491, 99170, 100404, 102041, 103787, 105302, 106300, 106815, 107210, 107672, 107883, 107474, 106663, 106165, 106461, 107413, 108519, 109378, 109886, 110146, 110220, 110005, 109400, 108553, 107706, 106798, 105540, 103956, 102515, 101517, 100647, 99375, 97627, 95907, 94913, 95128, 96475, 98170, 99187, 99074, 98162, 96935, 95613]
55054I5613j053o8J226J713R24k50o42j47M21M90K86L28P51J156J080N14m1o3
55036A02238M46R93J061N55j40m50k18L1k22n95j41J200K156J631O5j251j721
55019A05638j626j252o83k12j02r6J61L78M5n71p09l18l7l4J91P37R57N45M6n8
54999A03000m1k63l99Q2J051J806J798J067K04j0P30J850K419K108J353O71K59
54982A17685J68K83J96l63r86j076p87p31r09p88m38n65j165j267l99N61O45O0
54964A10124l73l36N8Q09J693K023J469O81M44N64K90m92j143j165n34N08J442
54947A16062J563P26k34m62k36l74p45l23J113K266J821N9j535j918j290m22J69
54930A16240L88K80l5k85j67L26Q74J260J687K498L619M564N039N308N880O948
$$ y = [95613, 94560, 94492, 95718, 97431, 98355, 98105, 97463, 97316, 97737, 98227, 98513, 98841, 99592, 100748, 101828, 102342, 102301, 102238, 102684, 103677, 104738, 105293, 105153, 104703, 104485, 104516, 104294, 103699, 103558, 104758, 106914, 108545, 108610, 107359, 105638, 104012, 102760, 102077, 101865, 101763, 101667, 101828, 102206, 102251, 101680, 100971, 100653, 100616, 100582, 100773, 101510, 102467, 103012, 103058, 103000, 102959, 102696, 102297, 102379, 103430, 105236, 107034, 108101, 108305, 108295, 109025, 110875, 113294, 115402, 116755, 117426, 117685, 117853, 118136, 118332, 117969, 116983, 115907, 115120, 114389, 113480, 112692, 112254, 111689, 110524, 109257, 108858, 109419, 110064, 110124, 109751, 109415, 109473, 110282, 111975, 113998, 115467, 116148, 116592, 117156, 117446, 116954, 115811, 114646, 114112, 114620, 116062, 117625, 118351, 118117, 117655, 117419, 117045, 116300, 115977, 117090, 119356, 121177, 121236, 119701, 117783, 116493, 116071, 116240, 116628, 116908, 116873, 116588, 116421, 116747, 117621, 118881, 120568, 123066, 126685, 131249, 136288, 141596, 147476, 154424]
54914A54424Q236R221R421Q605O924M822K808J141l37k046m111n995o992p092
54900A79029o946o832o249m974l822l650l989l667k563j753j831k072j600n96
54886A28485J84N00O96R65J089Q36L87L00R98K187L041L212L330M073N125N812
54870A61220O339P407Q703Q922P471N160K888O77j615l622n068o202p031p025
54856A78224o154n422n562n961n679m887m379m234l954l519l343l326k912k005
54842A16887j104n60k85j87l37o89j056j265j137n53J48K81k94q23o66j30J89
54825A08419L03M23L08j61l43K21P64L56m03j06J193J927J337M28J85J97j92n17
54807A14339K7J139J757J461P22M7m17n89l90l1J24Pj44j61j29j79l01l20p0L49
$$ y = [154424, 162660, 171881, 181302, 189907, 196831, 201653, 204461, 205602, 205265, 203219, 199108, 193113, 186121, 179029, 172083, 165251, 159002, 154028, 150206, 146556, 142567, 138900, 136337, 134584, 132753, 130681, 129081, 128485, 128669, 129169, 129865, 130830, 131919, 132755, 133142, 133442, 134440, 136627, 139668, 142880, 146210, 150283, 155408, 161220, 167559, 174966, 183669, 192591, 200062, 205222, 208110, 208787, 207172, 203550, 198482, 192280, 185249, 178224, 172070, 166648, 161086, 155125, 149446, 144559, 140180, 135946, 131992, 128473, 125130, 121804, 118892, 116887, 115783, 115223, 114938, 114751, 114414, 113725, 112669, 111404, 110267, 109714, 109862, 110143, 109849, 109026, 108360, 108230, 108419, 108722, 109145, 109453, 109292, 108949, 109170, 109934, 110290, 109887, 109781, 110974, 112901, 114238, 114666, 114851, 115048, 114856, 114339, 114366, 115505, 117262, 118723, 119445, 119492, 119075, 118486, 118096, 118065, 118189, 118196, 118052, 117891, 117762, 117583, 117282, 116962, 116892, 117241]
54787A17241M57j02r52j215n40M43R56R64R15R09O73K60K60J048K169K725K361
54770A28572J617J263J473J826K102K677L942N594O907P542P809Q129Q593R022
54756A97068Q995P897N355J891j314l540n047o300p169p295o833o227n546m643
54742A67292l807l590l839l651k540j157m69o26j111j617k183k629k517j814j078
54727A34664p31n22N9J091K175K925L300L571M138N149O265O963P207P474P920
54712A91648P850O451L837R95j261k921m418n922p061p224o283n061m712n379
54698A60539n901n236l806k846k680k499j736q30m37n54p29o98n19l68m07n71
54682A30722n46k48j22n34r97p66q2L3p10j438j452j067p45l13L52P09M06P9M65
$$ y = [117241, 117698, 117596, 116644, 115429, 114889, 115332, 116288, 117252, 118167, 119076, 119749, 120009, 120269, 121317, 123486, 126211, 128572, 130189, 131452, 132925, 134751, 136853, 139530, 143472, 149066, 155973, 163515, 171324, 179453, 188046, 197068, 206063, 213960, 219315, 221206, 219892, 216352, 211305, 205005, 197836, 190541, 183708, 177481, 171935, 167292, 163485, 159895, 156056, 152405, 149865, 148708, 148239, 147613, 146502, 144885, 142702, 140073, 137556, 135742, 134664, 133933, 133411, 133470, 134561, 136736, 139661, 142961, 146532, 150670, 155819, 162084, 169047, 176254, 183728, 191648, 199498, 205949, 209786, 210781, 209520, 206599, 202181, 196259, 189198, 181974, 175691, 170630, 165918, 160539, 154638, 149402, 145596, 142750, 140070, 137571, 135835, 135005, 134568, 134014, 133285, 132587, 132068, 131700, 131293, 130722, 130176, 129928, 129806, 129272, 128275, 127509, 127427, 127460, 126750, 125312, 123860, 122793, 122048, 121735, 122087, 122796, 123202, 123281, 123746]
54663A23746J174J182K71q05j420j632j702j616j275p14r6L58N59O81R23J071
54647A20705P42R9j63K63R52J480J826J828J126O6k84L85R26L14r12j634j746
54630A25973j693j240j6J201J219K75k12K96R30J016Q83Q27M56m33j315j749j943
54613A24475k127k039j489p51q7N36J085J340J397J589J758J357M81kK74N94L04
54596A28695k36l60j41JJ48O16J192J351J056P23M77j5q66j602j635r81l10k21
54578A27892n10l69N34J529J800J437J144J099Q66K92k31m80o04n03K04J270J690
54561A37060R91L0p2O71J309J203N46j34m76m45k80k83m21l14K73J110J726J758
54543A44252J125K08j61N98J991K873K773K325K229K360K170J495O08mJ48J136
$$ y = [123746, 124920, 126102, 126373, 125568, 124148, 122516, 120814, 119198, 117923, 117209, 117113, 117471, 118030, 118711, 119634, 120705, 121447, 121546, 121383, 121646, 122598, 124078, 125904, 127732, 128858, 128924, 128640, 129025, 129951, 130265, 129353, 127719, 125973, 124280, 123040, 123024, 124225, 125444, 125719, 125507, 125803, 126733, 127749, 128632, 129459, 129915, 129482, 128167, 126418, 124475, 122348, 120309, 118820, 118069, 117982, 118518, 119603, 120943, 122340, 123929, 125687, 127044, 127525, 127523, 127797, 128391, 128695, 128459, 128099, 127958, 127959, 128107, 128723, 129915, 131266, 132322, 133045, 133522, 133507, 132641, 131039, 129404, 128423, 128113, 127892, 127382, 127013, 127547, 129076, 130876, 132313, 133457, 134556, 135422, 135714, 135483, 135003, 134399, 133896, 134100, 135370, 137060, 138051, 138081, 138009, 138680, 139989, 141192, 141738, 141604, 141128, 140683, 140403, 140120, 139699, 139385, 139658, 140768, 142494, 144252, 145377, 145585, 145424, 146022, 148013, 150886, 153659, 155984, 158213, 160573, 162743, 164238, 164846, 164842, 164990, 166126]
54527A66126K121J974O25p46j150p62j78M57J022R58L1j012j380j358j658k059
54511A63011j715o35J67N4m86o91n29m93q44j278j227m47N68R08K85n05n52K2
54493A55613L59J44m8K72Q22J042Q03L32k03o55o82K1J197K017J875J073M88N13
54475A64983O81M95J92K93P32J127J611K513L303K967J627P66J211J956J755R77
54459A87189P99J229J224N13RL16R11J118J002Q90O81R2p44j358j414j014o18
54442A90825o60j053j240j026j040j826k797k760j490j5O92O22K11l46q53q04
54426A76440L0J038J297N26o76j521j685j380r92o42j40N62J021P40r1o55m45
54409A73427K17O68O22K55j40l33k29O2L00L82L51K10m2j13M27J480K223J972
$$ y = [166126, 168247, 170221, 170846, 170100, 168950, 168188, 168010, 168467, 169489, 170447, 170478, 169466, 168086, 166728, 165070, 163011, 161296, 160661, 160828, 160882, 160396, 159705, 159176, 158683, 157839, 156561, 155334, 154887, 155455, 156363, 156648, 156143, 155591, 155613, 155972, 156116, 156068, 156340, 157162, 158204, 159007, 159339, 159136, 158481, 157799, 157820, 159017, 161034, 162909, 163982, 164470, 164983, 165664, 166159, 166351, 166644, 167376, 168503, 170114, 172627, 175930, 178897, 180524, 181290, 182501, 184457, 186212, 187189, 187988, 189217, 190441, 190954, 190963, 191279, 192190, 193308, 194310, 195200, 195881, 195973, 195229, 193871, 192457, 191443, 190825, 190165, 189112, 187872, 186846, 185806, 183980, 181183, 178423, 176933, 176918, 177610, 178232, 178443, 178097, 177244, 176440, 176470, 177508, 178805, 179331, 178655, 177134, 175449, 174069, 173077, 172435, 172295, 172857, 173878, 174618, 174527, 173872, 173427, 173644, 174312, 174934, 175189, 175049, 174716, 174487, 174549, 174849, 175231, 175582, 175792, 175750, 175637, 176064, 177544, 179767, 181739]
54391A81739J062M78O56J047R47L73j27l29n43r96j393j382j149j182j493j485
54375A76223p47L25R18O69jl48J0P51J180R89N74M63O08O20N16O59R05O18l08
54356A84624j085j107p39n56m62j29K14J69j00l07p86j922l089l170k098r92o86
54339A67779r57j308j630j822j588r84n75o10o35k83P6p1n33o79l10J63L40K92
54321A56665M20R32J450J193j44j783k513k001j067o07p04q74p23j09Q92J858
54305A52885K201J750R56L49ll09o42q76q63n51j23n9o41j413j583r93l10o0r4
54286A49621j43l24p39j014p67j40M60Q76J082R48N01R8k5r9l41m99l05j7qj14
54266A49051O5M21N17L27K01J61j02n21n78j04M00M79K83J61J23O8K10Q07J640
$$ y = [181739, 182801, 183279, 183935, 184982, 185929, 186302, 186175, 185846, 185303, 184307, 182914, 181532, 180383, 179201, 177708, 176223, 175476, 175801, 176719, 177388, 177387, 177039, 177049, 177800, 178980, 179969, 180543, 181006, 181614, 182234, 182750, 183409, 184314, 184932, 184624, 183539, 182432, 181693, 181137, 180675, 180546, 180760, 180929, 180829, 180522, 179736, 177814, 174725, 171555, 169457, 168465, 167779, 166822, 165514, 163884, 162062, 160474, 159490, 158915, 158305, 157670, 157387, 157463, 157392, 156859, 156180, 155870, 156033, 156373, 156665, 157085, 158017, 159467, 160660, 160516, 158733, 156220, 154219, 153152, 152545, 151841, 150967, 150244, 150135, 151027, 152885, 155086, 156836, 157792, 158141, 158138, 157829, 157187, 156311, 155448, 154897, 154774, 154715, 154074, 152661, 151078, 150085, 149775, 149715, 149621, 149478, 149154, 148415, 147401, 146634, 146494, 146954, 147830, 148912, 149860, 150361, 150459, 150434, 150335, 149994, 149495, 149190, 149173, 149165, 149051, 149116, 149537, 150054, 150381, 150582, 150743, 150641, 150120, 149542, 149438, 149838, 150317, 150600, 150761, 150884, 150952, 151162, 151969, 153609]
54247A53609K142J997J336L83p22j691k074j726j066n82k85QN5n30j359j348j76
54230A47971R56P56m01j011n53k0k25o57n35j43k35p08p82k58K31K47Q1J17K64
54211A45095L23L68M90M41l9p09r93p04l01k79n27m92nM69M83K13J04J95K27K68
54191A44627O21J150J236O40j65o92r67j132j068p42m89n51p18p49p61p93m80
54174A38967L51J118J145N96K02K49L50J00n53j389j942j675o06N01R97J091J269
54157A40771J335Q75K48K10O49O92J27k71m7K45Q7j64J7M07M26M5k34m4M89R04
54137A46767P24j5n75k86M78P21K71n7N4j05q69j272m91P14J024N09K35L84J37
54118A48348n74p06J79R96P38j6k6P58J212P06j25l94m8L04K77P5O9K83M19L01
$$ y = [153609, 155751, 157748, 159084, 159467, 158745, 157054, 154980, 153254, 152188, 151606, 151321, 151329, 151384, 150854, 149495, 148147, 147971, 148927, 149683, 149282, 148271, 147718, 147698, 147473, 146816, 146281, 146138, 145903, 145195, 144413, 144155, 144386, 144633, 144714, 144831, 145095, 145418, 145786, 146276, 146717, 146678, 145969, 144976, 144272, 143971, 143692, 143165, 142673, 142668, 143137, 143620, 143833, 143937, 144132, 144359, 144627, 145248, 146398, 147634, 148274, 148109, 147417, 146450, 145318, 144250, 143508, 143019, 142468, 141750, 141001, 140240, 139447, 138967, 139318, 140436, 141581, 142177, 142379, 142628, 142978, 143078, 142525, 141136, 139194, 137519, 136913, 137414, 138411, 139502, 140771, 142106, 142981, 143229, 143439, 144088, 144780, 144907, 144636, 144589, 144834, 144921, 144757, 144774, 145181, 145607, 145652, 145418, 145374, 145863, 146767, 147491, 147476, 146901, 146615, 147093, 147814, 148085, 148028, 148082, 147977, 147108, 145836, 145345, 146059, 147083, 147592, 147827, 148211, 148348, 147774, 147068, 147247, 148243, 148981, 148965, 148939, 149697, 150909, 151615, 151490, 151096, 151048, 151352, 151629, 151704, 151773, 152056, 152475, 152776]
54098A52776J12O5%m25j212j916k113j741r47R8J104J662J585J134O77L06l7k40
54080A50888j41J40K93K48K61M67O56N93L62K22K95N47R57J455J805J801J593
54063A62442J569J844K010J570M85p75j636j728j014J96J323J833J582Q60J75
54048A70736k3M05J161J706J755J546J479J634J843K040K317K645K926L223L631
54033A99024L898L668L114K898L328M009M527M918N150M745L526K310K065K550
54019B49730K596J724P22M87R60J542J855J769J154J32q20j437k062k999l811
54004B51542l804l073k450k482k909l190l106k710k130j638j576j964k380k435
53990B15695k177j868j536j038m53j23j98l72k71k3j72r01j563j317j74R99J608
$$ y = [152776, 152888, 152953, 152953, 152528, 151316, 149400, 147287, 145546, 144599, 144697, 145801, 147463, 149048, 150182, 150859, 151165, 151128, 150888, 150747, 150887, 151180, 151428, 151689, 152156, 152812, 153405, 153767, 153989, 154284, 154831, 155788, 157243, 159048, 160849, 162442, 164011, 165855, 167865, 169435, 169920, 169145, 167509, 165781, 164767, 164963, 166286, 168119, 169701, 170561, 170736, 170713, 171118, 172279, 173985, 175740, 177286, 178765, 180399, 182242, 184282, 186599, 189244, 192170, 195393, 199024, 202922, 206590, 209704, 212602, 215930, 219939, 224466, 229384, 234534, 239279, 242805, 245115, 247180, 249730, 252326, 254050, 254772, 255259, 256219, 257761, 259616, 261385, 262539, 262671, 261851, 260414, 258352, 255353, 251542, 247738, 244665, 242215, 239733, 236824, 233634, 230528, 227818, 225688, 224050, 222474, 220510, 218130, 215695, 213518, 211650, 210114, 209076, 208623, 208500, 208302, 207930, 207659, 207636, 207464, 206563, 205000, 203683, 203509, 204508, 206116]
53973B06116J996K720L585L960L799L776M440N769P591R768J1771J2555J1368
53960B89214Q394M405M7m198p682r686r877q537o472m720l985m031l902l018j826
53945B34126j112j016j114j108r21l49P13J775K202K162K498L440M142L846K923
53930B52207K325K279K207J725J207J251J874K458K409J779J218J234J702K180
53916B78055K591L198L931M233L863L457L853N035O135O427O017N531N379N406
53902C43111N117M184K772J375L10n13j282j924k215k116j835j662j864k569l577
53887C37312m361m551m379m451n053n861o357o397o215o027n687m836l403j869
53873B67865r08p47j051j402j654j794j779j691j795k177k503k475k305k413k739
$$ y = [206116, 208112, 210832, 214417, 218377, 222176, 225952, 230392, 236161, 243752, 253520, 265291, 277846, 289214, 297608, 302013, 302060, 297862, 290180, 280494, 270617, 262080, 255608, 250888, 246903, 242872, 238970, 235952, 234126, 233014, 231998, 230884, 229776, 228855, 228506, 229219, 230994, 233196, 235358, 237856, 241296, 245438, 249284, 252207, 254532, 256811, 259018, 260743, 261950, 263201, 265075, 267533, 269942, 271721, 272939, 274173, 275875, 278055, 280646, 283844, 287775, 292008, 295871, 299328, 303181, 308216, 314351, 320778, 326795, 332326, 337705, 343111, 348228, 352412, 355184, 356559, 356869, 356356, 355074, 353150, 350935, 348819, 346984, 345322, 343458, 340889, 337312, 332951, 328400, 324021, 319570, 314517, 308656, 302299, 295902, 289687, 283660, 277973, 273137, 269734, 267865, 266957, 266210, 265159, 263757, 262103, 260309, 258530, 256839, 255044, 252867, 250364, 247889, 245584, 243171, 240432]
53858B40432k784k388j984j937j984j674j159j156k021l149l450k436p06O52J058
53843B15314P33K07k55o63r76j013o80j83j0n77j751k712k610j468k73N2m63j088
53825B01584j269r66l51L96R66J008N35lj44J57N73P60O47M24K92K39J42J06M49
53806B05545J165J720J755J757K570M224N765O453O630P081P922Q712R440J0739
53792B81478J2834J4800J5245J3554J0130N655P78l487n863n937m793l969l968
53779C26457m221m264m164l955l498l086l345m208m743m460m069m365n025n233
53765B67821m992m927n123m991m221l151k274j889k129k703k863k261j579j616
53751B23102j996j710p33p8k19n05l60qK15L73L56j48p33l43J177K560K896K944
$$ y = [240432, 237648, 235260, 233276, 231339, 229355, 227681, 226522, 225366, 223345, 220196, 216746, 214310, 213604, 214256, 215314, 216047, 216254, 215999, 215336, 214360, 213347, 212667, 212484, 212474, 211897, 210146, 207434, 204824, 203356, 203083, 203135, 202672, 201584, 200315, 199349, 198998, 199394, 200360, 201368, 201903, 201900, 201756, 201913, 202486, 203246, 203893, 204317, 204609, 204848, 204990, 205096, 205545, 206710, 208430, 210185, 211942, 214512, 218736, 224501, 230954, 237584, 244665, 252587, 261299, 270739, 281478, 294312, 309112, 324357, 337911, 348041, 353696, 354474, 350987, 345124, 339187, 334394, 330425, 326457, 322236, 317972, 313808, 309853, 306355, 303269, 299924, 295716, 290973, 286513, 282444, 278079, 273054, 267821, 262829, 257902, 252779, 247788, 243567, 240416, 238142, 236253, 234124, 231421, 228558, 226297, 224718, 223102, 221106, 219396, 218663, 218585, 218366, 217861, 217501, 217493, 217708, 218081, 218437, 218289, 217556, 217213, 218390, 220950, 223846, 226790]
53733B26790L770M850M754L250J617R49J121J370J070o8j793l210l485k798k069
53718B36118j833j793j518j043o87p05j149j760k070j882j519j290r42p4J097
53703B18950J918K104J934J714J543J490J563J566J348J109J060J057R55J018
53689B39329J448J824J667J211Q94M73l96j019l90R98J417K82r96j104m96k14
53673B44928j64K97Q90Q30K85K34Q52J195N17p81j795k044j597q04k00k64r67
53656B41412j718j904j420o40rL27N04N79K86n30j327j231k00P16O35j06n82n51
53638B34241l94k38J48O41Q29P57R12J298J251M38n30q09k17Q70K003K742K663
53621B46605J836J053J087J850K590K833K799K865L111L392L616L735L629L185
$$ y = [226790, 230560, 235410, 240164, 243414, 245031, 245980, 247101, 248471, 249541, 249473, 247680, 244470, 240985, 238187, 236118, 234285, 232492, 230974, 229931, 229244, 228539, 227390, 225630, 223560, 221678, 220159, 218869, 217927, 217853, 218950, 220868, 222972, 224906, 226620, 228163, 229653, 231216, 232782, 234130, 235239, 236299, 237356, 238311, 239329, 240777, 242601, 244268, 245479, 246373, 246846, 246450, 245431, 245041, 246039, 247456, 247738, 246742, 245638, 245142, 244928, 244764, 245061, 245951, 246781, 247066, 247300, 248152, 249347, 249864, 249083, 247288, 245244, 243647, 242843, 242643, 242379, 241412, 239694, 237790, 236370, 235730, 235721, 236048, 236552, 237131, 237417, 236887, 235560, 234329, 234129, 234845, 235480, 235374, 234792, 234241, 233847, 233609, 233757, 234398, 235227, 235984, 236896, 238194, 239445, 239883, 239353, 238544, 238327, 239197, 241200, 243942, 246605, 248441, 249494, 250581, 252431, 255021, 257854, 260653, 263518, 266629, 270021, 273637, 277372, 281001, 284186]
53607B84186K462J708J177R24Q55R32J269J894K502K659K274J679J184P42K23
53592C06670k06k58l6o8p45j810k527k395j577o98k60k91n38q04j045j173j068
53575B91171p43m34m07p20j228j690j897j784j456j011m01L93J062J147O26Q7
53559B82715J15O99J380J835K026J981J813J813K165K517K289J528J044J409K190
53544C07519K560K400K357K844L532L910L917L866L997M367M927N483N773N843
53530C63295O157P039Q176R094R966J1372J3144J4120J3499J2082J1550J2623
53518D92117J4530J6218J7475J8532J9275J9423J9221J9283J9724K0017J9869
53507F95684J9720K0059K0655K0935K0844K0794K0915K0908K0733K0838K1367
$$ y = [284186, 286648, 288356, 289533, 290457, 291312, 292244, 293513, 295407, 297909, 300568, 302842, 304521, 305705, 306447, 306670, 306464, 306206, 306170, 306102, 305357, 303547, 301020, 298625, 297048, 296350, 296090, 295799, 295261, 294457, 293412, 292239, 291171, 290428, 289994, 289587, 288867, 287639, 285949, 284052, 282268, 280812, 279801, 279400, 279793, 280855, 282002, 282628, 282715, 282830, 283529, 284909, 286744, 288770, 290751, 292564, 294377, 296542, 299059, 301348, 302876, 303920, 305329, 307519, 310079, 312479, 314836, 317680, 321212, 325122, 329039, 332905, 336902, 341269, 346196, 351679, 357452, 363295, 369452, 376491, 384667, 393761, 403727, 415099, 428243, 442363, 455862, 467944, 479494, 492117, 506647, 522865, 540340, 558872, 578147, 597570, 616791, 636074, 655798, 675815, 695684, 715404, 735463, 756118, 777053, 797897, 818691, 839606, 860514, 881247, 902085, 923452]
53496I23452K1662K1066J9952J9357J9633K0039J9856J9289J8946J8794J8248
53485A140294J7198J6280J5990J5882J5163J3821J2748J2603J2988J2946J2038
53474A297951J0592R006P200M896K149o40l106n160o961q766j0713j2610j4083
53461A269755j5049j5927j7074j8196j8724j8769j9257k0820k2861k4089k3874
53450A055115k2786k1862k1598k1707k1591k0900j9784j8696j7919j7240j6216
53439H34816j4733j3183j1977j1017r843q197o241m232k264m48R90J983K931M352
53425G62937O288Q330J0236J2198J4385J6544J8305J9599K0536K1143K1528K2107
53413I54136K3275K4891K6480K7920K9492L1263L2884L4186L5531L7322L9445
$$ y = [923452, 945114, 966180, 986132, 1005489, 1025122, 1045161, 1065017, 1084306, 1103252, 1122046, 1140294, 1157492, 1173772, 1189762, 1205644, 1220807, 1234628, 1247376, 1259979, 1272967, 1285913, 1297951, 1308543, 1317549, 1324749, 1329645, 1331794, 1331154, 1328048, 1322888, 1315927, 1307161, 1296448, 1283838, 1269755, 1254706, 1238779, 1221705, 1203509, 1184785, 1166016, 1146759, 1125939, 1103078, 1078989, 1055115, 1032329, 1010467, 988869, 967162, 945571, 924671, 904887, 886191, 868272, 851032, 834816, 820083, 806900, 794923, 783906, 774063, 765866, 759625, 755393, 753129, 752681, 753671, 755654, 758585, 762937, 769225, 777555, 787791, 799989, 814374, 830918, 849223, 868822, 889358, 910501, 932029, 954136, 977411, 1002302, 1028782, 1056702, 1086194, 1117457, 1150341, 1184527, 1220058, 1257380, 1296825]
53402A296825M1501M3353M5163M7050M8988N0913N2644N3875N4436N4486N4309
53391A843543N4107N4142N4725N5632N5827N4382N1622M8751M6275M3494L9775
53380B402275L5637L2049K9102K6118K2796J9509J6487J3412J0031O549L074q31
53368B616208n558j0883j6542k2973l0734l9203m6739n2321n6366n9539o1574
53357B213776o1972o1338o1006o1353o1342n9995n7640n5370n3775n2686n1875
53346A575424n1393n1222n1013n0335m9096m7568m5954m4025m1388l8268l5608
53335A069554l4010l2801l0799k7947k5375k3632k1807j8958j5677j3266j1818
53324H13464j0175p746n345l909l260k577j567n50K29Q80J619K574L862N472P134
$$ y = [1296825, 1338326, 1381679, 1426842, 1473892, 1522880, 1573793, 1626437, 1680312, 1734748, 1789234, 1843543, 1897650, 1951792, 2006517, 2062149, 2117976, 2172358, 2223980, 2272731, 2319006, 2362500, 2402275, 2437912, 2469961, 2499063, 2525181, 2547977, 2567486, 2583973, 2597385, 2607416, 2613965, 2617039, 2616208, 2610650, 2599767, 2583225, 2560252, 2529518, 2490315, 2443576, 2391255, 2334889, 2275350, 2213776, 2151804, 2090466, 2029460, 1968107, 1906765, 1846770, 1789130, 1733760, 1679985, 1627299, 1575424, 1524031, 1472809, 1421796, 1371461, 1322365, 1274797, 1228843, 1184818, 1143430, 1105162, 1069554, 1035544, 1002743, 971944, 943997, 918622, 894990, 873183, 854225, 838548, 825282, 813464, 803289, 795543, 790198, 786289, 783029, 780452, 778885, 778335, 778564, 779444, 781063, 783637, 787499, 792971, 800105]
53309H00105Q512R566J0599J1859J3228J4349J5071J5758J6985J8901K0960K2478
53297I78371K3320K3857K4398K4967K5607K6524K7724K8809K9315K9101K8330
53286A270323K7219K5885K4297K2286J9805J7190J4970J3290J1776R984P791N281
53274A470097K507m44l321n857p927r558j0953j2558j4740j7339j9792k1881k4008
53261A324226k6573k9384l1921l3833l4980l5299l5051l4833l4931l4818l3803
53250I58800l1994l0209k9044k8462k8191k8003k7635k6889k5933k5129k4593
53239F52718k4200k4018k4136k4144k3358k1728j9974j8563j7145j5287j3260
53228D26905j1578j0240q957p849p270p111o852o299n755n400n019m499m154m316
$$ y = [800105, 808617, 818183, 828782, 840641, 853869, 868218, 883289, 899047, 916032, 934933, 955893, 978371, 1001691, 1025548, 1049946, 1074913, 1100520, 1127044, 1154768, 1183577, 1212892, 1241993, 1270323, 1297542, 1323427, 1347724, 1370010, 1389815, 1407005, 1421975, 1435265, 1447041, 1457025, 1464816, 1470097, 1472604, 1472160, 1468839, 1462982, 1455055, 1445497, 1434544, 1421986, 1407246, 1389907, 1370115, 1348234, 1324226, 1297653, 1268269, 1236348, 1202515, 1167535, 1132236, 1097185, 1062352, 1027421, 992603, 958800, 926806, 896597, 867553, 839091, 810900, 782897, 755262, 728373, 702440, 677311, 652718, 628518, 604500, 580364, 556220, 532862, 511134, 491160, 472597, 455452, 440165, 426905, 415327, 405087, 396130, 388281, 381011, 373900, 367048, 360749, 354994, 349594, 344575, 340076, 335922, 331606]
53214C31606m866n346n359m773l822l082l048l530l751l226k339j796j771j869
53200B83028j756j451j125r14r17j103j258j263j340j690j923j404k10O69M15
53185B67758p62k045k986l549l582k866j744j099j405k138k386j815q89k37o8
53170B40187j17n8O9j33q38j581j682j121o30p27j049r59m54k9J53L76O77O32
53152B32716N5n56o49l95l67o45p41m01j5k7l04m12k76j55o7K35O68O40j32j037
53132B28135j223p42m59q00j178q92j73J91j9k44m4L26M20K54J83L20M51M60M73
53113B25439N41N09K82N2K3M9j99p66j340j684j847j890j718j355j151j360j733
53096B11852j865j816j924k102j806q82Q7N27M94L40J76J45O79J823K539J624
$$ y = [331606, 326740, 321394, 316035, 311262, 307440, 304358, 301310, 297780, 294029, 290803, 288464, 286668, 284897, 283028, 281272, 279821, 278696, 277782, 276865, 275762, 274504, 273241, 271901, 270211, 268288, 266884, 266674, 267343, 267758, 266996, 264951, 261965, 258416, 254834, 251968, 250224, 249125, 247720, 245582, 243196, 241381, 240492, 240255, 240187, 240070, 240012, 240081, 239948, 239110, 237529, 235847, 234726, 234096, 233369, 232320, 231361, 230907, 230878, 231031, 231407, 232084, 232716, 232771, 232215, 231566, 231171, 230804, 230159, 229418, 229017, 229002, 228975, 228671, 228259, 227983, 227828, 227761, 227996, 228664, 229304, 229172, 228135, 226912, 226170, 225711, 224911, 223733, 222841, 222668, 222859, 222840, 222596, 222552, 222878, 223298, 223552, 223735, 224055, 224506, 224966, 225439, 225980, 226489, 226771, 226823, 226846, 226895, 226696, 225930, 224590, 222906, 221059, 219169, 217451, 216096, 214945, 213585, 211852, 209987, 208171, 206247, 204145, 202339, 201457, 201544, 202071, 202565, 202905, 203081, 203226, 203905, 205728, 208267, 209891]
53080B09891n68k069j493K61J067Q8j409j804j006k66n04j360j873j622q72J4
53064A96475Q45J349J155K50q00j396j472j390j372j319j073o73k99j00n2N1L89
53047A90568R24J522K175K853L070K227N90n97n04J73J33q25j684j728j314j004
53031A96579p51l42m3k30p48j110j126r47o54j73M11Q30Q62N02m1m39m86l35l34
53012A91425n28n47j31M94Q94R23P19M84L94N13N92J72q53j941k415k105j331
52995A86759m75J44K51j23m39j40O40J155R03J80l41l31m1Q2j22l95l74O3P55
52976A88151J396J636J171R5r27j199p27p9M25R24J435J669J658J891K452K592
52960B02563J763N23j91l12m75q90j169j090q24m76j11k16j341l092m186l752
$$ y = [209891, 209323, 207254, 205761, 206022, 207089, 207177, 205768, 203964, 202958, 202692, 202188, 200828, 198955, 197333, 196461, 196475, 197320, 198669, 199824, 200074, 199274, 197878, 196406, 195016, 193644, 192325, 191252, 190579, 190280, 190180, 190128, 190179, 190568, 191492, 193014, 195189, 198042, 201112, 203339, 203929, 203332, 202828, 203001, 203134, 202309, 200625, 198897, 197583, 196579, 195828, 195486, 195443, 195213, 194465, 193355, 192229, 191282, 190628, 190455, 190866, 191696, 192558, 193060, 193019, 192580, 192094, 191759, 191425, 190897, 190350, 190219, 190713, 191607, 192530, 193249, 193733, 194127, 194640, 195232, 195404, 194551, 192610, 190195, 188090, 186759, 186284, 186428, 186679, 186556, 186117, 185977, 186617, 187772, 188675, 188855, 188514, 188183, 188142, 188224, 188102, 187707, 187333, 187396, 188151, 189547, 191183, 192354, 192449, 191522, 190323, 189596, 189517, 189942, 190866, 192301, 193970, 195628, 197519, 199971, 202563, 204326, 204849, 204658, 204346, 203871, 202981, 201812, 200722, 199898, 199422, 199311, 199095, 197754, 194662, 190476, 186724]
52944A86724k181n79J48k73j341j950j334j8P18M74J34M70J102J264R57O89N76
52927A85580L23j69p29j257j716j879j508p32OL13K4o77j205r54nQ72J156J182
52909A78625J423J653J286K98o97j169j060n47Q2M02J54m11p00l63L99J042J143
52892A81560Q04N72P45Q24K07o08l49J170K392J914K88r30j276j438j660j388
52876A82827n36J80L71M51O10L57m87j157r94m02j29o2M56J470K236K212J653
52859A89056J225J267J559J635J349R78P16K31p57j734j802r12K5M38P10J137
52843A95121J156K62r59j576j671k059k853l265k800j927j320j088r51p48m44
52828A74878J7O64J393K048K422K336J889J483J327J083L96m10o64l33n2j40j78
$$ y = [186724, 184543, 183964, 184112, 183839, 182498, 180548, 179214, 179196, 179914, 180388, 180522, 180992, 182094, 183358, 184315, 185004, 185580, 185903, 185734, 185005, 183748, 182032, 180153, 178645, 177913, 177919, 178232, 178256, 177579, 176374, 175420, 175415, 176287, 177443, 178625, 180048, 181701, 182987, 183285, 182588, 181419, 180359, 179812, 179894, 180296, 180450, 180039, 179339, 178976, 179375, 180417, 181560, 182364, 182936, 183681, 184505, 184712, 184104, 183755, 184925, 187317, 189231, 189519, 188589, 187313, 185875, 184215, 182827, 182291, 182471, 182842, 183293, 183903, 184260, 183773, 182616, 181622, 181220, 181091, 181029, 181485, 182955, 185191, 187403, 189056, 190281, 191548, 193107, 194742, 196091, 197069, 197785, 198016, 197259, 195525, 193723, 192811, 192836, 193274, 193984, 195121, 196277, 196539, 195580, 194004, 192333, 190274, 187421, 184156, 181356, 179429, 178109, 177021, 176070, 175322, 174878, 174895, 175559, 176952, 179000, 181422, 183758, 185647, 187130, 188457, 189540, 189936, 189526, 188862, 188529, 188477, 188337, 188159]
52811A88159J43L84k3q37j254q63P1J211K486L681M144L262J228r59k338k743
52795A95752k684k587k421k007j423r55q12j051j605k190k373j962j273p68m69
52780A71172l8O26J113R81L35j79L6Q96J618J500O95J3n7K23N04Q68J277J136
52762A82719N8j239j669j252r74j187j117k45P43R32M30J2QJ96M54Q35J210J313
52744A81227J098O42p0q77j233p65J08O68Q29J050J445J601J345J019R09Q56O52
52727A90504M07L19M25P23J185J494J238M88j68m15o25j165j717j710j149n48
52711A89286k43k70o98j544k307k266j477r35j309j902j469R7J466J417K06r10
52695A77142j182r17p11p02o94o15m85j56N15J330J866J899J560J062N66K65L21
$$ y = [188159, 188302, 188686, 188663, 187826, 186572, 185709, 185780, 186991, 189477, 193158, 197302, 200564, 201792, 200833, 198495, 195752, 193068, 190481, 188060, 186053, 184630, 183675, 182863, 181812, 180207, 178017, 175644, 173682, 172409, 171641, 171172, 171134, 171760, 172873, 173854, 174189, 174010, 174046, 174942, 176560, 178060, 178755, 178768, 178711, 178934, 179438, 180306, 181583, 182719, 182777, 181538, 179869, 178617, 177643, 176456, 175339, 175094, 175837, 176769, 177199, 177211, 177219, 177415, 177869, 178704, 179914, 181227, 182325, 182967, 182897, 182020, 180787, 180022, 180130, 180798, 181627, 182677, 184122, 185723, 187068, 188087, 188996, 189852, 190504, 190911, 191230, 191655, 192378, 193563, 195057, 196295, 196783, 196615, 196200, 195575, 194410, 192693, 190983, 189834, 189286, 189043, 188773, 188075, 186531, 184224, 181958, 180481, 179546, 178237, 176335, 174866, 174963, 176429, 177846, 178052, 177142, 175960, 175043, 174332, 173630, 172936, 172321, 171836, 171680, 172195, 173525, 175391, 177290, 178850, 179912, 180478, 180743, 181064]
52678A81064O06P52N89L52L00L13J13k42l05K15R98J360R39R7m07k07L62O90N99
52659A88188M37N15O80N35l7o47p13PJ161K106K548K780L198L701L737K931J445
52642B12572k63j755k704l026l034l204l535l420k420r45P2J62k95n62j90P67
52626A88220J901K786L295L589L731L448K553J343L25m17j202k086k672k710k433
52611A99671k140j789j332j079j271j496j120k33M13N17O37J161J490Q69k37n02
52595A93559N08J656J737R89N16O41P11M03K70O38P42k59j845k482j506J10J044
52578A97432J118J079J330J518J307R07O10K29n11j300j442p71O5M34M24M80O30
52561B03539N55J83k49o69j166j446r30K94J215J039K31j48J89O23P25P25P93
$$ y = [181064, 181670, 182422, 183011, 183363, 183663, 183976, 184089, 183847, 183542, 183757, 184755, 186115, 187054, 187151, 186744, 186537, 186899, 187589, 188188, 188625, 189140, 189820, 190355, 190318, 189671, 188958, 188965, 190126, 192232, 194780, 197560, 200758, 204459, 208196, 211127, 212572, 212309, 210554, 207850, 204824, 201790, 198586, 195051, 191631, 189211, 188266, 188338, 188500, 188205, 187643, 187453, 188220, 190121, 192907, 196202, 199791, 203522, 206970, 209523, 210866, 211191, 210774, 209572, 207486, 204814, 202104, 199671, 197531, 195742, 194410, 193331, 192060, 190564, 189444, 189211, 189624, 190141, 190778, 191939, 193429, 194298, 194061, 193559, 194067, 195723, 197460, 198449, 198965, 199606, 200317, 200720, 200990, 201628, 202370, 202111, 200266, 197784, 196278, 196388, 197432, 198550, 199629, 200959, 202477, 203784, 204691, 205301, 205530, 205019, 203719, 202277, 201506, 201571, 202005, 202429, 202909, 203539, 204094, 204277, 204028, 203359, 202193, 200747, 199817, 200111, 201326, 202365, 202596, 202448, 202637, 203260, 203985, 204710, 205503]
52544B05503N99m9o34n26J28N75M29O0l0R6n3p06j464j747j489j229j330j433
52526A96700r62q4L90J07k84K8R20J543J374O77P5j1N17J397K073K075J491R13
52508B08939Q44J273J880K397K703K687K240J402M63k25n80r58j719k637k966
52493B15743k331j296p49q67j067q52l21J74M39M30J48k27m30l94k49L7O44J436
52475B10268J953K046K085K278K257J767J328J565K184K282J609Q24M60L52K67
52460B33525M98J347K501L258L191K331R53n18j658k344k796l116l101k684k207
52445B29180j970j810j578j557j932k170j677q77p92j516j960j349k55L14J92
52430B10243r2k42l34l79l55m51p51q74m65J51M06L81N56P60K74q23j340n19P92
$$ y = [205503, 206102, 206053, 205419, 204893, 205021, 205596, 206025, 206085, 206055, 206151, 206098, 205392, 203928, 202181, 200692, 199463, 198133, 196700, 195738, 195654, 196044, 196151, 195867, 195895, 196815, 198358, 199732, 200409, 200484, 200473, 200990, 202387, 204460, 206535, 208026, 208939, 209783, 211056, 212936, 215333, 218036, 220723, 222963, 224365, 224828, 224603, 224023, 223065, 221346, 218709, 215743, 213412, 212116, 211367, 210500, 209433, 208581, 208260, 208434, 208873, 209303, 209451, 209224, 208794, 208400, 208151, 208188, 208832, 210268, 212221, 214267, 216352, 218630, 220887, 222654, 223982, 225547, 227731, 230013, 231622, 232446, 232906, 233258, 233525, 234023, 235370, 237871, 241129, 244320, 246651, 247604, 247086, 245428, 243084, 240288, 237172, 234071, 231387, 229180, 227210, 225400, 223822, 222265, 220333, 218163, 216486, 215609, 214817, 213301, 211341, 209992, 209737, 210051, 210243, 210151, 209909, 209575, 209196, 208841, 208390, 207639, 206765, 206300, 206451, 206857, 207238, 207794, 208554, 208828, 208005, 206665, 206146, 206938]
52411B06938J254Q93R25J960L231L812L894M319N367O557P449Q090Q517Q317O961
52396B78484M456J384j525l702m802m977m999n606o482o385m699k397r53o79p30
52381B36388m90q2L93J080J679J439L51n04l80J54L44O15J784L416M137L464K273
52364B56061J429R24N78N02N63J74q60j888k212j850j180m52L3p2n06m55K76P66
52346B51831L60j64K70J273J482N92k57j61N15J041J337J642J953K241K698L286
52330B69939L536L268L041L440M256M846N057N283N814O588P449Q220Q573Q234
52316C47544P323O181M985L840L028K758K743K505K133K215K868L390L198K708
52302C97419K815L730M765N256N219N066N019N022M939M597L737K224L62j138
$$ y = [206938, 208192, 209085, 210010, 211970, 215201, 219013, 222907, 227226, 232593, 239150, 246599, 254689, 263206, 271523, 278484, 282940, 284324, 282799, 279097, 274295, 269318, 264319, 258713, 252231, 245846, 241147, 238750, 237797, 237118, 236388, 235898, 235816, 236209, 237289, 238968, 240407, 240758, 240254, 239874, 240028, 240372, 240987, 242771, 246187, 250324, 253788, 256061, 257490, 258414, 258992, 259494, 260057, 260231, 259371, 257483, 255271, 253421, 252241, 251789, 251822, 251750, 251244, 250789, 251065, 251831, 252191, 252027, 252297, 253570, 255052, 255644, 255387, 255226, 255741, 256782, 258119, 259761, 261714, 263955, 266653, 269939, 273475, 276743, 279784, 283224, 287480, 292326, 297383, 302666, 308480, 315068, 322517, 330737, 339310, 347544, 354867, 361048, 366033, 369873, 372901, 375659, 378402, 380907, 383040, 385255, 388123, 391513, 394711, 397419, 400234, 403964, 408729, 413985, 419204, 424270, 429289, 434311, 439250, 443847, 447584, 449808, 450170, 449032]
52288D49032j668j276o28m01o53q57o48l54n90j328j753j222p4Q61J314J710K306
52271D43771K771K848K862L210L645L579K957K412K515L240M163M798M778L994
52257D91543K802J832J489J734K345L152M019M843N631O383O833O580N620M482
52243E49288L725L442L308K881J910O18k30N2J222K221K326J831J389J208J233
52228E76424J651K612L658M062L693L093K807K960L425L877L852L217K599K707
52214F20637L275L309K554J985K525L846M996N688O293O851O868O172N364N074
52200F85437N152M864L780K271J126Q72J378K062K405K384K426K973L978M847
52186G25955M911M055K809J807J222P80J90n98j466k266k959l698m629n465n558
$$ y = [449032, 447364, 446088, 445460, 445059, 444406, 443549, 442901, 442547, 441957, 440629, 438876, 437654, 437580, 438441, 439755, 441465, 443771, 446542, 449390, 452252, 455462, 459107, 462686, 465643, 468055, 470570, 473810, 477973, 482771, 487549, 491543, 494345, 496177, 497666, 499400, 501745, 504897, 508916, 513759, 519390, 525773, 532606, 539186, 544806, 549288, 553013, 556455, 559763, 562644, 564554, 565172, 564942, 564994, 566216, 568437, 570763, 572594, 573983, 575191, 576424, 578075, 580687, 584345, 588407, 592100, 595193, 598000, 600960, 604385, 608262, 612114, 615331, 617930, 620637, 623912, 627221, 629775, 631760, 634285, 638131, 643127, 648815, 655108, 661959, 668827, 674999, 680363, 685437, 690589, 695453, 699233, 701504, 702630, 703502, 704880, 706942, 709347, 711731, 714157, 717130, 721108, 725955, 730866, 734921, 737730, 739537, 740759, 741539, 741729, 741131, 739665, 737399, 734440, 730742, 726113, 720648, 715090]
52171G15090m727l760l661m443n222n393n105m460l089r36J111K038J864J465
52157F80772J437J660J796J644J075J68n63n29K04R06J019O82L66L00M84R56J744
52140F94121K659L251L115K198Q98l07j347k492l704m369m063l261k750k488j608
52125F79853L15K633M475N729O852Q170R761J1647J3592J4856J4760J3442J1719
52112G97804J0151Q654P052N549M459L648K638J151n73j954k518k199j362m53
52098H32047M20J538L139M943O331O934O970O833O557N872M660L103J312q49l298
52083H86512n436o648p035p237p469p114n518k974o76L53R7n83q53o43m81o80
52067H33615q43l53P43J742K120K035J858J574J004L35%O2J69J18J03K20J23n31
$$ y = [715090, 710363, 706603, 702942, 698499, 693277, 687884, 682779, 678319, 675230, 674294, 675405, 677443, 679307, 680772, 682209, 683869, 685665, 687309, 688384, 688552, 687989, 687460, 687664, 688570, 689589, 690271, 690637, 690937, 691421, 692377, 694121, 696780, 700031, 703146, 705344, 706242, 705935, 704588, 702096, 698392, 694023, 689960, 686699, 683949, 681461, 679853, 680168, 682801, 687276, 693005, 699857, 708027, 717788, 729435, 743027, 757883, 772643, 786085, 797804, 807955, 816609, 823661, 829210, 833669, 837317, 839955, 841106, 840533, 838579, 836061, 833862, 832500, 832047, 832467, 834005, 837144, 842087, 848418, 855352, 862322, 869155, 875712, 881584, 886244, 889347, 890659, 889810, 886512, 881076, 874428, 867393, 860156, 852687, 845573, 840055, 837081, 836405, 836758, 836855, 836272, 835419, 834776, 834295, 833615, 832772, 832419, 833162, 834904, 837024, 839059, 840917, 842491, 843495, 843830, 843830, 843892, 844061, 844179, 844282, 844502, 844625, 844094]
52049H44094j465k016j910j507j193j003r63j473k859m649n804n772n037m424
52035H04019m158l806k929j494J71J586K396K703L050L784M552M720M217L632
52021H22443L487L739L979L827L137K200J771K390L561M078L421K465K404L277
$$ y = [844094, 842629, 840613, 838703, 837196, 836003, 835000, 834037, 832564, 829705, 825056, 819252, 813480, 808443, 804019, 799861, 796055, 793126, 791632, 791803, 793389, 795785, 798488, 801538, 805322, 809874, 814594, 818811, 822443, 825930, 829669, 833648, 837475, 840612, 842812, 844583, 846973, 850534, 854612, 858033, 860498, 862902, 866179]
$$ [...]
##END NTUPLES=NMR SPECTRUM
##END=
