
##TITLE=AC1256_INDRH11073_6533999_sNlIztne0f
##JCAMPDX= 6.0         $$ Bruker NMR JCAMP-DX V2.0
##DATA TYPE= NMR SPECTRUM
##DATA CLASS= NTUPLES
##ORIGIN= BRUKER
##OWNER= Administrator
$$ 1.72 TOPSPIN		Version 2.1
$$ 2012-12-14 03:12:04.763 -0500  Administrator@X
$$ Compression mode = diff/dup
##.OBSERVE FREQUENCY= 400.02188249412
##.OBSERVE NUCLEUS= ^1H
##.ACQUISITION MODE= SIMULTANEOUS (DQD)
##.ACQUISITION SCHEME= undefined
##.AVERAGES= 8
##.DIGITISER RES= 22
##SPECTROMETER/DATA SYSTEM= spect
##.PULSE SEQUENCE= zg30
##.SOLVENT NAME= COFFEE_meoh
##.SHIFT REFERENCE= INTERNAL, COFFEE_meoh, 1, 14.98509
##AUDIT TRAIL= $$ (NUMBER, WHEN, WHO, WHERE, PROCESS, VERSION, WHAT)
$$ ##TITLE= Audit trail, TOPSPIN		Version 2.1
$$ ##JCAMPDX= 5.01
$$ ##ORIGIN= Bruker BioSpin GmbH
$$ ##OWNER= Administrator
$$ $$ E:\/data/COFFEE/nmr/AC1256_INDRH11073_6533999_sNlIztne0f/20/pdata/1/auditp.txt
$$ ##AUDIT TRAIL=  $$ (NUMBER, WHEN, WHO, WHERE, PROCESS, VERSION, WHAT)
(   1,<2012-12-14 03:11:56.497 -0500>,<Administrator>,<X>,<go>,<TOPSPIN 2.1>,
      <created by zg
	started at 2012-12-14 03:10:49.419 -0500,
	POWCHK enabled, PULCHK disabled,
       configuration hash MD5:
       86 BA 57 50 F2 9D 5C 9B 26 00 A9 28 5F 66 2E 89
       data hash MD5: 64K
       12 FD 0A 11 DF 3B C8 5B 16 32 32 EF 79 81 DE 7B>)
(   2,<2012-12-14 03:11:59.560 -0500>,<Administrator>,<X>,<proc1d>,<TOPSPIN 2.1>,
      <Start of raw data processing
       efp LB = 0 FT_mod = 6 PKNL = 1 PHC0 = 0 PHC1 = 0 SI = 32K 
       data hash MD5: 32K
       5E 40 72 1F 00 FB B0 A8 04 54 BB B4 67 AD 53 97>)
(   3,<2012-12-14 03:12:00.028 -0500>,<Administrator>,<X>,<proc1d>,<TOPSPIN 2.1>,
      <pk PHC0 = 100.7336 PHC1 = 0 
       data hash MD5: 32K
       61 83 BF 77 53 A0 5A DA C1 54 D9 BB 2F 7C 2D 6D>)
(   4,<2012-12-14 03:12:00.263 -0500>,<Administrator>,<X>,<proc1d>,<TOPSPIN 2.1>,
      <abs ABSG = 1 
       data hash MD5: 32K
       FF 47 D5 05 58 D4 B3 EE F8 9A A9 5E 5C 9B 87 F6>)
(   5,<2012-12-14 03:12:00.419 -0500>,<Administrator>,<X>,<proc1d>,<TOPSPIN 2.1>,
      <abs ABSG = 2 
       data hash MD5: 32K
       14 4B 6F 39 68 16 30 9E E7 27 EF 05 0C CB 2C C9>)
(   6,<2012-12-14 03:12:00.560 -0500>,<Administrator>,<X>,<proc1d>,<TOPSPIN 2.1>,
      <abs ABSG = 3 
       data hash MD5: 32K
       C6 9F B6 E4 F3 68 90 C3 2D 79 51 EA 24 6D 6D 48>)
(   7,<2012-12-14 03:12:00.700 -0500>,<Administrator>,<X>,<proc1d>,<TOPSPIN 2.1>,
      <abs ABSG = 4 
       data hash MD5: 32K
       AA 65 E6 08 D7 CB 5B 61 95 25 12 A6 CD 6E 90 C5>)
(   8,<2012-12-14 03:12:00.872 -0500>,<Administrator>,<X>,<proc1d>,<TOPSPIN 2.1>,
      <abs ABSG = 5 
       data hash MD5: 32K
       3E D5 A4 98 FF 5A 37 01 DB AD 56 3D 75 29 B4 D0>)
$$ ##END=
$$ 
$$ $$ hash MD5
$$ $$ DB E6 38 01 09 8C 0F 38 26 9D D0 5F FF 48 D2 1D
##$RELAX= 
##$RELAX= 
##$RELAX= 
##$RELAX= 
##$RELAX= 
##$RELAX= 
##$RELAX= 
$$ Bruker specific parameters
$$ --------------------------
##$DU= <E:\>
##$EXPNO= 20
##$NAME= <AC1256_INDRH11073_6533999_sNlIztne0f>
$$ [...]
##$TP= (0..7)
150 150 150 150 150 150 150 150
##$TP07= 0
##$TPNAME0= <>
##$TPNAME1= <>
##$TPNAME2= <>
##$TPNAME3= <>
##$TPNAME4= <>
##$TPNAME5= <>
##$TPNAME6= <>
##$TPNAME7= <>
##$TPOAL= (0..7)
0.5 0.5 0.5 0.5 0.5 0.5 0.5 0.5
##$TPOFFS= (0..7)
0 0 0 0 0 0 0 0
##$TUNHIN= 0
##$TUNHOUT= 0
##$TUNXOUT= 0
##$USERA1= <user>
##$USERA2= <user>
##$USERA3= <user>
##$USERA4= <user>
##$USERA5= <user>
##$V9= 5
##$VALIST= <valist>
##$VCLIST= <CCCCCCCCCCCCCCC>
##$VD= 0
##$VDLIST= <DDDDDDDDDDDDDDD>
##$VPLIST= <PPPPPPPPPPPPPPP>
##$VTLIST= <TTTTTTTTTTTTTTT>
##$WBST= 1024
##$WBSW= 4
##$XGAIN= (0..3)
0 0 0 0
##$XL= 0
##$YL= 0
##$YMAX_a= 668190
##$YMIN_a= -569953
##$ZGOPTNS= <>
##$ZL1= 120
##$ZL2= 120
##$ZL3= 120
##$ZL4= 120
##$ABSF1= 14.98509
##$ABSF2= -5.573092
##$ABSG= 5
##$ABSL= 3
##$ALPHA= 0
##$AQORDER= 0
##$ASSFAC= 0
##$ASSFACI= 0
##$ASSFACX= 0
##$ASSWID= 0
##$AUNMP= <proc_prof1d_extract_pilot.lims>
##$AXLEFT= 0
##$AXNAME= <>
##$AXNUC= <1H>
##$AXRIGHT= 0
##$AXTYPE= 0
##$AXUNIT= <>
##$AZFE= 0.1
##$AZFW= 0.1
##$BCFW= 0
##$BC_mod= 0
##$BYTORDP= 0
##$COROFFS= 0
##$CY= 15
##$DATMOD= 1
##$DC= 0
##$DFILT= <>
##$DTYPP= 0
##$F1P= 0
##$F2P= 0
##$FCOR= 0.5
##$FTSIZE= 32768
##$FT_mod= 6
##$GAMMA= 0
##$GB= 0
##$INTBC= 1
##$INTSCL= 1
##$ISEN= 128
##$LB= 0
##$LEV0= 0
##$LPBIN= 0
##$MAXI= 10000
##$MC2= 0
##$MEAN= 0
##$ME_mod= 0
##$MI= 0
##$NCOEF= 0
##$NC_proc= -8
##$NLEV= 6
##$NOISF1= 0
##$NOISF2= 0
##$NSP= 0
##$NTH_PI= 0
##$NZP= 0
##$OFFSET= 14.98509
##$PC= 1
##$PHC0= 100.7336
##$PHC1= 0
##$PH_mod= 1
##$PKNL= yes
##$PPARMOD= 0
##$PPDIAG= 0
##$PPIPTYP= 0
##$PPMPNUM= 2147483647
##$PPRESOL= 1
##$PSCAL= 4
##$PSIGN= 0
##$PYNMP= <proc.py>
##$REVERSE= no
##$SF= 400.02
##$SI= 32768
##$SIGF1= 0
##$SIGF2= 0
##$SINO= 400
##$SIOLD= 32768
##$SPECTYP= <>
##$SREGLST= <1H.CDCl3>
##$SSB= 0
##$STSI= 32768
##$STSR= 0
##$SW_p= 8223.68421052631
##$SYMM= 0
##$S_DEV= 0
##$TDeff= 65536
##$TDoff= 0
##$TI= <>
##$TILT= no
##$TM1= 0
##$TM2= 0
##$TOPLEV= 0
##$USERP1= <user>
##$USERP2= <user>
##$USERP3= <user>
##$USERP4= <user>
##$USERP5= <user>
##$WDW= 1
##$XDIM= 32768
##$YMAX_p= 471915913
##$YMIN_p= -771975
##$CURPLOT= <Network HP LaserJet P1505>
##$CURPRIN= <$Network HP LaserJet P1505>
##$DFORMAT= <normdp>
##$LAYOUT= <+/1D_H.xwp>
##$LFORMAT= <normlp>
##$PFORMAT= <normpl>
##$SURQMSG= 1
$$ End of Bruker specific parameters
$$ ---------------------------------
##NTUPLES= NMR SPECTRUM
##VAR_NAME=  FREQUENCY,     SPECTRUM/REAL,   SPECTRUM/IMAG
##SYMBOL=    X,             R,               I
##VAR_TYPE=  INDEPENDENT,   DEPENDENT,       DEPENDENT
##VAR_FORM=  AFFN,          ASDF,            ASDF
##VAR_DIM=   32768,         32768,           32768
##UNITS=     HZ,            ARBITRARY UNITS, ARBITRARY UNITS
##FACTOR=    0.250966925370066, 1,           1
##FIRST=     8223.43324360094, -227888,      -8705
##LAST=      0,             -146267,         -119893
##MIN=       0,             -771975,         0
##MAX=       8223.43324360094, 471915913,    0
$$ Real data points
##PAGE= N=1
##DATA TABLE= (X++(R..R)), XYDATA
$$ [...]
19522c08835h8644H9905N9714C6331b015j76053h4555A74804a11151k11679a6279
19510C98980c902k2787q5655A46251n0285a7355j07351M4245j68570i5177D1948
19498a55049j07912C00087h7384A67162e1396k66725j15064A52337b69661F7472
19487a09367k4129e6686k31169A9834R9341J23358B9745J19907f8259k5458j04188
19476a97905R3277c374l00303A7625d49385a68895d1373o3468B02926j5697P4005
19465B61234A28289c39780J14940A44343b72073B29189c0337o255j00556G8071
19454b82494d2322n7587A2586J83494J51589a42205j2954B01741r888b10268H9574
19442f903j11999F1727a08529B9501i6730q420j92119A00130m5545k702c69048
$$ plain form
19522 -308835 -88644 89905 149619 36331 -2015 -178068 -84555 174804 -111151 -322830 -16279
19510 398980 -3902 -26689 -112344 146251 95966 -17355 -124706 -80461 -249031 -95177 41948
19498 -155049 -262961 300087 -87384 167162 -51396 -318121 -433185 152337 -269661 67472
19487 -109367 -133496 -56686 -287855 19834 119175 242533 29745 149652 -68259 -93717 -197905
19476 -197905 -104628 -3374 -303677 17625 -449385 -168895 -41373 -104841 202926 187229 261234
19465 261234 128289 -339780 -224840 144343 -272073 229189 -30337 -36592 -137148 78071
19454 -282494 -42322 -99909 12586 196080 347669 -142205 -155159 201741 191853 -210268 89574
19442 -6903 -118902 61727 -108529 29501 -96730 -105150 -297269 100130 54585 51883 -369048
19430C46634a48386A81097H5182b71348a06138p467q263m6228j12874C15272A7876
19418a37703k708e904j52901e0328j50563N3865j6987a2927j95675j41550A74651
19406f640j14085k43220J51658k09187E8450a56981j47548R0581A782O1210M07919
19395D70911a83952L6250A9466d11914M9777a53181k04614D7080J64367b9293
19384E3073a21176C60723A38323a92977A81918m4381k6730b39946A97468e0196
19373D89220b26668O8716a587G4272a90705j66527a24297a7725n7698I1580a40908
19361a48677L418A29563P8091n6532h5513p3037M4777n6959q6109h9536B2817
19349d49153E7545a71994M1225C30529a24526c6684q9445j81924a36285j18795
$$ plain form
19430 346634 -148386 181097 85182 -271348 -106138 -113605 -121868 -168096 -280970 315272 17876
19418 -137703 -140411 -5904 -158805 -50328 -200891 -147026 -164013 -12927 -208602 -350152 174651
19406 -6640 -120725 -363945 -212287 -421474 58450 -156981 -304529 -213948 1782 62992 470911
19395 470911 -183952 -147702 19466 -411914 -362137 -153181 -357795 47080 211447 -29293
19384 53073 -121176 360723 138323 -192977 181918 137537 110807 -239946 197468 -50196
19373 489220 -226668 -157952 -1587 74272 -190705 -357232 -124297 -17725 -75423 91580 -140908
19361 -148677 -145259 129563 207654 151122 -85513 -158550 -113773 -170732 -256841 -89536 22817
19349 -449153 57545 -171994 -130769 330529 -124526 -36684 -126129 -308053 -136285 -255080
19339b55080h5584k59267A4034a9334m1n50735a47964B36604d359j05687d9994
19327h9671j39920d8262H2325K0974b42434b0539k24402l1837J00527G8622B7694
19315b10806F8607e4226A03515Q0004a0377k81987J01554A35815a08223j02385
19305b10608j07763A02975b78670f8237n4376I6668L3835i4018k01959h6610q639
19294i5249C24163i4509M4776A98276a02034A85039D5072N9135b41506d8561A26004
19282D3095b93217A0249h7717r7496G3444e89760K93879L9743A66474b37768i1282
19270H1862l4119a77691C8822a97052H2328a24821l14678d9966B1689O9466a6187
19258a59486B38787A11142K01656d23044a06629b1244k10468g3226F9854a62102
$$ plain form
19339 -255080 -85584 -344851 14034 -19334 -19375 -570110 -147964 236604 -4359 -110046 -49994
19327 -89671 -229591 -48262 82325 103299 -242434 -20539 -244941 -276778 -176251 78622 27694
19315 -210806 68607 -54226 103515 183519 -10377 -292364 -190810 135815 -108223 -210608
19305 -210608 -318371 102975 -278670 -68237 -122613 96668 130503 -94018 -295977 -86610 -95249
19294 -95249 324163 -94509 -49733 198276 -102034 185039 45072 104207 -241506 -48561 126004
19282 43095 -293217 10249 -87717 -185213 73444 -589760 -295881 -256138 166474 -237768 -91282
19270 81862 47743 -177691 38822 -197052 82328 -124821 -439499 -49966 21689 91155 -16187
19258 -159486 238787 111142 312798 -423044 -106629 -21244 -231712 -73226 69854 -162102
19247c20702e8737l86716A75717C6567c56258G6066Q3496a52795k27003B4137
19236B54436G2099a12178r5491j89991G6880g0599C3144r421i5157J6913r126
19225h7370a9979B28201I3811c0171j32800P2997m51761c6476B34283c39041I1119
19213b68041M2484B8154e7209j7500j10107B07670I4474R2590b90639D535K1599
19202B6134N439b83244J4817Q261d6296B21894b0016I7726l6581a58558K9892
19191a28666A16397E50J19104a31541i847j42947a5755j94019B15404a35557J5754
19180a19803A9050K15041h7709A16457a90154H4511b53016c9329a0725j2981r6243
19169a19949I3962a26041p33n3519G3702a82455g0343A39531a44054j53354B28296
$$ plain form
19247 -320702 -58737 -445453 175717 36567 -356258 76066 159562 -152795 -379798 24137
19236 254436 72099 -112178 -207669 -397660 76880 -70599 33144 23723 -95157 -78244 -87370
19225 -87370 -19979 228201 93811 -30171 -162971 -89974 -541735 -36476 234283 -339041 91119
19213 -268041 -225557 28154 -57209 -74709 -184816 207670 94474 187064 -290639 4535 26134
19202 26134 31573 -283244 -268427 -260166 -46296 221894 -20016 97726 61145 -158558 -128666
19191 -128666 116397 550 119654 -131541 -9847 -152794 -15755 -209774 215404 -135557 -119803
19180 -119803 19050 234091 -87709 116457 -190154 84511 -253016 -39329 -10725 -23706 -119949
19169 -119949 93962 -126041 -126774 -180293 73702 -182455 -70343 139531 -144054 -297408 228296
19157a95051a7761D352J0743c2296A11844P3476b04871i499k24246i0577k87077
19146c77654A41886D5589b89679A58722c16783A27434B1702f7054k23547a28790
19135b25213O9435I3097b29426R1111A31786c27383J58310d404k1309l20463a59986
19123b09021L3241K0331B11508p6380O7C3225J43803G8097N1626K34686A0618
19111c61238a70933L5021O462k13011f0015A17174L401R8553a64847I7532b53963
19099g457C90233G7925a37657o5993g5721l43200e1647F7365a65976C6268a38687
19087a56731p4260A84442c81594B98502b03588A22785D1202O322f5200l20632
19077c85832F097K02534a0005k28153A78819a06224F3767a62163b0403A15915
$$ plain form
19157 -195051 -17761 4352 15095 -32296 111844 185320 -204871 -9499 -233745 -90577 -377654
19146 -377654 141886 45589 -289679 158722 -316783 127434 21702 -67054 -290601 -128790
19135 -225213 -155778 93097 -229426 -138315 131786 -327383 -169073 -4404 -25713 -346176 -159986
19123 -209021 -175780 -155449 211508 135128 135195 33225 177028 78097 129723 364409 10618
19111 -361238 -170933 -135912 -129450 -342461 -60015 117174 120575 219128 -164847 97532 -253963
19099 -7457 390233 77925 -137657 -203650 -75721 -418921 -51647 67365 -165976 36268 -138687
19087 -156731 -230991 184442 -381594 298502 -203588 122785 41202 47524 -65200 -385832
19077 -385832 6097 208631 -10005 -238158 178819 -106224 63767 -162163 -20403 115915
19066c07130M3399A13213h6711q8511C096O5635B1714e0156a4504n9325b3238
19054B41153a76974B00701J32156a08132L2503j51560C13930A49334f2549H002
19043d4329j0594q8994E0676c3066j19227d3475I7634a93161B3518a00020A29952
19031A80470n4865b23268j6226i7742k19658A87896a86924R692b4211j08132b3936
19019a02270L5221j41127C0930J0427b14938P9515A18506a96932j82927k852c1373
19007c08140h765l92075E6815K52072a34090D7287a15043A84980b22746k9780
18997b52526A80788A1J47036L2024F4518a59704A83840C9445J632K51426c04200
18985i0336a649A77176d41828G1453a3082A34484D0199q454K2369a76365A44343
$$ plain form
19066 -307130 -263731 113213 -86711 -175222 3096 68731 21714 -50156 -14504 -73829 -23238
19054 241153 -176974 200701 332857 -108132 -75629 -227189 313930 149334 -62549 8002
19043 -44329 -54923 -143917 50676 -33066 -152293 -43475 97634 -193161 23518 -100020 129952
19031 180470 125605 -223268 -239494 -97742 -317400 187896 -186924 -177232 -24211 -132343 -23936
19019 -102270 -67049 -208176 30930 41357 -214938 -135423 118506 -196932 -379859 -382711 -31373
19007 -308140 -8765 -400840 56815 308887 -134090 47287 -115043 184980 -222746 -252526
18997 -252526 180788 11 147047 179071 64518 -159704 183840 39445 41077 292503 -304200
18985 -90336 -1649 177176 -441828 71453 -13082 134484 40199 31745 54114 -176365 144343
18973e4821j43829j43807A36966d2791H4485a51296C6787c00772B12471f3102
18962a63449q3148F3399J31423h2168k38117E5485e6883j28116i530k26848p5621
18951c11999A72603o0920b89848J38748P2653A55958f234B4375a25213E5292J27630
18940A82922a23960l25593J38543B61508i0495B98166b31477N856j25685J34550
18930b16756E7597P7534b88336a17707d2717j1772A88216A6984c91367J91627
18920a99740A71584i1578A00540b46720F6921a00859d4346k33264a30025d5253
18909b71502O1230h5777j5589I0954e7385A8913J77592k1259r647a38349k34613
18898c72962C9101J54616a39752K9005M3335A0331b89552A51622N0767a29401
$$ plain form
18973 -54821 -198650 -342457 136966 -42791 84485 -151296 36787 -300772 212471 -63102
18962 -163449 -246597 63399 194822 -82168 -320285 55485 -56883 -184999 -9530 -236378 -311999
18951 -311999 172603 111683 -289848 -151100 -78447 155958 -6234 24375 -125213 55292 182922
18940 182922 -123960 -449553 -311010 261508 -90495 298166 -231477 -225621 -351306 -216756
18930 -216756 57597 135131 -288336 -117707 -42717 -54489 188216 16984 -391367 -199740
18920 -199740 171584 -91578 100540 -246720 66921 -100859 -44346 -277610 -130025 -45253
18909 -271502 -210272 -85777 -101366 90954 -57385 18913 196505 175246 165599 -138349 -372962
18898 -372962 39101 193717 -139752 -110747 -67412 10331 -289552 151622 202389 -129401
18887D5310a44941J9759B7731a89395A87381a42657A35136J2068f9704j60778
18877b30482N2689b483B3336N4027b48800L6886d3403G7597J42919j01834m1900
18866G6782O8464c93041g3373a0872j39996A78479a49923M8154B1493f4050j68297
18855b32347A16192D0010O4337a03988G3760a9135D4370c4724j15205D7813d4181
18843b12112O0825B16094c12116K5868h9773B53968G4506A8059K53596E360b00501
18831A21247c31695H3324J05763a56661a1676F3942a14926k16612d4211n6033
18821a00244M7099j5565A11323J75175a36421F4147a07595a0880n6604D38072
18810b05075A2728P6019m3580b7068C13370A30844L73323b26888A79154b86159
$$ plain form
18887 45310 -144941 -125182 27731 -189395 187381 -142657 135136 147204 -69704 -230482
18877 -230482 -177793 -2483 23336 77363 -248800 -211914 -43403 77597 220516 118682 76782
18866 76782 145246 -393041 -73373 -10872 -150868 178479 -149923 -101769 21493 -64050 -232347
18855 -232347 116192 40010 104347 -103988 73760 -19135 44370 -34724 -149929 47813 -44181
18843 -212112 -151287 216094 -312116 -286248 -89773 253968 74506 18059 271655 5360 -200501
18831 121247 -331695 83324 189087 -156661 -11676 63942 -114926 -331538 -44211 -100244
18821 -100244 -53145 -68710 111323 286498 -136421 64147 -107595 -10880 -67484 438072
18810 -205075 12728 88747 45167 -27068 313370 130844 504167 -226888 179154 -286159
18799d2792j55435b5660A6608c93549I5861c7183B37490j13865a42901m9928o4619
18788b57448k10325a24309e5053K6854o4856c2223E3021j557k2053c64858j29170
18777d94028K33907e9714J1263j42600j45509d5383j4623b234k50348K9598e8528
18765D410d6562k7239A31929n0647d1550l26081J21345a0884j57129A05201a98570
18753A04019k8943a17322L9874m7464j37857D9618g0979j66396a05458k7103j05757
18742b38318f496A05621a76038b5187B80799b93544R4383e0598C64860h0047o9039
18731a49086A7699E208a26924A10060A8919d3829b1225o0729k8972o5850A3850
18719i2905H7035D1345R524e02317f1629q6684k03457G5175M2200P7915K3544
$$ plain form
18799 -42792 -198227 -25660 16608 -393549 95861 -37183 237490 123625 -142901 -192829 -257448
18788 -257448 -467773 -124309 -55053 -28199 -93055 -32223 53021 51464 29411 -364858 -494028
18777 -494028 -260121 -59714 -48451 -191051 -336560 -45383 -60006 -2234 -252582 -222984 -58528
18765 4410 -46562 -73801 131929 81282 -41550 -367631 -246286 -10884 -168013 105201 -198570
18753 104019 75076 -117322 -77448 -124912 -262769 49618 -70979 -237375 -105458 -132561 -238318
18742 -238318 -6496 105621 -176038 -25187 280799 -293544 -199161 -50598 364860 -80047 -149086
18731 -149086 17699 5208 -126924 110060 18919 -43829 -21225 -81954 -110926 -176776 13850
18719 -92905 87035 41345 50869 -502317 -61629 -148313 -351770 75175 117375 195290 218834
18708B18834d99570A25240d67599d5906C72222B3913b1511j05682E0465j4168
18698C6297f919K713k13847E8892K3117h3334M0292a9517l1756j11155B20157
18686H6738b38264E1779i1854a4126j34654A5880d35831B57863a90284r3003h7154
18674d26101a56819g3347K7967j18535L6659B30020b36228A32549e4214D2996
18663B70648b23921B7393b73346a2651l2388I3052b8347E90707B2253e47451b24195
18651d5612j83771H4605a29581j37606J1906d525j38726d4771A02830a97825N8941
18640a38884D3340d4822k12147A79925a02924H7999h0917A47892a67609a4132
18629a39129Q268K7911m1965N2482c1045A63843c45351A23089a29763O1350A67979
$$ plain form
18708 218834 -499570 125240 -467599 -45906 372222 23913 -21511 -127193 50465 36297
18698 36297 -6919 -4206 -218053 58892 82009 -83334 -43042 -19517 -51273 -162428 220157
18686 86738 -238264 51779 -91854 -14126 -148780 15880 -435831 257863 -190284 -283287 -87154
18674 -426101 -156819 -73347 -45380 -163915 -127256 230020 -236228 132549 -54214 42996
18663 270648 -223921 27393 -273346 -12651 -45039 93052 -28347 590707 22253 -547451 -224195
18651 -45612 -229383 84605 -129581 -267187 -255281 -4525 -143251 -44771 102830 -197825 -138884
18640 -138884 43340 -44822 -256969 179925 -102924 87999 -80917 147892 -167609 -14132
18629 -139129 -130861 -102950 -144915 -92433 -31045 163843 -345351 123089 -129763 -68413 167979
18617H7845g0830p0342o4120N0339A2158e746A90528j1795n5332n0032j1351c6058
18604c90564B2167P1051R1932a55595d8216q2169A30653f5204m0454n6460o659
18593a68777L7594E1581R0446a27985B83673A05788e9473k40980g7938l38309
18583d16247a50312A7278j231c2862r8996A28865f8724g402E5910K9201g9790
18571a29501j48328J22876d3181l12844a40201L6388o3867B25950a72095N1354
18561a20741A90927B4970c66715j069A80361f1107I6791b14443P2748H7830K19775
18550C07605e0509F2760c8818F8404c9813A02750N5102a55908G0824J21950a86497
18538a07461B02464p7633c84975j3296H3534C2896J5122f1439j02224A0737a95388
$$ plain form
18617 87845 -70830 -141172 -205292 -154953 12158 -5746 190528 178733 123401 73369 62018 -36058
18604 -390564 22167 93218 185150 -155595 -48216 -130385 130653 -65204 -105658 -162118 -168777
18593 -168777 -131183 51581 142027 -127985 283673 105788 -59473 -300453 -77938 -416247
18583 -416247 -150312 17278 16047 -32862 -131858 128865 -68724 -7402 55910 85111 -79790
18571 -129501 -277829 -154953 -43181 -356025 -140201 -103813 -167680 225950 -172095 -120741
18561 -120741 190927 24970 -366715 -367784 180361 -61107 96791 -214443 -141695 87830 307605
18550 307605 -50509 62760 -38818 68404 -39813 102750 157852 -155908 70824 192774 -186497
18538 -107461 202464 124831 -384975 -398271 83534 32896 48018 -61439 -163663 10737 -195388
18526b34336R5165J1974A45746F6740g50C61914m8391a56086D20389C2569a32212
18514c06912A32850b35163m8493g479C73140b16430J479h9008j09885P1480N3589
18503g3824n3005C12022e6633j56955P1448N0922m8411m273A1928c19128n06e5121
18490A1092g1254B54830q1653G6464c5302G1897j3208a86313c6261o7625q9093
18479a92979j5997B31622q0152c0119j80305K2768A48933a77771B59540o3524
18469A96016q9371c1479B3694h19j42722H6429a68232J7275K0133C01746A20333
18457g2342b5822j20553G8007a58268P4066B90693b97668C04229A08967a53362
18446a82696A96092a30988j03039a11877A40381a7591l31304J22839I5188D3883
$$ plain form
18526 -234336 -139171 -127197 145746 66740 -750 361914 313523 -156086 420389 32569 -132212
18514 -306912 132850 -235163 -283656 -7479 373140 -216430 -214951 -89008 -198893 -127413 -73824
18503 -73824 -126829 312022 -56633 -213588 -142140 -91218 -139629 -143902 11928 -319128 -319634 -55121
18490 11092 -71254 254830 173177 76464 -35302 71897 58689 -186313 -36261 -103886 -192979
18479 -192979 -208976 231622 151470 -30119 -210424 -187656 148933 -177771 259540 196016
18469 196016 106645 -31479 23694 -819 -143541 86429 -168232 -150957 -130824 301746 120333
18457 -72342 -25822 -146375 78007 -158268 -84202 290693 -297668 304229 108967 -153362
18446 -182696 196092 -130988 -234027 -111877 140381 -17591 -348895 -226056 95188 43883
18435c31763J21841L2487h8627m2496c0080C90124H1887c81470F0099a17779A60412
18423a31862A81387a16313I6064b32170B54703A21118k0762f1631q9764C868e31508
18411I3790e05463B61899B0808J5003A3048h7969q8505n0958d8400A64926M5783
18400B10709d9555o6248a0502A93328a63040j129l01503a11919A21480a39920
18389f1440j34276i0848c4324p2943j5255H3685l9721a62393h0982m125D5090
18377c65225f0617B19750a73315E4054A1932a31244f5005j15602c3300B52774
18366d22447f8881N417j99014A09397A3740f0977k45714L7991B60775d40010a05311
18354b41792B05038p8068f7542g559r7376l789n8945c5183j21485N7720k13436
$$ plain form
18435 -331763 -209922 -177435 -88627 -131123 -30080 390124 81887 -381470 60099 -117779 160412
18423 -131862 181387 -116313 96064 -232170 254703 121118 100356 -61631 -151395 3868 -531508
18411 93790 -505463 261899 20808 35811 13048 -87969 -176474 -227432 -48400 164926 210709
18400 210709 -49555 -115803 -10502 193328 -163040 -164169 -465672 -111919 121480 -139920
18389 -61440 -195716 -90848 -34324 -107267 -122522 83685 43964 -162393 -80982 -85107 45090
18377 -365225 -60617 219750 -173315 54054 11932 -131244 -65005 -180607 -33300 252774
18366 -422447 -68881 -63464 -262478 109397 13740 -60977 -306691 -268700 260775 -440010 -105311
18354 -241792 205038 126970 -67542 -7559 -104935 -108724 -167669 -35183 -156668 -98948 -312384
18343c12384c1060E6142A6929J34952b74112C2446a44694A99887a85992a8333
18332C4814Q0689d9674j3539A68987c51240A5758a593k72158h3229B12428a20210
18320a08858I1289i0391A320c67580A74437a15124e1464r330A45791c79404P6968
18309c02436a33890A75811q0749b23414A83784b56568A6377K4699b11914R8550
18299a13364A14225a25992a6276B96588p700d4665j7566E2537R5853e21256A3302
18287g7956A3936d180D36250i1311A8872b7677o70j45347E9788b65862n4673M0514
18275b80021B88923d5635A69775b90554N2918h6654b6712j56119I1229J81005
18265B72234f623m80945A40096J01340c01042J04116p5449g6266m0079l5413A62777
$$ plain form
18343 -312384 -31060 56142 16929 151881 -274112 32446 -144694 199887 -185992 -18333
18332 34814 115503 -49674 -63213 168987 -351240 15758 -1593 -273751 -83229 212428 -120210
18320 -108858 91289 -90391 1320 -367580 174437 -115124 -51464 -60794 145791 -379404 -302436
18309 -302436 -133890 175811 95062 -223414 183784 -256568 16377 41076 -211914 -113364
18299 -113364 114225 -125992 -16276 296588 288888 -44665 -62231 52537 148390 -521256 13302
18287 -77956 13936 -4180 436250 -91311 18872 -27677 -28347 -173694 59788 -265862 -320535 -280021
18275 -280021 288923 -45635 169775 -290554 -237636 -86654 -26712 -182831 91229 272234
18265 272234 -6623 -487568 140096 241436 -301042 -196926 -272375 -76266 -116345 -151758 162777
18253E602f4332F8522O1872a40373C15469c10424Q3329F1794a60296c5474a2639
18241A76395B9915j1494M8049a46437j27701A18780O4116F9673b1876G8997a35693
18229g3088j93901A9533i6050n3180o7438M0202H4407d26955M6388A93083c66573
18217a28909F1519P5630b11009D1140J41010M3646o0710f2228a0606j32414j44554
18206b87574E2140i4842m10673f0853G341J5036K1528c34747c0810D8340L26478
18195C74818g919A18907b2417H2031J49084a65122B42995b52188A04457a43979
18184H6234a46463L3646I8378K3443l1866b20692j4575c047k88049B56024H8401
18172a7262j65305H8106A0447a73746c5760C788b8499A49020h3190r0759n2270
$$ plain form
18253 5602 -64332 68522 130394 -140373 315469 -310424 -227095 61794 -160296 -35474 -12639
18241 176395 29915 18421 66470 -146437 -274138 118780 182896 69673 -21876 78997 -135693
18229 -73088 -266989 19533 -96050 -149230 -216668 -176466 84407 -426955 -380567 193083 -366573
18217 -128909 61519 137149 -211009 41140 182150 225796 165086 -62228 -10606 -143020 -287574
18206 -287574 52140 -94842 -505515 -60853 7341 22377 43905 -334747 -30810 48340 374818
18195 374818 -7919 118907 -22417 82031 231115 -165122 242995 -252188 104457 -143979
18184 86234 -146463 -112817 98378 121821 89955 -220692 -235267 -3047 -291096 256024 88401
18172 -17262 -182567 88106 10447 -173746 -35760 3788 -28499 149020 -83190 -173949 -226219
18161b26219C75923j80636f8286j09403A3807a42553k9955B8892L27448b27588
18150a21307J2459D8962a36177L8900B983L0517m300b32068A05688N6693f853
18138A08486N335b66404A25536a0871q8588j70541f5411K9639k96377E8780a34821
18126i1539A57383k8495N1437A0389a53395A72870a21699j3431C91184A45279
18115D0739A2901b79942i7564k92995f3299J2579l69817F3876a4190l7940j29711
18104a81841J3437C3319d3952i321m8662A76853b19918k8124a8980j9596B06804
18092A8355c45202e8310C59196a06852j78568A43940Q1557b14644B20295A0578
18081c6022D0945f7616k0382E2492K4654Q9825d33362a62023m8548i6811E2915
$$ plain form
18161 -226219 375923 195287 -68286 -177689 13807 -142553 -172508 28892 356340 -227588
18150 -121307 -108848 48962 -136177 -97277 2983 33500 29200 -232068 105688 162381 -6853
18138 108486 113821 -266404 125536 -10871 -99459 -270000 -65411 -35772 -332149 58780 -134821
18126 -91539 157383 128888 180325 10389 -153395 172870 -121699 -135130 391184 145279
18115 40739 12901 -279942 -97564 -390559 -63299 -50720 -420537 63876 -14190 -52130 -181841
18104 -181841 -168404 33319 -43952 -9321 -57983 176853 -219918 -248042 -18980 -38576 206804
18092 18355 -345202 -58310 359196 -106852 -285420 143940 225497 -214644 220295 10578
18081 -36022 40945 -67616 -87998 52492 77146 166971 -433362 -162023 -210571 -96811 52915
18069b05442f887A42828a08653A1741M2165a54505A51645l1714c52001P2550a27622
18057C17249a69777B31151n3756k0569a32094C9013i3141E5437f3118g199p9431
18046h6630J2937C6183b76930A51210a95622c6304n3315o599L6363k7706l82133
18035d69694a1861j07178I5019a08988F7414k6902J75324a1367j78499E2254b14605
18023b76052K6435a02131D5420N0311k9032b76647A75567p0250J13325D42a42905
18011H3213L0019a09429a7368k72092J36372e4700B26623K02010A70004i2095
18000B47587a85548B89089c47479f3389C1617K31561a19024j29348a04457B54355
17989C17167I7737a11475K2605j1902B4495J30563d26088G6554A1220J90517G5566
$$ plain form
18069 -205442 -6887 142828 -108653 11741 53906 -154505 151645 119931 -352001 -279451 -127622
18057 317249 -169777 231151 177395 156826 -132094 39013 -93141 55437 -63118 -7199 -86630
18046 -86630 -73693 36183 -276930 151210 -195622 -36304 -89619 -96218 -59855 -87561 -469694
18035 -469694 -11861 -119039 95019 -108988 67414 40512 215836 -11367 -189866 52254 -214605
18023 -276052 -249617 -102131 45420 95731 66699 -276647 175567 105317 218642 442 -142905
18011 83213 113232 -109429 -17368 -289460 -153088 -54700 226623 428633 170004 -92095
18000 247587 -185548 289089 -347479 -63389 31617 263178 -119024 -248372 -104457 254355
17989 317167 97737 -111475 -88870 -100772 24495 155058 -426088 76554 11220 201737 75566
17977a36342D0304L05894q8097c46812a25944d3129F00054a6680l9708l08919
17967c65307a68236I7214b12244B18444a37989B43170b2079n5712A0862N3107
17957F3969O6514a29379E342g6035f451q1479B10680e4237B46731k6637b04306
17945b57499B8794b84894A47496e8455C7690R602a00525b8290E3990f2839C21637
17933c52188E6627a0492m33H3041a18663A96206J0685m9463a03704I2737A0474
17921b14520R5198C32565j36771N2898j53b93620i3569L407A31903E4981f5593
17909d2856A01669D3987f6439K2290q2676l40814J53361A51485c7663j77428i0767
17897A0806M764J16965d9776n7940m0469A36114j6014f0783A14420a02204A6795
$$ plain form
17977 -136342 40304 346198 258101 -346812 -125944 -43129 600054 -16680 -56388 -365307
17967 -365307 -168236 97214 -212244 218444 -137989 243170 -22079 -77791 10862 63969
17957 63969 130483 -129379 5342 -76035 -6451 -87930 210680 -54237 246731 220094 -204306
17945 -257499 28794 -284894 147496 -58455 37690 47292 -100525 -28290 53990 -62839 321637
17933 -352188 56627 -10492 -10925 83041 -118663 196206 206891 157428 -103704 92737 10474
17921 -214520 -119322 332565 195794 248692 248539 -293620 -93569 -90162 131903 54981 -65593
17909 -42856 101669 43987 -66439 -44149 -126825 -467639 -314278 151485 -37663 -215091 -90767
17897 10806 15570 132535 -49776 -107716 -148185 136114 120100 -60783 114420 -102204 16795
17885b22743A39911c6690D55122G9765b32805A45904b14852B0486e7983q6619
17875a44602a2557A96573a48378c071D1437J71832e477n5758B50706q1610a54085
17863A5207a97242i0346l0884C61L22223A50969a10746B4807a46149A48888a90339
17851G5879n305b29423C84876a43217A12332A0134J25363G257K57673E905e9629
17839A69228J92252A39948b85474E2035J17278c7442k4395k13122B46097e4514
17828G4356J11434e66786i9387L2907B13572d1195A2302J65967F9997J27722p9660
17817A18059a64342e1657j91613J19653d2894j62727A49497a62289h00A4718L31090
17806C45808I6019a59134B233a72446n4762h4682B8126f4582A0218P5798C872
$$ plain form
17885 -222743 139911 -36690 455122 79765 -232805 145904 -214852 20486 -57983 -144602
17875 -144602 -12557 196573 -148378 -3071 41437 213269 -5477 -61235 250706 169096 -154085
17863 15207 -197242 -90346 -121230 361 322584 150969 -110746 24807 -146149 148888 -190339
17851 75879 70574 -229423 384876 -143217 112332 10134 135497 7257 264930 5905 -59629
17839 169228 361480 139948 -285474 52035 169313 -37442 -61837 -274959 246097 -54514
17828 74356 185790 -566786 -99387 -66480 213572 -41195 12302 178269 69997 197719 118059
17817 118059 -164342 -51657 -243270 -123617 -42894 -205621 149497 -162289 -800 14718 345808
17806 345808 96019 -159134 2233 -172446 -227208 -84682 28126 -64582 10218 86016 3872
17794f7753f823l71125B45641b10802E0170K3532B1874F143K1346b41306A8684
17782D3141d32925a46232p075b2033j39623g0756A61598D6811P3845B6219a33849
17770C9813a4978j45912B22672E0219J5351k7599a665m253G3039i0205D01154
17758A73518B1484J23471P9149n2231J06485e0395A19533A0154c9675B87806j02058
17747A85748J93694G5443k9656b2126A00580c5273l6371p6749C89970A18422A690
17735I3723b53871m6113A10621b03513A94419B4922P6200d20509J34722C60162
17724B6756L11602A62787O4226a01734A26309E1660b51162A5815a29348C5398
17713b72337a08429A04562a02120G0944b62875A29749F0029c9565A94106J31470
$$ plain form
17794 -67753 -6823 -377948 245641 -210802 50170 73702 21874 6143 27489 -241306 18684
17782 43141 -432925 -146232 -153307 -22033 -161656 -70756 161598 46811 120656 26219 -133849
17770 39813 -14978 -160890 222672 50219 65570 37971 -1665 -5918 73039 -90205 401154
17758 173518 21484 144955 224104 171873 278358 -50395 119533 10154 -39675 287806 185748
17747 185748 379442 75443 45787 -22126 100580 -35273 -71644 -148393 389970 118422 1690
17735 93723 -253871 -299984 110621 -203513 194419 24922 101122 -420509 -285787 360162
17724 26756 338358 162787 227013 -101734 126309 51660 -251162 15815 -129348 35398
17713 -272337 -108429 104562 -102120 70944 -262875 129749 60029 -39565 194106 325576
17703C25576h2186A65617b58142h6993K9716D78655A82634g9522H3456a1217o510
17692a7727A28495C447d2374j49702A13520a483j44347B1001Q022J3639O5711
17681A08373N1949M5640a46495o1105C43587C6988K24837c3790q1031k99115C3648
17669a08077a4477A41298J23292j4415a98523D39318a16683j11072k0725j50273
17659c98753a89181B4946f2439C7670K4782P4789L5588d5485k2193j81225F956
17647A00418d7208O192k12597B89245G6314J22337J21057j20076I3487b82311
17636A66461m6415b36864A58367a31092A76764c67694e6923I102a55847H6234
17625A23458c50125a47403A77875b17613A1122J71687p4650B7285J72201B5483
$$ plain form
17703 325576 -82186 165617 -258142 -86993 -57277 478655 182634 -79522 83456 -11217 -17727
17692 -17727 128495 3447 -42374 -192076 113520 -1483 -145830 21001 29023 42662 108373
17681 108373 160322 205962 -146495 -207600 343587 36988 261825 -33790 -114821 -413936 33648
17669 -108077 -14477 141298 264590 250175 -198523 439318 -116683 -227755 -248480 -398753
17659 -398753 -189181 24946 -62439 37670 62452 137241 172829 -45485 -67678 -248903 6956
17647 100418 -47208 -41016 -253613 289245 76314 198651 319708 199632 93487 -282311
17636 166461 120046 -236864 158367 -131092 176764 -367694 -56923 9102 -155847 86234
17625 123458 -350125 -147403 177875 -217613 11122 182809 108159 27285 199486 25483
17614A74682b48618q947A02924d6479C20108G7366i4695A34088n0285b18430R9362
17603a19068b1811D53993A54609a42127A85039D6313K09427J05535i3025I6890
17592E2980K27343H9671G59K27261P2727A03867J43876j03788a12421C67839j70154
17581A97685e797j8809j53398A5735a16761B88105r6298h1000A69765r165b10294
17569i5990K3508l9213k8367r3271B44772J79033A83939b1639k45441c9259A62766
17557D95412A41267b91723b0602B57743E6169K88491A32083b74350A46317d5715
17546D0464R5291e2480k11264C21560o2441m328L23137A0784c78152F9180a95832
17534h0482R902A03505a5201E1800P7087h4912a7838D34910a5368A61281D931
$$ plain form
17614 174682 -248618 -257565 102924 -46479 320108 77366 -94695 134088 83803 -218430 -119068
17603 -119068 -21811 453993 154609 -142127 185039 46313 255740 361275 -93025 96890
17592 52980 280323 89671 759 228020 300747 103867 247743 143955 -112421 367839 197685
17581 197685 -5797 -24606 -178004 15735 -116761 288105 191807 -81000 169765 160600 -210294
17569 -95990 -72482 -111695 -140062 -233333 244772 423805 183939 -21639 -267080 -39259 162766
17557 495412 141267 -291723 -20602 257743 56169 344660 132083 -274350 146317 -45715
17546 40464 135755 -52480 -263744 321560 259119 254791 577928 10784 -378152 69180 -195832
17534 -80482 -70580 103505 -15201 51800 128887 -84912 -17838 434910 -15368 161281 4931
17522a13284c7645E4687h2675B22030A08523d1360r3635B7544J36096J1361b86204
17510B31363c5468A73793a22818B35234b37620B72751d7135A20994D5020n903
17500C9117h2623p9044B30577A09243L2798L75955j03327B458M07188a71150a7915
17488B76849q1265c8079E04264A60162c4316C36062G2728L4387J48765J72252
17478D28132d9292A68233K11892j52820N5856n3348K67178A78310K17822A26047
17467A49078C9869L43130D1601L51555b8618M569C32382c5028d02A89001N7555
17456B46556K4244j14308L737Q1303K83480j10358A8134J77601D5089M50295A41812
17444B19038g7079B39749p3463J1491j9658J3662R5033Q5932p5635o2121R0917
$$ plain form
17522 -113284 -37645 54687 -82675 222030 108523 -41360 -134995 27544 163640 175001 -286204
17510 231363 -35468 173793 -122818 235234 -237620 272751 -47135 120994 45020 39117
17500 39117 -82623 -161667 230577 109243 142041 517996 414669 2458 409646 -171150 -17915
17488 276849 195584 -38079 504264 160162 -34316 336062 72728 107115 255880 428132
17478 428132 -49292 168233 380125 227305 283161 229813 496991 178310 396132 126047
17467 149078 39869 382999 41601 393156 -28618 -24049 332382 -35028 -402 189001 246556
17456 246556 270800 156492 160229 241532 525012 414654 18134 195735 45089 495384 141812
17444 219038 -77079 239749 166286 177777 158119 171781 266814 352746 277111 214990 305907
17433C05907A8232L04094G5646N47986D1619R7767J12744l4860K24587J0931J9101
17422D71889r074r2260j60492e5905E7388O80880G5290M2512K92671j94248L0468
17411B46693C2440b57843A21999a5194n3724R252A42082E8865J3777L37801k01070
17400B09373h752D08652d4708C38125m192Q9701B04800r1762d5868B12267k9590
17389A82677L1783J49600C3469L09297a5214A74748E7272b24114C05179F2401
17378A61799J3854J33386G4074a68615A38451L66404A99634q9316a6288B68486
17367B277K55942g7090I4819K49232A42187Q5593C2789P2235N2615G8616J41502
17356B20118r1888Q9798q5547J32803r1939J32109C4678K6680Q0240K58946l7610
$$ plain form
17433 305907 18232 322326 75646 623632 41619 139386 252130 217270 441857 452788 471889
17422 471889 462815 370555 210063 -55905 57388 738268 75290 117802 410473 216225 246693
17411 246693 32440 -257843 121999 -15194 -68918 -59666 142082 58865 72642 410443 209373
17400 209373 -8752 408652 -44708 338125 333933 423634 204800 113038 -45868 212267 182677
17389 182677 214460 364060 33469 342766 -15214 174748 57272 -224114 305179 62401
17378 161799 175653 309039 74074 -168615 138451 504855 199634 110318 -16288 268486
17367 2277 258219 -77090 94819 344051 142187 227780 32789 105024 157639 78616 220118
17356 220118 128230 218028 132481 265284 173345 305454 34678 61358 141598 400544 362934
17345C62934A06796P4235B5431J56106i8602D49800k00619b82719B11011a07679
17334G916J02011O4477O4202A05248D6116h745F8473N5110M1832D8723N989J17544
17322A72256Q6025j17733j8134j4286a47770A35669K65930j11126d1814F0873
17311A4035M63447b88358A30625n6656A9380J56287J72552j02521F2005J21576
17301A83581n1395F2828q960J40855d0871F7111Q3507K06287E9354Q3820K30956
17290C74130o0251A54601j9238J11547K8826m7615F3567J24123J132L2835R8666
17279C20323h7113I595O8676K70081A58606J81895A12398a0376B23450D7916K09276
17268B57192I9040J82576l6709o1960f6068C50134h952B06752o5066J42813J4510
$$ plain form
17345 362934 106796 181031 25431 181537 -98602 449800 249181 -282719 211011 -107679
17334 7916 109927 174404 238606 105248 46116 -8745 68473 123583 165415 48723 54712 172256
17322 172256 258281 140548 122414 108128 -147770 135669 401599 290473 -41814 60873
17311 14035 477482 -288358 130625 73969 19380 175667 348219 245698 62005 183581
17301 183581 132186 62828 53868 194723 -40871 67111 150618 356905 59354 143174 374130
17290 374130 313879 154601 135363 246910 275736 228121 63567 187690 188822 221657 320323
17279 320323 -87113 9595 78271 348352 158606 340501 112398 -10376 223450 47916 257192
17268 257192 99040 281616 244907 182947 -66068 350134 -8952 206752 141686 284499 299009
17257B99009R5395j22557m903K0285J55771A34430G054L60717G3068R8143M34
17246A71645A9961R7130O3627p282f5582C80394F6846L34855M4012A52806j0376
17235A42430P3351I7916L54203k8251H3118C0586j3476L69711C0947K75005f906
17223A45637a2091C75014A74209l0019J46027K4282j16825m0906J97707o0814
17213B93661Q8578j78302I8943j8854A6463M32618p8563F4025J60254J83714m7473
17202C60520j57210J15589j50130m623L59806A19141b0515G0662R7441a00982
17191A28620K73928j55545K24477j62365H5908J77765A13861K15808A49331J01265
17181B50596j7344J11900k3068m320R1911j28993j6521K36960a7357C02066a13867
$$ plain form
17257 299009 394404 271847 266944 287229 443000 134430 7054 367771 73068 171211 171645
17246 171645 19961 117091 180718 173436 -65582 380394 66846 401701 445713 152806 142430
17235 142430 215781 97916 452119 423868 83118 30586 17110 386821 30947 305952 -6906
17223 145637 -12091 375014 174209 144190 290217 314499 197674 156768 354475 293661
17213 293661 382239 203937 98943 80089 16463 449081 370518 64025 224279 407993 360520
17202 360520 203310 318899 168769 164146 523952 119141 -20515 70662 168103 -100982
17191 128620 402548 247003 471480 309115 85908 263673 113861 329669 149331 250596
17181 250596 233252 345152 322084 317764 409675 280682 264161 501121 -17357 302066 -113867
17169B35752G5249l66P1397o4308J85578J07331K26746A66834M78716a38300C51289
17157I2446J49035l1418K1355L7369J3618j23834K04758A62559M0697J62721N8943
17146D24920R5170L143f4145B04272L09507r3575L4398l0597K42094J4603l10106
17135C70596O9440J12557j30659l4780N6943j6365l1065k7955M34506H1966K95390
17124C77356L1512J12311d4347D81670O369k1697k6819k7844o3009M168p532O7496
17112D12802A14316J28837p5739J73355n5799J2656P7123O8246j66927L50837
17102F26905j87619j50380M7905J25091Q0839k30528N4641K62002j9346k60715
17092C48795K02426B64002J234K76726j45244k2373L91202B41988l2013L42439
$$ plain form
17169 235752 75249 74883 146280 81972 267550 374881 601627 166834 645550 -138300 351289
17157 92446 241481 210063 231418 268787 282405 158571 363329 162559 203256 365977 424920
17146 424920 520090 523233 -64145 204272 513779 420204 454602 424005 666099 680702 370596
17135 370596 440036 552593 421934 387154 444097 427732 396667 368712 803218 81966 377356
17124 377356 408868 521179 -44347 481670 488039 466342 439523 411679 348670 352838 345306 412802
17112 412802 114316 243153 167414 340769 284970 297626 374749 442995 276068 626905
17102 626905 439286 288906 336811 461902 542741 312213 366854 628856 609510 348795
17092 348795 551221 264002 265236 541962 396718 374345 765547 241988 209975 552414
17082E52414n9308K0237j11309K62244l24471P6172M9512j34357K32469O9554
17072F33157l09930L87636B86833J29180Q2175K00809j58638k45520M24589o0231
17062F59197C10336M3007D4776N41933E7746N28179n5927k59205L11068J80806
17052G62667l40530R4343J3684L58288o5087C20311M43735l21315J33899j13509
17042D63121K83989l13163J02767J38761j93488j16370p327J30702p5968K07877
17032F20901J70850l66157K28904k34364J71381j25527J57374p0288J92698k32159
17022E13613K10765q653k88659K64189k77759O8175J91784M1117j96719K12397
17012G30250N2032j57788n4327M1728L3152L60453m53953J92513O0544R4553j57997
$$ plain form
17082 552414 493106 513343 402034 664278 339807 415979 465491 331134 563603 633157
17072 633157 323227 710863 286833 416013 498188 698997 540359 294839 719428 659197
17062 659197 310336 353343 44776 586709 57746 585925 529998 270793 581861 762667
17052 762667 422137 516480 530164 888452 823365 320311 764046 442731 576630 463121
17042 463121 747110 433947 536714 675475 481987 365617 358290 488992 413024 620901
17032 620901 791751 425594 654498 420134 591515 465988 623362 553074 745772 513613
17022 513613 724378 715725 427066 691255 413496 481671 673455 714572 517853 730250
17012 730250 782282 624494 570167 611895 645047 1005500 551547 744060 804604 899157 741160
17001G41160A40041O67144n5605L86872C10160N54857q9399J38006J85159k00245
16991H98538j79931N3774o4594j75404L65622M9399o0024j14424K02999j0391
16981I65564k18255J40746K9150j15813J86414m34434K37532O59438p21709j67759
16971E60874M68393j8939M3127l79914R1655j02905M51542k13962p3374K76094
16961A102591m88532N11446o7353K93968m33235J60922J40573k38326j05605L77393
16951A253842M1793K00504m92058j38511L49288m06590M13467l5690m1479k33426
16941I11140p4135M94072j51262j52195j25009M35541m08699J60963K0776K89855
16931A401047m59786O42748n5072o1450j94838J89858n70221N23781j27754j13844
$$ plain form
17001 741160 140041 807185 751580 1138452 310160 865017 775618 913624 1098783 898538
16991 898538 718607 772381 707787 532383 898005 947404 887380 772956 975955 965564
16981 965564 747309 888055 917205 801392 987806 553372 790904 1450342 728633 560874
16971 560874 1029267 1010328 1053455 673541 765196 662291 1113833 899871 826497 1102591
16961 1102591 614059 1125505 1058152 1352120 918885 1079807 1220380 982054 876449 1253842
16951 1253842 1295635 1496139 1004081 865570 1214858 808268 1221735 1186045 1144566 911140
16941 911140 837005 1331077 1179815 1027620 902611 1338152 929453 1090416 1111192 1401047
16931 1401047 941261 1584009 1528937 1467487 1272649 1462507 892286 1416067 1288313 1174469
16921A174469R0626J39221j70949J54941m0560M35697l30982K07890k51609J42914
16911A551658Q8183k65256J87167N4523Q1969k54994J75246Q513k22326P7302
16901A481985J63357l38987L24479J75104J57330k58989K33597J70884j78086
16892A930674L7459j06723j4770j22094J66567J53922j12580J39214K81656n0752
16882B302573k36856j64991L13502Q0886m3321j53962N6537M321R4702k09903
16872B043488M31275j37907j03914K16893L26370l52325J99324J63474J70228
16863B956906N5216j6443k26574j89496K94713K35579J86923l18032M6587k78303
16853B747076N09689Q2542j89885k38054N24792n7244j82248J65363j47482L25723
$$ plain form
16921 1174469 1265095 1404316 1233367 1388308 1347748 1783445 1452463 1660353 1408744 1551658
16911 1551658 1639841 1374585 1561752 1616275 1698244 1443250 1618496 1627009 1404683 1481985
16901 1481985 1645342 1306355 1630834 1805938 1963268 1704279 1937876 2108760 1930674
16892 1930674 1968133 1861410 1846640 1724546 1891113 2045035 1932455 2071669 2353325 2302573
16882 2302573 2065717 1900726 2214228 2295114 2251793 2097831 2154368 2158689 2253391 2043488
16872 2043488 2474763 2336856 2232942 2449835 2776205 2423880 2623204 2786678 2956906
16863 2956906 3012122 2995679 2769105 2579609 2874322 3109901 3296824 2978792 3025379 2747076
16853 2747076 3256765 3339307 3149422 2911368 3436160 3378916 3196668 3362031 3214549 3540272
16843C540272N2842j89127M68464k5460k33469J4628J4894J18585L01017M0084
16833D102730k09629L42571R4093P420R1017k7610p859J70219J03271J7904N72713
16822E256840l06791K85785N1737J16360n2117L86750K3881M50574r7691P0552
16812F185880k15860N98617m75418L73637R1157J66300J37151K94638J46768L09431
16802G612301Q9476L75282j3080K56120m7691K29219K51951j22562M39766N55986
16792I626768m7063N1413O15888J863J97470Q34001j86261L44377N37709J52023
16782A2128188O98384J87418J72487M34976L06109N43091N68258N70883K90663
16773A5900457M88650L25371Q09329O24206N34692Q28099N48652K25613J412358
$$ plain form
16843 3540272 3593114 3403987 3872451 3846991 3613522 3628150 3643044 3761629 4062646 4102730
16833 4102730 3893101 4235672 4329765 4337185 4428202 4400592 4392733 4562952 4666223 4684127 5256840
16822 5256840 4950049 5235834 5287571 5403931 5351814 5738564 5762445 6213019 6115328 6185880
16812 6185880 5970020 6568637 6093219 6466856 6558013 6724313 6861464 7156102 7302870 7612301
16802 7612301 7701777 8077059 8063979 8320099 8272408 8501627 8753578 8631016 9070782 9626768
16792 9626768 9579705 9631118 10247006 10248869 10446339 11280340 11094079 11438456 11976165 12128188
16782 12128188 12826572 13013990 13186477 13621453 13927562 14470653 15038911 15609794 15900457
16773 15900457 16389107 16714478 17523807 18148013 18682705 19510804 20059456 20285069 21697427
16764B1697427P30952J179265K84085J324318P85793J064050J040181Q56300J494081
16755C0456452J363743J574361J538654J318221J829460J895336J604457J995276
16747D3575960K280862K349845K343537K848594L000462L272167K814215L359467
16739F5845109L994418L830845M128799M568835M982289N578744M997494O043754
16731A03970287O096486O394387O978050O844771P633590P473502P305431P456032
16723A60152536P239778O600154O157186N695188M645906L511760K406879R87845
16715A97397232n3448j673364k803472l821644m975879n799816o395482p347272
16707A64526855p124002p713290p728733p456504p528785p420567o727346o685208
$$ plain form
16764 21697427 22428379 23607644 23891729 25216047 26001840 27065890 28106071 28962371 30456452
16755 30456452 31820195 33394556 34933210 36251431 38080891 39976227 41580684 43575960
16747 43575960 45856822 48206667 50550204 53398798 56399260 59671427 62485642 65845109
16739 65845109 69839527 73670372 77799171 82368006 87350295 92929039 97926533 103970287
16731 103970287 110066773 116461160 123439210 130283981 137917571 145391073 152696504 160152536
16723 160152536 167392314 173992468 180149654 185844842 190490748 194002508 196409387 197397232
16715 197397232 197343784 195670420 192866948 189045304 184069425 178269609 171874127 164526855
16707 164526855 157402853 149689563 141960830 134504326 126975541 119554974 112827628 106142420
16699A06142420o069814n762552n520024n116711n004482m658328m006259m140676
16691F5863574l621178l241258l338479k920973k907162k356508k499977k460727
16683D2517312j985544j866803j643431j866130j469429j848494j472809j066030
16675B9298642j418387r02260r82185j170790q23944j361693o20612p80319r01444
16666B0337008o58398r84680n45223o73985n28637p70400l01925q50101J6221
16657A5039880p39143m93409l71000p01915j68835j57638p77997K7400l85411
16648A1271932k11003m38094l56299K03331p31965r7602l54408k84407m64567
16639H536918K53302n09359J2331n37561k9780j42398l81263K2916j90358p5044
$$ plain form
16699 106142420 100072606 94310054 88790030 83673319 78668837 74010509 70004250 65863574
16691 65863574 62242396 59001138 55662659 52741686 49834524 47478016 44978039 42517312
16683 42517312 40531768 38664965 37021534 35155404 33685975 31837481 30364672 29298642
16675 29298642 27880255 26977995 25995810 24825020 24001076 22639383 22018771 21238452 20337008
16666 20337008 19678610 18693930 18148707 17474722 16946085 16175685 15873760 15023659 15039880
16657 15039880 14300737 13807328 13436328 12734413 12565578 12407940 11629943 11657343 11271932
16648 11271932 11060929 10622835 10266536 10469867 9737902 9640300 9285892 9001485 8536918
16639 8536918 8790220 8280861 8293192 7755631 7725851 7583453 7202190 7225106 7034748 6959704
16629F959704m18979K38595j75089l75479R1209n01332K99686K0929m72237k50221
16619E416786j21287R3409j17070l67114r1455J08131K7506l31971J39146L5343
16609D791424j82636j29912k73206k8930K64710R9490m87930k9712r6087k41976
16599C685235k8443p3286N8631p1329j97817J41726k96862J29979j8791q012J20774
16588C441805k46606j35766p3554k17878M01988m16200L15504k84245M1093k44464
16578B581677j13972n4230M65180m38512q2486j43524J65902J50732l05075m7424
16568B178268j97107N47637o15876N19896k26487l69475L48583j28527j30855
16559A926057K27483j47656l05081K78069j65698o8080K14486o1074j86106Q7630
$$ plain form
16629 6959704 6540725 6779320 6604231 6228752 6319961 5818629 6118315 6139244 5667007 5416786
16619 5416786 5295499 5388908 5271838 4904724 4813269 4921400 4948906 4616935 4756081 4791424
16609 4791424 4608788 4478876 4205670 4176740 4441450 4540940 4053010 4023298 3927211 3685235
16599 3685235 3656792 3583506 3642137 3570808 3372991 3514717 3217855 3347834 3329043 3321031 3441805
16588 3441805 3195199 3059433 2985879 2768001 3169989 2753789 3069293 2785048 2826141 2581677
16578 2581677 2467705 2413475 2878655 2440143 2357657 2214133 2380035 2530767 2225692 2178268
16568 2178268 1981161 2528798 1912922 2432818 2206331 1836856 2185439 2056912 1926057
16559 1926057 2153540 2005884 1700803 1978872 1813174 1745094 1959580 1898506 1712400 1800030
16549A800030k24544J05564j58640m2953K73404K00670n93651K40645j03466j16222
16539A380837J99881l4591n0390l4664J53697o4451l88817K59363k2506k24909
16529A173450J26188K19002j12141k38405K93424l17126J25376J42504q2419r5000
16519A234853J80709k50420j00685J04203o9759m2805J46356j78234k70966N06246
16509A259498m03985N82084l13622J00809J71431l75308j66714N0155J09275P6293
16499A089916L85659m30936J11823j79645k86160J63985L77419l89102K99628
16490A142587l54157r5279J48604L61827l38963M7369J26245k51321O8717O3484
16480I19113j29837k0171l05475L28075K22L9050P0247j70245J28358j01329J32219
$$ plain form
16549 1800030 1575486 1681050 1522410 1479457 1752861 1953531 1359880 1600525 1497059 1380837
16539 1380837 1580718 1546127 1495737 1461073 1614770 1550319 1161502 1420865 1398359 1173450
16529 1173450 1299638 1518640 1406499 1168094 1461518 1144392 1269768 1412272 1329853 1234853
16519 1234853 1415562 1165142 1064457 1168660 1098901 1056096 1202452 1024218 753252 1259498
16509 1259498 855513 1437597 1123975 1224784 1396215 1020907 854193 904348 1013623 1089916
16499 1089916 1475575 1044639 1156462 976817 690657 854642 1232061 842959 1142587
16490 1142587 788430 693151 841755 1203582 864619 911988 1038233 786912 855629 919113
16480 919113 789276 769105 463630 791705 791927 830977 901224 730979 859337 758008 890227
16469H90227N5888o1313C11237L00264m5621R7473P5283j516j62008L1260K10475
16458H16847j86732m8483j38279L86333k44575l3435M9886l7473k28920N17170
16448H52339C79305K11981j1873J95317k05842K60264n0994l76928J10853j04699
16438D07384K30134j10843N3994R3222m8008q6808j7065A64442L82070O478j57792
16427C95198L55761C31085L04852J22342j05503N1649C08184K96836A58550N52435
16417G10985l31736J8641j19127K58298J87504k15026j47588L27313o0174j58288
16407D70802p4539J74719r6806r2701j03587Q2495J70381m3511j84141L00289
16397F03401n7841j12391j20506j14486L25272j85905j12835K75742j66954J9540
$$ plain form
16469 890227 946115 884802 311237 611501 565880 663353 738636 737120 575112 606372 816847
16458 816847 630115 581632 443353 829686 585111 551676 601562 564089 335169 852339
16448 852339 379305 591286 579413 774730 568888 829152 778158 401230 512083 407384
16438 407384 637518 526675 580669 673891 625883 539075 522010 164442 546512 552990 395198
16427 395198 750959 331085 635937 758279 652776 704425 308184 605020 158550 710985
16417 710985 379249 397890 278763 537061 724565 509539 361951 689264 629090 470802
16407 470802 396263 570982 474176 381475 277888 360383 530764 487253 303112 603401
16397 603401 545560 433169 312663 198177 523449 337544 224709 500451 333497 353037
16387C53037N5413R5931L8061k51284N351K70890A40781M327N60797r1736k6754
16376E87415j28976r1737L68153A41514M25109B45573j20750J25511K74816B25228
16365D30819m4487j74191K71082j55669K86131k31723l2005j59786l3814J67892
16355C24249M87136j66005l12636n4389j9440O8098B6042K91898K54157b8998
16344B94437K3212l8298R0943p5031M5023B7659R7686M12821j14796A55467q660
16333A46807c0276E20039k50595j07485k9646j4692M4975J35481k4052K2233A35461
16321E40739a21869C05262A36765K54916J48732n8980A82023K65183k12393j5669
16311B19144R5356M458p8270f5446H01K42416I5357J6545I857L91873A05698K74194
$$ plain form
16387 353037 408450 504381 542442 291158 296509 567399 140781 145108 705905 614169 587415
16376 587415 458439 366702 734855 141514 566623 245573 124823 250334 525150 225228
16365 430819 386332 212141 483223 327554 613685 381962 349957 190171 156357 324249
16355 324249 811385 645380 332744 278355 258915 327013 26042 317940 572097 -28998
16344 294437 317649 279351 370294 295263 340286 27659 125345 538166 423370 155467 146807
16333 146807 -30276 520039 269444 161959 132313 117621 162596 298077 274025 296258 135461
16321 540739 -121869 305262 136765 391681 540413 481433 182023 447206 234813 219144
16311 219144 314500 318958 240688 -65446 801 243217 95357 111902 9857 401730 105698 379892
16299C79892p8991q6298b16179a120A33916h5692E99042B28818K25711j5085A31465
16287D6138K75459I0767K90030E8671h249A14906J26722F0356J24469a0427l8580
16276d9007D72785H9368b07695e0811A01358K6502N22046B14094e0117A08214
16265B98815A1471N1951J47463J63135g5658B18794l1855o4194Q8342J85234g2223
16253a100A02712J19042R5583j36979m708H3841J23583O5488G3274L45965A56875
16241B11816j0424L20087G0482L19675j93702R4289L7627A20627N8929R3717I5221
16229A55658L27137k14193A24923a1617C41836A17301L791H971J13622j4008D9796
16217E6155M45571h2066G4142R1698P8640J2754a22086C18864A06357L98890E2203
$$ plain form
16299 379892 300901 214603 -216179 -1120 133916 -85692 599042 228818 454529 439444 131465
16287 46138 321597 90767 380797 58671 -8249 114906 241628 60356 184825 -10427 -49007
16276 -49007 472785 89368 -207695 -50811 101358 127860 649906 214094 -50117 108214
16265 298815 11471 63422 210885 374020 -75658 218794 186939 122745 211087 396321 -72223
16253 -1100 102712 221754 317337 180358 175650 83841 207424 272912 73274 419239 156875
16241 211816 201392 521479 70482 390157 196455 290744 328371 120627 179556 273273 95221
16229 155658 482795 268602 124923 -11617 341836 117301 121092 8971 122593 108585 49796
16217 56155 501726 -82066 74142 165840 244480 257234 -122086 318864 106357 505247 52203
16205D46293H9502N3901a67528B44597a01885B61340J17371a6095B60853D1635
16194C1921J11443f1547j79286k6126D40430A6488a39153B7705c0443A00565N2213
16183A52778b3603A02776d7214D5962A232J92216g361j03038d6150A02925a35456
16171D104L01137A07479J3178R1613a16042D855b61149C94030e741D51373a04249
16159a22701k2838C09818b7822k38783a13373a4491j84093A259L03385d9126A16518
16147D8129K95917a91631A81405J39280j41509b24911i8828A08988K57356a00177
16136f9593A40618c251A3581J41317b02591C50654d1560J1629E2099b77934a31023
16124B3183c4439q4499c2260B43441f0548j8866A9900L7458d6094k568E1651J94046
$$ plain form
16205 446293 89502 143403 -167528 244597 -101885 261340 378711 -16095 260853 41635
16194 31921 143364 -61547 -240833 -266959 440430 16488 -139153 27705 -30443 100565 152778
16183 152778 -23603 102776 -47214 45962 1232 193448 -7361 -110399 -46150 102925 -135456
16171 4104 305241 107479 120657 212270 -116042 4855 -261149 394030 -5741 451373 -104249
16159 -122701 -145539 309818 -27822 -266605 -113373 -14491 -198584 1259 304644 -49126 116518
16147 48129 344046 -191631 181405 320685 179176 -224911 -98828 108988 366344 -100177
16136 -69593 140618 -3251 13581 154898 -202591 350654 -41560 -29931 52099 -277934 -131023
16124 23183 -34439 -118938 -32260 243441 -60548 -79414 19900 57358 -46094 -48662 51651 245697
16112B45697G3263K8143i9958l0284B8033b1218r7738a8163A87142A6489a0982
16100c5834E716O4658a38060p3720B14548h978q5983C24329A12960b858m05937
16089d08795a22992C548P9311J02922E1922f8884A02628h0002J7165B4462a65819
16077C5240J11818O1295G691e2933D37022a13548j6679H0942o14M7618c35653
16065b39173b053r9877B04228a96559B59047i3049K8901A9156K3499J74133k2670
16054A94118a26354d2482j94083I1488g4875o4167c0490A63968a20739A6144J64978
16043A81122P8017d00713B7629b53666B13178F8165j2607B1591a05560A58192
16032a63878L4233O0951j97879P2534k6688A06507c90937J88186L6665C48436
$$ plain form
16112 245697 73263 101406 -99958 -130242 28033 -21218 -118956 -18163 187142 16489 -10982
16100 -35834 5716 70374 -138060 -211780 214548 -8978 -94961 324329 112960 -2858 -408795
16089 -408795 -122992 3548 82859 185781 51922 -68884 102628 -80002 -62837 24462 -165819
16077 35240 147058 208353 7691 -52933 437022 -113548 -130227 80942 80328 127946 -335653
16065 -239173 -2053 -101930 204228 -196559 259047 -93049 -64148 19156 42655 216788 194118
16054 194118 -126354 -42482 -236565 91488 -74875 -139042 -30490 163968 -120739 16144 181122
16043 181122 259139 -400713 27629 -253666 213178 68165 55558 21591 -105560 158192
16032 -163878 -129645 -68694 -266573 -194039 -220727 106507 -390937 -202751 -166086 348436
16021A40778O5700b43931B21103F277M67672j459A19790c5964a3336k64229i1711
16009A21000i2531C42862A27135g5845j2196m4336A42210E8899K907b88j00764
15998a01052j8842C4902g6834D6069b6986E5444a52739H6213g7585l0490A22445
15986C99144d68804e2780B07975b0135A51050J40083l3580q3659J36348J07345
15976D17587b24075a8263j0648A33669e2784A26811Q4006o0659f6295K5240A97776
15964g4405B20305n3703E3697J82238b4542j364q9141D5472K3365M2565a74695
15952a08775k2546k8597o3217A84787g5501H7020M5493a96550j28570G2484Q8682
15941A61166b16250R3355k729o8637Q3568A88704D3516a21068e8832I0193i7064
$$ plain form
16021 140778 206478 -243931 221103 6277 473949 472490 119790 -35964 -13336 -277565 -91711
16009 121000 -92531 342862 127135 -75845 -88041 -132377 142210 58899 61806 -288 -101052
15998 -101052 -119894 34902 -76834 46069 -26986 55444 -152739 86213 -77585 -108075 122445
15986 399144 -468804 -52780 207975 -20135 151050 291133 257553 173894 310242 417587
15976 417587 -224075 -18263 -28911 133669 -52784 126811 210817 150158 -66295 -41055 197776
15964 -74405 220305 166602 53697 235935 -24542 -25906 -115047 45472 68837 111402 -174695
15952 -108775 -131321 -159918 -223135 184787 -75501 87020 132513 -196550 -325120 72484 161166
15941 161166 -216250 -122895 -125624 -194261 -110693 188704 43516 -121068 -58832 90193 -97064
15929h2668j48331F7894a74481a1448k41705A08589K35340b13952H2882d7631
15918F2687e7340A12687h1771H2816a02514E9418M9040N163d4972j49759A62892
15906b21133J4024k4434j1518k00805a00297H4674A1886d7057B80190a4389o1580
15895g5969q1063e3002a4364A2690d19035J09963B85022I4302L1270A904f5320
15883B24897b43777f7636j1929a4247k75627c5706j31384A96395j5162a51098
15872b98460J0309l5420i1182B97738A34420o0177B4427a02120B41730a28501
15861e5307A99785b29128F5084a36962O7228E4865M09604b74715a6012k12867
15851b28879c1272B65337F1717R8333J76068b45946f1102C2362a7855l49651i4001
$$ plain form
15929 -82668 -230999 67894 -174481 -11448 -253153 108589 343929 -213952 82882 -47631
15918 62687 -57340 112687 -81771 82816 -102514 59418 108458 113621 -44972 -194731 162892
15906 -221133 -207109 -231543 -243061 -443866 -100297 84674 11886 -47057 280190 -14389 -75969
15895 -75969 -157032 -53002 -14364 12690 -419035 -309072 285022 94302 125572 1904 -65320
15883 224897 -243777 -67636 -79565 -14247 -289874 -35706 -167090 196395 181233 -151098
15872 -298460 -288151 -323571 -91182 297738 134420 74243 24427 -102120 241730 -128501
15861 -55307 199785 -229128 65084 -136962 -69734 54865 464469 -274715 -16012 -228879
15851 -228879 -31272 265337 61717 160050 336118 -245946 -61102 32362 -17855 -367506 -94001
15839h7236C9755O1266a02865a638B64987H8319b8399l06602P3450e8258j52808
15828b11066k31153d6521C6941a65512b576j98779d8233A14528m2661N8086b31451
15816d5419j22071L571A26194a10867J6351k55975G9005e3490j21140A94527L0851
15805B25378b83403k9419b2670r7850H4438a48499A58306a77649A43860j2683
15795A31177a2984p490l16981a40967b1824a656A54273a37100I5781a67742A79988
15783c71889g0190j65605N195A0216b61235B02753e4769r3949B2510p629a57551
15771A79179a51230A0245J94457b48635p7519L3466N9441C194J80180G390L42744
15760C50134j27626a70621A09501c35773a50810H2995b50684g7524A92402b7302
$$ plain form
15839 -87236 39755 101021 -102865 -1638 264987 88319 -28399 -335001 -261551 -58258 -211066
15828 -211066 -442219 -46521 36941 -165512 -2576 -201355 -48233 114528 71867 129953 -231451
15816 -45419 -167490 -163919 126194 -110867 -94516 -350491 79005 -53490 -174630 194527 225378
15805 225378 -283403 -312822 -22670 -120520 84438 -148499 158306 -177649 143860 131177
15795 131177 -12984 -20474 -337455 -140967 -21824 -1656 154273 -137100 95781 -167742 179988
15783 -371889 -70190 -235795 -230600 10216 -261235 202753 -54769 -148718 22510 14881 -157551
15771 179179 -151230 10245 204702 -248635 -326154 -292688 -233247 3194 183374 7390 350134
15760 350134 222508 -170621 109501 -335773 -150810 82995 -250684 -77524 192402 -27302
15749a86274A61247l3973b57889Q2106r6564E3557a5248q3808m58960K43320n6885
15738c71581D18622E109A080a57762A53538k0267f6633L0187i914q3865A22610
15726E659a90014R4116D3922a26539A45897J43330i9101K1490A72320f9719B00914
15714I7151b3471j7105F1168R3803K19861D7940g6264F0352a96580c4084l66216
15703d00300a52416P0265L9527j04294D2326a88785h9452B33473n7767R5584j10697
15692A60593a87598l1470E937M0289O4142a75618j4509O7213k1011A5614a57194
15680A15832H166O2788O508f586j03792j70697f1670A9404K7038d095F2002b32135
15667A6887L1108b89600D0963K21977j27831c7372C2087a8387p2140I7180a08278
$$ plain form
15749 -186274 161247 127274 -257889 -175783 -272347 53557 -15248 -99056 -558016 -314696 -371581
15738 -371581 418622 5109 1080 -157762 153538 133271 -66633 -36446 -9914 -93779 122610
15726 5659 -190014 -95898 43922 -126539 145897 289227 -99101 -77611 172320 -69719 200914
15714 97151 -23471 -40576 61168 154971 374832 47940 -76264 60352 -196580 -34084 -400300
15703 -400300 -152416 -82151 -42624 -146918 42326 -188785 -89452 233473 175706 271290 160593
15692 160593 -187598 -219068 5937 46226 110368 -175618 -190127 -122914 -143925 15614 -157194
15680 115832 8166 70954 77462 -6586 -110378 -281075 -61670 19404 46442 -4095 62002 -232135
15667 16887 47995 -289600 40963 262940 135109 -37372 32087 -18387 -90527 97180 -108278
15655D8397f5822C52782j23125B0289a63365L316j21631A63303c4658F0488b063
15643b96109a45477A56453H544K9655h4504J4631n3409A65466a94208g9822B9334
15631d6343C18134e55C2901b30211A3290Q6190c69921E1844a07823b7507k11129
15620b38636I9367J69089J14577g8076k22211h1407L8380j40475D8833a11948
15609a37530G7323J02105L320La51737k32715J47433l623A76116A6236J3495Q7601
15597A17332d15672C9021R3057a16882M4733D69399b80567A51303D9235K9316
15587G8551g5127A08999b1444j49074H0788K12037g2230B2398P0875e7376A18032
15575c82923h8036C4068b50250I849Q9799K14358c74155f8167m3746L4700L0986
$$ plain form
15655 48397 -65822 352782 229657 20289 -163365 -160049 -281680 163303 -34658 60488 -2063
15643 -296109 -145477 156453 8544 38199 -84504 -69873 -123282 165466 -194208 -79822 29334
15631 -46343 318134 -555 32901 -230211 13290 99480 -369921 51844 -107823 -27507 -238636
15620 -238636 99367 268456 383033 -78076 -300287 -81407 -43027 -183502 48833 -111948
15609 -137530 77323 179428 182748 182751 -151737 -384452 -237019 -240642 176116 16236 29731 117332
15597 117332 -415672 39021 132078 -116882 -72149 469399 -280567 151303 49235 78551
15587 78551 -75127 108999 -21444 -170518 80788 292825 -72230 22398 93273 -57376 118032
15575 -382923 -88036 34068 -250250 9849 99648 314006 -374155 -68167 -111913 -77213 -46227
15564d6227j00094E5497a20935D3347P3669B1451a9498A82376e02796a18102E0530
15552c900j87186A31293P3640a87478A37194m5311a61333F2890h7606o7671G8614
15540B05541L6041a01898A12922J4010g4297K1664K4177o8763A98501b8172B2816
15528c70273A71294J44028j35925a7280n3426B3713J03984N8968j6981G7985K5224
15517A03209l2428N8687j1325m1242e350C2785e3212I3155D2953J43658a93163
15505A22372a18229K8841A51045J57610f8425j02459B59673f1981A3030a09737
15494A17094L93264A88481K71a21386A00300i6559A31078a67949A67551n4726
15484A12825a15832C76355a25837f0058k6227j94359d8795C75227p2838j17638
$$ plain form
15564 -46227 -146321 55497 -120935 43347 117016 21451 -19498 182376 -502796 -118102 50530
15552 -3900 -191086 131293 204933 -187478 137194 91883 -161333 62890 -87606 -155277 78614
15540 205541 241582 -101898 112922 126932 -74297 -52633 -28456 -97219 198501 -28172 22816
15528 -370273 171294 315322 179397 -17280 -70706 23713 127697 186665 169684 77985 103209
15517 103209 70781 129468 118143 76901 -5350 32785 -53212 93155 42953 186611 -193163
15505 122372 -118229 -89388 151045 308655 -68425 -170884 259673 -61981 13030 -109737
15494 117094 510358 188481 188752 -121386 100300 -96559 131078 -167949 167551 112825
15484 112825 -115832 376355 -125837 -60058 -86285 -280644 -48795 375227 302389 184751
15474A84751B1326J48224N5208f2399l0130E6184A2325K45491a36776f6526N699
15463f0827l4845j68969d2811A54068F3148a19368D0613g2639j3056A84088A06
15451c21633B02880F8386a14209l0748E57099a20205E7483K4421P5850a72564
15440I931a06615n3029M1654A33325a18919j16945B05028d8335A54789k6753b94042
15428f8337j17406A3455a07260A2557K27898H8889a0799l03002N0378a29289d5053
15416A03262d3158a7176j88960B22779K37160d0320l9342A24312l0622f7760L3565
15405c4195G2481j0762a32478d5923A8345Q8953a79647I8901a59961E4884J69228
15394B24112K0558c22472A03656R5812a37518O3052k03734A35236E6687b1946
$$ plain form
15474 184751 21326 169550 224758 -62399 -92529 56184 12325 257816 -136776 -66526 -60827
15463 -60827 -95672 -264641 -42811 154068 63148 -119368 40613 -72639 -85695 184088 106
15451 -321633 202880 68386 -114209 -144957 557099 -120205 57483 81904 157754 -172564
15440 9931 -106615 -159644 -117990 133325 -118919 -235864 205028 -48335 154789 128036 -294042
15428 -68337 -185743 13455 -107260 12557 240455 88889 -10799 -313801 -263423 -129289 -45053
15416 103262 -43158 -17176 -206136 222779 459939 -40320 -79662 124312 93690 -67760 -34195
15405 -34195 72481 61719 -132478 -45923 18345 107298 -179647 98901 -159961 54884 224112
15394 224112 244670 -322472 103656 199468 -137518 -74466 -278200 135236 56687 -21946
15383a96089A15723b12564d502j02375A64310J23621c1522A63305b78738d7770
15372A17747h7283A47459Q0876a89624F3784h0266A40744c6511B04842L5507r8976
15361A41373b39072E0222e2385j33676b148j35082p576C47883i8370J3098m07515
15350d92787a29257a3278A92538J06317O5440E2185b88083A1746K9600R976a48358
15338C49624H9766a50077A04530A4537f4936B85494j32127b571F3752a299a60
15326A17494J05260O2082A42037D4070a1200A45955a74760C89163j75947l6793
15316A76423h658l32829H8625C0497R702D380g2071F7708a95562G4335P0593k7353
15304A17575Q4655G7618f3667A79215a370D5480J66599D5194j7479g3911D0584
$$ plain form
15383 -196089 115723 -212564 -4502 -106877 164310 287931 -31522 163305 -278738 -47770
15372 117747 -87283 147459 228335 -189624 63784 -80266 140744 -36511 204842 240349 141373
15361 141373 -239072 50222 -52385 -186061 -2148 -137230 -144806 347883 -98370 -85272 -492787
15350 -492787 -129257 -13278 192538 298855 364295 52185 -288083 11746 41346 51322 -148358
15338 349624 89766 -150077 104530 14537 -64936 285494 153367 -2571 63752 -1299 -160
15326 117494 222754 284836 142037 44070 -11200 145955 -174760 389163 213216 176423
15316 176423 -8658 -341487 88625 30497 40199 4380 -72071 67708 -195562 74335 144928 117575
15304 117575 202230 77618 -63667 179215 -1370 45480 212079 45194 27715 -73911 40584
15292A61403k5202a37116F3096c0814D57020k02548p7035F3878a39341I1814M81253
15281E73067B51446r0423m840n7462a1593l2296C851b39216B19544J07936A15616
15269B11230m81c28596G2234J7083b08354E33445a82496N3470r8459f9127A10508
15257B91951O2268A00472J01063J0881J99461j85196P1479e2582G2856L32087
15247D04943O08269J529965o80386M47464l092H26139l68163l866a06320A44504
15236C31970j55701a43406D3461J9626b09925M8030j64199A86783H1580K24459
15226C06039k9728b13279E3428B6257b1999A8482M43444d8776C41619c9278A018
15214B01195J72155b42760a11368a5503B97710E5933J10345b15894H8502k7628
$$ plain form
15292 161403 136201 -137116 63096 -30814 457020 254472 177437 63878 -139341 91814 573067
15281 573067 251446 161023 156183 98721 -11593 -43889 3851 -239216 219544 327480 115616
15269 211230 210749 -328596 72234 89317 -208354 533445 -182496 -129026 -227485 -69127 110508
15257 291951 354219 100472 201535 212416 411877 226681 298160 -52582 72856 404943
15247 404943 1013212 2543177 1862791 2310255 2307163 826139 457976 454110 -106320 144504
15236 331970 176269 -143406 43461 63087 -209925 -161895 -326094 186783 81580 306039
15226 306039 276311 -213279 53428 26257 -21999 18482 461926 -48776 341619 -39278 1018
15214 201195 373350 -242760 -111368 -15503 297710 55933 166278 -215894 88502 60874
15204F0874J30930B7547K2952J80873J13173A55133f5240o6245A09817m3459N9425
15193A25783J9000o0949M8750j4841J23030r8614b2854j28634B01000k7142E1712
15181A17320L8031N0704K5441h7231G9467J5067J0690H403M2647Q1308c39505
15169b14067B14353M0983n3555d3431A59036A8058K15512a43360A72236J89266
15159C61502g0946B08745F7541J55990b1466E7791a0412E7397L00831r9889A19258
15147A24825O9659E0222b64672C38658A57922B0999L51671A20969a04111A64437
15136G2439b11922B06562f0012C9263a64836A41754d45q5937B29901c8113a8559
15124B00665g3016A42755D9734L90512A56313F4926L02057A14210K02540b5478
$$ plain form
15204 60874 191804 27547 50499 231372 344545 155133 -65240 -131485 109817 66358 125783
15193 125783 144783 83834 132584 117743 240773 142159 -22854 -151488 201000 173858 51712
15181 117320 155351 206055 231496 -87231 79467 94534 105224 8403 51050 132358 -339505
15169 -214067 214353 255336 201781 -43431 159036 18058 233570 -143360 172236 361502
15159 361502 -70946 208745 67541 223531 -21466 57791 -10412 57397 358228 258339 119258
15147 124825 194484 50222 -264672 338658 157922 20999 372670 120969 -104111 164437
15136 72439 -211922 206562 -60012 39263 -164836 141754 -445 -86382 229901 -38113 -18559
15124 200665 -73016 142755 49734 440246 156313 64926 366983 114210 316750 -25478
15113B65211A28699K18296j62607M6644J28925a69893A34935e7289A40040L17673
15103D57713D1640b19492G7104h2619M0460l4965C68549j32068K66698k17760
15093B85419q7983K81868f3473L1396B54198G1796k9566J86723q6543Q71a27652
15081A43791J38298E3837J30410n9700R8606J52868A22328i9914B23251a07025
15070A52396d8831k32833a8741A31013j959K76911C0859R5571Q8057N3481Q1756
15059C49724N84A19907c6493n9079C64552k1626o5362o6176J53961A31905J27170
15048B59075n6401p6300J86169K77531j71595A37517E9642K62712B8370M8782
15038G7152J10876n5312b56480B74487A36535M3777J6982K8979I3862J05849M7265
$$ plain form
15113 265211 128699 346995 184388 231032 359957 -169893 134935 -57289 140040 457713
15103 457713 41640 -219492 77104 -82619 -42159 -77124 368549 236481 503179 285419
15093 285419 197436 479304 -63473 -32077 254198 71796 42230 228953 142410 143281 -127652
15081 143791 282089 53837 184247 124547 223153 376021 122328 -99914 223251 -107025
15070 152396 -48831 -281664 -18741 131013 129054 405965 30859 126430 214487 267968 349724
15059 349724 350308 119907 -36493 -95572 364552 342926 277564 211388 365349 131905 259075
15048 259075 202674 126374 312543 590074 418479 137517 59642 322354 28370 77152
15038 77152 188028 132716 -256480 274487 136535 180312 197294 226273 93862 199711 246976
15027B46976F8224K49118R530a03014l23605B10936L17649k48060P960j39478
15017A49007a43544b7952E17610I4069Q8735K4270l9557N556B5304M69747j45552
15006C49499K17515k68736F6575O4952J72771J69926I5539J2660J74316c0963
14995A07384J07895r5686J55215l2171K14399J30137J0229B17407p4767L21185
14985D63825A17690K74032p7291O4391I0526M78636k25282J28609m8246l0779
14975C93464j08550R456A10020K40502J16509a26753D73381j80425J43600j62199
14965B74357K6600A14952J97904G5373e6432B51271J76528A54929J11840K8717
14955B95486j5637k1372A5769O01396K1137B85709j02964L7426J67548E0991L82076
$$ plain form
15027 246976 68224 317342 326872 -103014 -426619 210936 528585 280525 288485 149007
15017 149007 -143544 -27952 517610 94069 182804 207074 167517 173073 25304 495051 349499
15006 349499 567014 298278 66575 131527 304298 474224 95539 108199 282515 -30963
14995 107384 215279 119593 274808 242637 457036 587173 597402 217407 142640 463825
14985 463825 117690 391722 314431 378822 90526 569162 343880 472489 424243 393464
14975 393464 284914 294370 110020 350522 467031 -126753 473381 292956 436556 274357
14965 274357 300957 114952 312856 75373 -56432 251271 427799 154929 266769 295486
14955 295486 279849 258477 15769 617165 638302 285709 182745 220171 387719 50991 433067
14944D33067A13549O6970J38757K16374A10725j4705F665J37857E8156J71933
14934B30089F7628K84051I8459K75315P2924p4785b5049A62971K32727A80215
14923C47500M6698j63715P9913o9162k0770K31972j56394j0889A14955J1707J59599
14912B86261q5079E7014M47370K3824k09232L25909k42066j60715j2301m8386
14902A81417K18890J60689B78185M005R8445q6130J84936A81689J59767K22162
14892E63618k76826n1398I9747K81575J94782j78738j43693R4715j36826J33416
14882C44978J7042k31I8115K45998L01519o4471P6938I9290O23888k90620j92358
14871B40200J23601J65732k55223J12724K01035k59599J07075P2975j82632K12308
$$ plain form
14944 433067 113549 180519 319276 535650 110725 96020 6665 144522 58156 230089
14934 230089 67628 351679 98459 373774 446698 371913 -25049 162971 395698 180215
14923 347500 394198 230483 310396 241234 220464 452436 296042 285153 114955 126662 286261
14912 286261 201182 57014 504384 528208 318976 644885 402819 242104 229803 181417
14902 181417 400307 560996 278185 282190 380635 294505 479441 181689 341456 563618
14892 563618 286792 235394 99747 381322 576104 397366 253673 348388 211562 344978
14882 344978 362020 361789 98115 344113 645632 581161 658099 99290 723178 432558 240200
14871 240200 363801 529533 274310 387034 588069 328470 435545 508520 325888 538196
14861E38196k53576K43431M84953D55455J49021K85931B70773L15638j72838l7538
14851C76035j14072N406K290q0021K83208j97855K74098J61057c0390C56097J11748
14840D67845k02786m1717A03385L12465L94272k07852J0377j35821j37911o1194
14830B77721J53001M9380M20963l49155m6858j01253L1438J37248J43036j60948
14820E54573J10047A63532J78800M73499B20958L28667j21440K27823j32645k11289
14810C12074K16235o0197J93647J9058K9118r8777k48455M39120j74787B98400
14799C88249J12546R7633m3230j32031O6660K40172l63957K45332L1393q1709
14789E61058L6661p6537J46659j72475M77628m17504O0188j83350L49277j95573
$$ plain form
14861 538196 284620 528051 1013004 455455 604476 890407 270773 586411 413573 376035
14851 376035 261963 267369 269659 189638 472846 274991 549089 710146 -30390 356097 467845
14840 467845 265059 223342 103385 415850 810122 602270 612647 476826 338915 277721
14830 277721 430722 480102 901065 551910 505052 403799 435237 572485 715521 554573
14820 554573 664620 163532 342332 815831 220958 549625 428185 656008 523363 312074
14810 312074 528309 468112 661759 680817 709935 611158 362703 801823 627036 298400
14799 388249 500795 598428 555198 423167 489827 729999 366042 611374 642767 561058
14789 561058 597719 521182 667841 495366 972994 555490 615678 432328 781605 586032
14779E86032K02172l12542j13275N00038j86349l36846K63187L2228K06773k58819
14769E82599J8494J03991j80741P2121J84695q2439J1128j99228K70710k51893
14759E29437k13894J44353j27503O14405k57547Q5728B59851N65511n040q2612
14749G37710p9809L62311k63618l77573L22251j30098j45620O83516l87943J44134
14739H65261L1670M1723Q5735j37627j59488L0060j65810K89997j85188J24711
14729H21044p5377K78386J70478D29056M37427j97291j6790J42070R8125o4152
14719H28445R26l64582M33112j7571R3861k00002L30000n29583L86369R9521k70354
14708G90142j13775J61925O5022m16782N00792l16304J8557O2447M1061K21679
$$ plain form
14779 586032 788204 475662 362387 862425 676076 339230 602417 634645 841418 582599
14769 582599 601093 705084 524343 596464 781159 698720 709848 510620 781330 529437
14759 529437 315543 459896 332393 946798 689251 774979 259851 825362 820322 737710
14749 737710 657901 1020212 756594 379021 701272 571174 425554 1109070 721127 865261
14739 865261 896931 938654 1024389 886762 727274 757334 591524 881521 696333 821044
14729 821044 745667 1024053 1194531 429056 866483 669192 652402 794472 892597 828445
14719 828445 829371 464789 897901 880330 974191 774189 1104189 574606 960975 1060496 790142
14708 790142 676367 838292 903314 486532 987324 671020 689577 752024 793085 1014764
14698A014764j10935p8994k11219N13251l65036L24539j8892k4684j35312L6064
14688I43546j14284p740J28492M0486m4566n6809j24290J77389J45219j02154
14678I85289K37532m53000L67970l2116m67733O56523q7405N7752N4265n6697
14668A262380q9016j90404J63171K15247j97691J94988o4754j16764P9412j74107
14658A082462K59157l09493L9452Q2959O4870o5444j3321J54276J29306k21635
14648A202589L89445j86486l47716K60056k60133J10341J10901R6125l15021O0314
14638A120415J37937M38891k65588j07041p0405L03074k61920J18329J23182m3604
14628A493270K14525m24239R8170K18008p8651k63372J98934n4665N682K31836
$$ plain form
14698 1014764 903829 824835 613616 1126867 761831 1086370 1067478 1042794 907482 943546
14688 943546 829262 821522 950014 990500 945934 889125 764835 942224 1087443 985289
14678 985289 1222821 769821 1137791 1105675 637942 1294465 1207060 1264812 1319077 1262380
14668 1262380 1173364 982960 1146131 1361378 1163687 1358675 1293921 1177157 1256569 1082462
14658 1082462 1341619 1032126 1071578 1154537 1219407 1153963 1140642 1294918 1424224 1202589
14648 1202589 1592034 1405548 1057832 1317888 1057755 1168096 1278997 1375122 1060101 1120415
14638 1120415 1258352 1697243 1431655 1324614 1254209 1557283 1295363 1413692 1536874 1493270
14628 1493270 1707795 1283556 1381726 1599734 1521083 1257711 1456645 1401980 1407662 1639498
14618A639498j51483K2800k05059L95605k19604K10437j61376J44867n569J69764
14608A839880J21839l94535J08740j04263j01043N0752K03481K12870k22332n9457
14598A655932l96K55078k51088K4480K56428j05525p2075M3842L09365k81274
14588A834767P9242J65268J50788n23959L12271L8463j56887K03993k65645K39774
14578B078075o1903J67053j34803L72735p1983l86480L27555K16168k84308R9486
14568B321595j31758J28787M77395l37055l43053L89477j04030L18306K30363
14559B950027j09705J54025M2431O9246N26779L19217l83169R06590N75526P63777
14549E814744J863618L635526J0010620J7139956O586850B0839945j0016827j139650
$$ plain form
14618 1639498 1488015 1510815 1305756 1701361 1481757 1692194 1530818 1675685 1670116 1839880
14608 1839880 1961719 1567184 1675924 1571661 1470618 1521370 1724851 1937721 1715389 1655932
14598 1655932 1655536 1910614 1659526 1684006 1940434 1834909 1762834 1806676 2116041 1834767
14588 1834767 1914009 2079277 2230065 1706106 2018377 2056840 1899953 2103946 1838301 2078075
14578 2078075 2016172 2183225 2048422 2421157 2349174 1962694 2290249 2506417 2222109 2321595
14568 2321595 2189837 2318624 2796019 2458964 2115911 2505388 2401358 2719664 2950027
14559 2950027 2840322 2994347 3036778 3106024 3632803 3952020 3568851 4475441 5050967 5814744
14549 5814744 7678362 11313888 21324508 38464464 45051314 20839945 10823118 9683468
14541I683468l058844l071396j074656l01352k9292j253K18789j24847M9952J18885
14531B409454j94376M43530j15997k37406M51743k03556K06790m70102r0496K65713
14521B465297R4847q9334L26551k32273J49221j6652J25043j01265r566j29401
14511B582468L99738k68097J96412M7652J44633O874j50629K74002o9733j19338
14501C043982j8088L99319k70063l1269j31387L56851K86780l61379M70509k06794
14491C538461p807K94376j63660J0702J8248j69738K22050L66342l79675K31679
14481C960978k1784K90424q130m65473M91241k6782O6136Q3851k30198N68565
14471D708828l22639k12362J15595N09917J378o2150Q1862k84669L87580m17880
$$ plain form
14541 9683468 6624624 3553228 2478572 2177220 2147928 2146675 2365464 2240617 2290569 2409454
14531 2409454 2215078 2658608 2542611 2305205 2756948 2553392 2760182 2290080 2199584 2465297
14521 2465297 2560144 2470810 2797361 2565088 2714309 2697657 2822700 2721435 2711869 2582468
14511 2582468 2982206 2714109 2910521 2958173 3102806 3109680 2959051 3233053 3163320 3043982
14501 3043982 3025894 3425213 3155150 3123881 2992494 3349345 3636125 3274746 3745255 3538461
14491 3538461 3530654 3825030 3661370 3672072 3690320 3520582 3742632 4108974 3729299 3960978
14481 3960978 3939194 4229618 4221488 3756015 4247256 4220474 4286610 4370461 4140263 4708828
14471 4708828 4386189 4173827 4289422 4799339 4800717 4738567 4820429 4535760 4923340 4505460
14461D505460L54225K79356L47386j29023m0881k66062L44293k05270j20842L15243
14451E383885J45538K9373K42410J3895Q0771J32090k76696L72221m5731J69623
14441F247379J5190L3188j51054K68979j00006K60377n1179J28802L96899R1148
14431G139723k51047N1001K31743j65269N02804J04389j8008J10206J44734J13735
14421G964011J62022K5378J96017j2719L00719l8160O37805l36471p6441O09675
14411I431836m83977O62835l20821K23473L03277k68638M97358j13994K45584
14402A0176933o946P26527k6573l37957N29327N1116L20315L42268j68583N37530
14392A2143957J52722J55741R6867L34497L29745P0935K90357L47824j92041L00747
$$ plain form
14461 4505460 4859685 5139041 5486427 5357404 5316523 5050461 5394754 5189484 5068642 5383885
14451 5383885 5529423 5558796 5801206 5815101 5895872 6027962 5751266 6123487 6077756 6247379
14441 6247379 6262569 6295757 6144703 6413682 6313676 6574053 6522874 6651676 7048575 7139723
14431 7139723 6888676 6939677 7171420 7006151 7508955 7613344 7595336 7705542 7850276 7964011
14421 7964011 8126033 8151411 8347428 8334709 8635428 8597268 9235073 8898602 8822161 9431836
14411 9431836 8947859 9610694 9289873 9513346 9816623 9547985 10045343 9931349 10176933
14402 10176933 10169987 10896514 10869941 10531984 11061311 11112427 11432742 11775010 11606427 12143957
14392 12143957 12296679 12452420 12549287 12883784 13213529 13284464 13574821 13922645 13730604 14031351
14382A4031351M37363L92027R1370L97614M77345J41610j12247M29848M69241
14373A6755522O31561J95627N08775Q9633N02242N62809K07255L64768M12806
14364B0230998M98347J91705J052627J53492R8704M41906N95361N09182O38324
14355B4410646O52537O38546P43974M83547O83656M24231J005435O41162M20615
14346C0104349O56282J378293O31326P75469N07079J450478Q52221J089876Q86001
14337C8331374J253245Q47825J282435J626292O72690J283802J635337J676230
14329D8609230J432736J641266J607991J508308J884950J679553K716764J521736
14321F2602534K178608K420513K156146K413592K704438K819157K886015L078481
$$ plain form
14382 14031351 14468714 14860741 14952111 15349725 15827070 15968680 15856433 16286281 16755522
14373 16755522 17387083 17582710 18091485 18181118 18683360 19246169 19453424 19818192 20230998
14364 20230998 20729345 20921050 21973677 22127169 22225873 22667779 23263140 23772322 24410646
14355 24410646 25063183 25701729 26445703 26929250 27612906 28037137 29042572 29683734 30104349
14346 30104349 30760631 32138924 32770250 33545719 34052798 35503276 36355497 37445373 38331374
14337 38331374 39584619 40432444 41714879 43341171 44013861 45297663 46933000 48609230
14329 48609230 50041966 51683232 53291223 54799531 56684481 58364034 61080798 62602534
14321 62602534 64781142 67201655 69357801 71771393 74475831 77294988 80181003 83259484
14313H3259484L441593L132845L531780L887765L970901M385535M317903M881961
14305A14809767M939936N489644N707522N710547O301145O425996P011760P621567
14297A64017884P934238Q439734Q960093R596900R673287J0175495J1530025J1362721
14289B41690377J1928103J2967575J3472172J3479244J4438569J4664845J4910997
14282C37551882J5083753J5353230J5453167J4581662J4615484J3548447J2830259
14275D39017884J1366410R854731P536262L869990q0611l28731O79978k644902
14267D69271011n649774o300043o489217q216878j1159054j3055701j4149346
14260D04250998j5284996j5711299j6055637j5952159j5840614j5651404j5540040
$$ plain form
14313 83259484 86701077 89833922 93365702 97253467 101224368 105609903 109927806 114809767
14305 114809767 119749703 125239347 130946869 136657416 142958561 149384557 156396317 164017884
14297 164017884 171952122 180391856 189351949 198948849 208622136 218797631 230327656 241690377
14289 241690377 253618480 266586055 280058227 293537471 307976040 322640885 337551882
14282 337551882 352635635 367988865 383442032 398023694 412639178 426187625 439017884
14275 439017884 450384294 460239025 467775287 471645277 471564666 471235935 471915913 469271011
14267 469271011 463621237 457321194 450831977 442615099 431456045 418400344 404250998
14260 404250998 388966002 373254703 357199066 341246907 325406293 309754889 294214849
14253B94214849j3932859j2229034j3298634j2640955j2190695j1550453j0649174
14246B07723045j0262436r454047q877746q641336q323121p447269p207386o904075
14238A40605629n954494n763032n911125n233079n405557m456438m358673l586400
14230I9936831m074919m160145l396624l491062l084011l272690k911742k930238
14222G2615400k618860j955261k297302k156546k295760k370887j633946j920306
14214E5366532j230516j616244j826463j853357j590053p85470j621705p99613
14206D4043111r19386j685450j115346j295333r81256p73465p53052q72672j594773
14197C4052378q13557q18642p62488o69208o55050q43422p36215p56725p08035
$$ plain form
14253 294214849 280281990 268052956 254754322 242113367 229922672 218372219 207723045
14246 207723045 197460609 188006562 179128816 170487480 162164359 154717090 147509704 140605629
14238 140605629 134651135 128888103 122976978 117743899 112338342 107881904 103523231 99936831
14230 99936831 95861912 91701767 88305143 84814081 81730070 78457380 75545638 72615400
14222 72615400 69996540 68041279 65743977 63587431 61291671 58920784 57286838 55366532
14214 55366532 54136016 52519772 50693309 48839952 47249899 46464429 44842724 44043111
14206 44043111 43123725 41438275 40322929 39027596 38046340 37272875 36519823 35647151 34052378
14197 34052378 33238821 32420179 31657691 30988483 30333433 29490011 28753796 27997071 27289036
14188B7289036o48988l09849m99059j135554n02117m23796m31801o35464l70631
14179B2331777q10550J51476o39311q28238J38079l98781o71758l08036l89094
14170A8575564k89524k93270k62764k48649q02671P4511k63077m03721k22871
14161A5863528j67750o34298q2952Q3425n46537m09717j85642J27449n97965m45652
14151A3003889J78329l39364k75580k443n43308j01137P1939l01979j01441l84939
14141A1203966J9879l93788m29494K09020k5821k92825n9455j11300l28042o4848
14131I727292j37163l80282J06834p6972p10447L91921l20314l803R5881l21159
14121H371788j26177k76454R7750k09693J0161l39864J76994k92649J47432l19934
$$ plain form
14188 27289036 26640048 26330199 25831140 24695586 24193469 23769673 23337872 22702408 22331777
14179 22331777 21521227 21672703 21033392 20205154 20343233 19944452 19272694 18964658 18575564
14170 18575564 18286040 17992770 17730006 17481357 16678686 16753197 16490120 16086399 15863528
14161 15863528 15695778 15061480 14978528 15061953 14515416 14105699 13920057 14047506 13449541 13003889
14151 13003889 13182218 12842854 12567274 12564831 12021523 11920386 11992325 11690346 11588905 11203966
14141 11203966 11223845 10830057 10400563 10609583 10583762 10290937 10231482 10120182 9792140 9727292
14131 9727292 9590129 9209847 9316681 9239709 8529262 8921183 8600869 8597066 8692947 8371788
14121 8371788 8245611 7969157 8066907 7857214 7867375 7527511 7704505 7411856 7559288 7239354
14111G239354j7200k46563L20243k44901k78124k23135J09812l3133J48126l52065
14101F422414j96816J16251m05057N19602k94540k59981M41358m11300q5110J22152
14091E968973l62057k68253K78694j21031j66872M4017k7369P030r9125m00249
14081D853758K83494j51167k64439J74808l7051k18083j09378K18590j11778l1252
14071D607502j43385K4088J2762o1533l29803K85761K29849k98252k18854J20001
14061D228136l03977J65331k19116M9871j31783k1124j0704R2860j5440j65822
14051C668232K52296j18652j64353R02N0767k41614k0573J00245j39556L28998
14041C716692k91676J69073k21247l34045K05194j30536N2217J94657m02226K31606
$$ plain form
14111 7239354 7222154 6975591 7295834 7050933 6772809 6549674 6659486 6626353 6774479 6422414
14101 6422414 6225598 6341849 5936792 6456394 6161854 5901873 6343231 5931931 5846821 5968973
14091 5968973 5606916 5338663 5617357 5496326 5329454 5373471 5346102 5353132 5254007 4853758
14081 4853758 5137252 4986085 4721646 4896454 4859403 4641320 4531942 4750532 4638754 4607502
14071 4607502 4464117 4488205 4500967 4439434 4109631 4395392 4625241 4326989 4108135 4228136
14061 4228136 3924159 4089490 3870374 3920245 3788462 3767338 3756634 3849494 3834054 3668232
14051 3668232 3920528 3801876 3637523 3638425 3689192 3447578 3427005 3527250 3387694 3716692
14041 3716692 3425016 3594089 3372842 3038797 3243991 3113455 3165672 3360329 2958103 3189709
14031C189709r8056J32886p9719J04515j28160L0170o5963j50493J05718l80996
14021B659611O49033o65589K46996l56976K75631K50804m99355K4120k94590P8495
14011B368180K57621J16549k82548O6006Q4942o72480K46148L79063j77335j13894
14001B272252r9025M50068l63251j5800K12472m02418L51145l59384R204M66748
13991B522011j27682M33348P37652K896845Q017248J7467350J4994836k0115879
13983B6825729j2713180m789941k676083j527487o98426o89223N4139l69153j20272
13974C296103l28581j88505l6228j45127J87521l70957K17155k14601l9873K366
13964B379273k43057J71372k26338K75786p4298O4743m22980N6802J46043K7336
$$ plain form
14031 3189709 3091653 3224539 3144820 3249335 3121175 3151345 3085382 2934889 3040607 2659611
14021 2659611 3308644 2643055 2890051 2533075 2808706 3059510 2560155 2584275 2289685 2368180
14011 2368180 2625801 2742350 2459802 2525808 2610750 1938270 2184418 2563481 2386146 2272252
14001 2272252 2173227 2623295 2260044 2244244 2456716 2054298 2405443 2046059 2055263 2522011
13991 2522011 2394329 2827677 3565329 6462174 14479422 31946772 46941608 26825729
13983 26825729 14112549 9322608 6646525 5119038 4420612 3731389 3785528 3416375 3296103
13974 3296103 2967522 2779017 2742789 2597662 2785183 2414226 2631381 2416780 2376907 2379273
13964 2379273 2136216 2307588 2081250 2357036 2282738 2347481 1924501 1981303 2127346 2154682
13954B154682J13244m23788J71423J5718k18634K9853K66429k27905j6432N6090
13944A920680Q2481j43821P5049m0701m0723J68410k74330J50132J99120l26866
13934A769431Q7543j18094O6670j67694j04838K69405l14146O7000O7242j52287
13924A470232K36334j32407J25044P3562k56571k2496J64249l56761L11868j23285
13914A489769J67960j25115M2460k09325J71854r7736K35720j18291j33946O9838
13904A493188k92593j73996L71266N7746Q0904k09053K99333k95666m2463J63914
13894A452580l70698K97328k01174L76630j21243j19521J1145l35602N31319Q755
13884A529519l56405K0633K1740L13314l72290k81566m9701O48396j89384J00157
$$ plain form
13954 2154682 2267926 1844138 2015561 2031279 1812645 1842498 2108927 1881022 1864590 1920680
13944 1920680 2003161 1859340 1934389 1893688 1852965 2021375 1747045 1897177 2096297 1769431
13934 1769431 1856974 1738880 1805550 1637856 1533018 1802423 1488277 1555277 1622519 1470232
13924 1470232 1706566 1574159 1699203 1772765 1516194 1493698 1657947 1301186 1613054 1489769
13914 1489769 1657729 1532614 1575074 1365749 1537603 1439867 1675587 1557296 1423350 1493188
13904 1493188 1200595 1026599 1397865 1455611 1536515 1327462 1626795 1331129 1288666 1452580
13894 1452580 1081882 1379210 1178036 1554666 1433423 1313902 1325047 989445 1520764 1529519
13884 1529519 1173114 1193747 1215487 1528801 1156511 874945 825244 1473640 1284256 1384413
13874A384413l45471M90471k09812P1192O4062l80508K09793J6302j69338p3387
13864A057717J3047L85178n16186J85323k49513K90826j72742J4239p1862J30229
13854A066256J50017n42745M91570J7658j12333O7105l91419N32976k31236n09549
13844E38300O50374k28252R5512j34643J09486K51560l8632j33636m89478L16431
13834I37022o8606N60735m29750K42284q5322m09318K07037j43492K89682k62711
13824H37561J66923L13628m53025j32024M24612J3026j19253p8091j18080L46137
13814A201414l27739k3305M2514j31135K59110J86770m72630o7793o4994L19951
13804I22163K97579n54975M39804k61125J35109k27516J07313A95952Q13982k54342
$$ plain form
13874 1384413 1038942 1529413 1319601 1390793 1454855 1074347 1284140 1300442 1131104 1057717
13864 1057717 1070764 1455942 939756 1125079 875566 1166392 993650 1007889 936027 1066256
13854 1066256 1216273 673528 1165098 1182756 1070423 1137528 746109 1279085 1047849 538300
13844 538300 1188674 960422 1055934 921291 1030777 1282337 1243705 1110069 620591 937022
13834 937022 868416 1429151 999401 1241685 1156363 747045 954082 810590 1100272 837561
13824 837561 1004484 1318112 865087 733063 1157675 1170701 1051448 973357 855277 1201414
13814 1201414 873675 850370 892884 761749 1020859 1207629 734999 667206 602212 922163
13804 922163 1219742 664767 1104571 843446 978555 751039 858352 195952 1009934 755592
13794G55592N5155J64547p7208n1296L9080J86934l26713J1197K02923l30496
13784F29715L11227m67669J37656K59298J44936l29388j37129J88777j51147k8263
13774E58013J05523L35615l30540R3546m9496r1826K85007l94228L23483j06801
13764G28296k02053J13308k35490M11949N397k91075L40716k57654k0488j7477
13754E75429J98498k80877M3824P1454J3084k8004r7876r7652L38750k6679k12660
13743D97291J60303J13926C16313L74600j20703J73262j47277K46536j05265j52717
13733E84749K25936K6917m698L2840k02823k42215K19989j85708L87863l01116
13723E41734R7833j68690M4389L32863C39168J02705J13635m7361L8799M53011
$$ plain form
13794 755592 810747 975294 898086 846790 885870 1072804 746091 757288 960211 629715
13784 629715 940942 473273 610929 870227 1015163 685775 548646 737423 586276 558013
13774 558013 663536 999151 668611 762157 712661 620835 905842 511614 835097 728296
13764 728296 526243 639551 404061 816010 821407 530332 871048 613394 592906 575429
13754 575429 773927 493050 536874 608328 621412 593408 495532 397880 736630 709951 497291
13743 497291 657594 771520 316313 690913 570210 743472 596195 842731 737466 584749
13733 584749 810685 837602 832904 865744 662921 420706 640695 454987 842850 541734
13723 541734 639567 470877 515266 848129 339168 441873 555508 508147 546946 999957
13713I99957B59852N70127l29100j10392l7447R9236n0205L80210l38684K69236
13703G12833C4361N24080M7374j32370J84942B00752K09670K52048j55336K70860
13693G77994C08428J76879A77625K84040l9707l8062K60613o8051j94534O8878
13683D50802J49417l3956o4396J7147J35315C26574K64939k50691L88619m8683
13673F80758j94701k18403K32302k41681R4144L01811r5496j42475J70055k87077
13663B99237K61633k8999K6645j77296q6860K78860B83279K91519j25754q3879
13653C65165m183k4594J17572K11151R8170C19249J9242J81053j69942j32084
13643B17518N30817l4935l33456K06589A78197l719J22873j18101J53516J43047
$$ plain form
13713 999957 259852 829979 500879 390487 353040 452276 402071 782281 443597 712833
13703 712833 34361 558441 605815 473445 658387 200752 410422 662470 507134 777994
13693 777994 308428 485307 177625 461665 421958 383896 644509 576458 381924 450802
13683 450802 600219 566263 501867 519014 654329 326574 591513 340822 729441 680758
13673 680758 486057 267654 499956 258275 352419 654230 558734 416259 586314 299237
13663 299237 560870 531871 558516 381220 294360 573220 283279 574798 449044 365165
13653 365165 360982 336388 453960 665111 763281 319249 338491 519544 349602 217518
13643 217518 748335 713400 379944 586533 178197 174478 297351 179250 332766 475813
13633D75813j73763M2846n8390j4133A15440J89817L59213k52921j8511A75221
13622A5804L01351L8215I4723O03445R3703k95435J46344B72281r5457P7716L78660
13611F33200j50110k3868j51089m5415A25153J26380J4688E0552M47258o3149
13601D34661A36664J72169q3014M9952K78827G8811L35120A70696K98676j9365
13591D50007j6444A68735L9184L81562j81209j83904N5822J9555J79330J71473
13581F50548A41679K98266n7038A36505M99148C10266K76005B75735n904M87411
13571G57242A43626K67605K65331l7875B64745K0259o0823e9005F8198E154L05085
13560C10239Q0227K41066j85040N0816A9894M8384L7412N37537j36069B18032
$$ plain form
13633 475813 302050 344896 286506 272373 115440 305257 664470 411549 393038 175221
13622 15804 317155 355370 94723 698168 791871 496436 642780 272281 176824 254540 633200
13611 633200 483090 459222 308133 262718 125153 251533 266221 50552 497810 434661
13601 434661 136664 308833 225819 275771 554598 78811 413931 170696 469372 450007
13591 450007 433563 168735 207919 589481 408272 224368 280190 299745 479075 650548
13581 650548 141679 439945 382907 136505 635653 310266 586271 275735 269831 757242
13571 757242 143626 411231 676562 638687 264745 285004 224181 -59005 68198 5154 310239
13560 310239 390466 631532 446492 497308 19894 68278 105690 643227 507158 218032
13549C56144J05706B22959J37103A36195K64666j03270j02265M5502J67356R591
13539D17775A81878K2682K60345P7517H1462J46204O9936j08790Q7224a39816
13528C05814K26975C5301J33402E418K08330Q3749R6270p1984a11513J1888B38275
13516D7912L27230m845M9132J17917B40779J31889A38908K54101c5157A31735
13505A56372Q0223J64241j94490Q4568O9537j50865G5826L46246k00462A3113
13494B07185J07998A55288J09718A17797R3279J31054O7894j22596K11327j65146
13484C33609a05119C764N53692A38943J83733K72113A26337M06269j15016A64009
13473A85356N0004r0617M40998F6235J48164j695C9799J52443O6638J8802A01816
$$ plain form
13549 356144 461850 222959 360062 136195 400861 297591 195326 240828 408184 417775
13539 417775 181878 204560 464905 542422 81462 227666 297602 188812 276036 -139816
13528 305814 532789 35301 168703 5418 213748 297497 393767 321783 -111513 -99625 238275
13516 47912 375142 370297 419429 537346 240779 372668 138908 393009 -35157 131735
13505 156372 236595 400836 206346 290914 360451 209586 75826 422072 221610 13113
13494 207185 315183 155288 265006 117797 211076 342130 410024 287428 498755 333609
13484 333609 -105119 3764 557456 138943 322676 594789 126337 532606 417590 164009
13473 185356 235360 144743 585741 66235 214399 212704 39799 192242 258880 277682 101816
13461B49531o8329l1696K53827K3197D5627M23894B25471l121O3912G4575B6879
13449B18600J94521F5363J55523A4230M53070j27929j14563K0575L0024o7695
13439B07712m2544n9903d9211D75181k15480A20843J23682A11900L12976a73757
13428F3105a84764D02314A33108K27850j77012Q7278A29061J34180M52559B28104
13417f6039F4316K17133K62586k50499J10711A99065n7451Q4990M48M3695j25681
13406A45066L43441k06388a5718D48221I2192J99493A5555K32859K03066k3393
13396D28087q6897A16466L23049k00207a80730B48569M5219p3758D6316J19322
13386A65638L32595l8733A48873K91583j90154h1209C84117g70B02776J47999
$$ plain form
13461 249531 181202 149506 403333 426530 45627 469521 225471 222350 286262 74575 26879
13449 218600 413121 65363 220886 14230 467300 339371 224808 245383 275407 207712
13439 207712 165168 105265 -49211 475181 259701 120843 244525 111900 424876 -173757
13428 63105 -184764 402314 133108 360958 183946 271224 129061 263241 715800 228104
13417 -66039 64316 281449 544035 293536 404247 199065 141614 226604 227052 270747 145066
13406 145066 488507 282119 -15718 448221 92192 291685 15555 248414 451480 428087
13396 428087 341190 116466 439515 239308 -180730 248569 293788 220030 46316 165638
13386 165638 498233 459500 148873 440456 250302 -81209 384117 -770 202776 350775
13376C50775m2367j37120J81622G9162M08546A92997H4727K57566r6117l7030
13366B09146D3157o597J27261J44992n6265A2007f2899A45427O2145K57540r1300
13355C73812m4553a49319B87290j21818h424r0829B92094N8831P2357A58322d7985
13343C79854j25920J45856k150A96724J04198R1544e0101B28455l5888B0455J30262
13332A50717J27460O1359l0533h0650E3570N31492H8700L7946j3625a81190B35913
13320D97073B00722J28917P9258F9919A8543h0112E0491d2875E2326E288M11022
13309D16310b32375A83409A6025Q0878K3412J30815g7338H1310K1036c0325B34320
13297G9660O3046a13001G3438g4805E2663J08479L3025C1653J42911f8595A01037
$$ plain form
13376 350775 308408 171288 352910 79162 487708 192997 84727 342293 246176 209146
13366 209146 43157 36560 163821 308813 252548 12007 -62899 145427 207572 465112 373812
13355 373812 329259 -149319 287290 165472 -8424 -99253 292094 350925 423282 158322 -47985
13343 379854 253934 399790 397640 196724 300922 392466 -50101 228455 192567 20455 150717
13332 150717 278177 339536 309003 -80650 53570 585062 88700 126646 113021 -181190 235913
13320 497073 200722 329639 408897 69919 18543 -80112 50491 -42875 52326 5288 416310
13309 416310 -232375 183409 16025 96903 120315 251130 -77338 81310 102346 -30325 234320
13297 79660 142706 -113001 73438 -74805 52663 161142 194167 31653 174564 -68595 101037
13285C28496d201A31689A9188b03312C0820h1288A17378e9952D3722J1385J7657
13274G2764e5219A50234K28408A77883p0977c3277B60707j14681K5091k0613J73819
13263C24323a23602A91643N5884a11240C04990C5982Q1951b11814H5770d6809
13252A76302i4934A11129M25600k68224b28077D38914C3374a58913A14180O7450
13242A81630Q2009j12582J21659j23858N9792k7133P7472q7855l5740K35779h0020
13230A09467E3045i418A15588b56329G8754K46989j7849E2645J9084L71528k00442
13219B42815A19917k3000Q9300a52084A53195p734E797g5147A38382b40815D40246
13207B23685p0296o2491d9940q1521A3316J14179P7850e6344I2656L39224j83779
$$ plain form
13285 328496 -4201 131689 19188 -203312 30820 -81288 117378 -59952 43722 55107 72764
13274 72764 -55219 150234 378642 177883 106906 -33277 260707 146026 171117 150504 324323
13263 324323 -123602 191643 247527 -111240 304990 35982 117933 -211814 85770 -46809
13252 176302 -94934 111129 536729 268505 -228077 438914 33374 -158913 114180 181630
13242 181630 263639 151057 272716 148858 208650 181517 258989 171134 135394 371173 -80020
13230 109467 53045 -9418 115588 -256329 78754 325743 307894 52645 71729 443257 242815
13219 242815 119917 96917 186217 -152084 153195 145461 5797 -75147 138382 -240815 440246
13207 223685 153389 90898 -49940 -131461 13316 127495 205345 -56344 92656 431880 248101
13196B48101H7123B0816O3068b52453A95943o8589k1552b58490B71149k480a58034
13184B80831a80708a2751B09085Q8124j45122E097M36069A70479R7693I241h0562
13172B86328o4330f3640L74q0273A17516d01527e4932G3446P0289K04237A56840
13160a12008A86113G688J35435h603A79936J50876b68208B01058F7815l403L39490
13149D03902a05214A06879h332D7499f8339a4772B11864L0022H1431J12242q451
13138A85222a40380N7482l38209A07336J69646b48127h7901B6435N9092K32552
13128C18079G2810a02731r4544E6597k1222M8290K02508I6804a9807B53789k5438
13117B28351b68836B38109a57866A26546b41405A36064a7627A93227h5069G7443
$$ plain form
13196 248101 87123 20816 83884 -252453 195943 127354 105802 -258490 271149 268669 -158034
13184 280831 -180708 -12751 209085 297209 152087 5097 441166 170479 268172 9241 -80562
13172 286328 221998 -63640 -63266 -143539 117516 -401527 -54932 73446 143735 347972 156840
13160 -112008 186113 7688 143123 -8603 179936 330812 -268208 201058 67815 64412 403902
13149 403902 -105214 106879 -8332 47499 -68339 -14772 211864 241886 81431 193673 185222
13138 185222 -140380 -82898 -421107 107336 276982 -248127 -87901 26435 85527 318079
13128 318079 72810 -102731 -197275 56597 35375 83665 286173 96804 -19807 253789 228351
13117 228351 -268836 238109 -157866 126546 -241405 136064 -17627 193227 -85069 77443
13106f2768B61839a76086A19436a33243A77220N713J26318A22673c8860j40144
13096a79004c0202A15877c6056B76394I6351k7910l222L81961a59711G5332a20029
13084f4625j62727a05132B57723F6462J01121j1940E9063N6479A698d8633K2204
13073b6429j8244A73576H3509a52737K9107A53532R0365J45100a36722R651C40066
13061B27531B1138L02071a83032C85326j37356F0532f9784B11065m4088p9112
13051H7865a072D565J28186L1187J49670l3483A17744c91582D5024c6725E0011
13039A80458C6212P2393c49652J46084c8100D041J67757M4589j2847I1265h8055
13027A88466d09F1798c1472D49891e6922C60232c3638q8443a930o5627B27473
$$ plain form
13106 -62768 261839 -176086 119436 -133243 177220 182933 309251 122673 -38860 -179004
13096 -179004 -30202 115877 -36056 276394 96351 68441 65219 447180 -159711 75332 -120029
13084 -64625 -227352 -105132 257723 66462 167583 155643 59063 115542 1698 -48633 -26429
13073 -26429 -44673 173576 83509 -152737 -123630 153532 243897 388997 -136722 -127071 340066
13061 227531 21138 323209 -183032 385326 247970 60532 -69784 211065 166977 87865
13051 87865 -1072 4565 132751 163938 313608 280125 117744 -391582 45024 -36725 50011
13039 180458 36212 108605 -349652 -203568 -38100 4041 171798 216387 203540 91265 -88055
13027 188466 -409 61798 -31472 449891 -56922 360232 -33638 -122081 -1930 -67557 227473
13015f3007B13982I3773K2143J3741N8366J1175m7806a12220B72775I9935C754
13003A26754b23200F0452R9790n6078a30433I7140c2145A56808J18316h5327k00435
12992b85762A27520M8219E9572e8614b8805A81443B4455K54773b19914H9142L3452
12981A22594J75077c6035B03314r6612J46270m9452F5838d22126E23567A17074
12970B00405a94442I5722K6248c231D8440f6718A18600N0770E5312d5019l32369
12959c77388B225J21764n2567k8408Q3137J9693F9984a14956C0439g3575k59417
12948c32992i5825c6281k0486D60392a30614B16669C9923a05397B39613C9007
12937A30989A1924c8428m049B02064I706Q9694h544F0604R7860a54373A98334
$$ plain form
13015 -63007 213982 93773 115916 129657 188023 199198 151392 -112220 272775 99935 3754
13003 126754 -223200 60452 160242 104164 -130433 97140 -32145 156808 275124 -85327 -285762
12992 -285762 127520 175739 59572 -58614 -28805 181443 24455 279228 -219914 89142 122594
12981 122594 297671 -36035 203314 106702 252972 203520 65838 -422126 523567 117074
12970 200405 -194442 95722 121970 -3231 48440 -66718 118600 169370 55312 -45019 -377388
12959 -377388 2225 123989 71422 43014 126151 145844 69984 -114956 30439 -73575 -332992
12948 -332992 -95825 -36281 -56767 460392 -130614 216669 39923 -105397 239613 39007
12937 130989 11924 -38428 -42477 202064 9706 99400 -8544 60604 158464 -154373 198334
12925A03154b39281i6967C02989C8196L5816J63851m8208a51646A35903Q1411
12915B17314F7973J73931D1410J42288J06451e4893r3388P584B43360F2816b34531
12903d3231G359K46915A4554a26288C04067a73788Q5640o4772B62813b5123l04235
12892c29358A24429L6164i598B4571M2370J40643f706A49641f2104k0823n4320
12881a37247d9769J4700C18842D7206a12579N3408A53318J45352A38272i5540
12870B19476k5557a2788j23078E8715J63826P2805A06163K61538B1706a96375
12859B55017K48849a11339H5598l680B1026a59894G189L9501h5312H3412j5884
12848F7528b62230H5809J72626d9157l4376E834K49564J26189j09091n5581a87362
$$ plain form
12925 103154 -239281 -96967 302989 38196 74012 237863 189655 -151646 135903 217314
12915 217314 67973 241904 41410 183698 290149 -54893 -148281 -140697 243360 62816 -234531
12903 -43231 7359 254274 14554 -126288 304067 -173788 -88148 -152920 262813 -25123 -329358
12892 -329358 124429 160593 -9598 24571 66941 207584 -6706 149641 -62104 -82927 -137247
12881 -137247 -49769 -35069 318842 47206 -112579 -59171 153318 298670 138272 -95540
12870 219476 193919 -12788 -135866 58715 222541 295346 106163 367701 21706 -196375
12859 255017 503866 -111339 85598 81918 21026 -159894 7189 46690 -85312 83412 67528
12848 67528 -262230 85809 258435 -49157 -83533 5834 255398 381587 272496 216915 -187362
12836h01H5249d454k02299F4881k8840a42907A24952G898L1611c6495A33700g083
12823A5810J51146l3962b25699H5921J01309n5660a52038q820A80273J13719a53574
12811b90359A84092e8323I7151J18545E4788b42850O2626A17924A1931a90495
12800A17354d16240F9260b29268o2017j46846d0491E9867B350J11263M762k2117
12789I6258K4496g7964A16195E6349L25685G8032h2067A28361a66083k49630B04747
12777A78528f217A25937M2069f3284A43089d0643F1119f8630J958j74938h101
12765C1767b74285B39293j09167l3446d6023A38597j8564a76421p61d8768k7632
12754g6400c5951A61806D9967a00997j68601B50144q1113q2003a00736l7947A34288
$$ plain form
12836 -801 85249 -4454 -206753 64881 36041 -142907 124952 7898 39509 -36495 133700 -7083
12823 15810 166956 132994 -225699 85921 187230 131570 -152038 -160858 180273 293992 -153574
12811 -290359 184092 -58323 97151 215696 54788 -242850 -180224 117924 11931 -190495
12800 117354 -416240 69260 -229268 -291285 -438131 -40491 59867 2350 113613 118375 96258
12789 96258 120754 -77964 116195 56349 382034 78032 -82067 128361 -166083 -415713 204747
12777 178528 -6217 125937 168006 -63284 143089 -40643 61119 -68630 -66672 -241610 -8101
12765 31767 -274285 239293 130126 96680 -46023 138597 120033 -176421 -177182 -48768 -76400
12754 -76400 -35951 161806 49967 -100997 -269598 250144 169031 87028 -100736 -138683 134288
12742A86061a69278A25461k2601C2469b9837B78045e8249E7544K91735j46404
12732B02875l0981k1185J04319a36796b3123C7483b9559r4334A07756A933b38616
12720i0908F5624d2316l23843d640H527J22914a29648A82379a05165B37226b69714
12708E1304O6820a84334a7005O907k98053D21257l5658j50673j3636j09684a08129
12696A987K16487h0900l8983c8380F6245K92881j36172J294A4306b60290A1074
12684b13290N7017f6828B13446a49333n1162O4953o9717j2690b9750B10112m8458
12673A61654n810q718c9109j16649A08236J08312b05960A33793a0232j3204L127
12662b0309A29006A4702L57539d3415A12000K8809R6924j08341C1762a68179c2863
$$ plain form
12742 186061 -169278 125461 102860 32469 -29837 278045 -58249 57544 349279 202875
12732 202875 171894 150709 255028 -136796 -23123 37483 -29559 -123893 107756 1933 -238616
12720 -90908 65624 -42316 -366159 -4640 8527 131441 -129648 182379 -105165 237226 -269714
12708 51304 118124 -184334 -17005 -10098 -308151 421257 385599 234926 221290 111606 -108129
12696 1987 218474 -80900 -119883 -38380 66245 359126 222954 224248 14306 -260290 11074
12684 -213290 -156273 -66828 213446 -149333 -200495 -135542 -205259 -217949 -29750 210112 161654
12673 161654 155844 147126 -39109 -155758 108236 216548 -205960 133793 -10232 -23436 -20309
12662 -20309 129006 14702 372241 -43415 112000 140809 237733 129392 31762 -168179 -32863
12650B29061a56912B3346N02544F6549c9115P573A36211F3899J53584a25592j01175
12639b26767A85244a64071C03951F3217P7095K037b35275C30495a4866C68553
12628b2719C01287H1831J94624j3498b476B00403a02984H9448K13014j10020O8507
12617B60949E4437g4404L724f071B39134a59394j69909a4268k35898B31934m2435
12606A89499a40295D3525P3916J28642r4105a52371f0822G1446J00913a28613
12595A96194i2843A34425a30150G4511a15362A1991P04J79069h5672I6245N1696
12584A47941C800J14484a54090A69875b02717A10006b25194f6219I773c68947
12573A90812p9020G627L40565a81857C85175A06105P8775b00132R3256p6356B31514
$$ plain form
12650 229061 -156912 23346 525890 66549 -39115 -31542 136211 63899 217483 -125592 -226767
12639 -226767 185244 -164071 303951 63217 140312 142349 -235275 330495 -14866 368553
12628 -22719 301287 81831 276455 262957 -2476 200403 -102984 89448 302462 192442 260949
12617 260949 54437 -74404 -70680 -6071 239134 -159394 -329303 -14268 -250166 231934 189499
12606 189499 -140295 43525 117441 246083 151978 -152371 -60822 71446 172359 -128613
12595 196194 -92843 134425 -130150 74511 -115362 11991 12695 191764 -85672 96245 147941
12584 147941 3800 118284 -154090 169875 -202717 110006 -225194 -66219 9773 -368947
12573 190812 111792 7627 348192 -181857 385175 106105 184880 -200132 -106876 -183232 231514
12561A63746e7432B7839L0867K51870f60D8548J80292J97624j58501D4353M7093
12550I1446k2843K8583m2638J48462r4645a06460A80a72663e7968K3973k51766
12539b85761L5287F9458R4427B4389J36714m1439b7511E4649c58928a20306b5035
12527B47110a56718n9734R2045c3928B6902J61854a2943D8256a65741A58552J05340
12516B63892j5972b83263A23931j1064B7915K56464A17438M3983b73721c981k0197
12505b4178A66121K68680e1733G491J37194c03046J16450Q2451b976j63863l5668
12494b02507b534j92797A04740h9052E3444J68215h004A3243d4524B43394e503
12482C53681d9015B17020j07386m9262h1397G8143c62410J75780C69472E7264
$$ plain form
12561 163746 -57432 27839 58706 310576 -660 48548 228840 426464 267963 44353 91446
12550 91446 68603 97186 54548 203010 108365 -106460 180 -172663 -57968 -33995 -285761
12539 -285761 -250474 69458 163885 24389 161103 119664 -27511 54649 -358928 -120306 -25035
12527 247110 -156718 -216452 -124407 -33928 26902 188756 -12943 48256 -165741 158552 263892
12516 263892 247920 -283263 123931 112867 27915 284379 117438 161421 -273721 -3981 -24178
12505 -24178 166121 434801 -51733 7491 144685 -303046 -186596 -104145 -2976 -166839 -202507
12494 -202507 -2534 -195331 104740 -89052 53444 221659 -8004 13243 -44524 243394 -5503
12482 353681 -49015 217020 109634 60372 -81397 78143 -362410 -186630 369472 57264
12471F5322I061L13754H8788a3616j0378k70916g4210A09507n0129J99641E1437
12459a54664B57372K2954j19519n0936K1187c158j02744F3279K58895I7748a2987
12447A2607b6572k18248A00689a84384h2798j24213m8691B98852b01019G3229
12436A47546B4032c6350A45633a68058n7367c6071D1040c5854D0566a23081C1676
12424A26103L466a58390H0494b74284M3469i7469G1968e0666F505f8567n6426
12413a24993C24300A12522a07824B7075a20694e9731r059k6817c0176n208B73467
12401A77289b28518g5319A76099J79648j6935A8445a22463F3411e72858K70329
12391c02529a33227G4839j0308N7529a6565k9173F2503M9412J67434G7775e0691
$$ plain form
12471 65322 9061 322815 88788 -13616 -23994 -294910 -74210 109507 59378 259019 51437
12459 -154664 257372 280326 160807 109871 131058 -3158 -105902 63279 322174 97748 -12987
12447 12607 -26572 -244820 100689 -184384 -82798 -207011 -255702 298852 -201019 73229
12436 147546 24032 -36350 145633 -168058 -225425 -36071 41040 -35854 40566 -123081 31676
12424 126103 129569 -158390 80494 -274284 -230815 -97469 71968 -50666 6505 -68567 -124993
12413 -124993 324300 112522 -107824 27075 -120694 -59731 -68790 -95607 -30176 -35384 273467
12401 177289 -228518 -75319 176099 355747 338812 18445 -122463 63411 -572858 -302529
12391 -302529 -133227 74839 64531 122060 -16565 -45738 62503 111915 279349 77775 -50691
12379c20614d6335I7663b16252K7300k2600r9833a14520B1037c2434N613n72B44281
12366B59738l2768b87462M4470N4973A95166a54843I7921C2713M9232j670c49940
12354A17625g3354B71422a38115f7133F7600P2633J39946o3792a43133M7571M0688
12343e4874G5098e22468C50411j29783b07993A14242J67042j30829c79322a41763
12332G1307D416K82307j21108b99802G9983K62528A55624b14285f6879o248n4611
12321a27738M2134a8358r2692Q104j83098A72863m1562B7030g6055J9236B12103
12309I2071a03634A17045g3615B17454a4410B04613a64559B18640A06351f4736
12298C6772J32976h6562j57265P102C1196C975N852M0577a61582G1913b9721D6944
$$ plain form
12379 -320614 -46335 97663 -216252 -188952 -211552 -311385 -114520 21037 -32434 -26821 -27393 244281
12366 259738 226970 -287462 -242992 -188019 195166 -154843 97921 32713 81945 80275 -349940
12354 117625 -73354 271422 -138115 -67133 67600 140233 280179 216387 -143133 -95562 -54874
12343 -54874 75098 -522468 350411 220628 -207993 114242 281284 150455 -379322 -141763
12332 71307 4416 286723 165615 -299802 79983 342511 155624 -214285 -66879 -73127 -127738
12321 -127738 -85604 -18358 -111050 -102946 -286044 172863 131301 27030 -76055 -56819 212103
12309 92071 -103634 117045 -73615 217454 -14410 204613 -164559 218640 106351 -64736
12298 36772 169748 -86562 -243827 -236725 31196 3975 9827 50404 -161582 71913 -29721 46944
12285A5715a97091m4685k9440C53767g8761a0689B23496a3106E3104M3532R8938
12274A95574Q967f5394A0940f8838A18147a17986A60021c9021a0426j77044A697
12262e697q8068F264a11966d78C46430J20221C9170J74843f1142A8278a52537
12250C6596a28529B52901a15865C10514j36093o0899K8383P6984j04266a50724
12239a96412f7091C46111D1845L49708q3214A38441o0026c01209h89A54647J28843
12228B83490I2397k7498h7984E74022j93000A26242R2743K96568H8171h3101L2864
12217e0237C34415J76039F9474R4838B3378K51055A1029K43596a0106j18158E8222
12205C8121H969L1557L4095B7693J45672P8846F9439J00554P1816K14651C4299
$$ plain form
12285 15715 -197091 -241776 -271216 353767 -78761 -10689 223496 -13106 53104 96636 195574
12274 195574 204541 -65394 10940 -68838 118147 -117986 160021 -39021 -10426 -187470 1697
12262 -5697 -93765 6264 -111966 -478 346430 466651 39170 214013 -61142 18278 -152537
12250 36596 -128529 252901 -115865 310514 174421 113522 141905 218889 114623 -150724
12239 -196412 -67091 346111 41845 391553 308339 138441 78415 -301209 -889 154647 283490
12228 283490 92397 64899 -87984 574022 381022 126242 218985 515553 88171 -83101 -50237
12217 -50237 334415 510454 69474 164312 23378 274433 11029 254625 -10106 -128264 58222
12205 38121 8969 40526 74621 27693 173365 252211 69439 169993 241809 456460 34299
12193c179B83889I6162R1857j3241J88907a36o2547G6736J57042h4546j68087
12182b52633B15387g6351n0595A15833b28384A78548g5600A07140R5196D5984
12171f9544B60789D1295L25802A23746k238J03191E4332a02776M3166A64169J7978
12160A82147p5596k3227f8835B20113J0454h3797j71151B11727i046A3782g7545
12148A61059M359D5625a48581e0983J4564j265F7157d0377J1531A15177G397c4666
12135B67202f2109H191K63290a40640M382G6012P5246K5064f8820m9957A71739
12123E8251R4048a63896A51842j0847k1605J73400f2047A3982L81713a41683A94734
12111a42910m8696C38J43700B0857d3001D25298A7628i6226o9899a3922A47479
$$ plain form
12193 -3179 283889 96162 188019 174778 363685 -136 -62683 76736 233778 -84546 -252633
12182 -252633 215387 -76351 -126946 115833 -228384 178548 -75600 107140 202336 45984
12171 -69544 260789 41295 367097 123746 121508 224699 54332 -102776 -59610 164169 182147
12160 182147 106551 83324 -68835 220113 230567 -83797 -254948 211727 -9046 13782 -77545
12148 161059 165418 45625 -148581 -50983 -36419 -37684 67157 -40377 -28846 115177 7397 -34666
12135 267202 -62109 8191 271481 -140640 -136258 76012 151258 176322 -68820 -118777 171739
12123 58251 152299 -163896 151842 140995 119390 292790 -62047 13982 395695 -141683 194734
12111 -142910 -191606 338 144038 20857 -43001 425298 17628 -96226 -166125 -13922 147479
12099A39941a05764A76615a53868j18769A27487B9877J3850L0624b20632a6549
12088B79853f8624i422m4488o7681A44901E1401c61116A50788J96053c58232a06104
12076I9025g3489j28982A34114b82080L0142g7260j2559H2523J87160a38603k040
12065a40643B7276L3383c2491B12159b53929F61410P68100m00533h563C49864
12054e926B87916b17215A06527h3821o538o3812f9749B65814b68844J14822f2289
12042e4924A11715h3630A7558b28236p9875J23145L1542d4593J7395D4306a73107
12030B36091b20306d6104B4730J18760J89316i5659k9073e8765A17343l5886K08082
12019B89539b80751D461P6599b98385O5032b217A2644K69913a2857E9702J62620
$$ plain form
12099 139941 -105764 176615 -153868 -272637 127487 29877 43727 74351 -220632 -16549
12088 279853 -68624 -9422 -53910 -121591 144901 51401 -361116 150788 346841 -358232 -106104
12076 99025 -73489 -202471 134114 -282080 -251938 -77260 -89819 82523 269683 -138603 -140643
12065 -140643 27276 60659 -32491 212159 -253929 661410 1429510 1028977 -8563 349864
12054 -5926 287916 -217215 106527 -83821 -90359 -154171 -69749 265814 -268844 -154022 -62289
12042 -54924 111715 -83630 17558 -228236 -308111 -184966 -153424 -44593 -27198 44306 -173107
12030 236091 -220306 -46104 24730 143490 332806 -95659 -124732 -58765 117343 81457 289539
12019 289539 -280751 4461 81060 -298385 -233353 -2217 12644 282557 -12857 59702 222322
12008B22322a8199k02113F2460c5573q5171k08678j32590a62803C1500a22418
11997A45336f4663l58005a21739A11800K87112a53376k9725M0202B85182o4527
11987B20655A917a0040j03955f410A06523I337P5875g8010A55111a25609j5893
11976a41502B27680a28981j7517A86269n4162c59350F032J6223R2669a4582B93370
11964a97013A8469K9041a31063k09643A32361c3955A21395f27047K94507r748
11954c42288J52404B9299R279K44226A17929M5126c9134D9335a928n3368G1973
11942b84036M0486a10202A29479D1242a46393F4874L0857d517B53940a34883H6191
11930d0004A75825q5361b00801N640l135r5461A9094e2244C7446c115k02777i6034
$$ plain form
12008 222322 -18199 -220312 62460 -35573 -120744 -329422 -462012 -162803 31500 -122418
11997 145336 -64663 -422668 -121739 111800 398912 -153376 -183101 -142899 285182 220655
11987 220655 1917 -10040 -113995 -6410 106523 9337 85212 -78010 155111 -125609 -141502
11976 -141502 227680 -128981 -146498 186269 132107 -359350 6032 22255 114924 -14582 293370
11964 -197013 18469 47510 -131063 -340706 132361 -33955 121395 -627047 -332540 -342288
11954 -342288 -189884 29299 38578 282804 117929 163055 -39134 49335 -1928 -55296 71973
11942 -284036 -243550 -110202 129479 41242 -146393 64874 95731 -4517 253940 -134883 86191
11930 -40004 175825 90464 -200801 -195161 -198296 -293757 19094 -52244 37446 -3115 -205892 -96034
11917b39621d2482a4675j70672g1299o7566J3731A20901h9121m8327H1078b71122
11905B60650c18876h6289p2744B13520r9979b09654H735K58858C1297a76602d6271
11893c09673A68273p8693a98016o6887I3916A5617K64294g8758j03461f8626B7721
11881B55612e4622B18508D1611d2219B09075Q9790c69238B82604r4657b19344
11870e8332k33136L7355R2503d2022B40196a54455e6541G4373i8248a4190l66083
11859c80273H9711m876J8069a88552j40816F8827P2255J08143A4760O0099k4954
11848D9905K41661d06521B79223a5996n36261A29354b27920R3468O4805k27947
11838b97594B20879E7580A8753P6081J06247D705i2232j66957J03248c5844A01381
$$ plain form
11917 -239621 -42482 -14675 -185347 -71299 -138865 -125134 120901 -89121 -137448 81078 -271122
11905 260650 -318876 -86289 -159033 213520 113541 -209654 8735 267593 31297 -176602 -46271
11893 -309673 168273 89580 -198016 -264903 93916 15617 279911 -78758 -182219 -68626 27721
11881 255612 -54622 218508 41611 -42219 209075 298865 -369238 282604 187947 -219344
11870 -58332 -291468 -254113 -161610 -42022 240196 -154455 -56541 74373 -98248 -14190 -380273
11859 -380273 89711 84835 102904 -188552 -329368 68827 141082 249225 14760 74859 49905
11848 49905 291566 -406521 279223 -15996 -552257 129354 -227920 -134452 -69647 -297594
11838 -297594 220879 57580 18753 94834 201081 4705 -92232 -259189 -155941 -35844 101381
11826a82059c5571K15C614c27003R2537B96532E9044c30861j56525a47464F9596
11814h3413I1396a6744d153n7276j95755a10162o0144n7492A581K87511d9567
11802i681l12770H8886a10470K4742G1755a23298p8490D4830b91198a4501B02633
11790h2802j41899L4721l8680A44322E5503A4373i3220j44471f7211A98814n2630
11779A46184R1898a95528d1184C051g8660b2464A58261d5518B07539a49169N3195
11768i5974j7984C9610a30952N2231A79722b6916p455o8299D6433a17071b1415
11756a89488e4415G2718b36716H1272P542L8375n4965K69019c14999A29010a19302
11744i3473p6829K2217A19833o562k4885d954A89752a10556j0597B24923a48900
$$ plain form
11826 -182059 -35571 -35356 3614 -327003 -234466 296532 59044 -330861 -487386 -147464 69596
11814 -83413 91396 -16744 -4153 -61429 -257184 -110162 -170306 -227798 1581 289092 -49567
11802 -9681 -322451 88886 -110470 -85728 71755 -123298 -201788 44830 -291198 -14501 202633
11790 -82802 -224701 -189980 -228660 144322 55503 14373 -93220 -237691 -67211 198814 146184
11779 146184 238082 -195528 -41184 3051 -78660 -22464 158261 -45518 207539 -149169 -95974
11768 -95974 -113958 39610 -130952 -78721 179722 -26916 -34371 -102670 46433 -117071 -21415
11756 -189488 -54415 72718 -236716 81272 88814 127189 72224 341243 -314999 129010 -119302
11744 -93473 -170302 -148085 119833 113271 88386 -4954 189752 -110556 -121153 224923 -148900
11732A25210b09352d9129j72812e4948m7063D8833K8950a91459j33344i5739p1266
11721a67005j20574a43687j08706A23238b94779G6718b21243n827j30001G9705
11710a69945G3636A2017J51178a96752f1374p7360O0301R042A09891K19305H3817
11698f3400j21501B47164c44733A03487b74278A88923H1060J48715j05465g1758
11687F7303i7550j01693r192B18426E636a74168M4260K461D30248A11896n0787
11676F1109e8431D8843A151O0996Q479a61049A01348A1092a72507A95053J28490
11665C23543A17225a13362C4108a11692l87392a64364e2567D3627h4843j58867
11655b43710R8569J662f0848A94996c25141j50995A05781Q0098B6151a0551C03025
$$ plain form
11732 125210 -209352 -49129 -221941 -54948 -102011 48833 77783 -191459 -324803 -95739 -167005
11721 -167005 -287579 -143687 -252393 123238 -294779 76718 -221243 -227070 -357071 79705
11710 -169945 73636 12017 163195 -196752 -61374 -138734 -78433 -69391 109891 329196 83817
11698 -63400 -184901 247164 -344733 103487 -274278 188923 81060 229775 124310 -71758
11687 67303 -97550 -199243 -208435 218426 5636 -174168 -129908 -127447 430248 111896 61109
11676 61109 -58431 48843 1151 62147 70626 -161049 101348 11092 -172507 195053 323543
11665 323543 117225 -113362 34108 -111692 -499084 -164364 -52567 43627 -84843 -243710
11655 -243710 -145141 -143479 -60848 194996 -325141 -476136 105781 185879 26151 -10551 303025
11643H3384L812a25881B6337a51682L4465A67057o2502a08414r3554e2123o1264
11632a13387L6297N941E8570h8161D9633c27207E6064J80057r2176h2164l3539
11621a15703b2778k91903g3509E7947J5366a81776l2685D1279A6406N0415d1139
11609c04601M8985C66164A54147A1138Q5423a06667A48612c9428L913C84395b03257
11597B26874a78482j1992A34062B3182J40957a74453F5085b07057E3735j7862
11587C5873a54870B12869J21248b34598J12984e700A21447a00978k48527d6365
11576h8013D14171A7374a88259B88031A01141e1237k11471D70670a33910F1473
11565b02365A84452F0132a92526o9212A38342j8332l7427e4758p2742N9040C21930
$$ plain form
11643 83384 87196 -125881 26337 -151682 -117217 167057 104555 -108414 -201968 -52123 -113387
11632 -113387 -77090 -71149 58570 -88161 49633 -327207 56064 236121 143945 -82164 -115703
11621 -115703 -22778 -314681 -73509 57947 73313 -181776 -214461 41279 16406 66821 -41139
11609 -304601 -255616 366164 154147 11138 96561 -106667 148612 -39428 -35515 384395 -203257
11597 226874 -178482 -190474 134062 23182 164139 -174453 65085 -207057 53735 35873
11587 35873 -154870 212869 334117 -234598 -121614 -5700 121447 -100978 -349505 -46365
11576 -88013 414171 17374 -188259 288031 101141 -51237 -262708 470670 -133910 61473
11565 -202365 184452 60132 -192526 -261738 138342 120010 82583 -54758 -127500 -68460 321930
11553a03462A00279a86772D1083L85255B06050K9543G2810E234c59446h7257E3805
11541G4303K330P9247b5722E40773b23319b2607C47285G9009d4808B39812A03740
11529B84268f1052C97023H9961f1447L0249j02679A09765K13941b4968C7306J57956
11518A95262b00775G4914j6378K2538J00457K41318a15870L4031j09559D26790
11507a29976E0692O0875a38156E22106k40409q7358q4095R3794c24217I6341K54139
11496C50480I2565N8980b04299L7382A53571M0148G4186A558J20152j9202J23213
11485B25721q9195n8546g6654j07538A77746m8569a28651C30523c98386A5526
11474A64421J02054n9409H9954c79122B02512l8129o5054N5264k0724a03773a0276
$$ plain form
11553 -103462 100279 -186772 41083 426338 206050 235593 72810 5234 -359446 -87257 53805
11541 74303 76633 155880 -25722 540773 -223319 -22607 347285 79009 -44808 239812 103740
11529 284268 -61052 397023 89961 -61447 -31198 -133877 109765 323706 -24968 37306 195262
11518 195262 -200775 74914 58536 81074 181531 422849 -115870 -81839 -191398 426790
11507 -129976 50692 111567 -138156 522106 281697 194339 110244 204038 -324217 96341 350480
11496 350480 92565 151545 -204299 -166917 153571 193719 74186 1558 121710 102508 225721
11485 225721 136526 77980 -76654 -184192 177746 129177 -128651 330523 -398386 15526
11474 164421 266475 207066 89954 -379122 202512 164383 99329 154593 133869 -103773 -10276
11462A93975q6369a60739C5659O191c9141H5987K76297A79232C9993K25275a96131
11450D425J2741N8583J39665h945K558D69843e2698J640j90613F7484f7895p9308
11438a47203D5173g9193G6600J13130P8596J89060A40828j1308a30822A048J18680
11427A19728J82528L1932n0274b83483a0075j20096c2476A81224G0756N9784M9740
11416A80280a79010m3216G5425a18849m345I1625J54169a5937m11191a84237B69911
11404a77326A33057h6362k3227l8956a0514B83596A21970i33l57854A50099d15764
11392C41242j32305a83306P1234E9062c35913B58542j890b69200L6824D3385a54570
11380e2493A34990c70619c5594k08166A96491q4486b35321A23293K23117j29222
$$ plain form
11462 193975 107606 -160739 35659 41850 -39141 85987 362284 179232 39993 265268 -196131
11450 4425 17166 75749 215414 -8945 -6387 469843 -52698 -51058 -241671 67484 -67895 -147203
11438 -147203 45173 -79193 76600 189730 268326 457386 140828 129520 -130822 1048 119728
11427 119728 302256 334188 283914 -283483 -10075 -130171 -32476 181224 70756 130540 180280
11416 180280 -179010 -222226 75425 -118849 -123194 91625 245794 -15937 -427128 -184237 269911
11404 -177326 133057 -86362 -109589 -148545 -10514 283596 121970 -933 -358787 150099 -415764
11392 341242 208937 -183306 -112072 59062 -335913 258542 256652 -269200 -232376 43385 -154570
11380 -52493 134990 -370619 -35594 -243760 196491 112005 -235321 123293 346410 217188
11370B17188d5141A65922n1798J42146A00619l947h4621B12641a83450e7094G818
11358A62003E350c66312a09582d7627j46123A89495B7625c42065G4329A0821J40668
11347A51489d2198j00293m4973P1785b5579A15137f7439D8287D193a24542F2718
11335b92747a661A84345h6513m3332J9984F5922K44307A23166d2230p8321A3134
11323d98366A68325g0899j67882A93382e8334r0755a7927A00935c5526a6675k23052
11312b39727l1989o5512a5723r7814a2106C44896a33882b5516l8904F7235a98191
11300e5775B3368R371c10488C37053H7612j3914b4507E1192P3874a9248C43989
11288D6260K64970C7801J4669j1148b90112F8855b04159o9077F3232a19407l39229
$$ plain form
11370 217188 -45141 165922 114124 256270 100619 96672 -84621 212641 -183450 -57094 7818
11358 162003 5350 -366312 -109582 -47627 -193750 189495 27625 -342065 74329 10821 151489
11347 151489 -42198 -142491 -187464 -115679 -25579 115137 -67439 48287 4193 -124542 62718
11335 -292747 -1661 184345 -86513 -129845 -109861 65922 310229 123166 -42230 -120551 13134
11323 -498366 168325 -70899 -238781 193382 -58334 -149089 -17927 100935 -35526 -16675 -239727
11312 -239727 -271716 -337228 -15723 -113537 -12106 344896 -133882 -25516 -64420 67235 -198191
11300 -55775 23368 32739 -310488 337053 87612 73698 -24507 51192 125066 -19248 343989
11288 46260 311230 37801 52470 41322 -290112 68855 -204159 -273236 63232 -119407 -458636
11277d58636A9676i8558i56A86822a2389l04102a47299a9906N062E6220e9336
11265C5326a28669K8479F5933a97237J1304B4929b59399c6420F6857B2330a56259
11253a86259j62649B2140h1601l076K399o1536a0906G4150e7578J3161l21864
11242c66281J45994A33848O2171N8405c7331A13146l3920b84347J18602F1371
11231a43214j26496f3706k20185A45925D7758K5886J49224G3468b54065a23551
11220A02807A9803J29788J35748b17379l1566a21032b5362C280a17119j90641
11210c07760a13662B0909a84355h0107A8704L49186L705G0953a8503I8553b76673
11198a9804q4920m6356P0480j29685A53569a14368j16293B98962a81311B64154
$$ plain form
11277 -458636 19676 -98558 -956 186822 -12389 -316491 -147299 -19906 -14844 56220 -59336
11265 35326 -128669 -100190 65933 -197237 -185933 24929 -259399 -36420 66857 22330 -156259
11253 -186259 -348908 22140 -81601 -84677 -82278 -143814 -10906 74150 -57578 -44417 -366281
11242 -366281 -220287 133848 196019 254424 -37331 113146 79226 -284347 -165745 61371
11231 -143214 -269710 -63706 -283891 145925 47758 73644 222868 73468 -254065 -123551
11220 102807 19803 149591 285339 -217379 -248945 -121032 -25362 3280 -117119 -307760
11210 -307760 -113662 20909 -184355 -80107 18704 367890 371595 70953 -18503 98553 -276673
11198 -19804 -104724 -151080 -80600 -210285 153569 -114368 -230661 298962 -181311 264154
11187c11782a0427c451j33697J2400N5765A32104a10650J144D00958A19247l4401
11176H4846a82597J8456C8654a84815j92205h5721k9335d2366k33280B27681c98386
11164F6510O6477b71886A78954b17924f5903n388A19792E0554L0907e5008A94567
11152c17034A90780b3167j88140E0087J6847Q090a39298I805b4976B0243L1241
11141E1484b9097A09286R3224C3920b4342p8192A3763a77527q4783A02456f4025
11129B61596k5049A11375J16792C866c4807A77426g0844A40509K30727h8048b8473
11117D9102b23266D8979M1744J06213L502m6793J82099B6865c2780H5268J63233
11106B48501q8056b27361d0311A34395a39313B20371M2003H5129C734K30026J33973
$$ plain form
11187 -311782 -10427 -3451 -137148 -124748 -68983 132104 -110650 -109506 400958 119247 84846
11176 84846 -182597 -164141 38654 -184815 -377020 -85721 -115056 -42366 -275646 227681 -398386
11164 66510 132987 -271886 178954 -217924 -65903 -71291 119792 50554 81461 -55008 194567
11152 -317034 190780 -23167 -211307 50087 66934 75024 -139298 9805 -24976 20243 51484
11141 51484 -29097 109286 202510 33920 -24342 -102534 13763 -177527 -262310 102456 -64025
11129 261596 236547 111375 228167 3866 -34807 177426 -70844 140509 371236 -88048 -28473
11117 49102 -223266 48979 90723 196936 200438 153645 335744 26865 -32780 85268 248501
11106 248501 160445 -227361 -40311 134395 -139313 220371 262374 85129 3734 233760 367733
11095C67733A04184J0475L5481a48712l2C32905P9248j61764I0067M38405a92592
11083B00349L112b73501G6261N04091B40961j9608n1576M272l6182P9317o0531
11072A56653M8232N7510L7284m19A34653M7712J09253b3821D21670A82771J89865
11061C72636Q440P2078l8823O1285A93477K73466J68395k19044K03049M6300j53161
11050E12482J5601J13178J02647j48342R5686R1975l38019K54929L22990l63184
11040F59943R9953Q6600j61662Q0472m5291O191r6685J44094K4365l79297q14
11029D17869l2073N4429L11803j16873L25201D44207r0134K35079l1480J18743
11019F76415R1732C16837K14500j30169K98711B95829n7238L55929j1716K3510
$$ plain form
11095 367733 104184 114659 150140 -148712 -148744 332905 412153 250389 90067 528472 -192592
11083 200349 203461 -273501 76261 580352 240961 221353 169777 174049 137867 217184 156653
11072 156653 204885 262395 299679 299260 134653 182365 291618 -23821 421670 182771 372636
11061 372636 381076 453154 414331 475616 193477 466943 635338 416294 619343 665643 512482
11050 512482 528083 641261 743908 595566 691252 783227 445208 700137 1023127 659943
11040 659943 759896 846496 684834 765306 720015 726206 629521 773615 797980 418683 417869
11029 417869 385796 440225 752028 635155 960356 444207 354073 589152 557672 676415
11019 676415 768147 316837 531337 401168 699879 295829 238591 594520 582804 606314
11009F06314B26987K18433j94460L13760j39377N6196J09711r4274J43182j07815
10999E32343R7414J00694Q149C09439L52986o2480K23685k2481r9419j06482J59229
10988G54477L0015N1325m01630L57278R5602j66919K98621L02824n28071O00845
10978A394367k95534L03367M36914K87533O07805q8980J09221J49992k04831l1549
10968B668305p2071l75240j86429o54349j3612q6671L48478n08332R4749q0691
10958A134137J57603o9775k56345j81877j45391M6999r1528j0832m1713A88888
10947C72291q4083b3282D57348A00201J54034A07030J23608B3720b2428I489K14712
10936B24201g9992B73084a86111C9395b56163A28081n3379f9055B3883J46406
$$ plain form
11009 606314 226987 445420 250960 564720 425343 481539 591250 496976 640158 532343
10999 532343 629757 730451 738600 309439 662425 599945 823630 801149 701730 595248 754477
10988 754477 784492 835817 434187 791465 887067 720148 1018769 1321593 793522 1394367
10978 1394367 1098833 1402200 1839114 2126647 2734452 2645472 2754693 2904685 2699854 2668305
10968 2668305 2596234 2220994 2034565 1380216 1366604 1279933 1628411 1120079 1214828 1134137
10958 1134137 1291740 1221965 965620 783743 638352 685351 593823 582991 541278 188888
10947 372291 288208 -23282 457348 100201 254235 107030 230638 23720 -22428 9489 224201
10936 224201 -79992 273084 -186111 39395 -256163 128081 74702 -69055 23883 170289
10926A70289a33013k4832C37810i1667J7507H0892i0451j23021A75171g9860D1375
10914a43197b3855l38263A05122D2889K545N0438k7027a74672k15730B5928Q4263
10903A10191e7423A84926G8736a46075D18558j39035K8751a76651P750A65330
10892c04820A77969e2836o3029d7965B00907M8015a37724A29551a24098r7637
10882b21735g6728l464b312B49211b68142H3158C4813a31055h347m1040I4214
10870b2051j10862K4808L263A43777b78488A9952K58941c56034J23232a3820C3458
10858C6720a1947j29263C86830a7439j73944A64381N3652b38701a05698A6164
10847a49363B9842J9980a59647J9859M3285A00309d14815h6665A64975a84744
$$ plain form
10926 170289 -133013 -157845 337810 -91667 -74160 80892 -90451 -213472 175171 -79860 41375
10914 -143197 -23855 -362118 105122 42889 45434 95872 68845 -174672 -390402 25928 110191
10903 110191 -57423 184926 78736 -146075 418558 279523 308274 -176651 -168901 165330
10892 -304820 177969 -52836 -115865 -47965 200907 248922 -137724 129551 -124098 -221735
10882 -221735 -76728 -80192 -2312 249211 -268142 83158 34813 -131055 -8347 -49387 94214
10870 -22051 -132913 -108105 -104842 143777 -278488 19952 278893 -356034 -232802 -13820 33458
10858 36720 -11947 -141210 386830 -17439 -191383 164381 218033 -238701 -105698 16164
10847 -149363 29842 49822 -159647 -139788 -96503 100309 -414815 -86665 164975 -184744
10836a41986f6649q5728j30750a11349D6100J21053a77323a1864j50168K1234
10826a40798m0987N6342k40459I8072a98333N3054d7695A39089b50239B78587
10815D7642d73726A59996a57377A3019a20338D3292J4376q683a32138H993g8344
10803b63319P2760A35986i9853M7589A44176L8739k8216K91737b63121a8955j52045
10792a71000n7997N6093b7077A0272c9977o5027H264J55176J03069f7053k51788
10781c18841h5354C5308O1781P4679C5397c0497F010a47046l2738j25201J43445
10770a61540K5722D0599a3217k62195J13932B8589i570r7922k20723c2125k50085
10759b82210a06518B30653E7107Q6485n5875A8395a19508A45695j9297b1623k6903
$$ plain form
10836 -141986 -66649 -152377 -283127 -111349 46100 167153 -177323 -11864 -162032 -140798
10826 -140798 -181785 -125443 -365902 98072 -198333 -145279 -47695 139089 -250239 278587
10815 47642 -473726 159996 -157377 13019 -120338 43292 57668 48985 -132138 8993 -78344
10803 -263319 -190559 135986 -99853 -52264 144176 182915 154699 446436 -263121 -18955 -171000
10792 -171000 -228997 -172904 -27077 10272 -39977 -105004 8264 163440 266509 -67053 -318841
10781 -318841 -85354 35308 97089 171768 35397 -30497 6010 -147046 -179784 -304985 -161540
10770 -161540 -135818 40599 -13217 -275412 -161480 28589 -9570 -107492 -328215 -32125 -282210
10759 -282210 -106518 230653 57107 143592 87717 18395 -119508 145695 126398 -21623 -48526
10748d8526F631a6441F4548b74239a34677q9187H1725b4031n944r3600F5048B0581
10735b1148p3214o4040a394j37028K9472B45100A5129O7465c07335E9956a49765
10723C37347c92316g4573J5255k6639B79344a45697C5127e8256m10499i722q4610
10712i4332c977l5326d294A11966K15946b58568j4749C12470j50589a4537B43824
10700b11233G0812R6887a33995k6896a3922k74200C1042L61221r0507b07424A86036
10688g2162C2300b81222a09279K6174c7288A08276B5773j2467O1585FL32659a56540
10675F7608a00205C7735f5112k44181J22935A87794h7061l9295D0168K73938I007
10663C1703m29J44101C1265L41142E5603J00353A9273b91316R1482L0401g4718
$$ plain form
10748 -48526 6631 -16441 64548 -274239 -134677 -223864 81725 -24031 -29975 -123575 65048 20581
10735 -21148 -94362 -158402 -1394 -138422 -108950 245100 15129 82594 -307335 59956 -149765
10723 337347 -392316 -74573 -59318 -85957 279344 -145697 35127 -58256 -468755 -9722 -94332
10712 -94332 -3977 -39303 -4294 111966 327912 -258568 -273317 312470 161881 -14537 243824
10700 -211233 70812 167699 -133995 -160891 -13922 -288122 31042 392263 301756 -207424 186036
10688 -72162 32300 -281222 -109279 -83105 -37288 108276 25773 13306 74891 6 332665 -156540
10675 67608 -100205 37735 -65112 -309293 -186358 187794 -87061 -126356 40168 314106 9007
10663 31703 31274 175375 31265 372407 55603 155956 19273 -291316 -199834 -169433 -74718
10651b18974A09504J814E1279b54618q55A27822b03819P145c5264E2115g8214
10639b72718K7431n7987P0518J4855R6753d4620j11426H5830i375j95124B14144
10627C6K45994a6996k06127B36249m2841C3476J4077R2096R965a37625B25289
10615B1361L05290o5482c70397a02505j83037n9378a52578L5256E6123R4492b29646
10603i7423d8488j70869D4111C430b00678h3716I622a78222A2062K2711J3759
10592D8532a85284r765h9805r7307K1158h2008j86780i1657j35090c8786m7468
10581h6254C87925b30935e2881k3656o0885k73992a57225c8220F424N5649a8918
10569F584N9440N921h1614j72002J18710E0343j6106R2224b19662M603d0763A4693
$$ plain form
10651 -218974 109504 111318 51279 -254618 -255473 127822 -203819 -196674 -35264 52115 -78214
10639 -272718 -245287 -303274 -232756 -217901 -121148 -44620 -156046 85830 -9375 -204499 214144
10627 36 246030 -16996 -223123 236249 193408 33476 47553 139649 149614 -137625 225289
10615 21361 326651 261169 -370397 -102505 -285542 -344920 -152578 -117322 56123 150615 -229646
10603 -97423 -48488 -219357 44111 3430 -200678 -83716 9622 -178222 12062 34773 48532
10592 48532 -185284 -195049 -89805 -187112 -165954 -82008 -268788 -91657 -226747 -38786 -86254
10581 -86254 387925 -230935 -52881 -76537 -137422 -411414 -157225 -38220 6424 62073 -18918
10569 6584 66024 71945 -81614 -253616 -134906 50343 34237 126461 -219662 -215059 -40763 14693
10556b2838G4378e2754j27460Q2677j80956g5317j80495e1491K4608B46314G4856
10544b04552A10241m248E2286j4856d8053J4010H9975c09659B21879d4798G2498
10532H024a78521h3871D6068c00735O2289B71752j08437b24170J09130m909k48048
10521c67997E5288R2795m1034b53482d7A17763c21978D6823a24359K1466B45587
10509E893i4927G4523L01572a57213C37816B5103J08364a87338A51899b42658
10498A04725h3785M568B00630E2213a20179B48211b99069j03211n0697B29932
10487h1080K8372k46389i5711b426n1458k60114a4524E6524b2108B24881D1181
10475a73367k49819h2424L4688F9840a56868D3993e8556k36636D7066C771J81611
$$ plain form
10556 -22838 74378 -52754 -180214 -97537 -278493 -75317 -255812 -51491 -26883 246314 74856
10544 -204552 110241 105993 52286 37430 -48053 -34043 89975 -309659 221879 -44798 72498
10532 8024 -178521 -83871 46068 -300735 -238446 271752 163315 -224170 -115040 -119949 -367997
10521 -367997 55288 148083 107049 -253482 -47 117763 -321978 46823 -124359 -102893 245587
10509 5893 -94927 74523 376095 -157213 337816 25103 133467 -187338 151899 -242658
10498 104725 -83785 -79217 200630 52213 -120179 248211 -299069 -402280 -452977 229932
10487 -81080 -52708 -299097 -95711 -2426 -53884 -313998 -14524 56524 -22108 224881 41181
10475 -173367 -423186 -82424 -47736 69840 -156868 43993 -58556 -295192 47066 3771 185382
10464A85382C5002o954J3122a2484j81793B72131C82b48000G4309a63319A95254
10452D8551b66601A39133b25580G7179a60807e703k1271k06523a03347B65688
10441A9101O5653b6901H6682M8383b06734B25899f8723I8344a824k42068A65096
10429a10163K7064b0029j06204B61198l3424a84543b4990n9857J2352C28853o9568
10418B59285h2176B83479g7913j28052R4430j24234J00078A96027i5249H4449
10407a87174j84167C74868a95335C17276a85022A3791c7467c269o5206a2080A64901
10395C53843E5629M0051e0632j16805A21931L20078A54560M0758c0515A58752
10384D0335L25829a11963A5548b97623F5809K20540j27892L26538C9728L10146
$$ plain form
10464 185382 35002 28048 41170 -12484 -194277 272131 382 -248000 74309 -163319 195254
10452 48551 -266601 139133 -225580 77179 -160807 -5703 -26974 -233497 -103347 265688
10441 19101 84754 -26901 86682 135065 -206734 225899 -68723 98344 -1824 -243892 165096
10429 -110163 -83099 -20029 -126233 261198 227774 -184543 -24990 -84847 -72495 328853 259285
10418 259285 -82176 283479 -77913 -205965 -111535 -235769 -135691 196027 -95249 84449
10407 -187174 -371341 374868 -195335 317276 -185022 13791 -37467 -3269 -68475 -12080 164901
10395 353843 55629 95680 -50632 -167437 121931 442009 154560 195318 -30515 158752
10384 40335 366164 -111963 15548 -297623 65809 286349 158457 484995 39728 349874
10374C49874B4805J30056L3881E5783J08095J78598J05666O584j32878E0931K59772
10363C10703A45153J5192G3033k3658P7113P835O4629a09112C7859N69837I0514
10351F18436L65089l62366H8426K31370a20391d1650A52978K76656J34037A08077
10340E5368j9314K5285K23870L7375b96626g1556B5336J46438J00958g6928A55028
10328A84677R599n6634a3650A80941C671K31058p0738e5305A01392g0528E7559
10316E0108g1417k5135l1892j49103a13798G0534b16676B7025K49246b75642B09894
10304a93994J6559B97164B3248c53651B8010e6893B53582b99603A35219k1087
10294A14132n5904a83426A5748O2998a73075n7313B24158H5692b43785F5510a00143
$$ plain form
10374 349874 24805 154861 188742 55783 163878 342476 448142 454726 321848 50931 310703
10363 310703 145153 160345 73033 49375 126488 134323 198952 -109112 37859 607696 90514
10351 618436 983525 621159 88426 319796 -120391 -41650 152978 429634 563671 108077
10340 55368 36054 61339 285209 322584 -296626 -71556 25336 171774 272732 -76928 155028
10328 184677 194276 137642 -13650 180941 3671 234729 163991 -55305 101392 -70528 57559
10316 50108 -71417 -96552 -128444 -277547 -113798 70534 -216676 27025 276271 -275642 209894
10304 -193994 -177435 297164 23248 -353651 28010 -56893 253582 -299603 135219 114132
10294 114132 58228 -183426 15748 78746 -173075 -230388 224158 85692 -243785 65510 -100143
10282A0014K39993h6471n8490M2431l8012r2555A51314h0035k3560d4798j46202
10271a91000A13058n6507J3660a18461H9430b32454Q1880B54488a08289b4045
10260a35256J8769A13437a01376B50420P082J14055I0928k8759j9392J3914R1654
10249A48345M950A1659a77240B88982I7855k9617a83914l32699B6354b53369P7397
10238a75972A33079L762g3297q001L9427A43728g3158L3674A5718K48047a75165
10226c28286H733O0518E206h2062n1890j19808f6279j15984D6740L08318g4943
10214C3264b29626P5678l8540l39592b44760B66149d0530C30165d0807l04168
10204c44975g3931L1016F673J6301c06615C5997a65760r3344b6781m6849k0818
$$ plain form
10282 10014 250007 -86471 -144961 -102530 -140542 -233097 151314 -80035 -103595 -44798 -191000
10271 -191000 113058 56551 70211 -118461 89430 -232454 -150574 254488 -108289 -24045
10260 -135256 -116487 113437 -101376 250420 257502 371557 90928 62169 42777 56691 148345
10249 148345 153295 11659 -177240 288982 97855 68238 -183914 -516613 26354 -253369 -175972
10238 -175972 133079 136841 -73297 -81298 -41871 143728 -73158 -39484 15718 263765 -175165
10226 -328286 8733 69251 5206 -82062 -133952 -253760 -66279 -182263 46740 355058 -74943
10214 33264 -229626 -153948 -192488 -532080 -244760 266149 -40530 330165 -40807 -344975
10204 -344975 -73931 -42915 6673 22974 -306615 35997 -165760 -259104 -26781 -73630 -94448
10193i4448B09851b35707A50657b77791a22238r2509I4970a08015b6814j19694
10183a46508B28535D4524J50537i9594b3193A20064e3422j60909B20010a24771
10172a27218A12731C6177e251j09916B69232a91100L4766j3373b4192A39233g7246
10160I8070a46020B70615b67375i4082M904A32124b86405A30740l3949a1607k37634
10149b49241h0696G7080b32392A290a31476A7659b35392a5300l37360A68662b340
10137A15137g8328k32589A1445K16422c28818k97779a5466G8302L1689a10539
10126E6857J81394D4846a56452L3882n3241A05361F71R8004c09877E6779a13808
10114c9245H9853h9494A962b75661J30686F6931b06712A94205a7275k65126B01193
$$ plain form
10193 -94448 209851 -235707 150657 -277791 -122238 -214747 94970 -108015 -26814 -146508
10183 -146508 228535 44524 195061 -99594 -23193 120064 -53422 -214331 220010 -124771
10172 -127218 112731 36177 -5251 -115167 269232 -191100 -156334 -169707 -24192 139233 -77246
10160 98070 -146020 270615 -267375 -94082 -89178 132124 -286405 130740 96791 -11607 -249241
10149 -249241 -80696 77080 -232392 1290 -131476 17659 -235392 -15300 -352660 168662 -2340
10137 115137 -78328 -310917 11445 227867 -328818 -626597 -15466 78302 109991 -110539
10126 56857 238251 44846 -156452 -122570 -175811 105361 671 98675 -309877 56779 -113808
10114 -39245 89853 -89494 1962 -275661 -144975 66931 -206712 194205 -17275 -282401 201193
10102b07872A67980B855a77674J6681e9198k59330h3655q7301e7515A32071c9900
10090a17277A76427F4025i6371D5986A9995P1926a34747E6741f653G7904c30374
10078i4969M0828o1608p7737I81b49427R7077e2624q138K9274A16333L1779R0163
10066B38275H9204a54854A07870a39344A17827B399d5332p3078o069j96629e3622
10054G5249a40306k16689n777B29840b14111a05470A97372b25926g212A41150
10043c59885J30596O3218b0347A08289h4498A66090b74048i3254E1037b27235
10032A84653a90208c2947j19404D2405k472L3571M594a0795k76609C9629M15926
10021D55555g1783n2344A19543a56192m7548B7775a79261k11552a38361L7551
$$ plain form
10102 -207872 167980 2855 -177674 -160993 -59198 -318528 -83655 -170956 -57515 132071 -39900
10090 -117277 176427 64025 -96371 45986 19995 91921 -134747 56741 -6653 77904 -330374
10078 -94969 -54141 -115749 -193486 981 -249427 -152350 -52624 -60762 -31488 116333 148112 238275
10066 238275 89204 -154854 107870 -139344 117827 2399 -45332 -118410 -124479 -321108 -53622
10054 75249 -140306 -356995 -362772 229840 -214111 -105470 197372 -225926 -7212 141150
10043 -359885 -229289 -166071 -20347 108289 -84498 166090 -274048 -93254 51037 -227235
10032 184653 -190208 -32947 -152351 42405 39933 73504 78098 -10795 -287404 39629 455555
10021 455555 -71783 -124127 119543 -156192 -203740 27775 -179261 -390813 -138361 -100810
10011a00810A3983g7862d063A2772K44343f595A45635a04255C52811F2970l886
10000E9084O4296d3144A38427h0853a5109r7790L1698B14734A5449i8004j19757
9989b17761J04871A25027g960l5258O908L136p9468l24067b09639C41941c20470
9977d4464j53566n73945G8369M7027C5063b32620C6667R8499A9077b05100M8143
9966a56957B6917J0177h1829G3068a09779A22281f0297A1666i4557j0921j40607
9955b46085A00710f7594J5369j97768O2831H8593a58269a6114l59503C09889a92079
9943d03719J88462B52426Q4144a26477k6962A78131a99410e0702j185g424j8020
9932b5444j4928B07430h5277G67K03640E6665m623a92605g0786L4398A91358a1406
$$ plain form
10011 -100810 13983 -77862 -4063 12772 257115 -6595 145635 -104255 352811 62970 59084
10000 59084 123380 -43144 138427 -80853 -15109 -112899 -81201 214734 15449 -98004 -217761
9989 -217761 -112890 125027 -7960 -43218 -36310 -33174 -112642 -436709 -209639 341941 -320470
9977 -44464 -198030 -771975 78369 125396 35063 -232620 36667 135166 19077 -205100 -156957
9966 -156957 26917 37094 -81829 73068 -109779 122281 -60297 11666 -94557 -105478 -246085
9955 -246085 100710 -67594 -52225 -249993 -187162 88593 -158269 -16114 -375617 309889 -192079
9943 -403719 -215257 252426 336570 -126477 -153439 178131 -199410 -50702 -51887 -7424 -25444
9932 -25444 -40372 207430 -85277 767 204407 56665 52042 -192605 -70786 -36388 191358 -11406
9919E8802b5063a1398j61755k98749a0397C9554a578B33585c54348g7852j87780
9908b65632A40805b33117K0845I5707e1701j01598E9952f4724K7467A59378D3545
9896a01578B10737d1599A03459a43214a951B4938a7980j25679r4756j9830D0564
9884a85163O5800r7091B03098j5774q2241f3117M147j9774k6882j42539A6693
9872g8357C16056a73673Q2165j0883A2876a33541k89943P7129i6392K8585a5004
9860a6379k24710J4140J03104l07404c844B04066g6534F648J06724b26045f2142
9848A6011n324i5120a0066n4208B3055a05276m0287A2051a13895A17297d50564
9836e5092b4092k25834a16654C45832d0856j85450n9093A08737a7943k26041B19922
$$ plain form
9919 58802 -25063 -11398 -173153 -471902 -10397 39554 -1578 233585 -354348 -77852 -265632
9908 -265632 140805 -233117 -212272 95707 -51701 -153299 59952 -64724 -37257 159378 43545
9896 -101578 210737 -41599 103459 -143214 -1951 24938 -17980 -143659 -238415 -258245 40564
9884 -185163 -119363 -216454 203098 187324 105083 -63117 -58970 -78744 -105626 -248165 16693
9872 -78357 316056 -173673 -91508 -102391 12876 -133541 -423484 -346355 -96392 -67807 -15004
9860 -16379 -241089 -226949 -123845 -431249 -3844 204066 -76534 6648 113372 -226045 -62142
9848 16011 10687 -95120 -10066 -64274 23055 -105276 -145563 12051 -113895 117297 -450564
9836 -55092 -24092 -249926 -116654 345832 -40856 -226306 -285399 108737 -17943 -243984 219922
9824b10672i0428J5426B3999d4996l42976B09016F6866k9650a07981R931j72414
9813b70464B8322i1631L4354j06716A83311a59902d2714H9045b51571i7615D1661
9801E8532a9705k5819D91632E5958a80621B84382f5726l55791h9885n4108L2118
9790a11875M7823B0481c15466C89402c29837D9936K4645c31177J09749e8140P693
9779e0447B08137a36412j1344j21234k23015I9387d0549A10565a68904j57040
9769c25944a35998N0673n6443k29420B03288j1661b44153L526Q2298G3308J30770
9758B04078a8281l52264A5435J08480h9481m2659H8181a11656j01444B79540b08631
9746g9307b3567B0593h1989A56362b51428f9696k65312B26249A3329a2251l98036
$$ plain form
9824 -210672 -90428 -75002 23999 -44996 -387972 209016 66866 37216 -107981 -98050 -270464
9813 -270464 28322 -91631 -57277 -163993 183311 -159902 -42714 89045 -251571 -97615 41661
9801 58532 -19705 -45524 491632 55958 -180621 284382 -65726 -421517 -89885 -143993 -111875
9790 -111875 -64052 20481 -315466 389402 -329837 49936 74581 -331177 -221428 -58140 -50447
9779 -50447 208137 -136412 -147756 -268990 -492005 99387 -40549 110565 -168904 -325944
9769 -325944 -135998 -85325 -141768 -371188 203288 191627 -244153 -240627 -158329 73308 204078
9758 204078 -18281 -370545 15435 123915 -89481 -132140 88181 -111656 -213100 279540 -208631
9746 -79307 -23567 20593 -81989 156362 -251428 -69696 -335008 226249 13329 -12251 -410287
9735d10287B88872b91786a45801A94938e6823o085A73079D4619O388J56460b03462
9723a5872o7593A14503B9052K82473C6768c36858a62251M8370A11745h5409b4521
9711a40921N5064C418f8871A03587e4427l79044D8304e278A06347c70399J09097
9700b61302a04232d3211A08566a99773f5981K265O576b0301D1020a45299J4679
9689a30620k5268k24108J63499h9928L9196A19909a35010B52208b09612B59987
9678c50799C7975a02100j05873O5482C10590a09466B7422d7500l38959b5861k12089
9667b37950o5891B5005b00214r4303q6j42865b02696c0088R779j11091A20972
9655A37506a10253g339j70852b3610j57194q1435e3151A4997f5824k16197B6451
$$ plain form
9735 -410287 288872 -291786 -145801 194938 -56823 -62908 173079 44619 51007 207467 -203462
9723 -15872 -83465 114503 29052 311525 36768 -336858 -162251 -113881 111745 -85409 -24521
9711 -140921 -85857 3418 -68871 103587 -54427 -433471 48304 -5278 106347 -370399 -261302
9700 -261302 -104232 -43211 108566 -199773 -65981 -63716 -57140 -20301 41020 -145299 -130620
9689 -130620 -155888 -379996 -216497 -89928 -50732 119909 -135010 252208 -209612 259987
9678 -350799 37975 -102100 -207973 -142491 310590 -109466 27422 -47500 -386459 -25861 -237950
9667 -237950 -303841 25005 -200214 -294517 -294603 -437468 -202696 -30088 -20309 -131400 120972
9655 137506 -110253 -7339 -178191 -23610 -180804 -262239 -53151 14997 -65824 -282021 26451
9643A46239A7365K8895j2797J54468b51786B73605J701F3991i8816j22885c0614
9631F8087a28983l4967O6659O615q3735j00526a4098l54747d1750H6710K60076
9620C46786e5126a8746C14749e8365j16682A21515b76022p4272n8330J23965D05761
9608b70037l3285A48650a42329j73774J29305i19G7189a92588j4955A85601o4343
9597A21258a3025l06260A5455K43010a08604j7715H7652g7098A61830f5267A37501
9585A44189l3482a81296j12164a13472B10540h6334c9934m07230a91572C7444
9574a99667b9662j34406M0566j04473a3110l7688h414r8311k59775J65941O5400
9563a35159a8177G0016a02576c8020j63826B7385c6397l8840c7217g631A12227
$$ plain form
9643 146239 17365 46260 33463 187931 -251786 273605 275306 63991 -98816 -221701 -30614
9631 68087 -128983 -163950 -97291 -90676 -174411 -274937 -14098 -368845 -41750 86710 346786
9620 346786 -55126 -18746 314749 -58365 -175047 121515 -276022 -350294 -408624 -284659 405761
9608 -270037 -303322 148650 -142329 -316103 -186798 -919 77189 -192588 -207543 185601 121258
9597 121258 -13025 -319285 15455 258465 -108604 -126319 87652 -77098 161830 -65267 137501
9585 144189 110707 -181296 -293460 -113472 210540 -86334 -39934 -447164 -191572 37444
9574 -199667 -29662 -164068 -123502 -227975 -13110 -50798 -8414 -106725 -366500 -200559 -135159
9563 -135159 -18177 70016 -102576 -38020 -201846 27385 -36397 -75237 -37217 -7631 112227
9551c11895a35937N4845m74507h6471L4792g415k28237J16341B9497I786d03663
9539i1807J5838n8566c3030n4145j14104h1580a2574r9466E2724a25256k3781
9528a49037A17304a52640A95952i3310m8298J3082c6631D04645A35565a88479
9517A2520J3753d03804a09392p6007B08236n915a92675B70534a93969A28663a0592
9505h3681o4217d5405k15967n285A4160J49823L3567a8760D5159j8046i1427H7282
9492b46473B12093e6930A5873g1731k81870i9284l580C8836b92296G4149J23241
9481A97390b28675A3401a18358k66150E1001a53464A98988A6398h2103D492a69083
9469A30578a6465I68J4482a087C72356b2419C74157c8898k16212I1485B4277F518
$$ plain form
9551 -311895 -135937 -81092 -555599 -86471 -51679 -7415 -235652 -119311 29497 9786 -403663
9539 -91807 -75969 -134535 -33030 -87175 -201279 -81580 -12574 -112040 52724 -125256 -149037
9528 -149037 117304 -152640 195952 -93310 -141608 -128526 -36631 404645 135565 -188479
9517 12520 26273 -403804 -109392 -185399 208236 202321 -192675 270534 -193969 128663 -10592
9505 -83681 -147898 -45405 -261372 -266657 14160 163983 197550 -18760 45159 27113 -91427 87282
9492 -246473 212093 -56930 15873 -71731 -353601 -99284 -102864 38836 -292296 74149 197390
9481 197390 -228675 13401 -118358 -384508 51001 -153464 198988 16398 -82103 4492 -169083
9469 130578 -16465 968 15450 -1087 372356 -22419 374157 -38898 -255110 91485 24277 6518
9456B17905a50597O2762l71503g7244E411a67547b3441j70645B07618P0380a87995
9444A4226e1231p1151k56848d9061b022k54682c8469n2451i51k55730A07277a92477
9431a17699b5550F8883c20541G585M6494b220m04840a89345l4607G642b81586
9419C71976a15441C8427J34578b14879C295b5462r1551p2734m707L1003A04344
9407b27517B70468J6129q7701d6236A67031L826C7670a81426f025k09486d0334
9395A74239J21770j03939a47398d3630a3877B11828a45535g1011b6861J2352E3511
9383d2405O099J2174q6970b4213G5308h1326l2915f097j26970o4629k6037J01824
9371a21909A72172a23407G4204a29623j25992A92085c96450i9749A45312G971
$$ plain form
9456 217905 -150597 -87835 -459338 -77244 5411 -167547 -23441 -194086 207618 277998 -187995
9444 14226 -51231 -122382 -379230 -49061 -2022 -256704 -38469 -90920 -951 -256681 107277 -192477
9431 -117699 -25550 68883 -320541 7585 54079 -2220 -407060 -189345 -223952 7642 -281586
9419 371976 -115441 38427 173005 -214879 3295 -25462 -117013 -189747 -194454 -163451 104344
9407 -227517 270468 286597 198896 -46236 167031 170857 37670 -181426 -6025 -215511 -40334
9395 174239 296009 192070 -147398 -43630 -13877 211828 -145535 -71011 -26861 -14509 53511
9383 -42405 -36306 -24132 -111102 -24213 75308 -81326 -114241 -6097 -133067 -197696 -223733 -121909
9371 -121909 172172 -123407 74204 -129623 -255615 192085 -396450 -99749 145312 7971
9360b52589P0089j36181j6972J11710B16488b84134A1009Q3843a94835j15177
9350c10012j4535h9088j81821C838J10366c00634B1863M12607D4314b48449j3905
9339b62354J03032m00052K59552e6224G1606J40386e4849a9757B8258h7538A56856
9327I0452a25396O1811o8036N4575K5983K3150m6738E3080O6904a1287B36680
9315d19818G6393J7723d4493l6825C61900b74559g0470b8613e981I4955b14527
9303b98608n802a41289C1365b74105h7105k77692C1932J85147a96370Q7572m6321
9292a55119F7878b04065b4249R238p9761A6006J62638d6610k54878e7148j47224
9281b04372G1719b27096B38075m1514a87838c3859m9751p722m8610e095k30304
$$ plain form
9360 -252589 -182500 -318681 -335653 -223943 216488 -284134 11009 94852 -194835 -310012
9350 -310012 -324547 -89088 -270909 3838 114204 -300634 21863 434470 44314 -248449 -262354
9339 -262354 -159322 -559374 -299822 -56224 71606 211992 -54849 -19757 28258 -87538 156856
9327 90452 -125396 -63585 -131621 -77046 -51063 -27913 -74651 53080 119984 -11287 236680
9315 -419818 76393 94116 -44493 -81318 361900 -274559 -70470 -28613 -5981 94955 -214527
9303 -298608 -304410 -141289 31365 -274105 -87105 -364797 31932 217079 -196370 -108798 -155119
9292 -155119 67878 -204065 -24249 -15011 -94772 16006 178644 -46610 -301488 -57148 -204372
9281 -204372 71719 -227096 238075 196561 -187838 -33859 -83610 -91332 -139942 -5095 -235399
9270b35399J3660B6683b08555g8383H144L3025a09109L9347C1964N1676d18221
9258C6896N6367f5486G5090d2338D2911e3860H7574a69486k45406a87916k7238
9247b15154k1770B3577d12442a41071M2321A21196J45222b85485N6611A7156q546
9236H610a20747j34709a27046M4307B55255a68224J3015E4800L4720a39806l3237
9225a73043D366K62608c81488J57854B30467A05820c56553J30640G9021f5979
9214c5603j44556Q1659k60509A54191K22397A79370D9128N5802i3004r8813I7108
9202A22653a77293I9700i7993A88542J81746A27380g6289p3763J1838B09278F4267
9190c29931j83992K14439A14348a40569l19751A34449h810D4440P6490b60616
$$ plain form
9270 -235399 -221739 26683 -208555 -78383 8144 41169 -109109 -69762 31964 83640 -418221
9258 36896 93263 -65486 75090 -42338 42911 -53860 87574 -169486 -414892 -187916 -215154
9247 -215154 -236924 23577 -412442 -141071 -98750 121196 266418 -285485 -228874 17156 8610
9236 8610 -120747 -255456 -127046 -82739 255255 -168224 -155209 54800 89520 -139806 -173043
9225 -173043 4366 266974 -381488 -223634 230467 105820 -356553 -225913 79021 -65979
9214 -35603 -180159 -98500 -359009 154191 376588 179370 49128 104930 -93004 -191817 97108
9202 122653 -177293 99700 -97993 188542 370288 127380 -76289 -150052 -138214 209278 64267
9190 -329931 -513923 -299484 114348 -140569 -460320 134449 -8810 44440 120930 -260616
9179b23978C89870b63321i5135m4460a1964j04686K273L2300A48094j364H060
9167B2484h3569A41516i8044B38601c42017Q7740A76236o6320e3679j37306r5216
9156b86201A47400b29424I6931c41254B4182a99228B21674b89896d8881C5535
9145b65206B72081a73635j11898E5507b81344A3261a61533D5050b83035g8987
9134a70941D6892c93600A1771b57436j59423a74706A26537i069j18535f0350j29143
9123a89493A10350b16692G0165b30939N5571N6799L9069j0977D7743e5654H7780
9111b6264p4229k28028J13937K0055g1281l18178B70019F7172F693R4265b7688
9099C6892L02104a60185A2148a273k13739K1837r0104J22475b1722P771A02938
$$ plain form
9179 -223978 389870 -263321 -95135 -139595 -11964 -116650 -114377 -82077 148094 146730 8060
9167 22484 -83569 141516 -98044 238601 -342017 -254277 176236 109916 -53679 -190985 -286201
9156 -286201 147400 -229424 96931 -341254 24182 -199228 221674 -289896 -48881 35535
9145 -265206 272081 -173635 -285533 55507 -281344 13261 -161533 45050 -283035 -78987
9134 -170941 46892 -393600 11771 -257436 -416859 -174706 126537 -9069 -127604 -60350 -189493
9123 -189493 110350 -216692 70165 -230939 -175368 -118569 -79500 -90477 47743 -55654 87780
9111 -26264 -100493 -328521 -214584 -194529 -71281 -389459 270019 67172 6693 100958 -27688
9099 36892 338996 -160185 12148 -1273 -215012 -193175 -283279 -160804 -21722 -13951 102938
9087A68798i1098G5319d9715A28653b33703A22180a12841l6816I9301f9432m7013
9076a16445A00194b04384N9366j00382A87244O140b31485n9049A95836b76460
9065b31177d724k08900E1150J00695P1107E3893i9823B15549B899J47205f5645
9053A50076k6282M86508k95646a43827j51843a15721j16434A98438b40374G9021
9042C15986c34455C4148e6329e255k41235D7633q57g0112q6252C6206M9362i0135
9029c9283b785A39103E3575g4447K568l05549b4517n290j05020c1157G5346b31017
9016A92587l9040F2785b64693a3163A7289k141J64104c76332a27318q3988c9708
9004g7130B76176a14406B61650i9988L0560r2368a3044C73004b70607B85614A0430
$$ plain form
9087 168798 -91098 75319 -49715 128653 -233703 122180 -112841 -149657 99301 -69432 -116445
9076 -116445 100194 -204384 -145018 -245400 187244 193384 -231485 -290534 195836 -276460
9065 -231177 -4724 -213624 51150 151845 222952 53893 -99823 215549 2899 150104 -65645
9053 150076 123794 610302 314656 -143827 -295670 -115721 -232155 198438 -240374 79021
9042 315986 -334455 34148 -56329 -5255 -246490 47633 46776 -70112 -156364 36206 85568 -90135
9029 -39283 -2785 139103 53575 -74447 -71879 -377428 -24517 -29807 -134827 -31157 75346 -231017
9016 192587 153547 62785 -264693 -13163 17289 15148 179252 -376332 -127318 -211306 -39708
9004 -77130 276176 -114406 261650 -99988 -69428 -161796 -13044 373004 -270607 285614 10430
8992i3443c1043m7967H5627a34517k78842a18642j10525j75849a71668l54852
8982e26520J84102A58837G060b60698j03806J60867A79332p764B4730h6307H2146
8970e2136a8201j32242j12390f0349G2980e0297A75880d5889j36404d4116n9630
8959a03746m5354k02029a05496I8314b10300A96532g6698p4641G4106j9890b00319
8947c3450E136M4459L6237k1680A9251a16948l2970C5592R7204a57847a3208j3301
8935b6509B13054J16045A48862c4139o0626D2300a38349D08591d58446A25228
8924B5070M74957J731711M091520M64834A456940C53301r9209j10640P8201c9724
8913g322B77364A34716C8512a78353a6795A90303K66061A31563i9711D1585A5458
$$ plain form
8992 -93443 -31043 -79010 85627 -134517 -413359 -118642 -229167 -405016 -171668 -526520
8982 -526520 -342418 158837 7060 -260698 -364504 -203637 179332 171568 24730 -86307 82146
8970 -52136 -18201 -150443 -262833 -60349 72980 -50297 175880 -45889 -182293 -44116 -103746
8959 -103746 -149100 -351129 -105496 98314 -210300 196532 -76698 -151339 74106 54216 -200319
8947 -33450 5136 49595 85832 64152 19251 -116948 -149918 35592 132796 -157847 -13208 -26509
8935 -26509 213054 329099 148862 -34139 -94765 42300 -138349 408591 -458446 125228
8924 25070 500027 2231738 6323258 6788092 1456940 353301 254092 143452 221653 -39724
8913 -7322 277364 134716 38512 -178353 -16795 190303 456364 131563 -99711 41585 15458
8901C21190J4450a9886E1336a67249i603j21709J8515k973M1001j796j78441J17329
8889a37677M5499l9026a896G4302c7057j9309G1705k1241a68675Q0082A0404J71523
8877A81927d7760C51109j48495J305P8241B0588h5260C2368a09764m0581H9550
8865b76956J38254a4856A33371B7824b22924B2367a82564N2598b0110A38374n2876
8854H5498O9719a58519A39374f1093n7405o2208j20172a14371D6766j8778g696
$$ plain form
8901 321190 335640 -19886 51336 -167249 -9603 -131312 -112797 -115770 -74769 -76565 -255006 -137677
8889 -137677 -92178 -131204 -1896 74302 -37057 -56366 71705 50464 -168675 -88593 10404 181927
8877 181927 -47760 351109 202614 203919 282160 20588 -85260 32368 -109764 -150345 89550
8865 -276956 -138702 -14856 133371 27824 -222924 22367 -182564 -129966 -20110 138374 85498
8854 85498 155217 -158519 139374 -61093 -118498 -180706 -300878 -114371 46766 27988 -7696
$$ [...]
##END NTUPLES=NMR SPECTRUM
##END=
