
##TITLE=AC1256_INDRH11073_6533999_sNlIztne0f
##JCAMPDX= 6.0         $$ Bruker NMR JCAMP-DX V2.0
##DATA TYPE= NMR SPECTRUM
##DATA CLASS= NTUPLES
##ORIGIN= BRUKER
##OWNER= Administrator
$$ 1.72 TOPSPIN		Version 2.1
$$ 2012-12-14 03:25:07.294 -0500  Administrator@X
$$ Compression mode = diff/dup
##.OBSERVE FREQUENCY= 400.02188249412
##.OBSERVE NUCLEUS= ^1H
##.ACQUISITION MODE= SIMULTANEOUS (DQD)
##.ACQUISITION SCHEME= undefined
##.AVERAGES= 64
##.DIGITISER RES= 22
##SPECTROMETER/DATA SYSTEM= spect
##.PULSE SEQUENCE= noesygpps1d.comp
##.SOLVENT NAME= COFFEE_meoh
##.SHIFT REFERENCE= INTERNAL, COFFEE_meoh, 1, 14.96088
##AUDIT TRAIL= $$ (NUMBER, WHEN, WHO, WHERE, PROCESS, VERSION, WHAT)
$$ ##TITLE= Audit trail, TOPSPIN		Version 2.1
$$ ##JCAMPDX= 5.01
$$ ##ORIGIN= Bruker BioSpin GmbH
$$ ##OWNER= Administrator
$$ $$ E:\/data/COFFEE/nmr/AC1256_INDRH11073_6533999_sNlIztne0f/22/pdata/1/auditp.txt
$$ ##AUDIT TRAIL=  $$ (NUMBER, WHEN, WHO, WHERE, PROCESS, VERSION, WHAT)
(   1,<2012-12-14 03:25:01.466 -0500>,<Administrator>,<X>,<go>,<TOPSPIN 2.1>,
      <created by zg
	started at 2012-12-14 03:13:31.450 -0500,
	POWCHK enabled, PULCHK disabled,
       configuration hash MD5:
       86 BA 57 50 F2 9D 5C 9B 26 00 A9 28 5F 66 2E 89
       data hash MD5: 64K
       49 67 74 1F 0A 58 10 6D 02 80 56 9B 2D E1 0A 9A>)
(   2,<2012-12-14 03:25:04.591 -0500>,<Administrator>,<X>,<proc1d>,<TOPSPIN 2.1>,
      <Start of raw data processing
       efp LB = 0.3 FT_mod = 6 PKNL = 1 PHC0 = 0 PHC1 = 0 SI = 128K 
       data hash MD5: 128K
       D5 D8 16 0D 3E 7B CD E2 95 B8 A9 AE FC 7F DF A1>)
(   3,<2012-12-14 03:25:05.653 -0500>,<Administrator>,<X>,<proc1d>,<TOPSPIN 2.1>,
      <pk PHC0 = -76.80542 PHC1 = 0 
       data hash MD5: 128K
       3C 4A 8D F5 49 4B 11 01 42 76 0E 5D 6E 48 76 72>)
(   4,<2012-12-14 03:25:06.325 -0500>,<Administrator>,<X>,<proc1d>,<TOPSPIN 2.1>,
      <abs ABSG = 1 
       data hash MD5: 128K
       B2 A8 14 EE 5D 0F 52 98 53 15 1F 3A 31 F3 1A 49>)
(   5,<2012-12-14 03:25:06.497 -0500>,<Administrator>,<X>,<proc1d>,<TOPSPIN 2.1>,
      <abs ABSG = 2 
       data hash MD5: 128K
       8C DC 6B 9C 73 40 25 42 C9 3B 32 9F 60 82 24 56>)
(   6,<2012-12-14 03:25:06.685 -0500>,<Administrator>,<X>,<proc1d>,<TOPSPIN 2.1>,
      <abs ABSG = 3 
       data hash MD5: 128K
       0F 79 B7 AB 0F C4 80 C7 9C D3 5B AF 09 76 89 DE>)
(   7,<2012-12-14 03:25:06.825 -0500>,<Administrator>,<X>,<proc1d>,<TOPSPIN 2.1>,
      <abs ABSG = 4 
       data hash MD5: 128K
       F9 1B 38 E6 A3 72 88 45 04 D8 C8 D4 47 0D FF 9E>)
(   8,<2012-12-14 03:25:06.966 -0500>,<Administrator>,<X>,<proc1d>,<TOPSPIN 2.1>,
      <abs ABSG = 5 
       data hash MD5: 128K
       4C 2B FC 04 47 6A B3 E9 5E 89 18 1D 6C 69 36 1D>)
$$ ##END=
$$ 
$$ $$ hash MD5
$$ $$ 11 43 CF 48 84 E4 98 1A 49 23 5E BC ED 49 41 AD
##$RELAX= 
##$RELAX= 
##$RELAX= 
##$RELAX= 
##$RELAX= 
##$RELAX= 
##$RELAX= 
##$RELAX= 
$$ Bruker specific parameters
$$ --------------------------
##$DU= <E:\>
##$EXPNO= 22
$$ [...]
##$TP07= 0
##$TPNAME0= <>
##$TPNAME1= <>
##$TPNAME2= <>
##$TPNAME3= <>
##$TPNAME4= <>
##$TPNAME5= <>
##$TPNAME6= <>
##$TPNAME7= <>
##$TPOAL= (0..7)
0.5 0.5 0.5 0.5 0.5 0.5 0.5 0.5
##$TPOFFS= (0..7)
0 0 0 0 0 0 0 0
##$TUNHIN= 0
##$TUNHOUT= 0
##$TUNXOUT= 0
##$USERA1= <user>
##$USERA2= <user>
##$USERA3= <user>
##$USERA4= <user>
##$USERA5= <user>
##$V9= 5
##$VALIST= <valist>
##$VCLIST= <CCCCCCCCCCCCCCC>
##$VD= 0
##$VDLIST= <DDDDDDDDDDDDDDD>
##$VPLIST= <PPPPPPPPPPPPPPP>
##$VTLIST= <TTTTTTTTTTTTTTT>
##$WBST= 1024
##$WBSW= 4
##$XGAIN= (0..3)
0 0 0 0
##$XL= 0
##$YL= 0
##$YMAX_a= 5916094
##$YMIN_a= -12024182
##$ZGOPTNS= <>
##$ZL1= 120
##$ZL2= 120
##$ZL3= 120
##$ZL4= 120
##$ABSF1= 14.96088
##$ABSF2= -5.597301
##$ABSG= 5
##$ABSL= 3
##$ALPHA= 0
##$AQORDER= 0
##$ASSFAC= 0
##$ASSFACI= 0
##$ASSFACX= 0
##$ASSWID= 0
##$AUNMP= <proc_prof1d_extract.lims>
##$AXLEFT= 0
##$AXNAME= <>
##$AXNUC= <1H>
##$AXRIGHT= 0
##$AXTYPE= 0
##$AXUNIT= <>
##$AZFE= 0.1
##$AZFW= 0.1
##$BCFW= 0
##$BC_mod= 0
##$BYTORDP= 0
##$COROFFS= 0
##$CY= 15
##$DATMOD= 1
##$DC= 0
##$DFILT= <>
##$DTYPP= 0
##$F1P= 0
##$F2P= 0
##$FCOR= 0.5
##$FTSIZE= 131072
##$FT_mod= 6
##$GAMMA= 0
##$GB= 0
##$INTBC= 1
##$INTSCL= 1
##$ISEN= 128
##$LB= 0.3
##$LEV0= 0
##$LPBIN= 0
##$MAXI= 10000
##$MC2= 0
##$MEAN= 0
##$ME_mod= 0
##$MI= 0
##$NCOEF= 0
##$NC_proc= -2
##$NLEV= 6
##$NOISF1= 0
##$NOISF2= 0
##$NSP= 0
##$NTH_PI= 0
##$NZP= 0
##$OFFSET= 14.96088
##$PC= 1
##$PHC0= -76.80542
##$PHC1= 0
##$PH_mod= 1
##$PKNL= yes
##$PPARMOD= 0
##$PPDIAG= 0
##$PPIPTYP= 0
##$PPMPNUM= 2147483647
##$PPRESOL= 1
##$PSCAL= 4
##$PSIGN= 0
##$PYNMP= <proc.py>
##$REVERSE= no
##$SF= 400.020009686731
##$SI= 131072
##$SIGF1= 0
##$SIGF2= 0
##$SINO= 400
##$SIOLD= 131072
##$SPECTYP= <>
##$SREGLST= <1H.CDCl3>
##$SSB= 0
##$STSI= 131072
##$STSR= 0
##$SW_p= 8223.68421052631
##$SYMM= 0
##$S_DEV= 0
##$TDeff= 65536
##$TDoff= 0
##$TI= <>
##$TILT= no
##$TM1= 0
##$TM2= 0
##$TOPLEV= 0
##$USERP1= <user>
##$USERP2= <user>
##$USERP3= <user>
##$USERP4= <user>
##$USERP5= <user>
##$WDW= 1
##$XDIM= 131072
##$YMAX_p= 425827197
##$YMIN_p= -12623
##$CURPLOT= <Network HP LaserJet P1505>
##$CURPRIN= <$Network HP LaserJet P1505>
##$DFORMAT= <normdp>
##$LAYOUT= <+/1D_H.xwp>
##$LFORMAT= <normlp>
##$PFORMAT= <normpl>
##$SURQMSG= 1
$$ End of Bruker specific parameters
$$ ---------------------------------
##NTUPLES= NMR SPECTRUM
##VAR_NAME=  FREQUENCY,     SPECTRUM/REAL,   SPECTRUM/IMAG
##SYMBOL=    X,             R,               I
##VAR_TYPE=  INDEPENDENT,   DEPENDENT,       DEPENDENT
##VAR_FORM=  AFFN,          ASDF,            ASDF
##VAR_DIM=   131072,        131072,          131072
##UNITS=     HZ,            ARBITRARY UNITS, ARBITRARY UNITS
##FACTOR=    0.0627417313425164, 1,          1
##FIRST=     8223.62146879497, 2782,         -52060
##LAST=      0,             4758,            -51217
##MIN=       0,             -12623,          0
##MAX=       8223.62146879497, 425827197,    0
$$ Real data points
##PAGE= N=1
##DATA TABLE= (X++(R..R)), XYDATA
$$ [...]
65184 141488 141463 142515 144296 145914 146674 146632 146430 146688 147647 149285 151387 153400 154500 154171 152691 150859
65168 150859 149278 148057 147162 146749 147005 147816 148789 149595 150246 151027 152125 153343 154246 154679 155046 155925 157410
65151 157410 158992 160130 160812 161591 163180 166023 170025 174638 179345 184211 189851 196768 204855 213645 222822
65136 222822 232224 241427 249734 256770 262912 268951 275376 282108 288805 295209 301155 306414 310651 313563
65122 313563 315069 315500 315575 315990 316821 317403 316943 315134 312018 307463 301234 293642 285634 277896 270148 261701
65106 261701 252540 243447 235070 227337 219906 212779 206203 200204 194580 189284 184524 180418 176748 173256
65092 173256 170054 167543 165835 164448 162725 160525 158294 156472 155105 154146 153817 154344 155419 156240 156156 155105
65076 155105 153455 151666 150198 149540 150092 151866 154293 156466 157865 158892 160364 162309 163674 163624 162733
65061 162733 162295 162675 163140 163361 164145 166190 168806 170637 171337 171793 172736 173779 174049 173338 172254 171381 170527
65044 170527 168916 166082 162517 159345 157376 156567 156368 156336 156379 156548 156762 156615 155562 153518 151238 149634
65028 149634 148619 147101 144414 141309 139132 138413 138744 139670 140956 142156 142700 142617 142610 143192 144181 145197 146202
65011 146202 147271 148323 149418 150980 153224 155582 157211 158039 158928 160757 163734 167610 172118 176837 180929
64996 180929 183529 184497 184527 184389 184273 183988 183494 182973 182550 182324 182625 183833 185888 188367 191167 194764 199527
64979 199527 205128 210855 216181 220684 223705 224645 223562 221061 217636 213467 208780 203964 199281 194790
64965 194790 190586 186798 183312 179940 176897 174725 173576 172960 172370 171805 171484 171411 171476 171721 172161 172561 172670
64948 172670 172510 172172 171498 170244 168465 166507 164734 163439 162853 162865 162907 162486 161815 161564 161969 162542 162769 162735
64930 162735 162872 163349 163969 164491 164785 164718 164160 163157 161941 160710 159513 158356 157302 156382 155524 154716 154152
64913 154152 154078 154469 154989 155316 155453 155730 156585 158342 161003 164133 167104 169632 172046 174927 178567 182871
64897 182871 187692 192998 198763 204917 211391 218041 224525 230528 236251 242450 249806 258315 267386 276434
64883 276434 285199 293548 301151 307445 311853 313955 313432 310028 303834 295672 286952 278865 271717 265216
64869 265216 259264 254128 249893 246192 242726 239768 237798 236777 236024 234825 232922 230368 227142 223084
64855 223084 218216 212961 207899 203273 198838 194273 189702 185676 182682 180791 179699 178925 177982 176633 175135
64840 175135 174095 173910 174413 175118 175723 176259 176775 177000 176456 174991 173198 172112 172301 173347 174387 175015 175425
64823 175425 175820 176148 176437 177000 178099 179761 182011 184943 188296 191360 193684 195630 197875 200561 203378
64808 203378 206315 209738 213724 217849 221851 226078 230941 236121 240629 243519 244362 243189 240316 236322
64794 236322 231945 227796 224130 220900 217992 215368 213013 210822 208640 206468 204611 203541 203588 204749 206740
64779 206740 209102 211276 212764 213426 213556 213558 213510 213227 212786 212774 213841 216112 219237 222945 227304 232413 238123
64762 238123 244212 250639 257444 264491 271464 278090 284281 290141 295917 301883 308217 315055 322609 330946
64748 330946 339585 347637 354500 360127 364368 366457 365613 361909 356042 348375 338806 327590 315738 304341
64734 304341 293903 284508 276287 269437 264035 260094 257664 256705 256904 257683 258334 258314 257629 256931 256943 257830 259384
64717 259384 261644 264907 269159 274084 279717 286511 294461 302675 310090 316261 321121 324386 325627 324644
64703 324644 321464 316207 309258 301257 292537 282846 272053 260977 251046 243130 237007 231884 227182 222810
64689 222810 218962 215742 212979 210489 208412 206971 205948 204861 203846 203841 205527 208468 211670 214659 217672
64674 217672 221152 225447 230679 236400 241682 246039 250044 254485 259130 262861 264926 265515 265169 264124 262268
64659 262268 259379 255356 250500 245454 240676 236226 232321 229631 228561 228605 229056 229960 231708 233974 235945
64644 235945 237432 238886 240389 241577 242675 244633 247958 252158 256645 261496 267079 273658 281681 291656
64630 291656 303219 314880 325192 333734 340620 345629 348255 348170 345285 339847 332798 325412 318061 309949
64616 309949 300550 290684 281502 273090 264971 257507 251645 247386 243572 239393 235312 232172 230091 228617
64602 228617 227446 226528 225720 224711 223258 221366 219332 217630 216604 216123 215714 215094 214454 214242 214798 216302
64586 216302 218959 223119 229104 236868 245878 255547 265803 277044 289477 302740 316322 330046 343964
64573 343964 357993 371908 385423 397952 408498 416187 420899 423078 423013 420571 415615 408317 399017
64560 399017 388091 376104 363895 352279 341619 331695 322054 312593 303803 296317 290197 284904 280022
64547 280022 275730 272368 269831 267712 265895 264722 264627 265768 267854 270118 271603 271810 271029 269873 268547
64532 268547 266783 264308 261114 257336 253174 248904 244739 240672 236610 232636 229004 225976 223805 222683
64518 222683 222494 222745 222973 223082 223117 222968 222579 222273 222483 223246 224253 225259 226120 226634 226849 227460 229362 232689
64500 232689 236707 240804 245231 250682 257421 264979 272466 279028 284204 288012 290735 292648 293993 294987
64486 294987 295582 295411 294360 293130 292793 293768 295586 297648 299771 301858 303510 304268 303996 302788 300707 297820
64470 297820 294358 290730 287444 285006 283604 282891 282377 282144 282907 285236 288956 293433 298155 302800 306926
64455 306926 309845 310838 309599 306683 303431 301101 299915 299197 298396 297642 297293 297496 298395 300335 303500 307642
64439 307642 312425 317755 323559 329625 336017 343360 352399 363513 376898 392719 410619 429581 449102
64426 449102 470391 495701 526484 562846 604839 653459 710038 775353 849962 935014 1031869
64415 1031869 1140641 1259288 1384074 1510705 1635081 1753593 1863444 1963061 2051891 2129260
64405 2129260 2193149 2240331 2267952 2274962 2262068 2230881 2183514 2122491 2049915 1966316 1870898
64394 1870898 1763416 1645821 1522076 1396790 1274120 1157340 1048678 949449 860527 782538
64384 782538 715386 657889 608419 565905 529950 500061 475241 454414 436827 421898 409002
64373 409002 397699 387951 379796 372870 366414 359723 352449 344548 336094 327207 318107 309149 300720 292973
64359 292973 285720 278744 272203 266530 261880 257941 254428 251517 249559 248555 248257 248687 250189 252893 256343
64344 256343 259758 262505 264335 265347 265825 265936 265572 264598 263171 261557 259653 257045 253681 250212 247469
64329 247469 245800 245079 245078 245612 246571 248119 250660 254205 257897 260624 262137 263178 264441 265844 267011 268080
64313 268080 269570 271599 273649 275127 275857 275894 275143 273395 270658 267170 263064 258203 252484 246192 239893
64298 239893 234017 228681 223937 219986 216987 214716 212598 210205 207731 205897 205227 205425 205637 205430 205289
64283 205289 205889 207108 208210 209003 210222 212500 215444 218144 220362 222768 226147 230797 236583 243056 249402
64268 249402 254694 258444 260764 261942 262110 261461 260526 260002 260307 261366 262753 264036 265090 266107 267221
64253 267221 268194 268578 268122 266797 264503 261093 256739 251974 247137 242012 236237 230029 224332 220232 218201
64238 218201 217813 218143 218580 219338 221050 223859 227116 230068 232663 235492 239071 243400 248141 252969 257706
64223 257706 262370 267266 272899 279578 287041 294651 302045 309485 317372 325540 333266 340027 345965 351439
64209 351439 356316 359951 361756 361647 359989 357257 353689 349186 343661 337510 331400 325418 318805 310914
64195 310914 302227 293969 286914 280999 275973 271837 268647 266432 265422 265930 267951 271316 276209 282891
64181 282891 290728 298080 303521 306736 308014 307408 304781 300196 293826 285846 276856 267993 260136 253279
64167 253279 247120 241829 237667 234165 230466 226350 222222 218179 213836 209235 205210 202534 201139 200398
64153 200398 199814 199207 198646 198484 199175 200811 203000 205325 207689 210098 212497 215054 218259 222310 226519
64138 226519 229722 231328 231728 231665 231414 230692 229211 227136 224939 222880 220793 218432 215899 213599 211869
64123 211869 210805 210341 210335 210591 211077 212105 214097 217150 221045 225691 231227 237596 244311 250840 256971 262614
64107 262614 267513 271469 274688 277569 280172 282182 283444 284232 284908 285582 286325 287514 289655 292803 296373
64092 296373 299624 302169 303907 304581 303673 300820 296207 290412 283937 276971 269589 262063 254916 248666 243539
64077 243539 239445 236206 233747 231950 230502 229059 227568 226230 225162 224366 224053 224596 225943 227361 228160
64062 228160 228475 228950 229771 230412 230392 229860 229339 229192 229502 230159 230840 231132 230898 230470 230283 230468 230938 231737 233068
64043 233068 235002 237345 239824 242230 244348 245952 247066 248175 249956 252647 255729 258362 260096 261029
64029 261029 261365 261142 260517 260048 260369 261642 263570 265939 268931 272849 277693 283005 288028 292028 294657
64014 294657 296051 296467 295851 293931 290762 286989 283457 280666 278619 277123 276049 275318 274688 273714 272044
63999 272044 269757 267256 264835 262584 260816 260220 261264 263609 266445 269275 272106 275000 277930 281051
63985 281051 284658 288676 292563 295926 299059 302708 307355 312770 318118 322605 326257 330005 334721 340242
63971 340242 345712 350774 355910 361593 367715 374126 381159 389214 398166 407591 417324 427513 438377 450228
63957 450228 463463 478247 494475 512344 532636 556115 582971 613251 647514 686513 730649
63946 730649 780462 837562 904358 982747 1073529 1177027 1293612 1423418 1566065 1720871
63936 1720871 1886857 2062371 2245226 2433521 2625772 2819777 3011554 3195798 3367177
63927 3367177 3520986 3653031 3759818 3839200 3890565 3914097 3909849 3877534 3817109 3729410 3616215
63916 3616215 3479947 3323637 3151365 2968338 2779967 2590575 2403012 2219337 2041496
63907 2041496 1871424 1711027 1562227 1426582 1304585 1195642 1098963 1014112 940463 876640
63897 876640 821035 772609 730647 694056 661598 632769 607673 585899 566147 547353 529658
63886 529658 513848 500138 487968 476819 466768 458184 451140 445268 440143 435816 432865 431714 431971
63873 431971 432737 433666 435315 438252 442275 446969 452724 460577 471086 483829 498092 513588 530448
63860 530448 548972 569579 592628 617966 644892 672782 701519 731195 761689 792733 824001
63849 824001 854771 883821 910164 933714 954797 973177 988075 999129 1006695 1011060 1011846 1008463
63837 1008463 1000783 989099 973733 955076 933822 910753 886285 860399 833035 804471 775353
63826 775353 746358 717697 688904 659331 628991 598760 569667 542208 516412 492278 469878
63815 469878 449270 430578 413996 399456 386443 374358 362937 352144 341998 332862 325520 320336
63803 320336 316436 312358 307603 302966 299216 295982 292298 287822 283105 278919 275600 272893 270171 266920
63789 266920 263178 259405 255861 252421 249121 246511 245135 244902 245239 245659 245878 245614 244734 243518 242419 241630
63773 241630 241143 241084 241511 241967 241729 240676 239516 238988 239109 239327 239140 238397 237207 235809 234420 233092 231772
63756 231772 230515 229494 228824 228504 228514 228751 228890 228661 228260 228134 228239 227973 227058 226123 226056 227073 228756 230738
63738 230738 232925 235224 237591 240280 243501 246793 249264 250744 252311 255230 259488 263777 266979 269434
63724 269434 272564 277307 283164 288869 293822 298525 303616 308948 313908 318339 322610 326807 330343 332469
63710 332469 332854 331527 328638 324581 320137 316091 312662 309411 305806 301922 298596 296759 296488 296805 296676
63695 296676 296095 295823 296220 296896 297667 299183 302110 306044 309799 312601 314546 316026 317205 318078 318575 318539
63679 318539 317944 317184 316840 317117 317862 319122 321228 324205 327610 331193 335318 340339 345893 351217 355953
63664 355953 360132 363569 365855 367007 367557 367727 366939 364506 360553 355865 350979 345859 340408 334833 329309
63649 329309 323709 318039 312934 309254 307227 306340 306163 306818 308436 310499 312211 313395 314599 316300 318423
63634 318423 320770 323557 327178 331602 336311 340875 345401 350336 355925 361912 367822 373577 379843 387632
63620 387632 397440 408891 421291 434501 449102 465770 484617 505204 527060 550176 575039 602233
63608 602233 631912 663611 696587 730321 764577 798873 831910 861588 885631 902346 911063 912138
63596 912138 906669 896158 882290 866799 851263 836746 823533 811243 799152 786339 771695 754241
63584 754241 733795 711322 688441 666562 646466 628397 612242 597771 585049 574634 566990 561707
63572 561707 557710 554390 552166 551737 553159 555912 559511 563701 568382 573762 580301 588012 596029 603436
63558 603436 610385 617813 626180 635218 645044 656729 671360 689090 709636 733295 760925 793065
63546 793065 829572 870129 914708 963244 1014542 1065083 1108872 1139355 1152589 1149113 1132963 1109150
63534 1109150 1082035 1055087 1030799 1010260 993194 978774 966321 955122 943864 930653 913872
63523 913872 893110 869240 843449 816205 787326 757026 726438 696888 669043 643113 619509
63512 619509 598685 580447 564039 549031 535677 524323 514867 506909 499967 493391 486520 479271 472372
63499 472372 466688 462420 459060 455866 452187 447658 442425 437141 432420 428317 424489 420788 417580 415451
63485 415451 414691 414986 415607 416071 416664 418150 420910 424595 428673 433025 437773 442845 448013 453133 457903
63470 457903 461510 462956 461885 458837 454682 450037 445166 440019 434256 427589 420398 413759 408541 404580
63456 404580 401033 397521 394571 392809 392013 391279 390133 389184 389530 391672 395218 399554 404556 410556 417873
63441 417873 426608 436743 448271 461235 475862 492676 512447 536070 564560 598829 638919 683072
63429 683072 727601 767857 799750 821057 832064 835248 834018 831398 829692 830991 837261 849561 867571
63416 867571 890496 918325 951631 989896 1030433 1069293 1103117 1129903 1148349 1157190 1155791 1145278
63404 1145278 1128614 1109154 1089068 1069151 1049728 1031166 1013372 995334 975634 953336 928205
63393 928205 900421 870602 839994 810051 781594 754649 729161 705466 683979 664826 648059
63382 648059 633864 622249 612770 604904 598537 593865 591060 590265 591583 594693 598758 603204 608490 615588
63368 615588 624790 635491 647111 659737 673756 689427 706977 726738 748911 773518 800704 830763
63356 830763 863727 899268 937073 976826 1017520 1057137 1093293 1123942 1147412 1162415 1168582 1166679
63344 1166679 1157872 1143148 1123863 1102397 1081312 1061754 1043139 1024382 1004884 984356 962384
63333 962384 938557 912718 884910 855370 824782 794313 765193 738363 714524 694233 677810
63322 677810 665292 656583 651603 650401 653217 660078 669638 678350 681443 675414 659869 637261 611294
63309 611294 585433 562002 541793 524423 509330 496384 485523 476182 467564 459331 451624 444391
63297 444391 437146 429546 421966 415201 409641 404893 400216 395216 390063 385095 380398 375835 371388 367323
63283 367323 363942 361190 358531 355294 351265 346959 343156 340207 337958 336297 335296 334688 333772 332297 331011
63268 331011 330659 330737 330021 328211 326256 324953 324076 323168 322360 321891 321481 320802 320088 319647 319210 318406 317553 317265
63250 317265 317504 317746 317960 318609 319640 320257 319979 319324 319125 319607 320473 321504 322661 323866 325094 326594 328701
63233 328701 331447 334560 337830 341280 344941 348603 351922 354741 357258 359806 362520 365289 368022 370851
63219 370851 374022 377715 381936 386407 390551 393860 396362 398509 400569 402548 404766 407878 411840 415375
63205 415375 417215 417610 417900 418744 419561 419722 419377 418828 417869 416284 414489 413216 412901 413788 416171 420030 424725
63188 424725 429631 434930 441302 448966 457539 466768 476913 488313 500915 514389 528371 542502 556423
63175 556423 569940 583105 596120 609141 622048 634314 645329 655054 664183 673289 681958 689147
63163 689147 694284 697481 698618 696825 691294 682239 670656 657305 642377 626004 608626 590731 572599
63150 572599 554552 537231 521320 507002 493864 481422 469713 459294 450642 443554 437196 430839
63138 430839 424582 419284 415755 414037 413467 413246 412887 412272 411680 411813 413431 416677 420828 424939 428710 432524
63122 432524 436756 441358 446177 451301 456858 462662 468363 473864 479285 484539 489313 493626 498148 503629
63108 503629 509978 516167 521195 524993 528309 531831 535693 539806 544335 549625 555766 562446 569182 575554
63094 575554 581326 586591 591819 597535 603802 610119 615896 620904 625197 628734 631209 632233 631588 629353
63080 629353 625789 621087 615240 608252 600391 592070 583494 574684 565922 557883 551085 545374 540177 535204
63066 535204 530668 526891 523895 521452 519405 517946 517559 518563 520632 522935 524922 526863 529481 533250
63052 533250 538286 544662 552342 560900 569756 578838 588532 598849 609137 618978 628978 640083 652244
63039 652244 664354 675552 686086 696689 707516 718089 728062 737616 747025 756155 764502 771584 777210
63026 777210 781469 784544 786430 786730 784835 780414 773667 765026 754793 743334 731442 720064 709581
63013 709581 699796 690820 683556 678822 676311 674951 674304 675070 678169 683809 691689 701683 713878 728134
62999 728134 743916 760591 777761 795417 813851 833247 853296 873452 893607 914133 935054
62988 935054 955629 975172 993946 1012638 1031113 1048243 1062974 1075032 1084504 1091201 1094574 1093792
62976 1093792 1087761 1075587 1057404 1034493 1008364 979956 949859 918836 887743 857179 827592
62965 827592 799560 773589 749756 727792 707401 688302 670212 653117 637378 623209 610182
62954 610182 597600 585188 573037 561038 548894 536677 524833 513543 502487 491408 480547
62943 480547 470376 461217 453216 446328 440084 433726 426863 419841 413286 407496 402425 398021 394243 390884
62929 390884 387691 384634 381880 379463 377100 374394 371265 368170 365750 364149 362797 361088 359113 357479
62915 357479 356528 356111 356033 356245 356576 356798 357046 357666 358499 358883 358625 358431 359077 360691 363179 366671 370969 375247
62897 375247 379101 383512 389843 398127 407181 416209 425308 434402 442711 449636 455368 460238 464139 466999
62883 466999 469164 470854 471709 471317 469836 467676 464941 461543 457490 452684 446888 440326 433866 428018 422146
62868 422146 415383 408064 401451 396070 391150 385922 380772 376638 373716 371196 368121 364198 359919 356132
62854 356132 353411 351658 350343 349176 348350 348075 348111 348052 347919 348177 349139 350570 351907 352729 353003 353037 353278 353948
62836 353948 354757 355050 354406 353095 351883 351438 351957 353192 354584 355507 355705 355578 355823 356709 357915 359067 360043
62819 360043 360668 360625 360041 359705 360176 360935 361114 360913 361513 363428 365632 366669 366153 364802 363433 362405 361763
62802 361763 361441 361336 361528 362419 364444 367630 371508 375317 378278 379934 380458 380478 380494 380650 381098 382191 384101
62785 384101 386584 389436 392926 397469 403180 410042 418246 427890 438557 449664 461130 473275 486146
62772 486146 499388 512648 525608 537632 547989 556603 564134 571050 576877 580591 581576 580058 576756
62759 576756 572273 566735 559888 551540 541846 531134 519654 507615 495305 482986 470855 459249
62747 459249 448574 438733 428994 418965 409372 401226 394394 387820 381205 375616 372065 370108 368296 365632
62733 365632 362215 358839 356333 355097 354954 355496 356526 357843 358765 358572 357612 357253 358352 360392 362558 364960
62717 364960 368117 371836 375480 379039 383062 387749 392980 399202 407312 417436 428668 440395 453300
62704 453300 468535 486348 505968 526573 547942 570297 593943 619159 646226 675428 706869
62693 706869 740283 775150 811182 848484 886905 925338 962082 995850 1026013 1051869 1072288
62682 1072288 1086259 1093279 1092958 1084786 1068767 1045903 1017642 985133 949454 912037 874129 835987
62670 835987 797405 759020 722316 688151 656119 625805 597949 573606 552548 533384 515198
62659 515198 498270 483042 469183 456155 444170 433945 425686 418854 412846 407384 402133 396509 390175
62646 390175 383541 377434 372333 368083 364327 361067 358756 357822 358086 358746 359074 359066 359263 360017 361191 362455
62630 362455 363460 363674 362543 360136 357358 355233 354131 353826 353940 354046 353629 352428 350653 348594 346229
62615 346229 343575 341136 339495 338660 338364 338768 340143 341904 342881 342743 342361 342362 342141 341018 339723 339832 341848
62598 341848 344666 347046 348980 351379 354903 359428 364449 369640 374988 380507 385987 391131 395881 400365
62584 400365 404445 407619 409613 410822 411844 412705 412859 411839 409647 406593 403080 399459 395751 391524 386432
62569 386432 380845 375565 370862 366221 361151 355817 350657 345810 341342 337681 335316 334170 333669 333422 333476
62554 333476 333877 334375 334688 334757 334540 333825 332515 330980 329859 329509 329866 330773 332190 334046 336192 338642 341608
62537 341608 345063 348480 351324 353648 355823 357728 358751 358754 358598 359347 361223 363699 366355 369233 372508
62522 372508 376372 381260 387702 395775 405034 415143 426278 438795 452869 468642 486351 505961
62510 505961 526974 548965 572124 596807 622672 648638 673688 697294 719044 738383 754955
62499 754955 768755 779658 787093 790638 790769 788597 784945 780144 774791 770197 767757 768073 770944 776028
62485 776028 783277 792980 805749 822362 843192 867691 894731 923571 954107 985905 1017187 1045114
62473 1045114 1067104 1081840 1089320 1090305 1085672 1075765 1060026 1037335 1007053 969935 928047 883741
62461 883741 838623 793464 748951 706171 666167 629284 595402 564773 538067 515337 495499
62450 495499 477401 461159 447800 437659 429704 422574 415715 409221 403066 397017 391123 385801 381426
62437 381426 378118 375983 375229 375794 376962 377630 377100 375570 373793 372277 370974 369620 368146 366670 365359
62422 365359 364447 364156 364374 364592 364376 363699 362617 361053 359296 358302 358701 359668 359638 358218 356607 355886 355776
62405 355776 355553 355345 355684 356304 356338 355567 354675 354291 354424 354935 355971 357708 360105 363070 366582 370545 374816
62388 374816 379407 384332 389259 393730 397910 402710 408936 416530 424791 433114 441287 449391 457710 466704
62374 466704 476761 487876 499689 511864 524421 537698 552051 567660 584642 603269 624006
62363 624006 647316 673613 703385 737135 775110 817307 863892 915372 972039 1033343 1097946
62352 1097946 1164212 1230344 1294131 1352930 1404015 1444974 1474113 1490869 1495839 1490232 1475388 1452919
62340 1452919 1424891 1393221 1358760 1321224 1280095 1235490 1188431 1140676 1094201 1050390 1009599
62329 1009599 971663 936662 904890 876231 850012 825445 801908 778975 756562 734935 714199
62318 714199 693953 673942 654707 636916 620252 603812 587471 571937 557442 543476 530043
62307 530043 518075 508099 499496 491706 485219 480553 477061 473731 470584 468256 466676 465174 463670 462719
62293 462719 462535 462866 463828 465934 469192 472969 476864 481034 485512 489895 493895 497667 501421 505237 509345
62278 509345 513967 518766 523030 526646 530377 534978 540621 547352 555453 564890 574970 585155 596006
62265 596006 608938 625175 645197 668933 696162 726893 761667 801366 846542 897028 952258
62254 952258 1011732 1074966 1141203 1209231 1277063 1341568 1398838 1445479 1479615 1500622 1508418 1503531
62242 1503531 1487576 1462935 1431638 1394715 1352564 1305584 1254437 1200126 1144082 1087978 1033141
62231 1033141 980211 929548 881916 838505 800140 766628 737040 710609 687142 666631 648809
62220 648809 633238 619548 607305 595812 584415 572991 561935 551732 542832 535743 530708 527190
62208 527190 524098 520762 517374 514291 511289 507875 504076 500494 497596 495352 493633 492706 493095 495056 498393
62193 498393 502862 508566 515682 523868 532291 540515 549054 558707 569518 580804 592078 603406 614867
62180 614867 626254 637498 648821 660050 670258 678571 685211 691439 698659 707907 719902 735080
62168 735080 753549 775442 801406 832497 869491 912321 960008 1010884 1062834 1113594 1160915
62157 1160915 1202537 1236260 1260372 1274124 1277818 1272601 1260177 1242305 1220110 1193929 1163981 1131003
62145 1131003 1095956 1059427 1021875 984401 948709 916105 886895 860916 838203 818875 802744
62134 802744 789415 778554 769712 762102 755026 748522 743143 738995 735342 731373 727077 723021 719418 715738
62120 715738 711314 706139 701049 697263 695768 696898 700298 705375 711927 720375 731385 745214 761178
62107 761178 777433 791297 800313 803536 801940 797575 792515 788564 787233 789097 792959 796165 796148 791759
62093 791759 783384 772359 760457 749443 740616 734668 731968 732724 736703 743105 751099 760449 771516
62080 771516 784727 800243 818012 837888 859658 883119 908198 934933 963313 993148 1024134
62069 1024134 1056087 1089044 1123033 1157727 1192566 1227411 1262837 1299422 1336820 1373856 1409331
62058 1409331 1442188 1470776 1492638 1505583 1508987 1503962 1492483 1476375 1456664 1433483 1406627 1376348
62046 1376348 1343405 1308317 1270965 1231212 1189669 1147586 1106259 1066789 1030002 996065 964206
62035 964206 933283 902836 873530 846642 823194 803361 786503 771817 759017 748206 739160 731160
62023 731160 723656 716619 709958 703079 695517 687594 679896 672358 664394 655772 646815 637897 629307 621489
62009 621489 614780 608921 603439 598595 595373 594393 595357 597778 601690 607293 614262 621833 629379 636601 643224
61994 643224 648738 652453 653800 652692 649561 644936 639036 632015 624444 617085 610049 602534 593655 583401
61980 583401 572684 562546 553426 544989 536573 527869 519228 511286 504432 498771 494403 491403 489566 488505
61966 488505 488002 488026 488471 489243 490529 492587 495180 497624 499525 501181 503127 505594 508526 511844 515536
61951 515536 519694 524633 530780 538362 547300 557434 568676 580998 594582 609933 627487 647074
61939 647074 668148 690637 715147 742151 771263 801487 831858 861693 890499 917954 943858
61928 943858 968014 990170 1010008 1026965 1040230 1049338 1054691 1056991 1056131 1051171 1041581 1028053 1011985
61915 1011985 994764 977762 962426 949924 941079 936880 938469 946138 958822 975125 994438 1016580
61903 1016580 1040691 1065145 1088290 1108690 1124791 1135045 1138509 1135016 1124879 1108850 1088239 1064543
61891 1064543 1038805 1011619 983635 955690 928428 902114 876847 852697 829774 808423 789199
61880 789199 772245 756762 741462 725574 709194 692897 677464 663847 652781 644235 637533 632077
61868 632077 627718 624561 622808 622788 624695 628238 632970 639039 647213 658075 671558 687395 705619 726472
61854 726472 750175 776958 807035 840339 876599 915844 958529 1004920 1054535 1106294 1158882
61843 1158882 1210780 1260259 1305731 1345944 1379664 1405409 1421942 1428979 1427153 1417400 1400725 1378649
61831 1378649 1353539 1328287 1305648 1287872 1276624 1272849 1276614 1287189 1303499 1324451 1348750 1374428
61819 1374428 1398857 1419418 1434131 1441590 1440537 1429857 1409083 1378782 1340449 1295999 1247192 1195314
61807 1195314 1141403 1086856 1033616 983472 937205 894587 855172 818814 785557 755427 728469
61796 728469 704692 683803 665187 648366 633351 620386 609367 599620 590330 581173 572538 564979
61784 564979 558498 552533 546720 541326 536706 532644 528624 524543 520723 517338 514330 511833 510100 508976
61770 508976 507986 507096 506827 507383 508227 508908 509822 511734 514860 518854 523356 528094 532635 536628 540246 544020
61754 544020 548290 553114 558531 564436 570244 575168 578901 581644 583467 584103 583584 582698 582471 583289 584653
61739 584653 585687 585858 585456 585468 586770 589302 592234 595019 597961 601569 605707 609851 613930 618317 622906
61724 622906 626798 629321 631012 633074 635953 638940 641186 642626 643694 644552 645008 644937 644305 642831 640073
61709 640073 635936 630766 624903 618487 611811 605455 599766 594455 589073 583747 579147 575722 573236 571058
61695 571058 568754 566338 564083 562094 560044 557422 554102 550582 547528 545210 543462 542036 540758 539460
61681 539460 538045 536624 535425 534557 534030 533879 534029 534049 533403 532087 530788 530174 530122 529858 528861 527491 526658
61664 526658 526904 527925 529043 530014 531186 532863 534881 537023 539555 542915 546928 550752 553743 556115 558658
61649 558658 562057 566592 572165 578374 584738 591099 597723 604873 612430 620056 627514 634583 640831 645787
61635 645787 649249 651127 651082 648684 644031 637890 631093 623980 616563 608991 601674 595017 589187 584009 579064
61620 579064 574054 569173 564930 561452 558272 555079 552379 550861 550167 548914 546143 542233 537957 533076
61606 533076 526528 517958 508402 499272 491101 483635 476775 470979 466747 464060 462322 460654 458253 454826
61592 454826 450830 447146 444356 442361 440667 438867 436773 434332 431625 428899 426435 424304 422294 420005
61578 420005 417095 413616 410187 407529 405625 403565 400565 396968 393826 391608 389835 387985 386108 384261
61564 384261 382033 379211 376519 374943 374468 374166 373577 373231 373619 374294 374440 373885 373074 372378 371909 371817 372209 372796
61546 372796 373029 372700 372133 371776 371835 372287 372995 373811 374822 376449 379059 382502 386280 390124 394029 397793
61530 397793 401011 403637 406045 408236 409389 408616 405928 402133 398037 394107 390686 387982 385752 383432
61516 383432 380679 377648 374766 372490 371173 370776 370638 369925 368464 366876 365738 364925 363915 362468 360758
61501 360758 359148 358089 357961 358594 359087 358584 357251 356111 355900 356423 357079 357547 357692 357276 356244 355130 354622
61484 354622 354703 354629 353920 353020 352729 353252 354100 354776 355202 355519 355842 356328 357149 358165 358848 358804 358300 357998 358239
61465 358239 358830 359520 360272 360944 361046 360159 358484 356728 355476 354841 354609 354440 354006 353295 352882 353621 355801
61448 355801 358739 361320 362837 363237 362779 361805 360790 360326 360836 362325 364430 366773 369294 372307 376183
61433 376183 380878 385816 390294 394059 397486 401202 405498 409971 413763 416294 417849 419361 421563 424499
61419 424499 427812 431267 434755 438070 441034 443792 446641 449546 452062 453784 454581 454341 452778 449739 445581
61404 445581 441011 436570 432333 428059 423549 418901 414460 410574 407386 404859 402910 401401 400100 398854
61390 398854 397874 397700 398667 400396 401849 402046 400881 399332 398730 399711 401864 404286 406261 407402 407624 407321
61374 407321 407319 408129 409329 410107 410366 410853 412184 414166 416220 418038 419637 421125 422681 424527 426690 428953
61358 428953 431219 433753 436918 440802 445158 449556 453663 457711 462679 469603 478623 489095 500628 513480
61344 513480 527798 543092 558798 574752 590629 605496 618515 629720 639443 647324 652617 655358
61332 655358 656483 656746 656089 654132 650769 646100 640204 633140 625028 616152 607117 598744 591427 584837 578621
61317 578621 573140 568940 565646 562119 557798 553344 549836 547826 547241 547606 548136 548170 547872 548238 550148 553713
61301 553713 558639 564831 572375 581228 591079 601276 610759 618424 623679 626336 626015 622249 615449 607206
61287 607206 599177 591941 585262 579050 573595 569124 565617 562968 561006 559523 558635 558956 561079 564944 569987
61272 569987 575782 582213 589158 596417 603990 612157 621226 631387 642664 654715 666732 677907 688151
61259 688151 698185 708887 720755 733993 748783 765193 782991 801744 821053 840465 859141
61248 859141 875827 889170 897990 901305 898608 890529 878996 866090 852618 838169 822630 807047
61236 807047 792639 779600 767490 756419 747024 739347 732549 725924 719625 714085 709201 704453 699599
61223 699599 695027 691552 689882 689998 690994 691769 691869 691403 690327 688368 685665 682845 680308 677921 675602
61208 675602 673639 672168 670874 669553 668499 667916 667333 666108 664293 662665 662079 663048 665671 669704 674922
61193 674922 681656 690724 702627 717192 734160 753711 775996 800497 826159 851788 875961 897064
61181 897064 914096 927439 938490 948600 958516 968401 977914 986527 994121 1001076 1007489 1012619 1015544
61168 1015544 1016045 1014430 1010812 1005123 997605 988740 978713 967346 954375 939463 922285 903183 883492
61155 883492 864616 846892 829847 813419 798247 784898 773476 764073 756950 752096 749081 747594
61143 747594 747714 749537 752773 756745 760438 762556 761923 758010 750964 741259 729676 717546 706490 697662
61129 697662 691277 686820 683569 681150 679939 680841 684401 690277 697828 706989 718182 731605 747011 764011
61115 764011 782182 801078 820599 841183 863117 885836 908401 930531 952651 975058 997552
61104 997552 1019734 1041096 1060959 1078969 1095577 1111453 1126507 1140026 1151556 1160746 1166420 1166808
61092 1166808 1161051 1149885 1134649 1116253 1095265 1072254 1047710 1022141 996465 971672 947924
61081 947924 924601 901524 879486 859295 840896 823829 808024 793724 781085 770224 761239 753798
61069 753798 747140 740873 735480 731679 729557 728596 728235 728103 727983 727897 728113 728966 730787 733896 738330 743664
61053 743664 749575 756494 765131 775337 786088 796757 807795 820021 833901 849765 868040 888861
61041 888861 911904 936823 963405 991172 1019526 1048537 1078966 1111252 1145057 1180006 1216159
61030 1216159 1253505 1291780 1331173 1372447 1415875 1460819 1506915 1555086 1606848 1663100 1723914
61019 1723914 1788764 1856420 1925299 1994614 2064891 2137326 2213598 2296642 2390483 2498467 2622255
61008 2622255 2762826 2921165 3097341 3290750 3503295 3742259 4019496 4349314 4748946
60999 4748946 5240289 5849113 6602649 7529376 8660746 10031571 11680288 13653787 16013319
60990 16013319 18824231 22111070 25782251 29566484 33026033 35683748 37220802 37630110
60982 37630110 37223378 36491002 35910900 35804399 36263637 37125704 37993874 38343432 37715872
60973 37715872 35916690 33092657 29637519 25999747 22523068 19394871 16680109 14374814
60965 14374814 12440986 10825728 9475757 8346167 7400259 6606074 5936039 5368011 4883752
60956 4883752 4466697 4102695 3781946 3498320 3246901 3023197 2823860 2646461 2488567
60947 2488567 2348066 2224044 2116004 2022196 1939618 1865346 1796730 1730500 1663253 1593501 1522540
60936 1522540 1452922 1386520 1324057 1265556 1210727 1159331 1111564 1067805 1027883 990950 956237
60925 956237 923724 893956 867420 844095 823344 804184 785842 768094 751092 735148 720826
60914 720826 708748 698833 690058 681538 673623 667341 662978 659887 657645 656547 656806 657953 659406 661150
60900 661150 663479 666454 669888 673502 676758 678817 679112 677871 675846 673581 671090 668073 664173 659083
60886 659083 652653 644936 636048 625992 614734 602509 589980 577958 566888 556627 546820 537468
60874 537468 528929 521319 514228 507269 500726 495270 491083 487576 484119 480783 478256 477179 477627 479136
60860 479136 481136 483438 486345 490207 494967 500295 506129 512856 520798 529640 538456 546257 552571 557743
60846 557743 562777 568638 575507 582713 589465 595468 600710 604806 606974 606741 604462 601031 597246 593564
60832 593564 590120 586663 582613 577626 572160 567159 563053 559425 555753 552038 548397 544493 539825 534292
60818 534292 527940 520444 511556 501991 493074 485302 477966 470511 463550 457935 453326 448447 442610 436345
60804 436345 430536 425530 421249 417682 414948 413052 411888 411497 412102 413703 415680 417065 417495 417748 418960
60789 418960 421271 423703 425486 427022 429235 432396 436048 439763 443430 446988 450438 454168 458750 464280
60775 464280 470233 476070 481729 487470 493532 500049 507060 514477 522119 529769 537071 543536 548913 553541
60761 553541 557975 562275 565979 568876 571510 574703 578766 583307 587644 591217 593751 595272 596038 596383 596542
60746 596542 596600 596600 596723 597309 598580 600296 601860 602839 603227 603153 602632 601886 601627 602594 604902 608260 612772 619065
60728 619065 627540 637900 649703 663069 678585 696632 716999 739111 762541 787375 814063 842753
60716 842753 872738 902700 931559 958881 984447 1007678 1027627 1043305 1053858 1058599 1057122 1049504
60704 1049504 1036361 1018771 998051 975337 951135 925307 897604 868289 838318 808933 780961
60693 780961 754355 728524 703265 679212 657140 636987 617964 599628 582434 567146 554046
60682 554046 542830 532907 523643 514726 506541 499882 494990 491155 487508 483865 480469 477295 474141 471162
60668 471162 468692 466568 464156 461120 457733 454333 450907 447313 443518 439545 435543 432110 430061 429552
60654 429552 429762 429801 429684 430098 431458 433636 436473 439959 443876 447778 451585 455783 460705 465823 470202
60639 470202 473541 476391 479314 482245 484856 487209 489640 492199 494639 496993 499766 503281 507119 510441
60625 510441 512734 514017 514460 514149 513227 511966 510503 508665 506160 502927 499244 495533 491989 488333 484027
60610 484027 478936 473668 469038 465242 461911 458937 456835 456026 456137 456306 455999 455244 454286 453293 452283 451073
60594 451073 449440 447635 446546 446924 448475 450124 451153 451705 452129 452366 452261 452104 452445 453426 454609 455496
60578 455496 456110 457036 458868 461664 465067 469030 474144 480950 489169 498150 508043 519938 534689 552168
60564 552168 571886 593727 617606 642902 668795 694794 720252 743539 762323 774793 780285 778989
60552 778989 771704 759903 745418 729809 714372 700755 690939 686265 686817 692020 701576 715629 734352
60539 734352 757707 785539 817675 853935 893964 936746 980105 1020895 1055863 1082357 1098553
60528 1098553 1103677 1098408 1084812 1065497 1042838 1018925 995694 974559 956044 940112 926805 916210
60516 916210 907869 900641 893358 885569 877705 870816 866189 864853 867048 872079 878870 886831 896273 908070
60502 908070 923106 942173 966251 996543 1034108 1079737 1134351 1199220 1275405 1363002 1461138
60491 1461138 1568471 1683187 1802447 1922209 2037785 2144455 2237646 2312924 2366048 2393133
60481 2393133 2391129 2358796 2297418 2210458 2102660 1979761 1848548 1715943 1587329 1465973
60471 1465973 1354124 1253830 1166177 1090303 1023941 964946 912074 864784 822918 786466 755074
60460 755074 727769 703428 681428 661610 643856 628046 614170 602047 591135 581000 571788 563787
60448 563787 556782 550360 544623 539925 535976 531951 527597 523598 520533 518061 515461 512617 510060 508249
60434 508249 507172 506552 506158 505887 505640 505207 504330 502888 500859 498036 494077 489117 483985 479442 475416 471535
60418 471535 468216 466483 466606 467632 468511 469108 469749 470326 470391 469815 468862 467794 466810 466155 465912 465796 465528 465323
60400 465323 465652 466590 467708 468569 469012 469038 468815 468833 469660 471378 473473 475434 477195 478924 480653 482375 484201
60383 484201 486129 487777 488732 489148 489631 490503 491514 492451 493631 495469 497785 499926 501474 502453 502930 502864
60367 502864 502435 502103 502141 502420 502783 503304 503979 504594 505174 506300 508517 511580 514626 516994 518635 519878 521103
60350 521103 522521 523946 524892 525235 525637 526944 529199 531692 534021 536709 540556 545600 550783 554606 556187
60335 556187 555894 554945 554242 553708 552871 551786 550942 550444 549807 548637 547165 546009 545593 545800 546011 545666 545062
60318 545062 545322 547135 549819 552219 554327 557295 561884 567804 574710 582980 593049 604729 617785 632770
60304 632770 650731 672480 698672 730281 768386 813230 863367 915175 963096 1001256 1025873
60293 1025873 1036192 1032914 1016304 986677 946497 900966 855917 815185 779885 749604 723793
60282 723793 702150 684104 668486 654119 640745 629008 619365 611331 603968 596709 589449 582236 575335
60269 575335 569307 564518 560749 557663 555372 554020 553089 551835 550304 549188 548652 548014 546741 545041 543163
60254 543163 540826 537858 534864 532700 531504 530746 529953 528928 527540 525889 524588 524294 524880 525594 526119 526951
60238 526951 528516 530401 531877 532832 533796 535206 537046 539062 540901 542151 542728 543264 544668 547153 550127
60223 550127 553126 556316 559756 562749 564511 565217 565779 566779 568241 570329 573498 577695 582030 585619 588407
60208 588407 590903 593501 596345 599511 602873 606037 608769 611342 614142 617057 619615 621611 623260 624773
60194 624773 626133 627282 628203 628689 628295 626766 624445 622109 620379 619278 618395 617346 615972 614126 611573
60179 611573 608320 604907 602011 599754 597744 595787 594226 593417 593197 593039 592537 591612 590461 589452 588839 588498
60163 588498 588165 588000 588535 589875 591405 592572 593599 595081 597242 600036 603723 608713 614883 621468 627718
60148 627718 633366 638503 643327 648048 652765 657397 661816 665976 669782 673023 675632 677917 680375 683493
60134 683493 687823 693805 701146 708688 715376 721060 725897 729302 730231 728381 724414 719011 712417 705104
60120 705104 698137 692549 688731 686603 685862 685836 685701 685319 685556 687371 690849 695334 700156 704896 709336 713616
60104 713616 718199 723153 727572 730187 730590 729476 727715 725510 722501 718359 713137 707336 701782 697281
60090 697281 694276 692850 692983 694515 696890 699368 701750 704687 708904 714224 719635 724264 727890 730451
60076 730451 731564 730887 728688 725543 721551 716246 709354 701239 692569 683961 676069 669480 664113 659059
60062 659059 653529 647720 642297 637153 631346 624336 616729 609524 603050 596925 590744 584400 577933 571557
60048 571557 565920 561908 559887 559235 558909 558517 558609 559831 562049 564554 566958 569479 572351 575413 578493
60033 578493 581785 585460 589075 591754 592868 592372 590691 588502 586409 584381 581608 577279 571437 564794
60019 564794 557879 550815 543790 537118 530708 524042 517052 510599 505726 502596 500472 498599 496832 495469
60005 495469 494718 494482 494646 495467 497472 500833 505015 509300 513569 518231 523455 528879 534152 539351 544651
59990 544651 549868 554614 558788 562735 566996 571890 577208 582281 586576 590245 593796 597224 599789 600813
59976 600813 600411 599259 597862 596233 594015 590757 586353 581413 576968 573483 570392 566950 563383 560845
59962 560845 560246 561466 563712 566293 568924 571540 574090 576442 578347 579516 579895 579871 580061 580759 581686 582411
59946 582411 582997 583950 585465 587004 587843 587849 587399 586723 585686 584206 582534 580992 579706 578592 577373 575598
59930 575598 573002 569969 567389 565937 565657 566192 567048 567622 567451 566725 566210 566425 567155 567962 568828 570005 571516
59913 571516 573173 574863 576494 577882 579100 580763 583483 587046 590525 593235 595233 596890 598448 600174
59899 600174 602477 605483 608711 611574 614194 617358 621575 626456 631209 635578 639982 644786 649722 654125
59885 654125 657576 660165 662338 664574 667063 669516 671498 673163 675391 678888 683274 687441 690702 693127
59871 693127 694784 695233 694007 691202 687345 682919 678214 673353 668242 662725 657044 651949 648153 645760
59857 645760 644383 643581 643050 642568 641988 641206 640077 638629 637498 637847 640531 645432 651802 659123 667469 677224
59841 677224 688721 702048 716972 732929 749063 764094 776273 783975 786766 785897 783666 782336 783387
59828 783387 787050 792014 795834 796080 791288 781011 765603 746336 725254 704301 684538 666373 650106
59815 650106 635819 623112 611593 601498 593296 586818 581347 576494 572353 568878 565740 562909 560620
59802 560620 558578 555934 552439 548961 546300 544017 541133 537665 534661 532801 531719 530826 530096 529675 529283
59787 529283 528554 527647 526961 526370 525258 523349 521011 518593 515954 512990 510209 508288 507185 506122 504445
59772 504445 502187 499846 497974 497022 497122 497857 498466 498469 498043 497807 498398 500098 502526 504752 506140 507134 508831
59755 508831 511786 515681 520090 524911 529885 534410 538269 541959 545924 549957 553782 557558 561233 563987
59741 563987 565169 565454 566226 567976 570040 571730 572925 573594 573582 572991 572048 570515 567969 564825 562333 561185
59725 561185 560682 559604 557453 554602 551771 549645 548496 547764 546487 544554 543100 543170 544325 545150 544923 544231
59709 544231 543997 544460 545317 546485 548456 551917 557102 563461 569988 575872 580908 585371 589697 594256 599202
59694 599202 604439 609861 615600 621732 627688 632224 634206 633376 630343 626108 621723 618092 615746 614675
59680 614675 614416 614342 614086 613909 614503 616048 617548 617589 615792 613018 610027 606531 601962 596594 591331 586708
59664 586708 582647 579041 576008 573642 572040 571543 572443 574296 576008 576893 577383 578500 580798 584030 587652
59649 587652 591330 594923 598175 600638 601942 602073 601266 599657 597161 593726 589564 585004 580316 575795 571907
59634 571907 569042 567114 565556 563791 561664 559494 557841 557147 557413 558169 558840 559156 559132 558734 557827 556516
59618 556516 555276 554484 553811 552306 549196 544593 539374 534512 530601 527901 526463 526010 525926 525693 525373 525521
59602 525521 526578 528440 530583 532431 533688 534477 535119 535626 535502 534323 532441 530765 529872 529694 530042 530858
59586 530858 531772 532026 531276 530061 528964 527690 525553 522629 519725 517260 514881 512220 509362 506391 503092
59571 503092 499493 496193 493727 491965 490562 489614 489365 489545 489602 489493 489624 489979 489953 489266 488558 488649 489502 490315
59553 490315 490506 490287 490315 491087 492727 495134 498151 501659 505544 509632 513788 518158 523231 529547 537402
59538 537402 546983 558805 573815 592810 615458 639544 661155 676056 681630 678050 667954 655119
59526 655119 643183 634746 630756 630425 632092 634536 637622 641822 647382 653928 660647 666701 671570 675057
59512 675057 676932 676725 674123 669437 663363 656254 647995 638639 628769 619079 609955 601618 594287 587922
59498 587922 582124 576595 571489 567075 563367 560348 558178 556759 555461 553790 552132 551277 551378 551959 552897
59483 552897 554693 557657 561439 565644 570413 576076 582608 589823 597852 607024 617307 628011 637964 645934
59469 645934 651088 653280 652831 650062 645300 639388 633751 629523 626757 624874 623834 624530 627949 634253 642812
59454 642812 652893 664085 676234 689338 703648 719567 737221 756182 775754 795395 814502
59443 814502 831798 845219 852671 852939 846078 833312 816659 798209 779433 761232 744477 729925
59431 729925 717345 705320 692553 679162 666249 654593 644356 635847 629692 626106 624687 625242 628379
59418 628379 634988 645389 659193 675784 694862 716816 742628 773063 807607 843963 878256 905522
59406 905522 920801 921285 908257 886729 862706 840571 822633 810265 804785 807135 816509 828885
59394 828885 837262 834602 817757 788901 753343 716340 681648 651608 627205 607943 592460 579596
59382 579596 568886 560266 553614 548493 544181 540142 536595 534283 533447 533380 533342 533519 534620 536837 539711
59367 539711 542850 546181 549525 552468 554739 556429 557756 558892 560004 561215 562548 564148 566493 570089
59353 570089 575010 580972 587843 595815 605139 616031 628840 643980 661545 681113 702005 723661
59341 723661 745828 768488 791488 814122 835224 853910 870110 884127 895828 904539 909673 911118
59329 911118 909016 903542 895108 884536 872777 860463 847839 835111 822727 811168 800443 790077
59317 790077 779882 770590 763234 757802 753009 747666 741868 736522 732130 728529 725479 722824 720183 717133
59303 717133 713844 711040 709198 708167 707704 707976 709342 712011 716164 722138 730290 740858 754273 771452
59289 771452 793407 820288 850550 880798 906407 922838 927213 919357 901746 878504 854013 831735
59277 831735 813560 799860 790167 783981 781119 781463 784578 789839 797019 806535 818820 833470 849221
59264 849221 864713 879043 891570 901595 908539 912249 912845 910292 904306 894716 881869 866679 850204
59251 850204 833123 815687 798226 781461 765981 751593 737739 724568 713074 704038 697273 692081
59239 692081 687944 684530 681596 679363 678578 679704 682328 685756 689850 694784 700248 705512 710077 713757
59225 713757 716164 716655 714879 711022 705544 698921 691565 683611 674863 665212 655065 645113 635874 627659
59211 627659 620613 614420 608334 602043 596236 591791 588701 586421 584926 584538 584806 584546 583202 581449 580297
59196 580297 580324 581855 584962 588906 592426 595230 598545 603583 609963 616329 622075 627739 633959 640826 648234
59181 648234 656113 664124 671616 678136 683755 688766 693335 697552 701537 705347 708924 712357 716145 721025
59167 721025 727434 735198 743769 752804 762484 773259 785302 798153 810791 822075 831332 838649 844480
59154 844480 848926 851560 851952 850015 845692 838751 829278 818042 805902 793183 780166 767886 757513
59141 757513 748914 740692 731976 723435 716154 710238 705190 701103 698541 697391 696688 695797 695223 695868 697889
59126 697889 700629 703554 706887 711267 717068 724247 732754 742805 754608 768011 782594 798035 814239
59113 814239 831147 848537 866011 883078 899288 914421 928445 941261 952625 962394 970603 977142
59101 977142 981636 983945 984499 983749 981513 977333 971370 964489 957482 950544 943444 935831 927562 919218 912086
59086 912086 906943 902890 898042 891380 883208 873821 862751 849774 835725 821637 807626 793301 778870
59073 778870 765163 752782 741756 731765 722278 712804 703553 695570 689621 685173 681062 676913 673214
59060 673214 670123 667105 663886 660993 658980 657633 656335 654800 653039 650957 648428 645645 642945 640322
59046 640322 637459 634367 631696 630242 630192 631017 632102 633393 635352 638321 641997 645570 648348 650272 651921
59031 651921 654126 657491 662124 667640 673469 679299 685384 692409 701008 711377 723381 736913 751955
59018 751955 768267 785257 802233 818622 833823 847001 857286 864165 867660 868246 866621 863285 858244
59005 858244 851414 843492 836099 830770 828061 827869 830131 834589 840202 845632 850476 855443 861144 867079
58991 867079 871986 874813 875323 874122 872199 870062 867180 862521 855615 846774 836393 824648 811948 799105
58977 799105 786754 775072 764287 755013 747817 742840 740152 740119 743032 748634 756273 765356 775441 786169
58963 786169 797333 808826 820397 831711 842709 853504 863728 872393 878651 882305 883270 880896 874386
58950 874386 863767 850113 834808 818816 802602 786586 771577 758630 748318 740251 733572 727840
58938 727840 723121 719379 716296 713669 711430 709216 706436 702868 698665 693782 688096 682168 677004 672718
58924 672718 668218 662657 656526 650836 645984 641981 638988 636827 634593 631694 628889 627396 627314 627801 628561
58909 628561 630174 633019 636810 641366 647103 654467 663418 673628 684799 696710 709292 722637 736544
58896 736544 750206 762845 774565 786092 797745 809302 820941 833729 848961 867379 889105
58885 889105 913876 941121 970075 999942 1029694 1057813 1082640 1103083 1118757 1129420 1134707 1134454
58873 1134454 1128867 1118204 1102630 1082628 1059377 1034521 1009638 985948 964328 945343 929080
58862 929080 914864 901289 886994 871706 856274 841461 826938 811704 795287 778164 761234
58851 761234 745283 730825 718042 706820 696998 688479 680972 673944 667171 661044 655932 651427 646671
58838 646671 641260 635424 629519 623814 618607 613976 609494 604663 599681 595275 591807 588994 586504 584320
58824 584320 582392 580447 578338 576272 574534 573259 572568 572633 573493 574953 576699 578370 579613 580345 580922 581781
58808 581781 582937 584047 584908 585610 586289 587010 587764 588332 588236 587199 585630 584385 584088 584809 586190 587598 588383
58791 588383 588428 588312 588623 589315 590129 591340 593564 596962 601217 606216 612186 619158 626776 634654 642506 650004
58775 650004 656995 663787 670555 676483 680118 680849 679490 677171 674145 669999 664662 658767 653155 648271
58761 648271 644029 640126 636495 633386 631033 629447 628616 628562 629035 629568 630249 631982 635404 639852 644110 647931
58745 647931 652049 656812 661777 666882 673075 681214 690795 700344 708861 716548 724300 732794 742118 752099
58731 752099 762832 774671 787648 801151 814344 826648 837648 846986 854759 861656 868185 874018
58719 874018 878587 882069 885280 888919 893443 899334 906711 914886 923036 931097 939239 946635 951658 953307
58705 953307 951653 946905 938942 927925 914521 899207 881888 862332 840515 816661 791652 767190
58693 767190 744625 723641 703096 683195 665679 651575 639936 629289 619266 610114 601586 593286
58681 593286 585535 578960 573527 568647 564071 560135 557260 555539 554682 554232 554059 554681 556727 560069 564045
58666 564045 568568 574384 582044 591337 601917 613775 626627 639416 650814 659858 665973 669025 669597
58653 669597 668592 666309 662490 657450 652307 647744 643310 638414 633256 628312 623568 618798 613976 608924
58639 608924 603218 596994 591214 586599 582936 579993 578414 578969 581389 584661 588027 591072 593332 594528
58625 594528 594926 594866 594264 593036 591592 590433 589725 589787 591470 595433 601445 609009 618182 629142 641391
58610 641391 654061 666642 678729 689458 697911 703846 707443 708658 707482 704546 700729 696376 691446
58597 691446 686168 680907 675639 670138 664513 659051 653859 649177 645744 644253 644711 646891 651047 657538
58583 657538 666063 675943 686892 698826 711206 723302 734950 746330 757142 766671 774567 780951
58571 780951 786005 790155 794503 800319 808105 817783 829644 844305 861721 881009 901453 923056 945882
58558 945882 969462 993081 1016254 1038566 1059303 1077415 1091817 1101774 1107241 1108784 1107003 1102147
58546 1102147 1094414 1084372 1072762 1060036 1046293 1031494 1015570 998587 980923 962903 944115
58535 944115 923740 901975 880544 861177 844015 828148 813270 799996 788745 779206 771083 764777
58523 764777 761060 760210 761442 763151 764027 764202 764992 767285 770571 773777 776475 778831 780935 782845 784943
58508 784943 787612 790753 794036 797351 800596 803379 805363 806580 807051 806564 805237 803685 802075 799603 795596
58493 795596 790594 785612 780838 775900 770984 766813 763697 761411 759820 758951 758696 759155 761104 765536 772852
58478 772852 782934 795520 809900 824698 838747 851908 864458 876051 885886 893396 898023 898881
58466 898881 895534 888808 880110 870357 860170 850369 841297 832330 823273 815683 811535 810881 812123 814336
58452 814336 817932 823179 829485 836270 843252 849564 853731 855009 853978 851586 848298 844256 839525 834093
58438 834093 828302 823226 819987 818775 819177 821117 824545 828526 831793 834205 836670 839767 843463 848105
58424 848105 854462 862661 872085 882495 894184 906917 919733 932080 944128 955692 965711 973190
58412 973190 977925 980014 979340 975884 970146 963065 955774 949144 943025 936279 928211 919679 912132 905997
58398 905997 900857 896707 893935 892328 891199 890382 890189 890602 891381 892579 893905 894136 892310 889101 885798
58383 885798 882492 878669 874953 872512 871123 869702 868563 869128 871390 873727 875576 878373 883291 889835
58369 889835 897225 905468 914361 923022 931265 940138 950480 962140 975027 989489 1005097 1020487 1035065
58356 1035065 1049538 1064208 1078113 1090490 1101608 1111433 1118917 1123571 1126553 1129289 1132126 1135096 1138891
58343 1138891 1144088 1150243 1156614 1163159 1170314 1178470 1187993 1199005 1210959 1223309 1236570 1251591 1267843
58330 1267843 1283843 1299344 1315535 1332838 1350087 1366214 1381155 1394754 1406464 1416594 1426120
58319 1426120 1434788 1441235 1445578 1449984 1455899 1462548 1469087 1476307 1485077 1494798 1504685 1515192 1527014
58306 1527014 1539972 1553890 1569246 1586067 1603446 1620964 1639238 1658386 1677531 1696533 1716508
58295 1716508 1737755 1758888 1778949 1798696 1818871 1838989 1858894 1879741 1902299 1925985 1950618
58284 1950618 1977251 2006136 2035741 2065087 2095274 2127370 2160630 2194223 2228961 2265854 2304506
58273 2304506 2344284 2385478 2428129 2471467 2515676 2562358 2612126 2663752 2716862 2773184 2833787
58262 2833787 2897422 2963119 3032033 3104975 3180468 3257059 3335217 3415065 3494660 3572623 3650186
58251 3650186 3728631 3807139 3885397 3965933 4051440 4142012 4237202 4338426 4446944 4561926 4682996
58240 4682996 4812280 4951509 5099588 5255505 5421032 5597966 5785517 5983116 6192810
58231 6192810 6416069 6651496 6898997 7162938 7447591 7752658 8076988 8423388 8795826
58222 8795826 9195389 9623491 10085824 10588531 11133624 11722739 12362102 13059104 13817790
58213 13817790 14643044 15545704 16538491 17631431 18837552 20178942 21681049 23366482
58205 23366482 25262738 27412293 29868626 32690090 35950178 39752218 44228633 49538878
58197 49538878 55888613 63550872 72855340 84160392 97847983 114332473 134044551
58190 134044551 157408049 184854433 216801650 253392897 293891643 335967596 375398845
58183 375398845 406671187 424519623 425827197 410881314 383210601 348087854 310644916
58176 310644916 274647240 242283392 214575450 191847434 173988355 160519818 150551492
58169 150551492 142752160 135520757 127431276 117741306 106601752 94807108 83290955
58162 83290955 72725201 63411316 55386076 48560989 42797910 37937481 33822590 30319744
58154 30319744 27322010 24739044 22494350 20531255 18811628 17304458 15978813 14806941
58146 14806941 13766491 12836384 11995319 11226952 10522189 9873827 9272958 8713058 8193453
58137 8193453 7715575 7278547 6880469 6520393 6196209 5903391 5638279 5399867 5185972
58128 5185972 4990170 4804747 4624419 4445666 4265893 4086004 3911241 3746539 3592595
58119 3592595 3448132 3313370 3188835 3073030 2963990 2861599 2766247 2676846 2592078 2511918
58109 2511918 2436145 2363232 2292528 2225601 2163520 2104677 2047193 1991529 1938671 1887678 1837312
58098 1837312 1788397 1742281 1698473 1656056 1615986 1579647 1546313 1514270 1483418 1454654 1427700
58087 1427700 1401585 1376462 1353044 1330975 1309493 1288912 1269827 1251662 1233481 1215260 1196831
58076 1196831 1176693 1153654 1128802 1104164 1080239 1056412 1032942 1010726 989761 969544 950497
58065 950497 933529 918622 905133 892928 882095 872142 862641 853928 846088 838090 829031 819314 809510
58052 809510 799130 787791 776508 766333 756644 746242 735303 724861 715248 706410 698852 692681
58040 692681 686544 679069 670730 662853 655554 648163 640935 634698 629302 623870 618098 611951 604653 595515
58026 595515 585281 575344 566031 556841 547769 539127 530697 522325 514731 508442 502668 496557 490751 486228
58012 486228 482440 478272 474097 471068 468980 466731 464555 463824 464658 465473 465087 463843 462583 461817 461899 462908
57996 462908 464336 465882 468117 471322 474304 475766 476303 477495 479511 481282 482675 484628 487254 489521
57982 489521 490961 492030 492658 492017 490010 487570 485258 482806 480284 478427 477562 477287 477284 477420 477153 476064
57966 476064 474850 474510 474675 474160 473053 472745 473821 475414 476781 477979 478764 478315 476412 473544 469686 464370
57950 464370 458176 452527 447661 442356 436153 430259 425613 421634 417766 414843 413845 414427 415714 417636 420567
57935 420567 424488 429365 435648 443595 452698 462393 472663 483392 493883 503576 512574 520843 527640
57922 527640 532368 535430 537643 539331 540400 540669 539612 536404 530753 523288 514812 505757 496583 487885
57908 487885 479719 471543 463259 455545 448721 442085 434929 427394 419677 411220 401581 391542 382452 374738
57894 374738 367792 361030 354442 348204 342438 337337 333194 330236 328535 327892 327858 328196 329297 331628 334831
57879 334831 338004 340955 344327 348239 351697 353840 354948 355560 355253 353225 349693 345850 342427 338989 334750
57864 334750 329627 324309 319538 315573 312324 309840 308360 307902 308241 309554 312624 317883 324658 331983 339721
57849 339721 348107 356577 364186 371093 378498 386961 395768 404098 411748 418474 423751 427595 430612 432746
57835 432746 433022 431110 428086 424916 421048 415417 408100 400127 392253 384804 378199 372708 368018 363846
57821 363846 360698 359167 358744 358200 357166 356587 357353 358962 359882 359133 357343 356171 356618 358165 359780 361281
57805 361281 362971 364202 363454 360077 355033 349522 343809 337878 332301 327688 323943 320844 318797 318177 318359
57790 318359 318189 317221 315900 314759 313933 313214 312174 310540 308781 307859 308039 308500 308599 308877 310184 312418 314925
57773 314925 317635 320901 324572 328169 331821 336155 341225 346249 350416 353365 354953 355185 354359 352734 350028
57758 350028 345762 340119 334016 328260 322948 317633 311778 305184 298372 292431 288129 285236 283022 281219
57744 281219 280109 279788 279790 279437 278286 276340 274050 272033 270583 269544 268655 267746 266555 264853 262938 261494
57728 261494 260640 259658 257994 255999 254291 252951 251843 251201 251287 251971 253129 254890 256820 257594 256432 254393
57712 254393 253218 253163 252996 251885 250221 248594 247126 246007 245740 246381 247214 247547 247382 247158 247315 248246 250142
57695 250142 252714 255443 258154 260904 263352 264816 265028 264346 263189 261768 260361 259250 258331 257411 256961
57680 256961 257931 260697 264972 271009 280135 293607 311577 333765 360733 393912 434689 484091 543203
57667 543203 613157 694112 783651 875323 958208 1018798 1045385 1032894 985049 912509 828348
57656 828348 743676 665400 596378 536957 486517 444301 409555 381409 358860 340913 326625
57645 326625 314892 304448 294422 284962 276912 270698 265807 261569 258054 255805 254854 254404 253484 251779
57631 251779 249858 248679 248724 249498 250069 250086 249918 249761 249191 247913 246383 245204 244293 243213 241973 240892 239930
57614 239930 238754 237301 235725 233955 231895 229950 228720 228163 227631 226738 225672 224680 223759 222970 222540 222483
57598 222483 222425 221920 220734 218917 216865 215145 213887 212524 210474 207859 205046 201822 197719 193092 189087
57583 189087 186464 185029 184269 183906 183716 183402 182904 182324 181453 179872 177697 175672 174300 173307 172170 170776
57567 170776 169317 167922 166593 165261 163755 162026 160453 159600 159593 160044 160581 161122 161661 162260 163204 164627 165993
57550 165993 166507 166178 165947 166631 168232 170340 172545 174248 174782 174219 173628 174105 175780 177997 180082 181662
57534 181662 182611 183068 183278 183205 182571 181439 180403 179965 179990 180024 179952 180140 181100 183056 185619 187904 189262 189878
57516 189878 190397 191081 191830 192810 194351 196193 197622 198551 199717 201521 203368 204553 205112 205307 204894 203505
57500 203505 201356 199046 196968 195297 194112 193069 191384 188687 185571 182855 180686 178828 177394 176626
57486 176626 176236 175672 174859 174103 173383 172402 171279 170584 170564 170811 170806 170456 169926 169227 168158 166603 164830 163506
57468 163506 163214 163860 164668 164903 164425 163522 162525 161735 161420 161618 162141 162879 163833 164794 165439 165956 167063 169097
57450 169097 171497 173533 175065 176211 176803 176732 176457 176513 176825 177091 177501 178368 179332 179744 179805 180504 182269 184313
57432 184313 185575 185796 185482 185213 185270 185637 186179 186927 188162 190009 192042 193653 194752 195752 196832 197590
57416 197590 197570 196837 195890 195169 194663 193906 192513 190915 190300 191432 193707 195818 197238 198490 199985 201311
57400 201311 201879 201724 201251 200597 199761 199133 199378 200681 202402 203656 204156 204394 205015 206146 207469 208859 210653
57383 210653 213120 216014 218934 221947 225380 228996 231871 233288 233516 233488 233876 234595 235104 235000 234459 234188
57367 234188 234846 236365 237917 238730 238890 239202 240281 242013 243971 245991 247980 249387 249510 248542 247771 248296
57351 248296 249846 251351 252393 253513 255294 257795 260858 264260 267475 270007 272176 274890 278292 281362
57337 281362 283325 284754 286656 288962 290704 291413 291583 291897 292604 293660 294963 296382 297886 299601 301524
57322 301524 303356 304933 306526 308384 310266 311913 313722 316388 319968 323775 327140 329881 332210 334623
57308 334623 337749 341788 346145 350018 353245 356134 358743 360899 362888 365478 369186 373911 379294 384956
57294 384956 390398 395094 398785 401461 403181 404278 405485 407322 409480 411311 412796 414447 416442 418559
57280 418559 420943 424215 428660 433895 439498 445462 451913 458858 466310 474271 482575 491235 500836 511982
57266 511982 524376 537089 549759 562765 576161 589201 601183 612114 622347 632228 642273 652902
57254 652902 663664 673485 682064 690349 699177 708232 716909 725499 734734 744613 754500 764080 773543 782981
57240 782981 792276 801502 810912 820533 830139 839668 849432 859922 871475 883924 896537 908642 920454
57227 920454 932890 946429 960661 975116 989858 1004882 1019647 1033864 1048255 1063759 1080292
57216 1080292 1096952 1113211 1129206 1145138 1161179 1177901 1195991 1215332 1234943 1253975 1272354
57205 1272354 1290386 1308275 1326280 1344911 1364584 1385142 1405868 1425923 1444837 1462838 1480697
57194 1480697 1499022 1517644 1535809 1553026 1569565 1586156 1603326 1621108 1639344 1658200 1678215
57183 1678215 1699674 1722040 1744343 1766231 1788336 1811483 1835875 1861146 1886850 1912629 1938159
57172 1938159 1963260 1987885 2011941 2035305 2058066 2080397 2102144 2123001 2143184 2163308 2183466
57161 2183466 2203141 2222445 2242613 2264622 2287928 2311382 2334824 2358845 2383265 2406924 2429012
57150 2429012 2449770 2469818 2489413 2508487 2526758 2543766 2559315 2573897 2588185 2602101 2614926
57139 2614926 2626232 2636141 2644788 2652224 2658855 2665170 2670992 2675767 2679755 2684188 2689966 2696929 2704685 2713461
57125 2713461 2723711 2735529 2748833 2763610 2779468 2795486 2811105 2826881 2843951 2862985 2884015
57114 2884015 2907116 2933015 2963340 3000497 3046933 3104186 3172799 3253104 3345635 3450843 3569371
57103 3569371 3703215 3856298 4033884 4242421 4490640 4790207 5154766 5599150 6140183
57094 6140183 6797392 7591647 8542918 9668787 10982203 12487083 14174578 16023513 18003153
57085 18003153 20074575 22192168 24308682 26378804 28351793 30156358 31696854 32873287
57077 32873287 33611810 33880186 33680560 33035613 31984095 30583207 28906114 27032200 25037702
57068 25037702 22991669 20954580 18976377 17094887 15336217 13715910 12239308 10902183
57060 10902183 9693432 8599356 7607526 6708872 5897954 5171718 4527593 3962105 3470580
57051 3470580 3047325 2685646 2377987 2116607 1894339 1704764 1541987 1400659 1276256
57042 1276256 1165183 1064741 973218 889961 814928 747916 688276 635340 588791 548370 513400
57031 513400 482972 456621 434538 417058 404267 396349 394053 398502 410753 431875 463276 506572
57019 506572 563505 636855 731452 852714 1001917 1170826 1339329 1478157 1557224 1557690 1481561
57008 1481561 1351062 1196579 1042413 901021 776620 670355 581737 508459 447582 396977
56998 396977 355023 319850 289910 264692 243984 226957 212824 201797 194321 189701 186504 184222
56986 184222 183632 185546 190062 197000 206084 216326 225730 231929 232977 227888 217151 202790 187307
56973 187307 172379 158775 147062 137507 129449 121870 114914 110017 108159 108806 111082 115290 122509 133117
56959 133117 146545 162282 180285 200178 220484 238945 253383 262160 264166 258989 247427 231684
56947 231684 214568 198124 183102 169737 158646 150594 145667 143259 142910 144735 149008 155798 165193
56934 165193 177544 193275 212665 235815 262285 290353 316796 337699 349691 350776 340743 321331
56922 321331 295853 268063 240851 215681 192961 172852 155677 141617 130120 119960 110175 100872
56910 100872 92862 86543 81379 76550 71909 68168 66117 65651 65680 65199 64406 64371 65571 67350 69092 71289
56894 71289 74889 80120 86801 95414 106901 121405 138185 156929 178306 202776 229343 255666
56882 255666 278817 295833 304521 304611 297992 287424 275133 262596 250949 241026 233279 228162 226429
56869 226429 228692 234874 244467 257302 273880 295109 321957 355253 395564 443009 496826 554567
56857 554567 611525 661247 697171 714451 711344 689947 655723 615393 574416 536041 502145 474097
56845 474097 452643 437802 429460 427857 433301 445957 466340 495632 535052 585130 645893 717322
56833 717322 798822 887656 977512 1058436 1118833 1149173 1145453 1110129 1050392 975701 895715 818262
56821 818262 747678 685100 630729 585489 550362 525099 508545 500021 499744 508131 525332 551447
56809 551447 586702 631318 685121 746532 811093 871049 917145 941573 940183 913318 865615 804648
56797 804648 738454 673291 612916 559079 512206 472134 438894 412805 393667 380417 372120 368939
56785 368939 371558 380017 393772 412543 436270 464177 494362 523941 548866 563982 564706 549583
56773 549583 521097 483983 443037 402110 363870 329578 299230 272368 248779 228417 211057
56762 211057 196219 183270 171489 160329 149793 140447 132831 126884 121943 117267 112580 108173 104406
56749 104406 101173 98056 95041 92649 91128 89845 87882 85036 81961 79477 78019 77500 77367 76991 76289
56734 76289 75712 75401 74759 73333 71659 70597 70112 69486 68579 68056 68344 69113 70035 71345 73304 75543 77347
56717 77347 78343 78707 78860 79114 79470 79707 79776 79979 80487 80843 80368 79038 77584 76650 76213 75918 75655 75596 75767
56698 75767 75771 75008 73355 71542 70460 70017 69230 67779 66818 67615 69878 72228 73980 75535 77184 78640
56682 78640 79914 81655 84107 86436 87651 87741 87464 87335 87273 87084 86913 87193 88200 89665 90987 91901 92713
56665 92713 93586 94060 93843 93760 95025 97547 99769 100475 100105 100005 100896 102409 103691 104167 104028 104185 105420
56648 105420 107475 109308 110319 110892 111674 112882 114550 116907 120136 124042 128262 132515 136463 139652 141841
56633 141841 143218 144159 144991 146005 147321 148649 149577 150191 151046 152377 153651 154052 153139 151053 148486 146414
56617 146414 145406 144998 144240 142962 141986 141938 142337 142201 141194 139844 138855 138356 137717 136093 133411 130692 129051
56600 129051 128445 127895 126771 125274 123739 122272 121188 120988 121548 122025 121945 121804 122275 123331 124499 125480 126170
56583 126170 126546 126861 127498 128389 128997 129112 129123 129351 129713 130245 131272 132734 134153 135668 138279 142394 146895
56566 146895 150432 153149 156378 161015 166941 173699 180945 188429 196253 205013 215040 225535 234907 241946
56552 241946 246383 248678 249782 250882 252719 255048 257051 258128 258095 256982 255123 253180 251624 250345 249076
56537 249076 247888 246842 245509 243400 240654 237705 234503 230641 226205 221872 218119 214763 211371 207748
56523 207748 203941 200020 195988 191830 187717 184147 181612 179925 178164 175527 172058 168383 165049 162311
56509 162311 160241 158702 157466 156577 156374 156996 158186 159731 161648 163704 165256 165957 166215 166611 167238 167904
56493 167904 168523 168972 168988 168648 168488 168809 169297 169681 170166 170779 170946 170364 169764 170091 171343 172812 174020 174771
56475 174771 174802 174187 173702 173985 174619 174776 174443 174204 174167 174022 173970 174668 176249 178175 180016 181667 182919 183526
56457 183526 183737 184098 184741 185530 186745 188852 191564 193872 195154 195721 196220 196989 197980 198818 198952 198262 197417
56440 197417 197184 197525 197895 198191 198781 199787 201049 202626 204623 206579 207763 208072 207993 207789 207393 206994 206961
56423 206961 207194 207243 207103 207189 207545 207738 207573 207276 207015 206878 207213 208255 209482 210112 210179 210362 210815 211067 211061 211248
56403 211248 211510 210952 209184 206985 205342 204453 203976 203576 202944 201920 200914 200639 201185 201928 202514 203355 204916
56386 204916 207077 209404 211523 213131 214212 215376 217332 219943 222411 224423 226372 228380 229999 231126
56372 231126 232327 233882 235239 235819 235708 235248 234572 233841 233346 233136 233146 233765 235435 237502 238454 237692 236243
56355 236243 235301 234992 235003 235442 236297 236907 236806 236505 236683 237139 237314 237347 237824 238800 239773 240386 240613 240544 240487 240971
56335 240971 242178 243712 245295 247244 249828 252685 255450 258463 262186 266263 269830 272517 274559 276231
56321 276231 277812 279880 282993 287083 291523 295629 298794 300502 300723 300077 299170 298043 296687 295642 295475
56306 295475 295958 296527 297362 299196 302024 304828 306896 308863 311957 316417 320986 323972 324675 323801 322599
56291 322599 321707 320843 319485 317651 315984 315278 315899 317482 319173 320371 321216 322217 323535 324958 326460
56276 326460 328312 330602 332978 334963 336269 336920 337412 338595 340892 343712 346134 348042 350045 352476 355246
56261 355246 358616 363153 368694 374198 378975 383419 388243 393667 399730 406696 414735 423769 433925 445543
56247 445543 458406 471658 484948 498988 514477 531015 547646 563949 580034 595808 610835
56236 610835 624698 637133 648043 657576 665886 672629 677168 679394 679818 678671 675544 670214 663191 655133
56222 655133 646347 637172 628205 619709 611327 602769 594247 585986 577966 570463 564049 558575 552943 546482
56208 546482 539918 534349 529872 525824 521837 517985 514408 511423 509532 508696 508027 506874 505802 505885 507336
56193 507336 509386 511224 512528 513362 514041 514915 515989 517007 518056 519603 521700 523791 525631 527749 530513
56178 530513 533363 535524 537077 538781 541165 544161 547311 550104 552451 554944 558139 561658 564686 567395
56164 567395 570874 575540 580679 585822 591415 597671 603935 609912 616492 624625 634260 645022 656997 670129
56150 670129 683728 697372 711489 726392 741622 756950 773173 791235 811475 834385 861007
56139 861007 891833 926444 965196 1010268 1064140 1128089 1203176 1291452 1394624 1511991 1640462
56128 1640462 1775553 1911270 2040257 2156041 2255375 2338203 2406602 2464739 2518170 2570718
56118 2570718 2621648 2666563 2700519 2719941 2723333 2712292 2691431 2665709 2637588 2606815 2571367
56107 2571367 2527186 2468455 2390646 2293693 2181633 2060119 1935379 1814134 1701984 1601620
56097 1601620 1513503 1437683 1373847 1320549 1276053 1239560 1210415 1186946 1167541 1152088 1140877
56086 1140877 1132889 1126756 1122613 1121254 1122089 1123669 1125686 1128770 1132773 1136960 1141402 1146603 1152196 1157566
56072 1157566 1163280 1170471 1179397 1189945 1202664 1217692 1233542 1248797 1264162 1281070 1299201 1317348
56060 1317348 1335802 1355658 1376510 1397063 1417389 1438322 1459243 1478778 1497198 1515837 1534615
56049 1534615 1552486 1569835 1588067 1607188 1626192 1645462 1666368 1688757 1711267 1733873 1757792
56038 1757792 1783204 1809495 1837402 1868385 1901989 1936253 1970543 2005754 2042123 2079362 2118476
56027 2118476 2160884 2206071 2252633 2301003 2352388 2405622 2458171 2509918 2562986 2618226 2674987
56016 2674987 2733921 2796658 2862934 2931380 3002877 3079685 3161487 3245904 3332795 3424430 3521467
56005 3521467 3622530 3727780 3839067 3956416 4078230 4205146 4339931 4483484 4634761
55996 4634761 4794556 4965180 5146480 5336510 5536097 5748236 5973056 6208218 6454373
55987 6454373 6715265 6992488 7285500 7596961 7932348 8294012 8681498 9098145 9551162
55978 9551162 10044665 10579185 11158737 11791463 12482565 13234234 14053982 14955708 15951537
55969 15951537 17050914 18269416 19630173 21155673 22868650 24804357 27013444 29552434
55961 29552434 32484978 35898608 39912678 44672798 50358535 57206970 65516202 75619592
55953 75619592 87870760 102654627 120384224 141471598 166322428 195333713 228713941
55946 228713941 265966595 305191585 342697818 373426222 392280341 395881242 383867043
55939 383867043 358977932 325860604 289338277 253133465 219502033 189512328 163462240
55932 163462240 141187653 122285201 106284039 92735901 81232098 71410721 62976996
55925 62976996 55704930 49413467 43951009 39198483 35065143 31471045 28340097 25608473
55917 25608473 23225757 21144058 19315614 17702616 16279077 15020348 13899356 12894828
55909 12894828 11994179 11185469 10453779 9787430 9180378 8626240 8116433 7645919 7214172
55900 7214172 6818572 6452834 6113471 5801566 5516310 5252692 5007496 4781835 4575605
55891 4575605 4384913 4207295 4044429 3897317 3763503 3641462 3533321 3440818 3362697 3298507
55881 3298507 3251149 3223111 3213452 3220472 3243873 3281741 3327930 3374284 3412907 3435028 3431064 3394361
55869 3394361 3323371 3219622 3086637 2932018 2767134 2602257 2443429 2294574 2159376 2039335
55859 2039335 1932574 1836561 1750290 1672803 1601985 1536406 1476404 1422137 1372439 1326574 1285028
55848 1285028 1247529 1212303 1178314 1146206 1116108 1086660 1057258 1029176 1003366 979102 955790
55837 955790 934076 914149 894952 876204 859167 844251 829821 814634 799654 786244 774152
55826 774152 762482 751131 740206 729438 719000 709373 699701 688000 673737 658584 643968 629840
55814 629840 616524 605484 597019 589211 580641 572473 566479 562531 559428 556761 554666 553026 552234 553601
55800 553601 557862 564286 572052 581154 591043 599905 606425 611102 614726 616757 616169 612778 606858 598552
55786 598552 588589 578420 568884 559760 551028 543071 534987 524512 510678 495080 479614 464624 450372
55773 450372 438637 431261 428330 429156 433899 442770 454458 466521 476473 481762 480139 471522 458668
55760 458668 444853 431655 419608 409484 401549 394693 387832 381425 376429 372515 368525 363941 358847
55747 358847 353124 346683 339808 332475 324183 315232 307130 300860 295790 291219 287798 286289 285961 285464 284327
55732 284327 282505 279492 275188 270712 267095 264003 260823 257935 255548 252390 247217 240860 235185 230618
55718 230618 226286 222027 218584 216136 214271 213304 214243 217368 221973 227395 233325 239233 244500 249010 252761
55703 252761 255161 255508 253850 250565 245526 238567 230325 221710 212943 204026 195652 188678 183105 178535
55689 178535 175102 172949 171289 169188 166927 165450 164756 164009 163002 162411 162716 163961 166374 170107 174276
55674 174276 177270 178131 176971 174221 170335 166130 162506 159701 157406 155542 154305 153644 153347 153414 153804 154085
55658 154085 154054 154373 155921 158808 162648 167330 172750 178256 183266 188102 193277 198300 202135 204639 206566
55643 206566 208271 209290 209111 207593 204714 200645 195980 191221 186184 180489 174351 168234 162128 155912
55629 155912 150023 144927 140304 135700 131615 128890 127277 125733 124031 122930 122698 122556 121827 120780 120046
55614 120046 119832 119892 119742 118834 117057 115060 113609 112724 111876 110795 109556 108190 106875 106150 106233 106420 105923
55597 105923 105032 104591 104646 104512 104001 103588 103460 103327 103208 103485 104119 104594 104690 104593 104246 103376 102266 101782 102545
55578 102545 104565 107594 111194 114574 117057 118754 120335 122345 125269 129803 136206 143631 150866 157457
55564 157457 163275 167498 169250 169045 168313 167480 165717 162668 159124 155648 151704 146708 141020 135336 129876
55549 129876 124668 120054 116349 113439 111025 108860 106601 103933 101044 98568 96981 96400 96804 97825 98485
55534 98485 97909 96374 94968 94239 93845 93406 92861 92017 90750 89756 90072 91516 92504 91798 89741 87479 85768
55517 85768 84921 85083 85983 86932 87507 87818 87924 87550 86739 86155 86239 86541 86303 85453 84710 84939 86569 89312 92260
55498 92260 94451 95478 95489 94853 94112 93874 94215 94390 93740 92615 91778 91223 90388 89237 88146 86933 85082
55481 85082 82914 81422 80795 80213 79293 78630 78633 78879 79008 79250 79641 79700 79365 79246 79389 78781 76810 74358 72710
55462 72710 72066 71871 71932 72402 73174 74075 75262 76784 78137 78878 79296 79868 80428 80488 80098 79749 79597 79341 78760
55443 78760 78026 77561 77843 79091 80893 82354 82855 82490 81720 80976 80643 80922 81554 82121 82757 83957 85553
55426 85553 86585 86494 85851 85581 86026 87081 88614 90313 91735 92968 94763 97580 101000 104443 107929 111650
55410 111650 115255 118037 119492 119358 117597 114648 111246 107660 103637 99337 95639 93066 91140 89291
55396 89291 87736 86852 86384 85982 85903 86388 86839 86494 85560 84882 84789 85018 85513 86425 87408 87718 87119 86150 85441
55377 85441 85201 85333 85631 85833 85805 85610 85250 84580 83685 82994 82656 82154 80908 79001 76947 75111 73728 73086
55359 73086 73167 73493 73763 74319 75496 76909 77971 78775 79775 80828 81280 80914 80215 79677 79366 79112 78716 77960
55341 77960 76780 75399 74034 72685 71473 70909 71388 72609 73883 74869 75672 76470 77388 78506 79612 80235
55325 80235 80262 80244 80706 81497 82174 82651 83020 83156 83061 83218 84027 85212 86306 87308 88161 88070 86314 83557 81382
55306 81382 80492 80237 79893 79595 79743 80250 80718 80864 80574 79974 79606 80021 80986 81498 80787 79016 76969 75442
55288 75442 74995 75781 77353 78954 80221 81380 82696 84029 85086 85818 86380 86842 87110 87094 86861 86586 86332
55271 86332 85923 85222 84504 84261 84595 85129 85569 85936 86123 85844 85296 85232 85882 86435 86236 85915 86462 87627 88232
55252 88232 87900 87455 87550 87847 87778 87420 87304 87861 89247 91161 92746 93158 92424 91313 90359 89518 88755 88289
55234 88289 88094 87797 87332 87132 87353 87482 87093 86557 86551 87154 87855 88261 88427 88588 88870 89231 89517 89586 89429 89160
55214 89160 88913 88807 88894 88936 88460 87368 86345 86177 86651 86617 85374 83615 82725 83344 84845 86093 86510 86361
55196 86361 86162 86011 85734 85552 86126 87670 89468 90642 91126 91423 91745 91925 92025 92321 92743 92935 92897 92982 93182
55177 93182 93034 92414 91889 92003 92650 93325 93647 93371 92326 90679 88974 87668 86818 86379 86523 87396 88723
55160 88723 89953 90763 91356 92246 93730 95429 96477 96385 95639 95235 95661 96592 97455 97974 98177 98195 98108 97820 97177
55141 97177 96392 96061 96354 96474 95548 93965 93107 93631 94699 95188 95095 95306 96319 97604 98137 97354 95674 94187
55123 94187 93678 93909 94022 93545 92723 91944 91272 90630 90156 90188 90998 92534 94246 95431 95974 96467 97227 97602
55105 97602 96909 95729 95376 96180 97257 98033 98960 100317 101364 101380 100816 100677 101250 102130 103059 103995 104661 104782
55087 104782 104622 104661 104850 104790 104578 104790 105549 106233 106289 105855 105281 104518 103352 101981 100875 100143 99439 98600 97971
55068 97971 97848 97879 97439 96539 95888 95988 96656 97613 99048 101153 103488 105374 106681 107653 108148 107709 106378
55051 106378 104759 103174 101367 99282 97568 96924 97249 97783 97917 97714 97788 98676 100171 101353 101573 101256 101293
55034 101293 101778 101971 101507 100924 100837 101245 101893 102632 103077 102580 101149 99944 100252 102178 104699 106724 107672
55017 107672 107417 106289 105049 104334 104062 103658 102852 102029 101804 102400 103449 104328 104752 105023 105551 106245 106635 106557
54999 106557 106338 106295 106474 106949 107897 109236 110653 112119 113898 115911 117585 118590 119198 119677 119842 119538 119006
54982 119006 118384 117373 115833 114285 113355 113172 113662 114897 116636 118059 118622 118728 118939 119019 118521 117890 118000
54965 118000 118792 119373 119426 119547 120086 120615 120931 121718 123573 125905 127460 127693 127160 126666 126458 126282 125920 125512
54947 125512 125373 125555 125687 125342 124498 123498 122624 121891 121260 120846 120798 121058 121358 121496 121593 121999 122805 123578 123776
54928 123776 123480 123475 124585 127119 130943 135698 140830 145855 150908 156783 164105 172579 181283 189477 196900
54913 196900 203435 208757 212288 213410 211844 207821 201755 193846 184430 174579 165759 158730 153313 149280
54899 149280 146685 145038 143075 140103 136955 134833 133753 132959 132380 132569 133373 133764 133204 132348 132108 132676
54883 132676 133717 135047 136765 139064 142165 146230 151286 157349 164558 172922 182102 191636 201088 209645
54869 209645 215968 219144 219550 218164 215202 210221 203437 196003 188801 181737 174553 167589 161347 155862
54855 155862 150924 146465 142347 138190 133869 129894 126932 125106 124030 123271 122529 121557 120204 118455 116352
54840 116352 114028 111925 110678 110612 111472 112740 114034 115161 116066 116824 117524 118112 118551 119072 119896 120695 120758
54823 120758 119828 118492 117601 117569 118307 119478 120646 121438 121769 121718 121234 120257 119182 118749 119295 120393 121364 121868
54805 121868 121918 121671 121380 121234 121137 120937 120847 121222 121853 122025 121493 120889 120908 121547 122459 123526 124673 125566 125999
54786 125999 126296 126821 127366 127515 127387 127511 128102 128956 129959 131211 132642 133952 134989 135890 136904 138403
54770 138403 140983 145151 150743 157026 163466 170221 177737 186082 194790 203270 211264 218861 226013 232085
54756 232085 236067 237269 235605 231163 223958 214461 203986 193999 185117 177180 170177 164553 160598 158045
54742 158045 156402 155310 154470 153681 153128 153175 153630 153609 152524 150907 149838 149742 150122 150368 150406 150579 151256 152695
54724 152695 155052 158420 162939 168844 176225 184812 194138 203764 213086 221028 226422 228803 228481 225745
54710 225745 220439 212591 203082 193286 184201 176186 169303 163479 158527 154444 151593 150139 149407 148342
54696 148342 146673 145101 144214 143717 142984 141900 140774 139754 138774 137881 137277 137027 136962 136794 136265 135333 134317
54679 134317 133622 133233 132742 131957 131103 130352 129606 129007 129101 130049 131131 131558 131419 131274 131202 130899 130437 130131 129822
54660 129822 129048 127916 127028 126493 125811 124893 124447 124995 126163 127296 128180 128750 128642 127659 126381 125759 126160
54643 126160 127115 127888 128079 127855 127791 128278 129004 129304 129153 129341 130348 131476 131598 130505 129013 127884 127122
54626 127122 126364 125503 124761 124381 124373 124525 124637 124733 124955 125228 125297 125171 125228 125683 126232 126524 126748 127401 128550 129703
54606 129703 130377 130513 130354 130174 130212 130644 131538 132899 134715 136789 138618 139698 140031 140172 140674 141593 142617
54589 142617 143530 144337 144912 144765 143528 141619 140095 139612 139801 139959 140063 140591 141465 141916 141588 141177 141508 142375
54571 142375 142806 142331 141509 141200 141689 142586 143367 143889 144441 145304 146319 147037 147279 147349 147577 147979 148493 149259 150325
54552 150325 151313 151746 151589 151210 150865 150530 150159 149840 149663 149660 149889 150421 151314 152681 154662 157104 159490 161471
54534 161471 163301 165374 167467 168954 169801 170756 172316 173928 174638 174237 173353 172522 171661 170514 169211 168175
54518 168175 167649 167528 167504 167217 166365 164899 163128 161459 159979 158398 156473 154391 152731 152099 152693 153974
54502 153974 154792 154190 152306 150305 149282 149452 150487 152177 154310 156256 157357 157792 158530 160265 162675
54487 162675 164839 166093 166460 166559 167196 168682 170456 171637 172035 172298 173046 174247 175576 176968 178569 180431
54471 180431 182482 184562 186348 187582 188567 190113 192667 195722 198296 199787 200201 199825 198991 198006 197092 196470
54455 196470 196466 197252 198385 198990 198562 197318 195727 194157 193075 192946 193596 194172 194083 193460 192423 190609 188029
54438 188029 185732 184745 184767 184708 184189 183603 183021 182080 180934 180289 180290 180261 179772 179170 178800 178499 178233 178411 179043 179285
54418 179285 178505 177330 176913 177485 178263 178572 178374 177843 177124 176601 176790 177722 178802 179471 179692 179598 179077 178059
54400 178059 177063 176963 178061 179654 180714 180962 181086 181892 183374 184697 185067 184542 183942 183976 184561 185098 185339
54383 185339 185654 186313 186822 186453 185296 184267 183968 184003 183710 183105 182746 182977 183727 184831 186085 187067 187351 186956
54365 186956 186356 186063 186411 187584 189446 191375 192634 192969 192612 191762 190425 188735 187063 185638 184339 182999
54349 182999 181695 180587 179611 178469 176885 174846 172646 170667 169095 167932 167330 167600 168656 169677 169688
54334 169688 168414 166344 164157 162397 161457 161348 161536 161483 161365 161748 162570 163021 162644 161973 161724 161829 161719 161338
54316 161338 161338 162243 163799 165254 166138 166620 167125 167735 168130 168145 168137 168568 169357 169895 169681 168764 167666 167038 167225
54297 167225 167882 168183 167708 166934 166463 166109 165344 164425 164208 164769 165086 164428 163302 162525 162010 161122 159804 158630
54279 158630 157964 157654 157422 157042 156269 155130 154238 154348 155532 157155 158620 159741 160393 160321 159508 158404 157588
54262 157588 157373 157795 158679 159537 159667 158695 157000 155427 154617 154676 155338 156237 157067 157702 158256 158873 159412 159506 159032
54243 159032 158342 157879 157691 157571 157502 157631 157856 157903 157877 158232 158928 159131 158247 156917 156371 156905 157575 157448 156651
54224 156651 156057 156260 157029 157518 157003 155617 154282 153638 153220 152207 150788 150033 150353 150872 150678 150057 149938
54207 149938 150625 151636 152454 152829 152557 151554 150179 148972 148046 147121 146170 145655 145949 146806 147590 147887 147790 147673
54189 147673 147902 148739 150306 152404 154354 155298 154939 153914 153204 153216 153602 153830 153660 153112 152342 151591 150962 150274
54171 150274 149430 148854 149168 150461 152284 154270 156237 157750 158340 158295 158521 159329 160011 159955 159396 158616 157181
54154 157181 154711 151844 149647 148444 147967 148252 149476 151119 152178 152213 151521 150380 148943 147780 147606 148271
54138 148271 148787 148634 148290 148166 147812 146726 145410 144898 145522 146738 148040 149501 151286 153095 154381 155010
54122 155010 155439 156102 156776 156836 156183 155569 155741 156539 157236 157590 158044 158937 159982 160654 160732 160323 159677 159091 158731
54103 158731 158453 158008 157412 156848 156258 155406 154426 153830 153858 154172 154432 154790 155547 156553 157261 157274 156632 155717 155004
54084 155004 154827 155213 155941 156778 157605 158412 159313 160490 161888 163130 164028 165013 166633 168675 170327 171186 171527
54067 171527 171508 170866 169730 169054 169656 171175 172520 173053 172902 172428 171947 171779 172045 172453 172737 173160 174160 175613
54049 175613 176951 177975 179032 180326 181536 182304 182789 183558 185108 187522 190419 193238 195797 198479 201650
54034 201650 205063 208265 211479 215513 220701 226418 231819 236644 241071 245260 249366 253606 257903 261748
54020 261748 264783 267357 270089 273066 275753 277560 278173 277526 275898 274000 272508 271472 270435 269101 267489
54005 267489 265466 262614 258756 254321 250003 246337 243716 242470 242640 243852 245626 247747 250227 253202
53991 253202 257055 262380 269549 278386 288409 299098 309591 318344 323549 323993 319472 310649 298895
53978 298895 286025 273522 261817 250673 240349 231930 226285 223049 220993 219159 217305 215401 213239
53965 213239 210719 208256 206566 205935 205861 205573 204919 204527 205011 206272 207777 209315 211091 213203 215439 217604
53949 217604 219663 221473 222812 223838 225141 227069 229318 231425 233381 235503 238008 241011 244666 248889
53935 248889 253158 256952 260244 263224 265738 267455 268467 269232 269955 270466 270751 271132 271777 272471 273093 274003
53919 274003 275676 278170 281198 284614 288603 293466 299326 305971 312863 319402 325310 330799 336338 342292
53905 342292 348736 355413 361753 367011 370582 372328 372632 372064 370973 369427 367571 365843 364571 363425 361650
53890 361650 358927 355628 352082 348050 343268 338111 333164 328416 323413 318066 312687 307303 301615 295724
53876 295724 290260 285567 281354 277421 274123 271701 269660 267340 264757 262375 260325 258378 256455 254577
53862 254577 252444 249685 246547 243765 241617 239616 237328 234995 233010 231165 228953 226453 224432 223458
53848 223458 223261 223140 222818 222613 222798 223083 222910 222233 221762 222310 223932 225816 227009 227214 226929 226908 227521 228508
53830 228508 229261 229336 228766 227974 227501 227830 229301 231984 235574 239581 243812 248712 255122 263553 273548 283596
53814 283596 291617 295757 295129 290184 282456 273836 265869 259501 255118 252610 251474 251156 251412 252265 253730
53799 253730 255832 258878 263273 268847 274733 280262 285760 292006 299033 305938 311934 317098 321953 326700
53785 326700 331036 334386 336018 335304 332357 328299 324474 321311 318211 314566 310523 306640 303096 299519
53771 299519 295439 290658 285214 279336 273501 268270 263806 259634 255155 250349 245743 241669 237908 234260
53757 234260 231146 229196 228285 227414 225725 223366 221180 219695 218724 217827 216862 215986 215342 214982 214981 215404 216080
53740 216080 216617 216838 217040 217611 218444 219097 219520 220213 221411 222555 223003 223071 223772 225452 227204 227843 227136 225823
53722 225823 224736 224236 224332 224893 225698 226496 227159 227668 227918 227689 226917 225913 225215 225167 225679 226355 226829 226998 226993
53703 226993 227022 227257 227875 229136 231313 234407 237930 241229 244151 247214 250852 254606 257463 259010 259840
53688 259840 260665 261441 261676 261304 260774 260434 260246 260107 260047 260013 259767 259163 258362 257681 257292 257117 256974 256811 256804 257094
53668 257094 257444 257409 257012 256917 257615 258713 259399 259459 259359 259412 259395 259009 258265 257275 256023 254511 252790 250767 248272
53649 248272 245475 242966 241274 240520 240570 241239 242283 243491 244849 246344 247630 248269 248327 248295 248335 248112 247545
53632 247545 247155 247410 248222 249418 251147 253327 255211 256191 256758 257967 260037 262131 263549 264521 265702 267378
53616 267378 269458 271837 274467 277274 280260 283570 287262 291051 294448 297156 299299 301225 303167 305097
53602 305097 306939 308790 310768 312671 314037 314634 314752 314872 315197 315614 315952 316086 315927 315508 315077 314949 315273
53585 315273 315972 316836 317619 318118 318233 317897 316972 315424 313587 311968 310626 308966 306404 303097 299847 297361
53569 297361 295777 294775 293949 293104 292345 291947 292116 292941 294506 296785 299399 301726 303395 304549 305577 306782
53553 306782 308303 310106 311928 313511 314959 316575 318297 319742 321017 323003 326440 331038 335840 340229
53539 340229 344254 348250 352620 357782 363881 370605 377621 385098 393470 402840 412972 423667 434703
53526 434703 445507 455421 464402 473125 482301 492138 502493 513267 524607 536895 550509 565477
53514 565477 581506 598540 617052 637492 659624 682766 706480 730627 754903 778906 802642
53503 802642 826491 850525 874307 897444 919996 942200 964160 985901 1007408 1028514 1049041
53492 1049041 1069151 1089229 1109284 1128803 1147393 1165311 1183117 1200976 1218516 1235227 1250788
53481 1250788 1265121 1278358 1290904 1303386 1316329 1329655 1342552 1354027 1363551 1370949 1375790 1377556
53469 1377556 1376657 1374587 1372356 1369091 1362866 1352786 1339589 1324451 1308007 1290595 1272541 1253828
53457 1253828 1234055 1213046 1191056 1168196 1144256 1119462 1094838 1071285 1048645 1026183 1003695
53446 1003695 981630 960309 939600 919427 900136 882194 865673 850216 835463 821515 809008
53435 809008 798699 790931 785475 781739 779088 777195 776402 777633 781589 788024 796120 805467 816274 828676
53421 828676 842457 857597 874557 893642 914504 936602 959794 984105 1009209 1034663 1060568
53410 1060568 1087640 1116659 1148050 1181868 1217858 1255582 1294665 1335002 1376676 1419831 1464724
53399 1464724 1511746 1561252 1613368 1667880 1724077 1780772 1836900 1892295 1947646 2003556 2059916
53388 2059916 2116220 2171971 2226517 2278959 2328721 2375926 2420748 2462581 2500355 2533616 2562883
53377 2562883 2588949 2612195 2632617 2650142 2664704 2676162 2684325 2689021 2690090 2687150 2679241 2664756
53365 2664756 2642091 2610559 2570604 2523144 2469165 2410091 2347997 2284840 2221563 2158297 2095250
53354 2095250 2032934 1971619 1911093 1851182 1792188 1734695 1679047 1625091 1572255 1519924 1467962
53343 1467962 1416867 1367281 1319359 1272852 1227748 1184562 1143929 1106067 1070740 1037568 1006313
53332 1006313 977048 950195 926347 905890 888702 874206 861651 850384 839938 830088 821047 813609
53320 813609 808713 806509 805928 805558 805026 805249 807252 811149 816427 822823 830505 839650 850281 862416 875997
53305 875997 890592 905595 920888 937139 955184 975214 996730 1019286 1042969 1068009 1094123
53294 1094123 1120694 1147593 1175313 1204023 1232986 1261438 1289662 1318441 1347470 1375057 1399532
53283 1399532 1420487 1438516 1454400 1468746 1481825 1493399 1503027 1510645 1516348 1519590 1519420 1515849 1510178
53270 1510178 1503454 1495305 1484825 1471833 1456512 1438468 1417181 1392994 1366753 1338756 1308918 1277649
53258 1277649 1245548 1212435 1177746 1141846 1105956 1070707 1035823 1001381 968265 936915 906621
53247 906621 876657 847264 818828 790766 762083 732746 703720 675750 648751 622439 597111
53236 597111 573522 552112 532491 513797 495617 478381 462736 448782 436268 425257 415978 408143
53224 408143 401054 394399 388324 382689 376992 371205 365929 361371 356879 351922 346910 342496 338615 334802
53210 334802 331020 327566 324468 321523 318687 315973 313211 310349 307707 305413 302915 299651 295987 292871
53196 292871 290612 288658 286582 284705 283540 283007 282502 281552 280216 278861 277616 276188 274349 272428 270864
53181 270864 269306 266832 263260 259578 256614 254011 251184 248675 247577 247888 248449 248430 248009 247585 247235 247145
53165 247145 247711 248836 249769 250045 250058 250407 251143 251947 252540 252617 251863 250406 248857 247585 246331 244798 243198
53148 243198 241885 240946 240508 240915 242047 242863 242375 240863 239526 239047 239082 239081 238930 238667 238162 237380 236618 236204
53130 236204 236121 236052 235700 235019 234333 234250 235245 237144 239130 240361 240650 240594 241059 242418 244207 245596 246205 246288
53112 246288 246121 245618 244719 243760 243025 242221 240889 239168 237653 236544 235439 233980 232221 230290 228133 225749
53096 225749 223356 221231 219676 219106 219724 221015 222062 222522 222845 223370 223733 223467 222712 221962 221469 221218 221154
53079 221154 221092 220750 220214 220002 220278 220436 219922 219049 218405 217874 216983 215938 215418 215417 215192 214457 213787 213605 213540 213157
53059 213157 212638 212273 211884 211311 211036 211660 213028 214388 215236 215566 215485 215138 214915 215216 215926 216532 216837 217233
53041 217233 218176 219649 221207 222193 221882 219814 216365 212810 210416 209407 208986 208393 207650 207159 206862 206185
53025 206185 204799 203078 201724 201203 201598 202627 203561 203547 202465 201193 200570 200347 199710 198618 197849 197755 197760 197365
53007 197365 196913 196942 197342 197646 197670 197426 196741 195538 194246 193532 193680 194533 195714 196685 196973 196739 196765 197452 198210
52988 198210 198268 197664 196887 195969 194747 193737 193867 195341 197504 199785 202007 203722 204183 203353 202304 202193
52972 202193 203295 205217 207520 209777 211536 212696 213661 214763 215824 216525 216884 217064 217006 216608 216067 215737
52956 215737 215719 215780 215544 214686 213159 211319 209596 207999 206273 204559 203396 202851 202155 200609 198466 196529
52940 196529 195171 194195 193438 193065 193327 194324 195873 197374 198074 197795 197223 197115 197430 197588 197285 196587 195457
52923 195457 193875 192406 191924 192519 193249 193294 192966 193167 194146 195211 195581 195142 194382 193860 193829 194156 194480 194501 194175
52904 194175 193663 193139 192753 192757 193447 194801 196260 197068 196970 196527 196686 197987 200084 201903 202422 201623 200753 201301
52886 201301 203432 205645 206260 205014 202937 200976 199276 197705 196379 195449 194806 194226 193529 192544 191304 190395
52870 190395 190581 191852 193330 194464 195812 198124 201057 203420 204561 204913 205263 205993 207110 208553 210286
52855 210286 212336 214760 217325 219337 220205 220183 220134 220424 220481 219570 217632 215063 212025 208436 204542 201018
52839 201018 198375 196450 194700 192910 191454 190858 191215 192115 193044 193714 194038 194010 193798 193818 194494 195930 197887
52822 197887 200064 202256 204187 205335 205111 203326 200474 197455 194986 193376 192847 193746 196121 199286 202293
52807 202293 204911 207779 211399 215305 218405 219882 219592 217873 215276 212315 209232 206086 203036 200245
52793 200245 197412 194016 190348 187733 187048 187392 186984 185276 183381 182403 182206 182143 182200 182793 183896 185046 186024
52776 186024 186992 188015 188944 189772 190664 191491 191807 191527 191329 191957 193261 194315 194513 194158 193829 193608 193295 193049
52758 193049 193275 193935 194554 194956 195443 196026 196105 195347 194368 193945 193905 193445 192408 191456 191060 191047 191321 192334 194445
52739 194445 197286 200187 202829 205063 206486 206787 206381 206121 206338 206593 206515 206451 207051 208412 209950 210989 211267
52722 211267 210921 210269 209635 209131 208467 207155 205080 202733 200722 199213 198044 197213 196814 196597 196058 195141 194387
52705 194387 194161 194101 193629 192727 191888 191552 191906 192962 194395 195483 195717 195417 195331 195642 195826 195539 195209 195544
52687 195544 196683 198044 198916 199125 199162 199642 200635 201667 202355 202785 203135 203408 203767 204609 205818 206446 205841 204766
52669 204766 204560 205404 206283 206612 206810 207144 207078 206269 205279 204688 204265 203730 203685 204924 207213 209532 211296 212647
52651 212647 213822 215007 216722 219572 223439 227334 230074 230791 229108 225493 221382 218206 216176 214481
52637 214481 212656 211061 209979 209094 208237 207928 208609 209835 210875 211809 213403 216105 219756 224103 228853
52622 228853 233096 235410 235041 232686 229743 227029 224515 222040 219737 217735 215959 214420 213401 213075 213128
52607 213128 213019 212496 211640 210563 209363 208292 207671 207590 207911 208571 209584 210797 211964 213145 214598 216134
52591 216134 217017 216872 216334 216319 216856 217213 217141 217328 218407 220020 221269 221838 222199 222797 223490 223879 223855 223561 223049
52572 223049 222221 221126 220037 219233 218891 219144 219928 220674 220523 219185 217375 216056 215402 214910 214407 214381 215157
52555 215157 216278 217019 217181 217029 216714 216142 215308 214391 213587 213072 213055 213604 214451 215218 215809 216340 216779 216924 216733
52536 216733 216403 216056 215604 215031 214582 214522 214825 215229 215572 215939 216469 217086 217517 217622 217655 218004 218664 219140 219017
52517 219017 218459 217951 217723 217723 218104 219360 221801 225053 228264 230804 232750 234726 237344 240701 244322 247452
52501 247452 249370 249630 248299 246016 243524 240969 237946 234416 231228 229279 228364 227449 226067 224825 224323
52486 224323 224187 223663 222816 222503 223186 224302 225011 225227 225664 227000 229208 231683 233852 235601 237221 239031
52470 239031 241065 243029 244532 245413 245917 246568 247787 249649 252059 255020 258493 261932 264262 264661 263250
52455 263250 260838 258018 254911 251755 249233 247776 246859 245510 243464 241338 239628 238110 236432 234727
52441 234727 233179 231442 229167 226884 225590 225432 225494 225106 224641 224650 224855 224657 224247 224414 225305 226078 225954 225063
52423 225063 224031 223174 222430 221823 221583 221872 222643 223803 225368 227439 230079 233138 236122 238359 239520 240080
52407 240080 241156 243735 247987 253321 259073 265091 271658 278938 286576 293755 299499 302925 303408 300783
52393 300783 295552 288874 282101 276085 270804 265864 261391 258199 256848 256753 256654 255868 254687 253632 252845 252345
52377 252345 252339 252922 253870 255053 256691 258847 261044 262828 264445 266398 268623 270707 272770 275371 278462
52362 278462 281047 282148 281636 279958 277543 274775 272092 269776 267872 266513 265965 266083 266194 265914 265752 266435
52346 266435 267897 269460 270786 272022 273117 273724 274033 275035 277409 280482 282837 283875 284342 285262 286874
52331 286874 288886 291437 295177 300279 305876 310892 315340 320329 326767 334405 342289 349734 356491 362312
52317 362312 366934 370538 373734 376935 380067 383057 386242 389974 394056 397946 401424 404690 407920 411163
52303 411163 414721 419159 424620 430481 436004 441165 446486 452126 457511 461845 464670 465983 466155 465847 465649
52288 465649 465564 465070 463837 462205 460774 459753 458934 458152 457505 457181 457271 457733 458454 459394 460716 462565 464634
52271 464634 466229 467026 467565 468712 470853 473917 477893 482782 488051 492783 496560 499830 503179 506567 509519
52256 509519 511839 513909 516467 520246 525649 532498 540112 547695 554602 560340 564687 567895 570494 572693
52242 572693 574224 574972 575450 576372 577968 579984 582194 584590 587130 589640 591980 594168 596441 599284 603130
52227 603130 607738 612101 615404 617956 620791 624417 628465 632539 636761 641246 645599 649391 652831 656541
52213 656541 660830 665510 670233 674637 678339 681253 683917 687151 691278 695969 700820 705678 710308 714173
52199 714173 716861 718503 719546 720291 720959 722040 724199 727776 732538 737897 743184 747795 751418 754262 756921
52184 756921 759840 762946 765775 767858 768891 768626 766766 763126 757978 752123 746388 740982 735559 730014
52170 730014 724861 720518 716557 712248 707757 704146 702042 700990 700497 701075 703521 707465 711468 714608 717304
52155 717304 720290 723343 725517 726338 726259 725969 725735 725627 725998 727318 729545 732030 734162 735902 737506 739029
52139 739029 740342 741406 741991 741262 738335 733544 728592 725039 723011 721794 721243 721932 724146 727526 731782
52124 731782 737116 743736 751484 760250 770259 781559 793536 805306 816347 826467 835396 842894 849142
52111 849142 854555 859141 862413 864108 864654 864711 864374 863200 861094 858965 858276 859926 863671 868663 874356
52096 874356 880752 887884 895411 902796 909608 915458 919688 921404 919963 915490 908919 901461 893928 886567
52082 886567 879474 873045 867827 864076 861680 860509 860514 861337 862098 861960 860944 860009 860178 861590 863411 864640
52066 864640 864994 865050 865562 866750 868217 869451 870243 870643 870695 870404 869925 869666 870063 871167 872540 873579 873946
52049 873946 873566 872327 870049 866828 863168 859574 856126 852565 848612 844096 839045 833971 829862 827475
52035 827475 826661 826695 827203 828406 830430 832852 835104 837010 838738 840469 842304 844320 846517 848881 851632
52020 851632 855198 859729 864780 869689 874181 878417 882564 886641 890796 895468 901027 907223 913060 917245
52006 917245 918826 917552 913766 907897 899940 889342 875543 858758 840134 820927 801654 782313
51994 782313 763233 745172 728475 712705 697428 682891 669577 657516 646495 636511 627435 618578
51982 618578 609313 599934 591156 582836 573954 563859 552788 541126 529002 516867 505637 495823 487174
51969 487174 479609 473894 470893 470638 472609 476468 482023 488955 497098 506600 517214 527844 537388 545713
51955 545713 553188 559510 563691 565074 563750 560116 554631 548019 541114 534424 528292 523418 520732 520730 523420
51940 523420 528850 537089 547618 559403 571827 585052 599233 613815 627912 640929 652427 661721
51928 661721 668107 671381 671705 668946 662492 651841 637299 620036 601566 583059 564999 547342 530083
51915 530083 513713 499120 486948 477026 468523 460758 453796 448199 444333 442123 441329 441772 443315 445993
51901 445993 450196 456360 464379 473601 483454 493601 503304 511088 515445 515623 511567 503622 492744 480623
51887 480623 468959 458588 449625 442182 436597 433148 431969 433000 435693 439116 442949 448179 456222 467486
51873 467486 481325 497156 514790 533656 552534 570394 586973 602297 616150 628381 639391
51862 639391 649997 660958 672591 684325 694308 699750 698143 688504 671839 650754 628329 606653
51850 606653 586134 566381 547609 530786 516524 504429 493652 483572 473820 464200 454880 446296
51838 446296 438620 431569 424825 418369 412449 407633 404792 404464 406157 408850 412161 416303 420817 424396
51824 424396 426334 427261 427818 427446 425312 421826 418327 415629 413753 412809 413196 414935 417610 421055 425492
51809 425492 430865 436614 442175 447179 451077 453097 452804 450349 446117 440548 434374 428508 423438 419059
51795 419059 415274 412371 410561 409504 408629 407716 406815 405746 404089 401770 399392 397797 397301 397456 397577 397440
51779 397440 397298 397257 396832 395294 392410 388687 385040 382402 381537 382871 386322 391317 397074 402920 408534
51764 408534 414135 420414 428074 437215 447067 456250 463292 467148 467536 464887 459929 453299 445531 437255
51750 437255 429172 421773 415182 409302 404061 399487 395645 392620 390601 389873 390619 392710 395801 399684 404437
51735 404437 410273 417537 426926 439208 454188 470060 484340 495469 503235 507910 509839 510090 510738
51722 510738 513821 520111 528901 538370 545846 548568 545321 537480 527962 519151 512015 506714 503102 500465
51708 500465 497486 493011 486782 479444 472120 466026 462123 460772 461710 464307 467730 470894 472635 472193 469724
51693 469724 466411 464011 463901 466243 470122 474471 478576 481555 481982 478777 472411 464696 457265 450584 444398
51678 444398 438657 433891 430954 430444 432179 435268 439012 443589 449464 456255 462768 468216 472973 478195
51664 478195 485278 495643 510086 527667 545580 560603 570517 574124 570724 560440 544856 526617
51652 526617 508235 491423 477290 466578 459630 456508 457131 460929 466262 470608 471641 468250 460667
51639 460667 449975 437544 424593 411966 400161 389508 380171 372074 365010 358913 353877 349908 346864
51626 346864 344670 343405 343043 343279 343809 344640 345919 347464 348809 349811 350939 352691 354821 356464 356961
51611 356961 356264 354500 351624 347739 343501 339759 336983 335271 334686 335109 335973 336759 337780 339856 343049
51596 343049 346482 349814 354310 361704 372261 384574 397187 409706 422201 434134 444276 451486
51584 451486 455357 456313 455308 453365 451228 449472 448819 450162 454160 461036 470888 483987 500474 519709
51570 519709 540087 559806 578094 595825 614772 635929 658446 680245 699662 716609 732605
51559 732605 750252 772556 801949 839296 883686 933078 984796 1035303 1080188 1115263 1137982
51548 1137982 1147844 1145695 1132887 1110730 1080178 1041953 997314 948544 898172 847718 797696 748892
51536 748892 702984 661647 625498 594273 567543 544860 525617 509298 495631 484046 473335
51525 473335 462570 452283 444003 438464 434819 431791 428970 426559 424357 421653 418077 414077 410450 407657
51511 407657 405698 404328 403150 401638 399472 397034 395275 394720 394624 393497 390554 386326 381849 377780 374543
51496 374543 372616 371963 371558 370361 368673 367778 368193 369135 369906 370971 373101 376042 378594 379741 379263 377572
51480 377572 375395 373334 371317 368653 364967 360893 357462 355033 353196 351558 350152 349174 348690 348654 348916
51465 348916 349231 349423 349554 349828 350524 352007 354439 357297 359601 361005 362249 364135 366421 368309 369737
51450 369737 371470 374002 377008 379988 382953 386380 390898 397092 405251 415272 426980 440332 454802
51437 454802 468724 479868 486899 490018 490418 489721 489791 492048 496284 500411 501745 498517 490431 478566
51423 478566 465042 452146 441098 431768 423722 417121 412270 408776 405817 403076 400903 399539 398701 398044
51409 398044 397729 398261 399864 402184 404645 406973 409283 411644 413731 415069 415514 415354 414998 414743 414812 415423
51393 415423 416829 419351 423259 428519 434871 442360 451512 462644 475292 488775 503243 519732 539358
51380 539358 562950 591360 625419 665443 711244 762705 819875 882282 948348 1015342 1079418
51369 1079418 1136029 1181326 1213598 1232907 1239354 1232473 1212460 1181049 1140618 1093121 1040309 984198
51357 984198 926590 868656 811607 757312 707619 663499 625330 593387 567229 545115 525004
51346 525004 505992 488124 471154 454531 438460 423960 411616 400976 391317 382338 373984 366272
51334 366272 359589 354572 351357 349263 347472 345675 343937 342332 340971 340135 340120 340976 342361 343615 344231
51319 344231 344463 345157 346550 347570 346954 344876 342743 341551 341218 341547 342822 345127 347946 350911 354236
51304 354236 357809 360545 361463 361041 360733 361228 361800 361327 359373 356248 352508 348569 344563 340459 336396 332809
51288 332809 330044 327932 325993 324015 322257 321192 321244 322593 324916 327423 329502 331367 333787 337185 341247
51273 341247 345435 349534 353596 357680 361875 366352 371158 376046 380745 385358 390221 395275 399700 402321
51259 402321 402458 400344 396766 392353 387342 381990 376915 372694 369168 365576 361605 358019 355761 354581
51245 354581 353079 350290 346776 343785 341803 340408 339266 338528 338165 337637 336537 335137 333961 333189 332773
51230 332773 332765 333109 333451 333668 334316 335967 338220 340020 340986 341855 343485 345976 348892 351746 353941 354831 354424
51213 354424 353762 353977 355071 356123 356639 357173 358518 360832 363830 367433 371731 376454 380965 384859 388269
51198 388269 391445 394294 396495 397827 398216 397661 396368 394785 393162 391208 388599 385830 384053 383872 384641
51183 384641 385280 385456 385655 386299 387198 387832 387865 387356 386649 386091 385793 385641 385553 385512 385359 384853 384063 383372 382872 382088
51163 382088 380619 378819 377414 376633 376072 375276 374078 372490 370678 368955 367501 366143 364704 363364 362286
51148 362286 361150 359584 357892 356741 356176 355530 354330 352695 350783 348542 346259 344768 344746 346127 348382
51133 348382 350995 353575 355954 358383 361167 363945 365831 366513 366684 367163 368117 369399 371059 373087 375173
51118 375173 377184 379378 381718 383598 384885 386696 390304 395533 400987 405640 409435 412535 414911 416723
51104 416723 418313 419560 419883 419106 417776 416425 415046 413486 411816 409985 407602 404504 401205 398390 396223
51089 396223 394509 393237 392516 392100 391481 390546 389789 389703 390138 390507 390566 390794 391919 394159 397054 400026 402869
51072 402869 405612 408094 409946 411006 411630 412523 414238 416745 419442 421815 424124 427245 431691 437151 443313
51057 443313 450748 460295 471504 482232 490100 494223 495537 495870 496967 500037 505633 513606 523127 532985
51043 532985 542259 550954 559827 569289 578589 586401 592132 596315 599863 603419 607359 611629 615136 615821
51029 615821 611938 603212 590609 575326 558445 541209 524962 510664 498751 489398 482542 477639
51017 477639 473867 470822 468825 468450 469894 472824 476563 480382 483896 487406 491600 496639 501692 505721
51003 505721 508737 511945 516455 522056 527508 531917 535478 538827 542064 544789 546907 548910 551259 553942
50989 553942 556944 560907 566858 575276 585708 597345 609740 622914 637031 652213 668531 685900
50977 685900 703778 720946 735689 746334 751832 751917 746870 737350 724540 710150 695869 682740 671241
50964 671241 661825 654978 650677 648295 647307 647851 650297 654565 660245 667269 676012 686671 698798 711550
50950 711550 724323 737221 751065 766710 784155 802553 821508 842108 866101 894154 925610
50939 925610 959912 997106 1036272 1074124 1106099 1128917 1141910 1146542 1145456 1141596 1136988 1131826
50927 1131826 1125122 1116321 1105774 1093644 1079207 1061679 1041198 1018512 994171 968586 942548 916990
50915 916990 892227 867965 844182 821591 801036 782654 765820 749767 734228 719535 706229
50904 706229 694534 684177 674682 665715 657114 648752 640670 633331 627531 623780 621664 619867 617010 612674
50890 612674 607692 603369 600373 598387 596693 594837 592722 590394 588000 585836 584206 583207 582728 582655 583022
50875 583022 584018 585799 588202 590640 592583 594147 595986 598438 601077 603389 605621 608603 612848 618252
50861 618252 624607 631907 639911 647780 654678 660733 667166 675320 685655 697738 711017 725383 740977
50848 740977 757789 775734 794992 815962 838830 863413 889495 917032 945901 975608 1005475
50837 1005475 1034987 1063871 1091971 1119214 1145654 1171401 1196540 1221188 1245597 1270231 1295879
50826 1295879 1323631 1354398 1388335 1425035 1464409 1506994 1553057 1601689 1651202 1700244 1748022
50815 1748022 1793457 1834550 1868766 1893896 1908655 1912906 1907455 1893336 1871062 1840644 1802418 1757750
50803 1757750 1708873 1658143 1607405 1557797 1509997 1464734 1423102 1386348 1355317 1330211 1310827
50792 1310827 1296865 1288058 1284228 1285323 1291269 1301694 1315831 1332639 1350879 1369122 1386030 1400809
50780 1400809 1413321 1423638 1431630 1437087 1440121 1441152 1440402 1437516 1431782 1422706 1410278 1394672 1375825
50767 1375825 1353405 1327143 1297040 1263337 1226570 1187778 1148464 1110064 1073318 1038123 1004060
50756 1004060 971180 940402 913036 889729 869955 852682 837401 824178 812894 802978 794072 786507
50744 786507 780889 777577 776720 778366 782207 787643 794441 802975 813476 825458 838389 852431 867905
50731 867905 884367 901013 917856 935702 954979 975336 996471 1018517 1041301 1063874 1085225
50720 1085225 1105036 1123424 1140366 1155759 1169666 1182007 1192194 1199499 1203827 1205992 1207353 1209330
50708 1209330 1213067 1219297 1228440 1240855 1256865 1276564 1299710 1325774 1353960 1383280 1412838 1441993
50696 1441993 1469951 1495322 1516536 1532729 1543876 1550129 1551578 1548886 1543629 1537662 1532332 1528443 1526538
50683 1526538 1526853 1529156 1532958 1537782 1543236 1549157 1556005 1564988 1577696 1595643 1620057 1651677 1690508
50670 1690508 1735931 1787015 1842456 1900282 1958185 2014360 2067744 2117390 2162216 2201712 2236475
50659 2236475 2267680 2296249 2322713 2347357 2370037 2390072 2406674 2419387 2427943 2432085 2431867 2427964
50647 2427964 2421461 2413561 2405703 2399592 2396761 2398240 2404757 2416914 2434955 2458607 2487279 2519937 2554725
50634 2554725 2589356 2622326 2653238 2681588 2705913 2724744 2737878 2746061 2749969 2750373 2748839 2746967
50622 2746967 2744327 2737367 2720446 2688198 2638176 2572827 2499277 2426429 2361485 2308584 2269447 2244085
50610 2244085 2230993 2227746 2231760 2240222 2249681 2256665 2258747 2254346 2241667 2218884 2185494 2142649 2091955
50597 2091955 2034767 1972764 1908127 1842538 1776684 1711182 1647294 1586249 1528534 1474412 1424568
50586 1424568 1379619 1339455 1303606 1271923 1244461 1221148 1202048 1187547 1177738 1172020 1169845 1171443
50574 1171443 1177175 1186513 1198346 1212042 1227488 1244158 1260840 1276331 1289907 1301125 1309785 1316289
50562 1316289 1321621 1326777 1332499 1339633 1349385 1363025 1381521 1405536 1435661 1472469 1516380 1567331
50550 1567331 1624457 1686108 1750317 1815206 1879008 1940013 1996901 2049168 2097204 2142178 2185944
50539 2185944 2230720 2278433 2330278 2386840 2448248 2514010 2583180 2655202 2730457 2809717 2893420
50528 2893420 2982054 3076910 3179661 3291011 3410306 3536454 3668533 3805118 3943570 4080394
50518 4080394 4212066 4335126 4445750 4539738 4613119 4662731 4686429 4683074 4652522 4595609 4514139
50507 4514139 4410783 4288906 4152562 4006762 3857610 3711605 3574353 3449750 3340373
50498 3340373 3248505 3176631 3126955 3100442 3096245 3111889 3143834 3187772 3238468 3289612 3334161
50487 3334161 3365088 3376329 3363791 3326174 3264937 3183216 3084643 2973019 2852600 2727898 2602837
50476 2602837 2480107 2361289 2247361 2139012 2036735 1940806 1851197 1767607 1689754 1617569
50466 1617569 1550871 1488967 1430935 1376448 1326074 1280678 1240741 1206217 1176670 1151258 1128898
50455 1128898 1108798 1090770 1074894 1061014 1048741 1037798 1028088 1019545 1012148 1006020 1001202 997430
50443 997430 994484 992803 993367 996691 1002123 1008396 1014760 1021386 1028821 1037462 1047625 1059700 1073828 1089653
50429 1089653 1106806 1125678 1147238 1171911 1198959 1227301 1256731 1287931 1321434 1357110 1394749
50418 1394749 1434696 1477621 1523988 1574119 1628557 1687968 1752618 1822308 1896747 1975583 2057827
50407 2057827 2141673 2225370 2308190 2390167 2470809 2548525 2621469 2688519 2748916 2801058 2842063
50396 2842063 2868581 2877803 2867933 2838436 2790275 2725701 2647558 2558923 2463369 2365039 2267993 2175616
50384 2175616 2090792 2016168 1953656 1903889 1866594 1841339 1827458 1823541 1827700 1838294 1853719 1871499
50372 1871499 1888310 1901091 1907537 1905436 1892576 1867961 1832592 1788399 1736859 1679231 1617610 1554784
50360 1554784 1493025 1433558 1377064 1324031 1274623 1228763 1186459 1147612 1111620 1077701 1045650
50349 1045650 1015768 988035 962017 937685 915585 895909 878000 861217 845752 832146 820408
50338 820408 810115 800986 792774 784874 776677 768287 760268 752699 744968 736610 727924 719607 712191 705965
50324 705965 701085 697403 694435 691768 689508 688199 688321 689910 692609 696087 700506 706518 714633 724597
50310 724597 735555 746788 758105 769598 781357 793480 805968 818403 830118 840982 851801
50299 851801 863528 876269 889396 902525 915906 929829 944158 958632 973231 987817 1001526
50288 1001526 1012788 1020020 1022238 1019284 1011873 1001564 990560 981324 976214 977018 984146 995622 1006850
50275 1006850 1012002 1006730 990581 967242 942265 920059 902519 889788 881511 876927 874410 872048
50263 872048 869057 866122 864052 862577 860954 859292 858497 859043 860561 862705 865574 868897 871593 872822 873062
50248 873062 873493 874620 876176 878055 880423 882856 884297 884224 883240 882161 881133 880033 879150 878802 878666 878150
50232 878150 877170 876009 874589 872590 870235 868225 866772 865295 863322 861237 859864 859664 860603 862497 865226
50217 865226 868845 873648 879917 887482 895989 905824 918406 935132 956264 981280 1010059 1043267 1081648
50204 1081648 1125416 1174287 1227440 1283200 1339152 1392968 1443029 1488140 1527061 1558911 1584198
50193 1584198 1605192 1624929 1645569 1667327 1688513 1706310 1717607 1719540 1709833 1687101 1651154 1603160
50181 1603160 1545541 1481509 1414422 1347334 1282938 1223603 1171074 1126061 1088346 1057481 1033252
50170 1033252 1015348 1002766 993775 986390 978736 969174 956561 940735 922668 903976 886177 870214
50158 870214 856450 844894 835456 828049 822595 819077 817602 818229 820567 823628 826290 827912 828393 827703
50144 827703 825548 821526 815480 807660 798674 789324 780365 772332 765565 760330 756839 755233 755659 758252
50130 758252 762880 769003 775974 783334 790563 796748 801023 803461 805075 806751 808550 810265 812154 814665
50116 814665 817797 821292 825310 830318 836315 842785 849602 857448 867004 878052 889811 901973 914969
50103 914969 929170 944195 959283 974310 990313 1008933 1031334 1057655 1087444 1120471 1157083
50092 1157083 1198080 1244642 1298430 1361277 1434355 1517609 1610033 1710217 1816233 1924948 2031863
50081 2031863 2132153 2222385 2301709 2371789 2435633 2496177 2555431 2614279 2672359 2727742 2776762
50070 2776762 2814546 2836098 2837349 2815946 2771759 2706949 2625275 2530978 2427993 2319798 2209448
50059 2209448 2099448 1991644 1887449 1788156 1695005 1609081 1531247 1462000 1401219 1348090 1301551
50048 1301551 1260859 1225573 1195006 1167937 1143069 1119699 1097864 1077943 1060331 1045413 1033462
50037 1033462 1024330 1017305 1011537 1006654 1002860 1000489 999591 999944 1001204 1002927 1004646 1006135 1007423 1008426
50023 1008426 1008732 1008029 1006505 1004490 1001870 998358 994269 990302 986372 981311 974130 965080 954955 943883
50009 943883 931571 918420 905496 893344 881573 869817 858408 847848 838327 830187 824326 821557
49997 821557 821903 824970 830683 839032 849268 859905 869656 878004 884971 890773 895773 900342 904624 908543
49983 908543 911974 914646 916057 915919 914759 913704 913631 914943 918196 924438 934682 949492 969417 995406
49969 995406 1028349 1068361 1114934 1167592 1225936 1288998 1354859 1420919 1484292 1542235 1592895
49958 1592895 1636079 1673200 1706319 1737317 1767840 1799364 1832658 1866960 1899726 1927112 1944737
49947 1944737 1948467 1935297 1904143 1856075 1793850 1721154 1642036 1560589 1480617 1405132 1335796
49936 1335796 1272742 1215072 1161651 1111545 1063902 1017892 973171 930350 890696 855241 824234
49925 824234 797344 774025 753591 735352 719064 705116 694017 685716 679650 675321 672516 670991
49913 670991 670317 670176 670508 671242 672096 672930 674193 676755 681253 687589 695056 702974 711316 720816 732313
49898 732313 745917 760881 776211 791092 804637 815685 823344 827671 829519 829648 828193 824860 819200
49885 819200 810690 798950 784258 767664 750351 732910 715373 697788 680531 664044 648562 634239
49873 634239 621397 610450 601510 594232 588171 583267 579862 578225 578162 579134 580706 582803 585628 589385
49859 589385 594020 599247 604958 611639 620157 630971 643752 657878 673036 689000 704992 719748
49847 719748 732269 742190 749443 753992 756124 756626 756311 755423 753580 750083 744187 735437 724131 711369
49833 711369 698395 685954 674384 664071 655376 648199 642077 636871 633016 630903 630253 630381 630966 632340
49819 632340 635053 639416 645516 653476 663492 675540 689132 703411 717496 730715 742541 752504
49807 752504 760392 766569 771794 776481 780151 781852 781107 778199 773468 766722 757665 746729 735005 723316
49793 723316 711743 700146 688777 678109 668375 659577 651728 644743 638275 632103 626662 622731 620540
49780 620540 619457 618636 617675 616542 615213 613657 612082 611049 611361 613795 618677 625664 634123 643761 654580
49765 654580 666228 677792 688466 698038 706442 713157 717555 719758 720798 721822 723218 724347 723900 720643
49751 720643 714090 704512 692368 678107 662723 648015 635580 625586 617087 609557 603534 599611 597407
49738 597407 595955 594774 594086 594111 594575 594965 595080 595287 596281 598468 601468 604389 606750 608931 611542 614636
49722 614636 618031 622322 628898 638632 650863 664077 677400 691075 705559 720576 735085 747745
49710 747745 757228 762541 763561 761199 756695 750705 743279 734558 725040 715071 704596 693729 683322
49697 683322 674523 667803 662626 658064 653560 649182 645379 642558 640785 639906 639949 641185 643624 646713 649918
49682 649918 653476 658105 663973 670467 677244 685107 695400 708709 724558 742279 761545 781740 801136
49669 801136 817231 828086 833277 833611 830331 824794 818578 813274 809847 808371 808544 810328 813705 817715
49655 817715 819905 817109 807179 790327 768918 745860 723124 701664 682305 666061 653375 643547
49643 643547 635357 628151 622045 617260 613756 611517 610844 612016 614728 617916 620244 620971 620485 619836 619570
49628 619570 619143 617631 614742 610857 606375 601470 596379 591410 586643 582048 577895 574628 572301 570627
49614 570627 569551 569268 569626 570162 570927 572561 575116 577470 578537 578621 578933 580089 581806 583850 586429 589543
49598 589543 592649 595256 597320 598812 599376 598825 597724 597048 597308 598272 599503 600916 602705 604865 607007
49583 607007 608729 610058 611365 612870 614481 616159 618160 620683 623548 626532 629930 634470 640702 648622
49569 648622 657781 667526 677312 687146 697690 709556 722522 735653 748066 759173 768314 774715 778014
49556 778014 778454 776456 772364 766722 760265 753372 745945 738125 730781 724884 720724 718093 716951 717364 718897
49541 718897 720575 721511 721236 719555 716609 713211 710658 709802 710438 711765 713335 715466 718913 724336 731997
49526 731997 741750 753293 766524 781701 799137 818687 839461 860063 879118 895671 909238 919727
49514 919727 927473 933260 938031 942470 947012 952241 958948 967576 977710 988231 997698 1004340 1006035 1000970
49500 1000970 988678 970335 948055 924072 900365 878511 859458 843398 829955 818429 808064
49489 808064 798475 789939 783038 777881 773880 770361 767164 764481 762422 760942 759972 759363 758864 758388 758122
49474 758122 758183 758349 758391 758411 758545 758622 758602 759114 760911 763812 766841 769543 772458 776037 779764 782885 785460
49457 785460 788028 790519 792204 792640 792012 790503 787892 783967 778903 773102 767057 761412 756674 752612 748359
49442 748359 743365 737917 732499 727116 721679 716700 713087 711340 711329 712692 715025 717804 720634 723729 727852
49427 727852 733759 741918 752607 765879 781390 798661 817648 838869 862928 889811 917933 943119
49415 943119 959120 960887 948444 927257 904299 883949 867500 855202 847386 843993 844319 847669 853733
49402 853733 862227 872736 885051 899196 914956 931685 948596 964917 979918 993359 1005916 1018581
49390 1018581 1031521 1043911 1054821 1063608 1069417 1071193 1068656 1062706 1054425 1044226 1032332 1019489
49378 1019489 1006589 994062 982220 971798 963487 957317 953213 951865 954155 959794 967292 975302 983239
49365 983239 990528 996224 999778 1001523 1001867 1000500 996918 991405 984947 978296 971488 964163 956043 947147
49351 947147 937866 928921 921076 914847 910459 907925 907095 907765 909819 913132 917186 920976 923512 924482 924375
49336 924375 923922 923403 922449 920521 917579 914125 910622 907084 903424 899871 896693 893808 891111 889011 888073
49321 888073 888184 888649 889126 889848 890839 891631 891997 892337 892962 893624 894134 894875 896206 897854 899425 901030 902796
49304 902796 904286 905139 905900 907381 909473 911503 913596 916661 920955 925644 930054 934430 938986 943027 945777
49289 945777 947638 949875 953165 956978 960331 962725 964363 965769 967356 969244 971469 974230 977811 982341
49275 982341 987960 995132 1004359 1015419 1027363 1039515 1052072 1065362 1078869 1091525 1102791 1112974
49263 1112974 1122472 1131144 1138517 1144326 1148738 1152277 1155697 1159890 1165867 1174817 1187997 1206250 1229454
49250 1229454 1256404 1285130 1313116 1337250 1353972 1360129 1354230 1337134 1311485 1280378 1246376 1211460
49238 1211460 1177379 1145587 1116849 1091143 1068112 1047576 1029691 1014807 1003178 994688 988907 985473
49226 985473 984278 985152 987642 991487 997110 1004996 1014533 1023904 1031293 1035770 1036994 1034851 1029954 1023954
49212 1023954 1018613 1014631 1011762 1009809 1008884 1008825 1009178 1010054 1012539 1017842 1026229 1037019 1049351 1062654
49198 1062654 1076449 1090068 1102701 1113594 1122148 1127926 1130789 1131078 1129596 1127207 1124353 1120926 1116642
49185 1116642 1111572 1106387 1102154 1099772 1099461 1100765 1103123 1106433 1111073 1117643 1126975 1140214 1158467 1182270
49171 1182270 1211722 1247186 1289394 1338350 1391953 1445478 1492256 1525398 1540210 1536247 1517434
49160 1517434 1489975 1459672 1430469 1404441 1382335 1364086 1349126 1336458 1324779 1313064 1301157
49149 1301157 1289474 1278068 1266484 1254689 1243479 1233589 1224921 1217122 1210369 1204943 1200505 1196645 1193867
49136 1193867 1193199 1194836 1197951 1201837 1206537 1212197 1218538 1225245 1232382 1240142 1248574 1257699 1267540 1277953
49122 1277953 1288857 1300663 1314061 1329297 1346135 1364477 1384464 1405970 1428855 1453971 1483117
49111 1483117 1517503 1556976 1601428 1652559 1713771 1788558 1878990 1984292 2099298 2214720 2321271
49100 2321271 2415635 2502874 2591949 2686783 2779348 2850722 2881005 2861968 2802645 2722825 2639733
49089 2639733 2559020 2476103 2384197 2281204 2171336 2062576 1962815 1876862 1805616 1747464 1700319
49078 1700319 1662467 1632214 1607705 1587442 1570574 1556331 1543489 1530873 1518238 1506259 1495581
49067 1495581 1486176 1477624 1469660 1462294 1455735 1450422 1446822 1444958 1444344 1444658 1446242 1449610 1454669 1460865
49053 1460865 1467932 1476022 1485094 1494655 1504207 1513554 1522625 1531374 1540013 1548945 1558256 1567602 1576717 1585808
49039 1585808 1595363 1605969 1618439 1633529 1651163 1670339 1690295 1711485 1734869 1760309 1786104
49028 1786104 1810183 1831401 1849645 1865043 1877440 1886711 1893400 1898750 1903864 1909000 1913888 1918538 1923269
49015 1923269 1928082 1932787 1937936 1944863 1954277 1965291 1976432 1987172 1997935 2009064 2020650 2033153
49003 2033153 2047220 2062613 2077944 2091854 2104094 2115276 2125906 2135870 2144627 2151741 2157329 2162016
48991 2162016 2166309 2170126 2173146 2175472 2177570 2179652 2181519 2182999 2184127 2184891 2185186 2185083 2184836 2184609 2184530 2184908
48975 2184908 2185887 2186834 2186616 2184723 2181745 2178589 2175614 2172627 2169290 2165278 2160508 2155493 2151112 2147730 2144844
48960 2144844 2141823 2138731 2136201 2134913 2135439 2138245 2143428 2150769 2160312 2172482 2187283 2203808 2221194
48947 2221194 2239717 2260324 2283186 2307321 2331590 2355486 2379050 2402747 2427533 2454373 2483328
48936 2483328 2513575 2544609 2576945 2611300 2647538 2684915 2723102 2762452 2803336 2845693 2889246
48925 2889246 2933827 2979365 3025848 3073408 3122219 3172161 3222757 3273598 3324689 3376178 3427727
48914 3427727 3478375 3527127 3573660 3618379 3661884 3704527 3746426 3787627 3827977 3866912 3903651
48903 3903651 3937732 3969309 3998938 4027181 4054437 4080923 4106595 4131068 4153735 4174018 4191542
48892 4191542 4206191 4218106 4227584 4234824 4239756 4242178 4242133 4240056 4236472 4231454 4224276 4213569 4197993
48879 4197993 4177041 4151343 4122115 4090280 4056088 4019466 3980379 3938693 3893886 3845329 3792935
48868 3792935 3737448 3680022 3621664 3563129 3505131 3448385 3393451 3340661 3290238 3242381 3197157
48857 3197157 3154397 3113799 3075209 3038753 3004624 2972761 2942841 2914597 2888054 2863350 2840547
48846 2840547 2819801 2801643 2786748 2775348 2767112 2761684 2759091 2759416 2762310 2767152 2773635 2781878 2791958
48833 2791958 2803622 2816618 2831145 2847751 2866787 2888019 2910765 2934318 2958242 2982458 3007167
48822 3007167 3032658 3058974 3085690 3112204 3138436 3165138 3193259 3222961 3253459 3283840 3313800
48811 3313800 3343526 3373202 3402926 3432933 3463527 3494646 3525672 3555878 3585140 3614212 3644228
48800 3644228 3675874 3709086 3743575 3779430 3816961 3856071 3896100 3936203 3975533 4013045 4047712
48789 4047712 4079246 4108305 4135661 4161275 4184325 4203815 4218941 4229168 4234314 4234451 4229561 4219423
48777 4219423 4203913 4183109 4157081 4126101 4091232 4054078 4015614 3975799 3934656 3892825 3850350
48766 3850350 3805845 3758058 3707737 3656626 3604909 3551112 3494610 3436788 3379338 3322714 3266848
48755 3266848 3212195 3159280 3108179 3059285 3013776 2972408 2934463 2898743 2865061 2833862 2804927
48744 2804927 2777459 2751074 2725763 2701139 2676758 2653205 2631936 2613965 2599395 2588192 2580499
48733 2580499 2575981 2573507 2571768 2569763 2566638 2561721 2555031 2547414 2539965 2533551 2528755 2525779 2524338 2524073
48719 2524073 2525054 2527430 2530754 2534419 2538778 2544978 2553335 2562615 2571450 2579961 2589481 2601035 2614515 2628998
48705 2628998 2643350 2656831 2669617 2682695 2696895 2712119 2727725 2743384 2759242 2775499 2792346
48694 2792346 2810230 2829695 2850837 2873209 2896231 2919433 2942229 2963720 2982890 2998938 3011532
48683 3011532 3021041 3028554 3035364 3042169 3048823 3054969 3060788 3066863 3073228 3078789 3081957 3081784 3078303 3071775
48669 3071775 3062069 3049004 3033013 3015053 2995941 2976108 2955924 2935779 2915750 2895518 2874703
48658 2874703 2852969 2829692 2803863 2774520 2741117 2703592 2662538 2619491 2576565 2535437 2496891
48647 2496891 2461435 2429788 2402320 2378425 2357037 2337532 2319597 2302440 2284843 2266054 2246051
48636 2246051 2224895 2202480 2179136 2155880 2133640 2112611 2092739 2074397 2057975 2042881 2027492
48625 2027492 2010248 1990640 1969171 1946755 1924200 1901958 1880145 1858889 1838799 1820934 1806180
48614 1806180 1794685 1785989 1779651 1775646 1774178 1775241 1778464 1783391 1789744 1797208 1804877 1811160 1814685 1815409
48600 1815409 1814655 1813931 1813936 1814811 1816995 1821267 1827876 1835964 1844020 1850755 1855477 1857875 1857643 1854286 1847300 1836723
48584 1836723 1823654 1809964 1797239 1785968 1775768 1766182 1757104 1748653 1741044 1734647 1729940 1727247 1726571
48571 1726571 1727660 1730211 1734005 1738959 1745044 1752158 1760131 1768871 1778341 1788292 1798143 1807140 1814419 1818875
48557 1818875 1819328 1815192 1806787 1794752 1779469 1761599 1742938 1725890 1711735 1699815 1688608 1677196
48545 1677196 1665408 1653088 1639861 1625509 1610006 1593103 1574324 1553649 1532025 1510911 1491279
48534 1491279 1473217 1456534 1441591 1429303 1420266 1414130 1410075 1407810 1407844 1410833 1417040 1426645 1440238
48521 1440238 1458488 1481045 1505655 1528307 1544430 1550528 1545449 1530708 1509745 1486581 1464540 1445620
48509 1445620 1430733 1420439 1415313 1415654 1421169 1431294 1445696 1464108 1485776 1509567 1534729 1561124
48497 1561124 1588505 1615855 1641474 1663117 1677849 1682672 1676486 1661553 1642361 1622717 1604104 1586520
48485 1586520 1569863 1554000 1538250 1521746 1504402 1487042 1470519 1455123 1440868 1427898 1416376
48474 1416376 1406257 1397352 1389370 1381755 1373837 1365482 1357369 1350333 1344626 1340145 1337117 1335954 1336522 1338162
48460 1338162 1340562 1344051 1348943 1355199 1362981 1372818 1384699 1397413 1409240 1418865 1425248 1427337 1424918
48447 1424918 1419418 1412912 1406401 1399834 1393564 1388594 1385153 1382173 1378728 1375105 1371745 1367830 1361865 1353419
48433 1353419 1343605 1333982 1325512 1318437 1312575 1307650 1303668 1300913 1299333 1298169 1296634 1294872 1293767 1293763 1294263
48418 1294263 1294294 1293458 1292064 1290557 1289043 1287323 1285266 1283036 1280900 1278877 1276722 1274333 1271969 1269955 1268300
48403 1268300 1266659 1264528 1261478 1257381 1252527 1247287 1241564 1234837 1226908 1218321 1209798 1201412 1192551 1182546
48389 1182546 1171169 1158649 1145490 1132259 1119406 1107275 1096220 1086496 1078019 1070432 1063441 1056841
48377 1056841 1050230 1043239 1036212 1030187 1025842 1022801 1020317 1018249 1016896 1016186 1015669 1015198 1015066 1015432 1016123
48362 1016123 1017089 1018593 1020767 1023344 1026034 1028831 1031642 1033861 1034741 1034205 1033036 1032094 1031558 1031013 1030094 1028723
48346 1028723 1026805 1024092 1020497 1016221 1011451 1006304 1001259 997093 993864 990405 985552 979662 974202 969957
48332 969957 966446 963108 960148 957898 956104 954252 952142 949853 947592 945773 944801 944661 945164 946513 948908
48317 948908 951596 953188 953067 951613 948937 944553 938670 932606 927285 922349 917402 912967 909338 905589
48303 905589 900879 895974 892335 890320 889319 889007 889381 890101 890954 892603 895924 901026 907796 916742 928261
48288 928261 941556 955254 968443 980061 988186 991411 990550 987729 984294 980889 978825 979581 983149 988402
48274 988402 995034 1003777 1014986 1028398 1044097 1062428 1083207 1106278 1132357 1162032 1194659 1229791
48262 1229791 1268892 1313824 1364550 1420493 1483258 1555589 1638515 1732571 1841360 1970976 2126694
48251 2126694 2314360 2545435 2837023 3206678 3671419 4252174 4973778 5859384 6933206
48242 6933206 8235725 9827829 11753902 13964933 16246162 18215203 19432492 19591785
48234 19591785 18676718 16965417 14874831 12766364 10847701 9194373 7813801 6683950
48226 6683950 5766371 5018567 4406118 3903164 3486568 3136155 2838498 2585053 2367428
48217 2367428 2177918 2012817 1870918 1749187 1642937 1549360 1467788 1396892 1334354 1279023
48207 1279023 1230983 1189485 1152780 1119813 1090334 1063550 1038284 1014314 992116 971480 951718
48196 951718 932845 915261 898639 882468 867334 854285 843183 833081 824059 817439 814190 814123 816424
48183 816424 819795 822100 821005 815252 804916 790793 774330 757623 742390 728989 717123 707054
48171 707054 699163 692744 686474 680003 674089 669194 664926 660884 657171 653932 651099 648649 646544 644441
48157 644441 642053 639697 637958 636965 636479 636396 636547 636355 635360 633836 632261 630543 628502 626672 625777 625741 626092
48140 626092 626996 628925 631507 633718 635149 636137 636791 636876 636686 637081 638538 640837 643592 646284 648058 648524
48124 648524 648678 649998 652630 655530 658306 661552 665165 667794 668613 668567 669087 670446 672054 673666 675501
48109 675501 677690 680207 682943 685438 687088 688028 689285 691629 694860 698585 702975 708090 713111 717025
48095 717025 719696 721629 723075 724080 725159 727051 729821 732810 735532 738184 741181 744553 747861 750571
48081 750571 752615 754705 757766 761810 765689 768372 770151 772131 774781 777645 780365 783307 786972 791281
48067 791281 795754 800171 804880 810623 818119 827535 838195 848899 858602 866613 872256 874883 874607 872683
48053 872683 870579 868611 865872 861557 855875 849397 842012 833174 823058 812870 803836 796295 789879 784032
48039 784032 778036 770983 762342 752468 742231 732282 722967 714708 707860 702165 696831 691390 686175 681743
48025 681743 678029 674318 670074 665606 661797 659100 656935 654230 650533 646304 642124 638025 633831 629791
48011 629791 626528 624487 623664 623683 623911 623742 623053 622206 621452 620625 619640 618892 618805 619331 620258 621609 623227 624390
47993 624390 624516 624051 624018 624858 626307 628224 630704 633337 635138 635525 634990 634582 635002 636161 637306 637672 637295
47976 637295 637001 637320 637811 637925 637962 638384 638724 638245 637338 636979 636881 635614 632826 629983 628308 627149 625186
47959 625186 622308 619400 616952 614705 612235 609215 605503 601440 597623 594035 590026 585575 581742 579223
47945 579223 577227 574638 571558 568748 566106 562895 559140 555663 552788 550036 547115 544283 541623 538880
47931 538880 536243 534449 533746 533456 532933 532444 532622 533439 534157 534119 533265 531957 530571 529263 528014 526825 525689
47914 525689 524368 522436 519831 517205 515354 514307 513262 511434 508760 505797 503207 501425 500583 500529 500922
47899 500922 501401 501777 502196 502996 504280 505706 506984 508453 510739 513809 516852 519207 520997 522655 524350
47884 524350 526119 528020 529794 530926 531485 532421 534427 536892 538662 539545 540443 542137 544599 547420 550296
47869 550296 552992 555293 557079 558204 558394 557551 556076 554612 553586 553185 553452 554059 554374 554202 554170 554877 556035
47852 556035 556975 557623 558279 558746 558478 557482 556343 555478 555093 555674 557638 560463 563026 564912 566617 568436
47836 568436 570060 571409 572933 574743 576279 577202 577847 578393 578397 577663 576775 576173 575389 573951 572435 571808 572178
47819 572178 573043 574452 577022 580894 585545 590811 597419 606252 617575 631176 646894 664667 684271
47806 684271 705359 727783 751743 777425 804424 831568 857440 880992 901542 918398 930930
47795 930930 938959 942597 941631 935571 924478 909268 890958 870121 847332 823570 799647 775695
47783 775695 751835 729066 708824 691768 677553 665661 655901 648156 642264 638250 636202 635870 636819
47770 636819 639025 642757 647716 652807 657138 660874 664823 669486 674871 680877 687325 693715 699483 704597
47756 704597 709566 714703 719723 724238 728286 732097 735518 738125 739825 740947 741678 741872 741622 741562 742157 742898
47740 742898 742632 740627 736955 731955 725827 718838 711482 704170 696973 689773 682446 674869 667088 659557
47726 659557 652845 646936 641122 634793 628079 621528 615532 610309 606055 602688 599613 596134 591987 587231
47712 587231 581867 576022 570317 565494 561615 558033 554242 550375 546745 543302 539848 536483 533504 530877
47698 530877 528198 525246 522392 520208 518730 517302 515278 512753 510431 508810 507767 506970 506405 506269 506545
47683 506545 506993 507562 508571 510365 512948 515989 519152 522341 525685 529307 533159 537128 541251 545699 550469
47668 550469 555190 559404 562989 566250 569529 572821 575828 578384 580738 583322 586244 589128 591467 592977
47654 592977 593566 593252 592364 591612 591596 592250 593030 593575 593952 594362 594973 595918 597089 598034 598586 599526 601971 605989
47636 605989 610520 614934 619971 626687 635157 644954 656475 670921 689114 710996 736262 764768 796268
47623 796268 830355 866960 906516 949423 995449 1043521 1091738 1137659 1179180 1215328 1245965
47612 1245965 1270742 1288733 1299134 1301755 1296583 1283366 1262039 1233311 1198530 1159143 1116552 1072217
47600 1072217 1027457 983159 939897 898261 858794 821720 787031 754936 725928 700294 677700
47589 677700 657349 638398 620183 602336 585032 569004 554992 543005 532382 522625 513866 506289
47577 506289 499470 492794 486401 481115 477314 474387 471583 468925 466944 465836 465327 465159 465266 465621 466304
47562 466304 467630 469742 472101 473773 474269 473816 472875 471814 471114 471366 472778 474985 477570 480572 484228
47547 484228 488430 492708 496726 500647 505022 510340 516560 522964 528585 532899 536148 539048 542247 545988
47533 545988 550122 554423 558918 563786 568843 573360 576750 579280 581699 584159 586015 586824 587036 587447 588289
47518 588289 589171 589564 589023 587143 583793 579332 574236 568541 561912 554240 545861 537187 528403 519661 511333
47503 511333 503912 497633 492203 486893 481115 475026 469483 465160 461821 458717 455622 453094 451674 451238
47489 451238 451287 451516 451801 451928 451813 451852 452586 453966 455349 456333 457226 458457 459877 461014 461756 462417 463210 464145
47471 464145 465421 467440 470237 473243 475899 478244 480667 483280 485840 488079 489781 490689 490798 490698 491164
47456 491164 492300 493470 494216 494821 495664 496408 496336 495424 494644 495124 497306 500970 505747 511420 518023 525879
47440 525879 535391 546602 559115 572684 587679 604619 623287 642758 662390 682362 702997 723858
47428 723858 743804 761729 776953 789145 798278 804583 808202 808872 806216 800272 791513 780489 767850
47415 767850 754495 741153 727801 714070 700267 687414 676138 666149 657098 649269 642928 637609
47403 637609 632684 628274 624912 622545 620544 618544 616689 615087 613639 612441 611819 611811 611970 611731 610725 608800
47387 608800 606145 603361 601045 599321 598048 597237 596778 596026 594391 592318 590942 590680 590835 590709 590329 589809
47371 589809 588839 587318 585784 584627 583364 581376 578884 576452 573844 570159 565051 559133 553106 547063
47357 547063 540711 533805 526265 518312 510609 503852 498077 492691 487325 482327 478200 474879 471801 468512
47343 468512 464901 460974 456715 452253 447946 444197 441223 439061 437706 437086 436915 436697 436029 434871 433426
47328 433426 431886 430410 429188 428279 427404 426245 425004 424381 424839 426079 427392 428295 428692 428651 428314 427890 427476
47311 427476 426912 425967 424573 422801 420764 418685 416821 415080 412940 410113 407187 405198 404547 404610 404412 403373
47295 403373 401391 398669 395784 393657 393033 393912 395634 397483 399072 400191 400604 400242 399513 399159 399699 401151
47279 401151 403297 405924 408635 410765 411964 412853 414628 417815 421694 425124 427625 429464 431017 432426
47265 432426 433705 434798 435499 435626 435329 435052 435115 435482 435916 436264 436553 436878 437235 437431 437168 436299 434988 433654
47247 433654 432832 432960 434050 435454 436214 435870 434908 434386 435208 437651 441244 445015 448227 451126 454611 458917
47231 458917 462974 465531 466695 467853 470184 473757 478063 482816 487901 492944 497450 501392 505412 510298
47217 510298 516340 523230 530607 538520 547202 556525 566087 575902 586608 598688 611687 624332 635028
47204 635028 641982 643424 638542 628302 614907 600491 586562 574222 564042 555631 548123 541318 535809
47191 535809 531782 528397 524819 521326 518838 517620 516925 515781 513798 511469 510002 510581 513329 517167 521015
47176 521015 524908 529512 534866 540299 545479 550804 556594 562593 568631 575190 582747 590821 598212 604121
47162 604121 608630 612172 614952 616914 617904 617663 615982 613062 609549 606034 602598 598961 594827 589991 584349
47147 584349 578094 571734 565648 559760 553959 548680 544623 541883 539806 537743 535525 533119 530436 527823
47133 527823 526215 526253 527532 529191 530970 533092 535343 537003 537745 537998 538276 538677 539212 540038 541036 541562 541011
47116 541011 539345 536809 533501 529594 525699 522470 519957 517711 515433 513134 510722 507930 504779 501752
47102 501752 499337 497594 496317 495337 494445 493188 491102 488153 484787 481555 478769 476454 474379 472132 469433
47087 469433 466520 464016 462189 460563 458555 456314 454458 453064 451492 449445 447577 446580 446097 445155 443452
47072 443452 441549 439831 437998 435722 433195 430724 428274 425806 423666 422213 421270 420357 419267 418046 416619
47057 416619 414881 413142 411979 411561 411484 411398 411473 412009 412864 413625 414278 415357 417271 419687 421820 423349 424842
47040 424842 427162 430576 434542 438263 441199 443140 444142 444562 444988 445869 447235 448855 450533 452161 453581
47025 453581 454632 455330 455895 456523 457211 457807 458210 458473 458749 459180 459898 461046 462622 464229 465202 465177 464480 463754
47007 463754 463312 463050 462910 463078 463675 464543 465454 466307 467017 467467 467670 467788 467824 467509 466677 465535 464448 463602
46989 463602 463099 463159 463939 465206 466447 467368 468164 469308 471065 473213 475239 476964 478942 481998 486330 491310
46973 491310 496271 501067 505614 509288 511373 512116 512876 514980 518569 522585 525732 527394 527789 527460 526808
46958 526808 526135 525888 526456 527659 528833 529604 530190 530707 530572 529089 526488 523876 522159 521402 521255 521568 522375
46941 522375 523512 524509 524873 524581 524316 525049 527115 529785 531967 533231 533937 534540 535140 535675 536133 536551 537060
46924 537060 537938 539319 540847 541986 542625 542996 542995 542104 540197 537951 536181 535085 534359 533736 533073 532216 531128
46907 531128 530040 529120 528139 526748 525082 523829 523688 524797 526630 528430 529943 531837 535151 540210 546307
46892 546307 552549 558708 564958 571203 577110 582603 587818 592670 596917 600630 604128 607391 609971 611657
46878 611657 612851 614073 615374 616430 616953 616850 616216 615437 615186 616047 618115 620977 624020 626723 628867 630614
46862 630614 632274 633973 635690 637654 640373 644064 648248 652168 655519 658516 661399 664143 666659 669002
46848 669002 671356 673905 676671 679318 681243 682142 682418 682718 683073 682892 681938 680929 680891 682115 684043 685956
46832 685956 687416 688148 687926 686841 685476 684609 684678 685584 687010 688910 691569 695192 699495 703863 707884 711571
46816 711571 715137 718825 722997 727942 733368 738409 742513 746164 750331 755307 760456 765017 768768 771910
46802 771910 774762 777657 780717 783580 785683 786964 788004 789309 790774 791979 792735 793135 793393 793841 794743
46787 794743 795868 796587 796678 796708 797282 798311 799455 800965 803420 806813 810501 814047 817490 820789 823704 826427
46771 826427 829756 834191 839235 843966 848026 851751 855585 859800 864644 870349 876823 883570 890098 896426
46757 896426 903109 910696 919154 927977 936934 946423 956864 967947 978912 989449 999795 1010010 1019674
46744 1019674 1028421 1036218 1042937 1048278 1052460 1056342 1060311 1063535 1064989 1064903 1064483 1064389 1064235 1063574 1062591 1061669
46728 1061669 1060912 1060390 1060358 1060890 1061683 1062513 1063609 1065290 1067507 1069991 1072605 1075283 1077825 1079983 1081611 1082549
46712 1082549 1082580 1081646 1079916 1077439 1074029 1069689 1064814 1059601 1053559 1046045 1037141 1027534 1017656 1007431
46698 1007431 996851 986186 975446 964098 951624 938124 924215 910614 897949 886557 876109
46687 876109 865719 854841 843990 834234 826023 818821 811830 804741 797738 791075 784872 779153 773883
46674 773883 768955 764238 759639 755110 750621 746109 741509 736852 732307 727919 723379 718309 712973 708393
46660 708393 705438 703862 702576 700788 698567 696328 694197 691999 689477 686305 682210 677391 672651 668780
46646 668780 665873 663430 661034 658662 656458 654530 653053 652302 652367 652949 653574 654045 654627 655793 657843 660788
46630 660788 664558 669154 674532 680473 686720 693175 699776 706308 712582 718733 724899 730629 735096 738091
46616 738091 740303 742296 743717 744027 743560 743152 742915 742204 740789 739293 738225 737309 736160 735037 734387 734106
46600 734106 733838 733709 734153 735114 736039 736730 737704 739474 741823 743992 745414 746122 746580 747254 748229 749179 749813
46583 749813 750325 751166 752317 753066 752792 751803 751055 750988 750972 750085 748253 746333 745195 745059 745764 747199 749110
46566 749110 750779 751509 751448 751477 752133 753018 753515 753641 753887 754528 755581 757259 759858 763138 766269 768574 770106
46549 770106 771374 772779 774452 776422 778739 781557 785136 789627 794805 800195 805537 810932 816515 822247
46535 822247 828089 834114 840319 846637 853286 860773 869315 878582 888323 898906 910853 924116 938298
46522 938298 953334 969386 986195 1003196 1020271 1037632 1054825 1070647 1084495 1097182 1109790
46511 1109790 1122157 1133166 1142321 1150272 1157758 1164637 1170209 1174123 1176676 1178352 1179259 1179068 1177558 1175167
46497 1175167 1172763 1170728 1168585 1165777 1162476 1159242 1156184 1153041 1149870 1146969 1144108 1140495 1135710 1130086
46483 1130086 1124058 1117669 1110909 1103864 1096209 1087212 1076682 1065427 1054209 1042798 1030653 1018040
46471 1018040 1005676 993551 980944 967615 954223 941534 929894 919596 911047 904284 898871 894619
46459 894619 892024 891690 893618 897255 901950 907165 912648 918666 925758 933931 942377 950266 957597 964940
46445 964940 972535 980040 987042 993458 999344 1004543 1008635 1011200 1012149 1011829 1010720 1008984 1006387 1002596 997420
46430 997420 990853 983230 975369 968086 961323 954141 945921 937328 929684 923570 918430 913422 908225 903026
46416 903026 898131 893784 890138 887296 885424 884763 885334 886735 888473 890502 893174 896657 900707 905082 909920
46401 909920 915578 922270 929952 938378 947169 955972 964696 973481 982408 991381 1000275 1008938 1016847 1023056
46387 1023056 1026776 1027974 1027266 1025399 1023002 1020589 1018325 1015748 1012167 1007559 1002782 998684 995202 991615
46373 991615 987509 983181 979204 976007 973898 973058 973365 974531 976691 980540 986591 994482 1003373 1012878 1023251
46358 1023251 1034728 1047212 1060671 1075420 1091772 1109713 1129129 1150045 1172347 1195504 1218922
46347 1218922 1242468 1266339 1290462 1314272 1337000 1357917 1376391 1392075 1405123 1415869 1424160
46336 1424160 1429179 1430170 1427158 1420788 1411573 1399569 1384870 1368185 1350758 1333614 1316992 1300585
46324 1300585 1284347 1268834 1254616 1241503 1228737 1216080 1204458 1195240 1188987 1185091 1182584 1181015
46312 1181015 1180498 1181224 1183117 1185853 1189005 1192311 1195988 1200697 1206978 1214753 1223534 1233072 1243488 1254779
46298 1254779 1266571 1278602 1291178 1304853 1319730 1335306 1350898 1366062 1380718 1395085 1409387
46287 1409387 1423371 1436123 1446630 1454471 1459833 1462990 1464100 1463372 1460947 1456553 1449645 1440107 1428574
46274 1428574 1415907 1402590 1388759 1374578 1360383 1346618 1333718 1321877 1310868 1300365 1290517
46263 1290517 1281894 1274693 1268331 1262174 1256418 1251877 1249078 1247922 1248157 1249723 1252530 1256192 1260167 1264089
46249 1264089 1267883 1271606 1275221 1278511 1281287 1283705 1286275 1289396 1292940 1296368 1299197 1301279 1302713 1303694
46235 1303694 1304477 1305358 1306553 1308033 1309524 1310796 1311974 1313379 1315015 1316490 1317643 1318923 1320729 1322666
$$ [...]
##END NTUPLES=NMR SPECTRUM
##END=
