
##TITLE=AC1256_INDRH11073_6642054_PRwSDJKfXY
##JCAMPDX= 6.0         $$ Bruker NMR JCAMP-DX V2.0
##DATA TYPE= NMR SPECTRUM
##DATA CLASS= NTUPLES
##ORIGIN= BRUKER
##OWNER= Administrator
$$ 1.72 TOPSPIN		Version 2.1
$$ 2012-08-08 15:39:36.906 -0500  Administrator@TOPSPIN
$$ Compression mode = diff/dup
##.OBSERVE FREQUENCY= 400.02188249412
##.OBSERVE NUCLEUS= ^1H
##.ACQUISITION MODE= SIMULTANEOUS (DQD)
##.ACQUISITION SCHEME= undefined
##.AVERAGES= 8
##.DIGITISER RES= 22
##SPECTROMETER/DATA SYSTEM= spect
##.PULSE SEQUENCE= zg30
##.SOLVENT NAME= COFFEE_meoh
##.SHIFT REFERENCE= INTERNAL, COFFEE_meoh, 1, 14.98509
##AUDIT TRAIL= $$ (NUMBER, WHEN, WHO, WHERE, PROCESS, VERSION, WHAT)
$$ ##TITLE= Audit trail, TOPSPIN		Version 2.1
$$ ##JCAMPDX= 5.01
$$ ##ORIGIN= Bruker BioSpin GmbH
$$ ##OWNER= Administrator
$$ $$ C:\Bruker\TOPSPIN/data/COFFEE/nmr/AC1256_INDRH11073_6642054_PRwSDJKfXY/10/pdata/1/auditp.txt
$$ ##AUDIT TRAIL=  $$ (NUMBER, WHEN, WHO, WHERE, PROCESS, VERSION, WHAT)
(   1,<2012-08-08 15:39:27.468 -0500>,<Administrator>,<TOPSPIN>,<go>,<TOPSPIN 2.1>,
      <created by zg
	started at 2012-08-08 15:38:20.468 -0500,
	POWCHK enabled, PULCHK disabled,
       configuration hash MD5:
       6B 1B 68 BB D9 2E 58 E2 7F 35 AD 54 07 DF 0E 41
       data hash MD5: 64K
       E1 1C 3B B3 34 79 02 8F 5E 96 93 F8 01 21 B4 76>)
(   2,<2012-08-08 15:39:32.218 -0500>,<Administrator>,<TOPSPIN>,<proc1d>,<TOPSPIN 2.1>,
      <Start of raw data processing
       efp LB = 0 FT_mod = 6 PKNL = 1 PHC0 = 0 PHC1 = 0 SI = 32K 
       data hash MD5: 32K
       3F D3 0A 2F 20 80 D3 C0 0C 96 D7 D7 60 EA 34 1C>)
(   3,<2012-08-08 15:39:32.546 -0500>,<Administrator>,<TOPSPIN>,<proc1d>,<TOPSPIN 2.1>,
      <pk PHC0 = 177.1051 PHC1 = 0 
       data hash MD5: 32K
       6C E7 41 FE B3 F2 23 3A C0 65 75 FA F0 8E 79 83>)
(   4,<2012-08-08 15:39:32.640 -0500>,<Administrator>,<TOPSPIN>,<proc1d>,<TOPSPIN 2.1>,
      <abs ABSG = 1 
       data hash MD5: 32K
       77 67 99 35 A5 89 68 22 DC 9A 35 09 FE 8C 5C D0>)
(   5,<2012-08-08 15:39:32.671 -0500>,<Administrator>,<TOPSPIN>,<proc1d>,<TOPSPIN 2.1>,
      <abs ABSG = 2 
       data hash MD5: 32K
       0B 41 79 89 C3 5C C2 FD 86 38 7A B8 1D 87 96 22>)
(   6,<2012-08-08 15:39:32.703 -0500>,<Administrator>,<TOPSPIN>,<proc1d>,<TOPSPIN 2.1>,
      <abs ABSG = 3 
       data hash MD5: 32K
       31 32 53 EF 44 CD B7 D4 E8 E5 F0 4D C9 B3 0C 3D>)
(   7,<2012-08-08 15:39:32.734 -0500>,<Administrator>,<TOPSPIN>,<proc1d>,<TOPSPIN 2.1>,
      <abs ABSG = 4 
       data hash MD5: 32K
       B5 B9 D0 A3 B7 37 73 BD 48 61 7B 13 E7 67 CB DC>)
(   8,<2012-08-08 15:39:32.765 -0500>,<Administrator>,<TOPSPIN>,<proc1d>,<TOPSPIN 2.1>,
      <abs ABSG = 5 
       data hash MD5: 32K
       7B 3C 8C C5 2B BC AE 2E 1D 01 1A 3F BD 97 8E 5E>)
$$ ##END=
$$ 
$$ $$ hash MD5
$$ $$ 55 AA E1 1F 68 37 28 53 15 54 AA A6 CB 6C 25 54
##$RELAX= 
##$RELAX= 
##$RELAX= 
##$RELAX= 
##$RELAX= 
##$RELAX= 
##$RELAX= 
$$ Bruker specific parameters
$$ --------------------------
$$ [...]
150 150 150 150 150 150 150 150
##$TP07= 0
##$TPNAME0= <>
##$TPNAME1= <>
##$TPNAME2= <>
##$TPNAME3= <>
##$TPNAME4= <>
##$TPNAME5= <>
##$TPNAME6= <>
##$TPNAME7= <>
##$TPOAL= (0..7)
0.5 0.5 0.5 0.5 0.5 0.5 0.5 0.5
##$TPOFFS= (0..7)
0 0 0 0 0 0 0 0
##$TUNHIN= 0
##$TUNHOUT= 0
##$TUNXOUT= 0
##$USERA1= <user>
##$USERA2= <user>
##$USERA3= <user>
##$USERA4= <user>
##$USERA5= <user>
##$V9= 5
##$VALIST= <valist>
##$VCLIST= <CCCCCCCCCCCCCCC>
##$VD= 0
##$VDLIST= <DDDDDDDDDDDDDDD>
##$VPLIST= <PPPPPPPPPPPPPPP>
##$VTLIST= <TTTTTTTTTTTTTTT>
##$WBST= 1024
##$WBSW= 4
##$XGAIN= (0..3)
0 0 0 0
##$XL= 0
##$YL= 0
##$YMAX_a= 471910
##$YMIN_a= -610824
##$ZGOPTNS= <>
##$ZL1= 120
##$ZL2= 120
##$ZL3= 120
##$ZL4= 120
##$ABSF1= 14.98509
##$ABSF2= -5.573092
##$ABSG= 5
##$ABSL= 3
##$ALPHA= 0
##$AQORDER= 0
##$ASSFAC= 0
##$ASSFACI= 0
##$ASSFACX= 0
##$ASSWID= 0
##$AUNMP= <proc_prof1d_extract_pilot.lims>
##$AXLEFT= 0
##$AXNAME= <>
##$AXNUC= <1H>
##$AXRIGHT= 0
##$AXTYPE= 0
##$AXUNIT= <>
##$AZFE= 0.1
##$AZFW= 0.1
##$BCFW= 0
##$BC_mod= 0
##$BYTORDP= 0
##$COROFFS= 0
##$CY= 15
##$DATMOD= 1
##$DC= 0
##$DFILT= <>
##$DTYPP= 0
##$F1P= 0
##$F2P= 0
##$FCOR= 0.5
##$FTSIZE= 32768
##$FT_mod= 6
##$GAMMA= 0
##$GB= 0
##$INTBC= 1
##$INTSCL= 1
##$ISEN= 128
##$LB= 0
##$LEV0= 0
##$LPBIN= 0
##$MAXI= 10000
##$MC2= 0
##$MEAN= 0
##$ME_mod= 0
##$MI= 0
##$NCOEF= 0
##$NC_proc= -8
##$NLEV= 6
##$NOISF1= 0
##$NOISF2= 0
##$NSP= 0
##$NTH_PI= 0
##$NZP= 0
##$OFFSET= 14.98509
##$PC= 1
##$PHC0= 177.1051
##$PHC1= 0
##$PH_mod= 1
##$PKNL= yes
##$PPARMOD= 0
##$PPDIAG= 0
##$PPIPTYP= 0
##$PPMPNUM= 2147483647
##$PPRESOL= 1
##$PSCAL= 4
##$PSIGN= 0
##$PYNMP= <proc.py>
##$REVERSE= no
##$SF= 400.02
##$SI= 32768
##$SIGF1= 0
##$SIGF2= 0
##$SINO= 400
##$SIOLD= 32768
##$SPECTYP= <>
##$SREGLST= <1H.CDCl3>
##$SSB= 0
##$STSI= 32768
##$STSR= 0
##$SW_p= 8223.68421052631
##$SYMM= 0
##$S_DEV= 0
##$TDeff= 65536
##$TDoff= 0
##$TI= <>
##$TILT= no
##$TM1= 0
##$TM2= 0
##$TOPLEV= 0
##$USERP1= <user>
##$USERP2= <user>
##$USERP3= <user>
##$USERP4= <user>
##$USERP5= <user>
##$WDW= 1
##$XDIM= 32768
##$YMAX_p= 448082803
##$YMIN_p= -626891
##$CURPLOT= <Network HP LaserJet P1505>
##$CURPRIN= <$Network HP LaserJet P1505>
##$DFORMAT= <normdp>
##$LAYOUT= <+/1D_H.xwp>
##$LFORMAT= <normlp>
##$PFORMAT= <normpl>
##$SURQMSG= 1
$$ End of Bruker specific parameters
$$ ---------------------------------
##NTUPLES= NMR SPECTRUM
##VAR_NAME=  FREQUENCY,     SPECTRUM/REAL,   SPECTRUM/IMAG
##SYMBOL=    X,             R,               I
##VAR_TYPE=  INDEPENDENT,   DEPENDENT,       DEPENDENT
##VAR_FORM=  AFFN,          ASDF,            ASDF
##VAR_DIM=   32768,         32768,           32768
##UNITS=     HZ,            ARBITRARY UNITS, ARBITRARY UNITS
##FACTOR=    0.250966925370066, 1,           1
##FIRST=     8223.43324360094, -45394,       161236
##LAST=      0,             6303,            -222936
##MIN=       0,             -626891,         0
##MAX=       8223.43324360094, 448082803,    0
$$ Real data points
##PAGE= N=1
##DATA TABLE= (X++(R..R)), XYDATA
$$ [...]
$$ plain form
19524 133139 -391300 -251719 -418983 -122706 -82737 27356 -221665 -194706 73713 23727
19513 -131336 19855 -340579 128719 149155 205133 -86787 -326257 -69309 19338 132467 -251987
19501 -261977 -171776 82100 80908 195450 -145151 38299 63560 40579 -129104 255763 -374219
19489 14775 -223886 -2871 104853 -176735 170920 -182989 -312530 -199307 -3876 -80793 -209142
19478 -209142 -4271 -134251 -118868 -276433 -155766 -60824 -214047 -119493 -352848 70025 -98667
19466 231659 -218193 -176142 -114303 -118076 235932 -64411 -163386 39920 -8090 -157290 -344820
19455 -344820 -69616 -145255 -139455 80314 -193217 -129317 -265945 -345626 51218 394210 -127080
19443 1835 -245523 -41067 -76865 -443846 -202195 -115051 -272369 266036 35798 84424 -297307
$$ packed form
19524A33139c91300J39581j67264a22706L9969B7356b21665K6959G3713B3727
19513a31336A9855c40579A28719K0436N5978h6787k39470f9309A9338J13129b51987
19501b61977R0201H2100j192J14542a45151C8299K5261k2981a29104B55763c74219
19489A4775b23886b871A04853a76735A70920a82989j29541J13223c876p6917j28349
19478b09142d271j29980J5383j57565J20667f0824j53223R4554k33355G0025i8667
19466B31659b18193M2051O1839l773B35932f4411r8975C9920h090j49200j87530
19455c44820f9616p5639N800H0314a93217O3900j36628p9681E1218L42992a27080
19443A835b45523d1067l5798l66981b02195Q7144j57318B66036C5798M8626b97307
$$ plain form
19431 -482627 52284 -57587 199951 -326197 -142601 -56023 -233343 256085 -47901 42771
19420 -207361 -445644 136654 41931 9607 47656 -134686 -292478 -139320 -280335 259188
19409 -110943 64100 -99546 313529 138313 92323 171930 3385 -201869 -45740 -263732 -112562
19397 21274 -133714 -214301 63903 200856 34924 222444 24845 -202219 -205669 201305 201847
19386 201847 -233528 -68175 -17603 -196170 63644 -188240 -308996 -94259 67958 -439186
19375 -289131 -372010 -127029 -154648 -280197 174400 -23514 87156 74255 -395160 60707 61750
19364 61750 18756 107881 -98915 -23884 -204106 26007 -301272 36073 7531 17675 -62155
19352 125763 -8499 8698 134279 17340 -235384 -138270 167872 199123 25089 -126347 -388240
$$ packed form
19431d82627E2284e7587A99951c26197a42601e6023j77320B56085d7901D2771
19420b07361k38283A36654D1931I607L8049a34686j57792a39320j41015B59188
19409a10943F4100i9546C13529A38313m5990P9607C385b01869d5740k17992a12562
19397B1274a33714q0587F3903J36953C4924J87520B4845b02219l450B01305N42
19386B01847b33528f8175a7603j78567F3644a88240j20756i4259F7958d39186
19375b89131q2879a27029k7619j25549A74400b3514H7156j2901c95160F0707J043
19364F1750A8756Q9125i8915b3884j80222B6007c01272C6073G531J0144f2155
19352A25763h499H698J25581A7340b35384R7114A67872L1251B5089a26347k61893
$$ plain form
19341 -388240 238702 -105944 -352198 -340249 72542 77105 -83738 316325 60846 -102730 6844
19329 -65118 189467 -239434 -44577 -426500 -171442 -80136 14458 -142275 -55659 38144 -13681
19317 149667 9989 130855 -107327 -276061 -49783 46264 -33402 -224531 -119706 -78031 -65832
19306 -65832 -30914 -336955 15291 147232 -299280 -224348 -333298 -181652 -108262 -220353
19296 -220353 28813 -216180 33749 -120578 -114156 -452984 -328150 284849 -72550 129478
19285 -99437 -159487 -94890 -238324 7815 -450709 295055 -249849 -730 -20159 34183 40737 -8107
19272 -289850 -95480 372755 -166758 107349 -129844 123230 -48556 -330035 58132 -108614
19261 -28764 -86735 -116146 -209582 -76786 -121034 -337596 -172721 144973 -71974 -228300 -29079
$$ packed form
19341c88240B38702a05944k46254J1949G2542M563h3738C16325F0846a02730F844
19329f5118A89467b39434d4577l81923a71442h0136A4458a42275e5659C8144a3681
19317A49667I989J20866a07327j68734d9783D6264c3402j91129J04825M1675J2199
19306f5832c0914l06041A5291J31941b99280P4932j08950J51646P3390j12091
19296b20353B8813b16180C3749a20578O422l38828J24834B84849g2550A29478
19285i9437o0050O4597j43434G815d50709B95055b49849g30j9429C4183O554h107
19272b89850i5480C72755a66758A07349a29844A23230d8556k81479E8132a08614
19261b8764n7971k9411r3436g6786m4248k16562J64875A44973g1974j56326b9079
$$ plain form
19249 287932 -33033 71059 -375955 -151229 -254423 64960 -34998 91697 -119672 -74930 141355
19237 49107 -7002 -308575 -146208 -8893 -209011 -97402 -424772 60134 -70316 -219636 71483
19225 150395 -75876 -63002 -268570 -213506 -104861 3959 -90509 -138323 -202715 -52636 119283
19213 -216323 -267491 -1800 -142874 -20895 161556 -41740 -151941 121535 6245 110669 259468
19202 259468 110230 -208447 -218220 -212012 -150594 299254 -108478 31199 -304366 54530 -149267
19190 -243871 -112825 -301748 -258310 -101177 -176957 -77254 252679 -44692 133323 96748
19180 96748 -122266 -162978 90273 -408416 -127144 -8217 -245543 126389 -33865 2209 126585
19169 126585 -132142 -244895 -62387 -16122 64634 -67072 -240598 -90605 -297291 -66848 5086
$$ packed form
19249B87932c3033G1059c75955a51229j03194F4960c4998I1697a19672M4742A41355
19237D9107g002l01573a46208h893k00118i7402l27370F0134g0316j49320G1483
19225A50395g5876J2874k05568N5064a04861C959i0509m7814o4392e2636A19283
19213b16323n1168a800j41074b0895A61556d1740j10201A21535F245J04424J48799
19202B59468A10230b08447r773O208O1418B99254a08478C1199c04366E4530a49267
19190b43871a12825j88923M3438a01177p5780g7254B52679d4692A33323l6575
19180I6748a22266m0712I0273d08416a27144h217k37326A26389c3865B209J24376
19169A26585a32142j12753f2387a6122F4634f7072j73526i0605k06686f6848E086
$$ plain form
19157 25077 48165 211188 -129537 -164863 309347 93662 195731 -203694 94532 144116 -152478
19145 1898 64966 168649 17441 -125779 -305524 30122 175702 134957 118227 423205 -131968
19133 104613 -322698 129009 -286867 -51798 -123161 64720 16100 -50668 60549 242868 -141868
19121 128620 -491716 -237616 -24844 -66212 -130660 -44254 -195473 -186057 -285503 2087 -230846
19109 -38380 -57545 114811 188343 53678 -46503 105503 208033 161594 209183 -81180 -49992
19098 -49992 -131606 -282183 -118663 -118317 -129928 -305288 66037 34123 -10399 -124402 128417
19086 -6114 -96339 -129370 127091 -55573 368209 -345164 -152852 -74166 53388 -23070 92553
19074 -92456 1534 -126189 -145021 -218074 -248739 -128494 -124744 154412 -18394 6560 102308 124208
$$ packed form
19157B5077K3088J63023a29537l5326C09347I3662J02069b03694I4532M9584a52478
19145A898O3068J03683A7441a25779j79745C0122J45580m0745j6730L04978a31968
19133A04613c22698A29009b86867e1798p1363F4720A6100e0668F0549J82319a41868
19121A28620d91716b37616b4844m1368o4448d4254j51219R416r9446B087b30846
19109c8380j9165A14811P3532E3678d6503A05503J02530m6439M7589h1180L1188
19098d9992q1614j50577a18663L46j1611j75360F6037l1914a0399j14003A28417
19086f114r0225l3031A27091e5573C68209c45164a52852g4166E3388b3070I2553
19074i2456A534a26189j8832p3053l0665J20245L750A54412a8394F560R5748K1900
$$ plain form
19062 124208 -161661 -210215 -136343 56951 112252 -193681 -35295 -1507 -259205 41490 -127309
19050 185560 -208633 -137133 -119980 98877 -7368 83340 128392 205019 406061 -10358 72219
19038 -110196 -139121 25150 17351 -60060 83613 -338462 -89356 -67923 18825 -148993 81980
19026 -266414 -406393 23513 -7490 207626 66718 -222542 -392006 210862 -263036 -185433
19016 -185433 -19424 -187389 -91718 -139957 -33031 -195899 -53910 -362500 -180794 -42729 -33295
19005 -33295 -4154 427671 -202983 -92387 51932 73869 143314 10173 98186 -10815 157811
18993 169000 206646 -244837 -50719 -101164 -49939 15727 -161084 -105140 -304675 -336027 148650
18981 217922 -151109 -33203 203960 -337850 -172418 -528840 3149 -178976 183114 27961
$$ packed form
19062A24208a61661m8554P3872E6951N5301a93681c5295a507k57698D1490a27309
19050A85560b08633P1500J7153I8877g368H3340M5052P6627K01042a0358G2219
19038a10196k8925B5150p799f0060H3613c38462h9356K1433A8825a48993H1980
19026b66414j39979B3513g490B07626F6718b22542j69464B10862b63036P7603
19016a85433a9424j67965i1718m8239c3031j62868e3910l08590a80794d2729R434
19005c3295d154D27671b02983i2387E1932K1937O9445A0173Q8013a0815A57811
18993A69000L7646b44837e0719n0445d9939A5727a61084N5944j99535l1352A48650
18981B17922a51109c3203B03960c37850J65432l56422C149a78976A83114B7961
$$ plain form
18970 -56662 56070 -81153 131377 -150007 43902 184542 117460 -303133 48349 92174 70102
18959 70102 282031 87944 121782 92390 221448 -25408 95980 -118920 44701 -175534 -146195
18948 -146195 28161 -77400 -163148 -48407 132755 -402481 -38488 -114417 -2937 88670 169929
18937 169929 -143069 243532 -183330 -210491 -343993 -90163 186863 1805 201921 -5237 72414
18925 218185 42073 352261 61642 122802 100794 139419 161366 -115916 45439 20864 -179345
18913 -85976 -31118 -29787 -67658 -91309 261674 -165544 -334083 22763 -333451 7475 -25198
18901 121633 155605 -66680 -94517 136483 181821 433701 241001 588781 -23602 -130802
18891 -130802 -97685 62878 -50641 -214065 -442098 -67497 -141524 -99521 -238504 124267 69267
$$ packed form
18970e6662E6070h1153A31377a50007D3902J40640o7082c03133D8349M3825k2072
18959G0102K11929H7944L3838k9392J29058b5408I5980a18920D4701a75534K9339
18948a46195B8161g7400q5748d8407A32755d02481c8488p5929b937H8670Q1259
18937A69929a43069B43532a83330k7161j33502i0163A86863A805K00116e237G2414
18925B18185D2073L10188F1642O1160k2008L8625K1947a15916D5439B0864a79345
18913h5976c1118J331l7871k3651B61674a65544j68539B2763c33451G475b5198
18901A21633L3972f6680k7837A36483M5338K51880j92700L47780b3602j07200
18891a30802L3117F2878e0641j63424k28033f7497p4027M2003j38983A24267n5000
$$ plain form
18880 69267 -129414 -4316 195791 -423524 34598 18147 -94082 133389 -526355 -314434 -258023
18869 -258023 -208779 57690 -129253 -76459 205091 346228 -30537 122996 -179750 144872
18858 104922 -277348 -43874 -206625 112042 19303 -39958 -165330 -150194 -232844 -236434 25610
18846 272178 -13998 114397 -336366 24095 -506995 -105389 93146 -268175 14803 -62401
18835 -262738 82753 -84849 134636 162173 -103371 75003 165162 26760 -46342 -236555 93249
18823 125358 -252552 114973 -317212 74247 122693 -43112 -213178 89185 189972 57694
18812 -328899 268825 -329766 -322496 -148459 -134256 244105 -277009 -177202 46240 17765 23144
18801 23144 -71676 -103645 107142 -189185 -158622 -142362 -172756 147341 85475 -96297 53311
$$ packed form
18880F9267a29414d316A95791d23524C4598j6451i4082A33389e26355K11921N6411
18869b58023M9244E7690a29253N2794B05091J41137c0537A22996a79750A44872
18858A04922b77348d3874j62751A12042A9303c9958j25372J5136q2650l590B5610
18846B72178a3998A14397c36366B4095e06995a05389I3146b68175A4803f2401
18835b62738H2753h4849A34636K7537a03371G5003R0159B6760d6342j90213I3249
18823A25358b52552A14973c17212G4247M8446d3112j70066H9185J00787E7694
18812c28899B68825c29766P270a48459J4203B44105b77009R9807D6240A7765N379
18801B3144g1676l1969A07142a89185L0563J6260l0394A47341o1866i6297E3311
$$ plain form
18789 -1382 73261 101155 -8541 87775 83298 -206594 -131507 -29111 -27895 -82217 -150614 -10144
18776 -32011 -180326 -80099 95205 -13819 81859 -360619 -75404 102382 -5406 80493 -280580
18764 -345846 147928 -174680 -87373 -124473 -78362 -10058 -96866 -159582 99017 -21541 375302
18752 -168589 -338178 -300337 -198469 -214769 -87358 303431 74659 182277 -192690 131375
18741 -183716 267007 -277285 -159173 76582 23937 -142466 189094 -141007 8580 144961
18731 144961 111147 28127 218291 -181199 -169357 181849 14543 -11349 -464767 -322950
18721 -322950 -416644 -298993 248399 -189739 -283158 -454092 -25695 -154810 -351060 321727
18710 234593 -99695 -98906 176237 27931 115157 116642 -312933 56128 -67075 -230566 -213883
$$ packed form
18789a382G3261K7894h541H7775m477b06594P5087b9111J216n4322o8397a0144
18776c2011j48315h0099I5205a3819H1859c60619g5404A02382e406H0493b80580
18764c45846A47928a74680Q7307l7100M6111a0058q6808o2716I9017b1541C75302
18752a68589j69589L7841J01868j6300h7358C03431G4659J07618a92690A31375
18741a83716B67007b77285J18112G6582B3937a42466A89094a41007H580J36381
18731A44961l3814B8127J90164a81199J1842A81849A4543a1349m53418J41817
18721c22950r3694J17651B48399a89739r3419j70934b5695j29115j96250C21727
18710B34593i9695P89A76237B7931Q7226J485c12933E6128f7075j63491J6683
$$ plain form
18699 -213883 86332 -42492 -100106 -292497 -21667 -9140 -244444 -89165 65917 -85863 -120335
18688 -120335 -314759 218140 -310847 25226 21622 -3058 -113922 -254989 -193367 -453235 -103852
18676 -87134 93306 -63994 -278514 47757 -8037 -62999 -301527 86504 1014 -60295 -84419 5489
18663 151330 -113986 6896 -161193 67865 -206932 -153763 -162603 -101537 -245640 -81409 -303058
18652 -303058 -227676 -364644 117643 -53265 -79921 -39124 -268194 -213738 65068 -338185 -322911
18641 -322911 -185444 -132772 -61180 -292810 -114310 -49206 -101840 224321 -248950 67458
18630 -116560 322420 -13694 -265376 109788 151752 -32595 109299 -35396 83844 -305273
18619 48658 -170587 -53812 -66520 -19402 -120499 -272896 -254387 7672 43962 253084 -222576
$$ packed form
18699b13883H6332d2492n7614j92391b1667i140k35304h9165F5917h5863l4472
18688a20335j94424B18140c10847B5226l604c058j10864j41067O1622k59868a03852
18676h7134I3306f3994k14520D7757h037n4962k38528H6504A014f0295k4124E489
18663A51330a13986F896a61193F7865b06932N3169q840O1066j44103h1409k21649
18652c03058P5382j36968A17643e3265k6656c9124k29070N4456F5068c38185J5274
18641c22911J37467N2672f1180k31630a14310d9206n2634B24321b48950F7458
18630a16560C22420a3694k51682A09788M1964c2595A09299c5396H3844c05273
18619D8658a70587e3812j2708a9402j01097j52397J8509G672L6290K09122b22576
$$ plain form
18607 217134 -177340 -111428 50353 -326641 -261167 -52156 196001 -155396 94870 -41160 317771
18595 -11157 -180412 -188134 86589 -328096 -96230 -155941 -51129 -279734 164093 -90053 242838
18583 -1918 -181405 -45641 -223271 -95247 -85646 -142639 85693 -103655 -244938 -245855 -120025
18571 -267786 -135522 -124126 -52250 -445236 -66706 -23720 59489 -208978 42891 -64652 131149
18559 290305 -42718 -217771 -141016 -74285 165846 -173277 -111774 -208143 311265 -33057 -182236
18548 -182236 -48503 142758 235487 -28211 -122919 441817 -213167 -35925 -357689 -25094 -205691
18537 -205691 -343478 76370 -82345 14529 -242783 -354925 49819 102381 73831 -6303 -219573
18526 -219573 -168723 6117 -14454 14187 -42325 3680 -2817 -189118 106990 -149259 245407
$$ packed form
18607B17134a77340O5912E0353c26641O5474e2156A96001a55396I4870d1160C17771
18595a1157j69255p722H6589c28096i6230n9711e1129k28605A64093i0053B42838
18583a918j79487d5641j77630i5247R601n6993H5693a03655j41283r17a20025
18571b67786J32264J1396e2250l92986f6706b3720E9489b08978D2891f4652A31149
18559B90305d2718j75053P6755O6731A65846a73277O1503r6369C11265c3057j49179
18548a82236d8503A42758R2729b8211r4708D41817b13167c5925l21764b5094j80597
18537b05691j37787G6370h2345A4529b42783j12142D9819N2562k8550f303k13270
18526b19573N0850F117a4454A4187d2325C680b817j86301A06990a49259B45407
$$ plain form
18514 -179017 -21689 48250 -298766 127427 -304678 14235 -266702 -265650 -106457 -13326 -6497
18502 140363 -174457 -14592 -221367 -226077 -42938 -335105 18512 200827 -43772 50518 -326991
18490 221504 675698 82481 266442 -17878 -309726 -321245 -36797 42584 -36120 61539 37018
18479 37018 -48965 321410 -29703 -429892 95742 -19941 204143 -33292 -399866 -265862 -198102
18468 -198102 -93854 106421 70419 -35367 -60248 -3935 -169104 99364 180358 -278120 -153626
18457 -153626 112684 -64256 -328934 -252192 -296007 316109 59538 365680 -286626 -32017
18446 63785 193141 -164536 99556 49087 94138 2359 -90674 -43435 136688 23644 -3585
18434 -192085 -296914 92690 45098 97935 91383 -255312 -54572 198789 26242 -81070 262380
$$ packed form
18514a79017b1689D8250b98766A27427c04678A4235b66702J052a06457a3326f497
18502A40363a74457a4592k06775m710d2938k92167A8512J82315d3772E0518c26991
18490B21504M54194H2481J83961a7878k91848j1519c6797D2584c6120F1539k4521
18479C7018d8965C21410b9703m00189I5742a9941B04143c3292l66574J34004O7760
18468a98102i3854A06421l6002c5367k4881c935j65169I9364Q0994b78120J24494
18457a53626A12684f4256k64678P6742m3815C16109E9538L06142b86626c2017
18446F3785J29356a64536I9556D9087M5051B359i0674d3435A36688B3644c585
18434a92085j04829I2690D5098N2837o552b55312e4572A98789B6242h1070B62380
$$ plain form
18422 -218317 76167 -105457 305789 251748 -239024 -216116 276797 -22117 -184306 43681
18411 -25678 116182 71213 243435 92011 -45918 -146807 -11121 -182781 -118837 -37202 63362
18399 322164 -94707 -318554 -269668 107229 176073 85733 -363274 176102 124208 6495 69553
18388 69553 250935 76605 -100447 178154 193890 -197869 -278824 -46649 -152872 -318371
18378 -318371 -125456 93958 -165216 48670 49196 300235 -162565 -330025 -121099 3228 -121347
18366 -148064 57707 -16614 61240 25348 15928 144415 -133438 -418501 59227 78133 102011
18355 102011 39015 -37275 53739 -266900 -181933 -137973 -200077 -237691 26387 -118841 -96558
18344 -96558 79073 -52096 209579 -2015 -166728 -95151 -535716 -214435 -25060 -314184 -23962
$$ packed form
18422b18317G6167a05457C05789n4041b39024K2908B76797b2117j62189D3681
18411b5678A16182m4969J72222I2011d5918j00889a1121j71660O3944c7202F3362
18399C22164i4707k23847M8886A07229O8844H5733c63274A76102n1894F495O3058
18388F9553J81382G6605a00447A78154J5736a97869q0955d6649j06223j65499
18378c18371a25456I3958a65216D8670N26K51039a62565j67460a21099C228a21347
18366a48064E7707a6614F1240B5348r420J28487a33438k85063E9227J8906K3878
18355A02011C9015c7275E3739b66900Q4967M3960o2104l7614B6387a18841K2283
18344i6558G9073e2096B09579b015j64713P1577m40565b14435b5060k89124b3962
$$ plain form
18332 -64228 -103095 55931 -305654 -245616 137958 159640 11451 -160808 232534 -160966 -29951
18320 85778 -192136 -288847 -228142 -93138 -93406 -48904 -340250 93420 -219528 -101204 -22662
18308 -7696 -142967 36657 -106562 109758 15157 -104861 -311555 -47577 65637 -10858 185720
18296 -227246 267744 -38970 46179 -200331 -178146 33348 -2366 -175295 -315543 -190535 -60415
18284 -180799 -219743 -7981 118875 -49107 80763 -206185 -111440 -235260 -155000 -177556 -200021
18273 -200021 110059 -455817 74973 214968 -219956 -58759 104359 -27346 -48356 -34854
18263 -34854 -376691 -204937 -118288 -7363 519348 -111717 -71718 137774 -29321 -81656 18090
18251 -54077 -281249 -304797 63263 189133 146193 -24646 -166508 -116147 -34778 38964 -119235
$$ packed form
18332f4228l8867E5931c05654O0038A37958K1682A1451a60808B32534a60966b9951
18320H5778a92136r6711O0705i3138k68M4502k91346I3420b19528a01204b2662
18308g696j35271C6657a06562A09758A5157a04861k06694d7577F5637a0858A85720
18296b27246B67744c8970D6179b00331K2185C3348b366j72929j40248J25008f0415
18284a80799l8944g981A18875d9107H0763b06185R4745j23820Q0260k2556k2465
18273b00021A10059d55817G4973J39995b19956e8759A04359b7346k1010J3502
18263c4854l41837J71754Q6649g363E19348a11717L9999A37774b9321n2335A8090
18251e4077k27172k3548F3263J25870m2940b4646j41862N0361c4778C8964a19235
$$ plain form
18239 -389830 -45331 -83576 17599 -161580 -103381 -136211 274725 -36439 -228257 -92386 -255364
18228 -255364 -54542 175553 248883 -61210 -139230 -156746 -85907 -224569 309909 -7271 -100152
18217 -100152 -145588 -160246 58131 -395692 -134458 -52790 -43205 -150755 -266734 198898 -331137
18205 15860 168679 236080 52723 -96827 86898 66755 234702 134648 157056 26441 -132427
18193 548609 124340 -176245 -324712 182539 149208 55200 359499 169992 35174 20762
18183 20762 -122483 -6743 -19619 -3981 594469 67700 -361478 -47287 -332434 57134 8097
18171 -245300 -53694 66954 -209860 16220 88547 -313561 315821 -124496 -59770 74956 -287891
18159 -290727 -374828 -25950 -377812 -99312 352325 -42974 109642 -258363 36234 10286 234320
$$ packed form
18239c89830d5331l8245A7599a61580N8199l2830B74725c6439j91818i2386j62978
18228b55364e4542A75553P3330f1210p8020j7516P0839j38662C09909g271r2881
18217a00152m5436j4658E8131c95692a34458e2790R585j07550j15979A98898c31137
18205A5860J52819O7401E2723i6827H6898k0143J67947j00054K2408B6441a32427
18193E48609A24340a76245j48467A82539l3331E5200L04299A69992C5174j4412
18183B0762a22483f743j2876c981E94469F7700c61478d7287k85147E7134H097
18171b45300e3694F6954b09860A6220P2327c13561C15821a24496e9770G4956b87891
18159b90727q4101b5950l51862i9312C52325d2974A09642b58363C6234A0286K24034
$$ plain form
18148 234320 22403 -191163 -388699 -224476 -205945 -122434 -264191 -163729 -259242 396756
18137 -202784 55650 -94077 -271648 163834 204950 198652 -29392 218298 -447584 24782 110606
18126 110606 19644 -234083 318419 -377637 105415 16703 144387 -410062 -91910 243772
18115 105595 83256 -15972 123658 5203 178421 -61917 -25178 -155872 165408 160661 -191658
18103 39893 -24939 -56700 -276164 -64139 90124 297172 -78417 153016 -255715 45897 75725
18092 75725 70258 -376348 -128807 -90424 -85005 -169182 240234 268291 -313146 81698 141989
18081 141989 -53177 -73393 -92344 -1695 168980 -216372 333074 41681 19049 18917 -139679
18069 -8543 3610 196606 -102807 108604 -19425 -186555 196962 -152250 18808 257666 253760
$$ packed form
18148B34320B2403a91163j97536J64223J8531Q3511j41757J00462r5513C96756
18137b02784E5650i4077j77571A63834M1116o298b9392B18298d47584B4782Q5824
18126A10606A9644b34083C18419c77637A05415A6703J27684d10062i1910B43772
18115A05595k2339a5972A23658E203J73218f1917b5178j30694A65408m747a91658
18103C9893b4939l1761k19464f4139I0124K07048g8417A53016b55715D5897K9828
18092G5725n467c76348a28807L8383N419q4177B40234K8057c13146H1698O0291
18081A41989e3177k0216j8951a695A68980b16372C33074D1681A9049j32a39679
18069h543C610J92996a02807A08604a9425j67130A96962a52250A8808K38858l906
$$ plain form
18058 253760 2711 190394 -288109 -76490 -84331 164816 -305649 186810 -320790 236121
18047 -41874 55286 108727 111895 -10401 -99100 83231 -203650 -167724 -15200 11514 -292344
18035 252268 -288534 -318896 -172042 -306725 153990 -366615 110482 122671 -20305 -181963
18025 -181963 22040 66809 42329 164079 -265462 20146 -74528 123004 255326 266053 -83107
18013 -122818 241976 -7165 452656 92126 -38497 -276459 87390 -303618 35951 -51827 310906
18001 -68458 259183 -10549 -86938 183016 124831 -24836 405328 -20246 -200254 176720 197408
17990 197408 126873 7505 -236949 53571 -286450 -77659 173583 -175286 -85904 14876 77426
17979 77426 -92358 -207994 34651 -95285 -28701 9570 6565 -48448 -131910 -71811 -2291 -34062
$$ packed form
18058B53760B711J87683b88109g6490p841A64816c05649A86810c20790B36121
18047d1874E5286N3441L168a0401q8699H3231b03650L5926a5200A1514b92344
18035B52268b88534l0362J46854j34683A53990c66615A10482J2189b0305j61658
18025a81963B2040M4769k4480J21750b65462B0146g4528A23004J32322J0727h3107
18013a22818B41976g165D52656I2126c8497k37962H7390c03618C5951e1827C10906
18001f8458B59183a0549p6389A83016n8185b4836D05328b0246j80008A76720K0688
17990A97408p0535G505b36949E3571b86450g7659A73583a75286h5904A4876O2550
17979G7426i2358j15636C4651i5285b8701I570l005d8448q3462O0099b291l1771
$$ plain form
17967 -34062 110703 430468 -133330 55942 -218422 -285641 158186 -142723 38186 12629
17956 92215 250072 -48577 -103794 -13598 -46889 -149676 53881 194784 -202888 92159 -207298
17944 41592 -45009 98392 70888 -227105 64394 32657 -137189 182269 -176195 117737 72442
17933 72442 -99318 64121 44781 -467277 45802 181159 27858 198309 72319 -16085 86765
17921 46228 72240 105730 -32571 -109194 177625 51606 -81995 85767 -302138 48384 63678
17910 63678 115207 -242239 -190576 123915 -175880 -26408 102110 -89380 3110 47785 154638
17899 154638 173974 184142 156103 85120 -78556 -255264 -12333 199213 -87377 -77265 -141084
17888 -141084 236264 -71680 -141617 -166328 117791 53277 -77582 -89765 155304 40987 -15886
$$ packed form
17967c4062A10703L19765a33330E5942b18422o7219A58186a42723C8186A2629
17956I2215J57857d8577n5217a3598l3291j02787E3881J40903b02888I2159b07298
17944D1592d5009I8392k7504b27105F4394l1737a37189A82269a76195A17737m5295
17933G2442i9318F4121j9340d67277D5802J35357B7858J70451G2319a6085H6765
17921D6228K6012L3490c2571p6623A77625E1606h1995H5767c02138D8384J5294
17910F3678N1529b42239N1663A23915a75880b6408A02110h9380C110M4675J06853
17899A54638J9336J0168k8039p0983g8556j76708a2333A99213h7377J0112o3819
17888a41084B36264g1680o9937k4711A17791E3277g7582j2183A55304D0987a5886
$$ plain form
17876 159798 234476 -54448 -85566 80568 -116631 -358851 282748 -4968 -34168 98294 24838
17864 64804 -110878 201491 582590 -3583 -193808 118339 -168579 186488 210340 340713
17854 340713 3955 284376 23772 76813 -121230 -32157 200322 -82579 284400 18722 44722
17843 44722 -159630 -46829 -28059 -101134 67756 -104269 285717 109026 -271307 94682 30826
17831 -168846 51142 -154712 -138095 -109862 -48310 15614 -87874 41142 -25983 -196494 -98833
17820 -98833 14533 356107 -83345 -71929 -75629 -233223 -21361 70992 109126 -119503 67269
17808 -25504 71989 110371 -294013 44988 -39068 -33064 -126491 -20230 -90307 -206909 -102887
17796 -10758 -264506 268142 102151 5328 295405 33574 159145 -45676 -14432 -20671 -200302
$$ packed form
17876A59798P4678e4448l1118H0568a16631k42220B82748d968k9200I8294B4838
17864F4804a10878B01491L81099c583j90225A18339a68579A86488K3852J30373
17854C40713C955K80421B3772N3041a21230c2157B00322h2579B84400A8722K6000
17843D4722a59630d6829J8770p3075F7756a04269B85717A09026b71307I4682C0826
17831a68846E1142a54712J6617K8233d8310A5614h7874D1142b5983j70511R7661
17820i8833A4533L41574h3345J1416l700j57594b1361G0992L8134a19503F7269
17808b5504G1989L8382b94013D4988c9068O004r3427b0230p0077j16602a02887
17796a0758k53748B68142A02151E328K90077C3574J25571d5676a4432o239j79631
$$ plain form
17785 -200302 277273 67451 110359 618144 -127721 10000 -28548 -318580 -31195 29809 2947
17773 -246604 -68500 188113 -62135 52005 -2277 -178538 -154184 -46656 -228439 20364 469849
17762 469849 -105455 240098 86983 154099 -130324 195904 34223 158471 -33163 119384
17751 -309095 -224245 67738 161384 309512 172992 300541 109864 -228705 26742 -47435
17740 -35297 -50195 -315803 104675 166476 146048 93224 264301 -69100 91562 -75777 103603
17728 62936 89180 31747 170805 -39852 -134118 -141934 149383 45956 186081 207419 -67548
17716 -76013 -16390 -37151 -127268 165815 199176 -68818 -24292 17340 -279131 201804 -178081
17704 13851 196053 -254772 -5269 -37926 232046 10169 223277 14352 96962 93134 456408
$$ packed form
17785b00302B77273F7451M2908N07785a27721A0000b8548k90032c1195B9809B947
17773b46604f8500A88113f2135E2005b277j76261K4354d6656j81783B0364M49485
17762D69849a05455B40098H6983O7116a30324A95904C4223J24248c3163A19384
17751c09095Q4850F7738R3646J48128j36520J27549A09864b28705B6742d7435
17740c5297j4898k65608A04675O1801k0428n2824J71077f9100I1562g5777A03603
17728F2936K6244C1747J39058c9852r4266p816A49383D5956J40125K1338f7548
17716g6013a6390k0761r0117A65815L3361f8818b4292A7340b79131B01804a78081
17704A3851J82202b54772e269l2657B32046A0169K13108A4352Q2610l828L63274
$$ plain form
17693 456408 260945 80802 239578 -76131 459052 17685 -118033 -71216 98035 -57631 227770
17681 113893 686 -118532 -108293 173611 -51329 -150544 393414 224382 -32058 94206 -58642
17669 -226399 -72458 -37064 133114 209485 4216 194326 69058 -182998 78435 -51449 131465
17657 363876 -9723 -196516 6030 -50752 -178828 186362 -21883 22566 -139775 90543 66114
17646 66114 235359 82103 338068 18169 -98301 -57060 -77931 188245 287066 218489 341562
17635 341562 -212624 266645 5545 -114161 28957 234935 137423 -50525 73004 -485326 125957
17623 -98857 12069 413743 94288 -233977 173698 59369 -54901 -171520 91354 226335 134000
17612 134000 -55911 -45796 -95394 264598 204713 -261253 24904 -156529 -231166 116472 79918
$$ packed form
17693D56408j95463H0802J58776g6131D59052A7685a18033M6817I8035e7631B27770
17681A13893F86a18532J0239A73611e1329r9215C93414j69032c2058I4206e8642
17669b26399g2458L5394A33114P6371D216J90110F9058a82998G8435e1449A31465
17657C63876i723j86793F030e0752j28076A86362b1883B2566a39775I0543k4429
17646F6114J69245H2103K55965A8169i8301M1241k0871A88245R8821o8577J23073
17635C41562b12624B66645E545a14161B8957K05978r7512e0525G3004d85326A25957
17623i8857A2069M01674I4288b33977A73698E9369e4901j16619I1354J34981r2335
17612A34000e5911J0115m9598B64598n9885b61253B4904a56529p4637A16472l6554
$$ plain form
17601 79918 254115 -99860 159340 138750 157877 435209 182197 -31492 65601 -268945 -185570
17590 -185570 167461 219674 87224 -51703 379795 361510 31618 25833 -98937 -117414 -134615
17579 -134615 46979 -211812 230153 190178 -2738 -10725 104747 99451 -173478 -9648 33787
17567 -44252 -11359 -174836 94476 371913 336463 -3663 188387 12191 252136 93268 -33740
17555 -24301 181790 131115 45704 133987 59844 153417 283278 171324 -69373 27757 201268
17544 201268 -76060 -79726 149854 114860 120551 273190 387719 289306 -76635 45847 -89011
17532 470975 328318 82178 85077 357528 136744 159214 200543 643012 456970 284610
17522 284610 655676 349276 198886 266002 399853 378594 343094 325917 145882 94021
$$ packed form
17601G9918J74197i9860A59340k0590J9127K77332A82197c1492F5601b68945Q3375
17590a85570A67461N2213H7224e1703C79795j8285C1618n785i8937j8477j7201
17579a34615D6979b11812B30153l9975b738p987A04747n296a73478i648C3787
17567d4252a1359j63477I4476K77437l5450c663A88387A2191K39945I3268c3740
17555b4301A81790n0675D5704Q8283E9844R3573J29861j11954f9373B7757J73511
17544B01268g6060l666A49854l4994N691J52639J14529r8413g6635D5847h9011
17532D70975j42657H2178K899K72451A36744K2470M1329M42469j86042j72360
17522B84610L71066l06400j50390O7116J33851k1259l5500j7177A45882n1861
$$ plain form
17512 94021 195394 469693 191521 199883 393576 685806 281621 271405 488710 67977
17501 225334 138058 276954 111183 685441 199310 438998 532243 124036 14534 178084
17491 178084 196706 112645 195126 85553 128069 377803 123477 258282 -12660 168074 132506
17480 132506 128893 357292 320523 593243 198739 313529 275526 174301 255560 115333
17469 547747 527794 262694 178141 166661 286804 229134 -50316 361190 316419 19958 166390
17458 166390 440026 292849 192628 433943 238864 179427 189215 258746 220409 183990 570706
17447 570706 407051 573041 341869 269895 218693 464440 435536 119977 -12207 253355
17436 506777 426135 289254 164660 527935 296767 270163 291745 325090 57260 327481
$$ packed form
17512I4021J01373K74299A91521Q362J93693K92230B81621j0216K17305F7977
17501B25334q7276J38896A11183N74258A99310K39688R3245A24036A4534J63550
17491A78084J8622q4061Q2481H5553M2516K49734A23477J34805a2660A68074l5568
17480A32506l613K28399l6769K72720A98739J14790l8003j01225Q1259A15333
17469E47747j9953B62694q4553j1480J20143n7670e0316C61190m4771A9958J46432
17458A66390K73636j47177j00221K41315j95079n9437R788O9531l8337l6419L86716
17447E70706j63655J65990k31172p1974n1202K45747k8904A19977a2207B53355
17436E06777q0642j36881j24594L63275k31168k6604K1582L3345E7260K70221
$$ plain form
17426 327481 295332 264978 331483 356353 42637 -6438 199907 301211 187914 82154 405272
17415 405272 282237 291252 278251 268347 524468 386575 272109 145937 354626 221213
17405 221213 193421 37672 216068 -239579 187134 -166586 117950 217451 27744 -342856
17394 175727 81857 50258 42135 -23433 282976 -69050 329686 85970 305710 407278 -68263
17382 429650 235785 346131 -251628 28652 -26714 231089 103463 383359 545440 135096
17371 40782 18074 543613 53338 54277 98080 172255 243125 93049 137218 71308 245175 12749
17358 335108 -108657 794353 50922 396829 299782 292357 242373 230673 399998 202648 241383
17347 241383 240753 276434 368885 51829 85971 148691 370402 195843 83356 -34483 252222
$$ packed form
17426C27481l2149l0354O6505K4870D2637f438A99907J01304j13297H2154L23118
17415D05272j23035R015j3001r904K56121j37893j14466j26172K08689j33413
17405B21213k7792C7672J78396b39579A87134a66586A17950R9501B7744c42856
17394A75727H1857l1599q123b3433B82976f9050C29686H5970K19740J01568f8263
17382D29650j93865J10346b51628B8652b6714B31089A03463K79896J62081A35096
17371D0782A8074N25539E3338R39M3803P4175P0870I3049M4169o5910J73867A2749
17358C35108a08657G94353E0922L45907r7047p425m9984j1700J69325j97350L8735
17347B41383o30L5681R2451E1829L4142O2720K21711j74559H3356c4483B52222
$$ plain form
17335 135874 176409 274296 414897 66360 292211 424063 21847 471318 418661 -8124 382244
17323 311138 437533 26481 73982 -7193 184756 132942 360976 -13802 420163 81857 16622
17311 -66471 287768 313706 -81915 24055 73906 56419 120578 279183 528532 234782 449370
17300 449370 150867 -6645 57546 299988 244170 593624 269284 67737 153719 291329 379548
17289 379548 136816 154891 230694 -113773 -86453 115370 195610 500076 448767 278252
17279 278252 358039 289073 273715 24831 417673 -91865 -30895 -58736 62253 101980 -35089
17267 147161 115722 92367 265322 53101 122048 345557 138647 -23913 170694 79842 403294
17256 403294 204556 -165107 409814 312916 -167641 206550 264986 70185 195779 566274
$$ packed form
17335A35874M0535R7887J40601F6360K25851J31852B1847M49471n2657h124C82244
17323C11138J26395B6481M7501g193A84756n1814K28034a3802D20163H1857A6622
17311f6471B87768K5938h1915B4055M9851j7487O4159J58605K49349B34782K14588
17300D49370A50867f645E7546K42442n5818L49454B69284F7737Q5982J37610Q8219
17289C79548A36816J8075P5803a13773K7320A15370Q0240L04466n1309j70515
17279B78252P9787o8966j5358B4831L92842i1865c0895k7841F2253L9727c5089
17267A47161l1439k3355J72955E3101O8947K23509A38647b3913A70694G9842L23452
17256D03294j98738a65107D09814r6898a67641B06550N8436G0185J25594L70495
$$ plain form
17246 566274 201617 532908 355300 473623 516583 271192 329553 416987 199845 104701
17236 104701 548368 259983 365872 -105649 700058 438913 218069 551852 65972 550702
17226 550702 240584 223575 330531 248560 92813 343191 536397 6030 663428 506872
17216 506872 263579 297247 721579 446103 206717 211511 139274 16027 188750 666982
17206 666982 653725 332030 291477 508544 -9634 419036 262723 -23021 253003 501052
17196 501052 831592 317622 598382 422508 518130 318632 420975 -36828 459280 239328
17186 239328 677826 229376 656950 444264 301695 314928 559908 421356 154299 470085
17176 470085 156876 300450 479556 275384 444532 461095 229162 479041 251148 346952
$$ packed form
17246E66274B01617L31291j77608J18323M2960k45391N8361Q7434A99845r5144
17236A04701M43667B59983J05889a05649G00058k61145B18069L33783F5972M84730
17226E50702B40584j7009J06956q1971I2813K50378J93206F030O57398j56556
17216E06872k43293L3668M24332k75476B06717M794p2237A6027J72723M78232
17206F66982j3257l21695m0553K17067i634D19036j56313b3021B53003K48049
17196E01052L30540C17622K80760j75874R5622j99498J02343c6828D59280k19952
17186B39328M38498B29376M27574k12686j42569J3233K44980j38552A54299L15786
17176D70085A56876J43574J79106k04172J69148J6563B29162K49879k27893R5804
$$ plain form
17166 346952 624840 449075 -208 529230 334056 471434 528590 424371 438929 472469 580920
17155 580920 197401 319299 637546 176495 676658 -3619 319137 205045 326556 624588
17145 624588 698558 475144 612399 700552 266266 496384 231979 494508 400702 384344
17135 384344 378181 337907 391945 342677 353428 537435 529811 464759 550648 639973 542238 241809
17122 645964 530504 669946 760985 597022 717820 416126 466239 447898 349043 564941
17112 564941 516886 419682 329961 564701 733156 45154 696022 881675 289636 678754
17102 678754 634637 872881 894002 292946 697367 908956 623301 354816 688142 660376
17092 660376 648873 425453 649844 595919 699581 548146 297998 675165 880473 802041
$$ packed form
17166C46952K77888j75765b08E29230j95174J37378N7156j04219J4558L3540J08451
17155E80920A97401J21898L18247A76495N00163c619C19137j14092J21511K98032
17145F24588P3970k23414J37255Q8153B66266K30118B31979K62529r3806j6358
17135C84344o163m0274N4038m9268J0751J84007p624o5052Q5889Q9325r7735B41809
17122F45964j15460J39442R1039j63963J20798l01694N0113j8341r8855K15898
17112E64941m8055r7204q9721K34740J68455D5154O50868J85653B89636L89118
17102F78754m4117K38244K1121B92946M04421K11589k85655k68485L33326k7766
17092F60376j1503k23420K24391n3925J03662j51435k50148L77167K05308p8432
$$ plain form
17082 802041 363442 853293 702846 431940 660031 796581 535018 655142 596625 788137
17072 788137 487970 561662 866482 754389 890311 624723 827816 765840 673028 410386
17062 410386 729272 935378 878670 736471 666781 357367 477266 665787 662727 761527
17052 761527 571926 954109 866333 1047982 589897 724798 828764 797611 830006 829572 780395
17041 780395 919695 905171 577645 632701 1008646 822903 1118226 731262 709183 861592
17031 861592 530572 703480 766333 1082487 864022 837619 732376 589615 1006149 866141
17021 866141 869331 1052631 1038198 917456 901546 661473 754703 1087152 679722 814788
17011 814788 979276 955382 785831 930969 896171 913044 905566 831222 928217 1226306 1173096
$$ packed form
17082H02041C63442M89851j50447k70906K28091J36550k61563J20124n8517J91512
17072G88137l00167P3692L04820j12093J35922k65588K03093o1976r2812k62642
17062D10386L18886K06106n6708j42199o9690l09414J19899J88521l060R8800
17052G61527j89601L82183q7776J81649m58085J34901J03966l1153L2395m34m9177
17041G80395J39300j4524l27526N5056L75945j85743K95323l86964k2079J52409
17031H61592l31020J72908O2853L16154k18465k6403j05243j42761M16534j40008
17021H66141L190J83300j4433j20742j5910k40073R3230L32449m07430J35066
17011H14788J64488k3894j69551J45138l4798J6873p478p4344R6995K98089n3210
$$ plain form
17000 1173096 989604 1354369 1009691 992402 1209632 1239684 789378 1108743 1274539 830269
16990 830269 971107 1080500 947031 1078628 837069 1065041 1457737 1030015 1248642 1190816
16980 1190816 1043440 1099214 1366664 1057634 1025441 1173984 1264686 1422644 1508186 1295082
16970 1295082 1280095 1232093 1272423 1288345 1448250 1544896 1259490 1401198 1374316 1366763 1689420
16959 1689420 996283 1630719 1645395 1197276 1536435 1194831 1754882 1621967 1706992 1598183
16949 1598183 1446585 1510454 1377575 1634150 1800439 1430950 1449087 1478018 1746317 1852056
16939 1852056 1598497 1707646 1788951 1590103 1578029 1897062 1793891 1939766 1561756 1592499
16929 1592499 1764211 1912610 1815919 1860906 1908737 1837799 2317323 1859828 1979928 1856203
$$ packed form
17000A173096j83492L64765l44678j7289K17230L0052m50306L19365J65796m44270
16990H30269J40838J09393j33469J31597k41559K27972L92696m27722K18627n7826
16980A190816j47376N5774K67450l09030l2193J48543R0702J57958Q5542k13104
16970A295082j4987m8002M0330J5922J59905R6646k85406J41708k6882p553L22657
16959A689420o93137O34436J4676m48119L39159l41604N60051j32915Q5025j08809
16949A598183j51598O3869j32879K56575J66289l69489J8137K8931K68299J05739
16939A852056k53559J09149Q1305j98848j2074L19033j03171J45875l78010L0743
16929A592499J71712J48399r6691M4987M7831p0938M79524m57495J20100j23725
$$ plain form
16919 1856203 1942532 2092438 2130938 1994944 1981118 2292258 2189013 2404358 2398866 2306793
16909 2306793 2345129 2136589 2276248 2376797 2705284 2478918 2498155 2398410 2243270 2610954
16899 2610954 2340411 2625296 2884940 2545748 2687780 2622958 2876376 2768871 2605045 2780277
16889 2780277 2797389 2759135 2590972 3136569 2979949 3110072 2710944 3273994 3141183 3394830
16879 3394830 3568473 3203557 3448916 3421715 3520192 3284567 3498143 3669409 3613779 3513910
16869 3513910 3903927 3738204 3695390 3496061 4005422 4255749 4040887 4256053 4264778 4118954
16859 4118954 4372935 4351155 4379174 4415650 4451948 4491747 4795520 4765639 4688188 4874257 4991900
16848 4991900 4842837 4803364 5010807 5651204 5839341 5300580 5259733 5498455 5204570 5415076
$$ packed form
16919A856203Q6329J49906L8500j35994j3826L11140j03245K15345n492r2073
16909B306793L8336k08540J39659J00549L28487k26366J9237r9745j55140L67684
16899B610954k70543K84885K59644l39192J42032o4822K53418j07505j63826J75232
16889B780277J7112l8254j68163N45597j56620J30123l99128N63050j32811K53647
16879C394830J73643l64916K45359k7201R8477k35625K13576J71266n5630r9869
16869C513910L90017j65723m2814j99329N09361K50327k14862K15166Q725j45824
16859D118954K53981k1780K8019L6476L6298L9799L03773k9881p7451J86069J17643
16848D991900j49063l9473K07443O40397J88137n38761m0847K38722k93885K10506
$$ plain form
16838 5415076 5806977 5958980 6119096 6416979 6016383 6370793 6241812 6084945 6725826
16829 6725826 6456763 6753604 7108910 6957577 7040571 7747907 7342936 7725507 7852938 8033426
16819 8033426 8058226 8034662 8605980 8561252 8674685 8637063 8695001 9127668 9530987 9566087
16809 9566087 9688228 9787693 10052109 10382549 10715442 10656970 11299291 11185411 11414656 11985881
16799 11985881 12058544 12394903 13005863 13127606 13243934 13505025 13869056 14142836 14403977
16790 14403977 14945239 15042415 15838964 16142931 16580848 17096078 17200107 18110261 18567016
16781 18567016 18885173 19405861 20188514 20346263 21228633 21573418 22360376 22793399 23830377
16772 23830377 24438915 25344951 26264338 27175218 27675765 28682686 29386713 30350213 31548016
$$ packed form
16838E415076L91901J52003J60116K97883m00596L54410j28981j56867O40881
16829F725826k69063K96841L55306j51333Q2994P07336m04971L82571J27431J80488
16819H033426K4800k3564N71318m4728J13433l7622N7938M32667M03319L5100
16809I566087J22141R9465K64416L30440L32893n8472O42321j13880K29245N71225
16799A1985881P2663L36359O10960J21743J16328K61091L64031K73780K61141
16790A4403977N41262R7176P96549L03967M37917N15230J04029R10154M56755
16781A8567016L18157N20688P82653J57749Q82370L44785P86958M33023J036978
16772B3830377O08538R06036R19387R10880N00547J006921P04027R63500J197803
$$ plain form
16763 31548016 32577350 33326136 35269985 36341614 37175517 38546449 40040832 41270649
16755 41270649 43059307 44291557 46107771 47909541 49629585 51330357 53248930 55402301
16747 55402301 57565665 59778724 61979216 64328309 66969931 69352197 72273344 74902817
16739 74902817 77744723 80790158 83787396 86815731 89815663 92981436 96198308 99324196
16731 99324196 102284026 105068965 108363464 111069521 113612888 116192676 118451955 120289248
16723 120289248 122075351 123459190 124650908 125497879 125859230 126082088 125589513 124705393 123668798
16714 123668798 122409994 120458591 118757369 116134168 113715629 110756459 108167241 105540177
16706 105540177 102060589 98847408 95704706 92304039 89289938 86031288 82716103 79934371
$$ packed form
16763C1548016J029334P48786J943849J071629Q33903J370932J494383J229817
16755D1270649J788658J232250J816214J801770J720044J700772J918573K153371
16747E5402301K163364K213059K200492K349093K641622K382266K921147K629473
16739G4902817K841906L045435K997238L028335K999932L165773L216872L125888
16731I9324196K959830K784939L294499K706057K543367K579788K259279J837293
16723A20289248J786103J383839J191718Q46971L61351K22858m92575q84120j036595
16714A23668798j258804j951403j701222k623201k418539k959170k589218k627064
16706A05540177l479588l213181l142702l400667l014101l258650l315185k781732
$$ plain form
16698 79934371 76704322 73659751 70721094 68193162 65302666 62876492 60232215 58088909
16690 58088909 56069311 53709758 51591119 49498494 47765546 46120684 44053054 42750503
16682 42750503 41126491 39403122 37956796 36515182 35467984 34324865 33239390 31910467
16674 31910467 30684399 30097916 28580497 27833261 26736261 25945649 24940183 24317114 23206387
16665 23206387 22525642 22255496 21732238 20547008 20109401 19692410 18921702 18456691 18220224
16656 18220224 17461397 17118860 16380538 16211687 15890319 15223995 14878928 14581984 14171240
16647 14171240 13919089 13481322 13067484 12608244 12316441 11682555 11779530 11621077 11219460
16638 11219460 10938681 10931919 10602173 10316404 10240192 9853280 9588739 9504631 9336588 9134486
$$ packed form
16698G9934371l230049l044571k938657k527932k890496k426174k644277k143306
16690E8088909k019598k359553k118639k092625j732948j644862k067630j302551
16682D2750503j624012j723369j446326j441614j047198j143119j085475j328923
16674C1910467j226068n86483j517419p47236j097000p90612j005466o23069j110727
16665B3206387o80745k70146n23258j185230m37607m16991p70708m65011k36467
16656A8220224p58827l42537p38322j68851l21368o66324l45067k96944m10744
16647A4171240k52151m37767m13838m59240k91803o33886R6975j58453m01617
16638A1219460k80779o762l29746k85769p6212l86912k64541q4108j68043k02102
$$ plain form
16628 9134486 9125940 8545437 8568911 8596795 8169998 8051860 7719761 7715379 7589300 7342549
16618 7342549 7063080 7380729 7211529 6774197 6561038 6608518 6350375 6365299 6158808 6157607
16608 6157607 6366924 5974614 5578111 5618331 5476574 5322918 5249114 5485152 5337915 5237260
16598 5237260 5024117 5282402 4876546 5004343 4786548 4708959 4767442 4826045 4264877 4577831
16588 4577831 4190791 4115181 4308746 4190984 3672714 4165904 4008481 3954882 3857672 3674822
16578 3674822 3699322 3819454 3526312 3836769 3537771 3529389 3433369 3687911 3184044 3301520
16568 3301520 3465653 3140330 3382905 3265614 2933861 2834284 3013502 3208767 3116248 2742218
16558 2742218 3130348 2743280 2874958 2555908 2515182 2752100 2514088 2650194 2762332 2805242
$$ packed form
16628I134486q546n80503K3474K7884m26797j18138l32099m382j26079k46751
16618G342549k79469L17649j69200m37332k13159M7480k58143J4924k06491j201
16608F157607K09317l92310l96503M0220j41757j53656p3804K36038j47237j00655
16598E237260k13143K58285m05856J27797k17795p7589N8483N8603n61168L12954
16588D577831l87040p5610J93565j17762n18270M93190j57423n3599r7210j82850
16578C674822K4500J20132k93142L10457k98998q382r6020K54542n03867J17476
16568C301520J64133l25323K42575j17291l31753r9577J79218J95265r2519l74030
16558B742218L88130l87068J31678l19050m0726K36918k38012J36106J12138M2910
$$ plain form
16548 2805242 2519780 2803278 2423537 2337034 2735403 2328394 2262857 2297516 2124915 2289576
16538 2289576 2222750 1893117 2085145 2168295 2094659 2129041 2298942 2026693 1943546 1704133
16528 1704133 2113819 2163086 1570680 2115106 1891025 1992155 2129922 1833149 1851602 1600298
16518 1600298 1727865 1602181 1745195 1790445 1823654 1877637 1656434 1376246 1742349 1825463
16508 1825463 1709734 1736259 1755843 1577932 1471150 1415517 1261594 1512113 1792690 1531018
16498 1531018 1413771 1120187 1404048 1224914 1489220 1288635 1649034 1514670 1535673 1496349
16488 1496349 1529700 1169406 1467090 1326636 1108262 1346867 1068900 1210405 1226083 1315720
16478 1315720 1086272 1341984 1077659 1115862 1417271 1161126 1510106 1144753 1026686 991376
$$ packed form
16548B805242k85462K83498l79741q6503L98369m07009o5537L4659j72601J64661
16538B289576o6826l29633J92028Q3150p3636L4382J69901k72249q3147k39413
16528A704133M09686M9267n92406N44426k24081J01130J37767k96773J8453k51304
16518A600298J27567j25684J43014M5250L3209N3983k21203k80188L66103Q3114
16508A825463j15729K6525J9584j77911j06782n5633j53923K50519K80577k61672
16498A531018j17247k93584K83861j79134K64306k00585L60399j34364K1003l9324
16488A496349L3351l60294K97684j40454k18374K38605k77967J41505J5678Q9637
16478A315720k29448K55712k64325L8203L01409k56145L48980l65353j18067l5310
$$ plain form
16468 991376 1199212 1260217 957877 1215602 1263862 1407434 1166476 1070779 1179157 1195866
16458 1195866 1166789 719762 1153303 1070207 1065141 1120599 1228493 842935 1080653 1049443
16448 1049443 1007243 1091460 1020088 886234 957412 1223435 827016 633501 735062 1279410
16438 1279410 1064087 1057168 990250 851336 991668 705724 797652 1031018 1078013 1130666
16428 1130666 807758 851421 907690 690192 618266 812292 889149 829757 861625 1007408
16418 1007408 987742 487969 957232 715548 856005 910446 954078 542364 881788 586378
16408 586378 631659 811094 853373 675649 520477 676722 578988 855262 921997 585685
16398 585685 741290 554937 660560 652240 436648 969360 760627 549590 176918 297732
$$ packed form
16468I91376K07836O1005l02340K57725M8260J43572k40958r5697J08378J6709
16458A195866k9077m47027M33541q3096n066N5458J07894l85558K37718l1210
16448A049443m2200Q4217p1372j33854P1178K66023l96419j93515J01561N44348
16438A279410k15323o919o6918j38914J40332k85944R1928K33366M6995N2653
16428A130666l22908M3663N6269k17498p1926J94026P6857n9392L1868J45783
16418A007408j9666D87969M69263k41684J40457N4441M3632m11714L39424k95410
16408E86378M5281J79435M2279j77724j55172J56245r7734K76274O6735l36312
16398E85685J55605j86353J05623q320k15592N32712k08733k11037A76918J20814
$$ plain form
16388 297732 781794 786986 661575 1004580 522131 718877 516919 553755 273958 576601
16378 576601 701722 567580 659967 683969 844728 380639 1026227 446929 543787 438667
16368 438667 953507 35891 367891 360025 464233 263597 563040 254091 133802 470466
16358 470466 655303 382623 578779 870488 414705 536920 125565 353608 516409 328789
16348 328789 375012 479344 292978 799791 676650 225454 569382 370533 747669 631336
16338 631336 520953 407158 517170 545088 521724 292092 369321 498493 158338 637091
16328 637091 435615 651003 393240 173161 477995 682795 471610 470094 226461 512985
16318 512985 392542 266213 396686 393302 516898 271780 171484 203148 191816 103565
$$ packed form
16388B97732M84062N192j25411L43005m82449J96746k01958L6836B73958L02643
16378E76601J25121j34142R2387K4002J60759C80639O45588D46929R6858j05120
16368D38667N14840C5891L32000p866J04208k00636K99443B54091j20289L36664
16358D70466J84837k72680J96156K91709D14705J22215A25565K28043J62801j87620
16348C28789M6223J04332j86366N06813j23141B25454L43928j98849L77136j16333
16338F31336j10383j13795J10012K7918k3364k29632P7229J29172A58338M78753
16328F37091k01476K15388k57763A73161L04834K04800k11185j516B26461K86524
16318E12985j20443j26329J30473l384J23596k45118j00296L1664j1332q8251
$$ plain form
16308 103565 170893 360723 308983 255063 412339 436376 273828 453914 481231 169519
16297 406260 68126 392393 621737 19512 166062 388424 143630 430028 275889 489838
16287 489838 328500 723570 230796 722522 428454 218859 248705 40514 180427 285019
16277 285019 236126 397991 256532 651179 205297 388037 454854 61843 208816 36512
16266 166810 368961 236335 191099 98911 156408 112808 188957 171611 3146 29434 280106
16255 280106 31594 462867 63996 289616 542804 295910 459018 164678 453345 587324
16245 587324 61246 -137554 230217 560355 277555 513547 314011 344711 524271 317886
16235 317886 250284 451627 199260 318918 505147 251325 319309 368532 9804 315115
$$ packed form
16308A03565O7328J89830n1740n3920J57276K4037j62548J80086K7317A69519
16297D06260F8126L24267K29344A9512J46550K22362A43630K86398j54139K13949
16287D89838j61338L95070B30796M91726k94068k09595K9846D0514J39913J04592
16277B85019m8893J61865j41459L94647B05297J82740O6817F1843J46973C6512
16266A66810K02151j32626m5236r2188N7497m3600P6149j7346C146K6288K50672
16255B80106C1594M31273F3996K25620K53188k46894J63108A64678K88667J33979
16245E87324F1246a37554B30217L30138B77555K35992j99536L0700J79560k06385
16235C17886o7602K01343A99260J19658J86229B51325O7984M9223I804L05311
$$ plain form
16225 315115 219214 197115 372842 206932 394356 489060 205158 318421 436710 453282
16215 453282 -31771 253091 37389 341303 144627 28519 140111 309634 274186 189770
16205 189770 277825 46963 -81145 358305 31809 115997 451912 -277837 -10977 97694 -72976
16193 221606 194104 -36044 256365 190576 -151616 -56530 -264913 309344 345856 58117 340410
16182 340410 -61536 -138900 275004 172398 181261 234834 192064 233813 62553 -276233 294784
16170 101408 324396 195335 413276 43435 -64111 -354545 112118 -60145 3650 148355
16160 148355 -9843 -25288 -39573 225882 -13179 304879 -180072 235749 39244 214512 38852
16148 143800 -194944 142548 154286 25042 -174275 -154674 191864 85824 269754 -43936
$$ packed form
16225C15115r5901k2099J75727j65910J87424R4704B05158J13263J18289J6572
16215D53282c1771B53091C7389L03914A44627B8519J11592J69523l5448q4416
16205A89770Q8055D6963h1145C58305C1809Q4188L35915b77837a0977I7694g2976
16193B21606k7502c6044B56365o5789a51616e6530k08383C09344L6512E8117K82293
16182C40410f1536p7364B75004j02606Q863N3573m2770M1749F2553b76233B94784
16170A01408K22988j29061K17941D3435f4111k90434A12118f0145C650J44705
16160A48355i843j5445j4285B25882a3179C04879a80072B35749C9244J75268C8852
16148A43800a94944A42548J1738B5042a74275J9601A91864H5824J83930d3936
$$ plain form
16137 -124318 -55771 -127676 -103136 -24395 -54559 202013 26419 175722 247438 -14538 116724
16125 247168 195881 -11004 69983 -35746 -167018 -17816 320902 131123 154278 250884 147658
16114 147658 190303 119602 -2003 162297 328316 31098 373860 317975 -164999 394201 122772
16102 150585 288952 -89261 37213 -46153 176716 33208 162904 345039 13762 361508
16092 361508 88485 42855 352583 77687 147000 183223 -187074 -219446 -128339 158307 -42365
16080 105198 -34528 115884 -48028 -181880 47059 -42477 165559 -9540 228421 51965 -220724
16068 -20717 457236 99901 -62372 -418775 169653 -86713 19954 -101503 72886 -152219 146652
16056 -88882 90565 185886 -21944 39321 -119695 122051 163474 -98885 -60414 -174662 -174370
$$ packed form
16137a24318e5771p1905K4540b4395l0164B02013B6419J49303P1716a4538A16724
16125B47168n1287a1004F9983c5746j31272a7816C20902A31123K3155R6606j03226
16114A47658M2645p0701b003A62297J66019C1098L42762n5885a64999C94201A22772
16102A50585J38367h9261C7213d6153A76716C3208J29696J82135A3762L47746
16092C61508H8485D2855L09728G7687O9313L6223a87074l2372R1107A58307d2365
16080A05198c4528A15884d8028j33852D7059d2477A65559i540B28421E1965b20724
16068b0717D57236I9901f2372l56403A69653h6713A9954a01503G2886a52219A46652
16056h8882I0565R5321b1944C9321a19695A22051M1423i8885L8471j14248K92
$$ plain form
16045 -174370 248256 19182 56794 260177 -66423 17591 -8055 57723 149722 129112 -95067
16033 173102 93567 116706 -67459 -100579 131733 -79911 -54432 -50533 -3160 -48487 -138689 313901
16020 -375877 -58596 -91233 39620 -50010 180753 -427250 -144225 180776 63743 -154230
16009 -15350 110387 -144666 6818 235905 -102670 -139832 90889 176039 176199 -141756 -216259
15998 -216259 -93476 213854 -128058 -599 228825 9950 126181 -264480 27206 269348 -397173
15986 90711 98455 178967 -31870 -10288 -111569 395396 483073 469384 444650 573855 388661
15975 388661 477549 520991 137105 80551 -91766 20974 -242317 -92582 -294391 -138937 -18641
15963 79843 51873 -43759 38986 26740 -208493 -67842 93134 -4212 58522 13529 155482
$$ packed form
16045a74370B48256A9182L7612K03383f6423A7591h055E7723R1999k0610i5067
16033A73102p9535K3139f7459l3120A31733g9911K5479L899c160m5327r0202C13901
16020c75877e8596l2637C9620e0010A80753d27250a44225A80776F3743a54230
16009a5350A10387a44666F818K29087a02670l7162I0889Q5150J60a41756p4503
15998b16259i3476B13854a28058e99B28825I950J16231b64480B7206K42142c97173
15986I0711P744Q0512c1870a0288j01281C95396Q7677j3689k4734J29205j85194
15975C88661Q8888M3442A37105n6554i1766B0974b42317i2582k01809a38937a8641
15963G9843k7970d3759C8986j2246b08493f7842I3134d212E8522A3529J41953
$$ plain form
15952 155482 -207659 -203829 -77543 -170496 271904 127108 -36039 52011 -55211 -34128 127908
15940 -151480 -249796 21310 63469 7823 99674 91411 123802 -94883 137698 -233366 232869
15928 -13537 -200003 -295063 73389 71300 -129088 -191889 52673 168901 -241208 -79752 56768
15916 -163883 90012 198510 280563 45113 -72795 13780 -207449 -297982 221106 -159511 51691
15904 -136531 -144460 -109201 -35557 191313 151247 117540 98943 -154329 -217131 -363597 149833
15892 82629 222448 69617 328530 -341969 80352 35379 -60914 520384 -81395 122071 211560
15881 211560 -182871 81492 -142294 117143 -235842 -67562 -362435 -54179 -238784 25329
15870 199129 -167592 -285272 -93889 -7929 20097 -62105 -205458 -82264 -195311 136110 -102741
$$ packed form
15952A55482b07659L830g7543r2953B71904A27108c6039E2011e5211K1083A27908
15940a51480r8316B1310M2159G823R1851q263L2391i4883A37698b33366B32869
15928a3537j86466r5060G3389k089a29088o2801E2673J16228b41208g9752E6768
15916a63883I0012J08498Q2053D5113g2795A3780b07449r0533B21106a59511E1691
15904a36531p929L5259c5557A91313m0066l3707j8597a54329o2802j46466A49833
15892H2629J39819F9617K58913c41969H0352C5379f0914E20384h1395A22071Q9489
15881B11560a82871H1492a42294A17143b35842f7562k94873e4179j84605B5329
15870A99129a67592j17680i3889g929B0097f2105j43353h2264j13047A36110a02741
$$ plain form
15858 -11411 -41361 126589 -145782 257325 67915 127328 44703 70511 46232 -372680 -123971
15846 -388872 -164347 23082 313801 65810 -65244 -257064 -126271 -16703 386934 12529
15835 212352 -121604 -272600 178876 65605 -19313 -70740 187676 202189 -25913 -8266 -321588
15824 -321588 -249690 -44527 -25338 349253 -56860 -97255 -230581 231207 49725 -291492 111242
15812 25291 -54394 -75544 54073 43640 161312 51734 57338 63688 -238741 408423 -95913
15800 89709 83828 -58814 -379751 169113 -187721 141046 -119782 196795 98318 99081 -201706
15788 -52611 -127670 20586 -89537 3446 -150893 -129065 15039 -213382 38915 -121092 -471706
15777 -471706 -368367 -274047 167588 -11847 -257069 -8091 -78404 -165156 -280128 -83417 -158940
$$ packed form
15858a1411k9950A26589a45782B57325F7915N9413D4703K5808k4279c72680a23971
15846c88872a64347B3082K90719F5810f5244j91820a26271a6703C86934A2529
15835B12352a21604j50996A78876F5605a9313n1427A87676J4513b5913h266l13322
15824c21588P1898d4527J9189C49253e6860m0395j33326B31207D9725b91492A11242
15812B5291e4394k1150E4073j0433J17672E1734N604O350b38741D08423i5913
15800H9709n881e8814l20937A69113a87721A41046a19782A96795I8318P63b01706
15788e2611p5059B0586h9537C446a50893K1828A5039b13382C8915a21092l50614
15777d71706J03339R4320A67588a1847k45222h091p0313q6752j14972h3417p5523
$$ plain form
15766 -158940 -67057 -284069 -88069 163854 -3375 -170124 186748 -389042 -185132 -245539
15756 -245539 128397 -122687 28719 -150822 24037 106038 -3826 -314118 288079 3260 -72117
15744 -264208 162889 200841 -9159 115377 83195 -99742 69432 242305 -305694 -135940 93446
15732 367857 200018 -132373 -188988 25359 36365 26202 191700 202327 -62578 -433903 -45351
15720 -137459 -99302 104867 -40132 -215643 171491 -178344 287777 -12107 48853 68428
15710 68428 -11022 -290984 241282 155728 -90538 -109061 -76483 258182 256993 -243430 127869
15698 -330640 -332357 -101124 158274 -222476 -38187 -270665 262855 -101778 -375162 -250012
15688 -250012 -81409 47450 245726 -49355 50697 189366 114879 98165 -74779 -91473 74200
$$ packed form
15766a58940f7057k17012h8069A63854c375j66749A86748c89042a85132o0407
15756b45539A28397a22687B8719a50822B4037Q2001c826l10292B88079C260g2117
15744b64208A62889L7952i159A15377l2182i9742F9432J72873c05694a35940I3446
15732C67857j67839a32373n6615B5359J1006j0163J65498J0627f2578l71325d5351
15720a37459L8157A04867d0132j75511A71491a78344B87777a2107D8853J9575
15710F8428a1022k79962B41282q5554i0538j8523L2578B58182j189b43430A27869
15698c30640j717a01124A58274b22476c8187k32478B62855a01778k73384J25150
15688b50012h1409D7450J98276d9355E0697J38669p4487j6714g4779j6694G4200
$$ plain form
15676 51792 -192525 -42056 -73100 -187365 -116493 146395 86029 -320973 -207921 -101390
15665 54422 58623 174092 113949 99708 112101 -45909 77443 -136902 205422 312575 -78501
15653 -186426 23179 -160937 -41244 51513 5203 -307291 19003 -284666 -138535 -21771 184061
15641 10079 -162717 -150535 -1387 36620 -249069 -9431 -108920 -220532 -128163 -234848 -124541
15630 -124541 297570 -197622 -70507 -160783 -37862 -35985 193449 -25905 -200129 -119778 295265
15618 -104504 256175 -287278 -169811 131767 -88088 -151432 65254 -262790 -76616 -177301
15608 -177301 -184547 -104978 105741 -51103 -78004 140200 13117 226067 -118731 12549 -184813
15596 152208 -341024 -214050 126750 -213816 -105200 21016 209825 230584 173297 -104919
$$ packed form
15676E1792a92525d2056l1044j14265P0872A46395o0366c20973J13052a01390
15665E4422M201J15469o0143j4241J2393d5909G7443a36902B05422J07153g8501
15653a86426B3179a60937d1244E1513E203c07291A9003b84666a38535b1771A84061
15641A0079a62717J2182a387C6620b49069i431r9489j11612R2369j06685J10307
15630a24541B97570a97622g0507r0276c7862J877A93449b5905j74224Q0351B95265
15618a04504B56175b87278J17467A31767h8088o3344F5254b62790g6616j00685
15608a77301p246P9569A05741e1103k6901A40200A3117K12950a18731A2549a84813
15596A52208c41024J26974A26750b13816a05200B1016J88809K0759n7287a04919
$$ plain form
15585 -105665 179709 284856 188728 182472 -197236 -217087 -4708 -40285 43832 -418049 -235204
15574 -235204 -35420 108683 -188731 116727 132167 19439 -32709 -129752 -79391 101052 206716
15563 206716 2819 -47256 215704 25812 -48009 -47715 590 160007 275542 117079 121422 213181
15551 213181 76013 45606 -133487 94008 24736 261382 -76729 240333 13819 -211063 -87530
15539 439373 328413 183500 509505 194636 -11527 358525 -210759 -132627 14266 -86192
15528 416231 558580 137404 337692 -8437 446063 58272 355337 267187 -55271 128941
15517 -168508 48586 38019 -1852 -141054 -214179 193131 -152757 -81576 -24731 -90988 -225217
15506 -225217 -71090 104668 9806 35413 9676 -98268 115072 -27456 -110996 386691 -359139
$$ packed form
15585a05665A79709J05147r6128o256a97236j9851d708l5577D3832d18049J82845
15574b35204c5420A08683a88731A16727J5440A9439c2709r7043N0361A01052J05664
15563B06716B819d7256B15704B5812d8009K94E90J59417J15535A17079M343R1759
15551B13181G6013l0407a33487I4008B4736K36646g6729B40333A3819b11063h7530
15539D39373j10960j44913L26005A94636a1527C58525b10759P8132A4266h6192
15528D16231J42349A37404K00288h437D46063E8272K97065q8150e5271A28941
15517a68508D8586j0567a852j39202p3125A93131a52757P1181b4731o6257j34229
15506b25217g1090A04668I806K5607I676i8268A15072b7456q3540C86691c59139
$$ plain form
15494 118100 24461 -57138 81763 81622 -5341 140142 99841 -305419 -403908 -41347 300613
15482 47924 -88778 214996 -206511 -247864 12756 -29311 73497 -253875 97441 234153 71439
15470 47251 40329 311837 46211 72584 246071 301650 180769 -194645 162174 168848 -70750
15458 -71440 307907 183346 150288 259364 64125 -276657 185654 -49461 23926 -20715 -29428
15447 -29428 62174 84733 -232041 160813 71902 226002 267589 131020 55098 451165 296558
15436 296558 225976 365114 133511 167613 176652 128230 218022 -345717 -18029 -28934 -207930
15425 -207930 47407 272564 48639 35251 -179733 214838 381152 41033 -183277 148274
15414 -35707 -75808 15117 -237327 97079 19366 -226619 -70406 87525 50665 94668 161747
$$ packed form
15494A18100B4461e7138H1763j41e341A40142m0301c05419r8489d1347C00613
15482D7924h8778B14996b06511m1353A2756b9311G3497b53875I7441J36712G1439
15470D7251o922K71508D6211K6373J73487N5579j20881a94645A62174O674g0750
15458g1440C07907j24561l3058J09076F4125b76657A85654d9461B3926b0715q713
15447b9428F2174K2559b32041A60813G1902J54100M1587A31020E5098L96067j54607
15436B96558p0582J39138A33511L4102R039m8422Q9792c45717a8029j0905j78996
15425b07930D7407K25157D8639j3388a79733B14838J66314D1033a83277A48274
15414c5707m0101A5117b37327I7079A9366b26619g0406H7525l6860M4003O7079
$$ plain form
15403 161747 7895 56470 -20504 214384 54836 -55186 -72335 -166199 246416 -279957 -83649
15391 28315 61860 -47801 153373 -50299 -15570 -57046 -83628 -55329 -210279 -186967 316950
15379 32561 -173831 -182060 37826 142386 -25218 52949 -45608 -296529 -144533 15779 -248069
15367 7711 41279 -150698 58006 -89636 -243319 136506 29951 301069 71789 -60308 -16922
15355 -121271 -27167 -135869 -46499 204337 216386 121513 -157363 215736 114992 297009
15345 297009 -187099 -199113 320182 32418 278025 134643 4168 10787 -174978 91443 -1836
15333 -203454 263503 -61389 177988 -138329 -184698 -151164 133770 -5460 237509 160038 -146365
15321 -107792 156011 27933 226126 -231226 57683 430081 44230 125080 -7005 -32327 -337074
$$ packed form
15403A61747G895M8575b0504B14384E4836e5186j7149r3864B46416b79957h3649
15391B8315L3545d7801A53373e0299a5570m1476k6582K8299j54950K3312C16950
15379C2561a73831q229C7826J04560b5218E2949d5608k50921a44533A5779b48069
15367G711L3568a50698E8006h9636j53683A36506B9951K71118G1789f0308a6922
15355a21271b7167j08702d6499B04337J2049r4873a57363B15736j00744J82017
15345B97009a87099j2014C20182C2418K45607A34643D168O619a74978I1443a836
15333b03454B63503f1389A77988a38329m6369L3534A33770e460B37509p7471a46365
15321a07792A56011B7933J98193b31226E7683L72398D4230Q0850g005k5322l04747
$$ plain form
15310 -337074 202338 138794 379677 -127450 -184813 52923 29513 -181318 32578 -379926
15299 -74225 354805 313888 -82365 45383 19488 269208 194096 289174 -52869 -117652 33408
15287 86546 214427 19199 -135796 -109018 6091 -243453 143377 278038 -24042 178563 74208
15275 17863 129540 173203 64220 270796 149866 115892 -92104 -95436 241211 -11403 -278373
15264 -278373 94714 19256 -58411 10526 85891 98347 -148019 324115 126899 205014 -13950
15252 288773 63576 162514 193844 -236847 263603 -28803 145729 228506 -3865 -49079 -156177
15241 -156177 273720 85710 400408 285611 464603 138306 834793 1465025 2662070 2735944
15231 2735944 2821240 2602623 1889682 1075434 468383 718136 104237 175259 64759 502522
$$ packed form
15310c37074B02338o3544K40883a27450n7363E2923k3410a81318C2578c79926
15299g4225C54805m0917h2365D5383A9488K49720p5112R5078e2869o4783C3408
15287H6546J27881A9199a35796K6778F091b43453A43377J34661b4042A78563G4208
15275A7863J11677M3663F4220K06576j20930l3974i2104l332B41211a1403k66970
15264b78373I4714A9256e8411A0526P5365J2456a48019C24115A26899P8115a3950
15252B88773F3576R8938L1330b36847B63603b8803A45729Q2777c865m5214j07098
15241a56177B73720H5710L14698j14797J78992A38306O96487O30232J197045P3874
15231B735944Q5296k18617p12941q14248D68383K49753A04237P1022F4759M37763
$$ plain form
15221 502522 -184384 303106 179946 -166741 -80619 224477 -99067 275062 230286 -62335
15210 140499 23224 196391 -85095 -257870 62341 52500 288322 384013 280021 -311427 -52315
15198 281352 288624 73610 146663 393529 20836 14874 -99978 13771 -55518 153551 327082
15187 327082 24979 88269 327413 -23243 302542 -32971 -81465 157391 6382 -183060 231818
15175 42559 -203954 245099 -154998 -100072 422200 238084 115290 52921 -58290 393423
15164 1677 -49639 376284 -173720 -211357 91622 69419 -122385 202822 283332 331106 146030
15152 196522 189179 70374 84467 -74969 -84767 -38932 84382 -2635 249083 -33525 281997 -3492
15139 100063 112615 381825 -20317 -59934 -173962 -28586 176416 18692 70554 -31012 177809
$$ packed form
15221E02522a84384C03106j23160a66741h0619B24477i9067B75062m4776f2335
15210A40499B3224J73167h5095j72775F2341r841K35822R5691j03992c11427e2315
15198B81352P272G3610P3053K46866B0836n962i9978A3771e5518A53551J73531
15187C27082B4979O3290K39144b3243C02542c2971m8494A57391F382a83060B31818
15175D2559b03954B45099a54998N4926D22200j84116A15290E2921e8290C93423
15164A677d9639C76284a73720l7637I1622k2203a22385B02822Q0510M7774A46030
15152A96522p343G0374J4093g4969r798c8932H4382b635B49083c3525B81997c492
15139A00063J2552K69210b0317l9617j14028b8586A76416A8692N1862c1012A77809
$$ plain form
15127 49061 345836 106279 124212 107235 221544 160455 317815 79906 192892 119098 134117
15116 134117 -121059 59630 267464 380507 456514 309092 414225 509076 605009 320220
15106 320220 155917 356038 95067 255076 -101496 85951 -101997 9939 9075 150057 242920
15095 242920 391459 -42057 330982 509738 279791 371624 -57135 -143950 -72293 330684
15084 -82508 2884 153396 -189991 157771 142205 -18524 126412 147096 -115735 136032 -29958
15072 150508 -20749 196619 566472 249687 9614 254879 -296434 44785 -55766 111886
15061 224426 269068 210738 -29824 86082 -6477 -111328 54312 140102 27850 -39504 186546
15049 295107 157702 -124269 306210 471791 -181326 -58268 144276 -18816 228736 -1289
$$ packed form
15127D9061K96775A06279J7933j6977J14309o1089J57360G9906J12986p3794J5019
15116A34117a21059E9630K07834J13043P6007j47422J05133R4851R5933k84789
15106C20220A55917K00121I5067J60009a01496H5951a01997I939q64J40982R2863
15095B42920J48539d2057C30982J78756k29947R1833e7135q6815P1657C30684
15084h2508B884J50512a89991A57771j5566a8524A26412K0684a15735A36032b9958
15072A50508b0749A96619L69853B49687I614K45265b96434D4785e5766A11886
15061B24426M4642n8330b9824H6082f477j04851E4312Q5790B7850c9504A86546
15049B95107j37405a24269C06210J65581a81326e8268A44276a8816B28736a289
$$ plain form
15038 -109156 98834 195472 313667 12892 399315 413134 90529 471650 231631 192878 222004
15027 222004 124726 198222 384809 243292 182755 200277 379919 74649 451566 432402 134828
15015 361652 371873 254134 280009 386812 370208 228765 212978 400123 585000 101962
15004 280527 -87292 255773 251826 56753 270564 278222 -10224 510322 174849 363802 18471
14992 361668 391079 355574 351246 499184 150889 116956 336313 393544 68281 271079 451269
14981 451269 119766 424261 254821 409286 49303 458486 287559 183750 235282 442975
14971 442975 185799 447491 314090 297706 283854 288213 349862 191350 10835 214783 405040
14960 405040 260456 183932 322331 129816 272562 242543 83032 232653 240513 264168 178260
$$ packed form
15038a09156I8834R6638J18195A2892L86423J3819I0529L81121B31631l8753K9126
15027B22004r7278P3496J86587j41517o0537J7522J79642G4649L76917j9164A34828
15015C61652J0221j17739K5875J06803j6604j41443j5787J87145J84877A01962
15004B80527h7292B55773l947E6753K13811P658a0224E10322A74849J88953A8471
14992C61668K9411l5505m328J47938A50889l3933K19357N7231F8281K02798J80190
14981D51269A19766L04495j69440J54465D9303M09183j70927j03809N1532K07693
14971D42975A85799K61692j33401j6384j3852M359O1649j58512A0835K03948J90257
14960D05040j44584p6524J38399A29816J42746l0019H3032J49621P860K3655q5908
$$ plain form
14949 178260 7938 227776 206114 239510 474754 326456 178911 301818 341337 339941 451003
14938 451003 185527 608605 417941 467009 255423 343228 221595 449468 151263 534470
14928 534470 548049 503561 354978 358396 668206 877639 830522 454330 634106 738241
14918 738241 620054 929295 738320 477322 695237 664501 611070 392266 181651 303812
14908 303812 199928 390090 306387 246746 494344 311330 340762 644900 429639 283268
14898 283268 330608 409990 480728 531762 338534 361894 259566 -2575 542039 590434 -64225
14886 188834 404339 458256 391215 73609 210689 487574 397118 508424 518341 523178 288860
14875 288860 448402 410831 354995 476107 698446 659836 337972 642895 354153 436536
$$ packed form
14949A78260G938K19838k1662L3396K35244j48298j47545J22907L9519j396J11062
14938D51003A85527M23078j90664M9068k11586Q7805j21633K27873A51263L83207
14928E34470J3579m4488j48583L418L09810K09433m7117l76192J79776J04135
14918G38241j18187L09241j90975k60998K17915l0736n3431k18804A81651J22161
14908C03812j03884J90162q3703n9641K47598j83014K9432L04138k15261j46371
14898B83268M7340P9382P0738N1034j93228K3360j02328b575E42039M8395f4225
14886A88834K15505N3917o7041G3609J37080K76885r0456J11306R917M837k34318
14875B88860J59542l7571n5836J21112K22339l8610l21864L04923k88742Q2383
$$ plain form
14865 436536 648371 352765 335214 343420 -250979 542599 342822 404650 469749 112512
14854 298195 289715 415120 486688 267987 412622 200227 300412 178395 505330 622536
14844 622536 362241 306283 524071 718299 776301 887705 764436 771215 720637 657315 725628
14833 725628 504444 445080 781777 332398 437170 458567 565746 265356 571384 338160
14823 338160 799062 572670 461653 702616 585759 613822 607412 661852 475125 135918
14812 305759 641093 332442 73201 529451 428609 430484 387700 623735 451764 392966
14802 392966 602803 345055 489331 636913 530351 897091 789787 776512 787786 349583
14791 787866 569771 510350 741833 553660 750803 603160 781634 382212 534111 591131
$$ packed form
14865D36536K11835k95606j7551Q206b50979E42599j99777O1828O5099A12512
14854B98195q480J25405P1568k18701J44635B00227J00185j22017L26935J17206
14844F22536k60295n5958K17788J94228N8002J11404j23269O779n0578o3322O8313
14833G25628k21184n9364L36697C32398J04772K1397J07179B65356L06028k33224
14823C38160M60902k26392j11017K40963j16857K8063o410N4440j86727A35918
14812C05759L35334l08651G3201M56250j00842J875m2784K36035j71971n8798
14802C92966K09837k57748J44276J47582j06562L66740j07304j3275J1274C49583
14791G87866k18095n9421K31483j88173J97143j47643J78474C82212J51899N7020
$$ plain form
14781 591131 660972 640079 835475 534417 599011 491270 599972 809748 525384 557262
14771 557262 808805 520048 560797 573734 517166 459958 353304 844185 408913 156924
14760 656828 969246 620487 707361 723672 395466 906895 597164 591927 594168 435495 483171
14749 483171 745649 474882 724700 399874 635092 809882 643695 779754 537938 643782
14739 643782 796987 775845 392023 519602 834836 601760 126793 1035383 572452 855143
14729 855143 551403 868611 496295 549826 834907 1129509 839043 486982 1181983 1071218
14719 1071218 945654 921767 777839 699566 1037777 870341 934023 1008012 1029569 682772
14709 682772 829020 1039724 750697 698078 1038542 1038908 1167299 1110248 965537 1090279
$$ packed form
14781E91131O9841k0893J95396l01058O4594j07741J08702K09776k84364L1878
14771E57262K51543k88757M0749J2937n6568n7208j06654M90881D08913A56924
14760F56828L12418l48759Q6874J6311l28206N11429l09731n237K241j58673M7676
14749D83171K62478k70767K49818l24826K35218J74790j66187J36059k41816J05844
14739F43782J53205k1142l83822J27579L15234k33076A26793R08590m62931K82691
14729H55143l03740L17208l72316N3531K85081K94602k90466l52061O95001j10765
14719A071218j25564k3887j43928p8273L38211j67436O3682P3989K1557l46797
14709F82772J46248K10704k89027n2619L40464L66J28391n7051j44711J24742
$$ plain form
14699 1090279 949918 1056694 1074726 1090173 1086597 697304 882740 1023136 701463 849449
14689 849449 764601 975422 1092052 793427 737188 831501 977831 1041704 883873 673684
14679 673684 1255672 896558 900516 923366 1023538 787557 920531 898776 895813 1102698 985839
14668 985839 913047 900530 1052786 828601 721588 1140406 970431 1040125 770723 1063748
14658 1063748 644529 961366 1124336 1112583 1098997 1031219 710536 1275711 1146717 1292800
14648 1292800 1082254 991702 1051835 1149134 1310096 1231125 1238545 1047578 1180485 1328994
14638 1328994 1229061 1078185 1139710 1512429 1423694 1467470 1030898 1223473 1181093 1117976
14628 1117976 1241296 1410486 1275553 1413146 1199842 1630497 931758 1357838 904849
$$ packed form
14699A090279j40361J06776J8032J5447l576l89293J85436J40396l21673J47986
14689H49449q4848K10821J16630k98625n6239R4313J46330O3873j57831k10189
14679F73684N81988l59114L958K2850J00172k35981J32974k1755k963K06885j16859
14668I85839p2792j2517J52256k24185j07013M18818j69975O9694k69402K93025
14658A063748m19219L16837J62970j1753j3586o7778l20683N65175j28994J46083
14648A292800k10546r0552O0133R7299J60962p8971P420j90967J32907J48509
14638A328994r9933j50876O1525L72719q8735M3776m36572J92575m2380o3117
14628A117976J23320J69190j34933J37593k13304M30655o98739M26080m52989
$$ plain form
14619 904849 1156896 1482515 1370130 1205894 1214077 1316263 1549564 1418224 1474760 1181052
14609 1181052 1211108 1252120 1580599 1246553 1473799 1526289 1325184 1428256 1278637 1605943
14599 1605943 1458141 1514943 1400497 1551654 1492598 1703146 1655003 1610142 1418366 1442022
14589 1442022 1679912 1953650 1836775 2173768 2015365 1737643 1920350 2123474 1469700
14580 1469700 1728090 2291271 1961783 2164533 1957174 2060935 2107028 2260821 2218265 2132072
14570 2132072 2485022 2190415 2333910 2717218 2184095 2500900 2591065 2464212 2395649 2515259
14560 2515259 2924448 2759523 2690024 3164290 3159496 3592606 3778828 3976288 4633025 5135558
14550 5135558 6559148 8628592 12663842 21518238 30246790 26586883 18633641 13119273
$$ packed form
14619I04849K52047L25619j12385j64236Q183J02186K33301j31340N6536k93708
14609A181052L0056M1012L28479l34046K27246N2490k01105J03072j49619L27306
14599A605943j47802N6802j14446J51157n9056K10548m8143m4861j91776K3656
14589A442022K37890K73738j16875L36993j58403k77722J82707K03124o53774
14580A469700K58390N63181l29488K02750k07359J03761M6093J53793m2556q6193
14570B132072L52950k94607J43495L83308n33123L16805R0165j26853o8563J19610
14560B515259M09189j64925o9499M74266m794M33110J86222J97460O56737N02533
14550E135558J423590K069444M035250Q854396Q728552l659907p953242n514368
$$ plain form
14542 13119273 10373386 6376430 3548790 2536628 2251459 2164897 2165552 2105622 2425210
14533 2425210 2621749 2781859 3171010 3471486 4876849 6430140 5726855 4264655 3595362
14524 3595362 3208896 3134029 2412124 2485658 2405037 2501230 2411766 2524630 2575613 2595508 2637804
14513 2637804 2561849 2640220 2424692 2479573 2537436 2509422 2960719 2778114 2845067 2881551 2910231
14502 2910231 2812353 2961557 3392103 2849026 3133417 3043101 2747953 3446055 3239524 2722026
14492 2722026 3205740 3412600 3065206 2973172 3539045 3338138 3590527 3539377 3441827 3547508
14482 3547508 3422387 3736268 3667902 3689924 3687353 3948632 3643548 4248705 3886406 3859123
14472 3859123 3789921 4349866 4627951 4157432 3970376 4345167 4180161 4357396 4434932 4347578
$$ packed form
14542A3119273k745887l996956k827640j012162k85169q6562O55n9930L19588
14533B425210J96539J60110L89151L00476J405363J553291p03285j462200o69293
14524C595362l86466p4867p21905P3534q0621R6193q9464J12864N0983J9895M2296
14513B637804p5955P8371k15528N4881N7863k8014M51297j82605O6953L6484K8680
14502B910231r7878J49204M30546n43077K84391r0316k95148O98102k06531n17498
14492B722026M83714K06860l47394r2034N65873k00907K52389n1150r7550J05681
14482C547508j25121L13881o8366K2022k571K61279l05084O05157l62299k7283
14472C859123o9202N59945K78085m70519j87056L74791j65006J77235P7536q7354
$$ plain form
14462 4347578 4329408 4223540 4820960 4394669 5024218 4609311 4784260 4715728 5022159 4882855
14452 4882855 5250021 5020840 5494317 5438737 5256782 5390426 5751082 5873987 5621598 5753797
14442 5753797 5637384 5576876 5624878 5946975 6147390 6117603 6285621 6197703 6212413 6473075
14432 6473075 6422698 6664026 6930863 6811615 6874418 6971016 7160511 7197682 7138672 7636124
14422 7636124 7767450 7971449 7489838 7831735 7921747 8273388 8481669 8749386 8570883 8562164
14412 8562164 8573793 8816378 9355275 9228564 9395205 9422303 9540723 9944033 10112860 10170118
14402 10170118 9918524 10598281 10554873 10592654 10881432 11159001 11305041 11350777 11658699 11643678
14392 11643678 11944848 11976974 12420766 12487691 12815368 13076442 13372497 13523515 13835837 13871523
$$ packed form
14462D347578j8170j05868N97420m26291O29549m14907J74949o8532L06431j39304
14452D882855L67166k29181M73477n5580j81955J33644L60656J22905k52389J32199
14442E753797j16413o0508M8002L22097K00415k9787J68018q7918J4710K60662
14432F473075n0377K41328K66837j19248O2803R6598J89495L7171n9010M97452
14422G636124J31326K03999m81611L41897R0012L51641K08281K67717j78503q719
14412H562164J1629K42585N38897j26711J66641K7098J18420M03310J68827N7258
14402A0170118k51594O79757m3408L7781K88778K77569J46040M5736L07922j5021
14392A1643678L01170L2126M43792O6925L27677K61074K96055J51018L12322L5686
$$ plain form
14382 13871523 14182115 14240362 15267061 15329056 15425086 15816934 16160790 15989354 16526774 17092974
14372 17092974 17326555 17582006 17855269 18570816 18698631 19187934 19398985 19881886 20067725
14363 20067725 20955717 21285654 21799304 22177223 22514654 23277075 23585071 24306727 24881155
14354 24881155 25070172 26177946 26486746 27574735 28202119 28524243 29535374 30213078 31029458
14345 31029458 31611459 32266967 33391051 34201324 35120316 36003557 37233303 38196058 39073405
14336 39073405 40582254 41777779 42766358 43945560 45628426 46776889 48272017 49676498
14328 49676498 51313749 52860172 54763602 56591385 58504272 60805735 62445078 64713638
14320 64713638 67179923 69433554 71977864 74461281 77709309 80435325 83104672 86937263
$$ packed form
14382A3871523L10592N8247J026699O1995R6030L91848L43856j71436N37420N66200
14372A7092974K33581K55451K73263P15547J27815M89303K11051M82901J85839
14363B0067725Q87992L29937N13650L77919L37431P62421L07996P21656N74428
14354B4881155J89017J107774L08800J087989O27384L22124J011131O77704Q16380
14345C1029458N82001O55508J124084Q10273R18992Q83241J229746R62755Q77347
14336C9073405J508849J195525R88579J179202J682866J148463J495128J404481
14328D9676498J637251J546423J903430J827783J912887K301463J639343K268560
14320F4713638K466285K253631K544310K483417L248028K726016K669347L832591
$$ plain form
14312 86937263 89984865 93601440 97148551 101146673 105379353 109703391 114595200 119618874
14304 119618874 124667030 130453273 136165587 142255937 148922845 155856846 163269892 170710849
14296 170710849 179311894 188160802 196896341 206952815 216992344 227619653 239071041
14289 239071041 250995531 263243447 275906065 289568018 303354670 317363820 332094639
14282 332094639 346680929 361655259 376281179 390470804 404226188 416902650 427648610
14275 427648610 435108967 440152143 443768417 446558068 448082803 442257451 433249972 424663756
14267 424663756 420748679 417005305 417807006 416985004 407305822 394033522 379092422 363616465
14259 363616465 347658975 331586740 316010629 300816024 285636089 271487679 257582889
$$ packed form
14312H6937263L047602L616575L547111L998122M232680M324038M891809N023674
14304A19618874N048156N786243N712314O090350O666908O934001P413046P440957
14296A70710849Q601045Q848908Q735539J0056474J0039529J0627309J1451388
14289B39071041J1924490J2247916J2662618J3661953J3786652J4009150J4730819
14282C32094639J4586290J4974330J4625920J4189625J3755384J2676462J0745960
14275D27648610P460357N043176L616274K789651J524735n825352r007479q586216
14267D24663756l915077l743374Q01701q22002r679182j3272300j4941100j5475957
14259C63616465j5957490j6072235j5576111j5194605j5179935j4148410j3904790
$$ plain form
14252 257582889 244649913 231757916 219892064 208836885 197928753 188287057 178756333
14245 178756333 170081007 161976735 153982709 146422021 139537908 134289053 129581494 124231968
14237 124231968 118446322 113483400 108588014 103079225 98901023 94689739 91430750 87807904
14229 87807904 84111635 80836488 77722014 74874512 71872393 69270218 66894854 64520347
14221 64520347 62146707 60094416 58209005 56427461 54598497 52559553 51071127 49627335
14213 49627335 48176686 46771109 44913397 43916167 42395975 41420424 40399251 39466777
14205 39466777 37973742 37284777 35981169 34959150 34169859 33798921 32519697 31640287 30587194
14196 30587194 29819272 29364793 28652424 27844993 27250078 26632298 25687742 25216870 24612606
$$ packed form
14252B57582889j2932976j2891997j1865852j1055179j0908132r641696r530724
14245A78756333q675326q104272p994026p560688o884113n248855m707559n349526
14237A24231968n785646m962922m895386n508789m178202m211284l258989l622846
14229H7807904l696269l275147l114474k847502l002119k602175k375364k374507
14221F4520347k373640k052291j885411j781544j828964k038944j488426j443792
14213D9627335j450649j405577j857712r97230j520192r75551j021173r32474
14205C9466777j493035o88965j303608j022019p89291l70938j279224q79410j053093
14196C0587194p67922m54479p12369q07431n94915o17780r44556m70872o04264
$$ plain form
14187 24612606 23747237 23430224 22942017 22636506 22092087 21372149 21301281 20626849 19999769
14178 19999769 19887019 19424291 18936742 18647261 18267203 17935230 17381235 17295586 17007633
14169 17007633 16335305 16119021 16061351 15730672 15381822 14859462 14469389 14504715 14338575 14103190
14159 14103190 13691882 13739525 13274518 13052663 12864079 12380679 12499644 11921806 11703715
14150 11703715 12018891 11674339 11532028 11237625 11108830 10916503 10844245 10598425 10334683
14141 10334683 10340323 10031041 9947858 9852423 9845778 9337710 9634503 9154247 8912487 8984944
14131 8984944 8720403 8573018 8295278 8441341 8502380 8225992 8441886 8158039 7758641 7921908
14121 7921908 7760005 7545589 7595798 7601929 7409494 7294004 7048352 7311422 6828955 7099165
$$ packed form
14187B4612606q65369l17013m88207l05511n44419p19938p0868o74432o27080
14178A9999769j12750m62728m87549k89481l80058l31973n53995q5649k87953
14169A7007633o72328k16284n7670l30679l48850n22360l90073L5326j66140k35385
14159A4103190m11308M7643m65007k21855j88584m83400J18965n77838k18091
14150A1703715L15176l44552j42311k94403j28795j92327p2258k45820k63742
14141A0334683N640l09282q3183r5435o645n08068K96793m80256k41760P2457
14131H984944k64541j47385k77740J46063O1039k76388K15894k83847l99398J63267
14121G921908j61903k14416N0209O131j92435j15490k45652K63070m82467K70210
$$ plain form
14111 7099165 6688129 6844929 6620474 6374658 6688983 6360805 6322701 6212229 6272970 6147486
14101 6147486 6352090 5944647 5685214 6020934 5715238 5560631 5512204 5499697 5312444 5392907
14091 5392907 5598509 5477925 4920893 4958639 4942057 5064348 5031003 4771506 5041793 5112260
14081 5112260 4839996 4533652 4687058 5065933 4541150 4329100 4613088 4547421 4328338 4342968
14071 4342968 4152078 4462102 4212321 4408773 4320739 4101686 4077006 4137517 3910303 4135212
14061 4135212 3885104 3981146 3894265 3995130 3850881 3805058 3744404 3584680 3280553 3603798
14051 3603798 3825671 3438627 3497128 3586245 3384713 3507249 3264337 3363996 3147996 3078297
14041 3078297 3344206 3189329 3396844 3015421 3032031 3353028 3128941 3011839 2990125 3129904
$$ packed form
14111G099165m11036J56800k24455k45816L14325l28178l8104j10472O0741j25484
14101F147486K04604m07443k59433L35720l05696j54607m8427j2507j87253Q0463
14091E392907K05602j20584n57032L7746j6582J22291l3345k59497K70287P0467
14081E112260k72264l06344J53406L78875n24783k12050K83988o5667k19083J4630
14071D342968j90890L10024k49781J96452q8034k19053k4680O0511k27214K24909
14061D135212k50108R6042q6881J00865j44249m5823o0654j59724l04127L23245
14051C603798K21873l87044N8501Q9117k01532J22536k42912R9659k16000o9699
14041C078297K65909j54877K07515l81423J6610L20997k24087j17102k1714J39779
$$ plain form
14031 3129904 2895845 2901993 2954429 3293397 3329320 3297995 2886735 3132627 2888148 2849750
14021 2849750 2798921 2480023 2517677 2686760 2741602 2750860 2770323 2577631 2735861 2428736
14011 2428736 2542489 2584280 2161845 2431067 2642668 2420108 2185297 2215942 2173862 2082892
14001 2082892 2546275 2157519 2001566 2159404 2195374 2155420 2081739 2295767 2200357 2421485
13991 2421485 3023708 3888112 4676535 7964433 16087110 27358065 27576404 21555002 16002625
13982 16002625 13720185 9520023 6252456 4595606 3982121 3461471 3237474 3064662 2881662
13973 2881662 2595530 2535885 2552143 2297617 2169712 2382604 2304646 2140188 2250607 2276810
13963 2276810 2454805 2351635 2243728 2008845 1939670 1937694 2291711 1982934 1853148 1743057
$$ packed form
14031C129904k34059O148N2436L38968L5923l1325m11260K45892k44479l8398
14021B849750n0829l18898L7654J69083N4842R258J9463j92692J58230l07125
14011B428736J13753M1791m22435K69222K11601k22560k34811L0645m2080r0970
14001B082892M63383l88756j55953J57838L5970l9954p3681K14028r5410K21128
13991B421485O02223Q64404P88423L287898Q122677J1270955K18339o021402n552377
13982A6002625k282440m200162l267567j656850o13485n20650k23997j72812j83000
13973B881662k86132n9645J6258k54526j27905K12892p7958j64458J10419K6203
13963B276810J77995j03170j07907k34883o9175j976L54017l08777j29786j10091
$$ plain form
13953 1743057 1947023 1761169 1950502 1971995 1984880 2041153 1737391 1856405 1704625 1696478
13943 1696478 1866606 1858998 1972072 1885453 1893419 1879946 1750512 1682413 1533836 1598750 1716343
13932 1716343 1733807 1833441 1727636 1651323 1643035 1720057 1576126 1809005 1518496 1533449 1660005
13921 1660005 1225550 1453720 1418772 1540149 1504531 1606863 1637946 1934884 1552973 1489282
13911 1489282 1387959 1170140 1363863 1295826 1333870 1338586 1115257 1394944 1235996 1103446
13901 1103446 1443866 1577279 1336349 1051166 1349301 1284612 1176282 1283219 1455688 1269692
13891 1269692 1175872 1067917 1411916 1089931 1079806 1461489 1226327 1601722 1125147 1293436
13881 1293436 962693 1227436 1252355 1579824 781713 1003262 1183327 1131368 1071703 1221082
$$ packed form
13953A743057K03966j85854J89333K1493J2885N6273l03762J19014j51780q147
13943A696478J70128p608J13074q6619P966j3473j29434o8099j48577O4914J17593
13932A716343J7464R9634j05805p6313q288P7022j43931K32879k90509J4953J26556
13921A660005m34455K28170l4948J21377l5618J02332L1083K96938l81911o3691
13911A489282j01323k17819J93723o8037L8044M716k23329K79687j58948j32550
13901A103446L40420J33413k40930k85183K98135o4689j08330J06937J72469j85996
13891A269692r3820j07955L43999l21985j0125L81683k35162L75395m76575J68289
13881A293436l30743K64743K4919L27469G81713K21549J80065n1959n9665J49379
$$ plain form
13871 1221082 1170319 1448338 1322305 1229677 846642 1079398 1043251 1016620 1125103 1250639
13861 1250639 1251279 1217938 1341386 1178213 1034642 1163855 934906 929696 968674 1156209 1088786
13850 1088786 1114933 1117931 1104918 1050345 927461 1005990 988684 837620 794645 827435 827463 1096388
13838 1096388 904708 666069 1206757 1143744 1337491 1031564 1059667 520279 824809 928465
13828 928465 694243 659497 765230 822947 930941 707224 1016288 1161412 1045914 821679
13818 821679 798370 593272 809654 1004842 512987 848874 967732 1189091 794396 673205
13808 673205 1065611 844980 960938 582733 910873 544070 599330 911760 1007553 1066646
13798 1066646 642346 1014257 806475 979495 824588 721095 853046 803098 729471 807696
$$ packed form
13871A221082n0763K78019j26033r2628l83035K32756l6147k6631J08483J25536
13861A250639O40l3341J23448j63173j43571J29213k28949n210L8978J87535o7423
13850A088786K6147K998j3013n4573j22884P8529j7306j51064m2975L2790K8K68925
13838A096388j91680k38639N40688o3013J93747l05927K8103E20279L04530J03656
13828I28465k34222l4746J05733N7717J07994k23717L09064J45124j15498k24235
13818H21679k3309k05098K16382J95188m91855L35887J18858K21359l94695j21191
13808F73205L92406k20631J15958l78205L28140l66803N5260L12430R5793N9093
13798A066646m24300L71911k07782J73020j54907j03493J31951m9948p3627P8225
$$ plain form
13788 807696 611290 604541 756012 680719 763290 494895 967968 955982 596035 444566
13778 444566 778160 359130 791511 1004337 811711 558853 830547 867051 467515 743534
13768 743534 628943 680394 718149 403798 936101 642303 813971 530653 785083 552922
13758 552922 897983 596282 636059 433655 326717 602870 643800 916226 702949 547336
13748 547336 686481 536706 578642 794629 423194 580408 649568 618196 400939 851677
13738 851677 772420 743916 339635 650265 422514 569033 779272 466783 599588 397402
13728 397402 357538 818271 476977 731695 581189 484059 461557 457477 710343 711782 413454
13717 413454 611166 491773 301416 678343 818983 544944 880423 450009 678243 679754
$$ packed form
13788H07696j96406o749J51471p5293Q2571k68395M73073j1986l59947j51469
13778D44566L33594C59130M32381K12826j92626k52858K71694L6504l99536K76019
13768G43534j14591N1451L7755l14351N32303k93798J71668k83318K54430k32161
13758E52922L45061l01701L9777k02404j06938K76153M0930K72426k13277j55613
13748E47336J39145j49775M1936K15987l71435J57214O9160l1372k17257M50738
13738H51677p9257k8504C39635L10630k27751J46519K10239l12489J32805k02186
13728C97402l9864M60733l41294K54718j50506r7130k2502m080K52866J439k98328
13717D13454J97712j19393j90357L76927J40640k74039L35479m30414K28234J511
$$ plain form
13707 679754 717526 558547 225633 759170 504960 632247 540185 523475 522328 570412 535116
13696 535116 395358 579261 506126 140084 601962 640166 560739 599041 440326 489364
13686 489364 497690 253827 217626 454512 252115 880851 514097 727230 275533 411013
13676 411013 528671 613554 164826 179764 372146 443770 435972 648310 332273 132485
13665 283151 459148 241879 344666 133171 343429 232258 561036 636757 596933 403811
13655 403811 300560 654759 568547 586919 281828 373294 226869 483877 573543 466698
13645 466698 276626 616109 663262 329608 738671 336723 200784 425375 389950 243550
13635 243550 445855 476305 477161 229839 541118 396572 655311 242549 313923 339039 226544
$$ packed form
13707F79754L7772j58979B25633N33537k54210J27287r2062j6710j147M8084l5296
13696E35116j39758J83903p3135A40084M61878L8204p9427L8302j58715M9038
13686D89364Q326k43863l6201K36886k02397O28736l66754K13133B75533J35480
13676D11013J17658Q4883A64826J4938J92382P1624p798K12338l16037A32485
13665B83151J75997k17269J02787A33171K10258j11171L28778P5721l9824j93122
13655D03811j03251L54199q6212J8372B81828R1466j46425K57008Q9666j06845
13645D66698j90072L39483M7153C29608M09063C36723j35939K24591l5425j46400
13635B43550K02305L0450Q56B29839L11279j44546K58739B42549P1374K5116j12495
$$ plain form
13624 226544 427566 388073 603387 347665 593258 233334 -2458 409327 275637 752025
13614 752025 492943 418521 426783 503245 336670 401862 208262 566589 413360 537324
13604 537324 725291 238940 222089 264265 159046 -98780 62924 189473 509034 273439
13594 273439 450773 506083 315561 645310 82444 346291 301541 422268 439747 281382
13584 281382 332955 171278 -59090 103701 306151 362776 346899 328920 249409 382829 263784
13573 263784 251821 348178 372388 364388 199772 259576 332318 299576 569061 501273 236976
13561 397307 352896 219981 14433 148192 496094 68578 389239 422449 161534 226003
13551 226003 327572 375357 294135 150106 211782 329943 543997 501215 563728 149810
$$ packed form
13624B26544K01022l9493K15314k55722K45593B33334b458D09327j33690M76388
13614G52025k59082p4422Q262P6462j66575O5192j93600L58327j53229J23964
13604E37324J87967B38940j6851M2176j05219i8780F2924J26549L19561k35595
13594B73439J77334N5310j90522L29749H2444K63847m4750J20727J7479j58365
13584B81382N1573j61677e9090A03701K02450N6625j5877j7979p9511J33420j19045
13573B63784j1963R6357K4210q000j64616N9804P2742l2742K69485o7788B36976
13561C97307m4411j32915A4433J33759L47902F8578L20661L3210A61534O4469
13551B26003J01569M7785q1222j44029O1676J18161K14054m2782O2513A49810
$$ plain form
13540 305770 235281 -37829 381290 459503 671575 276077 412264 401355 491500 300560
13530 300560 258494 569862 326058 302175 446294 78268 113453 416741 4572 21200 258108
13519 258108 179463 168239 168875 95770 380681 78976 262875 309327 238036 86810 451805
13508 451805 257774 -100371 487702 480192 408594 -41218 349598 116609 317591 364597
13498 364597 118689 131217 -11082 323241 288648 127782 354382 220269 347287 186523
13488 186523 382795 395177 298728 366481 110758 362633 -51110 243690 273971 -132728
13477 336844 484351 98005 403098 230159 72997 150481 258948 168063 379608 255500
13467 255500 389193 297450 302353 288893 52721 465670 114865 425122 49900 298390 334523
$$ packed form
13540C05770p0489c7829C81290P8213K12072B76077J36187j0909R0145j90940
13530C00560m2066L11368k43804k3883J44119G8268L5185L03288D572J6628K36908
13519B58108p8645j1224O36p3105K84911G8976J83899M6452p1291H6810L64995
13508D51805j94031a00371D87702p510p1598d1218C49598A16609K00982M7006
13498C64597A18689J2528a1082C23241l4593A27782K26600j34113J27018j60764
13488A86523J96272J2382r6449O7753A10758K51875e1110B43690L0281a32728
13477C36844J47507I8005L05093j72939G2997P7484J08467r0885K11545j24108
13467B55500J33693r1743M903j3460E2721M12949A14865L10257D9900K48490L6133
$$ plain form
13456 334523 150767 -12963 159818 196919 116925 142231 166247 12644 304339 284991 220473
13445 220473 313874 -78875 658614 428689 239104 469724 273720 199217 442249 50918
13434 410954 397030 -282948 182214 -46780 365928 -52825 592845 158669 167442 238675 241037
13423 241037 136221 140054 -5675 77416 193929 260633 418028 206280 208780 38844 171145
13412 171145 409351 530959 203648 492408 368492 -1467 574942 -27624 -8014 223456
13401 441300 356875 250450 72108 153930 -165983 -93580 132397 -9214 389481 206031 197238
13390 197238 152941 189952 231774 12054 181196 -189998 176581 209828 254542 -4096 -8302
13379 -8302 68509 117458 -29747 -178754 199439 618567 149060 -107067 226238 52541 248674
$$ packed form
13456C34523A50767a2963A59818L7101p9994K5306K4016A2644K91695j9348o4518
13445B20473R3401g8875F58614k29925j89585K30620j96004p4503K43032E0918
13434D10954j3924b82948A82214d6780C65928e2825E92845A58669Q773P1233K362
13423B41037j04816L833e675G7416J16513O6704J57395B06280K500C8844J32301
13412A71145K38206J21608B03648K88760j23916a467E74942b7624h014B23456
13401D41300q4425j06425G2108Q1822a65983P2403A32397i214C89481j83450q793
13390A97238m4297L7011M1822A2054J69142a89998A76581L3247M4714d096m206
13379h302F8509M8949b9747j49007A99439M19128A49060a07067B26238E2541J96133
$$ plain form
13368 248674 96219 103821 252830 641932 301889 277893 199930 314173 222146 46889 245050
13357 245050 168905 69394 371307 69208 332754 4897 220654 -3760 -32679 53255 123498
13346 123498 502129 52871 531869 195759 114734 490961 209104 222445 235179 436655
13336 436655 216498 434532 251554 308604 -65915 58796 468327 334616 -96987 25975
13325 95118 346575 533808 210409 411812 89276 204669 87626 430696 257950 116390
13314 135059 216741 39889 68177 521538 114817 -252090 -26113 329873 70825 320791
13304 320791 -123107 -45190 -90597 51522 96513 375611 249540 243027 209840 105505 181533
13293 181533 110517 260726 129377 209136 152583 545897 207423 244978 -90151 71854 -29630
$$ packed form
13368B48674I6219P602J49009L89102C01889k3996p7963J14243r2027D6889J98161
13357B45050p6145F9394L01913F9208K63546D897K15757c760k8919E3255P0243
13346A23498L78631E2871M78998A95759q1025L76227B09104J3341J2734K01476
13336D36655B16498K18034j82978N7050f5915E8796M09531j33711i6987B5975
13325I5118K51457J87233B10409K01403H9276J15393H7626L43070j72746A16390
13314A35059Q1682C9889K8288M53361A14817b52090b6113C29873G0825K49966
13304C20791a23107d5190m5407E1522M4991K79098j26071o513l3187j04335P6028
13293A81533p1016J50209A29377P9759n6553L93314B07423L7555i0151G1854b9630
$$ plain form
13281 475809 86402 77059 78308 205854 94750 164714 86910 35500 25541 293960 143985
13269 216297 -172066 28300 246293 -211722 141943 155012 153917 42247 -94879 188122 111553
13258 111553 795930 230155 -14957 298191 147630 281443 17186 -162323 -19851 284034
13247 249537 38511 25978 265274 -58623 -108416 126560 -167602 -76892 200524 389030
13237 389030 88383 -188855 -19983 121801 -108319 192976 180362 492116 91561 -111393
13226 76634 -75194 -30405 -78829 198421 -16237 77353 -116582 194271 -21124 -4427 252098
13214 97641 44201 70970 -167231 120517 257750 377879 130552 -57265 340945 57860
13203 136085 279457 46045 421615 109915 -38196 -192627 36412 -10865 -81272 192196
$$ packed form
13281D75809H6402r343J249J27546I4750O9964p7804C5500r959K68419A43985
13269B16297a72066B8300K17993b11722A41943J3069j095D2247i4879A88122p6569
13258A11553O84377B30155a4957B98191A47630J33813A7186a62323a9851B84034
13247B49537C8511j2533K39296e8623m9793A26560a67602g6892B00524J88506
13237C89030H8383a88855a9983A21801a08319A92976j2614L11754I1561a11393
13226G6634g5194c0405m8424A98421a6237G7353a16582A94271b1124d427B52098
13214I7641D4201K6769a67231A20517J37233J20129A30552e7265C40945E7860
13203A36085J43372D6045L75570A09915c8196j54431C6412a0865p0407A92196
$$ plain form
13192 153642 201877 -3698 380656 52211 445633 199185 -84636 190559 30476 108606 173866
13181 173866 -108680 248707 99836 -142139 -155774 230502 218512 -114930 244577 285430
13171 285430 274219 260019 295923 369825 50413 166009 175931 66757 302468 -10548 50209
13159 -63907 321097 298222 -22902 -66213 -12807 -181953 -69689 52795 69634 44112 -101944
13147 -20853 -129165 137546 -150619 113578 -56725 126798 15923 182770 376735 117537
13136 -33604 26935 280852 19862 -159066 125621 122803 108088 16875 -420417 23435 158957
13125 158957 -44344 208806 27606 -66833 -51115 23902 -153796 -22523 139791 45037 159376
13114 159376 195537 356117 191129 -246237 24001 -135953 -67231 21337 -215102 48847
$$ packed form
13192A53642M8235c698C80656E2211L93422A99185h4636A90559C0476P8130O5260
13181A73866a08680B48707I9836a42139j3635B30502j1990a14930B44577M0853
13171B85430j1211j4200L5904P3902E0413J15596R922F6757K35711a0548E0209
13159f3907C21097k2875b2902m3311a2807j69146f9689E2795J6839k5522a01944
13147b0853j08312A37546a50619A13578e6725A26798A5923J66847J93965A17537
13136c3604B6935K53917A9862a59066A25621k818j4715A6875d20417B3435J35522
13125A58957d4344B08806B7606f6833J5718B3902a53796b2523A39791D5037J14339
13114A59376L6161J60580j64988b46237B4001a35953f7231B1337b15102D8847
$$ plain form
13103 54061 -16006 -183279 292300 83929 257862 -33569 34702 298720 -158209 -19343 -70440
13092 -70440 6195 9735 188184 15783 68717 11511 80348 -28484 299524 37930 86349 466652
13080 466652 -58554 162265 140974 101009 117966 -274727 -48009 355945 243094 60473 146263
13069 146263 161144 246828 -134606 226359 187096 256179 -65810 -13060 220304 -385425 167052
13057 139229 146266 10740 247633 407289 13769 475017 33801 131168 -67503 261452 186742
13046 186742 -30697 -22322 -132683 -33363 11297 55872 -184249 -163294 21595 -321881 107703
13034 -367165 157928 137570 152789 124720 288729 416006 -29260 220564 -98739 307073
13023 -13035 60579 182280 -77413 -7395 349208 -66587 -141998 134420 228972 209565 -150343
$$ packed form
13103E4061a6006j67273B92300H3929J73933c3569C4702K64018a58209a9343n1097
13092g0440F195L540J78449A5783N2934A1511O8837b8484B99524C7930M8419L80303
13080D66652e8554A62265k1291l9965J6957b74727d8009C55945j12851F0473Q5790
13069A46263J4881Q5684a34606B26359l9263O9083f5810a3060B20304c85425A67052
13057A39229P037A0740K36893J59656A3769M61248C3801R7367f7503B61452p4710
13046A86742c0697Q375j10361c3363A1297M4575a84249K0955B1595c21881A07703
13034c67165A57928k0358J5219k8069J64009J27277b9260B20564i8739C07073
13023a3035F0579J21701g7413g395C49208f6587p5411A34420R4552j9407a50343
$$ plain form
13011 -186581 345474 -15479 176483 -8428 58236 75789 -91860 261851 147374 -182890 82123
12999 -108178 12641 -58480 163242 -111859 -128552 164167 -33304 241571 -39334 -64218 -431179
12988 -431179 -109428 183639 76368 129112 -44112 35222 -55004 183287 -171737 211365
12977 63535 -104511 134976 -153680 174225 -54374 -67581 -162406 111107 -259571 120489
12966 94339 148718 136903 -32812 269198 -182902 244404 -68446 -210021 37898 314221 127848
12954 127796 -50941 7188 -87213 -392745 -99728 218490 157228 -1738 -325942 -169946 29320
12942 92490 207533 58483 231483 110557 -181424 84862 -117477 -214672 89038 -66716 18465
12930 147184 227216 -33859 -146573 119719 186667 -140658 41977 -116230 -281222 206940
$$ packed form
13011a86581C45474a5479A76483h428E8236J7553i1860B61851j14477a82890H2123
12999a08178A2641e8480A63242a11859j6693A64167c3304B41571c9334k4884l66961
12988d31179a09428A83639G6368N2744d4112C5222e5004A83287a71737B11365
12977F3535a04511A34976a53680A74225e4374j3207r4825A11107b59571A20489
12966I4339N4379j1815c2812B69198a82902B44404f8446j41575C7898K76323A27848
12954A27796e0941G188h7213l05532i9728B18490o1262a738l24204J55996B9320
12942I2490J15043E8483J73000A10557a81424H4862a17477r7195H9038f6716A8465
12930A47184Q0032c3859j12714A19719O6948a40658D1977a16230j64992B06940
$$ plain form
12919 206557 -20610 -145298 7357 -327758 153334 211762 173292 216925 222979 -72340 328026
12907 109889 -124324 88377 -139729 54545 3776 -138885 67610 -22877 166353 -215663 111580
12895 205247 -245657 58059 -129847 -83263 59466 -63497 -200589 294467 4727 -3501 20767
12883 -12896 213982 172969 26125 -67558 74477 14457 -109813 333792 -53331 -389173 215366
12871 237295 1542 -225514 70260 -62682 196822 -45915 -109255 -234512 649 -111576 18679
12859 -190829 19197 -155 198633 155714 -47609 8248 -218456 -15051 -37091 -19473 -56128 184942
12846 87168 -37470 -76538 -60079 411146 285849 61458 81645 81146 273343 -43676 276777
12834 -153250 107708 -42908 197265 -78701 -116522 -37427 173417 -51460 -19997 56450 343497
$$ packed form
12919B06557b0610j24688G357c27758A53334N8428l8470M3633O054g2340C28026
12907A09889a24324H8377a39729E4545C776a38885F7610b2877A66353b15663A11580
12895B05247b45657E8059a29847M6584E9466f3497j37092B94467D727c501B0767
12883a2896B13982m1013B6125f7558G4477A4457a09813C33792e3331l35842B15366
12871B37295A542b25514G0260f2682A96822d5915o3340j25257F49a11576A8679
12859a90829A9197a55A98633m2919d7609H248b18456a5051k2040J7618l6655A84942
12846H7168c7470l9068J6459D11146j25297F1458K0187m99J92197d3676B76777
12834a53250A07708d2908A97265g8701l7821c7427A73417e1460a9997E6450K87047
$$ plain form
12823 343497 -380302 51698 -113244 48693 192263 -250629 -54157 150354 -214636 -155851
12813 -155851 121461 -310078 61997 -200416 60309 -40979 -39278 -24072 191098 53116 173424
12802 173424 135260 64567 -47845 -98874 454940 34609 -36600 -34265 -381258 -1147 -116650
12791 -116650 158214 104230 -143265 307737 81373 90329 96200 21997 -48699 -31979 -87710
12780 -87710 291557 -93725 -20508 112837 -29626 193407 21742 104434 146076 -16083 314982
12768 -158826 -19276 39320 -346666 145666 -14751 -188123 -24887 -18437 -212456 -34935 -168111
12757 -168111 -18809 98961 -80633 -159599 -244735 122528 -30230 -113223 -44931 10404 -291189
12745 -175556 -117480 778 -129137 121720 -227497 160317 13386 169321 23655 8756 -194750
$$ packed form
12823C43497c80302E1698a13244D8693J43570b50629e4157A50354b14636N8785
12813a55851A21461c10078F1997b00416F0309d0979J701J5206A91098E3116J20308
12802A73424l8164F4567d7845n1029D54940C4609c6600K335l46993a147j15503
12791a16650A58214n3984a43265C07737H1373Q956N871B1997d8699J6720n5731
12780h7710B91557i3725b0508A12837b9626A93407B1742Q2692M1642a6083C14982
12768a58826a9276C9320c46666A45666a4751j73372b4887O450j94019c4935j33176
12757a68111a8809I8961h0633p8966q5136A22528c0230q2993d4931A0404b91189
12745a75556N8076G78a29137A21720b27497A60317A3386J55935B3655H756a94750
$$ plain form
12733 -38887 95537 31030 116359 153585 -68200 -308806 285177 -95822 397380 -171920 144447
12721 185494 338854 -153642 47480 211534 152264 -293022 -48442 74680 -79347 7714 -67352
12709 -181915 109330 -147411 34407 -7065 134230 -71361 1601 95602 -105361 -92581 120463
12697 -163996 61103 -67989 348384 265406 57254 66482 -74963 -82618 214408 -187912 -100472
12686 -100472 110106 154761 112274 -37052 -39216 -36149 110757 305229 149281 -109509 -101483
12675 -101483 154532 89722 48790 128835 -172937 26800 -46229 107076 1824 -48608 -59414
12664 -59414 -250636 49906 -85097 188908 -50803 156465 -11953 326813 -71389 -4722 -173182
12653 -173182 159203 229469 304751 180833 -112192 -93920 159104 48267 184497 255459
$$ packed form
12733c8887I5537C1030Q5329L7226f8200k40606B85177i5822C97380a71920A44447
12721A85494J53360a53642D7480J64054n9270b93022d8442G4680g9347G714f7352
12709a81915A09330a47411C4407g065A34230g1361A601R4001a05361J2780A20463
12697a63996F1103f7989C48384q2978E7254R228g4963p655B14408a87912Q7440
12686a00472A10106M4655m2487c7052k164L067A10757J94472A49281a09509Q026
12675a01483A54532o4810m0932Q0045a72937B6800d6229A07076A824d8608j0806
12664e9414j91222D9906h5097A88908e0803A56465a1953C26813g1389d722j68460
12653a73182A59203P0266P5282j23918a12192J8272A59104D8267J36230P0962
$$ plain form
12643 255459 -193951 53541 -321317 489103 -94217 369072 -171557 298154 -375585 191208
12632 14740 193866 289315 233605 114162 439567 43293 320541 359107 287184 538123 -27116
12620 -114138 -86559 278843 191043 -20458 196434 -252378 210259 230912 -114101 79139
12609 -362551 230937 -12673 358334 21483 145113 45340 -337690 98535 158888 80540 21312
12597 360027 23433 239313 -248194 80015 65680 26562 -13973 184934 -103948 59327 21229
12585 -46206 -184300 75519 -39879 -198277 76207 -93563 -146102 -191037 6318 -265618 -55375
12573 109384 239833 -165186 397939 43222 53724 -74313 -88292 331203 33945 -60056 -10063
12561 80688 40247 120306 336215 -61164 228720 -140411 83748 -241726 -4124 -94259 1512
$$ packed form
12643B55459a93951E3541c21317D89103i4217C69072a71557B98154c75585A91208
12632A4740J79126R5449n5710A14162L25405D3293K77248L8566p1923K50939b7116
12620a14138K7579B78843q7800b0458A96434b52378B10259K0653a14101G9139
12609c62551B30937a2673C58334B1483J23630D5340c37690I8535O0353p8348B1312
12597C60027B3433K15880b48194H0015j4335B6562a3973A84934a03948E9327B1229
12585d6206j38094G5519c9879j58398G6207i3563n2539m4935F318b65618e5375
12573A09384J30449a65186C97939D3222J0502g4313j3979C31203C3945f0056a0063
12561H0688D0247Q0059K15909f1164B28720a40411H3748b41726d124r0135A512
$$ plain form
12549 -264455 -146353 -26446 148074 73244 -147794 -230202 7834 -103568 -121674 71474 59128
12538 59128 170766 -13350 181048 -46961 286777 371581 4695 254718 247397 206734 334026
12527 334026 432067 -129619 58173 17332 -300655 11211 -254385 379886 -6297 67781 -24397
12515 93419 8782 -103904 -16289 134255 -135180 -188796 107479 94272 133048 285173 29250
12503 158155 -50047 298922 183354 189999 236281 123241 55783 -182896 23895 -188497 194034
12491 -275021 185916 -46399 26939 164055 96322 38152 2683 146869 247946 98531 108911
12480 108911 15466 136368 28283 -43089 234965 59414 116566 -108906 27895 225659 144829
12469 144829 254105 -135245 182816 -6095 235755 -69031 243585 -38913 50328 -13093 138550
$$ packed form
12549b64455J18102b6446A48074G3244a47794q2408G834a03568j8106G1474j2346
12538E9128J11638a3350A81048d6961B86777Q4804D695K50023p321m0663J27292
12527C34026R8041a29619E8173A7332c00655A1211b54385C79886f297F7781b4397
12515I3419H782a03904a6289A34255a35180n3616A07479j3207L8776J52125B9250
12503A58155e0047B98922j15568O645M6282j13040E5783a82896B3895a88497A94034
12491b75021A85916d6399B6939J37116o7733C8152B683J44186J01077I8531J0380
12480A08911A5466J20902B8283d3089B34965E9414N7152a08906B7895J97764q0830
12469A44829J09276a35245A82816f095B35755f9031B43585c8913E0328a3093A38550
$$ plain form
12457 110991 -278913 188433 -35863 42811 -323207 167231 -3710 -121157 -72583 335330
12446 -166529 234052 27704 -86121 -154562 185466 44402 192009 -136546 268283 2047 -82713
12434 -121840 -112301 131289 249926 274536 53405 -236808 19853 65147 -119749 328919 14508
12422 242701 127834 -69691 78776 282313 -173397 6539 57513 235274 -118738 -33885 -162053
12411 -162053 36315 -184710 29126 385129 395785 70244 27206 123243 -35203 93524 -213225
12399 11773 53916 93933 -184208 191409 9612 -23556 19620 77439 -294443 156083 263879
12388 263879 -100348 -50484 235258 69806 159088 47088 215286 126982 -10022 86756 -232988
12376 208596 217357 115133 -20510 67179 -95070 3858 37671 321947 -120099 -169019 339090
$$ packed form
12457A10991b78913A88433c5863D2811c23207A67231c710j17447M8574C35330
12446a66529B34052B7704h6121o8441A85466D4402J47607a36546B68283B047h2713
12434a21840R539A31289J18637K4610E3405b36808A9853M5294a19749C28919A4508
12422B42701j14867f9691G8776K03537a73397F539N0974J77761a18738c3885j28168
12411a62053C6315a84710B9126L56003J0656G0244B7206R6037c5203I3524b13225
12399A1773M2143M0017a84208A91409I612b3556A9620N7819b94443A56083J07796
12388B63879a00348M9864B35258F9806Q9282D7088J68198q8304a0022H6756b32988
12376B08596Q761j02224b0510F7179i5070C858L3813K84276a20099m8920C39090
$$ plain form
12364 16100 145549 69531 -209621 167256 418115 17945 6118 -120446 230500 34363 -59943
12352 58252 -87765 187410 23714 -184452 277364 46350 337165 23276 88174 123895 154459
12341 154459 -80086 -241578 271327 13992 194296 -7191 145241 -189174 -73056 -394514
12331 -394514 211599 211974 93582 18211 219305 211024 193221 478135 64234 25503 -69895
12319 273524 161615 717516 441349 397109 -84299 58200 289572 114488 -57219 128958
12308 258460 27763 77680 12333 -11950 -95655 278978 127168 210694 -20945 -49490 260053
12296 15177 -64725 63851 -17708 -28762 224957 -3540 461416 97151 -100173 -5756 53360
12284 -203004 107783 15457 243219 -127687 163670 90976 235961 86743 -103882 97099
$$ packed form
12364A6100J29449F9531b09621A67256K50859A7945F118a20446B30500C4363e9943
12352E8252h7765A87410B3714a84452B77364D6350K90815B3276O4898L5721L0564
12341A54459h0086j61492B71327A3992J80304g191A45241a89174g3056l21458
12331c94514B11599L75I3582A8211K01094q281j7803K84914F4234B5503f9895
12319B73524j11909N55901k76167m4240h4299E8200K31372A14488e7219A28958
12308B58460B7763M9917A2333a1950q3705B78978A27168Q3526b0945k8545B60053
12296A5177f4725F3851a7708j1054B24957c540D61416I7151a00173e756E3360
12284b03004A07783A5457K27762a27687A63670p2694J44985H6743a03882I7099
$$ plain form
12273 252363 -251461 64133 233639 38214 151354 86454 33514 37230 21345 -141422 83153
12261 -70919 20824 -28767 -156522 27620 -50985 28934 32281 -170101 -35951 113952 193175
12250 193175 10974 96361 91673 -3820 103700 252875 11864 -285 -164428 251225 -130131
12238 101997 193042 250004 -178118 219626 245871 246250 309963 47301 -83531 13072 -76560
12226 131914 41659 193769 318812 347453 -90086 509077 4650 274145 99428 468076 203881
12214 265201 317426 119230 295839 322495 179860 199104 159747 358908 88899 -39073 180812
12202 514786 313032 617020 350042 -64616 232434 268734 43466 322346 251230 276719
12192 276719 112550 345261 250422 19158 556216 453505 70323 151469 463723 2038 281160
$$ packed form
12273B52363b51461F4133J69506C8214J13140o4900C3514L716j5885a41422H3153
12261g0919B0824b8767j27755B7620e0985B8934L347a70101c5951A13952P9223
12250A93175A0974Q5387m688c820A03700J49175A1864b85j64143B51225a30131
12238A01997R1045N6962a78118B19626K6245L79O3713D7301h3531A3072g6560
12226A31914D1659J52110J25043K8641i0086E09077D650K69495I9428L68648B03881
12214B65201N2225A19230J76609K6656j42635J9244l9357J99161H8899c9073A80812
12202E14786k01754L03988k66978f4616B32434L6300D3466K78880p1116K5489
12192B76719A12550K32711r4839A9158N37058j02711G0323Q1146L12254B038K79122
$$ plain form
12181 281160 342509 145303 125076 227527 244803 480096 -61965 192319 221338 -20529 206208
12169 342829 161751 302503 -60813 363315 157153 -172253 141135 187661 143829 163704
12159 163704 152221 -4387 113927 168715 165603 -132397 99187 -170652 -75016 370032 82822
12147 214655 -100097 196574 213425 27123 135294 -69609 54206 209162 172270 151501 131552
12136 131552 171371 417591 110252 158825 128511 391962 65902 529929 66910 224488
12126 224488 -139371 288946 328570 159772 396286 136569 105399 -146587 60678 348 -7546
12114 179987 483262 -25881 165932 13549 202387 229242 -80998 161425 -21763 -187516
12104 -187516 298274 220512 323919 103223 29905 249900 187234 195449 311822 64776 477068
$$ packed form
12181B81160O1349A45303k0227J02451J7276K35293f1965A92319K9019b0529B06208
12169C42829A61751J40752f0813C63315A57153a72253A41135M6526m3832J9875
12159A63704j1483d387A13927N4788l112a32397I9187a70652g5016C70032H2822
12147B14655a00097A96574J6851B7123J08171f9609E4206J54956l6892k0769j9949
12136A31552L9819K46220A10252M8573l0314K63451F5902M64027F6910J57578
12126B24488a39371B88946L9624A59772K36514A36569l1170a46587F0678C48g546
12114A79987L03275b5881A65932A3549J88838K6855h0998A61425b1763j65753
12104a87516B98274p7762J03407A03223B9905K19995o2666Q215J16373F4776M12292
$$ plain form
12093 477068 103207 278776 250356 212341 144388 -77722 -55196 278452 116221 -39219 126125
12081 6507 209830 201796 195226 81965 264384 -107609 25666 161130 178472 -235508 198982
12069 -202959 99610 -88105 22037 -79256 239781 -81347 -85538 -233383 -176892 15734 -131823
12057 -9610 -224799 478274 99811 -554016 494312 46644 -320467 344460 -85689 -317 -78068
12046 -78068 134669 -130971 -190328 100710 39622 -140819 208936 86403 -130965 363159
12035 -37473 61869 103895 -248486 -115172 -58019 -356324 128735 -212483 -139822 268423
12024 -19492 250855 152564 112354 39953 216100 -94205 137072 -276230 -134748 104973
12013 199819 53474 -30485 -173298 -110584 -180537 -36551 -2031 -176292 -171705 33875 305573
$$ packed form
12093D77068A03207J75569k8420l8015o7953g7722K2526B78452A16221c9219A26125
12081F507K03323q034o570H1965J82419a07609B5666J35464J7342b35508A98982
12069b02959I9610h8105B2037g9256B39781h1347m191j47845N6491A5734a31823
12057i610k15189D78274I9811e54016D94312D6644c20467C44460h5689c17p7751
12046g8068A34669a30971n9357A00710C9622a40819B08936H6403a30965C63159
12035c7473F1869M2026b48486a15172N7153k98305A28735b12483P2661B68423
12024a9492B50855r8291m0210C9953J76147i4205A37072b76230a34748A04973
12013A99819E3474c0485j42813O2714o9953c6551b031j74261M587C3875K71698
$$ plain form
12002 305573 212730 -23145 354061 55699 -163213 -157988 -217590 -177450 -10034 291870 -5378
11990 -118419 -13713 -16394 -49183 -196654 -109191 62167 333334 -342059 195677 4200 88936
11979 88936 47826 99139 56014 -207960 -216100 38992 -173600 169478 68393 113504 123890
11968 123890 -123200 -162934 152943 -203736 -295714 -451803 -261816 -239569 -51582 -95272
11958 -95272 -204696 22254 -144288 -68328 -92822 36871 71386 54697 107117 -208622 -354104
11947 -354104 -76695 23909 -294930 -52904 -104340 -2224 -52700 -49256 -41899 -482367 -112459
11935 -19634 46607 127681 121926 110376 -48199 -287432 260646 -325884 -334884 -41427 -348163
11924 -348163 58631 -425931 -41591 -119401 -55758 -453802 125 269037 25398 91344 -103399
$$ packed form
12002C05573r2843b3145C54061E5699a63213N225n9602M0140a0034B91870e378
11990a18419a3713k681l2789j47471Q7463F2167K71167c42059A95677D200Q4736
11979H8936m1110N1313m3125b07960q140C8992a73600A69478F8393M5111J0386
11968A23890a23200l9734A52943b03736r1978j56089J89987K2247e1582m3690
11958i5272j09424B2254a44288f8328k4494C6871L4515j6689N2420b08622j45482
11947c54104g6695B3909b94930e2904n1436b224n0476L444P357m40468a12459
11935a9634D6607Q1074n755j1550d8199k39233B60646c25884r000d1427l06736
11924c48163E8631d25931d1591p7810e5758l98044A25K68912B5398O5946a03399
$$ plain form
11912 -147155 86149 -15339 125902 -168145 222160 -113525 -162514 220900 -85581 -7987 -50146
11901 -50146 -166582 -359402 -141017 36008 -68044 145040 60968 -38446 57568 -201211 -109199
11890 -109199 -130673 -243299 221874 27576 -59986 -264539 -87820 47067 182679 140406 -50651
11878 98975 58181 -71563 11348 -91968 60569 78456 304942 -219901 -428649 -179907 -103151
11867 -103151 99768 -11190 -184901 300705 -39147 -120715 33018 -256382 23509 -113702 -38170
11855 -158699 -263225 367284 71409 -136625 -41523 -122416 -296175 -243657 -177413 -523390
11845 -523390 -128482 73594 341803 3142 -227493 -83701 -114638 182775 -625939 367366
11834 -83421 313200 198990 275645 -443164 -156761 -274893 -509993 -97921 -260629 1661
$$ packed form
11912a47155H6149a5339A25902a68145B22160a13525m8989B20900h5581g987m2159
11901e0146j16436j92820a41017C6008f8044A45040F0968c8446E7568b01211R2012
11890a09199k1474j12626B21874B7576e9986k04553h7820D7067J35612m2273e0651
11878I8975m0794g1563A1348i1968F0569J7887K26486b19901k08748a79907P6756
11867a03151I9768a1190j73711C00705c9147q1568C3018b56382B3509a13702c8170
11855a58699j04526C67284G1409a36625d1523q0893j73759N2518O6244l45977
11845e23390a28482G3594K68209C142b27493h3701l0937A82775f25939C67366
11834h3421C13200j14210P6655d43164a56761j18132k35100i7921j62708A661
$$ plain form
11823 13579 -161943 -107067 -169189 -234728 -29399 167213 22104 183023 172767 -79897 -109368
11812 -109368 -67026 -138489 -122394 -240235 69646 -29433 17154 365823 -172959 -25670 45672
11800 -3220 47154 -93433 183041 -9984 67929 43727 -63364 -168491 -139273 -110313 83179 -78931
11787 -138427 -47029 112139 52979 109774 -189982 -311653 -58348 24756 -173820 -400608
11777 -400608 -152527 2615 -27524 55249 11256 -108068 112583 141696 -36278 -176423 171086
11765 82626 -239637 -284997 12153 -11529 -50141 -232099 -253775 -423835 -126130 143266 -114232
11753 181832 -105030 206888 -34330 176749 -231016 51427 18879 -170333 -128168 191303
11742 2003 8726 -371423 -197817 78432 -82882 -145980 4508 -105713 -132799 92222 35002 -139155
$$ packed form
11823A3579a61943N4876o2122o5539b9399A67213B2104J60919j0256g9897k9471
11812a09368M2342p1463J6095j17841F9646b9433A7154L48669a72959b5670D5672
11800c220D7154i3433A83041i984F7929k4202f3364j05127K9218K8960H3179g8931
11787a38427d7029A12139E2979N6795a89982j21671e8348B4756a73820k26788
11777d00608a52527B615b7524E5249A1256a08068A12583K9113c6278j40145A71086
11765H2626b39637m5360A2153a1529l8612j81958k1676j70060a26130A43266a14232
11753A81832a05030B06888c4330A76749b31016E1427A8879a70333M2165A91303
11742B003O723c71423J73606G8432h2882o3098D508a05713k7086I2222C5002a39155
$$ plain form
11729 -290415 184949 -203344 230534 -122857 -210856 -74562 209662 24749 -86800 -224588
11719 -224588 416344 -40367 162656 -245550 39331 5552 56025 -31714 2040 80154 17537
11707 -148450 -213590 41919 -319550 7354 210375 426634 -13302 231992 -288519 110749
11696 89090 -463545 -97703 -150376 293582 307817 -1209 -10510 191286 75948 34474 58091
11685 58091 335140 84012 -110349 200285 -231719 13694 287809 -126868 5856 -144027
11674 214768 -18925 317293 -294517 -254578 105148 -76943 65998 90803 17691 -97876 -1511
11662 -55121 -76617 32912 -49136 -6282 110927 52170 -140075 120843 -282892 -109095 -158729
11651 -158729 146964 -5910 -142779 -241883 -392958 -10352 -130301 -231107 -110359 -17213
$$ packed form
11729b90415A84949b03344B30534a22857q7999g4562B09662B4749h6800j37788
11719b24588D16344d0367A62656b45550C9331E552N0473c1714B040P8114A7537
11707a48450o5140D1919c19550G354K03021K16259a3302B31992b88519A10749
11696H9090d63545i7703n2673B93582J4235a209r301A91286G5948C4474K3617
11685E8091K77049H4012a10349B00285b31719A3694K74115a26868E856a44027
11674B14768a8925C17293b94517L9939A05148g6943F5998K4805A7691i7876a511
11662e5121k1496C2912d9136f282A10927E2170a40075A20843b82892a09095m9634
11651a58729A46964e910j36869r9104j51075a0352j19949j00806a10359a7213
$$ plain form
11640 -78438 -120478 6625 110979 -11665 17761 -75916 -12217 97172 6803 194071 -372732
11628 -97501 243755 1464 -166307 182996 -52409 143905 -296553 -296042 219215 113212 -57225
11616 12261 10439 158949 -264563 27587 127339 -88253 127427 -113183 -333812 189355 86498
11604 -181824 23568 -209879 -74619 -105954 150353 161437 120633 19983 -385530 -219029 -73189
11592 40742 53637 63557 -120834 -284859 -168083 337035 128578 108539 114739 -106755 -207842
11581 -207842 -51461 -154307 380891 88283 138242 -348844 -7973 81186 -110476 -423352 -415790
11570 -415790 -206533 -144048 -188239 295528 266455 -112835 -55036 -27540 -95923 23829 -145383
11558 -5166 -26495 -208161 -159162 -92437 51518 -56639 86148 -332407 -118328 -32571 76581
$$ packed form
11640g8438m2040F625J04354a1665A7761g5916a2217I7172F803J87268c72732
11628i7501B43755A464a66307A82996e2409A43905b96553N11B19215j06003e7225
11616A2261j822J48510b64563B7587R9752h8253A27427a13183k20629A89355H6498
11604a81824B3568b09879g4619l1335A50353J1084m0804A9983c85530J66501g3189
11592D0742J2895R920a20834j64025J16776C37035A28578k0039O200a06755j01087
11581b07842e1461j02846C80891H8283M9959c48844g973H1186a10476l12876P562
11570d15790b06533O2485m4191B95528k9073a12835e5036K7496o8383B3829a45383
11558e166k1329j81666M8999O6725E1518e6639H6148c32407a18328c2571G6581
$$ plain form
11546 -68412 14608 114105 -155264 -65245 86132 -57304 -329221 206942 56448 -128450 10375
11534 -123853 26150 219628 241134 67821 11173 -99563 123524 205355 129160 47593 21807
11522 171513 -259042 -46486 346240 335556 141913 56957 363619 -30061 86261 53944 57165
11511 57165 196040 95855 174974 199779 52453 196714 369056 -116844 -53194 77622 -218045
11499 62774 262 80985 167202 220837 150398 152226 466048 11337 146066 48013 9530 16929
11487 16929 91114 -158171 155300 -10907 100277 288266 -238794 187320 48172 44820 158335
11476 158335 116476 244459 317187 -74642 -60629 268823 259919 135733 -99097 116453 148648
11465 148648 -100790 266106 175428 413759 -34317 177974 206285 -130172 354955 124914
$$ packed form
11546f8412A4608R9497a55264f5245H6132e7304k71917B06942E6448a28450A0375
11534a23853B6150J93478K1506F7821A1173i9563A23524Q1831p6195D7593B1807
11522A71513b59042d6486C46240j0684A41913E6957L06662c0061H6261l2317L221
11511E7165J38875I5855P9119K4805E2453J44261J72342a16844e3194G7622b18045
11499F2774B62Q0723Q6217N3635p0439J828L13822A1337J34729D8013I530P399
11487A6929P4185a58171A55300a0907A00277J87989b38794A87320D8172l352J13515
11476A58335m1859J27983P2728g4642J4013B68823q904j24186i9097A16453L2195
11465A48648a00790B66106r0678K38331c4317A77974K8311a30172C54955A24914
$$ plain form
11454 49956 238178 301189 58270 102692 109868 -98211 69336 -93895 270513 -227843 -135859
11443 -135859 259680 180016 54126 46268 -130980 -72029 -139998 150530 247099 338872 -172783
11431 -266561 -372271 -108460 -37910 417938 -22508 400275 19181 348746 -269222 10101
11420 -118933 341073 94931 -268010 92148 52994 3959 -179209 3358 69723 44307 21545
11408 -356028 -7320 115073 235548 -279499 214969 324348 -105084 -155820 89657 -23325
11397 -53444 106446 -100519 263694 -86920 -274744 127725 100472 -71736 -179305 111034
11386 -12315 -397188 96927 -277941 -102703 57473 9077 -245185 80784 80873 -13593 362546
11374 386897 -78352 11517 -191136 -50347 -72102 -128502 25776 -115782 106106 -105470 110738
$$ packed form
11454D9956J88222O3011E8270M4422P176i8211F9336i3895B70513b27843R1984
11443a35859B59680p9664E4126p858a30980N8951o7969A50530R6569R1773a72783
11431b66561j05710a08460c7910D17938b2508D00275A9181L29565b69222A0101
11420a18933C41073I4931b68010I2148l9154C959a79209C358O6365k5416B1545
11408c56028g320A15073J20475b79499B14969J09379a05084n0736H9657b3325
11397e3444A06446a00519B63694h6920j87824A27725k7253g1736j07569A11034
11386a2315l84873I6927b77941a02703E7473I077b45185H0784Q9a3593C62546
11374C86897g8352A1517a91136e0347k1755n6400B5776a15782A06106a05470A10738
$$ plain form
11362 -403537 149511 -48276 30134 -166069 -31314 -138861 -27559 98569 101874 -86529 57729
11350 52218 181063 61486 102009 7319 -174175 94895 -171132 -201526 -151110 -284457 72442
11338 -51597 -135507 261051 -187410 90255 -12573 175837 -302074 -21609 91477 -101091 -183656
11327 -183656 -59581 81485 -45186 316839 -316001 -98601 146822 130297 71308 -24322 -47362
11316 -47362 -118415 374587 100172 192464 87411 -157543 89239 236433 -12072 -286632 -354476
11305 -354476 -8616 33225 -10790 -419901 220460 112694 -61749 -155114 -115985 -1267 -1877 -72966
11293 -72966 -7527 -184783 -136974 -247912 156251 71735 -160091 -140420 -168325 -412727 101041
11281 97480 161485 286598 -367494 -52578 -123399 -64910 88661 -212775 -443653 -87543 149286
$$ packed form
11362d03537A49511d8276C0134a66069c1314j07547b7559I8569L305h6529E7729
11350E2218J28845F1486M0523G319a74175I4895a71132l0394N0416j33347G2442
11338e1597q3910B61051a87410I0255a2573A75837c02074b1609I1477a01091q2565
11327a83656e9581H1485d5186C16839c16001i8601A46822j6525n8989b4322k3040
11316d7362p1053C74587A00172R2292H7411a57543H9239J47194a2072k74560o7844
11305c54476h616C3225a0790m09111B20460j07766f1749r3365L9129a267o10p1089
11293g2966g527j77256M7809j10938A56251G1735a60091J9671k7905k44402A01041
11281I7480O4005J25113c67494e2578p0821N8489H8661b12775k30878h7543A49286
$$ plain form
11269 104900 -274127 -101370 76382 303988 -182122 167543 -294759 -180361 -37470 37282
11258 -109575 66100 438908 128547 20237 -457529 128219 -109492 -227224 -360458 5587
11247 -213432 -296806 164348 -208866 -16896 -90577 29362 19033 -8364 54494 -116508 240158
11235 -186020 -274707 133224 -40216 98009 11445 181045 260776 150840 92427 91830 2488
11223 -141023 -94466 -21176 -125612 -329722 -67031 -445022 -246043 25367 51214 -94407 19855
11211 -131911 21783 -68559 -105553 -56619 217933 117008 -232457 -113493 35949 -105967
11200 60557 -395203 75103 255453 15073 -217161 -23354 117660 10511 108869 212308 29244
11188 -226362 116674 -107198 75670 -267309 -48032 69431 -7670 27757 389113 -102390 28260
$$ packed form
11269A04900b74127a01370G6382K27606a82122A67543b94759J14398c7470C7282
11258a09575F6100L72808A28547B0237d57529A28219a09492j17732j33234E587
11247b13432q3374A64348b08866a6896p3681B9362j0329h364E4494a16508B40158
11235a86020q8687A33224d0216I8009A1445J69600P9731j09936n8413n97B488
11223a41023M6557b1176j04436k04110f7031l77991J98979B5367K5847i4407A9855
11211a31911B1783f8559l6994M8934B17933j00925b32457a13493C5949a05967
11200F0557c95203G5103J80350A5073b17161b3354A17660A0511R8358J03439B9244
11188b26362A16674a07198G5670b67309d8032F9431g670B7757L61356a02390B8260
$$ plain form
11176 -31713 36868 87801 200271 -261554 -94360 320146 26769 -272442 -347010 -234325 -209233
11165 -209233 -90706 -369412 -91117 208091 -341157 -16702 -131063 -281072 -352620 138278
11154 -83996 131881 42201 112425 -72450 30434 -15435 69351 -19016 -247574 263120 -46703
11142 3244 -78272 -133399 -41129 -262565 -200409 -158435 63199 -136244 -142507 -139750 -150375 -201290
11130 -201290 -66406 113299 -119249 155757 -28864 394019 18920 237343 -210454 -15821
11119 165068 -134948 49890 234025 -90019 308490 -158557 -439535 177589 334078 47819
11108 -121032 318586 -14739 296643 227465 269172 292141 258655 61048 -15403 263542 65213
11096 421601 -121157 222994 -31688 -85285 145984 14484 368248 165508 248988 424850
$$ packed form
11176c1713C6868N0933J12470b61554i4360C20146B6769b72442p4568J12685K5092
11165b09233i0706k78706i1117B08091c41157a6702j14361j50009p1548A38278
11154h3996A31881D2201P0224g2450C0434a5435F9351a9016k28558B63120d6703
11142C244g8272n5127d1129k21436O2156M1974F3199a36244o263K757j0625n0915
11130b01290f6406A13299a19249A55757b8864C94019A8920K18423b10454a5821
11119A65068a34948D9890J84135i0019C08490a58557k80978A77589J56489D7819
11108a21032C18586a4739B96643o9178M1707K2969l3486F1048a5403B63542F5213
11096D21601a21157B22994c1688n3597A45984A4484L53764A65508Q3480J75862
$$ plain form
11086 424850 332158 173029 411302 175571 -103272 99404 114641 175059 202139 207765 104286
11075 104286 353625 301881 159114 -125629 296866 65898 239683 209191 823270 150693
11064 499447 15816 303216 615402 500594 390310 347062 378305 334677 588374 314495
11054 314495 261815 575732 636386 345323 810175 651143 641436 640686 557749 601020 701935
11043 701935 885142 785844 650776 476788 628592 695120 1025966 895211 870001 398034
11032 442601 497841 846633 521281 862018 714412 472620 885092 674903 823114 386529
11021 483552 720011 644578 510057 521767 581504 813966 620671 479738 580230 538016
11011 538016 690178 666693 776517 570320 635537 529013 516444 840731 629462 858914
$$ packed form
11086D24850r2692j59129K38273A75571a03272I9404J5237O0418K7080N626j03479
11075A04286K49339n1744j42767a25629B96866F5898J73785l0492O14079A50693
11064D99447A5816K87400L12186j14808j10284m3248L1243m3628K53697k73879
11054C14495n2680L13917O0654k91063M64852j59032r707p50q2937M3271J00915
11043G01935J83207r9298j35068j73988J51804O6528L30846j30755k5210C98034
11032D42601N5240L48792l25352L40737j47606k41792M12472k10189J48211C86529
11021D83552K36459p5433j34521J1710N9737K32462j93295j40933J00492m2214
11011E38016J52162k3485J09824k06197O5217j06524j2569L24287k11269K29452
$$ plain form
11001 858914 764205 541908 780188 694413 1037848 936744 674876 777792 1006074 795428
10991 795428 685897 561042 662821 653297 720539 878034 664586 768188 936283 816494
10981 816494 965416 853934 1133671 962426 1001288 1281770 1247448 1355182 1538787 1954013
10971 1954013 1980554 2557713 2543022 2669122 2717093 2971212 3260229 3139025 3023378 2420722
10961 2420722 2500186 2027784 1622245 1152130 1052213 1143383 858031 895180 952166 643949
10951 643949 452549 525608 782742 378170 316822 417582 393619 206023 100897 275890
10941 275890 352370 341894 194209 236869 192162 392821 134045 370106 -225008 133253
10930 236378 -119635 238900 -152659 160414 -110711 89202 -21927 284395 252556 134523
$$ packed form
11001H58914r4709k22297K38280q5775L43435j01104k61868J02916K28282k10646
10991G95428j09531j24855J01779r524O7242J57495k13448J03602J68095j19789
10981H16494J48922j11482K79737j71245L8862K80482l4322J07734J83605M15226
10971A954013K6541N77159j4691J26100M7971K54119K89017j21204j15647o02656
10961B420722P9464m72402m05539m70115r9917R1170k85352L7149N6986l08217
10951F43949j91400P3059K57134C78170o1348J00760k3963j87596A00897J74993
10941B75890P6480j0476j47685M2660m4707K00659A34045K36061b25008A33253
10930B36378a19635B38900a52659A60414a10711H9202b1927B84395l1839j18033
$$ plain form
10920 134523 -51444 105721 -34417 -65530 -166970 -81195 -211615 -55440 95871 389457 14655
10908 -56508 263291 -210827 -237254 -23022 33362 21191 31383 -99921 121 -336233 -33765
10896 -13471 -160782 -192854 -118098 74964 331812 -113174 -186030 379481 -212215 246454
10885 -41353 -100446 -92562 -145549 -160493 41497 -95157 -144825 160301 210334 -129265 -45644
10873 -192967 -250010 -324039 -28169 74626 -31290 129315 -169117 -37953 26363 -118310 166304
10861 -160334 4725 -103442 -101720 -126664 -179920 172697 118387 -31587 -254820 88762 117137
10850 117137 -129130 53676 219364 -113275 -190902 -67902 -232187 119962 -143482 -248499
10840 -248499 10814 -221431 -27675 -39489 70649 -250569 -450899 -31234 -105501 -70366 -88949
$$ packed form
10920A34523e1444A05721c4417l1113j01440h1195j30420e5440I5871K93586A4655
10908e6508B63291b10827k6427b3022C3362j2171J0192i9921A21c36233c3765
10896a3471j47311l2072P4756G4964K56848a13174p2856C79481b12215B46454
10885d1353n9093P884n2987j4944D1497i5157m9668A60301N0033a29265d5644
10873a92967n7043p4029b8169G4626c1290A29315a69117c7953B6363a18310A66304
10861a60334D725a03442J722k4944n3256A72697n4310c1587k23233H8762K8375
10850A17137a29130E3676J65688a13275p7627f7902j64285A19962a43482j05017
10840b48499A0814b21431b7675j1814G0649b50569k00330c1234p4267L5135j8583
$$ plain form
10829 -88949 -146263 -295565 -180928 43993 -1697 57696 473470 45782 -72669 91492 -71895
10817 -77330 -15094 41421 -112938 -158312 -220998 -199441 -79233 -249940 185454 12428 -217797
10805 -20419 -106404 -411874 78008 -43019 -231490 -193496 -209615 -319706 280890 -262178 114598
10793 -224235 -105244 -195837 -142093 -81610 95090 13234 -42920 52879 288087 95561 182684
10782 182684 148588 -129961 10956 159791 20150 249094 72623 -307119 -177685 72314
10771 -60469 151112 -167108 -44853 -103125 -151844 269727 17449 -95366 76287 -161373 -105697
10760 -105697 -157891 -204726 -30444 70342 62100 -25456 -156513 171510 -54299 186625 -96390
10748 -118073 126870 -93881 -63637 65988 -55431 -162086 -135662 -507700 -49538 3613 8502
$$ packed form
10829h8949n7314j49302J14637D3993a697E7696M15774D5782g2669I1492g1895
10817g7330a5094D1421a12938m5374o2686K1557g9233j70707A85454A2428b17797
10805b0419q5985l05470G8008d3019j88471L7994j6119j10091B80890b62178A14598
10793b24235a05244r0593N3744O0483I5090A3234d2920E2879K35208I5561Q7123
10782A82684l4096a29961A0956J48835B0150K28944G2623c07119J29434G2314
10771f0469A51112a67108d4853n8272m8719B69727A7449i5366G6287a61373N5676
10760a05697n2194m6835c0444G0342q242b5456j31057A71510e4299A86625i6390
10748a18073A26870i3881L0244F5988e5431j06655K6424l72038d9538C613M889
$$ plain form
10737 8502 -71142 9724 -281988 197002 303476 -230876 76765 -51901 79552 -95709 -166750
10726 -166750 -249046 -177611 -36742 -66089 -107025 198582 123953 -33164 221251 -356801 -72762
10714 -8120 136241 -87689 -302849 -294713 185154 400091 94350 255118 90389 -88471 50573
10702 -136995 147577 -196430 -116666 -148279 -473388 7708 -46970 -20557 62428 -252634 -198017
10691 -198017 -418531 -1335 -111982 -127306 -17669 -5447 -12165 -167282 -174059 -221372 217906
10679 46073 -97191 -321733 219201 -46407 489294 -368606 -137228 -95653 329323 18160
10668 25752 73149 31146 -212254 440469 93041 -18586 -194757 -17617 -119342 -96325 175642
10656 -15821 -16466 254115 57436 1077 87710 -107561 -131175 -135460 -336273 228685 80004 270228
$$ packed form
10737H502g1142I724b81988A97002J06474b30876G6765e1901G9552i5709p1041
10726a66750q2296P1435c6742k9347m0936A98582p4629c3164B21251c56801g2762
10714h120A36241h7689k15160Q136A85154K14937I4350J60768I0389h8471E0573
10702a36995A47577a96430P9764l1613l25109G708d6970b0557F2428b52634N4617
10691a98017k20514a335j10647j5324a7669e447o718j55117o777m7313B17906
10679D6073i7191k24542B19201d6407D89294c68606a37228M1575C29323A8160
10668B5752M7397C1146b12254D40469I3041a8586j76171a7617j01725K3017A75642
10656a5821o45B54115E7436A077Q6633a07561k3614m285k00813B28685H0004J90224
$$ plain form
10644 270228 -198469 -23193 -444981 -165057 -172823 -441465 46672 -179213 124077 73658
10634 73658 -14917 -21123 415306 -269380 -203536 281169 160159 -147174 67613 -428942 48544
10622 -64244 -34397 -55624 -67211 52220 -88 -189294 -104268 -109736 -19367 68309 -31468 -67923
10610 -67923 4894 -134656 109449 -439154 -261608 -24506 84636 -1809 171216 -26328 225632
10598 -193795 -60897 36642 -9793 -21411 7396 63020 -148363 -251564 98908 -36904 55953
10586 -159758 -206808 -161673 103340 -11277 -230744 47546 -348314 -116680 5595 190038 -141564
10574 -222516 192474 -148949 8047 -197076 187458 26527 31808 225597 -183223 3738 -120137
10562 -108145 -233504 -121635 -19000 4931 -189990 147584 -154137 -117367 226636 -14738
$$ packed form
10644B70228a98469b3193m21788a65057p766k68642D6672a79213A24077n0419
10634G3658a4917o206D15306b69380O5844B81169j21010a47174F7613d28942D8544
10622f4244K9847k1227j1587E2220h8j89206Q5026n468a9367F8309c1468l6455
10610f7923D894a34656A09449d39154J77546b4506H4636a809A71216b6328B25632
10598a93795f0897C6642i793j1618G396N5624a48363j03201I8908c6904E5953
10586a59758m7050M5135A03340a1277k19467D7546c48314a16680E595J84443a41564
10574b22516A92474a48949H047a97076A87458B6527N281J93789a83223C738a20137
10562a08145j25359J11869a9000D931a89990A47584a54137L6770B26636a4738
$$ plain form
10551 129702 38345 -165136 230586 237277 -38832 -79060 -200359 74001 -135143 411977 -59828
10539 -73480 141519 -95734 -324866 48909 24983 7628 -178355 62189 -310482 211947 57444
10527 229143 -91269 -151376 76128 -104228 -120558 -49306 -10348 196038 -68908 -257491 320409
10515 17086 -129295 -289196 -52109 -333942 -25812 -110402 -200735 36750 -29459 -49232 -504709
10504 -504709 -171036 99246 164344 82333 -50838 -62610 -116515 155837 -15607 -83944 -102381
10493 -102381 -80120 -124982 -36593 -70426 16241 -143276 28930 -138701 -95277 -134672 21103
10481 -191036 136649 -300296 -393300 -14119 -102756 -346957 101577 -181465 -203908 112461
10470 127443 -18402 -27429 -124326 98866 80409 -53495 -58047 57814 -155004 -145825 -16389 -103795
$$ packed form
10551A29702C8345a65136B30586O691c8832m0228j21299G4001a35143D11977e9828
10539g3480A41519i5734k29132D8909k3926G628a78355F2189c10482B11947E7444
10527B29143i1269o0107G6128a04228j6330d9306a0348A96038f8908j88583C20409
10515A7086a29295j59901e2109k81833b5812q4590r0333C6750b9459j9773m55477
10504e04709a71036I9246O5098q2011e0838j1772n3905A55837a5607o8337j8437
10493a02381K2261m4862c6593l3833A6241a43276B8930a38701M3424l9395B1103
10481a91036A36649c00296r3004a4119q8637k44201A01577a81465k2443A12461
10470A27443a8402r027r6897I8866j8457e3495m552E7814a55004R179a6389q7406
$$ plain form
10458 -103795 -332409 -275860 47862 151391 -164851 8009 -514625 -223994 -130696 206585
10447 27361 231335 -448584 -171928 68063 114618 -204982 -35447 -147556 -31225 -79607 -440489
10436 -440489 134137 -134111 -247011 -284269 74010 161023 -95349 -4685 60161 -171190 -128362
10425 -128362 -367141 -282833 -90038 27818 -264677 170130 187126 -73996 -167831 98092 72204
10414 72204 -122375 320651 -28662 101018 57700 -32904 298238 267145 226324 -269179 23894
10402 -33052 687 -106603 -166249 -19887 -109103 40031 -1326 -182698 -164379 174587 -5086 191796
10389 -34089 -335829 239461 -180759 153345 227980 227682 -208909 215406 304708 75423 89591
10378 89591 -78026 203861 366494 247172 293019 494051 330416 371611 246273 -41360
$$ packed form
10458a03795k28614N6549D7862J03529a64851H009e14625b23994R3298B06585
10447B7361K03974d48584a71928F8063M6555b04982c5447j12109c1225m8382l60882
10436d40489A34137a34111j12900l7258G4010Q7013i5349d685F0161a71190M2828
10425a28362k38779Q4308i0038B7818b64677A70130J6996g3996r3835I8092k5888
10414G2204a22375C20651b8662A01018m3318c2904B98238l1093m0821b69179B3894
10402c3052F87a06603n9646a9887q9216D0031a326j81372J8319A74587e086A91796
10389c4089l01740B39461a80759A53345P4635k98b08909B15406Q9302G5423J4168
10378H9591g8026B03861J62633j19322M5847K01032j63635M1195j25338d1360
$$ plain form
10367 26108 441203 313900 275911 298141 488495 733519 373652 416948 -12778 484825
10356 178718 205166 121146 -13519 121304 322285 60041 254617 446053 334125 373082
10346 373082 411560 398609 348551 154186 329789 127163 119048 194287 137962 471441 232982
10334 208177 90898 -6041 56524 -72021 76784 -12282 -25597 172922 760342 51494 -48198
10322 166659 -73623 140010 425369 14269 -80886 -64974 190877 -184017 83606 184136
10312 184136 60061 -178239 -149320 -16745 -52511 8788 -111124 37744 230256 -201019 126344
10300 -221297 -374020 6398 -61834 -102605 -392997 -41862 -334079 268327 -180987 269480
10289 36099 -112053 -72077 -214460 139053 -110816 -199729 156852 -134455 -233001 98661
$$ packed form
10367B6108M15095j27303l7989K2230J90354K45024l59867M3296a2778D84825
10356A78718K6448q4020a3519A21304K00981F0041J94576J91436j11928L8957
10346C73082L8478j2951n0058A54186J75603A27163q115P5239n6325L33479B32982
10334B08177I0898f041E6524g2021G6784a2282j3315A72922N87420E1494d8198
10322A66659g3623A40010K85359A4269h0886J5912A90877a84017H3606J00530
10312A84136F0061a78239K8919a6745l5766H788a11124C7744J92512b01019A26344
10300b21297j52723F398f1834m0771k90392d1862k92217B68327a80987B69480
10289C6099a12053L9976j42383A39053a10816q8913A56852a34455r8546I8661
$$ plain form
10278 -386939 -94053 -34884 79749 123030 -144490 -162204 -287614 115531 -16604 -67871 111398
10266 182453 73788 56838 -328245 75186 -400372 278694 78296 41378 59848 52040 77753
10255 77753 28411 -161121 87462 71154 -71700 -49048 -128173 -149116 3382 -130662 -133251 -421926
10243 -421926 207663 61777 -26149 -76412 -180891 81579 -63481 -268979 332216 -187397
10232 -76845 102866 79611 -279739 586025 -15215 264959 -76164 250418 71313 223270
10222 223270 198437 -45286 -63000 -91851 246528 86845 -124039 341936 -213323 -217680 62173
10210 388721 -71384 -2478 -195021 -18371 45549 89333 -25548 -139670 -111714 -264345 64525
10198 -86449 -19635 -113753 85536 -264256 -124983 48685 -83876 157923 37022 125388 14926
$$ packed form
10278c86939i4053c4884G9749M3281a44490j7714j25410A15531a6604n1267A11398
10266A82453G3788j6950c28245G5186d00372B78694G8296l6918J8470p808K5713
10255G7753B8411a61121H7462j6308g1700K2652p9125k0943C382a30662k589k88675
10243d21926B07663F1777b6149n0263j04479H1579f3481k05498C32216a87397
10232g6845A02866k3255b79739E86025a5215B64959g6164B50418G1313J51957
10222B23270k4833d5286j7714k8851B46528H6845a24039C41936b13323m357F2173
10210C88721g1384b478j92543a8371D5549M3784b5548j14122K7956j52631F4525
10198h6449a9635r4118H5536b64256a24983D8685h3876A57923C7022Q8366A4926
$$ plain form
10186 -30234 50030 -188356 40447 -34522 61822 39604 -125457 -85659 -135041 -373049 280925
10174 -56131 -195082 11951 -86131 -126907 122349 -282690 63230 56839 -179817 -144544 -154237
10163 -154237 -18746 -70205 34628 -208664 94600 -156731 240077 -168448 23026 -231588
10152 14165 -387675 -108057 -6523 -39551 -414991 -138681 202119 -154240 55541 -160380
10141 -91939 -53761 126867 97837 288843 -147502 -134145 18811 -268111 -78517 -377887 -170631
10129 -26029 -147301 28036 65010 -98805 -48736 47878 -157956 244772 89467 -171147 -48163
10117 -141208 -146402 -50407 -28264 66760 -368300 -59408 -13760 -104103 158224 10690 -62170
10105 52841 80040 101932 -145079 -190557 -223603 -273548 -223036 -123368 6242 271115 -46416
$$ packed form
10186c0234E0030a88356D0447c4522F1822k2218a25457L9798m9382k38008B80925
10174e6131j38951A1951h6131m0776A22349b82690F3230o391a79817L5273r693
10163a54237a8746n1459C4628b08664I4600a56731B40077a68448B3026b31588
10152A4165c87675a08057f523l3028l75440a38681B02119a54240E5541a60380
10141i1939L8178A26867k9030J91006a47502J3357A8811b68111g8517k99370a70631
10129b6029j21272B8036L6974i8805d8736D7878a57956B44772H9467a71147d8163
10117a41208n194e0407K2143F6760c68300e9408a3760r0343A58224A0690f2170
10105E2841K7199K1892a45079m5478l3046m9945N0512R9668F242K64873d6416
$$ plain form
10093 -53691 147302 127056 -455122 -168034 -176709 142452 -345855 -208588 -12231 -142500
10083 -142500 5731 -30251 137645 -365137 -127122 -208835 104048 -155515 -194292 241530
10072 -289567 -91059 -257889 -108925 -137268 -114644 -90591 256792 -140248 -103513 62811 126844
10061 126844 -17429 126759 -76884 -94823 16417 376900 13080 121806 193738 -172364 -124005
10050 -124005 24603 -313665 -185997 20178 -173539 177832 -174210 -310421 -33035 -81301
10040 -81301 215536 -29854 22888 271352 -52992 299042 -331393 -11354 -118084 -26597 -106164
10029 -106164 119954 -209393 -66519 -130909 -197306 132499 -181744 -253888 -156615 -31966 -32699
10018 -32699 -298793 78232 144682 367298 -404073 -216243 147470 -190062 -308326 -187693
$$ packed form
10093e3691A47302k0246d55122a68034q675A42452c45855J37267a2231j30269
10083a42500E731c0251A37645c65137a27122q1713A04048a55515l8777B41530
10072b89567i1059j66830a08925k8343K2624K4053B56792a40248L6735F2811O4033
10061A26844a7429A26759g6884j7939A6417L60483A3080J08726P1932a72364M8359
10050a24005B4603c13665J27668B0178a73539A77832a74210j36211c3035m8266
10040h1301B15536b9854B2888K48464e2992B99042c31393a1354j06730b6597p9567
10029a06164A19954b09393f6519o4390o6397A32499a81744p2144R7273c1966p33
10018c2699k66094G8232O6450K22616d04073J87830A47470a90062j18264J20633
$$ plain form
10008 -187693 -410133 -125688 102731 -78095 -440704 -193109 -39462 -273141 312022 85346
9997 75095 -194316 -161505 -413295 -105888 -78103 176464 37984 40758 33296 4737 -94832 -100690
9985 -100690 -124805 -55512 -227897 29237 17699 -180152 131381 -126072 159401 -155453
9974 -203936 75101 -125943 -119504 -14536 -75544 14595 -285500 -1184 -101349 -5005 -320615
9963 -320615 -178486 -38150 -33332 -297972 -259620 403811 -126193 -17392 -265679 -68470 -296371
9952 -296371 105019 922 -82707 -165715 167031 -179329 -276934 11124 -127857 -44549 125938
9940 -232571 -470449 -154826 17986 -9666 129752 -313778 -115707 -107402 80368 65946 -22013
9928 51838 61122 -107131 -29575 -69460 189118 -249053 118973 -178465 -245387 -235218 304574
$$ packed form
10008a87693k22440a25688A02731g8095l62609a93109c9462k33679C12022H5346
9997G5095a94316L2811k51790a05888K7785A76464C7984K774p462D737i4832n858
9985a00690k4115e5512j72385B9237j1538a80152A31381a26072A59401a55453
9974b03936G5101a25943O439a4536o1008A4595b85500a184j00165e005l15610
9963c20615J42129c8150M818k64640L8352D03811a26193a7392k48287f8470k27901
9952b96371A05019I22h2707q3008A67031a79329r7605A1124a27857d4549A25938
9940b32571k37878a54826A7986i666A29752c13778a15707Q305H0368j4422b2013
9928E1838R284a07131b9575l9885A89118b49053A18973a78465o6922J0169C04574
$$ plain form
9916 123303 177378 186531 21555 139980 7406 8036 181613 -43217 25367 312151 -318933 191634
9903 -147779 228769 109368 53571 -32424 93448 218779 -305337 -302433 -216442 118696 30302
9891 -120679 163477 -277698 23732 -57430 -80978 160326 -373333 137649 10342 151603
9881 151603 -70047 -130317 15741 -46031 -159204 -386462 -360905 366229 -130586 -412917 -132667
9869 -955 -137788 -290279 -114332 -412748 -89961 -159653 49486 5312 -233221 -228868 -83347 -62998
9857 -62998 125201 -126095 107682 93969 -171847 49342 23103 -143156 -79171 -74684 -98109
9846 -98109 84152 -97085 114782 -151712 163 -26318 -202371 -210108 -334060 143856 -8163 -19787
9834 -19787 -7881 -375647 -35587 -159982 -129398 62155 110042 -7894 1959 -318280 -38597 130000
$$ packed form
9916A23303N4075R153B1555J18425G406O30J73577d3217B5367K86784c18933A91634
9903a47779B28769A09368E3571c2424I3448J25331c05337K904Q5991A18696C0302
9891a20679A63477b77698B3732e7430k3548A60326c73333A37649A0342J41261
9881A51603g0047o0270A5741d6031j13173k27258K5557C66229a30586k82331a32667
9869i55j36833j52491a14332k98416h9961o9692D9486E312b33221M353h3347K0349
9857f2998A25201a26095A07682j3713a71847D9342B3103a43156O3985M487k3425
9846i8109H4152i7085A14782a51712A63b6318j76053p737j23952A43856h163j1624
9834a9787g881l67766c5587j24395L0584F2155M7887g894A959c18280c8597A30000
$$ plain form
9821 28873 -375652 -144988 242745 -8489 -49320 143292 98262 -229376 -38820 -241063 -323813
9810 -323813 -463320 -97319 -156660 -71328 -139607 -290802 143153 -34732 171920 124417 -498915
9798 -234335 195509 -157475 -316711 -132341 -133839 211851 -68885 -116069 469 -59765 1610
9786 -172320 43746 -43862 -93887 8889 -251188 32355 -93848 249742 672 214873 -235206
9774 4360 -42816 75120 183425 -25043 242942 -190420 -67754 -352382 6823 -55217 -130789
9763 -130789 6547 -98092 71633 106596 -91409 -437048 -226670 -416174 -43092 -127372 -262703
9752 -262703 -153747 -102751 327896 58162 136176 -151645 -92230 -42872 -277175 -22156 -291388
9741 -291388 -198996 -20594 -160092 -199209 -167832 -26434 -170409 -182619 -158778 194027 -68120
$$ packed form
9821B8873c75652a44988B42745h489m0831A43292m5030b29376c8820k02243q2750
9810c23813j39507i7319n9341g1328o8279j51195A43153c4732A71920m7503d98915
9798b34335A95509a57475j59236a32341j498B11851f8885m7184D69e9765A610
9786a72320D3746d3862n0025H889b51188C2355i3848B49742F72K14201b35206
9774D360d2816G5120J08305b5043B42942a90420f7754k84628F823e5217p5572
9763a30789F547i8092G1633L4963i1409l45639K10378j89504d3092q4280j35331
9752b62703J08956N0996C27896E8162P8014a51645N9415d2872k34303b2156k69232
9741b91388R2392b0594j39498l9117L1377b6434j43975j2210K3841A94027f8120
$$ plain form
9729 58760 -145077 -5739 -30440 26793 147966 -98263 -136583 63125 -264089 145782 -87703
9717 -67248 -61337 -280530 94045 -370286 149077 -61474 47368 -54107 -97640 305719 159891
9706 159891 194529 -7858 -16768 -31071 96302 -251011 45578 -344256 -10808 -76789 17980 -218141
9693 -22748 -279307 -295775 65230 -219852 -34063 160878 -154145 -416559 -117004 -15113 -37858
9682 -37858 -412623 -277463 -337069 56335 48118 -83530 -6977 -347195 -69407 209797 -306070
9670 -259302 -297796 236177 -243389 89017 260964 -116100 -255767 -144364 -213427 -224241
9660 -224241 -69472 -338281 -334137 -225954 -134545 -12286 -63631 -22310 -17260 528 -255945 -201868
9648 -201868 -242247 -221387 -158623 -121912 -195531 263517 132268 -191930 -151205 189123 -221078
$$ packed form
9729E8760a45077e739k4701B6793J21173i8263l8320F3125b64089A45782h7703
9717f7248N911k19193I4045c70286A49077f1474D7368e4107m3533C05719j45828
9706A59891L4638g858q910j4303I6302b51011D5578c44256a0808o5981A7980b18141
9693b2748k56559j6468F5230b19852c4063A60878a54145k62414a17004a5113k2745
9682c7858l74765J35160n9606E6335q217h3530f977l40218f9407B09797c06070
9670b59302l8494B36177b43389H9017J71947a16100j39667J11403o9063j0814
9660b24241f9472k68809M144J08183R1409a2286n1345b2310N050E28b55945N4077
9648b01868m0379K0860O2764L6711p3619B63517j31249a91930M0725A89123b21078
$$ plain form
9636 187642 94070 77537 -76572 18030 36017 -64935 -242180 193288 64831 -371896 -225067
9625 -225067 -199428 -289299 205031 -88969 33395 188557 -186353 143937 -234700 -266653 -271350
9614 -271350 -30781 -90805 32340 80187 -415742 -50073 58156 119336 27323 -263846 -238785
9603 -238785 -17551 63351 147492 -12639 -77874 398683 -98108 -108207 -57879 -119399 8641 -131539
9590 163 -15621 -218250 -45915 39484 -13063 -182067 -220252 -257275 -190140 102105 -179787
9578 -262809 -132675 161761 6763 -152689 322407 23580 -122503 -2427 35399 20009 -76550
9566 43536 254556 163581 -192652 -70036 -64804 -17716 -43854 -44394 -46486 -411558 68448 45620
9554 45620 -112429 -84111 -29318 -129916 46803 -332123 -336634 -121195 171976 181975 311826
$$ packed form
9636A87642r3572j6533g6572A8030J7987f4935j77245A93288F4831c71896J46829
9625b25067K5639q9871B05031h8969C3395J55162a86353A43937b34700l1953m697
9614b71350c0781o0024C2340M7847d15742e0073E8156O1180B7323b63846K5061
9603b38785a7551F3351Q4141a2639o5235C98683i8108j0099N0328o1520H641a31539
9590A63a5621k02629d5915C9484a3063j69004l8185l7023O7135A02105a79787
9578b62809J30134A61761F763a52689C22407B3580a22503b427C5399j5390g6550
9566D3536K11020r0975a92652g0036N232a7716k6138n40k092l65072F8448k2828
9554D5620a12429K8318b9318j00598D6803c32123m511a21195A71976R999J29851
$$ plain form
9543 311826 -111869 -428183 -153464 56010 -93224 -267306 154572 38392 -52846 46397 -129572
9531 172178 -44245 19795 373714 13748 -104731 305210 -206714 -112727 -71352 -140767 -45111
9519 -120591 765 -68062 362853 -186459 213659 22621 75540 -102098 -368460 -69069 239635
9507 61074 18158 -288656 89419 24575 89366 -147266 139382 -179752 13996 190108 -274209
9495 -263090 413470 -11394 -137598 -102367 -176131 -132296 -417822 39901 210378 119761 141610
9484 141610 -59147 152619 177080 -369915 53575 -361208 38510 257863 -14884 -8384 -66612
9473 -66612 271090 131157 -288726 56270 -58308 83862 -255036 49381 -103276 90332 -210908
9461 33253 -125386 -88703 -46949 166241 -204324 65952 -105932 25932 -26757 -300697 51152
$$ packed form
9543C11826a11869l16314a53464E6010i3224j74082A54572C8392e2846D6397a29572
9531A72178d4245A9795L53919A3748a04731C05210b06714R3987M1375o9415d5111
9519a20591G65f8062C62853a86459B13659B2621N2919a02098k66362f9069B39635
9507F1074A8158b88656H9419B4575O4791a47266A39382a79752A3996J76112b74209
9495b63090D13470a1394j26204L5231p3764M3835k85526C9901J70477r0617K1849
9484A41610e9147A52619K4461c69915E3575c61208C8510K19353a4884O500n8228
9473f6612B71090A31157b88726E6270e8308H3862b55036D9381a03276I0332b10908
9461C3253a25386L6683M1754A66241b04324F5952a05932B5932b6757k73940E1152
$$ plain form
9449 -134629 -53211 -65073 272524 -73259 -192386 -135509 -12192 32364 115930 65144 -279213
9437 -103093 141560 -233167 -228816 -252716 10070 -243825 140798 -241274 14174 284725 115106
9425 -500908 -226515 -109581 -134757 -37118 81365 228084 -38943 62345 -60916 301541 121309
9413 -190563 96575 -124930 -223266 -251135 167009 -61827 -83857 57642 247783 -18743 -248685
9402 -248685 -92600 -453021 129355 1876 -93617 -107182 -318739 103173 84830 -14843 -19600
9391 -19600 160196 -161683 145358 -92492 -97762 -84311 -221704 42051 95616 -30588 87759
9379 -303745 -123956 -42770 -148801 -54673 -397286 -207887 343854 -163876 6546 -226206
9368 -131008 -565701 -29612 -129952 157533 292893 491090 -200752 53304 -51207 -110597
$$ packed form
9449a34629e3211j1862B72524g3259j19127N6877a2192C2364Q3566n0786b79213
9437a03093A41560b33167M351k3900A0070b43825A40798b41274A4174K70551A15106
9425e00908b26515a09581k5176c7118H1365J46719c8943F2345f0916C01541A21309
9413a90563I6575a24930r8336k7869A67009f1827k2030E7642J90141a8743k29942
9402b48685i2600l60421A29355A876i3617j3565k11557A03173j8343a4843m757
9391a9600A60196a61683A45358i2492n270J3451j37393D2051N3565c0588H7759
9379c03745a23956d2770j06031e4673l42613J89399C43854a63876F546b26206
9368a31008m34693b9612j00340A57533J35360J98197b00752E3304e1207n9390
$$ plain form
9358 -110597 -200727 147755 -146126 31722 135093 -354101 -96492 -7645 236952 -112342 35631
9346 -334135 2196 10741 29129 -81346 96574 -208646 33879 -376482 -277545 -52613 -70106 -107191
9334 -107191 -308790 -196864 -266467 47877 61585 155338 156585 -170877 247317 -129235 17107
9322 -434981 162807 21237 -183914 -4122 -26114 272788 98693 123527 -40504 136863 -140026
9310 -127874 88039 -360338 180888 90350 -116510 -28455 -13816 101706 -173735 -256795 -107823
9298 95557 78625 -103923 -76415 140542 92569 -113923 -151079 -184958 -84569 -218277 -165801
9287 -165801 326487 -117734 -2441 -195118 -232449 -158427 166002 104602 113076 -35899 -76110
9276 -76110 -134751 356571 -213388 -368357 -164251 113306 -381844 28344 -9609 -72751 -262610
$$ packed form
9358a10597r0130A47755a46126C1722J03371c54101i6492g645B36952a12342C5631
9346c34135B196Q545J8388h1346I6574b08646C3879c76482R8937e2613j7493l7085
9334a07191k01599J11926o9603D7877J3708R3753J247a70877B47317a29235A7107
9322d34981A62807B1237a83914d122k1992B72788I8693K4834d0504A36863a40026
9310a27874H8039c60338A80888I0350a16510b8455a3816A01706a73735q3060a07823
9298I5557j6932a03923K7508A40542m7973a13923l7156l3879h4569j33708N2476
9287a65801C26487a17734b441j92677l7331P4022A66002o1400Q474c5899m0211
9276g6110n8641C56571b13388j54969a64251A13306c81844B8344i609o3142j89859
$$ plain form
9265 -262610 161524 14449 -23694 -131287 -209687 -111273 -167982 -156179 20529 -155306 14468
9253 -322391 123452 -141524 -97220 -488778 3547 -6573 -58374 430958 -155724 157601 -11816
9241 129776 50997 -540842 75175 -160221 -31705 34517 91549 -28836 -53206 229883 54188
9229 123284 -120990 -292002 201923 44964 128142 197897 -312952 -87370 -48031 -249409 237337
9217 21707 -204100 41424 -50393 -68888 3265 -22419 -207815 1645 -99071 -87907 -68413 -221382
9205 -221382 -103358 -15601 -290402 48850 -281848 -53013 -200446 -107308 -192894 -119241 -285229
9194 -285229 357085 177923 -249581 306565 -99650 71287 152768 -123858 -203272 -26580 59145
9182 90207 -371691 12978 -437299 -30682 -2960 130491 446333 -258060 -155715 -218022 376816
$$ packed form
9265b62610A61524A4449b3694j07593p8400R8414n6709J1803B0529a55306A4468
9253c22391A23452a41524M4304l91558C547f573n1801D30958a55724A57601a1816
9241A29776E0997e40842G5175a60221c1705C4517N7032b8836k4370B29883E4188
9229A23284a20990j71012B01923D4964Q3178O9755c12952h7370L9339k01378B37337
9217B1707b04100D1424e0393j8495C265b2419j85396A645i9071J1164J9494j52969
9205b21382a03358a5601k74801D8850b81848e3013j47433R3138q5586P3653j65988
9194b85229C57085A77923b49581C06565i9650G1287Q1481a23858p9414b6580E9145
9182I0207c71691A2978d37299c0682b960A30491L15842b58060J02345o2307C76816
$$ plain form
9170 95780 -42979 19740 11943 -44104 -204067 -223377 -291595 147249 -468149 -63551 -125885
9159 -125885 2441 -181245 351640 -54630 -30138 -5407 26847 292525 185107 -126697 -39604
9147 -518828 -41390 -147801 -429526 207641 -324261 -157236 125552 102772 45549 -177343
9136 -171534 -102937 -373704 -263638 -279993 -122125 -97083 -36827 -300546 -229756 169527 -214048
9124 -214880 163913 179741 -78303 15365 -90644 15510 -147675 48408 220588 -41070 -142101
9113 -142101 -80497 -161400 -50488 72768 138752 -409461 -9998 -241839 -246101 -378586 192404
9101 18097 -338880 74738 45501 -217678 251558 -331646 -186558 88947 -100441 -105606 99481
9089 -6070 -21563 153883 -109878 -169700 69639 -237890 -68966 -178340 40472 -5906 -298103
$$ packed form
9170I5780d2979A9740p797d4104j59963j9310o8218A47249d68149f3551o2334
9159a25885B441a81245C51640e4630K4492e407B6847K65678j07418a26697c9604
9147e18828d1390j06411k81725B07641c24261a57236A25552k2780D5549a77343
9136a71534O8597k70767J10066j6355a22125K5042c6827k63719P0790A69527b14048
9124b14880A63913J5828g8303A5365i0644A5510a47675D8408J72180d1070j01031
9113a42101O1604q0903e0488G2768O5984d09461i998k31841m262j32485A92404
9101A8097c38880G4738k9237b17678B51558c31646J45088H8947a00441n165I9481
9089f070j5493A53883a09878n9822F9639b37890f8966j09374D0472e906k92197
$$ plain form
9078 -298103 -39630 -236700 -3408 475919 -127758 -4081 -156100 -131252 -238276 -433613 -166968
9066 93478 -165070 -211869 235743 -37364 -93853 136655 -46404 -622003 -174525 -145173 -179090
9055 -179090 29433 261651 -33563 -148606 69980 -12514 -12983 21038 -88274 -18390 17323 -294666
9042 -351959 93465 -124607 -118516 248784 -74827 -252148 -118978 -249038 186740 86357 444466
9031 444466 145611 -344178 -25903 41959 -37530 82480 15767 196926 -238365 77748 46066
9020 46066 122852 143219 -148718 14481 147297 139891 134375 -97055 -203107 69995 126897 163801
9008 163801 61294 58741 155351 -40418 -19425 -94632 -46497 -54614 197456 -52236 94659 224684
8996 224684 -321521 -162094 59285 -6690 -177159 212533 -67011 -120778 -169732 -61588 -221118
$$ packed form
9078b98103c9630j97070c408D75919a27758d081j52019K4848j07024j95337a66968
9066I3478a65070m6799B35743c7364n6489A36655d6404n75599a74525K9352l3917
9055a79090B9433K32218c3563j15043F9980a2514m69B1038h8274a8390A7323b94666
9042c51959I3465a24607O091B48784g4827j77321a18978j30060A86740H6357L58109
9031D44466A45611c44178b5903D1959c7530H2480A5767J81159b38365G7748l1682
9020D6066P6786K0367a48718A4481J32816p406n516i7055j06052F9995N6902L6904
9008A63801F1294k553R6610d0418a9425p5207d6497q117A97456e2236I4659J30025
8996B24684c21521J59427E9285f690j70469B12533f7011n3767m8954f1588j59530
$$ plain form
8985 -221118 -403847 -160843 -65733 10175 -59374 -41038 -128340 -45691 -19185 -131279 -354234
8974 -354234 144953 254270 -120950 -170725 173539 -61588 92848 -55197 -436361 -341197 10215
8962 -106183 -96551 -42566 -149895 -106812 12020 141088 92201 -268708 -29788 -90057 81359
8950 -100594 -394109 -93065 -344878 -114254 120729 -157055 -176702 111983 -94690 176711
8939 -162397 -127221 -52673 -42061 16135 63228 -116207 -100562 -17410 113459 -4601 86227
8927 -46563 -94192 -65403 177436 219461 -734 165473 830420 1598702 1661185 1049919 825981
8916 825981 536290 101823 191305 259492 315324 -208168 -177613 -159547 58571 189034 422912
8905 422912 117110 -243283 -390522 -234927 -131696 -65672 -101521 -318488 92177 -64596
$$ packed form
8985b21118j82729a60843f5733A0175e9374J8336q7302d5691a9185j12094k22955
8974c54234A44953J09317a20950m9775A73539f1588I2848e5197l81164R5164A0215
8962a06183R632d2566j07329M3083A2020J29068m8887b68708b9788o0269H1359
8950a00594k93515i3065k51813a14254A20729a57055j9647A11983i4690A76711
8939a62397L5176e2673J0612A6135M7093a16207J5645a7410A13459d601H6227
8927d6563m7629K8789A77436M2025g34A65473O64947P68282O2483o11266k23938
8916H25981k89691A01823Q9482O8187N5832b08168L0555J8066E8571J30463K33878
8905D22912A17110b43283j47239J55595J03231f5672l5849k16967I2177f4596
$$ plain form
8894 -82881 -404620 117498 -79901 64626 -140939 10562 56255 -182825 -273483 -134859 -257892
8883 -257892 -239428 -108042 -64450 90561 -183604 -356103 78336 -2946 -9063 -113360 -27146
8871 -298975 163771 -43212 -180028 -37730 -27408 -56369 -331917 -145379 24274 -28504 40332
$$ packed form
8894h2881l21739A17498g9901F4626a40939A0562M5693a82825r0658a34859j23033
8883b57892J8464a08042M3592I0561a83604j72499G8336b946o117j04297b7146
8871b98975A63771d3212j36816c7730J0322k8961k75548a45379B4274b8504D0332
$$ [...]
##END NTUPLES=NMR SPECTRUM
##END=
