
##TITLE=AC1256_INDRH11073_6642054_PRwSDJKfXY
##JCAMPDX= 6.0         $$ Bruker NMR JCAMP-DX V2.0
##DATA TYPE= NMR SPECTRUM
##DATA CLASS= NTUPLES
##ORIGIN= BRUKER
##OWNER= Administrator
$$ 1.72 TOPSPIN		Version 2.1
$$ 2012-08-08 15:48:39.062 -0500  Administrator@TOPSPIN
$$ Compression mode = diff/dup
##.OBSERVE FREQUENCY= 400.02188249412
##.OBSERVE NUCLEUS= ^1H
##.ACQUISITION MODE= SIMULTANEOUS (DQD)
##.ACQUISITION SCHEME= undefined
##.AVERAGES= 32
##.DIGITISER RES= 22
##SPECTROMETER/DATA SYSTEM= spect
##.PULSE SEQUENCE= noesygpps1d.comp
##.SOLVENT NAME= COFFEE_meoh
##.SHIFT REFERENCE= INTERNAL, COFFEE_meoh, 1, 14.96213
##AUDIT TRAIL= $$ (NUMBER, WHEN, WHO, WHERE, PROCESS, VERSION, WHAT)
$$ ##TITLE= Audit trail, TOPSPIN		Version 2.1
$$ ##JCAMPDX= 5.01
$$ ##ORIGIN= Bruker BioSpin GmbH
$$ ##OWNER= Administrator
$$ $$ C:\Bruker\TOPSPIN/data/COFFEE/nmr/AC1256_INDRH11073_6642054_PRwSDJKfXY/12/pdata/1/auditp.txt
$$ ##AUDIT TRAIL=  $$ (NUMBER, WHEN, WHO, WHERE, PROCESS, VERSION, WHAT)
(   1,<2012-08-08 15:41:06.046 -0500>,<Administrator>,<TOPSPIN>,<go>,<TOPSPIN 2.1>,
      <acquisition in progress>)
(   2,<2012-08-08 15:48:28.437 -0500>,<Administrator>,<TOPSPIN>,<proc1d>,<TOPSPIN 2.1>,
      <Start of raw data processing
       efp LB = 0.3 FT_mod = 6 PKNL = 1 PHC0 = 0 PHC1 = 0 SI = 128K 
       data hash MD5: 128K
       1A 01 77 34 CF A7 5C DA D6 99 F5 9A 97 8D F0 75>)
(   3,<2012-08-08 15:48:31.609 -0500>,<Administrator>,<TOPSPIN>,<proc1d>,<TOPSPIN 2.1>,
      <pk PHC0 = -0.8184814 PHC1 = 0 
       data hash MD5: 128K
       62 6A 57 1D 47 63 E6 80 CC 01 F2 AB 86 44 32 24>)
(   4,<2012-08-08 15:48:34.328 -0500>,<Administrator>,<TOPSPIN>,<proc1d>,<TOPSPIN 2.1>,
      <abs ABSG = 1 
       data hash MD5: 128K
       2F 35 CA B2 22 E7 C0 56 DB 78 3A FF 5D BA 32 2C>)
(   5,<2012-08-08 15:48:35.296 -0500>,<Administrator>,<TOPSPIN>,<proc1d>,<TOPSPIN 2.1>,
      <abs ABSG = 2 
       data hash MD5: 128K
       16 67 21 18 C4 ED EC 68 EF B2 0E 5B BC 12 D3 13>)
(   6,<2012-08-08 15:48:36.218 -0500>,<Administrator>,<TOPSPIN>,<proc1d>,<TOPSPIN 2.1>,
      <abs ABSG = 3 
       data hash MD5: 128K
       C8 A6 F1 42 A9 33 47 48 4C 2A 87 72 F8 A6 01 89>)
(   7,<2012-08-08 15:48:37.125 -0500>,<Administrator>,<TOPSPIN>,<proc1d>,<TOPSPIN 2.1>,
      <abs ABSG = 4 
       data hash MD5: 128K
       F3 7A 70 16 3A EB 62 95 9D 94 41 D9 76 8F E9 74>)
(   8,<2012-08-08 15:48:37.906 -0500>,<Administrator>,<TOPSPIN>,<proc1d>,<TOPSPIN 2.1>,
      <abs ABSG = 5 
       data hash MD5: 128K
       35 CA C2 3A B6 64 D1 F9 3D B7 58 DF 97 16 D6 CA>)
$$ ##END=
$$ 
$$ $$ hash MD5
$$ $$ 39 E6 49 1D 97 11 29 EC CF CE A4 2A 12 4C E6 B4
##$RELAX= 
##$RELAX= 
##$RELAX= 
##$RELAX= 
##$RELAX= 
##$RELAX= 
##$RELAX= 
##$RELAX= 
$$ Bruker specific parameters
$$ --------------------------
##$DU= <C:\Bruker\TOPSPIN>
##$EXPNO= 12
##$NAME= <AC1256_INDRH11073_6642054_PRwSDJKfXY>
##$PROCNO= 1
##$TYPE= <nmr>
##$USER= <COFFEE>
##$ACQT0= -6.48892924534871
##$AMP= (0..31)
$$ [...]
150 150 150 150 150 150 150 150
##$TP07= 0
##$TPNAME0= <>
##$TPNAME1= <>
##$TPNAME2= <>
##$TPNAME3= <>
##$TPNAME4= <>
##$TPNAME5= <>
##$TPNAME6= <>
##$TPNAME7= <>
##$TPOAL= (0..7)
0.5 0.5 0.5 0.5 0.5 0.5 0.5 0.5
##$TPOFFS= (0..7)
0 0 0 0 0 0 0 0
##$TUNHIN= 0
##$TUNHOUT= 0
##$TUNXOUT= 0
##$USERA1= <user>
##$USERA2= <user>
##$USERA3= <user>
##$USERA4= <user>
##$USERA5= <user>
##$V9= 5
##$VALIST= <valist>
##$VCLIST= <CCCCCCCCCCCCCCC>
##$VD= 0
##$VDLIST= <DDDDDDDDDDDDDDD>
##$VPLIST= <PPPPPPPPPPPPPPP>
##$VTLIST= <TTTTTTTTTTTTTTT>
##$WBST= 1024
##$WBSW= 4
##$XGAIN= (0..3)
0 0 0 0
##$XL= 0
##$YL= 0
##$YMAX_a= 0
##$YMIN_a= 0
##$ZGOPTNS= <>
##$ZL1= 120
##$ZL2= 120
##$ZL3= 120
##$ZL4= 120
##$ABSF1= 14.96213
##$ABSF2= -5.596052
##$ABSG= 5
##$ABSL= 3
##$ALPHA= 0
##$AQORDER= 0
##$ASSFAC= 0
##$ASSFACI= 0
##$ASSFACX= 0
##$ASSWID= 0
##$AUNMP= <proc_prof1d_extract.lims>
##$AXLEFT= 0
##$AXNAME= <>
##$AXNUC= <1H>
##$AXRIGHT= 0
##$AXTYPE= 0
##$AXUNIT= <>
##$AZFE= 0.1
##$AZFW= 0.1
##$BCFW= 0
##$BC_mod= 0
##$BYTORDP= 0
##$COROFFS= 0
##$CY= 15
##$DATMOD= 1
##$DC= 0
##$DFILT= <>
##$DTYPP= 0
##$F1P= 0
##$F2P= 0
##$FCOR= 0.5
##$FTSIZE= 131072
##$FT_mod= 6
##$GAMMA= 0
##$GB= 0
##$INTBC= 1
##$INTSCL= 1
##$ISEN= 128
##$LB= 0.3
##$LEV0= 0
##$LPBIN= 0
##$MAXI= 10000
##$MC2= 0
##$MEAN= 0
##$ME_mod= 0
##$MI= 0
##$NCOEF= 0
##$NC_proc= -3
##$NLEV= 6
##$NOISF1= 0
##$NOISF2= 0
##$NSP= 0
##$NTH_PI= 0
##$NZP= 0
##$OFFSET= 14.96213
##$PC= 1
##$PHC0= -0.8184814
##$PHC1= 0
##$PH_mod= 1
##$PKNL= yes
##$PPARMOD= 0
##$PPDIAG= 0
##$PPIPTYP= 0
##$PPMPNUM= 2147483647
##$PPRESOL= 1
##$PSCAL= 4
##$PSIGN= 0
##$PYNMP= <proc.py>
##$REVERSE= no
##$SF= 400.020009185778
##$SI= 131072
##$SIGF1= 0
##$SIGF2= 0
##$SINO= 400
##$SIOLD= 131072
##$SPECTYP= <>
##$SREGLST= <1H.CDCl3>
##$SSB= 0
##$STSI= 131072
##$STSR= 0
##$SW_p= 8223.68421052631
##$SYMM= 0
##$S_DEV= 0
##$TDeff= 65536
##$TDoff= 0
##$TI= <>
##$TILT= no
##$TM1= 0
##$TM2= 0
##$TOPLEV= 0
##$USERP1= <user>
##$USERP2= <user>
##$USERP3= <user>
##$USERP4= <user>
##$USERP5= <user>
##$WDW= 1
##$XDIM= 131072
##$YMAX_p= 292547287
##$YMIN_p= -17554
##$CURPLOT= <Network HP LaserJet P1505>
##$CURPRIN= <$Network HP LaserJet P1505>
##$DFORMAT= <normdp>
##$LAYOUT= <+/1D_H.xwp>
##$LFORMAT= <normlp>
##$PFORMAT= <normpl>
##$SURQMSG= 1
$$ End of Bruker specific parameters
$$ ---------------------------------
##NTUPLES= NMR SPECTRUM
##VAR_NAME=  FREQUENCY,     SPECTRUM/REAL,   SPECTRUM/IMAG
##SYMBOL=    X,             R,               I
##VAR_TYPE=  INDEPENDENT,   DEPENDENT,       DEPENDENT
##VAR_FORM=  AFFN,          ASDF,            ASDF
##VAR_DIM=   131072,        131072,          131072
##UNITS=     HZ,            ARBITRARY UNITS, ARBITRARY UNITS
##FACTOR=    0.0627417313425164, 1,          1
##FIRST=     8223.62146879497, 5896,         -50702
##LAST=      0,             7395,            -49390
##MIN=       0,             -17554,          0
##MAX=       8223.62146879497, 292547287,    0
$$ Real data points
##PAGE= N=1
##DATA TABLE= (X++(R..R)), XYDATA
$$ [...]
61101F19083l860k678j669q03j67N65J823L149L560L018K419J929O90j533l714
61086F21812n099o124p156p562o769n311m044l271l104l710m541m382k926j343
61072E56470n55l1R02J704J567P48lm79n74J86J622K431J923J219J484J976J467
61055E72057O87J402L451M762M392L814M626O434P723P839P300O756O346O016
61041F43605N977O591P610P924O689M718L861M726O036O647O975P661Q131P704
61027G34855P139P583Q629Q942Q317P671P353O857O082N569N471N456N548N968
61013H31440O292N914N209N109N622N835N407M960N006N550O720Q738J1148J2988
60999I25938J3826J3979J3979J4473J6158J8923K1479K2937K4130K6305K9120
$$ plain form
61101 619083 615223 612545 610876 610073 609906 610471 612294 615443 619003 622021 624440 626369 627059 625526 621812
61086 621812 616713 610589 603433 595871 589102 583791 579747 576476 573372 569662 565121 560739 557813 556470
61072 556470 555915 555884 556786 558490 560057 560805 560802 560323 559749 559935 561557 563988 565911 567130 568614 570590 572057
61055 572057 572744 574146 577597 582359 586751 590565 595191 601625 609348 617187 624487 631243 637589 643605
61041 643605 649582 656173 663783 671707 678396 683114 686975 691701 697737 704384 711359 719020 727151 734855
61027 734855 741994 749577 758206 767148 775465 783136 790489 797346 803428 808997 814468 819924 825472 831440
61013 831440 837732 843646 848855 853964 859586 865421 870828 875788 880794 886344 893064 901802 912950 925938
60999 925938 939764 953743 967722 982195 998353 1017276 1038755 1061692 1085822 1112127 1141247
60988A141247L1401L3199L5394L7717L9131M0060M2295M6407N1030N4992N8537
60977A611410O2107O5548O8958P2852P7070Q0905Q4549Q9030R4547J00304J06109
60966B513389J12582J19744J27259J36121J48180J63746J81697K02058K26149
60957C930925K53871K83499L14839L49910L89783M33762M82973N41703O13802
60948G595067P00914Q06125R35843J095798J288979J520369J798396K124712K481881
60939B0348084K831646L118685L272817L224782K950216K511512K040130J654849
60931D1952721J391843J217199J093714J010133R42007Q16441N51232J31836l72661
60922D8734465q78978j358444j824217k266486k627636k845460k902032k822481
$$ plain form
60988 1141247 1172648 1205847 1241241 1278958 1318089 1358149 1400444 1446851 1497881 1552873 1611410
60977 1611410 1673517 1739065 1808023 1880875 1957945 2038850 2123399 2212429 2306976 2407280 2513389
60966 2513389 2625971 2745715 2872974 3009095 3157275 3321021 3502718 3704776 3930925
60957 3930925 4184796 4468295 4783134 5133044 5522827 5956589 6439562 6981265 7595067
60948 7595067 8295981 9102106 10037949 11133747 12422726 13943095 15741491 17866203 20348084
60939 20348084 23179730 26298415 29571232 32796014 35746230 38257742 40297872 41952721
60931 41952721 43344564 44561763 45655477 46665610 47607617 48424058 48975290 49107126 48734465
60922 48734465 47855487 46497043 44672826 42406340 39778704 36933244 34031212 31208731
60914C1208731k644364k406542k158194j951953j815201j734648j675039j609243
60906A5213547j528855j435159j329970j214784j092433r67213q44596p30371
60898F070166o28281n38779m60974l94636l39330k93247k54618k23146j98482
60889B738673j78496j60811j45135j32414j22393j13674j05458r7703r0086q2360
60879A510143p5197o9299o4131n8869n3986n0316m7155m3087l8437l5043l3470
60868I41153l2142k9627k6322k3384k1274j9847j8876j7915j6474j4729j3383
60857G07180j2619j1917j1083j0534j0382j0109r531r133r093q808p884o871o374
60844E82842o205n948n782o084o616o797o412n594m505l452k995l389m158m572
$$ plain form
60914 31208731 28564367 26157825 23999631 22047678 20232477 18497829 16822790 15213547
60906 15213547 13684692 12249533 10919563 9704779 8612346 7645133 6800537 6070166
60898 6070166 5441885 4903106 4442132 4047496 3708166 3414919 3160301 2937155 2738673
60889 2738673 2560177 2399366 2254231 2121817 1999424 1885750 1780292 1682589 1592503 1510143
60879 1510143 1434946 1365647 1301516 1242647 1188661 1138345 1091190 1048103 1009666 974623 941153
60868 941153 909011 879384 853062 829678 808404 788557 769681 751766 735292 720563 707180
60857 707180 694561 682644 671561 661027 650645 640536 631005 621872 612779 603971 596087 589216 582842
60844 582842 576637 570689 564907 558823 552207 545410 538998 533404 528899 525447 522452 519063 514905 510333
60830E10333m280l222j459M05J246N74p41j510j626j681j614p91P13K025K806
60815E01178L639M785N581N603N526O083O844O928O368N888N559M757L403K357
60801E74499K236K539K289J184j90j047j161j188k115m094n970o466n758n153
60787E49605n266n444n188n115n830o626o289m778l256k669k983l632m011l682
60773D84836k831k396l076m253m570l525j811k23Q90J178L50r54j337k48J257
60758D63287J889J683J681K512L907N188N729N273M286L713L945M309M004L153
60744E14559K384J748P27p91k216l088l700m761o497q218q777p765o234n829o903
60729D54639q021p675o086m805m903o119p490q240q145p575p095o749o018m776
$$ plain form
60830 510333 506053 502831 501372 501777 503023 503597 502856 501346 499720 498039 496425 495634 496347 498372 501178
60815 501178 504817 509602 515183 520786 526312 532395 539239 546167 552535 558423 563982 568739 572142 574499
60801 574499 576735 579274 581563 582747 582557 581510 580349 579161 577046 572952 566982 560516 554758 549605
60787 549605 544339 538895 533707 528592 522762 516136 509847 505069 501813 499144 496161 492529 488518 484836
60773 484836 482005 479609 476533 472280 467710 464185 462374 462151 463041 464219 464569 463615 462278 462030 463287
60758 463287 465176 466859 468540 471052 474959 480147 485876 491149 495435 499148 503093 507402 511406 514559
60744 514559 516943 518691 519418 518627 516411 513323 509623 504862 498365 490147 481370 473605 467371 461542 454639
60729 454639 446618 438943 432857 428052 423149 417030 409540 401300 393155 385580 378485 371736 365718 360942
60715C60942l792l716m161m490m880n637n979m903l017k051k393k577j686p83
60701C10877j115k165k499j788q48l29l32q67j648j778o29J105K071J874J253
60686C03182R03R38J468K677M170M991M705L904L430L473L644L580L317L312M116
60671C51810N706P251P853P481O777O151N699N704O490P639Q204P948P701Q183
60657D50597R133R872J0116R798Q728P041N602N275N927O627O614N781M419K886
60643E48416J413n6j636l048l755l828m160n284o532o934o570o244o176n842n086
60628D84678m415m066l664l014k499k279j893j127n88p86j118o56M37J131J077
60613D61218J013J431J727J260O25J099K961N053O155O301O468P317Q650R899
$$ plain form
60715 360942 357150 353434 349273 344783 339903 334266 328287 323384 320367 318316 315923 313346 311660 310877
60701 310877 309762 307597 305098 303310 302462 302133 301801 300934 299286 297508 296879 297984 300055 301929 303182
60686 303182 304085 305023 306491 309168 313338 318329 323034 326938 330368 333841 337485 341065 344382 347694 351810
60671 351810 357516 364767 372620 380101 386878 393029 398728 404432 410922 418561 426765 434713 442414 450597
60657 450597 459730 469602 479718 489516 498244 505285 510887 516162 522089 528716 535330 541111 545530 548416
60643 548416 549829 549773 548137 545089 541334 537506 533346 528062 521530 514596 508026 501782 495606 489764 484678
60628 484678 480263 476197 472533 469519 467020 464741 462848 461721 461133 460347 459229 458573 459010 460141 461218
60613 461218 462231 463662 465389 466649 467274 468373 471334 476387 482542 488843 495311 502628 511278 521177
60599E21177J0685J0830J0282R398R033R901J1716J3263J3534J2654J1516J0643
60587F54632R651P841N080J927r13l169m990o583p859q510q415q001p962q561
60573F14168r330r584r107q170p097o191n890o345o806o122m197k405k033k777
60559E28114l426l570l709l915l460k028m02N53R23J304J930K693L573M503N168
60544E28251N485N893O627P126O823O232O408P483Q577R201R887J1143J2650J3915
60530F45701J5163J6946J9242K1536K3682K6126K9347L3455L8318M3669M9079
60519I62264N4251N9612O6198P4567Q3945R2679R9425J03528J04522J01979R6100
60508A899070Q7832P7950O6421N3238L9467K6722J5706O005k877j1075j8913k6753
$$ plain form
60599 521177 531862 542692 552974 562372 571405 581306 593022 606285 619819 632473 643989 654632
60587 654632 664283 672124 677204 679131 678218 675049 670059 663476 655617 647107 638692 630691 622729 614168
60573 614168 604838 595254 586147 577977 570880 564689 558799 552454 545648 539526 535329 532924 530891 528114
60559 528114 524688 521118 517409 513494 510034 508006 507604 508157 509080 510384 512314 515007 518580 523083 528251
60544 528251 533736 539629 546256 553382 560205 566437 572845 580328 588905 598106 607993 619136 631786 645701
60530 645701 660864 677810 697052 718588 742270 768396 797743 831198 869516 913185 962264
60519 962264 1016515 1076127 1142325 1216892 1300837 1393516 1492941 1596469 1700991 1802970 1899070
60508 1899070 1986902 2064852 2131273 2184511 2223978 2250700 2266406 2272411 2269534 2258459 2239546 2212793
60496B212793l3909l8835m1060m2069m3460m4897m4780m2300l7828l1826k4666
60485A787163j7195j0075k458P321J9339L1478M1684M9817N6500O1092O1980N8630
60473B145276N2377M5098L7683K9965K1820J4049Q171N430O038R485J5218K2787
60461B413397L1566M1158N2061O5315Q1243R9099J18328J39639J64409J93300
60451C399515K25992K61963L00941L42387L84635M24436M57227M78039M82618
60442F757753M68121M33398L79087L07555K22516J28646L1548o2484j47552k19483
60432H299105k76234l17534l44663l60231l67214l67895l64095l58014l51760
60423E191465l45830l38961l29865l18363l04658k88463k69536k48434k26184
$$ plain form
60496 2212793 2178884 2140049 2098989 2056920 2013460 1968563 1923783 1881483 1843655 1811829 1787163
60485 1787163 1769968 1759893 1757435 1764756 1784095 1815573 1857257 1907074 1963574 2024666 2086646 2145276
60473 2145276 2197653 2242751 2280434 2310399 2332219 2346268 2354439 2359869 2365907 2375392 2390610 2413397
60461 2413397 2444963 2486121 2538182 2603497 2684740 2783839 2902167 3041806 3206215 3399515
60451 3399515 3625507 3887470 4188411 4530798 4915433 5339869 5797096 6275135 6757753
60442 6757753 7225874 7659272 8038359 8345914 8568430 8697076 8728624 8666140 8518588 8299105
60432 8299105 8022871 7705337 7360674 7000443 6633229 6265334 5901239 5543225 5191465
60423 5191465 4845635 4506674 4176809 3858446 3553788 3265325 2995789 2747355 2521171
60414B521171k03719j81969j61794j43291j25897j09760r6146q5779p7504o9626
60404A265686o1955n5566n0850m6983m3126l9221l5485l2020k8960k6410k4200
60393H20910k2158k0437j9113j7752j6034j4437j3550j3055j2287j1452j1258
60382F49377j1463j1055r930r182r389r743r443q936r047r597r588q448o509m625
60368E22422l672l949m726m829l973l014k562k119j172l32n07j374j741j288r94
60353D86170j595k549k896k567k269k434k809l027l108l239l311k975k073r10
60339D50408lL72L33K70N64J329K316L178L867M637N550O238O340N957N399M739
60323E01494L970L407L438M007M753N652O951Q482R597R898R509Q547O914M842
$$ plain form
60414 2521171 2317452 2135483 1973689 1830398 1704501 1594741 1498595 1412816 1335312 1265686
60404 1265686 1203731 1148165 1097315 1050332 1007206 967985 932500 900480 871520 845110 820910
60393 820910 798752 778315 759202 741450 725416 710979 697429 684374 672087 660635 649377
60382 649377 637914 626859 616929 607747 598358 588615 579172 570236 561189 551592 542004 533556 527047 522422
60368 522422 518750 514801 510075 505246 501273 498259 495697 493578 492406 492074 491567 490193 488452 487164 486170
60353 486170 484575 482026 479130 476563 474294 471860 469051 466024 462916 459677 456366 453391 451318 450408
60339 450408 450405 450777 451110 451380 451944 453273 455589 458767 462634 467271 472821 479059 485399 491356 496755 501494
60323 501494 505464 508871 512309 516316 521069 526721 533672 542154 551751 561649 571158 579705 586619 591461
60309E91461L098K109J354L9j877l815n389o524o989o455n104l673k701k100j671
60294E51763j668k426l580m066l178j461k92m79j548k557l292m259n532o246n576
60279E05603l868k340j784j974k269k331k082j365j17J213J864J482N39j35n3
60264D92383P42J933L110L916M372M948N962O944P073O319N613N781O827Q518
60250E64441J0909J3802J6266J7561J8157J9153K0880K2871K4878K6967K8673
60239G84558K9220K8793K8588K9148K9521K8720K7171K6013K5575K5310K4685
60228A087302K3266K0410J5974J1245Q051O747N856L959J239j237k944m037m553
60215A171278m308l496k644j823l83K145N227P753R270J0406J2047J4386J7000
$$ plain form
60309 591461 594559 596668 598022 598061 596184 592369 586980 580456 573467 567012 561908 558235 555534 553434 551763
60294 551763 550095 547669 544089 540023 536845 535384 535092 534613 533065 530508 527216 522957 517425 511179 505603
60279 505603 501735 499395 497611 495637 493368 491037 488955 487590 487473 488686 490550 492032 492571 492436 492383
60264 492383 493125 495058 498168 502084 506456 511404 517366 524310 531383 537702 543315 549096 555923 564441
60250 564441 575350 589152 605418 622979 641136 660289 681169 704040 728918 755885 784558
60239 784558 813778 842571 871159 900307 929828 958548 985719 1011732 1037307 1062617 1087302
60228 1087302 1110568 1130978 1146952 1158197 1166248 1172995 1178851 1182810 1184049 1182812 1179868 1175831 1171278
60215 1171278 1166970 1163474 1160830 1159007 1158624 1160769 1165996 1173749 1183019 1193425 1205472 1219858 1236858
60202A236858J9546K2000K4209K5698K6161K5882K5429K4978K4227K2915K1152
60191A499055J9141J6783J3780J0059N941J851k010n632q927j1664j3614j4681
60179A510082j4817j3951j2155r845p621n812m047j399K819Q247J3583J7781K0977
60166A503842K4060K7518L1204L5062L9286M3478M6583M8232M9478N1321N2990
60155A953054N2758N0219M6591M2610L7390K9942K0884J1857L823l189r048j3258
60143B223633j5673j6744j6807j5647j3046r404n466j594K495P337J3198J9972
60131B172254K7382L5074M2584M9500N5863O2103O8266P3472P6736P8161P8752
60120B820147P8882P7760P4702P0158O4779N8111M9316L8840K8343J8768R497
$$ plain form
60202 1236858 1256404 1278404 1302613 1328311 1354472 1380354 1405783 1430761 1454988 1477903 1499055
60191 1499055 1518196 1534979 1548759 1558818 1564759 1566610 1564600 1558968 1550041 1538377 1524763 1510082
60179 1510082 1495265 1481314 1469159 1459314 1451693 1445881 1441834 1440435 1443254 1451501 1465084 1482865 1503842
60166 1503842 1527902 1555420 1586624 1621686 1660972 1704450 1751033 1799265 1848743 1900064 1953054
60155 1953054 2005812 2056031 2102622 2145232 2182622 2212564 2233448 2245305 2249128 2245939 2236891 2223633
60143 2223633 2207960 2191216 2174409 2158762 2145716 2136312 2130846 2129252 2131747 2139084 2152282 2172254
60131 2172254 2199636 2234710 2277294 2326794 2382657 2444760 2513026 2586498 2663234 2741395 2820147
60120 2820147 2899029 2976789 3051491 3121649 3186428 3244539 3293855 3332695 3361038 3379806 3389303
60109C389303l11j0422k0161k9516l8735m7284n4173n9223o3124o6188o7834o7596
60097B864736o5833o3074n9272n4278m8472m2288l5593k8262k1072j5043j0019
60086B421530m819J076O792J1186J3897J4991J4534J3130J1975J1560J0807Q456
60074B535115M911J813j05j760m239p349r964j1314j1617j1561j1408j0612q438
60061B453472m962j019K952P445J2833J8433K3361K7781L2329L6595L9223L9543
60049B687986L8119L5646L2315K8444K4783K1668J8594J4987J0855O355J432l783
60037B917401q814j3430j7878k2257k6260k9949l4128l9401m5296n0705n4824
60026B574459n7338n8248n7925n7024n5928n4535n2658n0167m6652m1714l5813
$$ plain form
60109 3389303 3388992 3378570 3358409 3328893 3290158 3242874 3188701 3129478 3066354 3000166 2932332 2864736
60097 2864736 2798903 2735829 2676557 2622279 2573807 2531519 2495926 2467664 2446592 2431549 2421530
60086 2421530 2416711 2417787 2424579 2435765 2449662 2464653 2479187 2492317 2504292 2515852 2526659 2535115
60074 2535115 2540026 2541839 2541734 2539974 2535735 2528386 2518422 2507108 2495491 2483930 2472522 2461910 2453472
60061 2453472 2448510 2447491 2450443 2457888 2470721 2489154 2512515 2540296 2572625 2609220 2648443 2687986
60049 2687986 2726105 2761751 2794066 2822510 2847293 2868961 2887555 2902542 2913397 2919752 2921184 2917401
60037 2917401 2908587 2895157 2877279 2855022 2828762 2798813 2764685 2725284 2679988 2629283 2574459
60026 2574459 2517121 2458873 2400948 2343924 2287996 2233461 2180803 2130636 2083984 2042270 2006457
60015B006457l0178k5423k0976j6238j1444o884k160K955P790J1795J5640K0193
60003A951527K4975K8780L1391L3425L4708L4261L2081K9522K7369K4613J9931
59992B272583J3630P328K026k704p788j3444j9093k4030k7912l0660l2161l2380
59980B105395l1710l0779k9738k8016k5063k1085j6814j2742q939n294j594K422
59968A896043O720J0838J4426J7640K0656K3171K4870K6029K7025K7537K6921
59957B121876K5242K3209K1113J8583J5468J2264R477P157N315M194L857M002
59945B271757M459N542P597J0574J4354J9105K4988L1730L8878M6322N4193O2317
59933B591816P0079P6987Q3148Q8888R3890R6905R6566R2386Q4720P3997O0559
$$ plain form
60015 2006457 1976279 1950856 1929880 1913642 1902198 1895314 1893154 1896109 1903899 1915694 1931334 1951527
60003 1951527 1976502 2005282 2036673 2070098 2104806 2139067 2171148 2200670 2228039 2252652 2272583
59992 2272583 2286213 2293541 2295567 2292863 2285075 2271631 2252538 2228508 2200596 2169936 2137775 2105395
59980 2105395 2073685 2042906 2013168 1985152 1960089 1939004 1922190 1909448 1900509 1895215 1893621 1896043
59968 1896043 1902763 1913601 1928027 1945667 1966323 1989494 2014364 2040393 2067418 2094955 2121876
59957 2121876 2147118 2170327 2191440 2210023 2225491 2237755 2247232 2254389 2259704 2263898 2267755 2271757
59945 2271757 2276216 2281758 2289355 2299929 2314283 2333388 2358376 2390106 2428984 2475306 2529499 2591816
59933 2591816 2661895 2738882 2822030 2910918 3004808 3101713 3198279 3290665 3375385 3449382 3509941
59922C509941M5309K9719J4621n03j6259l1695m4682n4080o0819o6681p2388p7120
59910C175363p9574p9253p6869p3644p0309o6883o3234n9254n4308m7332l8259
59899B466444k8807k0874j4338p551R8P326J2955J7495K1912K5763K7615K6914
59887B534952K4333K0360J4621O813k425j2083k1698l1162l9919m7003n1989n5412
59875B339388n8028o0094o1651o3118o4846o6226o6076o4153o1572n9319n6997
59864A657308n3745m9844m6380m3540m0241l5688l0477k5764k1981j8920j6550
59853A274178j5076j4293j3505j2240j0666r113p476n431l184j472o10R4J469
59840A182675L257M350M206L235J734n91l598o181p594q604j0295j2271j3228
$$ plain form
59922 3509941 3555250 3584969 3599590 3599087 3582828 3551133 3506451 3452371 3391552 3324871 3252483 3175363
59910 3175363 3095789 3016536 2939667 2866023 2795714 2728831 2665597 2606343 2552035 2504703 2466444
59899 2466444 2437637 2416763 2402425 2394874 2394972 2402298 2415253 2432748 2454660 2480423 2508038 2534952
59887 2534952 2559285 2579645 2594266 2601079 2598654 2586571 2564873 2533711 2493792 2446789 2394800 2339388
59875 2339388 2281360 2221266 2159615 2096497 2031651 1965425 1899349 1835196 1773624 1714305 1657308
59864 1657308 1603563 1553719 1507339 1463799 1423558 1387870 1357393 1331629 1309648 1290728 1274178
59853 1274178 1259102 1244809 1231304 1219064 1208398 1199285 1191809 1186378 1183194 1181722 1181112 1181206 1182675
59840 1182675 1185932 1190282 1194488 1197723 1199457 1198866 1195268 1189087 1181493 1172889 1162594 1150323 1137095
59827A137095j3036j2975j3810j4807j4984j4356j3503j2725j2057j1484j0674
59816I92684r085o765m533k903j376Q21L689O570Q817J0134J0684J1226J2621
59803A032584J4745J6397J6698J6045J5320J4734J4119J3737J3983J4616J5165
59792A198143J5866J7328J9402K1301K2942K5074K7827L0038L0743L0668L1441
59781A470773L3748L7100M1124M6138N2199N8437O3905O8627P3120P7128P9386
59770B101685P8727P4919O8305N9050M7065L2555J6400M4j4962k7548l7450m4934
59758B353856n0234n3369n4425n3705n1602m8656m5658m3228m1271l9191l6676
59747A835841l3699k9838k4533j8267j2476p691k718L603J0733J7504K3901L0468
$$ plain form
59827 1137095 1124059 1111084 1097274 1082467 1067483 1053127 1039624 1026899 1014842 1003358 992684
59816 992684 983599 976834 972301 969398 968022 968843 972532 979102 987919 998053 1008737 1019963 1032584
59803 1032584 1047329 1063726 1080424 1096469 1111789 1126523 1140642 1154379 1168362 1182978 1198143
59792 1198143 1214009 1231337 1250739 1272040 1294982 1320056 1347883 1377921 1408664 1439332 1470773
59781 1470773 1504521 1541621 1582745 1628883 1681082 1739519 1803424 1872051 1945171 2022299 2101685
59770 2101685 2180412 2255331 2323636 2382686 2429751 2462306 2478706 2478750 2463788 2436240 2398790 2353856
59758 2353856 2303622 2250253 2195828 2142123 2090521 2041865 1996207 1952979 1911708 1872517 1835841
59747 1835841 1802142 1772304 1747771 1729504 1717028 1709337 1706619 1710222 1720955 1738459 1762360 1792828
59735A792828L6723M1897M6873N3473O1659O9318P5387Q1488Q9469R8829J07869
59724B555813J16343J25442J35716J46340J56222J64722J71303J75572J77769
59715C925242J78484J77724J74983J70463J65566J61806J59455J57695J55994
59706E427412J55004J55812J58362J61015J61940J60604J57456J52577J45437
59697F835619J35847J24062J09762R2152P1759N1159L2989J7824M812o365j5248
59686G454372k1750k6161k8037k6384k1215j3909n589M075J6019L0497M7138O5626
59674G474682Q5596J06209J26559J46439J65974J84262J98720K06166K04577J93809
59664I092993J74789J48380J15171P6105L2880j2356n7344r9659j36886j67476
$$ plain form
59735 1792828 1829551 1871448 1918321 1971794 2033453 2102771 2178158 2259646 2349115 2447944 2555813
59724 2555813 2672156 2797598 2933314 3079654 3235876 3400598 3571901 3747473 3925242
59715 3925242 4103726 4281450 4456433 4626896 4792462 4954268 5113723 5271418 5427412
59706 5427412 5582416 5738228 5896590 6057605 6219545 6380149 6537605 6690182 6835619
59697 6835619 6971466 7095528 7205290 7297442 7369201 7420360 7453349 7471173 7475985 7469620 7454372
59686 7454372 7432622 7406461 7378424 7352040 7330825 7316916 7311327 7315402 7331421 7361918 7409056 7474682
59674 7474682 7560278 7666487 7793046 7939485 8105459 8289721 8488441 8694607 8899184 9092993
59664 9092993 9267782 9416162 9531333 9607438 9640318 9627962 9570618 9470959 9334073 9166597
59654I166597j91395k09521k22396k29947k32427k31181k28285k25605k24321
59645G171519k24942k27444k31429k36372k41753k46909k50890k52676k51555
59636E007549k47312k40145k30630k19725k08420j97133j85572j73510j61645
59627C143457j51233j42702j34953j26400j16572j06378r6978q8735q1209p3712
59617B024585o5799n7575m9719m2989l7616l3319k9815k6945k4412k1944j9883
59606A614569j9041j9607k0756k1720k2765k4342k5761k5702k4240k3198k3867
59595A363570k5114k4679k2062j9094j7630j7591j7769j7559j7100j6242j4603
59584A154127j2575j1138j0418r396p487n479m208l112j104J604L630M299M397
$$ plain form
59654 9166597 8975202 8765681 8543285 8313338 8080911 7849730 7621445 7395840 7171519
59645 7171519 6946577 6719133 6487704 6251332 6009579 5762670 5511780 5259104 5007549
59636 5007549 4760237 4520092 4289462 4069737 3861317 3664184 3478612 3305102 3143457
59627 3143457 2992224 2849522 2714569 2588169 2471597 2365219 2268241 2179506 2098297 2024585
59617 2024585 1958786 1901211 1851492 1808503 1770887 1737568 1707753 1680808 1656396 1634452 1614569
59606 1614569 1595528 1575921 1555165 1533445 1510680 1486338 1460577 1434875 1410635 1387437 1363570
59595 1363570 1338456 1313777 1291715 1272621 1254991 1237400 1219631 1202072 1184972 1168730 1154127
59584 1154127 1141552 1130414 1119996 1110600 1103113 1097634 1093426 1090314 1089210 1090814 1094444 1098743 1103140
59571A103140M963O163P549Q699R287R175Q827R227J0967J3655J6419J8752K0652
59558A247475K2221K3483K4586K6040K8534L2259L6433L9921M2565M5442M9399
59547A618358N3904N7947O1585O5616O9950P3390P5130P5582P5482P5044P4250
59536B376238P3179P1628O9057O5326O0902N5940M9832M2195L3804K5991J9326
59525B943418J3428P891L051j45r61M01K879N632Q838J3079J8171K3234K7844
59512C066760L2233L6239L8702L8266L4379K7515J8880R716J99j0892k4524l9495
59500C227978n3175o4198p3322q1395q7801r1510r2633r2164r1013q9866q9092
59489B321809q8069q5406q0581p4651o8823o3126n7156n1103m5144l8793l1757
$$ plain form
59571 1103140 1108103 1114266 1121815 1130514 1139801 1148976 1157803 1167030 1177997 1191652 1208071 1226823 1247475
59558 1247475 1269696 1293179 1317765 1343805 1372339 1404598 1441031 1480952 1523517 1568959 1618358
59547 1618358 1672262 1730209 1791794 1857410 1927360 2000750 2075880 2151462 2226944 2301988 2376238
59536 2376238 2449417 2521045 2590102 2655428 2716330 2772270 2822102 2864297 2898101 2924092 2943418
59525 2943418 2956846 2964737 2967788 2967643 2966682 2967083 2969962 2975594 2984432 2997511 3015682 3038916 3066760
59512 3066760 3098993 3135232 3173934 3212200 3246579 3274094 3292974 3302690 3302889 3291997 3267473 3227978
59500 3227978 3174803 3110605 3037283 2955888 2868087 2776577 2683944 2591780 2500767 2410901 2321809
59489 2321809 2233740 2148334 2067753 1993102 1924279 1861153 1803997 1752894 1707750 1668957 1637200
59478A637200k4736j8357j2194n848q5M463Q942J5009K2322K8934L4028L8696
59466A728374M3881M9062N3306N6342N8083N8242N7031N5323N3390N0113M4095
59455B307242L5243K4738J3822L073p318j7075k5816l3425m0257m6675n2358n6444
59443B104750n8672n9902o1009o1711o1160n9504n7967n7205n6355n4132n0468
59432A466665m6541m3276m0318l6745l2490k8525k5460k2630j9163j5455j2614
59421A143448j0625q270n026j896J50J489L062N162P733J0969J4727J8029J9963
59408A198915K0588K0365J9463J8255J7607J7778J7908J7542J7797J9866K3173
59397A409257K6244K8667L0908L2832L3962L4696L5776L6894L7390L7950M0003
$$ plain form
59478 1637200 1612464 1594107 1581913 1576065 1575980 1580443 1589385 1604394 1626716 1655650 1689678 1728374
59466 1728374 1772255 1821317 1874623 1930965 1989048 2047290 2104321 2159644 2213034 2263147 2307242
59455 2307242 2342485 2367223 2381045 2384118 2376800 2359725 2333909 2300484 2260227 2213552 2161194 2104750
59443 2104750 2046078 1986176 1925167 1863456 1802296 1742792 1684825 1627620 1571265 1517133 1466665
59432 1466665 1420124 1376848 1336530 1299785 1267295 1238770 1213310 1190680 1171517 1156062 1143448
59421 1143448 1132823 1124553 1119527 1117631 1117781 1119270 1122332 1127494 1135227 1146196 1160923 1178952 1198915
59408 1198915 1219503 1239868 1259331 1277586 1295193 1312971 1330879 1348421 1366218 1386084 1409257
59397 1409257 1435501 1464168 1495076 1527908 1561870 1596566 1632342 1669236 1706626 1744576 1784579
59386A784579M3589M7565N1908N7907O5782P3941Q1229Q8328R6151J04328J12353
59375B607660J20993J31304J42868J54134J64119J72987J81050J87923J92715
59366D055753J94856J94719J93185J90452J85690J78521J70347J63172J57328
59357E684023J51411J44506J37167J29925J21981J11996R9428Q4520O7636M9132
59347F781725K9471R014j1951l2906n3187p2398r0227j06079j19577j31325j42239
59336F060321j52050j59421j63729j65886j67052j67376j66218j63068j58027
59327D597494j51967j46128j40921j35186j27573j18415j09289j00795r2147q3029
59317C392044p4410o6994o0136n3044m5980l9497l3403k7298k1383j6019j1055
$$ plain form
59386 1784579 1828168 1875733 1927641 1985548 2051330 2125271 2206500 2294828 2390979 2495307 2607660
59375 2607660 2728653 2859957 3002825 3156959 3321078 3494065 3675115 3863038 4055753
59366 4055753 4250609 4445328 4638513 4828965 5014655 5193176 5363523 5526695 5684023
59357 5684023 5835434 5979940 6117107 6247032 6369013 6481009 6580437 6664957 6732593 6781725
59347 6781725 6811196 6820210 6808259 6775353 6722166 6649768 6559541 6453462 6333885 6202560 6060321
59336 6060321 5908271 5748850 5585121 5419235 5252183 5084807 4918589 4755521 4597494
59327 4597494 4445527 4299399 4158478 4023292 3895719 3777304 3668015 3567220 3475073 3392044
59317 3392044 3317634 3250640 3190504 3137460 3091480 3051983 3018580 2991282 2969899 2953880 2942825
59306B942825o234j785J973N143P934J0122J1246J0966R212O355L235L74k705
59293B998661o656j1034j4795j7889k1098k4399k6952k8879l1351l4402l6268
59282B744938l5745l3783l1791k9794k7192k4187k1190j7946j4393j1456r712
59271B487749q220n905l399k214k745m313o620r886j3965j8447k3259k8214l2489
59258B328073l5588l8223m1097m3377m3783m2681m1616m1039l9987l7952l5511
59247A887219l2950k9786k6003k2453j9344j5519j0028l615K262P335J2638J8991
59235A768747K6089L3082L9433M4929M9058N1018N0590M8861M7590M7896M9925
59224B257218N3748N9671O7436P5898Q4198R2718J02092J11737J20129J26324
$$ plain form
59306 2942825 2936591 2934806 2936779 2941922 2949856 2959978 2971224 2982190 2991402 2997757 3000992 3001366 2998661
59293 2998661 2992005 2980971 2966176 2948287 2927189 2902790 2875838 2846959 2815608 2781206 2744938
59282 2744938 2709193 2675410 2643619 2613825 2586633 2562446 2541256 2523310 2508917 2497461 2487749
59271 2487749 2479529 2473624 2470225 2468011 2465266 2460953 2454333 2444447 2430482 2412035 2388776 2360562 2328073
59258 2328073 2292485 2254262 2213165 2169788 2126005 2083324 2041708 2000669 1960682 1922730 1887219
59247 1887219 1854269 1824483 1798480 1776027 1756683 1741164 1731136 1727521 1729783 1737118 1749756 1768747
59235 1768747 1794836 1827918 1867351 1912280 1961338 2012356 2062946 2111807 2159397 2207293 2257218
59224 2257218 2310966 2370637 2438073 2513971 2598169 2690887 2792979 2904716 3024845 3151169
59214C151169J30480J32991J33855J32835J29586J23542J14226J01939Q7714P2510
59204D310847N6625M0037K3130P033o931j8259k7611l5755m2358m6561m8713n0571
59192D160913n3353n6565n9345o2128o5894p0338p3924p5647p5872p5433p4711
59181C417703p3741p2539p1096o9351o7316o5043o2505n9698n6681n3403m9761
59170B716569m5922m2327l9109l5992l2843k9878k6985k3583j9560j5748j2845
59159B391777j0412p624m568j992o3J850M296P246J0448J3686J6658J8977K0352
59146B460631K0656K0083J9251J8769J8427J7299J4888J1639Q041L878j046o179
59134B606337j0784j4878j8892k2844k6398k9406l1796l3302l3755l3432l2596
$$ plain form
59214 3151169 3281649 3414640 3548495 3681330 3810916 3934458 4048684 4150623 4238337 4310847
59204 4310847 4367472 4407509 4430639 4437672 4430741 4412482 4384871 4349116 4306758 4260197 4211484 4160913
59192 4160913 4107560 4050995 3991650 3929522 3863628 3793290 3719366 3643719 3567847 3492414 3417703
59181 3417703 3343962 3271423 3200327 3130976 3063660 2998617 2936112 2876414 2819733 2766330 2716569
59170 2716569 2670647 2628320 2589211 2553219 2520376 2490498 2463513 2439930 2420370 2404622 2391777
59159 2391777 2381365 2373741 2369173 2367181 2367118 2368968 2373264 2380510 2390958 2404644 2421302 2440279 2460631
59146 2460631 2481287 2501370 2520621 2539390 2557817 2575116 2590004 2601643 2609684 2613562 2612516 2606337
59134 2606337 2595553 2580675 2561783 2538939 2512541 2483135 2451339 2418037 2384282 2350850 2318254
59123B318254l1184k9269k7322k5555k3582k1200j8851j6730j4209j0884p492
59112B091976m924k913o25J953M205N964P458Q529Q993R471J0865J3119J5322
59099B169393J6919J7984J8525J8278J7007J4366R732K939n119j3392k1794l0631
59087B214207l9351m6835n2688n7288o0716o2694o3412o3473o3095o2183o1083
59076A581389o0331n9760n8650n6707n4169n1149m7769m4657m2341m0288l7534
59065A028034l4102l0838k7963k4968k1821j9157j7168j5420j3862j2886j2175
59054G97674j0680q140n610m020l159k539k316k726l235l028j895k32J597L477
59040G55168N448P625J0023J2380J4349J5843J6887J7315J7005J6219J5260J4039
$$ plain form
59123 2318254 2287070 2257801 2230479 2204924 2181342 2160142 2141291 2124561 2110352 2099468 2091976
59112 2091976 2087052 2084139 2083514 2085467 2089672 2095636 2103094 2111623 2120616 2130087 2140952 2154071 2169393
59099 2169393 2186312 2204296 2222821 2241099 2258106 2272472 2282204 2285143 2280024 2266632 2244838 2214207
59087 2214207 2174856 2128021 2075333 2018045 1957329 1894635 1831223 1767750 1704655 1642472 1581389
59076 1581389 1521058 1461298 1402648 1345941 1291772 1240623 1192854 1148197 1105856 1065568 1028034
59065 1028034 993932 963094 935131 910163 888342 869185 852017 836597 822735 809849 797674
59054 797674 786994 778854 773244 769224 766065 763526 761210 758484 755249 752221 750326 750094 751691 755168
59040 755168 760616 768241 778264 790644 804993 820836 837723 855038 872043 888262 903522 917561
59028I17561J2515J1241J0741J0585R885Q559P262O159M686K681Q57j33m28n49
59014A001622p62r89r58m41L37P49O79R46K109L232K816P51j684l699n751q332
58998I90625j1008j3048j4228j4785j5151j5855j6991j7803j7505j6426j5551
58987H22274j4980j3876j1968j0120r031q270p043n187l037r40P34J692K200L028
58973G45476M678O958R356J1433J2875J3608J3884J3900J3509J2699J1968J1649
58961H81993J1298J0451R510R003Q514P417O248O052O679P111P300Q130R528J0234
58947I99468R828R474J0120J1286J2148J2641J2909J2919J3249J5007J8159K0970
58935A158178K2013K1854K1998K3005K4519K6389K8736L1440L4364L7753M1709
$$ plain form
59028 917561 930076 941317 952058 962643 972528 981087 988349 994508 999194 1001875 1002732 1002599 1002171 1001622
59014 1001622 1000860 999871 998913 998472 998809 999558 1000237 1001183 1003292 1006524 1009340 1010091 1008407 1004708 998957 990625
58998 990625 979617 966569 952341 937556 922405 906550 889559 871756 854251 837825 822274
58987 822274 807294 793418 781450 771330 762299 754029 746986 741799 738762 737822 738556 740248 742448 745476
58973 745476 750154 757112 766468 777901 790776 804384 818268 832168 845677 858376 870344 881993
58961 881993 893291 903742 913252 922255 930769 938186 944434 950486 957165 964276 971576 979706 989234 999468
58947 999468 1009296 1018770 1028890 1040176 1052324 1064965 1077874 1090793 1104042 1119049 1137208 1158178
58935 1158178 1180191 1202045 1224043 1247048 1271567 1297956 1326692 1358132 1392496 1430249 1471958
58924A471958M5667M9056N2176N5840O0409O5684P1490P7872Q4801R2102R9699
58913B226754J07766J16631J26331J36249J45508J54021J62594J71461J79275
58904C526590J84381J86498J86183J83000J75526J63054J46121J25467J01773
58895D978593P6237N0040K3157m801l2477n7117p7440r4627j09967j23060j33136
58884D495402j40569j46099j49770j51653j52503j52708j51522j48417j44233
58875C157928j40029j35606j30252j24185j18171j12274j06044r9486r2920q6295
58865B012666p9480p2941o7278o2378n7697n3178m9279m6211m3612m0843l7487
58854A402282l3805l0630k8364k6198k3166j9801j7570j6547j5058j2169r152
$$ plain form
58924 1471958 1517625 1566681 1618857 1674697 1735106 1800790 1872280 1950152 2034953 2127055 2226754
58913 2226754 2334520 2451151 2577482 2713731 2859239 3013260 3175854 3347315 3526590
58904 3526590 3710971 3897469 4083652 4266652 4442178 4605232 4751353 4876820 4978593
58895 4978593 5054830 5104870 5128027 5123226 5090749 5033632 4956192 4861565 4751598 4628538 4495402
58884 4495402 4354833 4208734 4058964 3907311 3754808 3602100 3450578 3302161 3157928
58875 3157928 3017899 2882293 2752041 2627856 2509685 2397411 2291367 2191881 2098961 2012666
58865 2012666 1933186 1860245 1792967 1730589 1672892 1619714 1570435 1524224 1480612 1439769 1402282
58854 1402282 1368477 1337847 1309483 1283285 1260119 1240318 1222748 1206201 1191143 1178974 1169822
58843A169822p497o728n282k719J97K994N801Q482J0639J2368J4239J6448J8666
58830A237430K0697K2819K5499K9050L3424L8193M2959M7739N2628N7269O1197
58819A668904O4715O8626P3136P7797Q2583Q8064R4433J01322J08727J17066J26108
58808B671481J35025J43675J52565J61185J67825J71650J73485J73785J71192
58799D121868J64199J53029J38698J21152R9720P4761M7794K0329o540l1897n5239
58788D847874p6599r5902j12546j26001j36262j43535j48241j51450j54202j55993
58778C547143j55266j51868j47681j44089j40315j35181j29085j22959j16546
58769B304153j09239j01663r4891q8754q2348p5574o8990o2670n6448n0798m6163
$$ plain form
58843 1169822 1162325 1155597 1150315 1147596 1147793 1150787 1156588 1165070 1175709 1188077 1202316 1218764 1237430
58830 1237430 1258127 1280946 1306445 1335495 1368919 1407112 1450071 1497810 1550438 1607707 1668904
58819 1668904 1733619 1802245 1875381 1953178 2035761 2123825 2218258 2319580 2428307 2545373 2671481
58808 2671481 2806506 2950181 3102746 3263931 3431756 3603406 3776891 3950676 4121868
58799 4121868 4286067 4439096 4577794 4698946 4798666 4873427 4921221 4941550 4935010 4903113 4847874
58788 4847874 4771275 4675373 4562827 4436826 4300564 4157029 4008788 3857338 3703136 3547143
58778 3547143 3391877 3240009 3092328 2948239 2807924 2672743 2543658 2420699 2304153
58769 2304153 2194914 2093251 1998360 1909606 1827258 1751684 1682694 1620024 1563576 1512778 1466615
58758A466615m1907l7033l1695k6936k3246k0222j7323j4154j0459o557l297r19
58746A232867J412M326P362J0063J2891J5940J7726J6663J3182R161N695K628
58734A349916k81k945n522q247j0832j2825j4343j5806j7336j9043k1288k3998
58722A197450k6307k7645k8485k9396l0203l0805l1850l3509l4464l3346l0627
58711H60813k7984k6314k5332k4495k3378k1673j9646j8016j6809j5187j3030
58700F28949j1512j1213j1034j0036q986q665q171o563m941m844n565n243l888
58687E28288l049k885j839O32L077M197M358M511M902N291N514N540N563N959
58673E70059O727P290P417P579P755O966N022L547L856M765M182K045l0j326k425
$$ plain form
58758 1466615 1424708 1387675 1355980 1329044 1305798 1285576 1268253 1254099 1243640 1237083 1233786 1232867
58746 1232867 1234279 1238605 1245967 1256030 1268921 1284861 1302587 1319250 1332432 1341593 1347288 1349916
58734 1349916 1349635 1346690 1341168 1332921 1322089 1309264 1294921 1279115 1261779 1242736 1221448 1197450
58722 1197450 1171143 1143498 1115013 1085617 1055414 1024609 992759 959250 924786 891440 860813
58711 860813 832829 806515 781183 756688 733310 711637 691991 673975 657166 641979 628949
58700 628949 617437 606224 595190 585154 576168 567503 559332 552769 547828 542984 537419 532176 528288
58687 528288 525239 522354 520515 521147 524224 528421 532779 537290 542192 547483 552997 558537 564100 570059
58673 570059 576786 584076 591493 599072 606827 613793 618815 622362 626218 630983 635165 637210 637180 635854 633429
58658F33429l549m334n047o316p779q527q709r221j0093j0632j0842j1218j1347
58645E25815j0313q327o584n688n449n804o440o062l770q56N35L59N24J915L453
58630D73308M232M823O004P605R158J0613J2143J3885J5880J7714J8782J9564
58618F13711K1725K5805K9962L2415L4010L6601M0060M2959M5346M8310N1472
58607A022376N3440N4487N6012N7375N6015N1235M5316M0111L4828K8159K0538
58596A519892J3106N933j474q974j5895k1631k5670k7834k8702k9059k9030k8469
58584A322193k7761k7196k6023k3510k0413j8026j6260j4144j1681r576p664n344
58572A114595l008j249P18L954P816J1122J4416J8593K2032K1973J8495J4171
$$ plain form
58658 633429 629880 625546 620499 614183 606404 597877 589168 579947 569854 559222 548380 537162 525815
58645 525815 515502 507175 500591 494903 489454 483650 477210 471148 467378 466522 467057 467416 467940 469855 473308
58630 473308 477540 482363 488367 495972 505130 515743 527886 541771 557651 575365 594147 613711
58618 613711 635436 661241 691203 723618 757628 794229 834289 877248 922594 970904 1022376
58607 1022376 1075816 1130303 1186315 1243690 1299705 1350940 1396256 1436367 1471195 1499354 1519892
58596 1519892 1532998 1538931 1537457 1528483 1512588 1490957 1465287 1437453 1408751 1379692 1350662 1322193
58584 1322193 1294432 1267236 1241213 1217703 1197290 1179264 1163004 1148860 1137179 1127603 1119939 1114595
58572 1114595 1111587 1110338 1111056 1115010 1122826 1133948 1148364 1166957 1188989 1210962 1229457 1243628
58560A243628R825L706m823j3786k1400k7681l2517l4961l5326l5543l6418l6795
58548I77909l6195l5832l6083l5381l2874l0007k8249k7177k5947k4718k3535
58537F41911k1571j8631j5775j3583j1476r410q320q077p054m713k681k229k544
58524E15847k535k530k989l320l050k682k408j564k28K97n03j387j239l24Q75
58509D92260K339L406K946J421Q69K002L307L783M415N965P516Q419R634J1728
58495E60010J3483J3873J3791J4453J5730J7154J8898K0510K0433J8177J5445
58484G41957J3787J2568J0337O831K571k057o295r056j0406j1734j3682j5366
58472G19455j6139j6401j6148j4688j2490j1316j1664j2100j1754j1380j1227
$$ plain form
58560 1243628 1253453 1257159 1252336 1238550 1217150 1189469 1156952 1121991 1086665 1051122 1014704 977909
58548 977909 941714 905882 869799 834418 801544 771537 743288 716111 690164 665446 641911
58537 641911 620340 601709 585934 572351 560875 551465 543145 535068 528014 523301 520620 518391 515847
58524 515847 513312 510782 507793 504473 501423 498741 496333 494769 494541 494838 494335 492948 491709 491385 492260
58509 492260 494599 498005 500951 502372 503241 505243 508550 512333 516748 522713 530229 538648 548282 560010
58495 560010 573493 587366 601157 615610 631340 648494 667392 687902 708335 726512 741957
58484 741957 755744 768312 778649 785480 788051 785994 779699 770643 760237 748503 734821 719455
58472 719455 703316 686915 670767 656079 643589 632273 620609 608509 596755 585375 574148
58461E74148j0223q220o617n778m240j620K47L45J10O46Q91J69K7J530L066K869
58445E47350J762J487K133L005M239N828O759O735P005Q036Q397P367O477O846
58431F23426P126N846L748J970L9k441m104l853k811k418k336j846j485j666j516
58416F17679o66j92l22N20K858M723M860M953O656Q853R896J0240J0616J0025
58402F90699P905O035N886O113M944L028J669L93j425k596k194j482j552j193
58388G16230N61K054J718R35J561K705K626J818J572J395M81r1P65J920K092K220
58372G40562L391M556M587M581N621O513O100N536N832N690M279L499M729O057
58358H11533N675N261O854R123J0029J0575J2383J4047J3589J2270J2363J3210
$$ plain form
58461 574148 563925 555705 549088 543310 539070 537450 537697 538042 538152 538798 539689 539858 539885 541415 544481 547350
58445 547350 549112 550599 552732 555737 559976 565804 572563 579298 586303 594339 602736 610103 616580 623426
58431 623426 630552 636398 640146 642116 642155 639714 635610 631757 628946 626528 624192 622346 620861 619195 617679
58416 617679 617013 616821 616499 617019 619877 624600 629460 634413 641069 649922 659818 670058 680674 690699
58402 690699 698604 704639 710525 716638 721582 724610 726279 726672 725247 722651 720457 718975 717423 716230
58388 716230 716791 718845 720563 721498 723059 725764 728390 730208 731780 733175 733656 733565 734330 736250 738342 740562
58372 740562 743953 748509 753096 757677 763298 769811 775911 781447 787279 792969 797248 800747 805476 811533
58358 811533 817208 822469 829323 838446 848475 859050 871433 885480 899069 911339 923702 936912
58346I36912J2886J1632J0507Q929O661N627O586O855M686K756L717N593N661
58333A029008N333O685P587N504L061M289P889R797J0209J2295J5784J7592J7491
58320A152524J7824J8777J8859J8886K0619K2808K3171K2701K3488K4227K2748
58309A386632K0819K1211K2144K0232J6936J6358J8267J9167J8683J9028J9606
58298A599083J8125J5820J5829J7565J8287J8727K1349K4644K5276K4453K6001
58287A825159K9546L1871L3527L7540M2813M5588M6338M8586N2083N3893N5080
58276B302024N9229O5185O8316O8271O8605O9563O8152O4540O1453N8171N2189
58265C005698M5605M2630M2125M0087L7860L9806M4390M6248M5904M8479N3847
$$ plain form
58346 936912 949798 961430 971937 980866 987527 993154 999740 1006595 1011281 1014037 1017754 1023347 1029008
58333 1029008 1034341 1041026 1048613 1054117 1057178 1061467 1069356 1079153 1089362 1101657 1117441 1135033 1152524
58320 1152524 1170348 1189125 1207984 1226870 1247489 1270297 1293468 1316169 1339657 1363884 1386632
58309 1386632 1407451 1428662 1450806 1471038 1487974 1504332 1522599 1541766 1560449 1579477 1599083
58298 1599083 1617208 1633028 1648857 1666422 1684709 1703436 1724785 1749429 1774705 1799158 1825159
58287 1825159 1854705 1886576 1920103 1957643 2000456 2046044 2092382 2140968 2193051 2246944 2302024
58276 2302024 2361253 2426438 2494754 2563025 2631630 2701193 2769345 2833885 2895338 2953509 3005698
58265 3005698 3051303 3093933 3136058 3176145 3214005 3253811 3298201 3344449 3390353 3438832 3492679
58254C492679N7238N8869O3552P1096P6542P9653Q4861R2118R7327J01409J09173
58243D384517J19561J27050J32178J40321J50709J57694J62479J71938J85970
58234E732417J97836K07113K20153K37398K52793K66171K83569L04864L24131
58225H026445L42458L66911L96793M25172M53790M91291N37011N82964O31581
58216A2254416O93844P69977Q51029R39913J050383J184228J331479J494390J687591
58207B2257250J912559K157413K424487K730633L077744L454484L872365M367311
58199D6254246M961219N661219O505155P565198Q896587J0530082J2518203J4904203
58191A17796112J7584032K0228328K2355283K3419683K2850534K0223009J5625880
$$ plain form
58254 3492679 3549917 3608786 3672338 3743434 3819976 3899629 3984490 4076608 4173935 4275344 4384517
58243 4384517 4504078 4631128 4763306 4903627 5054336 5212030 5374509 5546447 5732417
58234 5732417 5930253 6137366 6357519 6594917 6847710 7113881 7397450 7702314 8026445
58225 8026445 8368903 8735814 9132607 9557779 10011569 10502860 11039871 11622835 12254416
58216 12254416 12948260 13718237 14569266 15509179 16559562 17743790 19075269 20569659 22257250
58207 22257250 24169809 26327222 28751709 31482342 34560086 38014570 41886935 46254246
58199 46254246 51215465 56876684 63381839 70947037 79843624 90373706 102891909 117796112
58191 117796112 135380144 155608472 177963755 201383438 224233972 244456981 260082861
58184B60082861R838909L947935j307560n761423r459769j2281944j4010513j4621218
58176B16427278j4341489j3480513j2340277j1257205j0553684j0360129j0536255
58169A33557726j0809236j0962900j0897977j0590344j0055812r338990q495118
58162F2407349p575912o635818n733378m911276m184252l553400l019698k577191
58154B4216424k208022j895396j633052j415877j231699j069797r28830q09141
58146A3024610p04482o07786n18609m38466l64111k91412k21771j58866j01850
58137I617257m6756P496N9485J10732J66018K27643K93643L63926M44528N42019
58127A1785991O57153P90530R52908J161764J428338J759354K171482K683879
$$ plain form
58184 260082861 269921770 273869705 272562145 266800722 257340953 245059009 231048496 216427278
58176 216427278 202085789 188605276 176264999 165007794 154454110 144093981 133557726
58169 133557726 122748490 111785590 100887613 90297269 80241457 70902467 62407349
58162 62407349 54831437 48195619 42462241 37550965 33366713 29813313 26793615 24216424
58154 24216424 22008402 20113006 18479954 17064077 15832378 14762581 13833751 13024610
58146 13024610 12320128 11712342 11193733 10755267 10391156 10099744 9877973 9719107 9617257
58137 9617257 9570501 9577997 9637482 9748214 9914232 10141875 10435518 10799444 11243972 11785991
58127 11785991 12443144 13233674 14186582 15348346 16776684 18536038 20707520 23391399
58119B3391399L281211L891070M401555M682637M590074M007373K953694J645835
58111E2844848L86709o40913j446775k103348k606132k896099k963593k863502
58103C7711195k649596k359479k063310j862950j813204j874002j959095k008957
58095B1120602k005566j947814j840885j698279j534029j355903j173572j003605
58087H560949q57602p33818o27319n39186m69385m10518l56463l09363k71840
58078C985455k40346k12006j89993j76026j65024j52972j42806j37075j31859
58069B437348j23568j14924j08751j02250r2839q3470p6988p1097o3875n8368
58059A541218n6677n5196n0800m6290m4691m3511l9778l5767l4477l3922l1134
$$ plain form
58119 23391399 26672610 30563680 34965235 39647872 44237946 48245319 51199013 52844848
58111 52844848 53231557 52590644 51143869 49040521 46434389 43538290 40574697 37711195
58103 37711195 35061599 32702120 30638810 28775860 26962656 25088654 23129559 21120602
58095 21120602 19115036 17167222 15326337 13628058 12094029 10738126 9564554 8560949
58087 8560949 7703347 6969529 6342210 5803024 5333639 4923121 4566658 4257295 3985455
58078 3985455 3745109 3533103 3343110 3167084 3002060 2849088 2706282 2569207 2437348
58069 2437348 2313780 2198856 2090105 1987855 1895016 1811546 1734558 1663461 1599586 1541218
58059 1541218 1484541 1429345 1378545 1332255 1287564 1244053 1204275 1168508 1134031 1100109 1068975
58048A068975k7641k6061k5023k2225j9122j8113j8299j7943j7887j8890j8879
58037H38892j6512j4153j3927j4159j3008j2070j2930j3686j2470j1166j2025
58026F92786j3548j3223j1479r885q222o242n342n786n343l322k581m753p014
58013E96046o584m939m302l586j328P45R08J103L561O504P076O117O132O764O081
57998F20298M534L887L693K199l89k491l829n029n872o184o907q321q934q097
57984E78558p710r208j0995j1123j0378j0401j0822j0554j0028r885r348p986
57972D60120p070p240o899n017l225l031l220k210p02J88J185K838L572K188J88
57957D31665o61j086k354l669l805l291k988k495j849k369l908m021j888j73o87
$$ plain form
58048 1068975 1041334 1015273 990250 968025 948903 930790 912491 894548 876661 857771 838892
58037 838892 822380 808227 794300 780141 767133 755063 742133 728447 715977 704811 692786
58026 692786 679238 666015 654536 644651 636429 630187 624845 619059 613716 610394 607813 603060 596046
58013 596046 589462 584523 580221 576635 575307 576052 576960 578063 581624 588128 595204 601321 607453 614217 620298
57998 620298 624832 628719 632412 634611 634222 631731 627902 622873 617001 610817 603910 595589 586655 578558
57984 578558 570848 561640 550645 539522 529144 518743 507921 497367 487339 477454 468106 460120
57972 460120 453050 445810 438911 433894 430669 427638 424418 422208 421506 421694 422879 425717 429289 431477 431665
57957 431665 431004 429918 427564 423895 420090 416799 413811 411316 409467 407098 403190 399169 397281 397108 396421
57942C96421j364j73J248R54M99J813L262K703J823L312N854O238M689L978M556
57927D35813M691M329M830N721N306L919L203K980J954O02J43l74k588n337o085
57912D59107n128n042o464p761q375r176r849r135p596p123p816q071p610p597
57898C52364q087q013p482p438p378o027l994l017k984k342j082n67o50J52J833
57883B95288L031L791N340P196P413N897M635M434M090L050K233J819Q23o52j271
57868C47117r85j317k563l144k308j297j068j019o35n05r11j142q84p41r08p66
57852C26924j01P44J987M013N889O111N064M782N992P204P220O663O443O262N494
57837D00691M224K885J691P99J34q87k543l994m384m252m611n175m966m217l963
$$ plain form
57942 396421 395057 394884 396132 397086 397585 399398 402660 405363 407186 410498 416352 422590 427279 431257 435813
57927 435813 440504 444833 449663 455384 460690 464609 467812 470792 472746 473348 473491 473117 470529 465192 459107
57912 459107 453979 448937 442473 434712 426337 417161 407312 398177 390581 383458 375642 367571 359961 352364
57898 352364 344277 336264 328782 321344 313966 307939 303945 300928 297944 295602 294520 293953 293303 293455 295288
57883 295288 298319 302110 307450 314646 322059 327956 332591 337025 341115 344165 346398 348217 349040 348388 347117
57868 347117 346132 344815 342252 339108 336800 335503 334435 333416 332781 332276 331365 330223 329339 328598 327690 326924
57852 326924 326823 327567 329554 333567 339456 345567 350631 355413 361405 368609 375829 382492 388935 395197 400691
57837 400691 404915 407800 409491 410290 410424 409537 406994 403000 398616 394364 389753 384578 379612 375395 371432
57822C71432m094l623k477j476q18k84m04j653k894k699j736j783k738k915k068
57807C39770j705k324k757k586k842l813m359l934l462l541l606l349l251l347
57793B94894l056k528k516k691j894j81J207J998L075M341M557L656L068L289
57779C07219L262K778L189M909O276N998N062N152O636Q882J1074J2142J1375
57766C93954R799R345J0087R982P886N073K963J238q41k833m018m575m937n069
57752D28054n098n513o194o399o067n860n719m960l949l852m442m172k833j999
57738C60997k187j906m75N87K43k71J78O02l7o92j39O15n3j605k220j504m53M68
57720C52148J477K345K697K938L536L995L760L390L566L677K867J844K178M049
$$ plain form
57822 371432 367338 363715 361238 359762 358944 358660 358256 356603 353709 351010 349274 347491 344753 341838 339770
57807 339770 338065 335741 332984 330398 327556 323743 319384 315450 311988 308447 304841 301492 298241 294894
57793 294894 291838 289310 286794 284103 282209 282028 283235 285233 288308 292649 297206 300862 303930 307219
57779 307219 310481 313259 316448 321357 327633 333631 338693 343845 350481 359363 370437 382579 393954
57766 393954 403753 413098 423185 433167 441053 446126 449089 450327 449486 446653 442635 438060 433123 428054
57752 428054 422956 417443 411249 404850 398783 392923 387204 382244 378295 374443 370001 365829 362996 360997
57738 360997 358810 356904 356429 357016 357259 356988 357166 357768 357731 357039 356900 357515 357462 355857 353637 352133 351680 352148
57720 352148 353625 355970 358667 361605 365141 369136 372896 376286 379852 383529 386396 388240 390418 394467
57706C94467O030O969P088P337Q461J0580J3090J5220J6978J9009K1270K2704
57694E49203K2623K1398J9407J6447J2875J0106R023Q956Q992R301J0351J2054
57682G10736J4532J8446K3476K7808L0466L2934L7116M2819M8720N4709O1519
57671A103281O8930P6120Q3206R0605R7376J01906J03788J03083R7987Q5387O4449
57660B076118L8278J1405j3347l5231n3989o8808p8670q3242q3411q0707p6255
57649A552141p0812o5797o3035o2782o3075o2026n9889n7752n5289n1396m6374
57638H93914m1663l7530l2756k6747k0592j5618j1981r008o070k923J11K231L206
57625F94574M208O647J0251J3333J5071J6471J8743K1742K4587K7054K9627L2558
$$ plain form
57706 394467 400497 407466 414554 421891 430352 440932 454022 469242 486220 505229 526499 549203
57694 549203 571826 593224 612631 629078 641953 652059 661082 670038 679030 688331 698682 710736
57682 710736 725268 743714 767190 794998 825464 858398 895514 938333 987053 1041762 1103281
57671 1103281 1172211 1248331 1331537 1422142 1519518 1621424 1725212 1828295 1926282 2011669 2076118
57660 2076118 2114396 2125801 2112454 2077223 2023234 1954426 1875756 1792514 1709103 1628396 1552141
57649 1552141 1481329 1415532 1352497 1289715 1226640 1164614 1104725 1046973 991684 940288 893914
57638 893914 852251 814721 781965 755218 734626 719008 707027 698019 691949 689026 689137 691368 694574
57625 694574 698782 705429 715680 729013 744084 760555 779298 801040 825627 852681 882308 914866
57613I14866L5489L7911L9677M0959M1767M1642M0025L6935L2796K7522K0473
57602A310062J1782L038m137r771j5022k0373k5228k9074l1994l4020l4896l4794
57590A085573l4530l4766l5384l5829l5615l4461l2449l0159k8242k6694k4957
57579G32487k2799k0664j8940j7344j5369j3109j1225j0145r507q604p175n591
57567E72015m227l030j907j135r11p08K21J713K758K883K817L454M661N521N405
57552E89530M513L609L474M310N527O353O611O629O529O216O007O480P636Q782
57538F72206R419R640R651R639J0043J1086J1979J1676J0532J0136J1192J2735
57526G99934J3849J4868J6292J7732J8841K0239K2583K5401K7729K9201K9904
$$ plain form
57613 914866 950355 988266 1027943 1068902 1110669 1152311 1192336 1229271 1262067 1289589 1310062
57602 1310062 1321844 1324882 1320745 1310974 1295952 1275579 1250351 1221277 1189283 1155263 1120367 1085573
57590 1085573 1051043 1016277 980893 945064 909449 874988 842539 812380 784138 757444 732487
57579 732487 709688 689024 670084 652740 637371 624262 613037 602892 593385 584781 577606 572015
57567 572015 567788 564758 562851 561716 560805 560097 560318 562031 564789 567672 570489 573943 578604 584125 589530
57552 589530 594043 597652 601126 605436 610963 617316 623927 630556 637085 643301 649308 655788 663424 672206
57538 672206 681625 691265 700916 710555 720598 731684 743663 755339 765871 776007 787199 799934
57526 799934 813783 828651 844943 862675 881516 901755 924338 949739 977468 1006669 1036573
57515A036573K9900K9490K9092K8279K5938K1929J7441J3003P627R36n326r354
57503A225528j1625j3588j5246j5859j6107j7340j9125j9658j8575j7438j7268
57492A043699j7294j6500j4995j3413j2112j1248j0620r357o819l873k151k027
57480I23290k260j750m80J218L107M507M573L582K954L658N345P248R093J0922
57466I75007J2881J5420J8887K2757K6106K8820L1529L4258L6238L7232L8021
57455A277156L9156M0058L9790L8010L4898L0903K6726K2847J8856J3964Q309
57444A590673K937j550n458r023j1960j4300j6519j8530j9484j9158j8563j8522
57432A440543j8538j7780j6508j5600j5141j4270j2293r415o511m456l461k833
$$ plain form
57515 1036573 1066473 1095963 1125055 1153334 1179272 1201201 1218642 1231645 1239272 1240208 1234882 1225528
57503 1225528 1213903 1200315 1185069 1169210 1153103 1135763 1116638 1096980 1078405 1060967 1043699
57492 1043699 1026405 1009905 994910 981497 969385 958137 947517 938160 931341 927468 925317 923290
57480 923290 921030 919280 918800 920018 923125 927632 932205 935787 938741 942399 947744 954992 964085 975007
57466 975007 987888 1003308 1022195 1044952 1071058 1099878 1131407 1165665 1201903 1239135 1277156
57455 1277156 1316312 1356370 1396160 1434170 1469068 1499971 1526697 1549544 1568400 1582364 1590673
57444 1590673 1593610 1592060 1586602 1577579 1565619 1551319 1534800 1516270 1496786 1477628 1459065 1440543
57432 1440543 1422005 1404225 1387717 1372117 1356976 1342706 1330413 1320998 1314487 1310031 1306570 1303737
57420A303737j619L54K429M084N424O600P335P450P413P924R133J0461J1135J0915
57406A392775J0520J1083J2841J4620J5178J4739J4508J4982J5689J6363J7223
57395A550521J8054J8240J7987J8359J9660K0837K1070K0914K1222K1849K2270
57384A770983K2643K3323K3850K3495K2507K1918K2208K2804K2977K2634K2267
57373B021609K2353K2888K3376K3391K3032K2563K1824K0633J9629J9801K0927
57362B262026K1534K0849J9887J9889K0541K0680K0125J9771K0189K1228K2725
57351B489444K4610K6371K7328K7605K7948K8526K8745K8549K8997L0922L3682
57340B802727L5979L7509L9002M0811M2383M3259M3835M4641M5497M5990M6318
$$ plain form
57420 1303737 1302118 1302472 1304901 1308985 1314409 1321009 1328344 1335794 1343207 1351131 1360264 1370725 1381860 1392775
57406 1392775 1403295 1414378 1427219 1441839 1457017 1471756 1486264 1501246 1516935 1533298 1550521
57395 1550521 1568575 1586815 1604802 1623161 1642821 1663658 1684728 1705642 1726864 1748713 1770983
57384 1770983 1793626 1816949 1840799 1864294 1886801 1908719 1930927 1953731 1976708 1999342 2021609
57373 2021609 2043962 2066850 2090226 2113617 2136649 2159212 2181036 2201669 2221298 2241099 2262026
57362 2262026 2283560 2304409 2324296 2344185 2364726 2385406 2405531 2425302 2445491 2466719 2489444
57351 2489444 2514054 2540425 2567753 2595358 2623306 2651832 2680577 2709126 2738123 2769045 2802727
57340 2802727 2838706 2876215 2915217 2956028 2998411 3041670 3085505 3130146 3175643 3221633 3267951
57329C267951M6896M7377M6975M5804M4930M4804M4619M3757M3004M3546M5358
57318C765021M7407M8959M9880N0100M9742M9488M9887N0531N0791N0938N1576
57307D314320N2252N2001N1142N1168N2561N4046N4449N4145N4152N4969N6748
57296D901953N9566O2762O5049O6091O7218O9659P2795P4944P5290P4300P2856
57285E662483P1785P1607P1829P0977O8349O5256O3566O3341O3028O1872O0871
57274F394964O1086O2058O2558O2188O1652O1699O2420O3458O4395O4674O3583
57263G084735O0818N7083N3554N0492M6814M1604L5642L0691K7517K5473K3990
57252G538413K3318K3580K4124K4454K4991K6321K8305L0543L3055L5862L8465
$$ plain form
57329 3267951 3314847 3362224 3409199 3455003 3499933 3544737 3589356 3633113 3676117 3719663 3765021
57318 3765021 3812428 3861387 3911267 3961367 4011109 4060597 4110484 4161015 4211806 4262744 4314320
57307 4314320 4366572 4418573 4469715 4520883 4573444 4627490 4681939 4736084 4790236 4845205 4901953
57296 4901953 4961519 5024281 5089330 5155421 5222639 5292298 5365093 5440037 5515327 5589627 5662483
57285 5662483 5734268 5805875 5877704 5948681 6017030 6082286 6145852 6209193 6272221 6334093 6394964
57274 6394964 6456050 6518108 6580666 6642854 6704506 6766205 6828625 6892083 6956478 7021152 7084735
57263 7084735 7145553 7202636 7256190 7306682 7353496 7395100 7430742 7461433 7488950 7514423 7538413
57252 7538413 7561731 7585311 7609435 7633889 7658880 7685201 7713506 7744049 7777104 7812966 7851431
57241G851431M0478M2341M4721M7596N0486N3180N5567N7205N7786N7770N7822
57230H416383N7884N7513N6843N6397N6082N5112N3025N0049M6468M2206L7225
57219H985187L1890K6673K1722J6799J1513N734r9n291r602j3403j6915j9798
57207I034410k1705k2618k2388k0579j7450j4324j2216j0552q155n047k321n26
57195H876529O76J298P52j014l091m692n895o897p340o885n936n148m583l794
57181H823980k645j641j364j694j689m09K057M624O500Q065J0110J2608J4902
57168H873404J6727J8240J9157J8732J6613J2896P296p74j0970k1815l2173m2238
57156H875095n2619o3188p3410q3035r1702r8339j01830j02081r9756r5240q8492
$$ plain form
57241 7851431 7891909 7934250 7978971 8026567 8077053 8130233 8185800 8243005 8300791 8358561 8416383
57230 8416383 8474267 8531780 8588623 8645020 8701102 8756214 8809239 8859288 8905756 8947962 8985187
57219 8985187 9017077 9043750 9065472 9082271 9093784 9099518 9099419 9094128 9084526 9071123 9054208 9034410
57207 9034410 9012705 8990087 8967699 8947120 8929670 8915346 8903130 8892578 8884423 8879376 8877055 8876529
57195 8876529 8877205 8878503 8879255 8878241 8875150 8870458 8864563 8857666 8850326 8843441 8837505 8832357 8827774 8823980
57181 8823980 8821335 8819694 8818330 8816636 8814947 8814538 8816595 8821219 8827719 8835784 8845894 8858502 8873404
57168 8873404 8890131 8908371 8927528 8946260 8962873 8975769 8983065 8982291 8971321 8949506 8917333 8875095
57156 8875095 8822476 8759288 8685878 8602843 8511141 8412802 8310972 8208891 8109135 8013895 7925403
57145G925403p9827p0174o0522n1496m3408l6454l1084k8544l0517l7523m7790
57134G408064n8484o7848p5526q0953q2518p8832p0253n8670m6036l3487k1769
57123F733688j2263p180q073j3914k1325k7274l0952l2203k9207j9536l386J6009
57111F544384L5405N3670P0846Q7374J05063J27026J55405J90382K32161K82199
57101G883915L41614M10400M89547N82102O90937Q17925R66109J138557J332259
57092A4653365J537057J743454J946335K138602K314842K497549K750987L136695
57084C2718886L634766M121008M444470M533191M419856M171985L812359L308132
57076F5164653K624535J785423Q90681P5148n66379j029451j378260j673692j928688
$$ plain form
57145 7925403 7845576 7775402 7714880 7663384 7619976 7583522 7552438 7523894 7493377 7455854 7408064
57134 7408064 7349580 7281732 7206206 7125253 7042735 6963903 6893650 6834980 6788944 6755457 6733688
57123 6733688 6721425 6714245 6706172 6692258 6670933 6643659 6612707 6580504 6551297 6531761 6528375 6544384
57111 6544384 6579789 6633459 6704305 6791679 6896742 7023768 7179173 7369555 7601716 7883915
57101 7883915 8225529 8635929 9125476 9707578 10398515 11216440 12182549 13321106 14653365
57092 14653365 16190422 17933876 19880211 22018813 24333655 26831204 29582191 32718886
57084 32718886 36353652 40474660 44919130 49452321 53872177 58044162 61856521 65164653
57076 65164653 67789188 69574611 70465292 70540440 69974061 68944610 67566350 65892658 63963970
57067F3963970k132635k299539k471855k679246k909978l127327l302755l426765
57059D1613870l496454l504397l441061l303265l098775k844817k562825k273030
57051A7089246j991661j730537j496748j292421j116238r65848q38532p30594
57043F926667o38169n58988m92044m35558l86767l43829l06582k75075k48439
57034C241216k25430k05013j86338j69057j53619j40340j28440j16975j06203
57025A809801r6827q8376p9940p2117o6435o2818n9383n5000n0473m6875m4154
57014A087403m1843l9710l7300l4064l0496k7947k6799k5831k3845k1042j8317
57003G60209j6061j4109j2186j0091p903o051m769l705k611j851j411j49K750
$$ plain form
57067 63963970 61831335 59531796 57059941 54380695 51470717 48343390 45040635 41613870
57059 41613870 38117416 34613019 31171958 27868693 24769918 21925101 19362276 17089246
57051 17089246 15097585 13367048 11870300 10577879 9461641 8495793 7657261 6926667
57043 6926667 6288498 5729510 5237466 4801908 4415141 4071312 3764730 3489655 3241216
57034 3241216 3015786 2810773 2624435 2455378 2301759 2161419 2032979 1916004 1809801
57025 1809801 1712974 1624598 1544658 1472541 1406106 1343288 1283905 1228905 1178432 1131557 1087403
57014 1087403 1045560 1005850 968550 934486 903990 876043 849244 823413 799568 778526 760209
57003 760209 744148 730039 717853 707762 699859 693808 689039 685334 682723 680872 679461 679312 682062
56990F82062O225Q741J0756J4128J9288K4635K8684L1245L2654L3441L4727L7247
56978I63833M0113M2284M5032N1005O0925P3455Q8387J07655J32844J64050K01592
56967A971175K46374K97652L51926M03008M39863M45731M06891L26639K26445
56958E115704J28427L8811m7717j30964j99454k41379k55242k47994k28011k03398
56948C728783j83368j75646j81397j94617k07207k14133k14396k08891j98445
56939A950683j83527j64972j44281j23109j02711q3980o7618n4046m3488l6253
56929I46698l2440l1297l1537l2487l4142l5913l6480l5340l3489l1762k9632
56918E82179k6500k3199k1030k0163j9938k0042k0241j9814j8479j7147j6554
$$ plain form
56990 682062 688287 697028 707784 721912 741200 765835 794519 825764 858418 891859 926586 963833
56978 963833 1003946 1046230 1091262 1142267 1203192 1276647 1365034 1472689 1605533 1769583 1971175
56967 1971175 2217549 2515201 2867127 3270135 3709998 4155729 4562620 4889259 5115704
56958 5115704 5244131 5282942 5235225 5104261 4904807 4663428 4408186 4160192 3932181 3728783
56948 3728783 3545415 3369769 3188372 2993755 2786548 2572415 2358019 2149128 1950683
56939 1950683 1767156 1602184 1457903 1334794 1232083 1148103 1080485 1026439 982951 946698
56929 946698 914258 882961 851424 818937 784795 748882 712402 677062 643573 611811 582179
56918 582179 555679 532480 511450 491287 471349 451307 431066 411252 392773 375626 359072
56907C59072j5828j3839j1190r394q512p321n436l669k321q05J005K574M004O086
56893B94426Q751J0922J2207J3522J5506J7522J8699J8968J8486J7044J4600J1645
56881D72298Q550N239J922n75j766k156k442k543j909m33J430L195M781O590R227
56866E01408J2901J7136K1312K5412K9741L3900L6483L5909L1467K3775J4514
56855G83958N509k309q865j3851j6394j6237j4414j2031r102n462j968N04K697
56842F92035O119J0932J6218K2149L0092M0203N0424N8290O2362O1576N4892M2753
56830A148045K7693J2435j957j5258k6429l4054l7870l8798l7636l4659l0457
56819I31055k6276k3218k1477k0358j8780j5655j0231k463O705J5556K2471K6843
$$ plain form
56907 359072 343244 329405 318215 308821 300309 292988 287552 283883 281562 280757 281762 284336 288340 294426
56893 294426 303177 314099 326306 339828 355334 372856 391555 410523 429009 446053 460653 472298
56881 472298 480848 486087 488009 487434 485668 483512 481070 478527 476618 476185 477615 480810 485591 492181 501408
56866 501408 514309 531445 552757 578169 607910 641810 678293 714202 745669 769444 783958
56855 783958 789467 787158 778293 764442 748048 731811 717397 705366 696264 690802 688834 689338 692035
56842 692035 698154 709086 725304 747453 777545 817748 868172 926462 988824 1050400 1105292 1148045
56830 1148045 1175738 1188173 1186216 1170958 1144529 1110475 1072605 1033807 996171 961512 931055
56819 931055 904779 881561 860084 839726 820946 805291 795060 792597 799302 814858 837329 864172
56807H64172K8815K8033K3326J4256K546q970j8615k6414l2650l6937l8751l8037
56795G60774l5108l0740k6379k3412k1969k1182k0437j9517j7593j3538p543j279
56783E22077M046Q555J2086J3126J0549N432r0n151j0228j5331j9472k1892k2784
56770D80923k2696k1919k0650j9222j8068j7623j8152j9320k0249k0331j9768
56759B62925j8902j7511j5293j2734j0759r622q819p981p186o402n372m274l791
56746A34279m127m470l995l023k605l065l607l390k457j304j98O41O48m33j681
56731A01213j675k70J045R17l29j366j444q65l54m95j336k086j698j85J145J290
56715I3507O46j06j257l099m584m390k970j981j876j617p96l31o70q45p0R93J379
$$ plain form
56807 864172 892987 921020 944346 958602 961148 952178 933563 907149 874499 837562 798811 760774
56795 760774 725666 694926 668547 645135 623166 601984 581547 562030 544437 530899 523356 522077
56783 522077 526123 534678 546764 559890 570439 575871 575781 570630 560402 545071 525599 503707 480923
56770 480923 458227 436308 415658 396436 378368 360745 342593 323273 303024 282693 262925
56759 262925 244023 226512 211219 198485 187726 178104 169285 161304 154118 147716 142344 138070 134279
56746 134279 130152 125682 121687 118664 116059 112994 109387 105997 103540 102236 102038 102679 103327 102894 101213
56731 101213 99538 99268 100313 101230 100901 99535 98091 97226 96872 96377 95041 92955 91257 91072 92217 93507
56715 93507 94153 94047 92790 89691 85107 80717 77747 75766 73890 72273 71477 71146 70476 69631 69561 70554 71933
56698G1933J238J277J610J896J984J723Q28m65j205q20J08O20M33j93q90j045
56682G9032p0J664K806K708K348K839L732L819L004K346K382K571K435K319K683
56667A16618L240L244K461J514J242J753K298K181J543R87O38J37n83j168j519
56652A34586j906k359k555k469k438k481k240j737j420j308q93j69J51k30p33
56637A11799q95j011j281j375j210j276j604j424m91K10n8n96m54M5J56K83J377
56620A02195L136M098L517K122J081Q49J101J219Q98N90J026K089K723K341J609
56605A30594J325J362J375J609K113K098J232P09J647L086L124J724P00J016J759
56590A55473J959J914K111K160J593P93M03M65O61R05J190J358J388J564K011
$$ plain form
56698 71933 73171 74448 76058 77954 79938 81661 82489 82024 80819 79999 80107 80727 81160 80967 80077 79032
56682 79032 78962 80626 83432 86140 88488 91327 95059 98878 101882 104228 106610 109181 111616 113935 116618
56667 116618 119858 123102 125563 127077 128319 130072 132370 134551 136094 137081 137719 137856 137273 136105 134586
56652 134586 132680 130321 127766 125297 122859 120378 118138 116401 114981 113673 112780 112611 112762 112532 111799
56637 111799 110904 109893 108612 107237 106027 104751 103147 101723 101232 101442 101384 100788 100334 100379 100535 100818 102195
56620 102195 105331 109429 112946 115068 116149 116998 118099 119318 120216 120806 121832 123921 126644 128985 130594
56605 130594 131919 133281 134656 136265 138378 140476 141708 142417 144064 147150 150274 151998 152698 153714 155473
56590 155473 157432 159346 161457 163617 165210 166003 166406 166871 167532 168437 169627 170985 172373 173937 175948
56575A75948K439K555K349J802P98m03j096r33l82L8O38K040L926M987M466L321
56559B02493L266M727O397O991O762O746P126P282P136P384Q174Q592P933O721
56545B97730N915N656N347M625L793L429L740M147L707K292R89O45M45r08k984
56530C38568m087l937m080n229o031n435m524m796n962o863p382q024q508q255
56516B55455p563p038o563n898n447n291m466k592j213j940m029n393n334m689
56502A87999m027l385l192l682l851k784j477j573k760l348l012k803k768j883
56488A47454m46j33j255k082j529n53j52J22Q21J379J157M34l59j151j507p23
56472A41477Q10J744J796K178L425M401M165L320K659J911Q65L45R72J994K421
$$ plain form
56575 175948 178387 180942 183291 185093 185891 185488 184392 183459 183077 183115 183753 185793 189719 194706 199172 202493
56559 202493 205759 210486 216883 223874 230636 237382 244508 251790 258926 266310 274484 283076 291009 297730
56545 297730 303645 309301 314648 319273 323066 326495 330235 334382 338089 340381 341370 342015 342460 341552 338568
56530 338568 334481 330544 326464 321235 315204 309769 305245 300449 294487 287624 280242 272218 263710 255455
56516 255455 247892 240854 234291 228393 222946 217655 213189 210597 209384 207444 203415 198022 192688 187999
56502 187999 183972 180587 177395 173713 169862 167078 165601 164028 161268 157920 154908 152105 149337 147454
56488 147454 147008 146875 145620 143538 142009 141456 141304 141426 142247 143626 144783 145217 144858 143707 142200 141477
56472 141477 142287 144031 145827 148005 151430 155831 159996 163316 165975 167886 168751 169096 170068 172062 174483
56457A74483K335K253K168K173K855M145M823M243L509L806M557M522L860L715
56443B23447M267M584M112L199K297J622J435J809K201K009J463J367K070L168
56429B59050L979L972L079J920J358J408J095j99j756k431k076j418r48o52o61
56414B65720j368k736l885l769k338q96r19k424l978m607n007o188p630q012p294
56399B04669o693o713o696o365o263o326n609l946k553k159j942j158n83j230
56385A46433k593l311k887j814n82M82J066J316J950L182M114L959L206K708K282
56370A59511J265J2k80Q68K641L966M346L785K574J394J057J790K827L040K132
56355A90928J119J283K562L541L294K545K366K568K391K089K447L100K850J688
$$ plain form
56457 174483 176818 179071 181239 183412 186267 190412 195235 199478 202987 206793 211350 215872 219732 223447
56443 223447 227714 232298 236410 239609 241906 243528 244963 246772 248973 250982 252445 253812 255882 259050
56429 259050 263029 267001 270080 272000 273358 274766 275861 275662 273906 271475 269399 267981 267033 266381 265720
56414 265720 264352 261616 257731 253962 251624 250728 249809 247385 243407 238800 233793 227605 219975 211963 204669
56399 204669 197976 191263 184567 178202 171939 165613 160004 156058 153505 151346 149404 148246 147663 146433
56385 146433 143840 140529 137642 135828 135246 135728 136794 138110 140060 143242 147356 151315 154521 157229 159511
56370 159511 160776 160788 160508 161376 164017 167983 172329 176114 178688 180082 181139 182929 185756 188796 190928
56355 190928 192047 193330 195892 199433 202727 205272 207638 210206 212597 214686 217133 220233 223083 224771
56341B24771Q95R94J073N23m1l0K13L82Q69J885K883L399L529L262K454J669J863
56324B50593K846L340K899K515K918L636M165M636M873M244L074K709L542M429
56310C00419M626M785N256N186M195L351L346L288K442J693J968K607K566K069
56296C47797J801J584J073O73O44L92l76q96o92m52o53p32m94q06j803k172j354
56279C43534p10j149j510q99o07j735k811k044m09N7l68M2J314K085K240K701
56263C39731L204K761J881J920K675K901K854L894N742O557N905N400O055P014
56249C98494P343P304P338P264O890O327N542M705M700O133Q058Q986Q807Q488
56235D96379Q316P926P604P952Q576Q650Q444Q724R017Q223O725O020O314O215
$$ plain form
56341 224771 225666 226660 227733 228256 228215 228185 228398 228780 229649 231534 234417 237816 241345 244607 247061 248730 250593
56324 250593 253439 256779 259678 262193 265111 268747 272912 277548 282421 286665 289739 292448 295990 300419
56310 300419 305045 309830 315086 320272 324467 327818 331164 334452 336894 338587 340555 343162 345728 347797
56296 347797 349598 351182 352255 352928 353572 353964 353588 352692 352000 351548 350895 350163 349669 348863 347060 344888 343534
56279 343534 342824 341675 340165 339266 338659 336924 334113 332069 331660 331717 331349 331391 332705 334790 337030 339731
56263 339731 342935 345696 347577 349497 352172 355073 357927 361821 367563 374120 380025 385425 391480 398494
56249 398494 405837 413141 420479 427743 434633 440960 446502 451207 455907 462040 470098 479084 487891 496379
56235 496379 504695 512621 520225 528177 536753 545403 553847 562571 571588 579811 586536 592556 598870 605085
56221F05085N010L579K809K523K262J870J108j48j244j298m81J70O1p24k150l998
56205F14434n308n222m269l747m078m639m882m683m034l232k885k950k555j439
56191E60511n67m28j02Q51J118k11j673j441j07N51M52Q04J694K156K051J914
56175E67573J654J119J110K040K693K125J674K857M476M312K688J815K336L109
56161F01581L841N282P172Q411Q990R575R627Q198O077N013N327O307Q072J0804
56147G04277J3159J3903J4219J5791J7791J8495J8665K0179K2400K3365K3717
56136I05961K5820K9484L2302L3960L6577M0900M5744N1157N8595O7791P7138
56125A405429Q7230J00443J16656J32926J47732J61798J74283J81974J83336J80132
$$ plain form
56221 605085 610095 613674 616483 619006 621268 623138 624246 624098 622854 621556 621075 621245 621306 620582 618432 614434
56205 614434 609126 603904 599635 595888 591810 587171 582289 577606 573572 570340 567455 564505 561950 560511
56191 560511 559944 559516 559414 560265 561383 561172 559499 558058 557951 558502 558954 559758 561452 563608 565659 567573
56175 567573 569227 570346 571456 573496 576189 578314 579988 582845 587321 591633 594321 596136 598472 601581
56161 601581 605422 610704 617876 626287 635277 644852 654479 662677 668754 673767 679094 685401 693473 704277
56147 704277 717436 731339 745558 761349 779140 797635 816300 836479 858879 882244 905961
56136 905961 931781 961265 993567 1027527 1064104 1105004 1150748 1201905 1260500 1328291 1405429
56125 1405429 1492659 1593102 1709758 1842684 1990416 2152214 2326497 2508471 2691807 2871939
56115B871939J74171J65617J55282J45437J37135J29230J20523J10540R8316Q3426
56105D191616O8080N4983M3199K9508J3548k209j7406l4460n3946p3543r2051
56094D127319j10229j27094j39721j47699j53589j57994j58359j53727j46472
56085B832435j38212j28248j17315j08442j02482r6774q9809q3251p7932p1959
56075A818011o4366n6740m9758m2059l3841k7502k3324j8716j3041q781o560l708
56063A469615O00L572M025M690P192R374R795J0320J2120J3555J4113J5878J8997
56050A593846K0507J9875K0773K4901K8955L0264L0574L1664L2198L1656L2420
56039A897633L5146L6905L6527L6840L9014M0097L8883L8585M0715M1983M0678
$$ plain form
56115 2871939 3046110 3211727 3367009 3512446 3649581 3778811 3899334 4009874 4108190 4191616
56105 4191616 4259696 4314679 4357878 4387386 4400934 4398725 4381319 4346859 4292913 4219370 4127319
56094 4127319 4017090 3889996 3750275 3602576 3448987 3290993 3132634 2978907 2832435
56085 2832435 2694223 2565975 2448660 2340218 2237736 2140962 2051153 1967902 1889970 1818011
56075 1818011 1753645 1696905 1647147 1605088 1571247 1543745 1520421 1501705 1488664 1479883 1473323 1469615
56063 1469615 1470215 1473787 1477812 1482502 1489694 1499068 1508863 1519183 1531303 1544858 1558971 1574849 1593846
56050 1593846 1614353 1634228 1655001 1679902 1708857 1739121 1769695 1801359 1833557 1865213 1897633
56039 1897633 1932779 1969684 2006211 2043051 2082065 2122162 2161045 2199630 2240345 2282328 2323006
56028B323006M0334M3451M7232M9226N1569N5807N9179N9973O1153O4762O8288
56017B923980P0166P3098P8211Q2067Q3273Q5654R1102R5958R8570J03196J11879
56006C897154J19773J23497J26800J32891J38767J42557J48568J59176J69474
55997E158657J76084J83458J95301K07833K17962K29755K46140K62659K76338
55988G154187K92071L13367L35919L57191L82524M14548M47197M77874N14098
55979A0688976N60044O08927O57654P15668P89433Q72381R60976J065735J194559
55970A8114353J341265J503408J693752J919588K169682K437945K739917L088537
55962C5008447L477104L907602M411588N020120N742218O602475P669287R011602
$$ plain form
56028 2323006 2363340 2406791 2454023 2503249 2554818 2610625 2669804 2729777 2790930 2855692 2923980
56017 2923980 2994146 3067244 3145455 3227522 3310795 3396449 3487551 3583509 3682079 3785275 3897154
56006 3897154 4016927 4140424 4267224 4400115 4538882 4681439 4830007 4989183 5158657
55997 5158657 5334741 5518199 5713500 5921333 6139295 6369050 6615190 6877849 7154187
55988 7154187 7446258 7759625 8095544 8452735 8835259 9249807 9697004 10174878 10688976
55979 10688976 11249020 11857947 12515601 13231269 14020702 14893083 15854059 16919794 18114353
55970 18114353 19455618 20959026 22652778 24572366 26742048 29179993 31919910 35008447
55962 35008447 38485551 42393153 46804741 51824861 57567079 64169554 71838841 80850443
55954H0850443J0661107J2652131J5039182J7784212K0625436K3098871K4652809
55947B05364191K4706734K2752710J8670857J3028198O884718J139879l898988
55940B88648299q277885j1902302j4457195j5739098j5865415j5147448j3930622
55933A93328334j2605739j1596408j1166886j1255331j1565405j1807686j1829708
55926A11501171j1586170j1084238j0367150r496353q527648p514827o522266
55919D6402519n607054m793271m081406l472990k968157k551058k199601j904203
55911A8824779j661842j460459j285560j134607j009845r03992q07196p20839
55903I840439o50499n91619n35452m83075m40639m06080l72677l40758l14503
$$ plain form
55954 80850443 91511550 104163681 119202863 136987075 157612511 180711382 205364191
55947 205364191 230070925 252823635 271494492 284522690 291407408 292547287 288648299
55940 288648299 280370414 268468112 254010917 238271819 222406404 207258956 193328334
55933 193328334 180722595 169126187 157959301 146703970 135138565 123330879 111501171
55926 111501171 99915001 88830763 78463613 68967260 60439612 52924785 46402519
55919 46402519 40795465 36002194 31920788 28447798 25479641 22928583 20728982 18824779
55911 18824779 17162937 15702478 14416918 13282311 12272466 11368474 10561278 9840439
55903 9840439 9189940 8598321 8062869 7579794 7139155 6733075 6360398 6019640 5705137
55894E705137k91872k68435k46551k30390k16439j99008j80667j67462j57955
55885C746358j46711j34573j25960j19513j10703j00601r3291q7586p9568p0479
55875B677373o4040n8796n0881m1501l4153k7325j7472o635M27M146P856J0082
55863B399081O531j993j0729j8415k7193l6726m4727n1734n9344o5349o6532o4640
55851A958230o3885o4182o2518n9215n7125n6139n4026n1298m9900m8662m5231
55840A346049m0895l8237l5827l0704k4416k0908j9758j7080j2185p826m791j510
55828A091912J597K619K424L625N812O519O218P437R429Q506L700k321p851j3513
55814A126113j9149k3365k6233k8865l0584k9869k7634k6139k5246k3094j9784
$$ plain form
55894 5705137 5413265 5144830 4898279 4667889 4451450 4252442 4071775 3904313 3746358
55885 3746358 3599647 3465074 3339114 3219601 3108898 3008297 2915006 2827420 2747852 2677373
55875 2677373 2613333 2554537 2503656 2462155 2428002 2400677 2383205 2376570 2376997 2381143 2388999 2399081
55863 2399081 2405612 2403619 2392890 2374475 2347282 2310556 2265829 2214095 2154751 2089402 2022870 1958230
55851 1958230 1894345 1830163 1767645 1708430 1651305 1595166 1541140 1489842 1439942 1391280 1346049
55840 1346049 1305154 1266917 1231090 1200386 1175970 1155062 1135304 1118224 1106039 1098213 1093422 1091912
55828 1091912 1093509 1096128 1098552 1102177 1107989 1114508 1120726 1128163 1137592 1146098 1149798 1147477 1139626 1126113
55814 1126113 1106964 1083599 1057366 1028501 997917 968048 940414 914275 889029 865935 846151
55803H46151j7073j5189j3287j1999j2098j1726q670m328j823j231m06N45k49
55790G48617k380l695m313o088q558r320q181p198o840n730l833k452j389M04
55776F79044J812P73j933l661m224n715q462j0803j2525j4769j6842j6895j5601
55763E70199j5409j6203j5560j3412j2528j3918j5461j5730j5752j6189j6021
55752D04016j4890j3862j3146j1670r428p715o752n559m340m344n292n506m752
55739B96760m341m464m059l248l210l687l277k139j745k074j824j166j459k432
55725B57635k542k011k508l972m708m540m817n447n052l897l430l156j481N41
55711B10615J07k417l444j572P20J588K147L187L287J787L79J22k58j548k360
$$ plain form
55803 846151 829078 813889 800602 788603 776505 764779 756109 751781 749958 748727 748321 748866 748617
55790 748617 746237 742542 738229 732141 723583 714263 706082 698884 692044 686314 682481 680029 678640 679044
55776 679044 680856 681629 679696 676035 671811 666096 657634 646831 634306 619537 602695 585800 570199
55763 570199 554790 538587 523027 509615 497087 483169 467708 451978 436226 420037 404016
55752 404016 389126 375264 362118 350448 341020 333305 326553 320994 316654 312310 307018 301512 296760
55739 296760 292419 287955 283896 280648 277438 273751 270474 268335 266590 264516 262692 261526 260067 257635
55725 257635 255093 253082 250574 246602 241894 237354 232537 227090 222038 218141 214711 211555 210074 210615
55711 210615 210722 208305 204861 203289 204009 205597 207744 210931 214218 216005 216384 216506 216248 214700 212340
55696B12340j737q75q46j010r52j511k602k479n09J602K519K984L704L949L489
55681B18066L597M752N409M312K168J2k057l695m051l681m477o712q302q013p062
55666A90266o552n785m413l828m771n754n369m353l818l358k339j331q61l62L65
55651A37737L38o54j175m17K94k49j201j385j334k017k919k947k204j495j093
55636A19279j018j412j768j068M85J231L84p80r97p94j158j861k174k144k133
55621A04072k134k239k671k763j343J237K911K531J238N24L20q7n36m30K91J197
55605A02118J701J195j18p77K48J720J756P39N03J046P15m58o31L80P19J49P51
55588A11756K912M025K738J294J683K457J663L17M66K015L783N790Q188R805J0061
$$ plain form
55696 212340 210603 209728 208882 207872 206920 205409 202807 200328 199819 201421 203940 206924 210628 214577 218066
55681 218066 221663 226415 231824 236136 238304 238316 236259 232564 228513 224832 220355 213643 205341 197328 190266
55666 190266 183714 177929 173516 169688 164917 159163 153794 149441 145623 142265 139926 138595 137734 137372 137737
55651 137737 138075 137421 136246 135829 136123 135874 134673 133288 131954 129937 127018 124071 121867 120372 119279
55636 119279 118261 116849 115081 114013 114498 115729 116113 115333 114336 113542 112384 110523 108349 106205 104072
55621 104072 101938 99699 97028 94265 92922 94159 97070 99601 100839 101363 101683 101596 101060 100630 100921 102118
55605 102118 103819 105014 104896 104119 104367 106087 107843 108582 109085 110131 110846 110388 109757 110137 110856 111005 111756
55588 111756 114668 118693 121431 122725 124408 126865 128528 128845 129311 131326 135109 140899 149087 158892 168953
55573A68953J0603J2839J5531J7002J8018K0135K2743K4211K4616K4946K4750
55562C84347K3015K0213J7277J3576Q207K348k101n418r277j3637j6776j8044
55550D03730j8469j8759j8663j8169j7700j7200j6390j5730j5813j6180j5880
55539B14777j4784j3369j1813j0338r550r398q791p391o555p121p601o230l711
55526I8125k011j377n87M89P32r0q26p06j98m9m56r98p99O86K550L074K135J555
55508A01249K247K720J744N83P85J469J011l6j55K09m42j696j916j321j627k844
55492A01980l155k083j364k074l201l589l476l413l328l181l283l473l284l062
55478F0014l657m734m803l274j292j51qm89j460k634l258k741j320Q4M33o70k350
$$ plain form
55573 168953 179556 192395 207926 224928 242946 263081 285824 310035 334651 359597 384347
55562 384347 407362 427575 444852 458428 466635 468983 466882 461464 452187 438550 421774 403730
55550 403730 385261 366502 347839 329670 311970 294770 278380 262650 246837 230657 214777
55539 214777 199993 186624 174811 164473 154923 145525 136734 129343 122788 115667 108066 101836 98125
55526 98125 96114 94737 94150 94639 95371 95281 94455 93749 93551 93502 93046 92048 91249 91935 94485 97559 99694 101249
55508 101249 103496 106216 107960 108543 109328 110797 111808 111772 111617 111826 111384 109688 107772 106451 104824 101980
55492 101980 98825 96742 95378 93304 90103 86514 83038 79625 76297 73116 69833 66360 63076 60014
55478 60014 56357 51623 46820 43546 42254 42103 42095 41606 40146 37512 34254 31513 30193 30277 30710 30040 27690
55461B7690k982j962m50J80o4l93o11r01r40l99K68M39K67J34r2l59O5J365K323
55442B3578J927Q98L65Q6n51q42J38J509J582L80o35q80r17q17q8R65J441J285
55424B9424J109Q59J45n44m81j67n43j182j015k97r9j49P94K628L886L935L403
55407D1706K605J483R07J955L745M155K872J759J832K011J317K83m67j210j979
55392F2974k098j627j677k579l144k526j380n68j1M52L58m15j129j216r47o27
55376D3840k07L8m09j207j357p97n11q32r36l99K08N99J190J762J344N3n68J12
55358D1923P29J01r31j137j015j748k936k971j353O09J424R23N2k51J01M47L00
55341C4267p5k24l16p53j295j391j105q73n60J79Q62O86j20n92n53n96o57j04
$$ plain form
55461 27690 24708 22746 22296 22476 22412 22019 21408 20507 19567 19168 19436 19875 20142 20276 20184 19825 19890 21255 23578
55442 23578 25505 26403 26768 26854 26303 25461 25599 27108 28690 29070 28435 27555 26638 25821 25733 26698 28139 29424
55424 29424 30533 31392 31537 30993 30512 30345 29802 28620 27605 27308 27209 27060 27854 30482 34368 38303 41706
55407 41706 44311 45794 46701 48656 52401 56556 59428 61187 63019 65030 66347 66630 66163 64953 62974
55392 62974 60876 59249 57572 54993 51849 49323 47943 47375 47364 47816 48174 47759 46630 45414 44467 43840
55376 43840 43633 43671 43262 42055 40698 39901 39390 38558 37622 37223 37431 38030 39220 40982 42326 42379 41811 41923
55358 41923 42652 42753 41822 40685 39670 37922 34986 32015 30662 31271 32695 33618 33670 33419 33520 33967 34267
55341 34267 34192 33968 33652 32899 31604 30213 29108 28235 27675 27854 28716 29402 29282 28690 28137 27541 26884 26780
55323B6780Q15J111P71Q31J520J872J432Q71N18j44j062j281o03q5l27o79o80
55306C1660p87j044o54L88P80r9j121j234q85p91p68p54j373k362k047J14J947
55289B0970J221j214k622j874q6J529K685L245L029K362J775J243N81K17N92J170
55273C4823J056L41j47j52j40k62p4O35J406J563Q31l74j065n33P45J501J219
55256D1373N95K30k12j019j530r86K65J157J117L60m85o93P7J189J564J061O58
55239D4721R28J235Q41j47j304k433l090k693j633j112j324j025L29J432J113
55224C5838J43k23j96n30p99k52M49J06r33j233m64L90O80M85l12j788k884k222
55206B6255j50J482J774J710K240K756K183O58o36q72k88K70J93l65p69o65l15
$$ plain form
55323 26780 27595 28706 29477 30308 31828 33700 35132 36003 36521 36377 35315 34034 33431 33346 33019 32340 31660
55306 31660 30873 29829 29175 29563 30343 30244 29123 27889 27004 26213 25445 24691 23318 20956 18909 19023 20970
55289 20970 22191 20977 18355 16481 16395 17924 20609 23854 26883 29245 31020 32263 32844 33061 33653 34823
55273 34823 35879 36220 36073 35921 35781 35519 35445 36080 37486 39049 39880 39506 38441 37908 38653 40154 41373
55256 41373 41968 42198 41986 40967 39437 38451 38716 39873 40990 41350 40865 40172 40249 41438 43002 44063 44721
55239 44721 45649 46884 47725 47578 46274 43841 40751 38058 36425 35313 33989 32964 33293 34725 35838
55224 35838 35981 35758 35562 35032 34233 33981 34430 34536 33603 32370 31906 32296 32976 33461 33149 31361 28477 26255
55206 26255 26105 27587 29361 31071 33311 36067 38250 38908 38272 37400 37112 37382 37575 37210 36441 35776 35461
55189C5461l4J71K26q0m58r1J093J892J372J78n28o93q41o42N00J779J566l08
55171D0563k203k822k440j705n53R58J839J218k95j152o72K62L75m78j230r69
55155C0696q6L92L62P08J610J844N88j010j224j66N35K05j77J39M30j51j108j265
55137C2322m27M48N13q2m69JJ091J921J913J365R37P17L20k59m49P3Q58J297J358
55118D3448J399J535J556J439J495J866K130J727P69N7J05N21N75O1p90j899l141
55101E2853l811l200j699o03o01j136j415j248p38N0P86R02L85j05j16J64N10
55084D0978Q75Q76Q8q72p10N89J376P03k40K9J077J447Q15N6k24K6Q07J698J612
55065E1006J51j347j417n02kM5O07J381Q85j012k508k284j029N4Q09J396J290
$$ plain form
55189 35461 35427 35598 35824 35744 35286 35195 36288 38180 39552 39730 39202 38509 37668 37026 37526 39305 40871 40563
55171 40563 38360 35538 33098 31393 30840 31798 33637 34855 34560 33408 32736 32998 33373 32895 31665 30696
55155 30696 30610 31002 31364 32072 33682 35526 36114 35104 33880 33714 34249 34454 34277 34416 34846 34695 33587 32322
55137 32322 31895 32343 32856 32774 32305 32306 33397 35318 37231 38596 39533 40250 40570 40311 39862 39935 40793 42090 43448
55118 43448 44847 46382 47938 49377 50872 52738 54868 56595 57364 57421 57526 58047 58622 58683 57893 55994 52853
55101 52853 49042 45842 44143 43540 42939 41803 40388 39140 38402 38452 39238 40140 40525 40420 40304 40468 40978
55084 40978 41853 42729 42817 41945 41235 41824 43200 43903 43663 43692 44769 46216 47031 47087 46863 46889 47696 49394 51006
55065 51006 51157 49810 48393 47891 47889 47934 48541 49922 50807 49795 47287 45003 43974 44028 44837 46233 47523
55048D7523P9j435j920j016L87J145P83k35q83n51K84P34P58J110K050K870K968
55031E4651K670K517K386J835R17J35k53m25n04k23P06J930K405J430k82j142
55015F8753n22M06J93j011j792j373l86K13K93L52P09J133J163O80J19r8k82j043
54997F7507k043j987l55J573K144J230p8j095j954k704l072k921k290j142K40
54982E3053R82N64k93n62l63n06q78n43O39J657J730J141N10J71L26R91J593J474
54964F1686R09Q08J393K018K357K725L146L068K359J654J428J481J723K495L721
54949I2971M534M375L844L875M566N288N643N869O426P439Q404Q608Q001P411
54935A77254P365P063N293K302k17j094r48j278k912n440p634q336p521o431o222
$$ plain form
55048 47523 47602 46167 44247 43231 43618 44763 45546 45311 44428 43877 44161 44895 45653 46763 48813 51683 54651
55031 54651 57321 59838 62224 64059 64976 65111 64858 64433 63929 63706 64412 66342 68747 70177 69895 68753
55015 68753 68231 68637 68830 67819 66027 64654 64268 64481 64774 65126 65835 66968 68131 68811 68930 68832 68550 67507
54997 67507 65464 63477 63122 64695 66839 68069 67991 66896 64942 62238 59166 56245 53955 52813 53053
54982 53053 54035 54599 54306 53744 53381 52875 51997 51454 52093 53750 55480 56621 57131 57302 57628 58619 60212 61686
54964 61686 62595 63403 64796 66814 69171 71896 75042 78110 80469 82123 83551 85032 86755 89250 92971
54949 92971 97505 101880 105724 109599 114165 119453 125096 130965 137391 144830 153234 161842 169843 177254
54935 177254 184619 191682 196975 199277 199060 197966 197018 195740 192828 187388 179754 171418 163897 157466 151244
54920A51244o685o915o810o874o894o050m372k843j964j353r24j208k128k679
54906I3545k318j638j201p77j50M03R94K366M574O488P299P501P769P919P752
54891A40526P755P923P010M207P30j587k595l412m294m545m197m156m540m306
54877A34519l049j968k331l802m948m965m247l543l151k907k587k122j563j044
54863I2292p94r70j317j236n02J97j7r20j233k35J267J920J470Q65Q79J121N96
54846I3383r87k613k897j642k10j05j408k949l691l432k455j352j054k155m035
54831F2398n280n147m014k512j028q8j26o50n84J73N68J72n4N77J152O03m39m03
54813D5318J025K618L274K953K090J024J19k65j52J11L37O28J047J519J953K274
$$ plain form
54920 151244 144559 137644 130834 123960 117066 111016 106644 103801 101837 100484 99560 98352 96224 93545
54906 93545 91227 89589 88388 87611 87461 87864 88858 91224 95798 102286 109585 117086 124855 132774 140526
54891 140526 148281 156204 163214 167421 168151 166564 163969 160557 156263 151718 147521 143365 138825 134519
54877 134519 131470 129502 127171 123369 118421 113456 109209 105666 102515 99608 97021 94899 93336 92292
54863 92292 91498 90528 89211 87975 87473 87670 87653 86733 85500 85265 86532 88452 89922 90787 91666 92787 93383
54846 93383 92396 89783 86886 85244 85034 84929 83521 80572 76881 73449 70994 69642 68588 66433 62398
54831 62398 57118 51971 47957 45445 44417 44329 44203 43553 42969 43142 43710 43882 43828 44405 45557 46160 45721 45318
54813 45318 46343 48961 52235 55188 57278 58302 58421 58156 58004 58115 58452 59080 60127 61646 63599 65873
54797F5873K411K429K520K737L012L417M114M994N869O974Q588J0114J0514R877
54783A43443R626J0504J1306J0463Q184O016M787L910K511L83k037l978m702m186
54769A96230l338l039l209l202k832k387j941j353p73n24n35l50K74J123J784
54754A75928J971J784J716K059K234J374k49j222q51n0K25L92J135J888J781J413
54738A91528K126L783M706L891J945k36k379m111m689m123l626m244n648o817
54724A72106p361p604p820p903p569o622n245m169m118m966n780n857n301m536
54710H7255l778l178k836k441j381L25J679J700N06r70j974k289j954j198m95
54695F8971j48J69Q96J701J670N79n92p90j11O75J382K371L399L539K569J521
$$ plain form
54797 65873 68284 70713 73233 75970 78982 82399 86513 91507 97376 104350 112938 123052 133566 143443
54783 143443 153069 163573 174879 185342 193526 199542 204329 208239 210750 211133 209096 205118 200416 196230
54769 196230 192892 189853 186644 183442 180610 178223 176282 174929 174156 173632 173097 172747 173021 174144 175928
54754 175928 177899 179683 181399 183458 185692 187066 186817 185595 184744 184694 184919 185311 186446 188334 190115 191528
54738 191528 193654 197437 202143 206034 207979 207743 205364 201253 196564 192441 188815 184571 178923 172106
54724 172106 164745 157141 149321 141418 133849 127227 121982 117813 113695 108729 102949 97092 91791 87255
54710 87255 83477 80299 77463 75022 73641 73966 75645 77345 77851 76881 74907 72618 70664 69466 68971
54695 68971 68823 68992 69888 71589 73259 73838 73246 72456 72345 73020 74402 76773 80172 83711 86280 87801
54679H7801J296J568J798K390L682M541L578J534P14J899L442L888L698L614L061
54664A28504J535J88M03J677K531K804L330L898L418K080J555K672M328N255N638
54649A69816O359P560Q560Q651P614N950M652M226L941K789R90l66j093k117l771
54634B23761n118n412n093m812m598m517n154o462p190o429n020m328m244l606
54620A51778k278j471j935k919l294k879k241j774j464j222j095j186j611k350
54606A24059l057l199k590j680j212j535k343l066l348l130k411j219N5O69K23
54591I6216p68j368j291j089j270j674j894j858j678j265n44J45L14k3l21j90
54575H1442J69L63L83N34R08J147Q81K83j0M14J245J743J575J212J360K065K571
$$ plain form
54679 87801 89097 90665 92463 94853 98535 103076 106654 108188 108902 110801 114243 118131 121829 125443 128504
54664 128504 130039 130227 130630 132307 134838 137642 140972 144870 148288 150368 151923 154595 158923 164178 169816
54649 169816 176175 183735 192295 200946 208560 214510 219162 223388 227329 230118 231108 230742 229649 227532 223761
54634 223761 218643 213231 208138 203326 198728 194211 189057 182595 175405 168976 163956 159628 155384 151778
54620 151778 149500 148029 146094 143175 139881 137002 134761 132987 131523 130301 129206 128020 126409 124059
54606 124059 121002 117803 115213 113533 112321 110786 108443 105377 102029 98899 96488 95269 95324 95993 96216
54591 96216 95448 94080 92789 91700 90430 88756 86862 85004 83326 82061 81517 81662 81976 81953 81632 81442
54575 81442 81611 81974 82357 82891 83799 84946 85827 86110 86100 86514 87759 89502 91077 92289 93649 95714 98285
54558I8285K204J274P78J167J753J574O13k03p0R77K306L233L417L071K861L166
54542A26406L561L515L401M109N508O310N758M605L835L239K092O40j49m7J27
54527A72910l41j362k392k940k760k211k240l320m608m874m208l873m352m564
54513A28865l452j579m53o72j421j591r28o1K15l99j498k307k242j321j38N93
54497A11611O37M21M68P11P27N18N93J118J621J764J783J797J407N78J88R18K066
54480A28926K423K002J873K537L358L592L119K218J351J101J588K013J577O82
54466A58360L65P40J004Q94R37J196J016L16o6K53N93M90M18O51M53o83j915k140
54448A62882j583j287j444j299m90L20K61q36k271l018k640j796j464j606j312
$$ plain form
54558 98285 100489 101763 102541 103708 105461 107035 107648 107445 107375 108352 110658 113891 117308 120379 123240 126406
54542 126406 129967 133482 136883 140992 146500 152810 158568 163173 167008 170247 172339 172979 172830 172783 172910
54527 172910 172569 171207 168815 165875 163115 160904 158664 155344 150736 145862 141654 137781 133429 128865
54513 128865 125413 123834 123381 122709 121288 119697 118769 118708 118923 118524 117026 114719 112477 111156 111018 111611
54497 111611 112248 112669 113137 113848 114575 115093 115686 116804 118425 120189 121972 123769 125176 125754 125942 126860 128926
54480 128926 131349 133351 135224 137761 141119 144711 147830 150048 151399 152500 154088 156101 157678 158360
54466 158360 158725 159465 160469 161363 162300 163496 164512 164828 164762 165015 165608 166098 166516 167167 167620 166937 165022 162882
54448 162882 161299 160012 158568 157269 156779 157099 157360 156524 154253 151235 148595 146799 145335 143729 142417
54433A42417m25j25j213k710l035k035r06m95o03p85r01q94o36j09N85J275J473
54416A30878O16r78j833p62J720M046N234N229M201K589J517J858K907L183K568
54401A62973K429L247L578K182L9r04k95M59K94m30r23j071j166j260j243j219
54385A66690j399j722j861j617j172j000j441k277k767k308j116o8J92j62n09
54370A47463n39m65o19j021j357j237n37M25J099J224J032Q05M57j28m91R5J579
54353A47785K843K835J673L68k90k26K44P84J127J162R76O28K2q30j650k199k528
54336A52724k655k337j611j124j407k005k078j661j607k216k810k837k645k825
54322A22906l312l632l569l177k472j541p14l05l06n14p66r89j192j493j880k005
$$ plain form
54433 142417 141992 141867 140654 137944 134909 132874 131968 131473 130870 130085 129184 128290 127654 127545 128130 129405 130878
54416 130878 131494 130516 128683 127921 129641 133687 138921 144150 148351 150940 152457 154315 157222 160405 162973
54401 162973 165402 168649 172227 174409 174448 173544 173249 173708 174002 173572 172649 171578 170412 169152 167909 166690
54385 166690 165291 163569 161708 160091 158919 157919 156478 154201 151434 149126 148010 147942 148134 147972 147463
54370 147463 146924 146459 145840 144819 143462 142225 141688 142113 143212 144436 145468 146273 146730 146602 146111 146206 147785
54353 147785 150628 153463 155136 155504 155214 154988 155232 156016 157143 158305 159281 159909 159931 159101 157451 155252 152724
54336 152724 150069 147732 146121 144997 143590 141585 139507 137846 136239 134023 131213 128376 125731 122906
54322 122906 119594 115962 112393 109216 106744 105203 104489 104184 103878 103364 102598 101609 100417 98924 97044 95039
54306I5039j552q50n51p12p88o59r76k062l105k990j670j78M77R4p56j305j273
54289G6183j157j531k123k098j452j210j870k408j653m9Q89N60k23n69m75l14
54273F0500k09j60k97o44r41r01m54K76J048J497J368P90J95j0L16R27J177M72
54255F4950q74j661j084K03R11P31N17Q56J337J344R76P45Q45J125J481J865K028
54238G6295J657P38l48j038r45j69O15O41k36j366j912j611r01n34r71j916k332
54221F5667j380M84J714J328M3o76m35j38m71j034j222j174j275j350j041o34
54205E8406o32p50l59J93k11j625k498j739l63j97j473k658k405p86J139K184
54189D6226J694J79p65n7J432J839O69q10j500j689j967k072j499n46Kj51o83
$$ plain form
54306 95039 93487 92637 92086 91374 90586 89927 88951 86889 83784 80794 79124 78946 79423 79517 78761 77456 76183
54289 76183 75026 73495 71372 69274 67822 66612 64742 62334 60681 60632 61521 62081 61858 61289 60814 60500
54273 60500 60291 60131 59834 59190 58249 57348 56894 57170 58218 59715 61083 61873 62068 62058 62374 63301 64478 64950
54255 64950 64076 62415 61331 61534 62445 63176 63693 64549 65886 67230 68206 68951 69796 70921 72402 74267 76295
54238 76295 77952 78690 78342 77304 76359 76190 76805 77446 77210 75844 73932 72321 71420 70886 69915 67999 65667
54221 65667 64287 64771 66485 67813 67856 67180 66745 66607 66136 65102 63880 62706 61431 60081 59040 58406
54205 58406 57774 57024 56665 56858 56647 55022 52524 50785 50422 50225 48752 46094 43689 42903 44042 46226
54189 46226 47920 48099 47334 47277 48709 50548 51217 50407 48907 47218 45251 43179 41680 41134 41136 40985 40302
54172D0302j096r82k38N93O88j7o36n05LK48K91N39R16J057R80R62R42N94p3o36
54152D3932o62l9R30J619J611J327J571K227K106N99j183j672q42o2k01p35p85
54135D9741l00J07M1k90m66m25m90p63o83K82J663K292J760R11N50M20m4n34k30
54116E3542Q99J857J625J07j760k628j888l82M30J79j61O0L13J12P4Q29J754J920
54098E6882J658J931K617K666J838J036Q79R71P74K89k00m92m95m37q81j861k399
54081F4776j717n21p7l03q7P08R13j8j148j515j291r89o27k95n28j399k029j661
54063E2192o69J27N67R51J301J474J597J861K157K277K220J933J280M85J19K46
54047G0118J48o36j419j111L56J896K410J777Q07M22P60J100Q48M67R50K390L739
$$ plain form
54172 40302 39206 38224 37986 38579 39267 39250 38614 38109 38112 38360 38651 39190 40106 41163 42143 43105 44047 44641 44568 43932
54152 43932 43270 43231 44161 45780 47391 48718 50289 52516 54622 55221 54038 52366 51524 51462 51261 50526 49741
54135 49741 49441 49548 49589 49299 48833 48408 47918 47155 46472 46754 48417 50709 52469 53380 53930 54350 54306 53772 53542
54116 53542 54441 56298 57923 58030 56270 53642 51754 51372 51802 51981 51820 51880 52193 52305 52379 53208 54962 56882
54098 56882 58540 60471 63088 65754 67592 68628 69507 70478 71252 71541 71341 70849 70354 69917 69036 67175 64776
54081 64776 63059 62538 62461 62158 62071 62779 63692 63674 62526 61011 59720 58731 58104 57809 57281 55882 53853 52192
54063 52192 51523 51650 52217 53168 54469 55943 57540 59401 61558 63835 66055 67988 69268 69753 69872 70118
54047 70118 70266 69630 68211 67100 67456 69352 71762 73539 74346 74768 75528 76628 77476 77943 78893 81283 85022
54030H5022M131L805L385L022K542J960J361P83O13J495L392N111N450M503L357
54015A29932K792K737K796K754K626K529K529K502K336K212K348K410J722K87
54001A62512r71j329j160j297j960k709l087k885k122j218q75j355k171k755l091
53986A33527l311l217k666k079j994k368k737k829k619k184j780j737j851j494
53972A00661o65k33n54o28L47J375Q91p67j620q27K12J4r90j299m48O26Q87L08
53954I7290k52P5J289K424K603K038J607J631J716J761K227L141L748L485K673
53939A27456J800Q75O2J42J588L632N060N485N241M517L402K416J995J759J130
53924A66560M53M30O87J69r70j300k76Q42R87Q98J701K874L008J982J051R67J305
$$ plain form
54030 85022 89153 92958 96343 99365 101907 103867 105228 106011 106624 108119 111511 116622 122072 126575 129932
54015 129932 132724 135461 138257 141011 143637 146166 148695 151197 153533 155745 158093 160503 162225 162512
54001 162512 161541 160212 159052 157755 155795 153086 149999 147114 144992 143774 142899 141544 139373 136618 133527
53986 133527 130216 126999 124333 122254 120260 117892 115155 112326 109707 107523 105743 104006 102155 100661
53972 100661 99996 99763 99209 98581 98928 100303 101194 100427 98807 97980 98192 98206 97216 95917 95469 96095 96982 97290
53954 97290 97038 97113 98402 100826 103429 105467 107074 108705 110421 112182 114409 117550 121298 124783 127456
53939 127456 129256 130131 130193 130335 131923 135555 140615 146100 151341 155858 159260 161676 163671 165430 166560
53924 166560 167013 167443 168130 168299 167329 166029 165753 166595 167582 168480 170181 173055 176063 178045 179096 180063 181368
53907A81368J632K131K848L349L519L806M363M666M409M042M020M149M134M072
53893B32508L982L390K030N41j84M0P58J477J672Q18r05k294k416j882k051l107
53877B34377l982m121m209m786n223m786l950l765m226m249l349k470k777m094
53863A78390n116n029m262l613l242k980l133m189n785o731o298m903l346k024
53849A17739j123r08j247j393q84k73l60j069j694j865j667j058L1J163J721J686
53833A08799J512J329R67N31K94J02l05n32N5J117J496P63k75q16r38r22o02M3
53815A12618L85q1r25j275q33O1R81J625J717J199L71m07j026j469j591j264n05
53798A09581O05J875K845L122K941K944L290L488L220K756K399K150K153K804
$$ plain form
53907 181368 183000 185131 187979 191328 194847 198653 203016 207682 212091 216133 220153 224302 228436 232508
53893 232508 236490 239880 241910 242451 242267 242307 243065 244542 246214 247032 246127 243833 241417 239535 237484 234377
53877 234377 230395 226274 222065 217279 212056 207270 203320 199555 195329 191080 187731 185261 182484 178390
53863 178390 173274 168245 163983 160370 157128 154148 151015 146826 141041 134310 128012 123109 119763 117739
53849 117739 116616 115708 114461 113068 112184 111911 111551 110482 108788 106923 105256 104198 104229 105392 107113 108799
53833 108799 110311 111640 112607 113138 113432 113534 113229 112697 112752 113869 115365 116128 115853 115037 114099 113177 112575 112618
53815 112618 113003 112922 111997 110722 109889 109950 110931 112556 114273 115472 115843 115436 114410 112941 111350 110086 109581
53798 109581 110186 112061 114906 118028 120969 123913 127203 130691 133911 136667 139066 141216 143369 146173
53784A46173L909M413L612K181J362J463J785J806J722J884K239K515K482J968
53770A79514Q97n10j651j894j131k4M62nq28j327j670k402l263l223j924l59K91
53753A60953k6n21p98j145j828k537k735k376k113k660l825m473l778k241j027
53738A28870n23k22J69L52J57j71n15r21j022m28J93m18k117l085k255q48m93
53721A16723q85n50P32J757J766J129K55q55j789j675m10Q87J123M11l68p27q97
53704A16627j254j704j683q20L75P97M8r14q57K36J341J851K158K720L228L064
53688A25213K165J180P88J104J627J754J343P44L76M12R18J857K812L097K465
53673A47855J418N62k4m41m63J85J242K016K009J196m0r23o61P04K029K167J172
$$ plain form
53784 146173 150082 154495 158107 160288 161650 163113 164898 166704 168426 170310 172549 175064 177546 179514
53770 179514 180411 179901 178250 176356 175225 175201 175663 175658 174830 173503 171833 169431 166168 162945 161021 160662 160953
53753 160953 160927 160406 159608 158463 156635 154098 151363 148987 146874 144214 140389 135916 132138 129897 128870
53738 128870 128347 128125 128294 128646 128803 128632 128117 127196 126174 125746 125939 125521 123404 120319 118064 117216 116723
53721 116723 115838 115288 116020 117777 119543 120672 120927 120072 118283 116608 116198 117085 118208 118619 118251 117524 116627
53704 116627 115373 113669 111986 111166 111541 112338 112386 111472 110615 110851 112192 114043 116201 118921 122149 125213
53688 125213 127378 128558 129346 130450 132077 133831 135174 135918 136294 136706 137624 139481 142293 145390 147855
53673 147855 149273 149835 149811 149370 148907 149092 150334 152350 154359 155555 155515 154592 153931 154635 156664 158831 160003
53656A60003L6m98m61j32K71M48R6o81j361j530j230p85l83Q3Q18J690K109J617
53638A60110N02m97j007j117p09M32J739J965O92j013j886j765j138k37O59Q40
53622A57570R2n29J23J644K589K364J677J237J043Q90P23M13j5l8Q03J987K489
53605A75062K156J788J916K350K961L928M886M852L548K046J548J952K274K112
53591B13379K064K743L829M325L588J979M86k12m4P67J909K703K404J122K6N1
53575B41119Q30J379J421J398J520J432P47n75k191l273l004j560k34J24J65Q46
53559B40144J798J952J355J117J701K333K190J229j25j283j558p66K75O84P27
53544B51773J112J546J230N67Q30K098L092L275L491M013L765K335J252J931L543
$$ plain form
53656 160003 160039 159541 159080 158948 159219 159667 159763 159082 157721 156191 154961 154176 153793 153876 154694 156384 158493 160110
53638 160110 160612 160115 159108 157991 157282 157714 159453 161418 162110 161097 159211 157446 156308 156071 156730 157570
53622 157570 157662 157133 157256 158900 161489 163853 165530 166767 167810 168700 169423 169836 169821 169783 170586 172573 175062
53605 175062 177218 179006 180922 183272 186233 190161 195047 199899 203447 205493 207041 208993 211267 213379
53591 213379 215443 218186 222015 226340 229928 231907 232393 232181 232137 232904 234813 237516 239920 241042 241068 241119
53575 241119 241949 243328 244749 246147 247667 249099 249846 249271 247080 243807 240803 239243 239009 239133 239298 240144
53559 240144 241942 243894 245249 246366 248067 250400 252590 253819 253694 252411 250853 250087 250362 251046 251773
53544 251773 252885 254431 255661 256228 257058 259156 262248 265523 269014 273027 276792 279127 280379 282310 285853
53529B85853M289L932L676M094M624M898N279O049O964P791Q561R199R540R723
53515C74472J0083J0597J0935J1094J1511J2389J3259J3508J3166J2914J3300
53504E07228J4099J4698J5047J5876J7716K0053K1832K2612K2786K2952K3411
53493G18310K4107K4475K3766K2181K1275K2289K4301K5179K4382K3506K3857
53482I77628K4827K5365K5779K6894K8244K8412K6920K4841K3453K2988K2749
53471A258100K1949K0302J8183J6324J5176J4631J4233J3651J2856J2034J1321
53460A428760J0514R235P521N993M993L958K172k13k520m605o695q509r575j0373
53446A430656j1937j4269j6199j7162j7956j9396k1204k2733k3820k4398k4217
$$ plain form
53529 285853 290142 294074 297750 301844 306468 311366 316645 322694 329658 337449 346010 355209 364749 374472
53515 374472 384555 395152 406087 417181 428692 441081 454340 467848 481014 493928 507228
53504 507228 521327 536025 551072 566948 584664 604717 626549 649161 671947 694899 718310
53493 718310 742417 766892 790658 812839 834114 856403 880704 905883 930265 953771 977628
53482 977628 1002455 1027820 1053599 1080493 1108737 1137149 1164069 1188910 1212363 1235351 1258100
53471 1258100 1280049 1300351 1318534 1334858 1350034 1364665 1378898 1392549 1405405 1417439 1428760
53460 1428760 1439274 1448509 1456030 1462023 1467016 1470974 1473146 1472933 1470413 1465808 1459113 1450604 1441029 1430656
53446 1430656 1418719 1404450 1388251 1371089 1353133 1333737 1312533 1289800 1265980 1241582 1217365
53435A217365k3507k3096k3270k3296k2556k1439k0560j9915j9351j9078j9107
53424I82190j8908j8183j7279j6374j5058j3320j1863j0824r111o047k691n06
53412H42026O51K070M282O689Q739J0523J2433J4883J8088K1479K3894K4962K5707
53399A016426K7132K8892L0213L1370L3202L5660L7838L9137L9615L9665M0095
53388A399245M1857M4848M7614M9189N0420N2460N4849N6430N7409N8808O0434
53377A973563O1105O0684O0156N9738N8616N6692N4908N3554N1723M8915M5813
53366B585467M3027M0280L7329L4473L1675K8408K4860K2130K0573J9074J6567
53355B903863J3240R571N279M1n711j1636j8119k5212l1743l6725m0886m5627
$$ plain form
53435 1217365 1193858 1170762 1147492 1124196 1101640 1080201 1059641 1039726 1020375 1001297 982190
53424 982190 963282 945099 927820 911446 896388 883068 871205 860381 851270 845223 842532 842026
53412 842026 842677 844747 849029 855718 864457 874980 887413 902296 920384 941863 965757 990719 1016426
53399 1016426 1043558 1072450 1102663 1134033 1167235 1202895 1240733 1279870 1319485 1359150 1399245
53388 1399245 1441102 1485950 1533564 1582753 1633173 1685633 1740482 1796912 1854321 1913129 1973563
53377 1973563 2034668 2095352 2155508 2215246 2273862 2330554 2385462 2439016 2490739 2539654 2585467
53366 2585467 2628494 2668774 2706103 2740576 2772251 2800659 2825519 2847649 2868222 2887296 2903863
53355 2903863 2917103 2926674 2931953 2931994 2926283 2914647 2896528 2871316 2839573 2802848 2761962 2716335
53343B716335n0817n4954n7288n8651o0036o1421o2364o2921o3545o4468o5486
53332B054384o6222o6401o6041o5468o4974o4451o3500o1803n9291n6108n2726
53321A367399m9887m8097m7051m5824m3619m0334l6398l2383k8664k5254k1878
53310I48010j8398j5191j2846j1411j0177q466o429m693l334j726M61K628M028
53297H62456M760N509O569P838R492J1864J4573J6628J7680J8466J9639K0876
53285A016350K1652K2207K3105K4308K5354K6106K6649K6870K6682K6422K6380
53274A292085K6255K5757K5354K5600K5902K4949K2473J9782J8310J8161J8372
53263A543000J8096J7131J5616J3696J1540R539Q148P229N722K581j810n825q526
$$ plain form
53343 2716335 2665518 2610564 2553276 2494625 2434589 2373168 2310804 2247883 2184338 2119870 2054384
53332 2054384 1988162 1921761 1855720 1790252 1725278 1660827 1597327 1535524 1476233 1420125 1367399
53321 1367399 1317512 1269415 1222364 1176540 1132921 1092587 1056189 1023806 995142 969888 948010
53310 948010 929612 914421 901575 890164 879987 871521 865092 860399 857065 855339 855800 858428 862456
53297 862456 867216 872725 879294 887132 896624 908488 923061 939689 957369 975835 995474 1016350
53285 1016350 1038002 1060209 1083314 1107622 1132976 1159082 1185731 1212601 1239283 1265705 1292085
53274 1292085 1318340 1344097 1369451 1395051 1420953 1445902 1468375 1488157 1506467 1524628 1543000
53263 1543000 1561096 1578227 1593843 1607539 1619079 1628618 1636766 1643995 1649717 1652298 1650488 1644663 1636137
53250A636137j0764j3866j7816k1526k4365k6599k8600l0501l2460l4540l6324
53239A358776l7307l7614l7745l7771l7384l6608l5863l5417l5251l5310l5420
53228I57086l5257l4852l4681l4751l4222l2754l1495l1581l2199l1467k8997
53217E94830k6224k4218k2614k0842j9083j7575j6186j5029j4546j4540j4143
53206C89830j3118j2267j2082j1980j1319j0335r510q817q065p333o610n703m825
53193B67866m622n146n596n441n042m845m689m418m346m569m586m067l409k996
53179B04094k666k360k522l245l781l605l239l350l643l461k922k698l015l582
53165A60005m120m346l846k588j277o45o77r07j106j214j119r38j039j354j331
$$ plain form
53250 1636137 1625373 1611507 1593691 1572165 1547800 1521201 1492601 1462100 1429640 1395100 1358776
53239 1358776 1321469 1283855 1246110 1208339 1170955 1134347 1098484 1063067 1027816 992506 957086
53228 957086 921829 886977 852296 817545 783323 750569 719074 687493 655294 623827 594830
53217 594830 568606 544388 521774 500932 481849 464274 448088 433059 418513 403973 389830
53206 389830 376712 364445 352363 340383 329064 318729 309219 300402 292337 285004 278394 272691 267866
53193 267866 263244 258098 252502 247061 242019 237174 232485 228067 223721 219152 214566 210499 207090 204094
53179 204094 201428 199068 196546 193301 189520 185915 182676 179326 175683 172222 169300 166602 163587 160005
53165 160005 155885 151539 147693 145105 143828 143183 142506 141599 140493 139279 138160 137222 136183 134829 133498
53150A33498r47j020j869k504k037j120r17j224q95K39J040P54j20p71r77p87
53134A20343j69O45R79L55r23j918j754l76J204J682Q84K4K01R67J095L47l61
53117A23225m28k37k30j47L57R21Q27n4j056j404q71J61J121J633J534Q95J37
53100A26384p9M63J102J110Q18J173K162K638K045J320J454J991J948J490J577
53085A47596K277K646K188J501J247J276J027K67p15j378j453j408k065l370m062
53070A45574l273j865j305j620j730j475j809k797l074k033j188k086l800l939
53056A13580j876M02Q34l88j587j841j682j865k246k204j665j257j504k246k897
53041I1558l003k452j439l91K90N82P31O94L5j327k648l012k297j139k18P0m52
$$ plain form
53150 133498 132551 131531 129662 127158 125121 124001 123084 121860 120965 121204 122244 122998 122878 122107 121130 120343
53134 120343 120174 120819 121798 122153 121230 119312 117558 117182 118386 120068 120952 120976 121177 122144 123239 123586 123225
53117 123225 122797 122560 122330 122183 122540 123461 124288 124234 123178 121774 120903 121064 122185 123818 125352 126247 126384
53100 126384 126305 126768 127870 128980 129798 130971 133133 135771 137816 139136 140590 142581 144529 146019 147596
53085 147596 149873 152519 154707 156208 157455 158731 159758 160025 159310 157932 156479 155071 153006 149636 145574
53070 145574 142301 140436 139131 137511 135781 134306 132497 129700 126626 124593 123405 121319 117519 113580
53056 113580 111704 112106 112940 112552 110965 109124 107442 105577 103331 101127 99462 98205 96701 94455 91558
53041 91558 88555 86103 84664 84273 84563 85145 85876 86570 86605 85278 82630 79618 77321 76182 75964 76034 75582
53024G5582j500k174j677l08P22N97l80j296j517r53OO40L73o42j627j942j586
53007F2318q84p2O50R52O26r4o62o41rQ27J348J338J052Q13N19k05j299k066j836
52988F2675p06N13J044O97j36q39r93p00n06q43j413j333j57J395K095J602P59
52971F3154L63K45l7k01K81J060J250Q15O56J107J370R04M00O62J266J253O19
52954G5167J64R4k00q89j144k70J228K189K240K200K984M287M821L942K638K337
52938A01788L045L452K862K019J693J512Q38k4l65j98M4L64P72N50q72k644l338
52921A11498l017l157m364n378m821k898q05O58J236P39p03k234k842k331j328
52906H0253n51l00m95q43j026q99n56j73Rl35j298k400k937k811k539k444k261
$$ plain form
53024 75582 74082 71908 70231 69923 70645 71242 70862 69566 68049 67096 67102 67742 68115 67473 65846 63904 62318
53007 62318 61434 61362 62012 62964 63590 63496 62834 62193 62184 63011 64359 65697 66749 67562 68081 67876 66577 64511 62675
52988 62675 61969 62482 63526 64223 64087 63248 62255 61555 61049 60206 58793 57460 57303 58698 60793 62395 63154
52971 63154 63517 63762 63725 63524 63805 64865 66115 66930 67586 68693 70063 70967 71367 72029 73295 74548 75167
52954 75167 75331 75425 75225 74336 73192 72922 74150 76339 78579 80779 83763 88050 92871 96813 99451 101788
52938 101788 104833 108285 111147 113166 114859 116371 117209 117185 116820 116622 116666 117030 117802 118352 117480 114836 111498
52921 111498 108481 105324 100960 95582 90761 87863 87058 87716 88952 89691 88988 86754 83912 81581 80253
52906 80253 79702 79402 78907 78064 77038 76139 75583 75410 75419 75084 73786 71386 68449 65638 63099 60655 58394
52889E8394j715j059o37l33J81Q43J266J274J097R50O96M7r04j529j223j84O61
52872E7825O67J05m16q32j383j820j592p43P0N67J091J718J896J380P94O70N76
52855F0573o6p79n98L87J043Q05L48M15Q44J277J931K966L621L007J542O12P72
52838G8700J202J097O66L93J98l1Q1O34Q90M39K25J183K417K221P52l9O42J397
52820I3067J143R29J958L205K757P68o75m91K35J28o61j090p66k41j56n77j048
52803I8485j142r27p86p73o04l94p95k016l239l576l089k296j320k50K02n67j915
52786G4998k497j887q63k95m30j109j851j942j202m87o56j288j329p43m12n53
52770E7454m01L84J109J093M76k82q33q04m7Q29J040P70Q74J398J511R21K14l95
$$ plain form
52889 58394 56679 55620 54983 54650 54831 55674 56940 58214 59311 60261 60957 61004 60100 58571 57348 57164 57825
52872 57825 58492 58597 58181 57349 55966 54146 52554 51811 51881 52448 53539 55257 57153 58533 59327 59997 60573
52855 60573 60507 59728 59130 59517 60560 61365 61713 62128 62972 64249 66180 69146 72767 75774 77316 77928 78700
52838 78700 79902 80999 81665 82058 82256 82225 82306 82940 83830 84269 84494 85677 88094 90315 91067 91028 91670 93067
52820 93067 94210 95139 97097 100302 103059 103827 103152 102661 102896 103024 102363 101273 100507 100266 100110 99533 98485
52803 98485 97343 96416 95630 94857 94253 93859 93064 91048 87809 84233 81144 78848 77528 77278 77480 76913 74998
52786 74998 72501 70614 69751 69456 69026 67917 66066 64124 62922 62435 61779 60491 59162 58419 58007 57454
52770 57454 57053 57437 58546 59639 60115 59833 59000 58196 58149 58978 60018 60788 61662 63060 64571 65492 65706 65311
52752F5311j348k418k511j425m84o24r73m28M31K83p64j239l22J268K300K143
52736E9200R69m34j114q53m50p23j397j518q38j73l85j412k322k194r54N35J312
52719D7249J257R67Q39P52N90M31J17o30j490j603p99j4p7o46q34l13O57J766
52701D8219K583K524J526M51J94O54J020Q54L26k72q00j065q10J11J561K921L226
52684F3223K026J97p94n50Q9O29J632L289M412L861K309J458J898K674K767K124
52668I1244J243N95M73P84R34M17m71q72l79N27J015O71k11r89j396j867k785
52651H8933l551l126j644o15j066k267k850k555k085j803j453q80l32q3k83q55
52635F3485j302j042k38K56J11j09j34n62j482j622q2J957K630K000J683K214
$$ plain form
52752 65311 63963 61545 59034 57609 57125 56501 55528 55100 55531 55814 55050 53811 53489 54757 57057 59200
52736 59200 60169 59735 58621 57768 57318 56595 55198 53680 52842 52669 52284 50872 48550 46356 45402 45937 47249
52719 47249 48506 49473 50312 51064 51654 52085 52202 51572 50082 48479 47680 47666 47589 46943 46109 45796 46453 48219
52701 48219 50802 53326 54852 55303 55497 56151 57171 58025 58351 58079 57279 56214 55404 55515 57076 59997 63223
52684 63223 65249 65446 64652 64102 64191 64820 66452 69741 74153 78014 80323 81781 83679 86353 89120 91244
52668 91244 92487 93082 93555 94339 95273 95690 95219 94347 93968 94495 95510 96181 95970 94981 93585 91718 88933
52651 88933 85382 82256 80612 79997 78931 76664 73814 71259 69174 67371 65918 65038 64706 64623 64340 63485
52635 63485 62183 61141 60903 61159 61270 61161 61027 60465 58983 57361 57279 59236 61866 63866 65549 67763
52619F7763K398J380j14j075j487j775j931j805j525j183n81K62Q44P95L07j98
52603F2075n31o40n50m96p91j297j449r85l80l24q86j395j143k05N70N46J04M7
52585E2270L54L65J04M14J348J687P36m70p77o49j025j429q04M34R62Q00J128
52568E5448J965J942P22l07k79j10o56j190p73J61P40J142J853K334J703L42n04
52551F4533l97n1o3l08n87r94j434j378n18P22J516J486J034P70P01K76o14j160
52533F3534o59L02M87k86r52p27l7M02N39O73R13J370K188K979K940J919P40n4
52515G6271r32k253l124k421m49J262J702J193O48O71J253J731J269j64j457j531
52499G3669o77j22l92p59m00M64Q73L12o18p57K87J527J666P56Q7K92M80j47q49
$$ plain form
52619 67763 70161 71541 71427 70352 68865 67090 65159 63354 61829 60646 60065 60327 61171 61966 62273 62075
52603 62075 61544 60904 60354 59858 59067 57770 56321 55336 54956 54632 53746 52351 51208 51003 51573 52119 52223 52270
52585 52270 52624 52989 53093 53507 54855 56542 57278 56808 56031 55382 54357 52928 52124 52558 53520 54320 55448
52568 55448 57413 59355 60077 59770 59491 59381 58725 57535 56762 56923 57663 58805 60658 62992 64695 65037 64533
52551 64533 64136 64085 64022 63714 63127 62133 60699 59321 58803 59525 61041 62527 63561 64331 65032 65308 64694 63534
52533 63534 62875 63177 63664 63378 62426 61699 61662 62064 62603 63276 64189 65559 67747 70726 73666 75585 76325 76271
52515 76271 75339 73086 69962 67541 67092 68354 70056 71249 71897 72568 73821 75552 76821 76657 75200 73669
52499 73669 72992 72870 72478 71719 71319 71783 72656 72968 72350 71593 71880 73407 75073 75829 75916 76208 76688 76541 75692
52480G5692n50J63k23j631k186q96Q70J350P04K91M84M66q4m43j45K70K13m6k7
52461G4272P9j80o01o14k68j95n77q76p18m51m96p75j026j179j014k4J740L193
52443G0290L265K247J338J013O17m12j685k480k513j937r95n8M64M93L07M5l84
52426F9615p81n85M24J699K506K572J898M82j281k330j785r7J231J199K94l16
52410G4745k24q6n47j265j329m46P58J575J871J692Q33n96j711j736j148j078
52394G1308j615j643n63P15J038N40J91K88J83n13j113n69J242L111L548K229
52378G8377L16p46n69J96Q24R79M70o24j490j053O61K234K368J312K82j45l89
52361H3003p98q92n7J423K505K592K160J901J638P48m63p32M19J824K167J561
$$ plain form
52480 75692 75142 75305 75082 73451 71265 70369 71239 72589 73293 73584 74068 74534 74450 74007 73862 74132 74345 74299 74272
52461 74272 74351 74171 73570 72956 72688 72493 71916 71040 70322 69871 69375 68600 67574 66395 65381 65357 67097 70290
52443 70290 73555 75802 77140 78153 78770 78358 76673 74193 71680 69743 68748 68690 69154 69647 69954 69999 69615
52426 69615 68834 68249 68673 70372 72878 75450 77348 77830 76549 74219 72434 72337 73568 74767 75061 74745
52410 74745 74521 74435 73888 72623 71294 70848 71606 73181 75052 76744 77577 76981 75270 73534 72386 71308
52394 71308 69693 68050 67487 68202 69240 69780 69971 70259 70442 69929 68816 68247 69489 72600 76148 78377
52378 78377 78693 77947 77378 77574 78398 79377 79847 79223 77733 76680 77341 79575 81943 83255 83537 83392 83003
52361 83003 82205 81313 81256 82679 85184 87776 89936 91837 93475 94223 93760 93028 93447 95271 97438 98999
52345I8999Q22p8j549k949l096k102j247q99j05J427K449K020Q85K00lj40M4P60
52327I5438J226N53q39j808j984j705j027N7P94L07r60j504o90N28R70O20K37
52310I0213J73M8m48p96JK012L696L386J463P9M91J698K269K299K486K454J511
52293A13035M17O73K170L116K494J216N47O33J051J724K610L282L467L393L188
52278A43016K532J382M46M03R70J278Q92J03n27n65P7J032J701J852J834K077
52262A58503K568K927K782J948N71p57j253o45M75J145R06J73j88L56J553K631
52246A73695K963K520J772J422K016L343M242L593J763L88M05R86R98O99J049
52231B01854J919K213J636J085J156J324J089R33J555K754L659L756L201K436
$$ plain form
52345 98999 99821 99743 98194 95245 92149 90047 88800 87901 87796 89223 91672 93692 94577 94777 94774 94634 94678 95438
52327 95438 96664 97217 96378 94570 92586 90881 89854 89911 90705 91012 90052 88548 87858 88386 89356 89976 90213
52310 90213 90386 90434 89986 89190 89191 91203 94899 98285 99748 99827 100318 102016 104285 106584 109070 111524 113035
52293 113035 113452 114125 116295 119411 121905 123121 123668 124301 125352 127076 129686 132968 136435 139828 143016
52278 143016 145548 146930 147376 147779 148749 150027 150919 151022 150495 149930 150007 151039 152740 154592 156426 158503
52262 158503 161071 163998 166780 168728 169299 168542 167289 166644 167119 168264 169170 169343 169155 169511 171064 173695
52246 173695 176658 179178 180950 182372 184388 187731 191973 195566 197329 197717 198122 199108 200106 200805 201854
52231 201854 203773 205986 207622 208707 209863 211187 212276 213209 214764 217518 221177 224933 228134 230570
52217B30570J872J712J760J569J016O08R48J998L008L196K425J305O50O88R60
52202B54285R73P97Q55J330K056K767L205L224L030L053L239K932J939J243J930
52187B86858L632M825M554L199J640M87P2M01R40J132J155J522J976J665O01p0
52171C14589L56J156J277O95P3l75r37j654k126j999j237p4J048J663J637J202
52155C15294O38J19j34l5M8l48j024j285j016r23j380j790j475p13k21p1K20O24
52137C06528L52j132l070l823k488j53R70%j441j262L31J103j94k340l553l634
52121B86194l415l064k134q64k20o19j434j889j910j883j974j890j291l78O6n32
52105B62763j753k584k572k067j351l13Q77J630J809J929K069J476p1j347j072
$$ plain form
52217 230570 232442 234154 235914 237483 238499 239107 240055 242053 245061 248257 250682 251987 252637 253325 254285
52202 254285 255258 256055 256910 258240 260296 263063 266268 269492 272522 275575 278814 281746 283685 284928 286858
52187 286858 290490 295315 299869 303068 304708 305195 305267 305668 306608 307740 308895 310417 312393 314058 314659 314589
52171 314589 314945 316101 317378 318073 318146 317771 316834 315180 313054 311055 309818 309744 310792 312455 314092 315294
52155 315294 315932 316051 315917 315882 315930 315582 314558 313273 312257 311334 309954 308164 306689 305976 305755 305684 305904 306528
52137 306528 306880 305748 302678 298855 296367 296214 297184 297184 295743 294481 294812 295915 295721 293381 289828 286194
52121 286194 282779 279715 277581 276717 276497 275878 274444 272555 270645 268762 266788 264898 263607 263229 263295 262763
52105 262763 261010 258426 255854 253787 252436 252123 253000 254630 256439 258368 260437 261913 261842 260495 259423
52090B59423L95J655K105K175K188K053J950K230K655K567J867J087N31J49J73
52075B83203R33J965K230J530R09J217J975K106J390O24N44R78J124N98R2O71
52059C02089K308L648L582K590J868J661J368R60J026J436J163j41j517k052j893
52044C18096j428m36J111K300K313J710J628K073K054J228L43p1m60j302k160
52029C26999k253j530o44j33o3m03j181k157k709k453j861j825k466k721j541
52014C03059O38K126J760L4j647k358k023r40M36J349J150M7r38j037m80%J25
51997C01301J87L93M75J22n67j179j463j528j655k023k538k873k742k305k140
51982B81465k662l652m620n396o030o213n512m317l888m966o810q080q330q046
$$ plain form
52090 259423 259818 261473 263578 265753 267941 269994 271944 274174 276829 279396 281263 282350 282881 283030 283203
52075 283203 284136 286101 288331 289861 290770 291987 293962 296068 297458 298082 298626 299604 300728 301326 301418 302089
52059 302089 304397 308045 311627 314217 316085 317746 319114 320074 321100 322536 323699 323558 322041 319989 318096
52044 318096 316668 316232 317343 319643 321956 323666 325294 327367 329421 330649 330992 330921 330461 329159 326999
52029 326999 324746 323216 322572 322439 322376 321973 320792 318635 315926 313473 311612 309787 307321 304600 303059
52014 303059 303697 305823 307583 307617 305970 303612 301589 300649 301085 302434 303584 303631 302693 301656 301176 301176 301301
51997 301301 301488 301881 302356 302478 301911 300732 299269 297741 296086 294063 291525 288652 285910 283605 281465
51982 281465 278803 275151 270531 265135 259105 252892 247380 243063 239175 234209 227399 219319 210989 202943
51968B02943p569o767n652m632l988l716l852m375m770m351l228k298k063k156
51954A43526k217k512l165l505k998k226k145k634k643j712n59j27o36j637k473
51939A12337k596j924j067p51r42r53m25K46N26K74l96j308k063k168j665j127
51923I5998q58n21J07N90M00k71q08q69m21N45J730K259J463j08j085q09Q0O49
51905I8071O95N74N94Q86J513K298K708K257R83n74j815k406k300j595l72J181
51889A02698K523K867J931L56r08j541j776j668j044j71L27K72P4r3m95r91q89
51872A01472j38K36m45j298j006L99J739K292K209J671P27j07j51L96O57M53N22
51855A09628J173J652J288M93J37N35J427K296K474J617M48J92Q61J009q5j081
$$ plain form
51968 202943 195374 188607 182955 178323 174335 170619 166767 162392 157622 153271 150043 147745 145682 143526
51954 143526 141309 138797 135632 132127 129129 126903 124758 122124 119481 117769 117210 117083 116447 114810 112337
51939 112337 109741 107817 106750 105999 105057 104104 103679 103925 104451 104725 104329 103021 100958 98790 97125 95998
51923 95998 95140 94619 94726 95316 95716 95445 94637 93768 93347 93892 95622 97881 99344 99236 98151 97342 97422 98071
51905 98071 98766 99340 99934 100820 102333 104631 107339 109596 110579 110005 108190 105784 103484 101889 101517 102698
51889 102698 105221 108088 110019 110375 109467 107926 106150 104482 103438 103267 103594 103866 103940 103847 103352 102361 101472
51872 101472 101334 101570 101125 99827 98821 99220 100959 103251 105460 107131 107858 107751 107600 107996 108653 109106 109628
51855 109628 110801 112453 113741 114234 114371 114906 116333 118629 121103 122720 123168 123360 124221 125230 125145 124064
51839A24064m31J222J987J549J469K564L614L214J717M46j08l25l14J81R41J265
51823A43055J030R49J498K160K167J636J412J899K589K856K850L248M343N621
51809A77313O265N876M698L351K396K042K134K362K355J665K6k148l815m123l127
51794A97270j550k01K16p12k420l320k371n88n1j348k995l579l290k897k444j803
51778A67917j559k144k714k093n46N05M23j64o64j241k010k461k164j445r88j175
51762A47477j911k624k536j473m00l62j012j000O6J020Q05k35j214j879k285k100
51746A30337j192l30l48q83q51q1M64J67l60k08N13P99N6j020j076L00J800J624
51728A29711m15k468k605q19J254K145J652M65n84r82p73l89J4P70J938K757K512
$$ plain form
51839 124064 123633 124855 126842 128391 129860 132424 136038 139252 140969 141415 141307 140982 140668 140849 141790 143055
51823 143055 144085 145034 146532 148692 150859 152495 153907 155806 158395 161251 164101 167349 171692 177313
51809 177313 183578 189454 194152 197503 199899 201941 204075 206437 208792 210457 210483 208335 204520 200397 197270
51794 197270 195720 195519 195735 195023 192603 189283 186912 186324 186273 184925 181930 178351 175061 172164 169720 167917
51778 167917 166358 164214 161500 159407 158861 159366 159789 159625 158961 157720 155710 153249 151085 149640 148652 147477
51762 147477 145566 142942 140406 138933 138533 138171 137159 136159 136225 137245 138050 137815 136601 134722 132437 130337
51746 130337 129145 128815 128467 127584 126733 126652 127116 127283 126923 126715 127228 128027 128083 127063 125987 126287 128087 129711
51728 129711 129296 126828 124223 123404 124658 126803 128455 128920 128336 127354 126581 126192 126206 126976 128914 131671 134183
51711A34183J571P74K0j411l130l525j937J61R01J72q42j507j966j951p45J370
51695A22138K753K085j26k213l100k965k560k347k250j875j038j33J65k52o11
51680A07671j13J041J827J526M77l62m09L0K11j63o08n18j5K09r6m28l25N9N00
51661A10514J220K189K529J490j48p45P9R99R58N11O08J055J121R57J248J848
51645A26433J865J138M76L09J19l85n56J16R27P82k73j143j141o57l80m50n49
51628A26631m01J7N58J018J246J240J034O36J56j14J4L84P00R15J109J161R06
51611A37210N34L65K20m23j453j880j036L91J091P40K46L85Q58R32N37J99J27
51594A39043r8q16j625j722q58K49O26M3q40j288j213r80p54m14jR0m09j187j431
$$ plain form
51711 134183 135754 136528 136548 135137 132007 128482 126545 126706 127607 127779 126937 125430 123464 121513 120768 122138
51695 122138 124891 126976 126850 124637 121537 118572 116012 113665 111415 109540 108502 108369 108534 108282 107671
51680 107671 107558 108599 110426 111952 112429 112067 111658 111688 111899 111736 111128 110610 110595 110804 110708 110280 109955 110014 110514
51661 110514 111734 113923 116452 117942 117794 117049 117128 118127 119085 119596 120204 121259 122380 123337 124585 126433
51645 126433 128298 129436 129912 130221 130340 129955 129399 129515 130442 131224 130951 129808 128667 128010 127630 127180 126631
51628 126631 126230 126247 126805 127823 129069 130309 131343 131979 132135 132021 132035 132419 133119 134034 135143 136304 137210
51611 137210 137744 138109 138329 137906 136453 134573 133537 133928 135019 135759 136005 136390 137248 138180 138717 138916 139043
51594 139043 138945 138129 136504 134782 133924 134173 134799 134842 134002 132714 131501 130521 129767 129353 129352 129442 129033 127846 126415
51575A26415n30J199K448J988J22j309q91P17J692J393P92O79O57L37K43P55J196
51558A37903J048J144K246L179K129l57j647o13Q17N80o48p75M98J398O25j116
51542A46411k303k275j531q64n39j32Q02J908K272J628P96N59P25Q82J355K501
51526A52195L475K946J021o26p49J83J071J605K016K111J456L50j69N04J757K404
51510A71550J965J028L70J8n74j554k303k209j443o85l64n11j021j706k176k131
51494A58254j742j362r91l66M19P93L11q32j925k314j942j435j504k093k444k134
51478A38693j598j381j351j198j158j455j477n22Q35J140K5j241j533j277j505
51463A24997k241k562j953r88o40j257k156k222j081L26O82j50j008r90n37o53
$$ plain form
51575 126415 125885 127084 129532 131520 131642 130333 129442 130159 131851 133244 134036 134715 135372 135709 135952 136707 137903
51558 137903 138951 140095 142341 145520 147649 147292 145645 145032 145849 146429 145781 145006 145504 146902 147527 146411
51542 146411 144108 141833 140302 139438 138899 138767 139569 141477 143749 145377 146173 146732 147457 148339 149694 152195
51526 152195 155670 158616 159637 159011 158262 158445 159516 161121 163137 165248 166704 167054 166885 167389 169146 171550
51510 171550 173515 174543 174913 174931 174357 172803 170500 168291 166848 166163 165799 165288 164267 162561 160385 158254
51494 158254 156512 155150 154159 153793 154212 155005 155316 154484 152559 150245 148303 146868 145364 143271 140827 138693
51478 138693 137095 135714 134363 133165 132007 130552 129075 128553 129388 130528 130553 129312 127779 126502 124997
51463 124997 122756 120194 118241 117253 116613 115356 113200 110978 109897 110223 110905 110755 109747 108757 108220 107567
51447A07567j558k536k838k311j367p24r05j650j976j158M07J640J921J508R37
51432I6957L67l19j014j258p24K11O90L33k61k68K65N65K46k82n58o68q37r72
51414I2473q97o55k62M78J559K462K673K342K011J838J453N99m38j152j388j407
51398A01689j348r03K30J605K203J603N49RM5J27J30K95M73K75m4J89Q55J033
51380A09015L89k90l59j60j92l06l27o06j239j529j074o36r82j536j265m89m58
51363I7956j312j766j026N5J82q27k098k721k375j412o47p29j457j940j545l83
51347G7955J058K289K764K061M68j026j663j546j211q56l58K49P13Q81Q13N60
51331H3151J08m68r21j023p21j19N58R68P66M7m71q0R89J625J151J70k74o0J44
$$ plain form
51447 107567 106009 103473 100635 98324 96957 96233 95328 93678 91702 90544 90951 92591 94512 96020 96957
51432 96957 97324 97005 95991 94733 94009 94220 94910 95243 94982 94714 94979 95544 95790 95508 94950 94282 93445 92473
51414 92473 91576 90921 90659 91137 92696 95158 97831 100173 102184 104022 105475 106074 105636 104484 103096 101689
51398 101689 100341 99438 99668 101273 103476 105079 105628 105637 105682 105809 105939 106234 106707 106982 106938 107127 107982 109015
51380 109015 109404 109114 108755 108595 108403 108097 107770 107164 105925 104396 103322 102686 101704 100168 98903 98414 97956
51363 97956 96644 94878 93852 93907 94089 93262 91164 88443 86068 84656 84009 83280 81823 79883 78338 77955
51347 77955 79013 81302 84066 86127 86595 85569 83906 82360 81149 80293 79935 80184 80897 81778 82591 83151
51331 83151 83259 82791 81870 80847 80126 80007 80565 81533 82299 82346 81875 81795 82784 84409 85560 85730 85456 85396 85540
51312H5540R1K30P29J131J073O48j47j450k663k593j065M88Q35N24P23J245R24
51295H6263m22j760k341k292j738n89O38R47K49l02R8Q23P70k30j514k464k711
51278G3425k003n27Q50J323J006O53O43O59L43r8j45L65R38R34K87l91n94n24
51260G7144p28j314j875k008j482j18J870L444L371J624l25r60j35J122J765J407
51244H2802K67j056j822j670r28k35J50M63Q99J211J031M92K53P25J449J570Q83
51227H6484Kn11p05p14l80J93L52k45q81o92mJ62l27n88j93K61L08L48P97J277
51207H4944J218P22K21k03n89n81J93J323J822J267L30k0K80L14n46j594j544
51190H7557l22O51L70l28j23P05P97j3m40J35O87L01m23m24K65R31J248J159M16
$$ plain form
51312 85540 85631 85861 86590 87721 88794 89442 89295 87845 85182 82589 81524 82012 82847 83371 84094 85339 86263
51295 86263 85841 84081 81740 79448 77710 77121 77759 78706 78955 78653 78751 79574 80344 80114 78600 76136 73425
51278 73425 71422 70895 71745 73068 74074 74727 75370 76029 76372 76274 76129 76494 77432 78366 78653 78262 77668 77144
51260 77144 76416 75102 73227 71219 69737 69619 71489 74933 78304 79928 79603 78643 78508 79630 81395 82802
51244 82802 83069 82013 80191 78521 77593 77358 77508 77971 78870 80081 81112 81604 81857 82582 84031 85601 86484
51227 86484 86486 85975 85270 84556 84176 84369 84721 84476 83595 82903 82899 83061 82734 82146 81953 82214 82522 82870 83667 84944
51207 84944 86162 86884 87105 86902 86313 85732 85925 87248 89070 90337 90667 90647 90927 91241 90695 89101 87557
51190 87557 87235 87886 88256 87928 87805 88510 89307 89294 88854 88989 89676 89977 89554 89130 89395 90326 91574 92733 93149
51171I3149q27j593j259n82o73j320j456q65l14j30J87Q55J377J409J219R85M16
51154I0578n69j450j669j184k66P25J217P40l51j001o47J88P75J089J424J654
51138I1253J439Q96M42K13O9O4L42O37M41k31p21o55m97q21j315j017M04K137
51120I3080L127L100K476J586N17m10o71k92o3o09j440j511o73ll98j332j458
51103I5026l71Q29Q90j08j083j423j522j733j594n70Q90J734J637J268J192J140
51087I6202O56p1n33p30j123j724j728m08J821L591L906L048J911P22r23k806
51071A01811l706k871j204j55J65P36J741K197J662J033J015Q66k66j626j678
51056I9720l58P39N24k70l64L08P01K01o02o12N32K101K954K596J545P71P35R70
$$ plain form
51171 93149 92322 90729 89470 88888 88215 86895 85439 84574 84260 84130 84317 85172 86549 87958 89177 90162 90578
51154 90578 90009 88559 86890 85706 85440 86165 87382 88122 87771 86770 86123 86311 87086 88175 89599 91253
51138 91253 92692 93588 94030 94243 94312 94376 94718 95355 95796 95565 94844 94189 93692 92871 91556 90539 90943 93080
51120 93080 96207 99307 101783 103369 103886 103476 102805 102513 102450 101841 100401 98890 98217 98214 97816 96484 95026
51103 95026 94655 95484 96374 96266 95183 93760 92238 90505 88911 88341 89231 90965 92602 93870 95062 96202
51087 96202 96858 96787 96254 95524 94401 92677 90949 90541 92362 95953 99859 102907 104818 105540 104617 101811
51071 101811 98105 95234 94030 93875 94040 94776 96517 98714 100376 101409 102424 103290 103024 101398 99720
51056 99720 99362 100101 100625 100355 99991 100299 101000 101201 100599 99987 100519 102620 105574 108170 109715 110486 111221 112191
51038A12191N68p70k151k135l27J934K833K028Q35M65P33P14J02n74p41k82N46
51021A15969J299J587J377R78O40L92L80R86K215L341L501K564J150Mn00m71l70
51004A35042n76r25r60o31m01n15p25q50j011j091o90J4J06q01j832k060j711
50987A20383j406r02K97J679K229J967J794J930J694Q85K15J31K22J26J02L44
50971A31690N63P35J367K572L529L447K581J724J231R85R91J398K168L088L966
50956A62035M608M890M991N262N679N853N802O158P194Q128P973O898O180O787
50942B48438Q458J0093J0815J0573R921R413R120Q789Q256P587O895O290O007
50929C60655O195O454N982M421K368P46j84j034k479m453o174o942o803o424o375
$$ plain form
51038 112191 112759 111989 109838 107703 107376 109310 112143 114171 115006 115471 116204 116918 117020 116446 115705 115423 115969
51021 115969 117268 118855 120232 121210 121850 122242 122622 123608 125823 129164 132665 135229 136379 136383 135883 135412 135042
51004 135042 134466 133541 132581 131950 131549 131034 130309 129459 128448 127357 126667 126681 126787 125986 124154 122094 120383
50987 120383 118977 118075 118372 120051 122280 124247 126041 127971 129665 130550 130765 130896 131118 131244 131346 131690
50971 131690 132253 132988 134355 136927 140456 143903 146484 148208 149439 150424 151415 152813 154981 158069 162035
50956 162035 166643 171533 176524 181786 187465 193318 199120 205278 212472 220600 228573 235471 241651 248438
50942 248438 256896 266989 277804 288377 298298 307711 316831 325620 333876 341463 348358 354648 360655
50929 360655 366850 373304 379286 383707 386075 386821 386637 385603 383124 378671 372497 365555 358752 352328 345953
50914C45953o805p642q682r339q842p108n076l751l248l082k970k809k330j442
50900B72827o53m55m92j41M23M96R1o9L25R19J571K429L123L058K615K899L838
50883B92804L871K122j72j242q99k15R2L7k44n50m19K67Q12N31k98r58j373j874
50865B92292k306k151j394n31R5M41M81L03K62N29P80Q21J047J688K102J690J046
50848B97195J264K308L127L339L751N068O855Q086Q226P671P563Q992J1771J4185
50834C89401J4751J4046J3903J4905J5841J5846J5879J7311J9946K2345K3703
50823E77877K4510K5486K6571K7158K6892K6037K5091K4129K2646K0175J6928
50812H43500J3624J0700Q067N594L435J779M90q19k489m620o937q821r647r217
$$ plain form
50914 345953 339148 331506 322824 313485 304643 297535 292459 288708 285460 282378 279408 276599 274269 272827
50900 272827 272174 271719 271227 271086 271509 272005 272096 272027 272352 273271 274842 277271 280394 283452 286067 288966 292804
50883 292804 296675 298797 298625 297383 296484 296269 296361 296398 296154 295604 295185 295452 296264 296795 296497 295539 294166 292292
50865 292292 289986 287835 286441 285910 286005 286446 286927 287230 287492 288021 288801 289622 290669 292357 294459 296149 297195
50848 297195 298459 300767 303894 307233 310984 316052 322907 330993 339219 346890 354453 363445 375216 389401
50834 389401 404152 418198 432101 447006 462847 478693 494572 511883 531829 554174 577877
50823 577877 602387 627873 654444 681602 708494 734531 759622 783751 806397 826572 843500
50812 843500 857124 867824 875891 881485 884920 886699 887189 886370 883881 879261 872324 863503 853856 844639
50798H44639p859o183m703l464k042j27J848L195M148N806Q536J1270J3095J4763
50784H82922J7627K1586K5198K7534K8725K8939K8142K6892K6014K5176K3092
50773A161847J9524J5917J3468J1712R704P422N102K173j932o486j0183j2815
50761A215453j5366j8557k2113k5333k7808k9585l1100l2619l3513l2632k9951
50750I16876k7122k5616k4935k3661k1737k0331j9640j8340j5568j2275r856q336
50738F89459o615l982p16K486N040O620P402Q113R514J1589J3462J4225J3829
50725G70426J3119J2862J2798J1932R930P861P090P592P965P169N663M527L960
50712H82894L236J928N82n3kJ73M21J380L276N197N978N636N195N249N471N681
$$ plain form
50798 844639 836780 830597 825894 822430 820388 820261 822109 825304 829452 835258 843794 855064 868159 882922
50784 882922 900549 922135 947333 974867 1003592 1032531 1060673 1087565 1113579 1138755 1161847
50773 1161847 1181371 1197288 1210756 1222468 1232172 1239594 1244696 1246869 1244937 1238451 1228268 1215453
50761 1215453 1200087 1181530 1159417 1134084 1106276 1076691 1045591 1012972 979459 946827 916876
50750 916876 889754 864138 839203 815542 793805 773474 753834 735494 719926 707651 697795 689459
50738 689459 682844 678862 678146 680632 685672 692292 699694 707807 717321 728910 742372 756597 770426
50725 770426 783545 796407 809205 821137 831067 838928 846018 853610 861575 868744 874407 878934 882894
50712 882894 886130 888058 888640 888587 888585 888758 889179 890559 893835 899032 905010 910646 915841 921090 926561 932242
50696I32242O349P594Q510Q276P362O785O722O714O882P713Q934R786J0489J2152
50682A046510J4859J7117J7799J7594J7773J8337J8523J8524J9493K2000K5470
50671A253999K9256L3373L7982M2824M7589N2338N7119O1423O4458O5894O6037
50660A812292O5276O3659O1100N7886N4555N1328M7935M4235M0658L7607L4568
50649B371099L0439K4773J8280J1933O167J149k757n387p167q543r299q940p625
50636B414122o079m733l517k478j999k275l031l937m893n731o196o490p420r520
50622B345823j2225j4373j5467j6049j6723j7180j6517j4424j1678r211p033m442
50610B190501j354J152J910Q70j148l592o476r778j3299j7256k2236k8253l4356
$$ plain form
50696 932242 938591 946185 954695 962971 970333 977118 983840 990554 997436 1005149 1014083 1023869 1034358 1046510
50682 1046510 1061369 1078486 1096285 1113879 1131652 1149989 1168512 1187036 1206529 1228529 1253999
50671 1253999 1283255 1316628 1354610 1397434 1445023 1497361 1554480 1615903 1680361 1746255 1812292
50660 1812292 1877568 1941227 2002327 2060213 2114768 2166096 2214031 2258266 2298924 2336531 2371099
50649 2371099 2401538 2426311 2444591 2456524 2462691 2463840 2461083 2455696 2448529 2439986 2430687 2421747 2414122
50636 2414122 2408043 2403310 2399793 2397315 2395316 2393041 2390010 2386073 2381180 2375449 2369253 2362763 2355343 2345823
50622 2345823 2333598 2319225 2303758 2287709 2270986 2253806 2237289 2222865 2211187 2201976 2194943 2190501
50610 2190501 2189147 2190299 2192209 2193079 2191931 2188339 2181863 2172085 2158786 2141530 2119294 2091041 2056685
50597B056685l9617m4045m8083n1531n3705n4509n4688n4914n5026n4460n3112
50586A492995n1439m9866m8325m6508m4395m2253m0061l7182l3065k8230k4035
50575A047636k1146j8716j5556j1751q471o241m179j226K397N395O807O936O943
50562I88828P821R623J1549J2846J3585J4479J5888J7490J9040K1043K4215K8495
50550A184902L3059L7246M1091M4868M8558N1919N4836N7389N9578O1166O1827
50539A736439O1566O0992O0944O1665O2612O3285O3974O5204O6643O7349O7203
50528B437876O7375O8925P1427P3482P4230P3925P3336P3179P3921P5405P6683
50517C239764P6690P5159P2403O8315O2245N4048M4601L4859K4812J3803J516
$$ plain form
50597 2056685 2017068 1973023 1924940 1873409 1819704 1765195 1710507 1655593 1600567 1546107 1492995
50586 1492995 1441556 1391690 1343365 1296857 1252462 1210209 1170148 1132966 1099901 1071671 1047636
50575 1047636 1026490 1007774 992218 980467 971996 965755 961576 960350 962747 968142 974949 981885 988828
50562 988828 996649 1006272 1017821 1030667 1044252 1058731 1074619 1092109 1111149 1132192 1156407 1184902
50550 1184902 1217961 1255207 1296298 1341166 1389724 1441643 1496479 1553868 1613446 1674612 1736439
50539 1736439 1798005 1858997 1919941 1981606 2044218 2107503 2171477 2236681 2303324 2370673 2437876
50528 2437876 2505251 2574176 2645603 2719085 2793315 2867240 2940576 3013755 3087676 3163081 3239764
50517 3239764 3316454 3391613 3464016 3532331 3594576 3648624 3693225 3728084 3752896 3766699 3768215
50506C768215j1631k4824l7120m7702n6302o3232o8632p1907p2344p0161o6380
50495C177980o1720n6089m9319m1861l4599k8342k3667k0907k0026k0715k2824
50484B797911k6479l1681l8116m5520n3786o2319o9647p4317p6175p6386p6147
50473B167338p5825p5414p5162p5286p5397p4805p3424p1854p0429o8560o5474
50462A365708o1282n6878n2830m8912m4818m0789l7175l3816l0334k6826k3651
50451I08397k0727j7717j4839j2782j1612j0509q953p566p097p122o491m796k666
50438G75520o82J202L047M525N446O173P204Q661J0526J2926J5778J8535K0777
50425H89638K2903K5669K9051L2095L4086L5472L7306M0050M3256M6333M9091
$$ plain form
50506 3768215 3756584 3731760 3694640 3646938 3590636 3527404 3458772 3386865 3314521 3244360 3177980
50495 3177980 3116260 3060171 3010852 2968991 2934392 2906050 2882383 2861476 2841450 2820735 2797911
50484 2797911 2771432 2739751 2701635 2656115 2602329 2540010 2470363 2396046 2319871 2243485 2167338
50473 2167338 2091513 2016099 1940937 1865651 1790254 1715449 1642025 1570171 1499742 1431182 1365708
50462 1365708 1304426 1247548 1194718 1145806 1100988 1060199 1023024 989208 958874 932048 908397
50451 908397 887670 869953 855114 842332 830720 820211 811258 803692 796595 789473 782982 778186 775520
50438 775520 774838 776040 779087 783612 789058 795231 802435 811096 821622 834548 850326 868861 889638
50425 889638 912541 938210 967261 999356 1033442 1068914 1106220 1146270 1189526 1235859 1284950
50414A284950N1483N3212N4136N4876N6426N9055O1918O3962O4813O4563O3217
50403A932611O0821N7869N4910N1914M8514M4732M0818L6462L1029K4563J7631
50392B401874R978N18j0707k1622l0234l6847m2996m8725n2588n4193n4972n5904
50380B003582n5971n3853n0028m5954m1895l7033l1448k6661k3867k2624k1751
50369A592497k0820k0274k0555k1646k3196k4828k6445k8408l0989l3588l4919
50358A306829l4529l3645l3883l5239l6074l5185l3176l1478l0614l0010k9138
50347I43858k8054k6855k5298k3290k1261j9609j8109j6356j4521j3140j2180
50336G25185j0987r326p871p256p092o473n229m129l865m340n022n500n543n038
$$ plain form
50414 1284950 1336433 1389645 1443781 1498657 1555083 1614138 1676056 1740018 1804831 1869394 1932611
50403 1932611 1993432 2051301 2106211 2158125 2206639 2251371 2292189 2328651 2359680 2384243 2401874
50392 2401874 2411852 2412370 2401663 2380041 2349807 2312960 2269964 2221239 2168651 2114458 2059486 2003582
50380 2003582 1947611 1893758 1843730 1797776 1755881 1718848 1687400 1660739 1636872 1614248 1592497
50369 1592497 1571677 1551403 1530848 1509202 1486006 1461178 1434733 1406325 1375336 1341748 1306829
50358 1306829 1272300 1238655 1204772 1169533 1133459 1098274 1065098 1033620 1003006 972996 943858
50347 943858 915804 888949 863651 840361 819100 799491 781382 765026 750505 737365 725185
50336 725185 714198 704872 697001 689745 682653 676180 670951 666822 662957 658617 653595 648095 642552 637514
50322F37514m203l567l436l534l375k851k186j530q21l2P64J548K405L425M709
50307F24830O332Q131R603J0251J0110R730R667J0140J1069J2159J2971J3165
50295G48158J2778J2110J1272J0159Q834P648O693N416L178J32k774m803o166
50282H12635p572r177j0361j0617j0329j0371j1038j1806j2195j2392j2721j2874
50270F81182j2198j0677r105q212p909p565o799n864n324n448n894o096n976n986
50256E78129o149n598l780j717j150k223l114k366p69j58j016k185k521j974j076
50241E42333l63l21j160k313k713j891m59O50J019P22k9q95j384j234p45m08l08
50224E30501j17L43P24N36k17r42j121q83o96n87k40K06j3j130k203k226j491
$$ plain form
50322 637514 633311 629744 626308 622774 619399 616548 614362 612832 612011 611979 612743 614291 616696 620121 624830
50307 624830 631162 639293 648896 659147 669257 678987 688654 698794 709863 722022 734993 748158
50295 748158 760936 773046 784318 794477 803311 810959 817652 823068 826246 826378 823604 818801 812635
50282 812635 805063 795886 785525 774908 764579 754208 743170 731364 719169 706777 694056 681182
50270 681182 668984 658307 649202 640990 633081 625516 618717 612853 607529 602081 596187 590091 584115 578129
50256 578129 571980 566382 562602 560885 559735 557512 554398 552032 551263 551105 550089 547904 545383 543409 542333
50241 542333 541970 541649 540489 538176 535463 533572 533113 533763 534782 535504 535475 534580 533196 531962 531217 530809 530501
50224 530501 530384 530727 531451 531987 531770 530828 529707 528824 528128 527541 527301 527507 527494 526364 524161 521935 520444
50207E20444j067j146q32L41J601K000J516P07k3l50K21J717L085K991J392j40
50191E32457O6K150M667O029N935N359N273N630N806N687N814O446P065P083O587
50176F12054O121O036O428P351Q615R477R110P560O006N749O947Q491R214R210
50162G18369R606J1090J3108J4802J6168J7579J8613J8415J7361J7265J9457K3350
50150I15183K7352L0603L3227L5608L8199M1655M6321N1670N6875O1864O7257
50139A405814P3233P9000Q3386Q5636Q5649Q3755Q0433P6028P0815O5309O0235
50128B249293N5970N2343M9074M5996M2469L7165K9003J8163N741p317k0468l3216
50116B524216m5221n6535o7052p5754q1303q3461q3342q2161q0275p7664p4715
$$ plain form
50207 520444 519377 518231 517399 517740 519341 521341 522857 523564 523541 523191 523412 525129 528214 531205 532597 532457
50191 532457 532523 534673 539340 545369 551304 556663 561936 567566 573372 579059 584873 591319 598384 605467 612054
50176 612054 618175 624211 630639 637990 646605 656082 665192 672752 678758 684507 691454 699945 709159 718369
50162 718369 727975 739065 752173 766975 783143 800722 819335 837750 855111 872376 891833 915183
50150 915183 942535 973138 1006365 1041973 1080172 1121827 1168148 1219818 1276693 1338557 1405814
50139 1405814 1479047 1558047 1641433 1727069 1812718 1896473 1976906 2052934 2123749 2189058 2249293
50128 2249293 2305263 2357606 2406680 2452676 2495145 2532310 2561313 2579476 2585217 2577900 2557432 2524216
50116 2524216 2478995 2422460 2355408 2279654 2198351 2114890 2031548 1949387 1869112 1791448 1716733
50105A716733p2095o9942o7545o3918n8821n3223m8504m5090m2102l8597l4665
50094A122231l0952k7619k4378k1267j8595j6248j3797j1265r172p744o638n617
50082I28939m923m769m902m765l846j999K58J882K268J998K063K550K738K411
50068I19903K314L159M793O550P853Q439Q460Q527R139J0035J0560J0562J0339
50055A020633R960R437R422J0678J2710J4008J3994J3740J4343J5584J6710J7596
50043A178815J8423J9037J9534K0798K3491K6863K9459L0926L2417L5251L9632
50032A474646M4764M9814N4816O0582O7685P5692Q3885R2462J02222J12974J23285
50021B342827J31993J39024J44280J46786J45812J42121J37348J32647J28403
$$ plain form
50105 1716733 1644638 1574696 1507151 1443233 1384412 1331189 1282685 1237595 1195493 1156896 1122231
50094 1122231 1091279 1063660 1039282 1018015 999420 983172 969375 958110 948938 941194 934556 928939
50082 928939 924016 919247 914345 909580 905734 903735 903993 905875 908143 910141 912204 914754 917492 919903
50068 919903 922217 925376 930169 936719 944572 953011 961471 969998 979137 989172 999732 1010294 1020633
50055 1020633 1030593 1040030 1049452 1060130 1072840 1086848 1100842 1114582 1128925 1144509 1161219 1178815
50043 1178815 1197238 1216275 1235809 1256607 1280098 1306961 1336420 1367346 1399763 1435014 1474646
50032 1474646 1519410 1569224 1624040 1684622 1752307 1827999 1911884 2004346 2106568 2219542 2342827
50021 2342827 2474820 2613844 2758124 2904910 3050722 3192843 3330191 3462838 3591241
50012C591241J24582J20711J16098J10605J04437R6730Q5502O9860N1194L1212
50002D502172R905j3151l6655n8514p8219r6464j12734j25308j33733j39473j43789
49991C574037j46606j47890j48470j48755j47870j44888j40011j33988j27313
49982B288246j20428j13755j06931r9066r0277q1978p5090o8986o2956n7607n3721
49971A357451n0599m6757m1864l7002l3195l0551k8690k7213k5802k4343k2943
49960I88492k1578k0033j8455j7425j7081j6755j5925j4931j4147j3093j1214
49949H07855r040p584o942o397n728n391n414n085l978k520j375q40r61j569j970
49934G43061j301M47K267L307L755M273N038N741O243O698P186P602P897Q143
$$ plain form
50012 3591241 3715823 3836534 3952632 4063237 4167674 4264404 4349906 4419766 4470960 4502172
50002 4502172 4512077 4498926 4462271 4403757 4325538 4229074 4116340 3991032 3857299 3717826 3574037
49991 3574037 3427431 3279541 3131071 2982316 2834446 2689558 2549547 2415559 2288246
49982 2288246 2167818 2054063 1947132 1848066 1757789 1675811 1600721 1531735 1468779 1411172 1357451
49971 1357451 1306852 1260095 1218231 1181229 1148034 1117483 1088793 1061580 1035778 1011435 988492
49960 988492 966914 946881 928426 911001 893920 877165 861240 846309 832162 819069 807855
49949 807855 798815 791231 784289 777892 772164 766773 761359 756274 752296 749776 748401 747561 746600 745031 743061
49934 743061 741760 742207 744474 747781 751536 755809 760847 766588 772831 779529 786715 794317 802214 810357
49920H10357Q476R134J0426J2445J4887J7421K0065K2932K5762K8231L0740L4331
49908A045207L9453M5211N0402N5003O0014O5942P2210P8186Q3888Q9195R3052
49897A777763R4334R3148R0519Q7058Q2740P7762P2697O7783O2933N8446N4642
49886B619825N0570M4220L4567K2518R245n330k1511l8246n3808o7570p9812r0055
49874B424613r6923r9872r9904r8248r5264r1013q6124q1489p7592p4443p1758
49863A451983o8857o4955n9949n4621m9710m5137m0496l5932l2015k8934k6249
49852I45128k3473k0513j7588j4958j2822j1277j0204r274q153o840n778n483
49840G98765n861o127n628m693m217m439m676m385l906l798l941l862l689l991
$$ plain form
49920 810357 818833 827967 838393 850838 865725 883146 903211 926143 951905 980136 1010876 1045207
49908 1045207 1084660 1129871 1180273 1235276 1295290 1361232 1433442 1511628 1595516 1684711 1777763
49897 1777763 1872097 1965245 2055764 2142822 2225562 2303324 2376021 2443804 2506737 2565183 2619825
49886 2619825 2670395 2714615 2749182 2771700 2780945 2775615 2754104 2715858 2662050 2594480 2514668 2424613
49874 2424613 2327690 2227818 2127914 2029666 1934402 1843389 1757265 1675776 1598184 1523741 1451983
49863 1451983 1383126 1318171 1258222 1203601 1153891 1108754 1068258 1032326 1000311 971377 945128
49852 945128 921655 901142 883554 868596 855774 844497 834293 825019 816866 810026 804248 798765
49840 798765 792904 786777 781149 776456 772239 767800 763124 758739 754833 751035 747094 743232 739543 735552
49826G35552m671m739l562j789o21m65p44r03j004j304j746k114k317k254j725
49811G05594p96K4M20P74J513K173J887Q42L08Q72J515J092J19R7J399K779L004
49794G23616K133J035L99M80J187J915J862R48J31L14J175J551Q26m84j421j496
49778G34171q49K1N83N15m2o22q81r28j076j341j411j116p30o06o50n37l33m71
49760G23697r59j133n84R8O3o58j323j609j815k030j906j461j281j663k209k609
49744G02618l177m024m415l696k436j826k154k633k672k524k742l511m686n862
49730F56260o321n509l761k116j319j307j736k384k884k727j915j170j141j622
49716F20348j928j687j026k70K41L14J44J37L28L15Qj38J18L26J28p1J60M34L09
$$ plain form
49826 735552 730881 726142 722580 720791 720170 719705 718961 718058 717054 715750 714004 711890 709573 707319 705594
49811 705594 704798 704822 705242 706016 707529 709702 711589 712431 712739 713611 715126 716218 716337 716434 717833 720612 723616
49794 723616 725749 726784 727183 727663 728850 730765 732627 733575 733706 734020 735195 736746 737572 737088 735667 734171
49778 734171 733322 733343 733926 734441 734399 733777 732896 731968 730892 729551 728140 727024 726294 725688 725038 724501 724168 723697
49760 723697 722738 721605 721021 721119 721182 720524 719201 717592 715777 713747 711841 710380 709099 707436 705227 702618
49744 702618 699441 695417 691002 687306 684870 683044 680890 678257 675585 673061 670319 666808 662122 656260
49730 656260 649939 644430 640669 638553 637234 635927 634191 631807 628923 626196 624281 623111 621970 620348
49716 620348 618420 616733 615707 615437 615678 615992 616136 616273 616601 616916 616924 616786 616904 617230 617358 617287 617447 617881 618190
49697F18190L69J452L019L522K583J559J494J682J063Q6J69J662L389M072L482
49682F47793K207J011M67P19J306J559J226O96O46J560L284M921N442M762L838
49667F81437L460L419L208L024L292L694L598L212L347M047M459M265M201M802
49653G33465N525N702N628O030O927P723Q055Q010P685P189O861P018P520P962
49639H31300Q161Q156P910P403O926O855P206P598P681P371O831O432O568P277
49625I33675Q125Q605Q543Q045P369O915P015P504P884Q020Q168Q218P607O465
49611A042158N980O963Q612R517R347Q694P863P005O987Q626J1077J2496J2521
49598A157846J2689J3931J5114J4993J4266J4470J5693J6806J7439J8312J9698
$$ plain form
49697 618190 618559 620011 623030 626552 629135 630694 632188 633870 634933 635019 635188 636850 640239 644311 647793
49682 647793 650000 651011 651478 652197 653503 655062 656288 656984 657630 659190 662474 667395 672837 677599 681437
49667 681437 684897 688316 691524 694548 697840 701534 705132 708344 711691 715738 720197 724462 728663 733465
49653 733465 738990 744692 750320 756350 763277 771000 779055 787065 794750 801939 808800 815818 823338 831300
49639 831300 839461 847617 855527 862930 869856 876711 883917 891515 899196 906567 913398 919830 926398 933675
49625 933675 941800 950405 958948 966993 974362 981277 988292 995796 1003680 1011700 1019868 1028086 1035693 1042158
49611 1042158 1048138 1055101 1063713 1073230 1082577 1091271 1099134 1106139 1113126 1121752 1132829 1145325 1157846
49598 1157846 1170535 1184466 1199580 1214573 1228839 1243309 1259002 1275808 1293247 1311559 1331257
49587A331257K0874K1334K1507K1917K2476K3003K3796K5095K6481K7315K7532
49576A592587K7549K7591K7587K7617K8006K8847K9742L0199L0165L0027L0192
49565A910109L0730L1367L1622L1138L0074K9139K8941K9295K9520K9434K9545
49554B240914K9973K9844K8351K5997K4000K2608K0986J8804J6892J5928J5295
49543B489592J3942J1848R841Q363P050N477L675J954O22j78o72j312k155k597
49529B545450k130j197p43j067j506j183K94K728N350P065P276O594O253O806
$$ plain form
49587 1331257 1352131 1373465 1394972 1416889 1439365 1462368 1486164 1511259 1537740 1565055 1592587
49576 1592587 1620136 1647727 1675314 1702931 1730937 1759784 1789526 1819725 1849890 1879917 1910109
49565 1910109 1940839 1972206 2003828 2034966 2065040 2094179 2123120 2152415 2181935 2211369 2240914
49554 2240914 2270887 2300731 2329082 2355079 2379079 2401687 2422673 2441477 2458369 2474297 2489592
49543 2489592 2503534 2515382 2525223 2533586 2540636 2546113 2549788 2551742 2552364 2552186 2551514 2550202 2548047 2545450
49529 2545450 2543320 2542123 2541380 2540313 2538807 2537624 2537918 2540646 2545996 2553061 2560337 2566931 2573184 2579990
$$ [...]
##END NTUPLES=NMR SPECTRUM
##END=
