
##TITLE=AC1256_INDRH11073_6642054_PRwSDJKfXY
##JCAMPDX= 6.0         $$ Bruker NMR JCAMP-DX V2.0
##DATA TYPE= NMR SPECTRUM
##DATA CLASS= NTUPLES
##ORIGIN= BRUKER
##OWNER= Administrator
$$ 1.72 TOPSPIN		Version 2.1
$$ 2012-08-08 15:52:44.578 -0500  Administrator@TOPSPIN
$$ Compression mode = diff/dup
##.OBSERVE FREQUENCY= 400.02188249412
##.OBSERVE NUCLEUS= ^1H
##.ACQUISITION MODE= SIMULTANEOUS (DQD)
##.ACQUISITION SCHEME= undefined
##.AVERAGES= 64
##.DIGITISER RES= 22
##SPECTROMETER/DATA SYSTEM= spect
##.PULSE SEQUENCE= noesygpps1d.comp
##.SOLVENT NAME= COFFEE_meoh
##.SHIFT REFERENCE= INTERNAL, COFFEE_meoh, 1, 14.96215
##AUDIT TRAIL= $$ (NUMBER, WHEN, WHO, WHERE, PROCESS, VERSION, WHAT)
$$ ##TITLE= Audit trail, TOPSPIN		Version 2.1
$$ ##JCAMPDX= 5.01
$$ ##ORIGIN= Bruker BioSpin GmbH
$$ ##OWNER= Administrator
$$ $$ C:\Bruker\TOPSPIN/data/COFFEE/nmr/AC1256_INDRH11073_6642054_PRwSDJKfXY/12/pdata/1/auditp.txt
$$ ##AUDIT TRAIL=  $$ (NUMBER, WHEN, WHO, WHERE, PROCESS, VERSION, WHAT)
(   1,<2012-08-08 15:52:36.437 -0500>,<Administrator>,<TOPSPIN>,<go>,<TOPSPIN 2.1>,
      <created by zg
	started at 2012-08-08 15:41:06.046 -0500,
	POWCHK enabled, PULCHK disabled,
       configuration hash MD5:
       6B 1B 68 BB D9 2E 58 E2 7F 35 AD 54 07 DF 0E 41
       data hash MD5: 64K
       B9 BF E1 57 06 CF AD 25 00 B8 BC CE 15 60 59 FB>)
(   2,<2012-08-08 15:52:39.578 -0500>,<Administrator>,<TOPSPIN>,<proc1d>,<TOPSPIN 2.1>,
      <Start of raw data processing
       efp LB = 0.3 FT_mod = 6 PKNL = 1 PHC0 = 0 PHC1 = 0 SI = 128K 
       data hash MD5: 128K
       DA 7A 36 CC 5F A3 90 F0 BB C7 28 21 7B 09 61 6C>)
(   3,<2012-08-08 15:52:41.218 -0500>,<Administrator>,<TOPSPIN>,<proc1d>,<TOPSPIN 2.1>,
      <pk PHC0 = -0.8404541 PHC1 = 0 
       data hash MD5: 128K
       FD C4 CC 5A 88 61 63 4D 6C 1C 1C C0 4E 69 44 B0>)
(   4,<2012-08-08 15:52:42.250 -0500>,<Administrator>,<TOPSPIN>,<proc1d>,<TOPSPIN 2.1>,
      <abs ABSG = 1 
       data hash MD5: 128K
       65 FA 9D 7F 7A D0 3C 5E 4C 6B 5A CA A1 5D 15 66>)
(   5,<2012-08-08 15:52:42.703 -0500>,<Administrator>,<TOPSPIN>,<proc1d>,<TOPSPIN 2.1>,
      <abs ABSG = 2 
       data hash MD5: 128K
       78 DD 8A 4B 79 60 96 DC 80 CA D8 30 E8 93 68 F3>)
(   6,<2012-08-08 15:52:43.109 -0500>,<Administrator>,<TOPSPIN>,<proc1d>,<TOPSPIN 2.1>,
      <abs ABSG = 3 
       data hash MD5: 128K
       E1 94 77 8D 96 F9 DA 3C D3 27 70 01 35 55 85 47>)
(   7,<2012-08-08 15:52:43.531 -0500>,<Administrator>,<TOPSPIN>,<proc1d>,<TOPSPIN 2.1>,
      <abs ABSG = 4 
       data hash MD5: 128K
       6B D6 DF A2 30 1A C2 7D DA DD 2F 42 21 9F AD 23>)
(   8,<2012-08-08 15:52:44.140 -0500>,<Administrator>,<TOPSPIN>,<proc1d>,<TOPSPIN 2.1>,
      <abs ABSG = 5 
       data hash MD5: 128K
       96 B7 56 E7 DD A1 43 2A 09 52 0F 12 0E FE 37 D0>)
$$ ##END=
$$ 
$$ $$ hash MD5
$$ $$ 98 2B 16 09 0E 09 88 29 1E E2 EE 95 47 89 A4 8B
##$RELAX= 
##$RELAX= 
##$RELAX= 
##$RELAX= 
##$RELAX= 
##$RELAX= 
##$RELAX= 
##$RELAX= 
$$ Bruker specific parameters
$$ [...]
##$TP07= 0
##$TPNAME0= <>
##$TPNAME1= <>
##$TPNAME2= <>
##$TPNAME3= <>
##$TPNAME4= <>
##$TPNAME5= <>
##$TPNAME6= <>
##$TPNAME7= <>
##$TPOAL= (0..7)
0.5 0.5 0.5 0.5 0.5 0.5 0.5 0.5
##$TPOFFS= (0..7)
0 0 0 0 0 0 0 0
##$TUNHIN= 0
##$TUNHOUT= 0
##$TUNXOUT= 0
##$USERA1= <user>
##$USERA2= <user>
##$USERA3= <user>
##$USERA4= <user>
##$USERA5= <user>
##$V9= 5
##$VALIST= <valist>
##$VCLIST= <CCCCCCCCCCCCCCC>
##$VD= 0
##$VDLIST= <DDDDDDDDDDDDDDD>
##$VPLIST= <PPPPPPPPPPPPPPP>
##$VTLIST= <TTTTTTTTTTTTTTT>
##$WBST= 1024
##$WBSW= 4
##$XGAIN= (0..3)
0 0 0 0
##$XL= 0
##$YL= 0
##$YMAX_a= 13921527
##$YMIN_a= -8141235
##$ZGOPTNS= <>
##$ZL1= 120
##$ZL2= 120
##$ZL3= 120
##$ZL4= 120
##$ABSF1= 14.96215
##$ABSF2= -5.596032
##$ABSG= 5
##$ABSL= 3
##$ALPHA= 0
##$AQORDER= 0
##$ASSFAC= 0
##$ASSFACI= 0
##$ASSFACX= 0
##$ASSWID= 0
##$AUNMP= <proc_prof1d_extract.lims>
##$AXLEFT= 0
##$AXNAME= <>
##$AXNUC= <1H>
##$AXRIGHT= 0
##$AXTYPE= 0
##$AXUNIT= <>
##$AZFE= 0.1
##$AZFW= 0.1
##$BCFW= 0
##$BC_mod= 0
##$BYTORDP= 0
##$COROFFS= 0
##$CY= 15
##$DATMOD= 1
##$DC= 0
##$DFILT= <>
##$DTYPP= 0
##$F1P= 0
##$F2P= 0
##$FCOR= 0.5
##$FTSIZE= 131072
##$FT_mod= 6
##$GAMMA= 0
##$GB= 0
##$INTBC= 1
##$INTSCL= 1
##$ISEN= 128
##$LB= 0.3
##$LEV0= 0
##$LPBIN= 0
##$MAXI= 10000
##$MC2= 0
##$MEAN= 0
##$ME_mod= 0
##$MI= 0
##$NCOEF= 0
##$NC_proc= -2
##$NLEV= 6
##$NOISF1= 0
##$NOISF2= 0
##$NSP= 0
##$NTH_PI= 0
##$NZP= 0
##$OFFSET= 14.96215
##$PC= 1
##$PHC0= -0.8404541
##$PHC1= 0
##$PH_mod= 1
##$PKNL= yes
##$PPARMOD= 0
##$PPDIAG= 0
##$PPIPTYP= 0
##$PPMPNUM= 2147483647
##$PPRESOL= 1
##$PSCAL= 4
##$PSIGN= 0
##$PYNMP= <proc.py>
##$REVERSE= no
##$SF= 400.020009177445
##$SI= 131072
##$SIGF1= 0
##$SIGF2= 0
##$SINO= 400
##$SIOLD= 131072
##$SPECTYP= <>
##$SREGLST= <1H.CDCl3>
##$SSB= 0
##$STSI= 131072
##$STSR= 0
##$SW_p= 8223.68421052631
##$SYMM= 0
##$S_DEV= 0
##$TDeff= 65536
##$TDoff= 0
##$TI= <>
##$TILT= no
##$TM1= 0
##$TM2= 0
##$TOPLEV= 0
##$USERP1= <user>
##$USERP2= <user>
##$USERP3= <user>
##$USERP4= <user>
##$USERP5= <user>
##$WDW= 1
##$XDIM= 131072
##$YMAX_p= 292738730
##$YMIN_p= -10700
##$CURPLOT= <Network HP LaserJet P1505>
##$CURPRIN= <$Network HP LaserJet P1505>
##$DFORMAT= <normdp>
##$LAYOUT= <+/1D_H.xwp>
##$LFORMAT= <normlp>
##$PFORMAT= <normpl>
##$SURQMSG= 1
$$ End of Bruker specific parameters
$$ ---------------------------------
##NTUPLES= NMR SPECTRUM
##VAR_NAME=  FREQUENCY,     SPECTRUM/REAL,   SPECTRUM/IMAG
##SYMBOL=    X,             R,               I
##VAR_TYPE=  INDEPENDENT,   DEPENDENT,       DEPENDENT
##VAR_FORM=  AFFN,          ASDF,            ASDF
##VAR_DIM=   131072,        131072,          131072
##UNITS=     HZ,            ARBITRARY UNITS, ARBITRARY UNITS
##FACTOR=    0.0627417313425164, 1,          1
##FIRST=     8223.62146879497, 3984,         -49461
##LAST=      0,             5009,            -48968
##MIN=       0,             -10700,          0
##MAX=       8223.62146879497, 292738730,    0
$$ Real data points
##PAGE= N=1
##DATA TABLE= (X++(R..R)), XYDATA
$$ [...]
61079E78545l524l233l634m392m113k396p28l56n80k40L64L16j75k87rK08M98
61062E56264J101J482J180Q60J373K301K661K542K804L530M041M204M546N215
61048E94104N793O145O511O832O780O378O052O067O408O965P427P356O765O244
61034F85827O136O162O170O476P022P087O544O377P183Q109Q198P850P867P964
61020G84972P450O647O315O297N976N589N779O270O240N663N181M962M778M830
61006H66949N436O303P098Q258J0146J2003J2924J3249J3839J4658J5369J6591
60994A002823J8975K1651K3282K4238K5976K8640L1024L2723L4510L6628L8587
60983A319057M0644M3753M7799N1531N4484N7476O0981O4529O7914P1556P5534
$$ plain form
61079 578545 575021 571788 568154 563762 559649 557253 556525 556169 555589 555349 555713 556029 555854 555567 555558 555766 556264
61062 556264 557365 558847 560027 560887 562260 564561 567222 569764 572568 576098 580139 584343 588889 594104
61048 594104 599897 606042 612553 619385 626165 632543 638595 644662 651070 658035 665462 672818 679583 685827
61034 685827 691963 698125 704295 710771 717793 724880 731424 737801 744984 753093 761291 769141 777008 784972
61020 784972 792422 799069 805384 811681 817657 823246 829025 835295 841535 847198 852379 857341 862119 866949
61006 866949 872385 878688 885786 894044 904190 916193 929117 942366 956205 970863 986232 1002823
60994 1002823 1021798 1043449 1066731 1090969 1116945 1145585 1176609 1209332 1243842 1280470 1319057
60983 1319057 1359701 1403454 1451253 1502784 1557268 1614744 1675725 1740254 1808168 1879724 1955258
60972A955258P9604Q4167Q9782R5801J01092J06005J11940J19234J27291J36730
60962C006904J49181J64985J83248K04184K28934K56980K86452L17480L52418
60953E150766L92313M36381M85893N45208O17782P04820Q09567R38960J098748
60944A1180438J291397J521758J798712K123335K475677K815806L092362L244797
60936B9544282L210905K961484K543725K076946J681706J405222J219883J085281
60928D5729434R87501R09399P89258N45582J50783l40368q47538j334862j808421
60919D4780768k257147k625051k849969k912236k835621k657597k417671k166018
60911B4059458j956455j817334j735789j676651j612546j534189j441609j336016
$$ plain form
60972 1955258 2034862 2119029 2208811 2304612 2405704 2511709 2623649 2742883 2870174 3006904
60962 3006904 3156085 3321070 3504318 3708502 3937436 4194416 4480868 4798348 5150766
60953 5150766 5543079 5979460 6465353 7010561 7628343 8333163 9142730 10081690 11180438
60944 11180438 12471835 13993593 15792305 17915640 20391317 23207123 26299485 29544282
60936 29544282 32755187 35716671 38260396 40337342 42019048 43424270 44644153 45729434
60928 45729434 46716935 47626334 48415592 48961174 49111957 48771589 47924051 46589189 44780768
60919 44780768 42523621 39898570 37048601 34136365 31300744 28643147 26225476 24059458
60911 24059458 22103003 20285669 18549880 16873229 15260683 13726494 12284885 10948869
60903A0948869j219507j095976r70163q47339p33025o30798n40864m62239l95145
60894D053813l39745k94107k55652k23641j98279j78241j61212j46259j33801
60885B122876j23595j14547j06140r8400r0728q2451p4353o7951o3289n8896n4049
60874A188477m9497m5818m2499l9116l6134l3938l2061k9872k7335k4687k2094
60863H05426j9909j8543j7758j6722j5118j3539j2589j2156j1859j1570j1174
60852F44489j0463r601r152r262r291q624p407o206n353m960n084n511n762n667
60838E42146n504n342m783l751k970l086l734m084l883l360k487j190J5L95L0
60823D98412l43m06m39m19J44J251K221K761L439M540N309N053M382M516N653
$$ plain form
60903 10948869 9729362 8633386 7663223 6815884 6082859 5452061 4911197 4448958 4053813
60894 4053813 3714068 3419961 3164309 2940668 2742389 2564148 2402936 2256677 2122876
60885 2122876 1999281 1884734 1778594 1680194 1589466 1507015 1432662 1364711 1301422 1242526 1188477
60874 1188477 1138980 1093162 1050663 1011547 975413 941475 909414 879542 852207 827520 805426
60863 805426 785517 766974 749216 732494 717376 703837 691248 679092 667233 655663 644489
60852 644489 634026 624425 615273 606011 596720 588096 580689 574483 569130 564170 559086 553575 547813 542146
60838 542146 536642 531300 526517 522766 519796 516710 512976 508892 505009 501649 499162 497972 497987 498382 498412
60823 498412 498069 497663 497224 496805 496949 498200 500421 503182 506621 511161 516470 521523 525905 530421 536074
60808E36074O875P384P093O129M617L102K386K636L070K759J527o2j299j903k284
60793E78104l151m567n649n647n068n008n534n682n112m716n192n871n670m566
60779E06671l444k964l145l727m322m473m134l823l837l723k989j911j017k60
60765D62902N87J069O14k71l89N20J483J767J773K160K914L722M508N128N145
60750D93632M469L753L670M045M192L735K764J451Nj233k096k814l686m638n406
60735E01843n954o397o773p156p717q391q649q064o971o200o228o806p390p628
60721D01519p546p423p416p261o550n410m459l986l651l319l519m458n195m709
60707C26617l420k658k758k779k168j591j678j942j607q03k76l67q38j324j400
$$ plain form
60808 536074 542949 550333 557426 563555 568172 571274 573660 576296 579366 582125 583652 583590 582291 580388 578104
60793 578104 574953 570386 564737 559090 554022 549014 543480 537798 532686 527970 522778 516907 511237 506671
60779 506671 503227 500263 497118 493391 489069 484596 480462 476639 472802 469079 466090 464179 463162 462902
60765 462902 463489 464558 465172 464901 464512 465032 466515 468282 470055 472215 475129 478851 483359 488487 493632
60750 493632 498101 501854 505524 509569 513761 517496 520260 521711 521716 520483 518387 515573 511887 507249 501843
60735 501843 495889 489492 482719 475563 467846 459455 450806 442742 435771 429571 423343 416537 409147 401519
60721 401519 393973 386550 379134 371873 365323 359913 355454 351468 347817 344498 340979 336521 331326 326617
60707 326617 323197 320539 317781 315002 312834 311243 309565 307623 306016 305213 304937 304570 303732 302408 301008
60692C01008o56O89J639J449N89J12L48Q91J561K625M012N095N353M859M017L273
60676C36864L066L570M385M889M917M775M670M605M735N215N763O012O240P020
60662D06726Q124Q609Q254P960Q373Q992R165R116R208Q994P935O594O023O260
60648E20333O305N543M309L102K050J147L54o24j992l337m084m446n089n927o109
60633E11535n452m910n205n809n813n188m521m041l523k876k204j557j002p40
60619D58694p49o05p8L90L46J16M39J370K226K572K781L436M562N602O019N820
60603D92941N634O159P406Q674R353R574R818J0248J0778J1486J2418J3143J3082
60590F20714J2283J1329J0456R231P263M777K254p7k263m360o333p972q841q702
$$ plain form
60692 301008 300352 301041 302680 304129 304718 304830 305178 306069 307630 310255 314267 319362 324715 329574 333591 336864
60676 336864 339930 343500 347885 352774 357691 362466 367136 371741 376476 381691 387454 393466 399706 406726
60662 406726 414850 423459 431713 439673 448046 457038 466203 475319 484527 493521 501456 508050 514073 520333
60648 520333 526638 532181 536490 539592 541642 542789 543143 542519 540527 537190 533106 528660 523571 517644 511535
60633 511535 506083 501173 495968 490159 484346 479158 474637 470596 467073 464197 461993 460436 459434 458694
60619 458694 457945 457340 457262 457652 457998 458114 458553 459923 462149 464721 467502 470938 475500 481102 487121 492941
60603 492941 498575 504734 512140 520814 530167 539741 549559 559807 570585 582071 594489 607632 620714
60590 620714 632997 644326 654782 664013 671276 676053 678307 678230 675967 671607 665274 657302 648461 639759
60576F39759q013p636p859q161q118p993q074p976p232o208n745n922n941n269
60562E39612m293l602l277l152l279l604l611k827j523m15K61Q79J691K501L147
60547E18508L792M486M957N074N187N600O063O242O407P090Q202R082R518J0100
60533F10308J1356J2981J4351J5475J6935J9044K1460K3744K6003K8833L2720
60522H33210L7598M2929M8272N3802O0186O7781P6087Q4167R1464R7771J02433
60511A595700J04124J01884R6065Q7805P7738O5804N2341L8652K6116J5148N377
60500B266754l527j1706j9408k6705l2967l7355l9940m1792m3704m5277m5457
60489A918916m3462l9018l2347k4406j6497r010q37R236K0766L1911M1322M9064
$$ plain form
60576 639759 631746 624110 616251 608090 599972 591979 583905 575929 568697 562489 556744 550822 544881 539612
60562 539612 535319 531717 528440 525288 522009 518405 514794 511967 510444 510029 510290 511169 512860 515361 518508
60547 518508 522300 526786 531743 536817 542004 547604 553667 559909 566316 573406 581608 590690 600208 610308
60533 610308 621664 634645 648996 664471 681406 700450 721910 745654 771657 800490 833210
60522 833210 870808 913737 962009 1015811 1075997 1143778 1219865 1304032 1395496 1493267 1595700
60511 1595700 1699824 1801708 1897773 1985578 2063316 2129120 2181461 2220113 2246229 2261377 2266754
60500 2266754 2263227 2251521 2232113 2205408 2172441 2135086 2095146 2053354 2009650 1964373 1918916
60489 1918916 1875454 1836436 1804089 1779683 1763186 1754176 1753339 1762575 1783341 1815252 1856574 1905638
60477A905638N5538O0187O1706N9330N3610M6033L7959K9887K1846J4399Q910
60466B355043O490P062R921J4860K2152L1582M2332N4005O7117Q2323R9677J18982
60454B911546J40491J64936J93094K25498K62151L02173L43809L84860M22813
60445E351371M54378M75240M80766M67302M33213L79212L07919K23065J29125
60436H701591L1641o2811j47985k19725k76383l17928l45365l60902l67574l68118
60426F266441l64490l58460l51813l45392l38495l29782l18536l04713k88361
60417C266399k69574k48821k26872k04557j82793j62477j43938j26892j11254
60408A589221r7623q6492p7381o9323o1986n5730n0707m6492m2571l8753l5076
$$ plain form
60477 1905638 1961176 2021363 2083069 2142399 2196009 2242042 2280001 2309888 2331734 2346133 2355043
60466 2355043 2361533 2368595 2378516 2393376 2415528 2447110 2489442 2543447 2610564 2692887 2792564 2911546
60454 2911546 3052037 3216973 3410067 3635565 3897716 4199889 4543698 4928558 5351371
60445 5351371 5805749 6280989 6761755 7229057 7662270 8041482 8349401 8572466 8701591
60436 8701591 8733232 8670421 8522436 8302711 8026328 7708400 7363035 7002133 6634559 6266441
60426 6266441 5901951 5543491 5191678 4846286 4507791 4178009 3859473 3554760 3266399
60417 3266399 2996825 2748004 2521132 2316575 2133782 1971305 1827367 1700475 1589221
60408 1589221 1491598 1405106 1327725 1258402 1196416 1140686 1089979 1043487 1000916 962163 927087
60397I27087l1659k8683k6202k4062k2127k0435j8914j7286j5526j4141j3517
60386F94535j3351j3140j2890j2771j2383j1144r385q211q126q471q459q226q334
60373E59644q754q755p831o292n001m598m970n394n194m351l398k813k558k273
60359D87462j799j390j357j571j555j190r97j420k008j939j295j118j959l069
60345D64795l432l061k655k470k176j609r81m32Q0N27Q76J323K021K723L175L666
60329D62370M597N621N881N187M340M121M515N084N642O272P050P964Q873R456
60315E46973R421Q886Q233P540O527N125L709K542J332l38k368m208n452o168
60301E81754o596o733o299n200l878k999k797k957l170l400l421k708j238K9Q4
$$ plain form
60397 927087 895428 866745 840543 816481 794354 773919 755005 737719 722193 708052 694535
60386 694535 681184 668044 655154 642383 630000 618856 609471 601260 593134 584663 576204 567978 559644
60373 559644 550890 542135 534304 528012 523011 518413 513443 508049 502855 498504 495106 492293 489735 487462
60359 487462 485663 484273 482916 481345 479790 478600 477603 476183 474175 472236 470941 469823 467864 464795
60345 464795 461363 458302 455647 453177 451001 449392 448411 447979 448059 448586 449462 450785 452806 455529 458704 462370
60329 462370 466967 472588 478469 483656 487996 492117 496632 501716 507358 513630 520680 528644 537517 546973
60315 546973 556394 565280 573513 581053 587580 592705 596414 598956 600288 599950 597582 593374 587922 581754
60301 581754 575158 568425 562126 556926 553048 550049 547252 544295 541125 537725 534304 531596 530358 530387 530471
60286E30471r29k059k891l713m495m618l922l196l106l251k851j947j294j234
60272D90965j296r53l36N1K2l4L36J133J940K443K728L043L521M210N146O072
60256E18991O493O296O181O968Q662J0580J2301J3939J5575J6999J8169J9382
60244F60536K0859K2543K4413K6472K8362K9493K9798K9883L0128L0124K9347
60233I61958K7973K6598K5420K4183K2655K0731J8212J5024J1593Q611O305M256
60221A173519K010l24k189l146l210k727k050j348o18K17J296K718M374N972P446
60206A181940R186J1618J4567J7362J9615K1611K3776K5971K7554K7998K7355
60195A408553K6115K4701K3093K0960J8194J5145J2128Q903N000N78l439o342
$$ plain form
60286 530471 529542 527483 524592 520879 516384 511766 507844 504648 501542 498291 495440 493493 492199 490965
60272 490965 489669 488716 488380 488431 488453 488419 488755 489888 491828 494271 496999 500042 503563 507773 512919 518991
60256 518991 525484 531780 537961 544929 553591 564171 576472 590411 605986 622985 641154 660536
60244 660536 681395 703938 728351 754823 783185 812678 842476 872359 902487 932611 961958
60233 961958 989931 1016529 1041949 1066132 1088787 1109518 1127730 1142754 1154347 1162958 1169263 1173519
60221 1173519 1175529 1175205 1173016 1169870 1166660 1163933 1161883 1160535 1159917 1160134 1161430 1164148 1168522 1174494 1181940
60206 1181940 1191126 1202744 1217311 1234673 1254288 1275899 1299675 1325646 1353200 1381198 1408553
60195 1408553 1434668 1459369 1482462 1503422 1521616 1536761 1548889 1557792 1562792 1563370 1559931 1553589
60183A553589q383j0298j2313j3906j4479j3895j2419j0384q071n672l106J02
60171A440765M387R438J4214J7943K0979K4309K8296L2444L6335M0096M3663M6397
60159A759266M8027M9376N1241N2887N2640M9924M5739M0958L5212K7939J9678
60148B232887J1575M114k780q759j3023j5398j6562j6894j5808j2736q404m343
60136B133869j089K439P518J4111K1208K8223L5333M2605M9622N6170O2521O8618
60124B521148P3633P6860P8547P9231P8738P6580P2975O8563O3252N6253M7400
60113C293180L7617K7801J7986P953k019j1529k0765l0163l9497m7840n4434n9298
60101C118992o2886o5467o6874o6796o5075o1835n7477n2557m7461m2008l5622
$$ plain form
60183 1553589 1545206 1534908 1522595 1508689 1494210 1480315 1467896 1457512 1449441 1443769 1440663 1440765
60171 1440765 1445152 1454590 1468804 1486747 1507726 1532035 1560331 1592775 1629110 1669206 1712869 1759266
60159 1759266 1807293 1856669 1907910 1960797 2013437 2063361 2109100 2150058 2185270 2213209 2232887
60148 2232887 2244462 2248576 2245796 2237037 2224014 2208616 2192054 2175160 2159352 2146616 2138212 2133869
60136 2133869 2132780 2135219 2142737 2156848 2178056 2206279 2241612 2284217 2333839 2390009 2452530 2521148
60124 2521148 2594781 2671641 2750188 2829419 2908157 2984737 3057712 3126275 3189527 3245780 3293180
60113 3293180 3330797 3358598 3376584 3384537 3382518 3370989 3350224 3320061 3280564 3232724 3178290 3118992
60101 3118992 3056106 2990639 2923765 2856969 2791894 2730059 2672582 2620025 2572564 2530556 2494934
60090B494934k8213k0733j4359r158m121J342O676J1045J4185J5968J6020J4521
60078B498107J2673J1450J0255P846M278R02j463l326n400p617r477j0676j1135
60065B496417j0954j0424r598p921m837p00L624P953J2767J8051K3085K7516L1686
60052B576665L5594L8367L9186L8132L5836L2895K9791K6705K3176J8658J3560
60041B908565R022N359J590l110q327j3257j7874k2598k7397l1924l6205m0623
60029B723221m5385n0293n4749n7880n9065n8591n7368n5929n4154n1905m9193
60018B128709m5715m1063l5671l0592k6129k1534j6391j1232o406j452L821Q686
60006A905031J2779J6924K1751K6385K9564L1389L2769L3771L3678L2317L0173
$$ plain form
60090 2494934 2466721 2445988 2431629 2422471 2418350 2419692 2426368 2437413 2451598 2467566 2483586 2498107
60078 2498107 2510780 2522230 2532485 2540331 2544609 2545511 2544048 2540722 2535322 2527705 2518228 2507552 2496417
60065 2496417 2485463 2475039 2465441 2457520 2452683 2451983 2455607 2463560 2476327 2494378 2517463 2544979 2576665
60052 2576665 2612259 2650626 2689812 2727944 2763780 2796675 2826466 2853171 2876347 2895005 2908565
60041 2908565 2917587 2922946 2924536 2921426 2913099 2899842 2881968 2859370 2831973 2800049 2763844 2723221
60029 2723221 2677836 2627543 2572794 2514914 2455849 2397258 2339890 2283961 2229807 2177902 2128709
60018 2128709 2082994 2041931 2006260 1975668 1949539 1928005 1911614 1900382 1893976 1892524 1896345 1905031
60006 1905031 1917810 1934734 1956485 1982870 2012434 2043823 2076592 2110363 2144041 2176358 2206531
59995B206531K7313K3307J8176J2611P150J819l541r050j4720k0128k4495k7553
59983B197420k9941l2123l3458l3083l1254k8933k6421k3367j9850j6439j3187
59972A909364r498n062k82M282Q350J1863J5018J8143K1141K3315K4352K4983
59960B045969K5970K6827K6459K4722K2411J9986J7343J4657J2346J0171P549
59949B254410M824L194L129L817M510N471P274J0036J3852J9126K5911L3436M0876
59936B429866M8171N5605O3099P0319P7193Q3829Q9972R4843R7388R6657R2211
59925C299153Q4312P3552O0435M5538K9800J4087j517j7251l2444m5456n5233
59914C454976o2405o8412p3841p7993p9868p9246p6872p3791p0548o7036o3032
$$ plain form
59995 2206531 2233844 2257151 2275327 2287938 2295088 2296907 2293366 2284316 2269596 2249468 2224973 2197420
59983 2197420 2167479 2135356 2101898 2068815 2037561 2008628 1982207 1958840 1938990 1922551 1909364
59972 1909364 1899866 1894804 1894522 1898804 1907154 1919017 1934035 1952178 1973319 1996634 2020986 2045969
59960 2045969 2071939 2098766 2125225 2149947 2172358 2192344 2209687 2224344 2236690 2246861 2254410
59949 2254410 2259234 2262428 2265557 2269374 2273884 2279355 2286629 2296665 2310517 2329643 2355554 2388990 2429866
59936 2429866 2478037 2533642 2596741 2667060 2744253 2828082 2918054 3012897 3110285 3206942 3299153
59925 3299153 3383465 3457017 3517452 3562990 3592790 3606877 3605360 3588109 3555665 3510209 3454976
59914 3454976 3392571 3324159 3250318 3172325 3092457 3013211 2936339 2862548 2792000 2724964 2661932
59903B661932n8512n3233m6564l8322k9517k1508j4471p432J46P591J4060J9496
59891B433666K4053K7162K7895K6080K2444J7716J1929M758l792j3199k2737l1780
59879B524195l9770m6195n0936n4581n7901o0988o3264o4436o4926o5088o4620
59868A891490o3188o1149n9007n6593n3464m9823m6299m2962l9344l5305l1198
59857A353158k7204k3239j9585j6889j5310j4229j2992j1479r849q223o731n453
59845A181975m213k751j114M90K075L638M700M639L468J727l12k716n246p370
59831A178990r012j0576j2101j3093j3381j3476j3829j4257j4381j4113j3512
59820A037259j2634j1692j0900j0020q587o687m927l441j619R80L983O753Q981
$$ plain form
59903 2661932 2603420 2550187 2503623 2465301 2435784 2414276 2399805 2392373 2392519 2400110 2414170 2433666
59891 2433666 2457719 2484881 2512776 2538856 2561300 2579016 2590945 2595703 2591911 2578712 2555975 2524195
59879 2524195 2484425 2438230 2387294 2332713 2274812 2213824 2150560 2086124 2021198 1956110 1891490
59868 1891490 1828302 1767153 1708146 1651553 1598089 1548266 1501967 1459005 1419661 1384356 1353158
59857 1353158 1325954 1302715 1283130 1266241 1250931 1236702 1223710 1212231 1202382 1194159 1187428 1181975
59845 1181975 1177762 1175011 1173897 1174387 1176462 1180100 1184800 1189439 1192907 1194634 1194322 1191606 1186360 1178990
59831 1178990 1169978 1159402 1147301 1134208 1120827 1107351 1093522 1079265 1064884 1050771 1037259
59820 1037259 1024625 1012933 1002033 992013 983426 976739 971812 968371 966752 967732 971715 978468 987449
59807I87449J0529J1348J1894J2990J4766J6270J6583J5875J4921J4068J3267
59796A139960J2695J2690J3296J4342J5867J7969K0350K2540K4517K6630K8846
59785A349702L0562L1318L1529L2214L4075L7081M0923M5594N1185N7268O2993
59774A804444O7946P2437P6537P9225P9073P5528O8965N9681M7510L2608J6074
59763B480028m07j5329k7781l7599m5083n0395n3312n3845n2761n1006m8850m6151
59751A997509m3258m0880l9083l7101l4151k9951k4591j8541j2678p442k093M419
59739A712159J1823J8745K4559K9980L5711M1653M7788N4621O2077O9102P5166
59728B183384Q1384Q9140R8329J07809J17097J26584J36427J46172J55358J63650
$$ plain form
59807 987449 997978 1009326 1021220 1034210 1048976 1065246 1081829 1097704 1112625 1126693 1139960
59796 1139960 1152655 1165345 1178641 1192983 1208850 1226819 1247169 1269709 1294226 1320856 1349702
59785 1349702 1380264 1411582 1443111 1475325 1509400 1546481 1587404 1632998 1684183 1741451 1804444
59774 1804444 1872390 1944827 2021364 2100589 2179662 2255190 2324155 2383836 2431346 2463954 2480028
59763 2480028 2479621 2464292 2436511 2398912 2353829 2303434 2250122 2196277 2143516 2092510 2043660 1997509
59751 1997509 1954251 1913371 1874288 1837187 1803036 1773085 1748494 1729953 1717275 1709833 1707740 1712159
59739 1712159 1723982 1742727 1767286 1797266 1832977 1874630 1922418 1977039 2039116 2108218 2183384
59728 2183384 2264768 2353908 2452237 2560046 2677143 2803727 2940154 3086326 3241684 3405334
59718C405334J70419J74928J77059J77348J76230J73717J69899J65403J61165
59709D951502J57877J55703J54467J54095J54799J56668J59102J60959J61225
59700F366397J59299J54728J47220J36989J24537J09928R2871P3783N4247L6036
59690G456035K0003O164n612j5318k2729k7230k8101k5396k0241j3803o221L206
59678G320757J5095K9585M6508O5375Q5359J05647J25874J45977J65531J83237
59668H288945J96933K04237K03496J94128J76088J49486J15221P5503L2885j1120
59658I625802n5532r8243j36095j67080j91417k10048k23095k30413k32800k31811
59648G849268k28994k25973k24515k25545k28511k32381k36917k42229k47623
$$ plain form
59718 3405334 3575753 3750681 3927740 4105088 4281318 4455035 4624934 4790337 4951502
59709 4951502 5109379 5265082 5419549 5573644 5728443 5885111 6044213 6205172 6366397
59700 6366397 6525696 6680424 6827644 6964633 7089170 7199098 7291969 7365752 7419999 7456035
59690 7456035 7476038 7482202 7476590 7461272 7438543 7411313 7383212 7357816 7337575 7323772 7317551 7320757
59678 7320757 7335852 7365437 7411945 7477320 7562679 7668326 7794200 7940177 8105708 8288945
59668 8288945 8485878 8690115 8893611 9087739 9263827 9413313 9528534 9604037 9636922 9625802
59658 9625802 9570270 9472027 9335932 9168852 8977435 8767387 8544292 8313879 8081079 7849268
59648 7849268 7620274 7394301 7169786 6944241 6715730 6483349 6246432 6004203 5756580
59639E756580k51746k53578k52612k48432k41027k31341k20662k09468j97543
59630C650171j85072j72879j61593j51234j41675j32857j24420j15716j06508
59621B358217r7311q8817q1162p3903o6520n8884n1335m4361l8254l3077k8900
59610A695693k5739k3347k1428k0066j9551j9735k0131k0725k2015k3870k5123
59599A453963k4869k3718k3021k3173k3357k2814k1719k0707k0111j9742j9273
59588A211459j8569j7726j6739j5302j3191j0822q934p703o616n294l908k586
59576A084069j075O73K153L035L751M931O567Q142R224R679R646R672J0425J1976
59562A172868J3735J5339J7117J9352K1722K3841K5875K8149L0641L3220L5944
$$ plain form
59639 5756580 5504834 5251256 4998644 4750212 4509185 4277844 4057182 3847714 3650171
59630 3650171 3465099 3292220 3130627 2979393 2837718 2704861 2580441 2464725 2358217
59621 2358217 2260906 2172089 2090927 2017024 1950504 1891620 1840285 1795924 1757670 1724593 1695693
59610 1695693 1669954 1646607 1625179 1605113 1585562 1565827 1545696 1524971 1502956 1479086 1453963
59599 1453963 1429094 1405376 1382355 1359182 1335825 1313011 1291292 1270585 1250474 1230732 1211459
59588 1211459 1192890 1175164 1158425 1143123 1129932 1119110 1110176 1102473 1095857 1090563 1086655 1084069
59576 1084069 1082994 1083667 1085820 1088855 1092606 1097537 1104104 1112246 1121470 1131149 1140795 1150467 1160892 1172868
59562 1172868 1186603 1201942 1219059 1238411 1260133 1283974 1309849 1337998 1368639 1401859 1437803
59551A437803L8782M1602M4740M8857N3820N8498O2234O5683O9489P2908P4759
59540B069175P5098P5008P5064P4923P4176P2659P0169O6619O2228N6992N0337
59529B822448M2140L3646K6404K0466J4638Q436K875p14j875r34J523M908Q899
59516B982860J3537J8796K4115K8802L2691L5853L7732L7201L3549K7079J8759
59505C290974R486n37j1878k5028l9211n2567o3827p3206q1222q7410r1058r2509
59493B682007r2812r2433r1195q9189q6738q3660p9472p4271o8712o3171n7555
59482A802799n1733m5577l8893l1861k5184j9168j3183o779o64M488R530J5834
59470A599609K3072K9519L4445L8837M3595M8362N2450N5667N7785N8311N7348
$$ plain form
59551 1437803 1476585 1518187 1562927 1611784 1665604 1724102 1786336 1852019 1921508 1994416 2069175
59540 2069175 2144273 2219281 2294345 2369268 2443444 2516103 2586272 2652891 2715119 2772111 2822448
59529 2822448 2864588 2898234 2924638 2945104 2959742 2968178 2971053 2970339 2968464 2967530 2969053 2973961 2982860
59516 2982860 2996397 3015193 3039308 3068110 3100801 3136654 3174386 3211587 3245136 3272215 3290974
59505 3290974 3300460 3299923 3288045 3263017 3223806 3171239 3107412 3034206 2952984 2865574 2774516 2682007
59493 2682007 2589195 2496762 2405567 2316378 2229640 2145980 2066508 1992237 1923525 1860354 1802799
59482 1802799 1751066 1705489 1666596 1634735 1609551 1590383 1577200 1570421 1569757 1574245 1583775 1599609
59470 1599609 1622681 1652200 1686645 1725482 1769077 1817439 1869889 1925556 1983341 2041652 2099000
59459B099000N5675N3403M9402M2707L3845K4167J4359M281o099j6249k5463l3420
59447B295608m0321m6504n1872n5895n8367n9845o0939o1517o1155o0078n8875
59436A680240n7533n5536n2827m9908m6933m3538l9674l5900l2606k9556k6309
59425A209920k2737j9021j5552j2784j0696q539n623k249O31K588M051N711Q050
59412A133750J1196J4666J7480J9122J9990K0440K0040J8545J6917J6272J6407
59401A324825J6574J7232J9484K3068K6473K9055L1451L3811L5202L5231L4866
59390A627272L5083L5937L7375L9783M3177M7074N1662N7935O5975P4331Q1860
59379B197464Q9118R7080J05546J13889J22526J32387J43303J54023J63645J72234
$$ plain form
59459 2099000 2154675 2208078 2257480 2300187 2334032 2358199 2372558 2376839 2370740 2354491 2329028 2295608
59447 2295608 2255287 2208783 2156911 2101016 2042649 1982804 1921865 1860348 1799193 1739115 1680240
59436 1680240 1622707 1567171 1514344 1464436 1417503 1373965 1334291 1298391 1265785 1236229 1209920
59425 1209920 1187183 1168162 1152610 1139826 1129130 1120591 1114968 1112719 1113350 1115938 1119989 1125700 1133750
59412 1133750 1144946 1159612 1177092 1196214 1216204 1236644 1256684 1275229 1292146 1308418 1324825
59401 1324825 1341399 1358631 1378115 1401183 1427656 1456711 1488162 1521973 1557175 1592406 1627272
59390 1627272 1662355 1698292 1735667 1775450 1818627 1865701 1917363 1975298 2041273 2115604 2197464
59379 2197464 2286582 2383662 2489208 2603097 2725623 2858010 3001313 3155336 3318981 3491215
59369C491215J80100J87003J92191J94920J95013J92988J89429J84413J77969
59360E185241J70831J63998J57531J50718J43417J36243J29149J20870J10266
59351F468264R7419Q2949O7027M9600L0850J0988r828l0966n1383p0539q8525
59340F555856j05092j19438j31369j41706j50945j58359j63106j65519j66555
59331E253767j66605j65427j62803j58707j53325j47273j41227j34924j27339
59322C896137j18249j08830j00159r1967q3584p5238o7572o0486n3420m6400l9923
59311C050309l4073k8454k2762j6933j1020n424q59K429N018P437R349J0090R632
59298B974739Q415O658M289J321k120n939r961j3978j7990k1937k5224k7257k8582
$$ plain form
59369 3491215 3671315 3858318 4050509 4245429 4440442 4633430 4822859 5007272 5185241
59360 5185241 5356072 5520070 5677601 5828319 5971736 6107979 6237128 6357998 6468264
59351 6468264 6565683 6648632 6715659 6765259 6796109 6807097 6797269 6766303 6714920 6644381 6555856
59340 6555856 6450764 6331326 6199957 6058251 5907306 5748947 5585841 5420322 5253767
59331 5253767 5087162 4921735 4758932 4600225 4446900 4299627 4158400 4023476 3896137
59322 3896137 3777888 3669058 3568899 3476932 3393348 3318110 3250538 3190052 3136632 3090232 3050309
59311 3050309 3016236 2987782 2965020 2948087 2937067 2931643 2930784 2933213 2938231 2945668 2955017 2965107 2974739
59298 2974739 2983154 2989812 2994101 2995422 2993302 2987363 2977402 2963424 2945434 2923497 2898273 2871016 2842434
59285B842434l0476l3105l5031l5105l3838l2291l0547k8141k5154k1906j8289
59274B518551j4359j0960q802p415n908m320l327l154l763n608r156j3888j8777
59261B409114k3496k8225l2598l5925l8319m0523m2581m3693m3479m2484m1252
59250A996539l9681l7551l5019l2297k9358k6220k2989j9440j5029r616l860J517
59238A726996O619J2224J8757K5719L2271L8151M3539M7986N0216M9627M7660
59227B099765M6744M8023N0939N4926O0328O7347P5365Q3871R3114J03046J12438
59216B895906J19966J25576J29917J32952J33967J32523J28558J21853J12277
59207D033495J00359Q6961P2449N6798M0278K3600P581o827j8650k7608l4506
$$ plain form
59285 2842434 2811958 2778853 2743822 2708717 2674879 2642588 2612041 2583900 2558746 2536840 2518551
59274 2518551 2504192 2493232 2484430 2477015 2471107 2466787 2463460 2460306 2456543 2450935 2441779 2427891 2409114
59261 2409114 2385618 2357393 2324795 2288870 2250551 2210028 2167447 2123754 2080275 2037791 1996539
59250 1996539 1956858 1919307 1884288 1851991 1822633 1796413 1773424 1753984 1738955 1729339 1725479 1726996
59238 1726996 1733615 1745839 1764596 1790315 1822586 1860737 1904276 1952262 2002478 2052105 2099765
59227 2099765 2146509 2194532 2245471 2300397 2360725 2428072 2503437 2587308 2680422 2783468 2895906
59216 2895906 3015872 3141448 3271365 3404317 3538284 3670807 3799365 3921218 4033495
59207 4033495 4133854 4220815 4293264 4350062 4390340 4413940 4421521 4414694 4396044 4368436 4333930
59196D333930m0338m5236m8800n1121n2941n5049n7924o1703o5941o9665p2198
59185C713014p3698p4587p4878p4443p3519p2372p0832o8723o6384o4234o2132
59174B937212n9668n6786n3614n0069m6129m2212l8792l5909l3315l0743k7785
59163B462190k4024j9805j6170j3611j1388q678n680k982m99K237N223Q205J1261
59150B386279J4440J7194J8916J9688J9961J9893J9594J9374J9093J7872J5219
59139B587523J1831Q465M658l83o164j1274j5151j8440k1780k5165k8366l1120
59127B454634l2945l3493l3074l2259l1182k9726k8030k6231k4071k1413j8692
59116B143518j6172j3368r919o535m086k322l69J843L703N116O515P967R157J0177
$$ plain form
59196 4333930 4293592 4248356 4199556 4148435 4095494 4040445 3982521 3920818 3854877 3785212 3713014
59185 3713014 3639316 3564729 3489851 3415408 3341889 3269517 3198685 3129962 3063578 2999344 2937212
59174 2937212 2877544 2820758 2767144 2717075 2670946 2628734 2589942 2554033 2520718 2489975 2462190
59163 2462190 2438166 2418361 2402191 2388580 2377192 2368514 2362834 2359852 2359353 2361590 2366813 2375018 2386279
59150 2386279 2400719 2417913 2436829 2456517 2476478 2496371 2515965 2535339 2554432 2572304 2587523
59139 2587523 2599354 2607819 2612477 2612094 2605930 2594656 2579505 2561065 2539285 2514120 2485754 2454634
59127 2454634 2421689 2388196 2355122 2322863 2291681 2261955 2233925 2207694 2183623 2162210 2143518
59116 2143518 2127346 2113978 2104059 2097524 2093438 2091116 2090747 2092590 2096293 2101409 2107924 2115891 2125048 2135225
59102B135225J1412J2859J4298J5838J7480J8499J8129J6394J3499Q906K133o072
59090B278600j4474k2891l1728m0409m7648n3165n7739o1603o4065o4849o4614
59079A755415o3981o3095o2183o1523o0692n8904n6168n3234n0426m7491m4538
59068A133180m1991l9631l6784l3461l0266k7201k3808k0469j8195j6933j5439
59057H29002j3222j1278j0388r891q834p271n713m192k636j501j242j568j722
59044G49544j173J43J915L569M872O373Q712J1543J3842J5230J6142J6710J6519
59031H63941J5556J4444J3487J2402J1219J0421R960R151P947P208P147O585M597
59018I94065K057N94N20O57j5j244j997j587k92R61J566J759J996K066J393nj568
$$ plain form
59102 2135225 2146637 2159496 2173794 2189632 2207112 2225611 2243740 2260134 2273633 2282539 2284672 2278600
59090 2278600 2264126 2241235 2209507 2169098 2121450 2068285 2010546 1948943 1884878 1820029 1755415
59079 1755415 1691434 1628339 1566156 1504633 1443941 1385037 1328869 1275635 1225209 1177718 1133180
59068 1133180 1091189 1051558 1014774 981313 951047 923846 900038 879569 861374 844441 829002
59057 829002 815780 804502 794114 784223 775389 768118 762405 758213 755577 754076 752834 751266 749544
59044 749544 748371 748514 750429 753998 758870 765243 773955 785498 799340 814570 830712 847422 863941
59031 863941 879497 893941 907428 919830 931049 941470 951430 960581 968528 975736 982883 989468 994065
59018 994065 996122 996716 997236 997893 997878 996634 994637 993050 992758 993719 995285 997044 999040 1001106 1002499 1002494 1000926
59001A000926l157n225p860j0407j2306j3657j4730j5497j5893j6092j6248j6310
58989H53544j6211j5876j5073j3742j2364j1415j0553q993o689m483k978j886
58977G33281o35R51K689M332N780P296R295J1625J3353J3884J3786J3885J4003
58964H43525J3466J2372J1383J0594R726R000Q756Q447P331N988N745O668P519
58951I60520P777Q186R111R864J0102J0508J1526J2552J2970J2944J2745J2449
58939A091254J2703J4535J7723K0475K1557K1798K2689K4462K6384K8207L0300
58928A332087L2833L5666L8790M2278M5979M9650N3282N7058O1273O6324P2412
58917A887632P9251Q6478R4175J02510J11128J19651J28440J37990J47832J57053
$$ plain form
59001 1000926 997769 992544 984684 974277 961971 948314 933584 918087 902194 886102 869854 853544
58989 853544 837333 821457 806384 792642 780278 768863 758310 749317 742628 738145 735167 733281
58977 733281 732646 733597 736286 740618 746398 753694 762989 774614 787967 801851 815637 829522 843525
58964 843525 856991 869363 880746 891340 901066 910066 918822 927269 934600 940588 946333 953001 960520
58951 960520 968297 976483 985594 995458 1005560 1016068 1027594 1040146 1053116 1066060 1078805 1091254
58939 1091254 1103957 1118492 1136215 1156690 1178247 1200045 1222734 1247196 1273580 1301787 1332087
58928 1332087 1364920 1400586 1439376 1481654 1527633 1577283 1630565 1687623 1748896 1815220 1887632
58917 1887632 1966883 2053361 2147536 2250046 2361174 2480825 2609265 2747255 2895087 3052140
58907C052140J65569J73711J80688J84870J85689J83827J79382J71198J58395
58898D635469J41315J20637R6788P0611M3357J5721j2018l8635o2185q1972r8958
58887D830130j13775j25845j34870j41673j46792j49814j50908j51470j52106
58878C562877j51444j48187j43254j38477j34210j29516j23934j17778j11213
58869B364864j04230r7205r0536q4088p7604p1315o5548o0313n5707n2069m9255
58858A556994m6512m3498m0624l7969l4871l1127k7546k4635k1864j8902j6477
58847A212969j5030j3693j1564r147p392o158m629k550n8K941O226Q824J0173
58834A170912J1204J3205J6155J9113K1756K4520K7655L1056L4744L8809M3089
$$ plain form
58907 3052140 3217709 3391420 3572108 3756978 3942667 4126494 4305876 4477074 4635469
58898 4635469 4776784 4897421 4994209 5064820 5108177 5123898 5111880 5073245 5011060 4929088 4830130
58887 4830130 4716355 4590510 4455640 4313967 4167175 4017361 3866453 3714983 3562877
58878 3562877 3411433 3263246 3119992 2981515 2847305 2717789 2593855 2476077 2364864
58869 2364864 2260634 2163429 2072893 1988805 1911201 1839886 1774338 1714025 1658318 1606249 1556994
58858 1556994 1510482 1466984 1426360 1388391 1353520 1322393 1294847 1270212 1248348 1229446 1212969
58847 1212969 1197939 1184246 1172682 1163535 1156143 1149985 1145356 1142806 1142748 1145689 1151915 1160739 1170912
58834 1170912 1182116 1195321 1211476 1230589 1252345 1276865 1304520 1335576 1370320 1409129 1452218
58823A452218M7490N2161N6943O1257O5021O9011P3775P8950Q4187Q9897R6441
58812B227351J03484J10784J18813J27745J36742J45058J52954J60673J67331
58803C450935J71764J73703J73197J69597J62191J51102J36630J18383R6108P0784
58793D874394M4007J6819j0031l5433n8546p9492r8468j14800j27720j37473j44765
58782D128492j49792j52707j54324j55215j54797j52361j48450j44154j39630
58773B777062j34385j28567j22702j16592j09562j01702r3840q6487p9598p3135
58763A730492o7110o1318n5669n0479m5883m1359l6524l1817k7832k4407k1000
58752A267094j7407j3607r565n673k658m44K017N169Q175J0432J2622J5151J6714
$$ plain form
58823 1452218 1499708 1551869 1608812 1670069 1735090 1804101 1877876 1956826 2041013 2130910 2227351
58812 2227351 2330835 2441619 2560432 2688177 2824919 2969977 3122931 3283604 3450935
58803 3450935 3622699 3796402 3969599 4139196 4301387 4452489 4589119 4707502 4803610 4874394
58793 4874394 4918401 4935220 4925189 4889756 4831210 4751718 4653250 4538450 4410730 4273257 4128492
58782 4128492 3978700 3825993 3671669 3516454 3361657 3209296 3060846 2916692 2777062
58773 2777062 2642677 2514110 2391408 2274816 2165254 2063552 1969712 1883225 1803627 1730492
58763 1730492 1663382 1602064 1546395 1495916 1450033 1408674 1372150 1340333 1312501 1288094 1267094
58752 1267094 1249687 1236080 1226515 1220842 1218184 1217740 1219757 1224926 1233101 1243533 1256155 1271306 1288020
58739A288020J5810J2903R704O880L851L80k980n916q679j1345j3581j5156j6220
58726A263671j7249j8915k1542k4423k6442k7582k8905l0722l2026l2309l2493
58715I71063l3192l3410l2099k9873k8004k6729k5595k4557k3521k1848j9366
58704F72869j7001j5424j4066j2437j1179j0733j0270r198q365q401q273p055
58692E40467n750n561n675m697l124k314j913n83J399K504K528K732L640M557
58678E28210N102N549N860N836N978O744P426P142O379O095N982N271M492M601
58664F10667M922L938J716l00j572k697l757m332m891o253p888q503q225q345
58650E64480r143r646r492r221q828p708o063m823m212l812l728m150m167k798
$$ plain form
58739 1288020 1303830 1316733 1326437 1333317 1337168 1337548 1334568 1328652 1319973 1308628 1295047 1279891 1263671
58726 1263671 1246422 1227507 1205965 1181542 1155100 1127518 1098613 1067891 1035865 1003556 971063
58715 971063 937871 904461 872362 842489 814485 787756 762161 737604 714083 692235 672869
58704 672869 655868 640444 626378 613941 602762 592029 581759 572561 564196 555795 547522 540467
58692 540467 534717 529156 523481 518784 515660 513346 511433 510850 512249 514753 517281 520013 523653 528210
58678 528210 533312 538861 544721 550557 556535 563279 570705 577847 584226 590321 596303 601574 606066 610667
58664 610667 615589 619527 621243 620943 619371 616674 612917 608585 603694 597441 589553 581050 572825 564480
58650 564480 555337 545691 536199 526978 518150 510442 504379 499556 495344 491532 487804 483654 479487 476689
58636D76689q45O1L6O80K401L984M845N787P289Q750R767J0727J1918J3234J4785
58621E70108J6670J8417J9846K1937K5474K9465L2500L4983L8182M1784M4475
58610H93841M6384M8735N1429N3228N4136N5214N6069N4902N1250M6471M1227
58599A452886L4677K6568J8079J0053K173n563j2305j7659k2082k5658k7929k9047
58587A404193k9725k9952k9248k7957k6805k5448k3130k0455j8659j7441j5415
58576A139958j2494r864p833n669l302j191J192M686Q568J1502J3865J6792J9383
58563A175593J9498J7024J3616R424L004n421j3578k0254k6094l0996l3757l4624
58551A073435l5431l6589l6744l5840l5508l5862l4936l2175k9560k8230k6953
$$ plain form
58636 476689 475844 475905 475941 476621 479022 483006 487851 493638 500927 509677 519444 530171 542089 555323 570108
58621 570108 586778 605195 625041 646978 672452 701917 734417 769400 807582 849366 893841
58610 893841 940225 988960 1040389 1093617 1147753 1202967 1259036 1313938 1365188 1411659 1452886
58599 1452886 1487563 1514131 1532210 1542263 1544436 1538873 1526568 1508909 1486827 1461169 1433240 1404193
58587 1404193 1374468 1344516 1315268 1287311 1260506 1235058 1211928 1191473 1172814 1155373 1139958
58576 1139958 1127464 1117600 1109767 1104098 1100796 1099605 1100797 1105483 1114051 1125553 1139418 1156210 1175593
58563 1175593 1195091 1212115 1225731 1235155 1238159 1232738 1219160 1198906 1172812 1141816 1108059 1073435
58551 1073435 1038004 1001415 964671 928831 893323 857461 822525 790350 760790 732560 705607
58540G05607k4952k3365k2605k1109j8131j5224j3566j2241j0508r276q921q060
58528E17649o021m179l518l021j973j548k547l694l689l050k535j722n00No10
58513D79047r74j67Q93J392J889K583K421J297Q67J961L198L620M379O348Q239
58498E16993Q895R415J1196J3557J5081J5802J6489J7197J7793J8594J9287J8767
58486F99066J6958J5145J3759J1693Q606N679L220j49m731q598j0508j1678j3345
58473G25117j4765j5114j5059j5006j4041j2120j1052j1745j2618j2225j1290
58462E80082j0679r713q040o835o480n372k734l14M31N14J086J341O62M11J529
58447E35889K550K117J356J732K606K960L444M757N948O281O727P875Q460P804
$$ plain form
58540 705607 680655 657290 634685 613576 595445 580221 566655 554414 543906 534630 525709 517649
58528 517649 511628 507449 503931 500910 498937 497389 494842 491148 487459 484409 481874 480152 479652 479657 479047
58513 479047 478073 477906 478799 480191 482080 484663 487084 488381 489248 491209 494407 498027 502406 508754 516993
58498 516993 525888 535303 546499 560056 575137 590939 607428 624625 642418 661012 680299 699066
58486 699066 716024 731169 744928 756621 765227 770906 774126 773977 769246 760648 750140 738462 725117
58473 725117 710352 695238 680179 665173 651132 639012 627960 616215 603597 591372 580082
58462 580082 569403 559690 551650 544815 538335 532963 530229 529915 530346 530860 531946 533287 533949 534360 535889
58447 535889 538439 540556 541912 543644 546250 549210 552654 557411 563359 569640 576367 584242 592702 600506
58433F00506P358P960P943O045L773K646J548q63l336m067l565l161k673j682
58419F18432j114j411j228N6Q26K64K71K174M193M614M868O676Q703R039Q619
58404F64982R134R715Q758P071O182N429L604J647Q64K97j339k898k800j885j691
58389G07070j736j122p53j334j285O17K631K800K158K368K577J508M46J017K172
58374G19134K363K535L955N365N353N269O616P904P327O149O202O470N500M654
58360G94796N474O386N663N102O939R664J0801J1344J3272J5171J4630J2839J2490
58347I24571J3087J2495J1102J0353R311O783M659M931N778M759L459M449O244
58334A021981O060N096O001P527O975N721O926R637J0656J0468J1857J4323J5264
$$ plain form
58433 600506 607864 615824 623767 629812 633585 636231 637779 636916 633580 629513 625948 622787 620114 618432
58419 618432 617318 615907 614679 614735 615561 615825 616096 618270 622463 627077 631945 638621 647324 656363 664982
58404 664982 674116 683831 692589 699660 705842 711271 714875 716522 717386 717683 716344 713446 710646 708761 707070
58389 707070 705334 704212 703459 702125 700840 701457 704088 706888 709046 711414 713991 715499 715945 716962 719134
58374 719134 721497 724032 727987 733352 738705 743974 750590 758494 765821 771970 778172 784642 790142 794796
58360 794796 800270 806656 812319 817421 824360 834024 844825 856169 869441 884612 899242 912081 924571
58347 924571 937658 950153 961255 971608 980919 987702 992361 997292 1003070 1007829 1011288 1015737 1021981
58334 1021981 1028041 1033137 1039138 1046665 1053640 1059361 1066287 1075924 1086580 1097048 1108905 1123228 1138492
58321A138492J5217J6538J8371J8322J7543J8860K1324K2041K1732K2991K4708
58310A356139K3926K1702K1263K1888K0491J7889J7478J8922J9055J7896J7848
58299A574497J8272J6885J5166J6337J9259K0400K0379K2307K5213K5786K5162
58288A799663K7202L1260L3566L4526L7599M2162M4639M5694M8994N3846N6483
58277B255634N7647O1336O6766O9328O8804O9039P0060O8301O3998O0644N7771
58266B969328N2178M5495M2484M2651M1676M0089M1955M6084M7625M7445N0630
58255C467640N6508N9797O0880O5053P2117P6922P9753Q5667R3989R9215J02066
58244D319607J08607J18526J25703J30273J38273J49376J57244J62337J71712
$$ plain form
58321 1138492 1153709 1170247 1188618 1206940 1224483 1243343 1264667 1286708 1308440 1331431 1356139
58310 1356139 1380065 1401767 1423030 1444918 1465409 1483298 1500776 1519698 1538753 1556649 1574497
58299 1574497 1592769 1609654 1624820 1641157 1660416 1680816 1701195 1723502 1748715 1774501 1799663
58288 1799663 1826865 1858125 1891691 1926217 1963816 2005978 2050617 2096311 2145305 2199151 2255634
58277 2255634 2313281 2374617 2441383 2510711 2579515 2648554 2718614 2786915 2850913 2911557 2969328
58266 2969328 3021506 3067001 3109485 3152136 3193812 3233901 3275856 3321940 3369565 3417010 3467640
58255 3467640 3524148 3583945 3644825 3709878 3781995 3858917 3938670 4024337 4118326 4217541 4319607
58244 4319607 4428214 4546740 4672443 4802716 4940989 5090365 5247609 5409946 5581658
58235E581658J85622J97224K06164K19136K36235K50704K62938K80520L03403
58226G723604L23916L42352L67128L98471M28334M57513M95629N42839N89912
58217A1669698O38079O99490P75996Q58147R47599J058527J193810J343001J507312
58208B0691659J701688J928166K174015K440809K746413L093524L469446L884441
58200D2130161M375498M965458N660069O496497P549012Q873228J0495554J2464481
58192A03009958J4821997J7457786K0032985K2080681K3115862K2636348K0217397
58185B43373014J5850987J0194589M288505j072769n636599r404874j2262431
58178B45330422j4009761j4629932j4352275j3488984j2341409j1240456j0508325
$$ plain form
58235 5581658 5767280 5964504 6170668 6389804 6626039 6876743 7139681 7420201 7723604
58226 7723604 8047520 8389872 8757000 9155471 9583805 10041318 10536947 11079786 11669698
58217 11669698 12307777 13007267 13783263 14641410 15589009 16647536 17841346 19184347 20691659
58208 20691659 22393347 24321513 26495528 28936337 31682750 34776274 38245720 42130161
58200 42130161 46505659 51471117 57131186 63627683 71176695 80049923 90545477 103009958
58192 103009958 117831955 135289741 155322726 177403407 200519269 223155617 243373014
58185 243373014 259224001 269418590 273707095 272634326 266997727 257592853 245330422
58178 245330422 231320661 216690729 202338454 188849470 176508061 165267605 154759280
58171A54759280j0287887j0455950j0746666j0935759j0908975j0631275j0115537
58164H0677231r408116q566171p642465o693372n780695m949676m215217l577352
58156B9844167l037059k589546k217450j903014j638853j419758j234065j071208
58148A4733214r29558q09194p03804o06386n16730m36612l62651k90235k20548
58139I857496j57495j00221m4249J1604O5020J16812J72370K34896L01933L72227
58129A0830393M52012N49190O64808P98620R61541J172215J441687J775251K189560
58120B0835277K703529L295871L884910M360147M611342M517160L962447K942845
58112E1113528J650436L84367o58604j474852k133476k632108k913727k970601
$$ plain form
58171 154759280 144471393 134015443 123268777 112333018 101424043 90792768 80677231
58164 80677231 71269115 62702944 55060479 48367107 42586412 37636736 33421519 29844167
58156 29844167 26807108 24217562 22000112 20097098 18458245 17038487 15804422 14733214
58148 14733214 13803656 12994462 12290658 11684272 11167542 10730930 10368279 10078044 9857496
58139 9857496 9700001 9599780 9555531 9567135 9632155 9748967 9921337 10156233 10458166 10830393
58129 10830393 11282405 11831595 12496403 13295023 14256564 15428779 16870466 18645717 20835277
58120 20835277 23538806 26834677 30719587 35079734 39691076 44208236 48170683 51113528
58112 51113528 52763964 53148331 52489727 51014875 48881399 46249291 43335564 40364963
58104D0364963k860267k638385k343083k044897j845936j799969j865235j954930
58096B3012261k009618k010096j953486j845043j700177j534090j354175j169930
58088I435646r98618q52019p27689o20494n32164m62808m04417l50777l04620
58079D182040k68438k37660k09158j87135j73993j64016j52387j42170j36404
58070B510679j31279j23180j14852j08808j01813r1499q1571p5152o9628o2926
58060A549971n8131n6908n5145n0146m5607m4508m3563l9759l6042l5191l4265
58049A050706l0477k6829k6385k6374k3486k0001j9269j9720j8564j7101j7318
58038H05182j7372j5295j3262j3575j4209j2791j1148j1625j2510j1493j0136
$$ plain form
58104 40364963 37504696 34866311 32523228 30478331 28632395 26832426 24967191 23012261
58096 23012261 21002643 18992547 17039061 15194018 13493841 11959751 10605576 9435646
58088 9435646 8437028 7585009 6857320 6236826 5704662 5241854 4837437 4486660 4182040
58079 4182040 3913602 3675942 3466784 3279649 3105656 2941640 2789253 2647083 2510679
58070 2510679 2379400 2256220 2141368 2032560 1930747 1839248 1757677 1682525 1612897 1549971
58060 1549971 1491840 1434932 1379787 1329641 1284034 1239526 1195963 1156204 1120162 1084971 1050706
58049 1050706 1020229 993400 967015 940641 917155 897154 877885 858165 839601 822500 805182
58038 805182 787810 772515 759253 745678 731469 718678 707530 695905 683395 671902 661766
58027F61766j0692j1812j1373j0393j0371r942p836n853n545n165l300k024l098
58014E64362m461l943k955l136k867p04J353J614K202N033P778P806O864P698
58000E86644R046Q224O100N210N097L609R66j077k485m137n492n949o673q451
57986E90632r799r687r755j1305j2640j2122j1210j1620j2107j1046r667r681
57974D59993j0048r186p990p728p269n391l536l282l337k005l22J98O07K226L595
57959D06525K799Q48k92r28k098k895k348j836k745l803l505k957l497l836k583
57944C76849j228j456j865n75J169J405J173K328L843L909L627M863O344N777
57930D06163M154M097N356N782N412N750O290N469M051L864M197L012P05q29j836
$$ plain form
58027 661766 651074 639262 627889 617496 607125 597183 589347 583494 577949 572784 569484 567460 564362
58014 564362 559901 555958 553003 549867 547000 546296 547649 549263 551465 556498 564276 572082 578946 586644
58000 586644 595690 603914 610014 615224 620321 623930 624896 623819 621334 617197 611705 605756 599083 590632
57986 590632 580833 571146 561391 550086 537446 525324 514114 502494 490387 479341 469674 459993
57974 459993 449945 440759 432769 425041 417772 412381 408845 405563 402226 400221 399899 400097 400704 402930 406525
57959 406525 409324 410172 409880 408952 406854 403959 401611 399775 397030 393227 389722 386765 383268 379432 376849
57944 376849 375621 374165 372300 371725 372894 374299 375472 377800 381643 385552 389179 394042 400386 406163
57930 406163 410317 414414 419770 425552 430964 436714 443004 448473 452524 456388 460585 463597 464302 463473 461637
57915D61637l788n869o162n455o126p923q564p984q187r275r349q254p846q518
57901C58337q756q229q154q538q061o824o215o157n312l948l641m117l433j395
57887B75557J13M19Q31J925K803L301M335N649N852M942M419M569M103K746J753
57872C23317J500R56j47q20q56j207j948k045j440j320j933k184j702j372j535
57857C07264j473j006p87q38m57L69J115K118M018O008O634O236O502P670Q241
57842C51614P580O684O145N375M208L350K849J852J91j306k297l258m282m952
57828C73753n389n913n974m976l768l636m145l805k536j551j185q17o14j238k091
57813C26115j959j212j217j859j859j314j498k310k418j966k521m119m952m440
$$ plain form
57915 461637 457849 451980 445818 440363 434237 426314 417750 409766 401579 392304 382955 374701 366855 358337
57901 358337 349581 341352 333198 324660 316599 309775 303560 297403 292091 288143 284502 280385 276952 275557
57887 275557 275670 276089 276920 278845 281648 284949 289284 294933 300785 305727 310146 314715 318818 321564 323317
57872 323317 324817 325773 325626 324806 323950 322743 320795 318750 317310 315990 314057 311873 310171 308799 307264
57857 307264 305791 304785 303998 303160 302703 303072 304187 306305 310323 316331 322965 329201 335703 343373 351614
57842 351614 359194 365878 372023 377398 381606 384956 387805 389657 389848 388542 386245 382987 378705 373753
57828 373753 368364 362451 356477 351501 347733 344097 339952 336147 333611 332060 330875 330058 329444 328206 326115
57813 326115 324156 322944 321727 319868 318009 316695 315197 312887 310469 308503 305982 301863 296911 292471
57799B92471l996m287m238l470l214l893m148l246k372k398k386j370O4J119K042
57784B56678L062L584L326K950K820K483K008K322L540M417M246L936M551N981
57770C05904P583Q910R415Q756P735P546P891P253N359L646K938K350J081m21
57756C85946j620k746l820m329m348m659n266n281m621m300m644m823m512m397
57742C26580m596m266l261k446k008j170m4J83n38p62n2K29n41j084o29l89j236
57725C03970j897r95P49J910K528L282L865L735L455L740M127L882L366L282L424
57710C42423L361L529M475N734O545P016P681Q588R663J1244J3386J5354J6599
57697D55598J7527J8706J9939K0705K0707J9605J7160J4103J1839J0850J0392
$$ plain form
57799 292471 288475 284188 279950 276480 273266 269373 265225 261979 259607 257209 254823 253453 253517 254636 256678
57784 256678 259740 263324 266650 269600 272420 274903 276911 279233 282773 287190 291436 295372 299923 305904
57770 305904 313487 322397 331812 340568 348303 355849 363740 370993 376352 379998 382936 385286 386367 385946
57756 385946 384326 381580 377760 373431 369083 364424 359158 353877 349256 344956 340312 335489 330977 326580
57742 326580 321984 317718 314457 312011 310003 308833 308789 308972 308434 307672 307620 307849 307308 306224 305595 305206 303970
57725 303970 302073 301078 301827 303737 306265 309547 313412 317147 320602 324342 328469 332351 335717 338999 342423
57710 342423 345784 349313 353788 359522 366067 373083 380764 389352 399015 410259 423645 438999 455598
57697 455598 473125 491831 511770 532475 553182 572787 589947 604050 615889 626739 637131
57686F37131J0096J0545J1914J3567J5566J8941K3658K8038L1175L4352L8911
57675H73894M4326M9687N5545O2641P0199P7091Q3614R0374R6400J00125J01324
57664A705220J00159R4874Q2575O2542L7442J1078j3922l6275n5128o9536p8643
57653A840386q2400q2126p9772p6440p2320o8200o5645o5030o4743o3287o1024
57642A059399n8747n5864n1412m5977m0910l6252l0987k5047j9597j5452j2253
57631F66901r291o176k883J69K353L791N567Q306J1097J2775J3732J5383J8260
57618G39984K1650K4806K7620L0213L2671L5109L7400L9098M0041M0584M0704
57607A109880L9485L6192L1224K5344J8596J0855K839m446j0850j6725k1905k5948
$$ plain form
57686 637131 647227 657772 669686 683253 698819 717760 741418 769456 800631 834983 873894
57675 873894 918220 967907 1023452 1086093 1156292 1233383 1316997 1407371 1503771 1603896 1705220
57664 1705220 1805379 1900253 1982828 2045370 2082812 2093890 2079968 2043693 1988565 1919029 1840386
57653 1840386 1757986 1675860 1596088 1519648 1447328 1379128 1313483 1248453 1183710 1120423 1059399
57642 1059399 1000652 944788 893376 847399 806489 770237 739250 714203 694606 679154 666901
57631 666901 657610 651434 648551 648720 651073 654864 660431 668737 679834 692609 706341 721724 739984
57618 739984 761634 786440 814060 844273 876944 912053 949453 988551 1028592 1069176 1109880
57607 1109880 1149365 1185557 1216781 1242125 1260721 1271576 1274415 1269969 1259119 1242394 1220489 1194541
57595A194541k9038l1667l3697l4650l4765l4856l5303l5800l5999l5675l4545
57584H18546l2578l0363k8516k6883k4906k2550k0317j8479j6827j5080j3181
57573E68866j1292r772q813q071o991n619m469l598k598j622j351j609j223J93
57559E02031J499J826J965K932M257M849M761M829N188N443N785O696P785Q039
57545E67885P215O092N479N666O610P952R022R344R050Q479P867P623Q222R364
57531F75870J0063J0078J0371J1594J3102J4222J5395J7133J8891K0134K1562
57520H38415K4021K6960K9190L0560L1649L2440L2465L1735L0324K7658K3355
57509A158772J8168J2906P179N36n917j0584j3501j5865j7927j9037j9417k0075
$$ plain form
57595 1194541 1165503 1133836 1100139 1065489 1030724 995868 960565 924765 888766 853091 818546
57584 818546 785968 755605 727089 700206 675300 652750 632433 613954 597127 582047 568866
57573 568866 557574 547802 538989 530918 523927 518308 513839 510241 507643 506021 504670 503061 501838 502031
57559 502031 503530 505356 507321 510253 514510 519359 524120 528949 534137 539580 545365 552061 559846 567885
57545 567885 575100 581192 586671 592337 598947 606899 615921 625265 634315 642794 650661 658284 666506 675870
57531 675870 685933 696011 706382 717976 731078 745300 760695 777828 796719 816853 838415
57520 838415 862436 889396 918586 949146 980795 1013235 1045700 1077435 1107759 1135417 1158772
57509 1158772 1176940 1189846 1197025 1197561 1191644 1181060 1167559 1151694 1133767 1114730 1095313 1075238
57497A075238k0985k1078k0149j9219j8857j8522j7804j6943j5956j4451j2549
57486H78725j0845r288p293n052l523k869k119o02J331L269N224O888P491O951
57472H68288O330O659P987R771J1564J3185J4804J6952J9794K2608K4725K6686
57460A049353K9456L2749L5298L6712L7795L8938L9469L8837L7243L4818L1296
57449A441964K6923K2564J8456J3778Q006J839l602p829j0907j3120j5043j7111
57437A465918j8883j9453j8874j8286j8294j8180j7116j5435j4023j3112j2237
57426A282025j0946r195p305n686m402k949r68J056K448L471M924O703P779P825
57412A274780P792Q528R602J0067R759R412R878J1406J3318J4500J4589J4478
$$ plain form
57497 1075238 1054253 1033175 1013026 993807 974950 956428 938624 921681 905725 891274 878725
57486 878725 867880 858592 851299 846247 842724 839855 837736 837134 838465 841734 846958 853846 861337 868288
57472 868288 874618 881277 889264 899035 910599 923784 938588 955540 975334 997942 1022667 1049353
57460 1049353 1078809 1111558 1146856 1183568 1221363 1260301 1299770 1338607 1375850 1410668 1441964
57449 1441964 1468887 1491451 1509907 1523685 1531691 1533530 1529928 1522099 1511192 1498072 1483029 1465918
57437 1465918 1447035 1427582 1408708 1390422 1372128 1353948 1336832 1321397 1307374 1294262 1282025
57426 1282025 1271079 1261884 1254579 1248893 1244491 1241542 1240574 1241630 1244078 1247549 1252473 1259176 1266955 1274780
57412 1274780 1282572 1291100 1300702 1310769 1320528 1329940 1339818 1351224 1364542 1379042 1393631 1408109
57400A408109J5061J5955J6278J6292J6987J8228J8787J8343J8024J8594J9447
57389A600105J9943K0421K1213K1790K1801K1929K2793K3776K3910K3348K2985
57378A844014K3100K3163K2801K2271K2007K2147K2437K2442K2007K1471K1170
57367B089030K0880K0292J9802K0074K0873K1297K1188K1278K1815K2109K1847
57356B320485K1697K2165K2828K3356K4239K5789K7262K7863K7939K8319K9031
57345B600973K9561K9897L0509L1493L2527L3498L4607L5922L7261L8467L9514
57334B974229M0417M1211M1855M2215M2362M2757M3648M4471M4517M4068M3974
57323C445724M4251M4097M3558M3870M5691M8006M9478M9977N0088M9904M9229
$$ plain form
57400 1408109 1423170 1439125 1455403 1471695 1488682 1506910 1525697 1544040 1562064 1580658 1600105
57389 1600105 1620048 1640469 1661682 1683472 1705273 1727202 1749995 1773771 1797681 1821029 1844014
57378 1844014 1867114 1890277 1913078 1935349 1957356 1979503 2001940 2024382 2046389 2067860 2089030
57367 2089030 2109910 2130202 2150004 2170078 2190951 2212248 2233436 2254714 2276529 2298638 2320485
57356 2320485 2342182 2364347 2387175 2410531 2434770 2460559 2487821 2515684 2543623 2571942 2600973
57345 2600973 2630534 2660431 2690940 2722433 2754960 2788458 2823065 2858987 2896248 2934715 2974229
57334 2974229 3014646 3055857 3097712 3139927 3182289 3225046 3268694 3313165 3357682 3401750 3445724
57323 3445724 3489975 3534072 3577630 3621500 3667191 3715197 3764675 3814652 3864740 3914644 3963873
57312C963873M8405M8077M8406M9037M9566M9696M9319M8829M8879M9583N0412
57301D504082N1011N1530N2010N2317N2881N4490N6962N9043O0209O1468O3724
57290E119727O6325O8089O8839O9046O8789O8117O7652O7723O7534O6353O4973
57279E863167O4780O5750O6561O6513O6219O6360O6806O7085O6972O6506O6042
57268F592761O6228O7326O8559O8661O7114O4417O1290N7988N4303M9896M4784
57257G263327L9634L5349L2197K9845K8277K7871K8334K8575K8215K8270K9515
57246G599409L1185L2288L3274L5202L7849M0096M1729M3577M6002M8530N0885
57235H040026N3215N5260N6389N6552N6330N5993N5406N4794N4617N4566N3684
$$ plain form
57312 3963873 4012278 4060355 4108761 4157798 4207364 4257060 4306379 4355208 4404087 4453670 4504082
57301 4504082 4555093 4606623 4658633 4710950 4763831 4818321 4875283 4934326 4994535 5056003 5119727
57290 5119727 5186052 5254141 5322980 5392026 5460815 5528932 5596584 5664307 5731841 5798194 5863167
57279 5863167 5927947 5993697 6060258 6126771 6192990 6259350 6326156 6393241 6460213 6526719 6592761
57268 6592761 6658989 6726315 6794874 6863535 6930649 6995066 7056356 7114344 7168647 7218543 7263327
57257 7263327 7302961 7338310 7370507 7400352 7428629 7456500 7484834 7513409 7541624 7569894 7599409
57246 7599409 7630594 7662882 7696156 7731358 7769207 7809303 7851032 7894609 7940611 7989141 8040026
57235 8040026 8093241 8148501 8204890 8261442 8317772 8373765 8429171 8483965 8538582 8593148 8646832
57224H646832N1561M8609M5002M0329L4514K8249K2170J6288J0474M867m96n853
57212H942546j1262j6408k0967k4741k7435k8806k9040k8469k7060k4726k1974
57201H681658j9498j7218j4467j1138p837m965k480o97l62j632l730n832p725
57188H584077r356j0436j0833j0756j0324r443q265p211o453n779n014m000k226
57175H483981O75M104O964R066J1224J3863J6458J8510K0043K0828K0119J7567
57163H643402J3479P810q9j0130k0987l1556m1986n2584o2760p2016q0883q9665
57151H202035r7033j01202j01973j00392r6758r0427q1430p0989o0330n0002m0511
57140G310988l2662k7209k4922k6929l3911m4756n6884o8153p7684q4795q8172
$$ plain form
57224 8646832 8698393 8747002 8792004 8832333 8866847 8895096 8917266 8933554 8944028 8948895 8948399 8942546
57212 8942546 8931284 8914876 8893909 8869168 8841733 8812927 8783887 8755418 8728358 8703632 8681658
57201 8681658 8662160 8644942 8630475 8619337 8611500 8606535 8604055 8603358 8602996 8601364 8597634 8591802 8584077
57188 8584077 8574721 8564285 8553452 8542696 8532372 8522929 8514664 8507453 8501000 8495221 8490207 8486207 8483981
57175 8483981 8484656 8488760 8495724 8504790 8516014 8529877 8546335 8564845 8584888 8605716 8625835 8643402
57163 8643402 8656881 8664691 8664602 8654472 8633485 8601929 8559943 8507359 8444599 8372583 8291700 8202035
57151 8202035 8105002 8003800 7901827 7801435 7704677 7614250 7532820 7461831 7401501 7351499 7310988
57140 7310988 7278326 7251117 7226195 7199266 7165355 7120599 7063715 6995562 6917878 6833083 6744911
57129F744911q6642q0177o9852n7282m4286l2637k3822j9130j9455k4334l1566
57118F255728l8589m3870m6174m3310l3355j7038K653K3238M3728O3362Q1804
57107F248177J01033J24762J55145J92073K36153K89829L54669M30414N18249
57098H650504O22358P46945Q94658J068898J272572J501377J742756J984436K218133
57089B0702637K432935K620849K806032L057150L435163L908192M332955M545513
57081D7841426M477836M183807L761808L266219K688827K005502J232208M44539
57073F9902172k53388p90694j171669j455439j692863j890242k035848k145583
57065E8466446k265050k428670k630345k836619l017666l159866l256857l299424
$$ plain form
57129 6744911 6658269 6578092 6508240 6450958 6406672 6374035 6350213 6331083 6311628 6287294 6255728
57118 6255728 6217139 6173269 6127095 6083785 6050430 6033392 6036045 6059283 6103011 6166373 6248177
57107 6248177 6349210 6473972 6629117 6821190 7057343 7347172 7701841 8132255 8650504
57098 8650504 9272862 10019807 10914465 11983363 13255935 14757312 16500068 18484504 20702637
57089 20702637 23135572 25756421 28562453 31619603 35054766 38962958 43295913 47841426
57081 47841426 52319262 56503069 60264877 63531096 66219923 68225425 69457633 69902172
57073 69902172 69648784 68858090 67686421 66230982 64538119 62647877 60612029 58466446
57065 58466446 56201396 53772726 51142381 48305762 45288096 42128230 38871373 35571949
57057C5571949l276339l181653l019903k805539k557854k295542k034295j786506
57049A4614318j560519j359826j184350j032760r03026p91870o95682o12243n40491
57040E933551m78872m25222l78149l37284l02157k71828k45432k22161k00991
57031C071455j81395j63863j48780j35346j22677j11205j01672r3465q5475p8040
57021A849537p2311o8042o3746n8916n4480n1023m8093m5317m2859m0606l8231
57010A265913l6091l4796l3960l2510l0255k7914k5730k3364k1008j9261j7936
56999I63088j6266j4295j2757j1702j0445q825p154n147k192J432M951Q546J3008
56986I02242J8119K2802K6635K9848L2211L3540L4843L7231M0145M2680M6154
$$ plain form
57057 35571949 32295610 29113957 26094054 23288515 20730661 18435119 16400824 14614318
57049 14614318 13053799 11693973 10509623 9476863 8573837 7781967 7086285 6474042 5933551
57040 5933551 5454679 5029457 4651308 4314024 4011867 3740039 3494607 3272446 3071455
57031 3071455 2890060 2726197 2577417 2442071 2319394 2208189 2106517 2013052 1927577 1849537
57021 1849537 1777226 1709184 1645438 1586522 1532042 1481019 1432926 1387609 1344750 1304144 1265913
57010 1265913 1229822 1195026 1161066 1128556 1098301 1070387 1044657 1021293 1000285 981024 963088
56999 963088 946822 932527 919770 908068 897623 888798 881644 876497 874305 875737 880688 889234 902242
56986 902242 920361 943163 969798 999646 1031857 1065397 1100240 1137471 1177616 1220296 1266450
56975A266450N3044O3729P6766R2224J12044J37132J67019K02539K45622K95599
56965B712168L48091L96837M32349M39393M03672L26075K26126J25938L3152n6101
56955E387700j40879k09575k50591k62828k53752k32206k06422j85323j76362
56946C469762j80936j93630k06578k14324k15316k10280k00033j84978j66086
56937A697601j45304j24438j04218q5052o8033n4387m4401l7667l3866l2591l2890
56926I34754l3841l5135l6441l6922l6198l4951l3666l1580k8107k4404k2156
56915E81353k1400k0975k0483k0264j9978j8882j7319j6242j5418j3729j1221
56904C85442r165p973o676m745k898j670n78Q31K395M252P026J0488J3308J4886
$$ plain form
56975 1266450 1319494 1383223 1459989 1552213 1664257 1801389 1968408 2170947 2416569 2712168
56965 2712168 3060259 3457096 3889445 4328838 4732510 5058585 5284711 5410649 5443801 5387700
56955 5387700 5246821 5037246 4786655 4523827 4270075 4037869 3831447 3646124 3469762
56946 3469762 3288826 3095196 2888618 2674294 2458978 2248698 2048665 1863687 1697601
56937 1697601 1552297 1427859 1323641 1238589 1170556 1116169 1071768 1034101 1000235 967644 934754
56926 934754 900913 865778 829337 792415 756217 721266 687600 656020 627913 603509 581353
56915 581353 559953 538978 518495 498231 478253 459371 442052 425810 410392 396663 385442
56904 385442 376277 368304 361628 356883 353985 352315 351737 352568 354963 359215 366241 376729 390037 404923
56890D04923J6306J8673K1380K2946K2820K1520J9500J6790J3452R761O058K787
56878E96916M03j010j771k052j665n41R58K459L920N455P205R501J2742J6838
56864F49358K1224K5536K9859L3971L6646L6182L1679K3870J4672N834k076r179
56852H97576j5023j8427j8862j7241j4727j1528p560l606o34J701M723R051J4350
56839H19793K0684K8789L8663M8838N7286O2216O1986N5555M3732K9065J3869
56828A280476r99j5026k6811l4862l9035m0278l9239l6081l1505k6998k3763k1776
56816I44103k0127j7913j4549r557k666N695J4299K1869K7720L1289L1296K6296
56804A037755J6458M123p871j8015k6057l1976l5753l7599l7530l5168l0782k6138
$$ plain form
56890 404923 421229 439902 461282 484228 507048 528568 548068 564858 578310 588071 594129 596916
56878 596916 597319 596309 594538 592486 590821 590280 591238 593697 597617 603072 610277 619778 632520 649358
56864 649358 670582 696118 725977 759948 796594 832776 864455 888325 902997 908831 906755 897576
56852 897576 882553 864126 845264 828023 813296 801768 794208 790602 789968 791669 796392 805443 819793
56839 819793 840477 869266 907929 956767 1014053 1076269 1138255 1193810 1237542 1266607 1280476
56828 1280476 1279477 1264451 1237640 1202778 1163743 1123465 1084226 1048145 1016640 989642 965879 944103
56816 944103 923976 906063 891514 881957 879291 884986 899285 921154 948874 980163 1011459 1037755
56804 1037755 1054213 1058336 1050465 1032450 1006393 974417 938664 901065 863535 828367 797585 771447
56792G71447k3213k2291k2044k1315j9726j6911j2490o964j527L229P423J0535
56780F46153J1149Q547L717j773p179j2393j7171k1171k4189k5887k5801k4081
56768E09921k1735j9757j8474j7907j8238j9360k0574k1162k0937j9929j8067
56757B93781j5551j3089j1269j0014q983q144p519o800n732m639m064l999l920
56744A90058l494k948k670k749k950k981k685k023j076j91K1p10j743j972j148
56729A60739k81l27r80j182n59K91O28J69q65j774j758q32k5j36p38j084j330
56712A49956j966k570k363j621j234j117n01K90j3j398k091j008O82J277P23K28
56696A37274M77J152J651J518O13o30j374j271p41k48J28K90P8j41K89J194J561
$$ plain form
56792 771447 748234 725943 703899 682584 662858 645947 633457 626493 624966 628195 635618 646153
56780 646153 657302 665849 669566 667793 660614 648221 631050 609879 585690 559803 534002 509921
56768 509921 488186 468429 449955 432048 413810 394450 373876 352714 331777 311848 293781
56757 293781 278230 265141 253872 243858 234875 226731 219212 212412 206680 202041 197977 193978 190058
56744 190058 186564 183616 180946 178197 175247 172266 169581 167558 166482 166291 166312 165602 163859 161887 160739
56729 160739 160458 160131 159151 157969 157410 157701 158329 158498 157633 155859 154101 153269 153244 153108 152370 151286 149956
56712 149956 147990 145420 143057 141436 140202 139085 138584 138874 138861 137463 135372 134364 135046 136323 137046 137274
56696 137274 137751 138903 140554 142072 142685 142055 140681 139410 138669 138421 138549 138839 138917 138776 139065 140259 141820
56679A41820J076P19J282K251K737K685K409J773P23k6K48J177J748J545R08K31
56663A63306k96n25n32p43j379k019k113j731j391j444j892k546l130l474l703
56648A36388l913l721k776j650j356j880k082j373n05k85m67n01n10p44q50m48
56632A13327J22L19J59q9l80m89J08J352K223K063J618K018L140L850L527K629
56616A35497J935J838K192K504K446K327K585K853K319J155N65J030J650J728
56602A62624J769K190K315J762J591K638L742L196J324k2j09J28O6J91Q03J267
56586A85475J060N64L79O19J053J378J250O84L59Q96J884K334K018J633J613J598
56570B04797J254Q92R99J550K123K453K676L141L905M538M587M299M359M909N414
$$ plain form
56679 141820 142896 143615 144897 147148 149885 152570 154979 156752 157475 157449 157697 158874 160622 162167 163075 163306
56663 163306 163010 162485 161953 161210 159831 157812 155699 153968 152577 151133 149241 146695 143565 140091 136388
56648 136388 132475 128754 125978 124328 122972 121092 119010 117637 117132 116847 116380 115879 115369 114625 113775 113327
56632 113327 113449 113768 113927 113838 113458 112969 113077 114429 116652 118715 120333 122351 125491 129341 132868 135497
56616 135497 137432 139270 141462 143966 146412 148739 151324 154177 156496 157651 158216 159246 160896 162624
56602 162624 164393 166583 168898 170660 172251 174889 178631 181827 183151 183129 183020 183148 183214 183405 184208 185475
56586 185475 186535 187099 187478 188097 189150 190528 191778 192462 192821 193717 195601 197935 199953 201586 203199 204797
56570 204797 206051 206943 207942 209492 211615 214068 216744 219885 223790 228328 232915 237214 241573 246482 251896
56555B51896N662O098O843P220O869O532O961P700P811P298O879O724O285N245
56541C46023L946K943K550K601K443J570M21j19j69q55k477l869m245m438n283
56526C41042o034n659m788m855n859o518o279n870o001o586p174p311o734n860
56512B55514n539n752n365l959k853l217m251m496m002l635l276k449j879k491
56498B02350l437l139j862j283j729j911j319q06p21m05J45Pq59j300q51l70l88
56481A82122l58L0L24L92O39Q43L23n35n25L36P63N52J062K747M075L800K642
56464A99232J737J013J87r0O67J703K128K135K220K275K300K930M258N179M945
56449B32819M365M448M805M484L604L004K912L001L169L414L396L011K831L229
$$ plain form
56555 251896 257558 263656 270499 277719 284588 291120 298081 305781 313592 320890 327769 334493 340778 346023
56541 346023 349969 352912 355462 358063 360506 362076 362497 362378 362209 361354 358877 355008 350763 346325 341042
56526 341042 335008 329349 324561 319706 313847 307329 301050 295180 289179 282593 275419 268108 261374 255514
56512 255514 249975 244223 238858 234899 232046 228829 224578 220082 216080 212445 209169 206720 204841 202350
56498 202350 198913 195774 193912 192629 190900 188989 187670 186864 186143 185738 185883 185890 185031 183731 182880 182510 182122
56481 182122 181764 181794 182118 182510 183149 183992 184315 183780 183255 183591 184354 184906 185968 188715 192790 196590 199232
56464 199232 200969 201982 202169 202079 202746 204449 206577 208712 210932 213207 215507 218437 222695 227874 232819
56449 232819 237184 241632 246437 250921 254525 257529 260441 263442 266611 270025 273421 276432 279263 282492
56435B82492L609L302K658K454K734K969K930K636J941Q55p4m57p43j591k770
56420C02945l372k909j795q17n05q66j499k065k591l119l313k905k378k483l213
56405B69115l913m304m652n017n241n540o137o491n952n068m935n313m846l321
56391A98385k054j724j455p44n92j718l058l228k419j678j209n42L08R99J614
56376A80885K383L062L359L516L804L896L411K636K142K084K325K787L213L079
56362B22582K225J265R50J420K136K296J407m6p45l0J095J248O35N33J153J517
56346B39641J324J376J869J912J138L97K76L44K76M40Q35Q05L32L07J029J701
56330B54002J897K133K533K432J793J607K227K708K496K246K468K754K972L614
$$ plain form
56435 282492 286101 289403 292061 294515 297249 300218 303148 305784 307725 308580 308506 308049 307306 305715 302945
56420 302945 299573 296664 294869 294052 293547 292681 291182 289117 286526 283407 280094 277189 274811 272328 269115
56405 269115 265202 260898 256246 251229 245988 240448 234311 227820 221868 216800 211865 206552 201706 198385
56391 198385 196331 194607 193152 192408 191816 190098 187040 183812 181393 179715 178506 177964 178272 179271 180885
56376 180885 183268 186330 189689 193205 197009 200905 204316 206952 209094 211178 213503 216290 219503 222582
56362 222582 224807 226072 227022 228442 230578 232874 234281 234235 233490 233460 234555 235803 236438 236971 238124 239641
56346 239641 240965 242341 244210 246122 247260 247657 247933 248277 248553 248993 249828 250633 250965 251272 252301 254002
56330 254002 255899 258032 260565 262997 264790 266397 268624 271332 273828 276074 278542 281296 284268 287882
56316B87882M419M369L680L907N357O341N908N310N600N832N077M263M382M620
56302C56947L963L075K918K893K082J049P39Q03N12K23L94L58m50j288j440j506
56286C71272j984k068j230n85j057j723j552j248j620j807j048n40j377k163j120
56271C50150Q22J526J060J052J572J421P76R31J766J965J497J562K299K737K872
56256C74008L663N009N798N872O163O872P258P195P298P601P538P096O661O113
56242D64145N379N291O432P802Q144P929Q339R076Q948Q039P436P354P245P246
56228E68805P737Q088P529O708O624O733N931M694M236M228L420J957J035P10
56214F38435J07o09n55l6j93j092k011l086m755o073n716m243l408l566l713l556
$$ plain form
56316 287882 292301 296670 300350 304257 309614 315955 321863 327173 332773 338605 343682 347945 352327 356947
56302 356947 360910 363985 366903 369796 371878 372927 373666 374469 374981 375204 375598 375956 375506 374218 372778 371272
56286 371272 369288 367220 365990 365405 364348 362625 361073 359825 358205 356398 355350 354810 353433 351270 350150
56271 350150 350972 352498 353558 354610 356182 357603 358379 359310 361076 363041 364538 366100 368399 371136 374008
56256 374008 377671 382680 388478 394350 400513 407385 414643 421838 429136 436737 444275 451371 458032 464145
56242 464145 469524 474815 481247 489049 497193 505122 513461 522537 531485 539524 546960 554314 561559 568805
56228 568805 576542 584630 592159 598867 605491 612224 618155 622849 627085 631313 634733 636690 637725 638435
56214 638435 638542 637933 637378 637342 637149 636057 634046 630960 626205 620132 614416 610173 606765 603199 599486 595930
56198E95930l619l734l338k847k842k588j218L19N45j25l10j50n98j104n22M80
56182E74279M29k02J63J295J684J390J648K253K057J507J876K578K172J457K399
56167E96985M387M875L609K933L820M823N205N911P027P306O690O577P147P152
56153F74447O518O507P191P488P766R448J2001J3339J3389J4246J6506J8553J9700
56140H27099K0957K2402K3002K3394K5610K9494L2626L4352L6769M1133M6418
56129A163256N2137N9386O8405P8060Q8525J01456J16840J32527J47297J61384
56119B169273J73560J81017J82886J80795J75581J66718J55517J45234J37061
56110C667642J29055J19715J09416R7984Q4426O9741N6343M4062L0214J4196j797
$$ plain form
56198 595930 592311 588577 585239 582392 579550 576962 575744 576063 576608 576483 576173 576023 575425 574321 573799 574279
56182 574279 574708 574506 574669 575964 577648 579038 580686 582939 584996 586503 588379 590957 593129 594586 596985
56167 596985 601372 606247 609856 612789 616609 621432 626637 632548 639575 646881 653571 660148 667295 674447
56153 674447 680965 687472 694663 702151 709917 719365 731366 744705 758094 772340 788846 807399 827099
56140 827099 848056 870458 893460 916854 942464 971958 1004584 1038936 1075705 1116838 1163256
56129 1163256 1215393 1274779 1343184 1421244 1509769 1611225 1728065 1860592 2007889 2169273
56119 2169273 2342833 2523850 2706736 2887531 3063112 3229830 3385347 3530581 3667642
56110 3667642 3796697 3916412 4025828 4123812 4208238 4277979 4334322 4378384 4408598 4422794 4420997
56099D420997j7246l4364n3767p3124r1102j08648j25295j38347j47017j53374
56089C478713j57875j58041j53039j45542j37597j28622j18908j10849j04978
56080B263262r8781r1138q4032p8310p1876o3793n6055m9623m2722l4780k7921
56069A564231k2926j7863j2288q394o473l795L14L018L368M235O950Q990R146
56056A528513R897J2418J4314J4666J6107J9420K1381K0733K0939K4098K7355
56045A729841K8399K9244L1460L2946L2675L3333L6075L7886L7339L7473L9795
56034B106466M1194M0182M0148M2774M4374M2843M2111M5339M9547N1497N3059
56023B599534N6234N8810N9452O1330O6091P0157P1385P3270P8060Q2264Q3601
$$ plain form
56099 4420997 4403751 4369387 4315620 4242496 4151394 4042746 3917451 3779104 3632087 3478713
56089 3478713 3320838 3162797 3009758 2864216 2726619 2597997 2479089 2368240 2263262
56080 2263262 2164481 2073343 1989311 1911001 1839125 1775332 1719277 1669654 1626932 1592152 1564231
56069 1564231 1541305 1523442 1511154 1502760 1496287 1492492 1492806 1495824 1499192 1503427 1510377 1519367 1528513
56056 1528513 1538410 1550828 1565142 1579808 1595915 1615335 1636716 1657449 1678388 1702486 1729841
56045 1729841 1758240 1787484 1818944 1851890 1884565 1917898 1953973 1991859 2029198 2066671 2106466
56034 2106466 2147660 2187842 2227990 2270764 2315138 2357981 2400092 2445431 2494978 2546475 2599534
56023 2599534 2655768 2714578 2774030 2835360 2901451 2971608 3042993 3116263 3194323 3276587 3360188
56012C360188Q5673R0909R5831R8337J02374J10081J16860J19798J23277J30515
56002D433843J37554J41746J47797J58737J69422J75999J83213J95102K07344
55993E950757K16443K27336K43829K60848K74531K90331L12546L35925L56632
55984H469178L80913M13366M47816M79842N16563N63373O13677O63189P21155
55975A3269072P95014Q78084R65883J069662J199255J348357J512284J702963
55967B2740574J929023K179764K448107K749563L098077L486350L914749M415553
55959D6961760N022028N742700O599815P662164R000468J0644041J2622549J4989213
55951A19244738J7702876K0489962K2884959K4378628K4467132K2679853J8833287
$$ plain form
56012 3360188 3445861 3536770 3632601 3730938 3833312 3943393 4060253 4180051 4303328 4433843
56002 4433843 4571397 4713143 4860940 5019677 5189099 5365098 5548311 5743413 5950757
55993 5950757 6167200 6394536 6638365 6899213 7173744 7464075 7776621 8112546 8469178
55984 8469178 8850091 9263457 9711273 10191115 10707678 11271051 11884728 12547917 13269072
55975 13269072 14064086 14942170 15908053 16977715 18176970 19525327 21037611 22740574
55967 22740574 24669597 26849361 29297468 32047031 35145108 38631458 42546207 46961760
55959 46961760 51983788 57726488 64326303 71988467 80988935 91632976 104255525 119244738
55951 119244738 136947614 157437576 180322535 204701163 229168295 251848148 270681435
55944B70681435J3367060P258734J431501l723162q190864j1869078j4456494
55937B54499132j5756389j5887623j5165265j3935826j2585376j1537604j1071363
55930A58559686j1146115j1475962j1763283j1836810j1635466j1160922j0458701
55923G9082427r593437q621808p598641o592106n663628m838703m116927l499765
55915B8557412k988321k566620k211353j912715j668477j466386j290587j138087
55907A3314866j012106r05997q09280p22695o52022n93102n37221m85358m43409
55898G153676m08774l74603l42111l16271k94318k70426k46969k29594k15818
55889D454792j99604j82737j70675j61408j49227j35741j26589j20685j12681
$$ plain form
55944 270681435 284048495 291307229 292738730 289015568 280824704 268955626 254499132
55937 254499132 238742743 222855120 207689855 193754029 181168653 169631049 158559686
55930 158559686 147413571 135937609 124174326 112337516 100702050 89541128 79082427
55923 79082427 69488990 60867182 53268541 46676435 41012807 36174104 32057177 28557412
55915 28557412 25569091 23002471 20791118 18878403 17209926 15743540 14452953 13314866
55907 13314866 12302760 11396763 10587483 9864788 9212766 8619664 8082443 7597085 7153676
55898 7153676 6744902 6370299 6028188 5711917 5417599 5147173 4900204 4670610 4454792
55889 4454792 4255188 4072451 3901776 3740368 3591141 3455400 3328811 3208126 3095445
55880C095445j03026r5872r0032q1325p1162o3963n8644n1025m1902l4586k7413
55869B376495j6915n680J157M524Q548J1663Q823N85p980j5717k5234l5947m4570
55856B259752n1181n8012o3655o5017o3508o2920o2860o0498n7027n5856n6074
55845A603144n4135n0562m8581m7615m4406l9426l5909l3659k9873k5032k1995
55834A171951k0164j6485j1383p943o013k880R84K608K360L445O003P228O985
55821A136696P814R353Q133L250k564p764j3351j9313k4034k7373l0412l2311
55809A008124l1306k8457k6522k5549k3463k0369j8225j6960j4947j2635j1639
55798G78052j0914q100m070j831j506o78P52M64j716l477m201n422p125p562o758
$$ plain form
55880 3095445 2992419 2896547 2806515 2725190 2654028 2590065 2531421 2480396 2438494 2403908 2376495
55869 2376495 2359580 2353900 2355057 2359581 2368129 2379792 2388615 2389200 2381220 2365503 2340269 2304322 2259752
55856 2259752 2208571 2150559 2086904 2021887 1958379 1895459 1832599 1772101 1715074 1659218 1603144
55845 1603144 1549009 1498447 1449866 1402251 1357845 1318419 1282510 1248851 1218978 1193946 1171951
55834 1171951 1151787 1135302 1123919 1115976 1109963 1107083 1108067 1110675 1113035 1116480 1122483 1129711 1136696
55821 1136696 1144510 1153863 1161996 1165246 1162682 1154918 1141567 1122254 1098220 1070847 1040435 1008124
55809 1008124 976818 948361 921839 896290 872827 852458 834233 817273 802326 789691 778052
55798 778052 767138 759038 754968 753137 751631 750953 751705 752169 750453 746976 742775 737353 730228 722666 715908
55783G15908o443o521n297l045j695j246j39J085L22k154m041n068o985r768j1602
55768F53311j2443j3851j5474j5515j4461j4477j5261j4541j2551j1974j3213
55757D99550j3901j3342j3412j4496j4547j2937j1503j1007j0031q145o811o402
55745C63016n590m309m138n156n560m977m964n763n752m681m217m714m528l206
55731B95461k272k270k026j380j634k774l251k968l477m825n249m491m278n028
55717B49538n209m434l982l879k766j149j238k864l168j226O49J147J822L379
55703B26620L793J940j94q02q34j453j719p63K04q7r96j615k191k654j877J42
55687B17514J626J770J987L213M269M221M027M409M268K726P87m73j484k717l566
$$ plain form
55783 715908 709465 702944 697647 694602 692907 691661 691522 692607 692929 690775 686734 681666 674681 664913 653311
55768 653311 640868 627017 611543 596028 581567 567090 551829 537288 524737 512763 499550
55757 499550 485649 472307 458895 444399 429852 416915 405412 394405 384374 376229 369418 363016
55745 363016 357426 353117 348979 343823 338263 333286 328322 322559 316807 312126 307909 303195 298667 295461
55731 295461 293189 290919 288893 287513 285879 283105 279854 276886 273409 268584 263335 258844 254566 249538
55717 249538 244329 239895 235913 232034 229268 228119 226881 224017 220849 219623 220272 221419 223241 226620
55703 226620 230413 232353 232159 231357 230523 229070 227351 226588 226792 226705 225709 224094 221903 219249 217372 217514
55687 217514 219140 220910 222897 226110 230379 234600 238627 243036 247304 250030 250817 250344 248860 246143 242577
55672B42577l908m809o507p541p096o324o209o071n338m839n110n214m502l759
55658A65350l567l192k158j194o98m4P92Q24J08Q3R90J103l95j931k177k004k453
55641A49437k823k231j334j059j194j385j929k498j904k36O31j74j078p14l7m45
55625A31027j485j945j794j628j539j625k198k611j510Q17K138J400K48K96P78
55610A20369L79m10m00K51O55O66N59L17J76O64J338J006k29p96k48K6n76p18
55592A23029L34J274J201J301K520L611L252K265J941J884J320R72J825L367M675
55577A54771N961P578Q883R582J0752J3070J5477J7007J8477K0809K3221K4594
55565C30182K5198K5540K5002K3138K0742J8098J3899P632J277l259o793j0897
$$ plain form
55672 242577 238669 233860 227353 219812 212716 206392 200183 194112 188774 183935 178825 173611 169109 165350
55658 165350 161783 158591 156433 155239 154541 154497 155289 156113 156221 156304 157294 158397 158002 156071 153894 151890 149437
55641 149437 146614 144383 143049 141990 140796 139411 137482 134984 133080 132844 133475 133301 132223 131509 131472 131027
55625 131027 129542 127597 125803 124175 122636 121011 118813 116202 114692 115509 117647 119047 119295 119591 120369
55610 120369 120748 120338 119938 120189 120844 121510 122069 122386 122562 123226 124564 125570 125341 124545 124297 124323 123747 123029
55592 123029 123363 124637 125838 127139 129659 133270 136522 138787 140728 142612 143932 144904 146729 150096 154771
55577 154771 160732 168310 177193 186775 197527 210597 226074 243081 261558 282367 305588 330182
55565 330182 355380 380920 405922 429060 449802 467900 481799 489431 490708 487449 480656 469759
55553D69759j4885j7074j7764j8570j9667j9939j9232j8398j7650j6695j5940
55542B73945j5978j6371j6265j5605j4664j3284j1732j1049j1326j0977r163p385
55530A20146p101p298o355m814m108l864k809j382r95j388j060J33R05P86N90
55515H1386Q62J495K476L555L791K827J905K100K476J707M69K88Q76P35k17p55
55499A05976o46p68j295j636j881k502k950k374j437j550k566l055k684k515k990
55484G5127l371l164k654k066j570j846l183m340l837k122r12o85m91j5q0j015
55468D3776k005k243j612l94O87N66q18j841j168K19N05j82l02L37M64k08m82
55451C5299K07R48R85O58M42L32L79P28J055R72P92R32R28L07j99L04J092P56
$$ plain form
55553 469759 454874 437800 420036 401466 381799 361860 342628 324230 306580 289885 273945
55542 273945 257967 241596 225331 209726 195062 181778 170046 158997 147671 136694 127531 120146
55530 120146 113045 105747 99392 94578 90470 86606 83797 82415 81420 80032 78972 79105 80010 80796 81386
55515 81386 82248 83743 86219 89774 93565 96392 98297 100397 102873 104580 105049 105337 106213 106948 106731 105976
55499 105976 105330 104562 103267 101631 99750 97248 94298 91924 90487 88937 86371 83316 80632 78117 75127
55484 75127 71756 68592 65938 63872 62302 60456 57273 52933 49096 46974 46062 45377 44886 44871 44791 43776
55468 43776 41771 39528 37916 37522 38209 38775 37957 36116 34948 35167 35672 35490 35188 35525 35989 35781 35299
55451 35299 35506 36454 37439 38097 38539 38871 39250 39978 41033 42005 42797 43729 44657 44964 44765 45069 46161 46917
55433D6917m69j045o21l81q69j182n85M96J334J578J077Q4m99j76K01l16j129
55416D4415j094m65k44j39Q95K491L179K702K147J943J652J627K682M051L856
55401F9698K016O24Q99J660J462M56o01j518k092j862j123r86j729k378k328k138
55385F0060k211k085j552j238j440j540j090n17k56j89k72o92j147r99l53O0J46
55368D4685M08P25M96M5L36J133J097L6o01o7N59K30n23q19q49j088j196o87J09
55349D4029N50N16K22j55k93J02O40N50j66p17p52p08p93p09m87n33p10m19K25
55330D0392M24N0k24j71k35l97r9N34P47N22N25O81K31o29q21l08k35q32r33q2
55310C9140O56O06M41N30J22q67j114J2J119Q10l46j036j051q41m30J4k76j319
$$ plain form
55433 46917 46448 45403 44782 44401 43532 42350 41765 42261 43595 45173 46250 46334 45835 45659 45860 45544 44415
55416 44415 43321 42856 42612 42473 43368 45859 49038 51740 53887 55830 57482 59109 61791 65842 69698
55401 69698 71714 72338 73237 74897 76359 76815 76214 74696 72604 70742 69619 68633 66904 64526 62198 60060
55385 60060 57849 55764 54212 52974 51534 49994 48904 48387 48131 47942 47670 46978 45831 44832 44479 44539 44685
55368 44685 45093 45818 46314 46359 46695 47828 48925 48961 48360 48293 48852 49082 48559 47740 46891 45803 44607 43920 44029
55349 44029 44579 45095 45317 45162 44869 44971 45611 46161 45995 45278 44526 43818 43025 42316 41829 41296 40586 40167 40392
55330 40392 40816 40866 40642 40471 40236 39839 39740 40274 41021 41543 42068 42749 42980 42351 41530 41222 40987 40155 39222 39140
55310 39140 39796 40402 40843 41373 41495 40628 39514 39526 40645 41455 41109 40073 39022 38181 37751 37765 37489 36170
55292C6170j793r15J68Q8p21j015o88l61P3R95J855J855J293R87Q26K16n23n26
55274C7984J27N16L72L46P84J195J103P10M83N28N05M1o91r46k61P25R83N16K42
55255D5262M24K81n62j335j351r57p33o00l07mK08N28Q52P35L13L61J007J387
55237D5509J002L68j23p30j322j121k01J54n54j056l28P64R60N07K19j13r16j431
55219D1588p91K50K97m99p65oJ009J657J843J300j06j444j452k66P58R51R25J212
55201D6461J363Q42n6o27o30m33n14r09j119o88R1M62K40n5j89n28r94p95K63
55182D2185J079P82M3K9O91J160J210J210J069L16r12j897k270k164j670q08N3
55165D0106M35L00l8l21l71r2J96j7n93p25j81K81K04J74O48R69N29m6J28P31
$$ plain form
55292 36170 34377 33462 33630 33718 32997 31982 31294 30933 31006 32001 33856 35711 37004 37991 38817 39033 38510 37984
55274 37984 38111 38627 38999 39345 40129 41324 42427 43137 43620 44148 44653 44694 44003 43057 42796 43521 44504 45020 45262
55255 45262 45686 45967 45405 44070 42719 41762 41029 40429 40122 40118 40326 40854 41706 42441 42754 43115 44122 45509
55237 45509 46511 46879 46756 46026 44704 43583 43382 43536 42982 41926 41598 42362 43322 43829 44048 43935 43019 41588
55219 41588 40797 41047 41344 40845 40080 40074 41083 42740 44583 45883 45777 44333 42881 42615 43373 44324 45249 46461
55201 46461 47824 48666 48610 47983 47353 46920 46406 45497 44378 43690 43781 44243 44483 44428 44239 43711 42717 41922 42185
55182 42185 43264 44046 44089 44118 44809 45969 47179 48389 49458 49774 48862 46965 44695 42531 40861 40053 40106
55165 40106 40541 40841 40803 40482 40111 40019 40215 40198 39605 38880 38699 38980 39184 39358 40006 40975 41504 41458 41586 42317
55145D2317R00O82O86Q00M19l38q20q77p89m64K22P26M61j34k01J82K54l7l1M23
55125D4381P76Q17Q92J079J076R23J102J744K386K558K199J577J186J400J870
55110F5966J720Q19J90M95Q65J40j354k373k577k563k521k091j407j120j277j282
55094E1630r41p03p35o74l71j08l8L5K70P35J482K206K182J198J09k38j63l57
55076E5519n92k53L06K03m65p52l57J91O22J074J214M95o96j292j067p08m03L72
55058E3411J402J521L25r79j084j33Q35J215J053N62K0k33q8K63N98P24L77l90
55040E9399q63l81O27J067O29R2J32O82J489K458L197L064K025R12L91K63L4l13
55022G4904m24j18L99O90M06k41m97Q1R23J096N14n6j17P2J06l9j43k8L63Q46
$$ plain form
55145 42317 43217 43899 44585 45385 45804 45466 44646 43769 42980 42516 42738 43464 43925 43791 43590 43772 44026 43989 43958 44381
55125 44381 45157 45974 46866 47945 49021 49944 51046 52790 55176 57734 59933 61510 62696 64096 65966
55110 65966 67686 68505 68695 69190 70055 70195 68841 66468 63891 61328 58807 56716 55309 54189 52912 51630
55094 51630 50689 49986 49251 48577 48206 48098 48060 48095 48365 49100 50582 52788 54970 56168 56277 56039 55876 55519
55076 55519 54927 54674 54980 55183 54718 53966 53609 53800 54422 55496 56710 57205 56509 55217 54150 53442 53039 53411
55058 53411 54813 56334 56659 55680 54596 54463 55298 56513 57566 58128 58148 57915 57827 58090 58688 59412 59789 59399
55040 59399 58536 58155 58782 59849 60478 60570 60702 61384 62873 65331 68528 71592 73617 74529 74920 75183 75217 74904
55022 74904 74480 74362 74761 75451 75857 75616 75119 75200 76123 77219 77733 77677 77560 77632 77738 77699 77556 77528 77891 78737
55002G8737J039P82L10k16r34j643j614n86N24P18J57m48j069j968k617k251j199
54985F7722n06l77j65K20J61l56n35p4L74L57K21L29M98N04M30L46K96N62J225
54966G1232J647J239N66O63J418J841J796K102K856L102K490J962K223K803L142
54951A01082L459L914L986L423K963L280M019M525M866N468O300P075P738Q296
54937A70394Q559Q472Q154P388N650L063O41p65j356j941l122m980o983q074p611
54922A77489o393n996o858p851p881p043n926m727l553k778k544k513k508k693
54908A08225k899k560j637q40n73m28J1O55J530K940M709O147P060P896Q618Q576
54892A47430P869P497P574O749M255J259q64k344l928n117n048m334m379n228
$$ plain form
55002 78737 79776 80558 80868 80652 79718 78075 76461 75875 76399 77117 77274 76826 75757 73789 71172 68921 67722
54985 67722 67216 66839 66674 66894 67055 66699 66164 66090 66464 66821 67042 67371 67869 68373 68803 69149 69445 70007 71232
54966 71232 72879 74118 74684 75347 76765 78606 80402 82504 85360 88462 90952 92914 95137 97940 101082
54951 101082 104541 108455 112441 115864 118827 122107 126126 130651 135517 140985 147285 154360 162098 170394
54937 170394 178953 187425 195579 202967 208617 211680 212321 211556 210200 208259 205137 200157 193174 185100 177489
54922 177489 171096 165100 158242 150391 142510 135467 129541 124814 121261 118483 115939 113426 110918 108225
54908 108225 105326 102766 101129 100289 99716 99288 99299 99954 101484 104424 109133 115280 122340 130236 138854 147430
54892 147430 155299 162796 170370 177119 181374 182633 181769 179425 175497 170380 165332 160998 156619 151391
54878A51391n599m927m028l711l897m220m542m672m340l677l064k508j694p08
54864I9804j35l57j101j697j553n74N62Q95K72l34m5P95J257J115Q44N92kj031
54846I9307j985k358k109j467p24l17p54k117l701m329l361j542n43j281k894
54831F9825l779l396k424j476o41j54l71q23m89O15J234P62J61K78M11l32j283
54814E8118j080L00J616K070J861J322O20J73L54Q33R61P28O84R97J362J651J976
54797G4546K208K163K164K718L728M614N113N420N735O214P154Q549R705R969
54783A50000R689R690R995R812Q790P453O297N090L350J005j527l589m584m411
54769B07060l663l106l008l148l265l117k460j405n72m55p77r37p90n71k92K16
$$ plain form
54878 151391 145792 140865 136837 133126 129229 125009 120467 115795 111455 107778 104714 102206 100512 99804
54864 99804 99669 99312 98211 96514 94961 94387 94949 95844 96116 95782 95737 96532 97789 98904 99748 100340 100338 99307
54846 99307 97322 94964 92855 91388 90664 90347 89593 87476 83775 79446 76085 74543 74000 72719 69825
54831 69825 66046 62650 60226 58750 58109 57955 57584 56761 56272 56887 58121 58883 59044 59322 59733 59401 58118
54814 58118 57038 57338 58954 61024 62885 64207 64827 65000 65354 66187 67148 67876 68560 69557 70919 72570 74546
54797 74546 76754 78917 81081 83799 87527 92141 97254 102674 108409 114623 121777 130326 140031 150000
54783 150000 159689 169379 179374 189186 197976 205429 211726 216816 220166 221171 219644 216055 211471 207060
54769 207060 203397 200291 197283 194135 190870 187753 185293 183888 183316 182861 182084 181147 180357 179786 179494 179710
54753A79710Q95J541K046K189J613M85k42N8P85J057J052J532K436L052L318L766
54737B05293M187L616J911K00p00j301k343l585m402m925n757o883p636p626p180
54722A62869o805o553o090n255m490m505n426o392o402n427m290l610l305l090
54708I1229k886k575j883q15J70O63O95M46l1n94q96p57m86l85k50K87J002J181
54690H4115N32l34o05j88M11R35J606K453K965K759K188J855J823J849K099K839
54674A07302L585L483K668K312K970L802L867L345K847K311J448O51N79J145J816
54659A44131K530L416M002L639K721K442L261M443N279N940O868P959Q711Q780
54645B14122Q120O933N615M482L447K237Q36o17k134l754n143n884n998n774n291
$$ plain form
54753 179710 180605 182146 184192 186381 187994 188479 188237 188295 189080 190137 191189 192721 195157 198209 201527 205293
54737 205293 209480 213096 215007 215207 214507 213206 210863 207278 202876 197951 192194 185311 177675 170049 162869
54722 162869 156064 149511 143421 138166 133676 129171 123745 117353 110951 105524 101234 97624 94319 91229
54708 91229 88343 85768 83885 83070 83240 83903 84598 85044 85013 84419 83523 82766 82280 81895 81645 81932 82934 84115
54690 84115 84647 84313 83708 83520 83931 84866 86472 88925 91890 94649 96837 98692 100515 102364 104463 107302
54674 107302 110887 114370 117038 119350 122320 126122 129989 133334 136181 138492 139940 140591 141170 142315 144131
54659 144131 146661 150077 154079 157718 160439 162881 166142 170585 175864 181804 188672 196631 205342 214122
54645 214122 222242 229175 234790 239272 242719 244956 245792 245175 243041 239287 234144 228260 222262 216488 211197
54630B11197m641m413n109o136o277n349m515m634n064m691l472k263j529j023
54616A52081n95n91j217k023k378k183j882j855k090k426k775k935k546j565o85
54601A24335p13j592k474k773k625k305j780j170r74j350j659j301n79k16l84
54586A02440p59j215j774k109j786r65k97j15k44m70o85o44j21O18R66O62Rn28
54568I2983o45k10O97J718K414K575K222J587J143J240J577J514J126J221J940
54553A13102K223J358K83L59J457K358K644K933L465L713L473L267L383L515L546
54538A51079L835M433M859M877M738M414L434J778K31n62q03j041j443j908k346
54523A75575k638k788l137l913m579m366l528l184l722m173l610k383j455j147
$$ plain form
54630 211197 206556 202143 197034 190898 184621 179272 174757 170123 165059 160368 156896 154633 153104 152081
54616 152081 151486 150895 149678 147655 145277 143094 141212 139357 137267 134841 132066 129131 126585 125020 124335
54601 124335 123622 122030 119556 116783 114158 111853 110073 108903 107929 106579 104920 103619 103040 102824 102440
54586 102440 101681 100466 98692 96583 94797 93832 93535 93420 93176 92706 92021 91377 91256 91874 92840 93502 93511 92983
54568 92983 92338 92128 92825 94543 96957 99532 101754 103341 104484 105724 107301 108815 109941 111162 113102
54553 113102 115325 116683 116966 117325 118782 121140 123784 126717 130182 133895 137368 140635 144018 147533 151079
54538 151079 154914 159347 164206 169083 173821 178235 181669 183447 183678 183116 182313 181272 179829 177921 175575
54523 175575 172937 170149 167012 163099 158520 154154 150626 147442 143720 139547 135937 133554 132099 130952
54509A30952j100j005p96n08l30n86j208j565j129j24P76J094Q35L87K68O58J088
54492A27707R53L22r2J67Q96J711K362K534K017J198Q91J353J983K151J878J564
54476A49595J537J944K625K942K415J463J004J194J336J058P67P03N36J97K13
54461A69529P25J048P61M31O12Q81O43J44j47m99j361k215k042q45J89J25p36
54444A67243j471j598j425j510j915k077j582r40j009j679j951j459j044j334
54430A46249j687j378r05j154j790j727q95l55o16r50n84K75R57J202J146R54
54414A38742Q46J128J915K953L811M107L636K617J782J755K380K925K988K769
54400A74354K469J942J150M99L85O21O85L59j12m81p87j148j486j632j614j637
$$ plain form
54509 130952 129852 128847 128051 127543 127213 126627 125419 123854 122725 122601 123377 124471 125306 125693 125961 126619 127707
54492 127707 128660 128982 128890 129057 129953 131664 134026 136560 138577 139775 140666 142019 144002 146153 148031 149595
54476 149595 151132 153076 155701 158643 161058 162521 163525 164719 166055 167113 167880 168583 169119 169316 169529
54461 169529 170254 171302 172063 172494 173106 173987 174630 174774 174627 174128 172767 170552 168510 167665 167854 167979 167243
54444 167243 165772 164174 162749 161239 159324 157247 155665 154725 153716 152037 150086 148627 147583 146249
54430 146249 144562 143184 142279 141125 139335 137608 136713 136358 135742 134792 134208 134483 135440 136642 137788 138742
54414 138742 139588 140716 142631 145584 149395 153502 157138 159755 161537 163292 165672 168597 171585 174354
54400 174354 176823 178765 179915 180414 180799 181420 182105 182464 182352 181871 181084 179936 178450 176818 175204 173567
54384A73567j770j861j809j761j857j992j998j855j563j047m92m40j052j572j139
54369A51359m1N96L41q0rK96M24N83J067J523J416Q94N46O13R16J339J788J932
54351A65503J502P64K47J35K74O39J219J658J486P32j58r80j862k647k716j783
54335A64013n06J4p02k072l070l155k622k156k199k679l276l707l877l877l838
54320A26291l732l364k723k079j626j192o51l19n40j087j553k026k749l231k668
54305I6751j266k69l24p76r31j130j838k448j971n72M98L99m85j236j406j231
54289H1765j209j505j734j496j132j430k376k841j953l49N70L49k27k34M65J351
54273F8014J768J369M05m35p05n75l90j97J9M7k02l53l8N37R13R87R46P70L12
$$ plain form
54384 173567 171797 169936 168127 166366 164509 162517 160519 158664 157101 156054 155562 155122 154070 152498 151359
54369 151359 151318 151914 152255 152175 152166 152462 152886 153469 154536 156059 157475 158369 158915 159528 160444 161783 163571 165503
54351 165503 167005 167769 168016 168151 168425 169064 170283 171941 173427 174159 174001 173021 171159 168512 165796 164013
54335 164013 163507 163521 162819 160747 157677 154522 151900 149744 147545 144866 141590 137883 134006 130129 126291
54320 126291 122559 119195 116472 114393 112767 111575 110924 110605 110065 108978 107425 105399 102650 99419 96751
54305 96751 95485 95216 94892 94116 93185 92055 90217 87769 85798 85226 85724 86123 85638 84402 82996 81765
54289 81765 80556 79051 77317 75821 74689 73259 70883 68042 66089 65740 66310 66659 66432 66198 66663 68014
54273 68014 69782 71151 71556 71121 70416 69841 69451 69254 69273 69320 69118 68765 68727 69264 70177 71164 72110 72880 73192
54254G3192l05p50q23m82K30J023J423J302J102J178J340J326J298J398J270O00
54238H4322k25n93m96l11p1L61O75M00l04q07q31n68j64K61K83m13j323j606j250
54219G7340j032j331j663j525j043n32r4R9k54j056j689j705j326r77o77k05L34
54202F2664M67j25j156j818j487m71J49k78j140j291m69M46N97O5m50m45jL95
54184E5652K45n17j376j705j392q48m55k21J3K31J86k84q70r07j26P79Q26L9n06
54165D8764j54N06O12K44L2J54L39M65M71N4p87j277p12M66J158R88N00J89J83
54146E2195O02J351J691R91j63n70r5K53K5p0M46R20O80Q8j57j03k59o61r02p37
54126E5525k21M92J101J296J147J059J062P44J14o3O49J494J397M01m47m63N5
$$ plain form
54254 73192 72887 72137 71314 70832 71062 72085 73508 74810 75912 77090 78430 79756 81054 82452 83722 84322
54238 84322 84097 83504 83008 82697 82626 82987 83662 84062 83758 82951 82120 81552 81388 81649 81932 81519 80196 78590 77340
54219 77340 76308 74977 73314 71789 70746 70214 70120 70219 69965 68909 67220 65515 64189 63212 62535 62330 62664
54202 62664 63131 63006 61850 60032 58545 58074 58223 57945 56805 55514 55045 55491 56088 56153 55703 55258 55257 55652
54184 55652 55897 55380 54004 52299 50907 50059 49604 49383 49396 49627 49813 49529 48659 47752 47626 48405 49231 49270 48764
54165 48764 48610 49116 49728 49972 50004 50158 50497 50962 51433 51487 50700 49423 48711 49177 50335 51323 51823 52012 52195
54146 52195 52797 54148 55839 56830 56667 56097 56002 56255 56280 56210 56656 57576 58256 58344 58187 58084 57825 57164 56262 55525
54126 55525 55304 55796 56897 58193 59340 60399 61461 62205 62319 62256 62905 64399 65796 66197 65750 65287 65342
54109F5342N13P18P23M61j28p75j014o70p2L10M39O98J288J862J935J478Q75M25
54091G4408J77O6Jj26k64k32j16l35r58j426j332j100j230j313o97J59Q8j003
54073F4767j829j475m91J72L62L58J25l93p48m99J10N49P61J024J285J240R19
54056F6237P54J054J652K035J787R94L01K70O61P00J12n42o95m45j57J18N12R48
54038G6296J271J470J525J332J039J123J820K736L317L434L308L104K900K780
54024A07455K744K700K706K939L311L483L377L237L088K619J918J740K511L542
54010A47370L765L038K162J797J836J822J477Q54K05k37n28r98j824k729l214
53995A54796k982k103j013l70o16j507k300k582k587k688k897l042l056k905k565
$$ plain form
54109 65342 65855 66573 67296 67757 67629 66854 65840 65170 65098 65408 65847 66545 67833 69695 71630 73108 73983 74408
54091 74408 74585 74651 74652 74526 74262 74030 73914 73579 72621 71195 69863 68763 67533 66220 65523 65682 65770 64767
54073 64767 62938 61463 60972 61144 61506 61864 61989 61596 60848 60349 60459 61008 61769 62793 64078 65318 66237
54056 66237 66991 68045 69697 71732 73519 74513 74814 75084 75745 76445 76557 76015 75320 74875 74718 74836 75348 76296
54038 76296 77567 79037 80562 81894 82933 84056 85876 88612 91929 95363 98671 101775 104675 107455
54024 107455 110199 112899 115605 118544 121855 125338 128715 131952 135040 137659 139577 141317 143828 147370
54010 147370 151135 154173 156335 158132 159968 161790 163267 164121 164326 164089 163561 162563 160739 158010 154796
53995 154796 151814 149711 148698 148328 147712 146205 143905 141323 138736 136048 133151 130109 127053 124148 121583
53980A21583k222k132k189k022j629j404j418j266q51o17o72m20L37P43Q6q86
53964A05021q52K06R39M81n49r93m97L72Q72P28L08K60Q35J589J926J769J458
53947A13873J325J590K348L264L591K989K067J616J591J479J323J618K362L031
53933A44067L517M212N034N211M409L252K426J860J282R08R27Q48J22q21j015
53918A76239l30L36L80L23R36K020K586K099J133P10J247K334L299L830M037M104
53902B05283M067L906L782L911M236M402M146L646L211K826K226J443Q40N97M94
53887B49016L79M04M89O7j096k206k327j759j747k717l751m040m043m588n458
53872B16623n705n037m114l515l185k967l080l688m361m429l819l129k878k943
$$ plain form
53980 121583 119361 117229 115040 113018 111389 109985 108567 107301 106450 105833 105161 104741 105078 105821 105907 105021
53964 105021 104169 104375 105314 105795 105246 104253 103756 104128 105000 105728 106036 106296 107131 108720 110646 112415 113873
53947 113873 115198 116788 119136 122400 125991 128980 131047 132663 134254 135733 137056 138674 141036 144067
53933 144067 147584 151796 156830 162041 166450 169702 172128 173988 175270 176178 177105 177953 178075 177254 176239
53918 176239 175909 176245 176625 176948 177884 179904 182490 184589 185722 186432 187679 190013 193312 197142 201179 205283
53902 205283 209350 213256 217038 220949 225185 229587 233733 237379 240590 243416 245642 247085 247925 248522 249016
53887 249016 249395 249799 250288 250355 249259 247053 244726 242967 241220 238503 234752 230712 226669 222081 216623
53872 216623 210918 205881 201767 198252 195067 192100 189020 185332 180971 176542 172723 169594 166716 163773
53858A63773k949k957l414m344n044m835l871k849k213j949j990k216k174j456
53844A21512m12M2m46j213j470j137n61R2P73J233J239R02N35L00K13K38K28M6
53826A22114j24R7O66J011P42O8o39j216j425r03J05N69j86j507k189j903j162
53809A14118k61Q83J932K081J144km14j00K86L97M52O89J081J534K143K965L690
53792A32618L798L177K371J986K013K026K021K435L309L954L783L037K364J998
53778A70890J796J727J847J997J985J952K132K288J868P18o22j491j689j497j329
53763A82572j370j478j483j550k018k771l051k266p65M62Q06M35j80p65j257j602
53747A63719j779j929k300k934l449l339k633j990j896j979j561o96n4N7j07m15
$$ plain form
53858 163773 160824 157867 154453 150109 145065 140230 136359 133510 131297 129348 127358 125142 122968 121512
53844 121512 121100 121142 120696 119483 118013 116876 116315 116407 117180 118413 119652 120554 121089 121389 121602 121840 122068 122114
53826 122114 121990 122087 122753 123764 124506 124574 123935 122719 121294 120391 120496 121065 120879 119372 117183 115280 114118
53809 114118 113857 114740 116672 118753 119897 119895 119481 119381 119667 120064 120516 121205 122286 123820 125963 128928 132618
53792 132618 136416 139593 141964 143950 145963 147989 150010 152445 155754 159708 163491 166528 168892 170890
53778 170890 172686 174413 176260 178257 180242 182194 184326 186614 188482 189200 188578 187087 185398 183901 182572
53763 182572 181202 179724 178241 176691 174673 171902 168851 166585 165820 166282 167088 167523 167343 166578 165321 163719
53747 163719 161940 160011 157711 154777 151328 147989 145356 143366 141470 139491 137930 137234 137180 137237 137130 136715
53731A36715r72j409j110l62l28j350k205j819q38n23q17o43K46R46Q27K07m69
53714A26096j176j771j746q80L30J154J222N84l96j136j237q35l16J86O53Q22
53698A21554M64l9mO56J326J556J522J625J986K425K619K251J350M35K6Q5K34
53681A40071L39N08P06Q76J200J795K294K252J844J571J443J103O62O89J287J805
53665A60445J672J007K69j99j91K89Q34R22N45J88J49K67L44L91L60Q6l88p63
53647A66227q86q85q61p40m15J10P02R99O31k32q30o87j50L13Q15J462J629P52
53629A67954n83j278j141p28j35Q09J462R30k09k94R82K014J691R08Q17J041P33
53612A74973K82N53J252J417J073J098J669K099K095K129K455K791L010L307L554
$$ plain form
53731 136715 135743 134334 133224 132862 132534 131184 128979 127160 126322 125799 124982 124339 124585 125531 126358 126565 126096
53714 126096 124920 123149 121403 120523 120853 122007 123229 123813 123417 122281 121044 120209 119893 120079 120732 121554
53698 121554 122018 121979 121975 122631 123957 125513 127035 128660 130646 133071 135690 137941 139291 139726 139752 139837 140071
53681 140071 140410 140918 141624 142500 143700 145495 147789 150041 151885 153456 154899 156002 156664 157353 158640 160445
53665 160445 162117 163124 163393 163194 163003 163292 164126 165048 165593 165781 165930 166197 166541 166932 167292 167378 166990 166227
53647 166227 165341 164456 163595 162855 162440 162550 163252 164251 164882 164650 163820 163133 162983 163296 164111 165573 167202 167954
53629 167954 167371 166093 164952 164224 164089 164898 166360 167290 167081 166787 167769 169783 171474 172382 173199 174240 174973
53612 174973 175255 175808 177060 178477 179550 180648 182317 184416 186511 188640 191095 193886 196896 200203 203757
53597B03757L326K759K547K871L092K811K524K692K823K166R75K31L24O78Q72
53582B34448J314K380L417L299J950N90L10Q72J283J082O62N12O36P16M86j6m42
53565B53499m40j65j72n55o15J59J142J306O66K32N21R54Q15J71m48o83m52J50
53547B56085P77J072J098J152J241J177J162J621K418K968L176L456L723L321
53533B84447K317J834K515L508L758L517L728M486N135N496O006O751P266P401
53519C48165P638Q348R256R866J0048J0093J0406J1205J2306J3156J3319J2910
53507D76716J2510J2659J3509J4770J5938J6764J7555J8739K0175K1237K1704
53496F62276K2084K2846K3779K4324K4203K3477K2443K1752K2072K3235K4197
$$ plain form
53597 203757 207083 209842 212389 215260 218352 221163 223687 226379 229202 231368 232343 232574 232898 233576 234448
53582 234448 235762 238142 241559 244858 246808 247398 247708 248580 249863 250945 251607 252119 252755 253471 253957 253941 253499
53565 253499 253059 252894 252722 252167 251552 251711 252853 254159 254825 255057 255578 256532 257347 257518 257070 256387 255935 256085
53547 256085 256862 257934 259032 260184 261425 262602 263764 265385 267803 270771 273947 277403 281126 284447
53533 284447 286764 288598 291113 294621 298379 301896 305624 310110 315245 320741 326747 333498 340764 348165
53519 348165 355803 364151 373407 383273 393321 403414 413820 425025 437331 450487 463806 476716
53507 476716 489226 501885 515394 530164 546102 562866 580421 599160 619335 640572 662276
53496 662276 684360 707206 730985 755309 779512 802989 825432 847184 869256 892491 916688
53485I16688K4305K4115K4460K5186K5598K5749K6327K7302K7615K6538K4744
53474A198627K3532K3314K3246K2298K0335J8127J6447J5444J4813J4307J3789
53463A404279J3016J1827J0461R298Q262P005N575M360L289J747m78k787m635
53450A471219o205p841r413j0767j2247j4148j6000j7097j7483j7958j9142k0950
53438A301968k2788k3936k4011k3365k2801k2650k2551k2281k2218k2553k2678
53427A050136k2042k1068k0457k0029j9069j7547j6101j4923j3493j1480r136
53416H64791o751m381k223o00O27K144M408P104R572J1547J3344J5477J8055K0553
53402I53667K2335K3494K4801K6662K8584L0013L1241L2879L4868L6641L7974
$$ plain form
53485 916688 940993 965108 989568 1014754 1040352 1066101 1092428 1119730 1147345 1173883 1198627
53474 1198627 1222159 1245473 1268719 1291017 1311352 1329479 1345926 1361370 1376183 1390490 1404279
53463 1404279 1417295 1429122 1439583 1448881 1457143 1464148 1469723 1474083 1477372 1479119 1478641 1475854 1471219
53450 1471219 1465014 1457173 1447760 1436993 1424746 1410598 1394598 1377501 1360018 1342060 1322918 1301968
53438 1301968 1279180 1255244 1231233 1207868 1185067 1162417 1139866 1117585 1095367 1072814 1050136
53427 1050136 1028094 1007026 986569 966540 947471 929924 913823 898900 885407 873927 864791
53416 864791 858040 853659 851436 850836 851463 853607 858015 865119 874691 886238 899582 915059 933114 953667
53402 953667 976002 999496 1024297 1050959 1079543 1109556 1140797 1173676 1208544 1245185 1283159
53391A283159L9094M0203M1467M3248M5663M8139N0070N1696N3579N5510N6767
53380A808595N7337N7963N8948N9738N9903N9687N9368N8779N7714N6239N4347
53369B448618N1890M9035M6250M3634M0806L7643L4494L1547K8571K5557K2931
53358B860976K0776J8463J5421J1776P834L483j477o855j2431j8346k4669l0911
53346B844040l6502m1520m6361n0899n4552n7102n8986o0643o2021o2871o3294
53335B249289o3745o4542o5523o6245o6434o6190o5690o4893o3701o2238o0697
53324A539391n8933n6578n3626n0657m8286m6558m4909m2671l9584l5980l2479
53313A029130k9348k6264k2842j9276j6185j3866j1993j0058p874n649l714k245
$$ plain form
53391 1283159 1322253 1362456 1403923 1447171 1492834 1540973 1591043 1642739 1696318 1751828 1808595
53380 1808595 1865932 1923895 1982843 2042581 2102484 2162171 2221539 2280318 2338032 2394271 2448618
53369 2448618 2500508 2549543 2595793 2639427 2680233 2717876 2752370 2783917 2812488 2838045 2860976
53358 2860976 2881752 2900215 2915636 2927412 2935246 2938729 2937252 2930397 2917966 2899620 2874951 2844040
53346 2844040 2807538 2766018 2719657 2668758 2614206 2557104 2498118 2437475 2375454 2312583 2249289
53335 2249289 2185544 2121002 2055479 1989234 1922800 1856610 1790920 1726027 1662326 1600088 1539391
53324 1539391 1480458 1423880 1370254 1319597 1271311 1224753 1179844 1137173 1097589 1061609 1029130
53313 1029130 999782 973518 950676 931400 915215 901349 889356 879298 871424 865775 862061 859816
53301H59816j038L55K133L992N524O718P828R000J0261J1741J3481J5219J6744
53288I61774J8232J9859K1291K2113K2573K3289K4322K5196K5753K6254K6665
53277A217321K6640K6322K6315K6611K6445K5554K4732K4510K4146K2730K0733
53266A492059J9434J9145J8944J8111J6858J5490J3743J1437R151P534O246M226
53254A652378J038k537n467p706j0137j3437j7313k0925k3763k5986k8091l0414
53242A467640l2891l5143l6799l7733l8016l7738l7093l6495l6294l6361l6302
53231A066775l6062l5905l5765l5324l4748l4630l4889l4565l3293l2071l1736
53220F87787l1432k9789k7065k4807k3623k2640k1217j9759j8569j7169j5403
$$ plain form
53301 859816 858778 859133 861266 865258 870782 877500 885328 894328 904589 916330 929811 945030 961774
53288 961774 980006 999865 1021156 1043269 1065842 1089131 1113453 1138649 1164402 1190656 1217321
53277 1217321 1243961 1270283 1296598 1323209 1349654 1375208 1399940 1424450 1448596 1471326 1492059
53266 1492059 1511493 1530638 1549582 1567693 1584551 1600041 1613784 1625221 1634372 1641906 1648152 1652378
53254 1652378 1653416 1650879 1645412 1637706 1627569 1614132 1596819 1575894 1552131 1526145 1498054 1467640
53242 1467640 1434749 1399606 1362807 1325074 1287058 1249320 1212227 1175732 1139438 1103077 1066775
53231 1066775 1030713 994808 959043 923719 888971 854341 819452 784887 751594 719523 687787
53220 687787 656355 626566 599501 574694 551071 528431 507214 487455 468886 451717 436314
53209D36314j4104j3895j4067j3501j2092j0672r876r704r776r597q865p920p461
53196B94784p558p435o566n461m865m725m529m216m177m586n230n799n979n530
53182B18128m609l774l345l122k963l144l729m150l962l513l365l378l105k659
53168A69310k505k657k788k871l015k878k067j042p51j252j526r14o4m6r60j917
53152A42057k095j512q71q31j388j927j945j604j390j374j183o62j43P0J01K08
53136A25511L53L52J90j7k82p47j355j707j381m30N66J067J145J273J591J677
53120A27806J164K74m62p88p37k99N25J372J627R90j52j037j136m68N22J324J638
53103A32163J397P52J23O4O94J392J438R66Q02J275J755J645J281J400K048K587
$$ plain form
53209 436314 422210 408315 394248 380747 368655 357983 348107 338403 328627 319030 310165 302245 294784
53196 294784 287226 279791 273225 267764 262899 258174 253645 249429 245252 240666 235436 229637 223658 218128
53182 218128 213519 209745 206400 203278 200315 197171 193442 189292 185330 181817 178452 175074 171969 169310
53168 169310 166805 164148 161360 158489 155474 152596 150529 149487 148736 147484 145958 145044 144980 144934 143974 142057
53152 142057 139962 138450 137579 136748 135360 133433 131488 129884 128494 127120 125937 125275 125132 125202 125303 125511
53136 125511 125864 126216 126406 126389 126107 125360 124005 122298 120917 120487 121053 122120 123265 124538 126129 127806
53120 127806 128970 129244 128782 127994 127257 126958 127483 128855 130482 131472 131320 130283 129147 128679 129201 130525 132163
53103 132163 133560 134312 134435 134499 135193 136585 138023 138989 139791 141066 142821 144466 145747 147147 149195 151782
53087A51782K548K044J432R96Q98J107J352J353J055M42n47j750k661k924k739
53072A54388k498k240j837j471j414j583j779k175l006l849l856k856j679j192
53058A22953j345j470j156o57n29j013j731k065j865j589j590j603j311j105j627
53043A02297k663l188k622j439l81L45Q23R44N77r8q13j527k206k547k299j659
53027H3544j069p45o53p52r78j144j168j246j530j718j359m74M15Q76Q75N08j67
53010G3215r33j326j095m71J28N64Q99R93N57l48j150j262o72J25O34P25N10J15
52992G1208l76q31j109j117p84p3Q73J577J466M70p33j297j055n62k58N3O93J364
52974F9509J408P46N9j32m7j12k25n0K95L37J8j62J58P28J096J195J246J300J157
$$ plain form
53087 151782 154330 156374 157806 158802 159700 160807 162159 163512 164567 165009 164462 162712 160051 157127 154388
53072 154388 151890 149650 147813 146342 144928 143345 141566 139391 136385 132536 128680 125824 124145 122953
53058 122953 121608 120138 118982 118325 117796 116783 115052 112987 111122 109533 107943 106340 105029 103924 102297
53043 102297 99634 96446 93824 92385 92004 92349 93172 94116 94693 94595 93782 92255 90049 87502 85203 83544
53027 83544 82475 81730 81077 80325 79347 78203 77035 75789 74259 72541 71182 70708 71123 71999 72874 73382 73215
53010 73215 72282 70956 69861 69390 69518 70082 70981 71974 72531 72183 71033 69771 69099 69224 69858 70583 71093 71208
52992 71208 70832 70001 68892 67775 66991 66918 67791 69368 70834 71304 70571 69274 68219 67657 67399 67452 68145 69509
52974 69509 70917 71663 71722 71590 71543 71431 71206 71156 71451 71788 71806 71644 71802 72530 73626 74821 76067 77367 78524
52955G8524P30K52Lp1j76k18K58J350K375K629K424K703L594M098L556K722K676
52938A07429L298L612L218K552J886J031J2p53j085j159r65m12lm92j670k365
52922A14134k046j567j896k804l394l267k613j701q56n35p82j069j099j284j918
52907H7303k467k332j811j544j473j191r63j325j918j774q67l58r59j897k027
52892F4397j312o29n44p85q16m57J30P35J209J415J264Q95O29N27J56p60j591
52875F4463j324J5J121R50o0q30j080j214j299j000l78J59O04J253J869J838J205
52858F6292P41O90L51o46j475j207j96M25L32K58P51J437J741J718J763J876J701
52841G6552J199P95Q02R72Q77N02K21K81O09R99J266J253J011R21J283J811J929
$$ plain form
52955 78524 79254 79506 79509 79438 79262 79044 79302 80652 83027 85656 88080 90783 94377 98475 102031 104753 107429
52938 107429 110727 114339 117557 120109 121995 123026 123038 122285 121200 120041 119076 118664 118661 118169 116499 114134
52922 114134 112088 110521 108625 105821 102427 99160 96547 94846 93990 93455 92673 91604 90505 89221 87303
52907 87303 84836 82504 80693 79149 77676 76485 75522 74197 72279 70505 69638 69280 68321 66424 64397
52892 64397 63085 62456 61912 61127 60311 59854 59984 60719 61928 63343 64607 65502 66131 66658 66814 66054 64463
52875 64463 63139 63154 64275 65225 65165 64335 63255 62041 60742 59742 59364 59523 60127 61380 63249 65087 66292
52858 66292 67033 67723 68074 67428 65953 64746 64550 64975 65307 65565 66316 67753 69494 71212 72975 74851 76552
52841 76552 77751 78546 79348 80320 81197 81699 81920 82201 82810 83809 85075 86328 87339 88260 89543 91354 93283
52824I3283J571J243J181J120J004J315K141K583J783J86q46o40J86O76N28J07
52808A07421j14J9K21L6o32j304j459j082o17n17r78j885k766l131l006k823k655
52791H4728k048r29r9k66r99j310r36m34l00n81j183j883k176j787j186j074j400
52774F6137j507j155p56o10n00j35M64J038J217P21j73o02p1Q42J312J415J695
52757F9332J934J380J11q72j092j103j368j540j255q10n91m46j87j02m68r61j052
52740F0910o96k90j61l10m80l01K95Q16O51r7o86o19j44J93L5o63j473j568n91
52721E4821O08P84m5o03j37O69Q43L80j76n86p84m89L56J112J052K83m35n11R7
52702E7239J050J790J778R88M3l53n1N61R61Q00Q7p87j375j475r88K70K015L105
$$ plain form
52824 93283 94854 96097 97278 98398 99402 100717 102858 105441 107224 107410 106564 105924 106110 106786 107314 107421
52808 107421 107307 107326 107547 107583 106951 105647 104188 103106 102489 101972 100994 99109 96343 93212 90206 87383 84728
52791 84728 82680 81751 81652 81386 80387 79077 78141 77707 77407 76826 75643 73760 71584 69797 68611 67537 66137
52774 66137 64630 63475 62719 62109 61609 61474 61938 62976 64193 64914 64741 64139 64068 64910 66222 67637 69332
52757 69332 71266 72646 72757 71885 70793 69690 68322 66782 65527 64717 64126 63680 63493 63391 62923 61962 60910
52740 60910 60214 59924 59763 59453 58973 58672 58967 59783 60434 60337 59651 59032 58888 59081 59116 58453 56980 55412 54821
52721 54821 55429 56213 56168 55565 55428 56097 56940 57320 57144 56558 55774 55285 55641 56753 57805 58088 57653 57142 57239
52702 57239 58289 60079 61857 62845 62888 62535 62484 63045 64006 64806 64893 64106 62731 61256 60268 60538 62553 65658
52684F5658K532P97m95m97K37J043J982L013L415K769J833J660K291K957L109
52669I2304K711J884R41M26N65Q82P44J37m75p39o05k37l5l61j060j649k059k625
52651I0749l199l094k221j499j632k147k241j892j498j084n40j58j93l09r4K84
52635F9232M58M50L21j20p44q76l54n1m90p20K99J829K219J286M76O80J205J096
52617G6196L36n89j428k011k066j582r44m74k37k53n12q07r96j261j653j637p28
52600E9354N42J063N48k01m55k76l9J23K01J93J98K54J25l34p37o33k11O5K63
52581F0043P16J095O78m41j282j270q15m15l1M58Q25R33R59R95Q88O94O49O33
52563F5312K53l15l72K33P14N04R6K31P69R88O19N0l10m15l72j95J40N20O58L45
$$ plain form
52684 65658 68190 68987 68492 67995 68232 69275 71257 74270 77685 80454 82287 83947 86238 89195 92304
52669 92304 95015 96899 97840 98266 98831 99713 100457 100594 100119 99380 98775 98538 98503 98142 97082 95433 93374 90749
52651 90749 87550 84456 82235 80736 79104 76957 74716 72824 71326 70242 69702 69544 69351 69042 68948 69232
52635 69232 69690 70140 70461 70341 69597 68721 68367 68316 67826 67106 67405 69234 71453 72739 73215 73895 75100 76196
52617 76196 76532 75943 74515 72504 70438 68856 67912 67438 67201 66948 66436 65629 64633 63372 61719 60082 59354
52600 59354 59896 60959 61507 61306 60851 60575 60536 60659 60860 61053 61251 61505 61630 61296 60559 59926 59715 59780 60043
52581 60043 60759 61854 62532 62091 60809 59539 58724 58309 58278 58736 59561 60494 61453 62448 63336 64030 64679 65312
52563 65312 65565 65250 64878 65111 65825 66329 66425 66656 67425 68413 69032 69082 68772 68357 67985 67790 67930 68450 69108 69453
52543F9453j85l82p7K66K58J51J92Jo95j144m51Q69J363P13J21M06R01P82L63
52524G2905L93Q72J315J539J571J359J090J160J343P60p07j803j476l87Q7k39
52508G9782m04J59J063J724J748Q36p77j966j761p19l05q85j276n44O96J178N81
52491G9130l06o23k37K82K92k48p04n76j74r2k44r4K82J45o54j175o08N76J282
52472G6254J134O40K57mk15k96k06l0K37N65O21L5r61j600j486j067q59o87q8
52453G2244P15R70M59j69l24j20J56O65J516K116J783Q12K48N21R65Q50K32m51
52435H3188j040j477j457q19k2K78Jm08o73q84j077j030o13j5M49N19M1q25j405
52416G2731r18N98K049K312J401L46o4o3l07r13j354j213n71K89J169J761J637
$$ plain form
52543 69453 69268 68886 68809 69075 69333 69484 69676 69677 68982 67838 67387 68256 69619 70332 70453 70859 71760 72542 72905
52524 72905 73298 74170 75485 77024 78595 79954 81044 82204 83547 84307 83600 81797 80321 79934 80021 79782
52508 79782 79378 79537 80600 82324 84072 84908 84131 82165 80404 79685 79380 78495 77219 76675 77371 78549 79130
52491 79130 78824 78201 77964 78246 78538 78290 77586 77010 76836 76744 76500 76406 76688 76833 76179 75004 74396 74972 76254
52472 76254 77388 78028 78285 78281 78066 77770 77564 77534 77771 78336 78957 78992 78031 76431 74945 73878 73019 72332 72244
52453 72244 72959 73929 74388 74219 73895 73775 73931 74596 76112 78228 80011 80823 81071 81592 82557 83407 83639 83188
52435 83188 82148 80671 79214 78395 78373 78651 78652 78244 77571 76687 75610 74580 73967 73952 74401 74920 74961 74136 72731
52416 72731 71813 72411 74460 76772 78173 78519 78455 78392 78085 77172 75818 74605 74034 74323 75492 77253 78890
52399G8890P59k71q98j215j512j484o09P42J398Q95J57K22Q58J046M77j40r9N82
52381G9798J461K064J937R10m41j078o33J52L19p1j57N53J613K203J944J123L52
52364I2049Q5K26K42j46m32J04J311K155K003J409J169J141O42k79p86m83J23
52347A00533M70N95O26L72j83n57m59k96m85p03l75M34J177J571J592J087M2r85
52329A04456j364j214j053r30n50j25j54m30j93N44P72q0j219j512q12J67Q30
52312I7133J081J065R25P37M82L05O40J577K297J886P74M15J285K221K205J792
52296A16820J897K143J587N21K51J141K062J971J128M56M28R41J716K446K825
52281A38333K766K445K053J649J308J181J305J537J671J537J087N75M73R04J368
$$ plain form
52399 78890 79649 79378 78480 77265 75753 74269 73660 74402 75800 76695 76852 77074 77932 78978 79455 79315 79216 79798
52381 79798 81259 83323 85260 86170 85729 84651 84018 84170 84489 84418 84261 84814 86427 88630 90574 91697 92049
52364 92049 92134 92360 92602 92456 92024 92128 93439 95594 97597 99006 100175 101316 101958 101679 100893 100410 100533
52347 100533 101003 101598 102224 102596 102413 101856 101397 101101 100616 99913 99538 99972 101149 102720 104312 105399 105441 104456
52329 104456 103092 101878 100825 99895 99345 99220 99066 98636 98443 98987 99759 99679 98460 96948 96136 96303 97133
52312 97133 98214 99279 100204 100941 101423 101728 102368 103945 106242 108128 108902 109317 110602 112823 115028 116820
52296 116820 118717 120860 122447 122968 123219 124360 126422 128393 129521 129977 130405 131346 133062 135508 138333
52281 138333 141099 143544 145597 147246 148554 149735 151040 152577 154248 155785 156872 157447 157920 158824 160192
52266A60192J270P02L52O31J291J810J834J253K55n76n80L28J510K177K050J429
52250A75928Q25O06Q45J328J748J944K008K219K795L520L715K904J556P35Q68
52235B03544J258J175R07J144J755J959J587J355J699K134K052J629J464J779
52221B25441K334K839K993K499J499P51Q61J438J597J258J340K400L713M111L387
52206B58461K344J630J126N56J03J12N27J006J395J782K198K573K897L167L234
52191B83111L033K837K984L347L458L151K714K356J939J393R77R18J056J135J205
52176C15614J431J722J793J543J143Q42P14O31L70j14n66p20p04q20j045r94m87
52159C20353K19Q03J101R19J54p47j006n06q1m07j052j176p97o87j174j706j670
$$ plain form
52266 160192 161462 162164 162516 163147 164438 166248 168082 169335 169590 169014 168434 168762 170272 172449 174499 175928
52250 175928 176753 177359 178204 179532 181280 183224 185232 187451 190246 193766 197481 200385 201941 202676 203544
52235 203544 204802 205977 206884 208028 209783 211742 213329 214684 216383 218517 220569 222198 223662 225441
52221 225441 227775 230614 233607 236106 237605 238356 239217 240655 242252 243510 244850 247250 250963 255074 258461
52206 258461 260805 262435 263561 264117 264220 264332 264859 265865 267260 269042 271240 273813 276710 279877 283111
52191 283111 286144 288981 291965 295312 298770 301921 304635 306991 308930 310323 311300 312218 313274 314409 315614
52176 315614 317045 318767 320560 322103 323246 324088 324802 325433 325803 325689 325123 324403 323699 322879 321834 320840 320353
52159 320353 320572 321375 322476 323395 323549 322802 321796 321290 321209 320802 319750 318574 317777 317090 315916 314210 312540
52142C12540j137o10l85l30k59l15q61j816k354j757n45j18r45j844j570n34j38
52125B97022q23j710k033j960j843j543r14m03n76j322j958k093k052k368k946
52110B72478l039k180j024p36j541k406k379j671r74l77M04J173J541J674J937
52095B62880J935J001m98j235n78P56J835K479K764K536J900J485J575J646J283
52080B81764R57J200J588J344O23L31Q05J487J894K161K429K345J569N19J28Q28
52064C01972J933K251J393L17K66J285K267K458K282K312K286J764J202J360J893
52049C27241J613K34j123j491j173q02j93J012K174K265J444R52J321J634R71
52034C36079k34r43j020j181j661j818j159q9O57Q16N57lp79j488j839j902j989
$$ plain form
52142 312540 311403 310793 310408 310078 309819 309504 308643 306827 304473 302716 302171 302053 301108 299264 297694 297160 297022
52125 297022 296199 294489 292456 290496 288653 287110 286196 285793 285217 283895 281937 279844 277792 275424 272478
52110 272478 269439 267259 266235 265499 263958 261552 259173 257502 256528 256151 256555 257728 259269 260943 262880
52095 262880 264815 265816 265318 264083 263505 264261 266096 268575 271339 273875 275775 277260 278835 280481 281764
52080 281764 282721 283921 285509 286853 287476 287807 288612 290099 291993 294154 296583 298928 300497 301016 301144 301972
52064 301972 303905 306156 307549 307866 308132 309417 311684 314142 316424 318736 321022 322786 323988 325348 327241
52049 327241 328854 329088 327965 326474 325301 324499 324306 325318 327492 329757 331201 332153 333474 335108 336079
52034 336079 335845 334902 333882 332701 331040 329222 328063 327974 328631 329447 330004 330001 329222 327734 325895 323993 322004
52017C22004k149k120j751j278j035j076j223j343j421j367r55j50O04P22J76
52002C07638l24j88L06M16Ok96k7M80O49L82m2n24j173k009k853l452l549l093
51984B92347k542k603l432m388m895n142n479n608n080m336m452n671o977p336
51970B24406o827o232n952n759n368m833m397m221m269m396m506m571m488m034
51956A54553l223k530k505l125l794l995l710l232k823k581k379j945j232o64
51942A16815p30j292j629j264n24j14l66r79j307r40j45K43l88j685k616k466
51926A00613j417k10N02M88M5k14N6M96M68j11o57o89k95J90N91P96P05M55M29
51907A02241P50J068J091J001J112J329J352J196J124J106P57j00j106j736j815
$$ plain form
52017 322004 319855 317735 315984 314706 313671 312595 311372 310029 308608 307241 306286 306136 306740 307462 307638
52002 307638 307314 307126 307432 307848 307854 307558 307531 308011 308660 309042 309000 308476 307303 305294 302441 298989 295440 292347
51984 292347 289805 287202 283770 279382 274487 269345 263866 258258 253178 248842 244390 238719 231742 224406
51970 224406 217579 211347 205395 199636 194268 189435 185038 180817 176548 172152 167646 163075 158587 154553
51956 154553 151330 148800 146295 143170 139376 135381 131671 128439 125616 123035 120656 118711 117479 116815
51942 116815 116085 114793 113164 111900 111376 111262 110896 109917 108610 107670 107525 107768 107380 105695 103079 100613
51926 100613 99196 98986 99488 99976 100021 99807 99863 100359 100827 100716 100059 99370 99075 99265 99856 100652 101357 101812 102241
51907 102241 102991 104059 105150 106151 107263 108592 109944 111140 112264 113370 114127 114027 112921 111185 109370
51892A09370j517j012l33L95Q64Q89O35L82J17l07p46q04m00O7K35J19j34m52
51874A07368n87k19M01M86j98p71l94N20R69Q47Q47J147J251J037R79J167J075
51857A15925N94L68P31J134J055P77P04O62M18L09O62J133J225J044R24P00J22
51840A28487l65m2J041K098K610K666K423J855J168P95Q46R65R06Q42R21R23O56
51823A48795L87N75J240J879K017J721J477J678K294L023L622M021M288M570M971
51808A86558N338N288M656L777L092K621K061J266K63r74k321l202l055k117j251
51793B02000j002j295j958k818l258k603j247o00j367k595k969k415j804j600
51779A74469j602j668j883k053j751r75k84j83o30j195j479j451j430j678j988
$$ plain form
51892 109370 107853 106841 106508 106903 107767 108656 109291 109673 109790 109483 108737 107933 107533 107600 107835 107954 107820 107368
51874 107368 106781 106562 106963 107449 107251 106480 106086 106606 107575 108422 109269 110416 111667 112704 113683 114850 115925
51857 115925 116519 116887 117618 118752 119807 120584 121288 121950 122368 122677 123339 124472 125697 126741 127665 128365 128487
51840 128487 128122 128080 129121 131219 133829 136495 138918 140773 141941 142736 143582 144547 145453 146295 147216 148139 148795
51823 148795 149182 149757 150997 152876 154893 156614 158091 159769 162063 165086 168708 172729 177017 181587 186558
51808 186558 191896 197184 201840 205617 208709 211330 213391 214657 214920 213946 211625 208423 205368 203251 202000
51793 202000 200998 199703 197745 194927 191669 189066 187819 187219 185852 183257 180288 177873 176069 174469
51779 174469 172867 171199 169316 167263 165512 164537 164253 164070 163440 162245 160766 159315 157885 156207 154219
51764A54219j931j530j219j090p97l74m25j075j459q83N0K79l00r51j294j553
51748A39667j785j718j340r71p18m23j23o2k33l91m51m63l72j81j50l53l58R4
51730A29669M24q1j129j727j467p67oP09J031N69k91o29k58J17J91N65J593K542
51712A31055K541J702P48J7n31p73n26lL55L83K04j30o02j011j048o18O2N56M27
51693A32808m32j550k268k415k398k503k478j973j060j87K14nn63p95k47O68J002
51676A15818M15m19p29n40l38k51o6K33L40O8m01p24o56j41O67J436J772J423
51658A17907M94l83m08N65J714K067J642J255J381J723J923K037K106J863J186
51643A37072M27p9m09o37n04P5N72L98l09r09j007o69r2N01Q16P19M35K25N6j50
$$ plain form
51764 154219 152288 150758 149539 148449 147652 147278 146853 145778 144319 143436 143486 143765 143465 142514 141220 139667
51748 139667 137882 136164 134824 133853 133135 132712 132589 132527 132294 131903 131452 130989 130617 130436 130286 129933 129575 129669
51730 129669 130093 130012 128883 127156 125689 124922 124916 125625 126656 127225 126934 126305 126047 126164 126355 126920 128513 131055
51712 131055 133596 135298 136046 136063 135532 134759 134233 134230 134585 134968 135172 135042 134440 133429 132381 131763 131825 132381 132808
51693 132808 132376 130826 128558 126143 123745 121242 118764 116791 115731 115544 115758 115753 115190 114395 114148 114816 115818
51676 115818 116233 115814 115085 114545 114207 113956 113890 114123 114463 114531 114130 113406 112750 112609 113276 114712 116484 117907
51658 117907 118401 118018 117610 118175 119889 121956 123598 124853 126234 127957 129880 131917 134023 135886 137072
51643 137072 137499 137420 137011 136374 135870 135945 136517 136915 136606 135697 134690 134021 133929 134430 135246 135965 136400 136625 136681 136531
51623A36531k02J50P72J309J558J457R32J59l39k62Qk9k04p4J88kn63o89n7O06
51603A41249N43M4n2M56R26P40J2o31p47m86l79o76r71p13LM46J66m52p87p48
51583A37943o50o48o55p01r23j180j115n87J84R19J381J279M78n24q12%J277K077
51565A37743K036J403N48j76m03m5N35J014J555K280K592J743Q5r98p25K31P79
51548A50197P71P18P29L69n29j473j805j267j52Q74J279J137J002J099J012M77
51532A54438p0j27O9L1%N87J584K038J618J118J232J634J688J472J425J444J018
51515A71199J64l91j01P56J485J729J617J290O52l27j256j582j272r04r08j021
51499A71130q28n14o02j095j464j485j516j742j717j047j82mp62j757k115j651
$$ plain form
51623 136531 136329 136479 137251 138560 140118 141575 142507 142666 142327 142065 142073 142044 141840 141766 141954 141952 141389 140700 140643 141249
51603 141249 141792 141836 141784 142240 143166 143906 143918 143287 142540 142054 141675 140999 140028 139315 139318 139764 139930 139478 138691 137943
51583 137943 137293 136645 135990 135289 134366 133186 132071 131484 131668 132587 133968 135247 135725 135201 134389 134389 135666 137743
51565 137743 139779 141182 141730 141554 141151 141106 141641 142655 144210 146490 149082 150825 150910 149912 149187 149418 150197
51548 150197 150968 151686 152415 152784 152255 150782 148977 147710 147558 148432 149711 150848 151850 152949 153961 154438
51532 154438 154368 154241 154310 154341 154341 154928 156512 158550 160168 161286 162518 164152 165840 167312 168737 170181 171199
51515 171199 171363 170972 170871 171627 173112 174841 176458 177748 178400 178073 176817 175235 173963 173059 172151 171130
51499 171130 170302 169788 169186 168091 166627 165142 163626 161884 160167 159120 158938 158934 158172 156415 154300 152649
51483A52649r39o68j012j598j977k006j750j282q25p40j093j348r92l22j88q76
51467A35033j759k151k045j852j761j665j480j306j353j705k037j706n16P37R53
51452A15387K7j055j481j439j499j762j895j637r71j79R5o36j857k247j142N61
51436I8270J473J256O69L56K49L3k94m68k24L86Q66O42k06r06r42o75o54p13l30
51417I8788L68O67L16k09m70n39n03j20O77J400J605J526J693K043J966J216L22
51400A10746j53k87m58o04l70J45L99K42J45L86N36K34j05O1M82N82N12Q80J538
51381A14911J611P96j66n66m97l46l14o29j472k323k258j318o85r98j426j120
51365A03200o46r19j463j003M93J612J311j8j367k120k147j671j206j182j437
$$ plain form
51483 152649 151710 151042 150030 148432 146455 144449 142699 141417 140592 139852 138759 137411 136419 136097 135909 135033
51467 135033 133274 131123 129078 127226 125465 123800 122320 121014 119661 117956 115919 114213 113697 114434 115387
51452 115387 115414 114359 112878 111439 109940 108178 106283 104646 103675 103496 103591 102955 101098 98851 97709 98270
51436 98270 99743 100999 101668 102024 102273 102306 102012 101544 101320 101706 102572 103214 103008 102102 101160 100485 99831 99118 98788
51417 98788 99156 99823 100139 99930 99460 98921 98418 98298 98975 100375 101980 103506 105199 107242 109208 110424 110746
51400 110746 110593 110306 109848 109244 108874 109019 109418 109660 109805 110191 110727 110961 110856 110917 111399 111981 112493 113373 114911
51381 114911 116522 117318 117152 116586 116089 115743 115429 114800 113328 111005 108747 107429 106744 105746 104320 103200
51365 103200 102554 101635 100172 99169 99662 101274 102585 102567 101200 99080 96933 95262 94056 92874 91437
51350I1437j472j137o09K7O74Q84L66m00o91n80o58q82o26J01N07K72K2K13L62
51331H7810q2q52j349j391r74M0J359J917R73p43j676j207j45M80M70K32M3q4
51313H4821r9J37O07J032J168J067R21O76L6j004j848j856j103k82J33K21J84
51296H4811p7o80j413j867j757j066k7Q94J225Q84K71j25j79j55l57q12j193j060
51278G7317l36N46J023R23M93O8j37o1J70L21L13K83K62P5k29k06L34Q38O52n3
51258H2596n73o37m65l9Q28J716J739P37l65p03l92%K47L38J22l84p42o02k13
51239H3208L8J88M60P29P00M22J86R8J17L48Q55J305J169L36p37j445j468r50
51221H5559l58q7q1K2L01M95N14O30R13R84P11N61Q57J075N81k61n29j06K19J01
$$ plain form
51350 91437 89965 88828 88219 88246 88920 89804 90170 89770 89079 88499 87841 86959 86333 86434 86941 87213 87235 87448 87810
51331 87810 87728 86876 85527 84136 83162 83202 84561 86478 87451 86708 85032 83825 83680 84160 84630 84862 84905 84821
51313 84821 84722 84859 85466 86498 87666 88733 89654 90330 90366 89362 87514 85658 84555 84273 84406 84627 84811
51296 84811 84734 84054 82641 80774 79017 77951 77924 78818 80043 80927 81198 81073 80894 80739 80382 79570 78377 77317
51278 77317 76981 77527 78550 79473 79966 80034 79897 79836 80006 80327 80640 80923 81185 81260 81031 80825 81159 81997 82649 82596
51258 82596 82023 81386 80921 80882 81710 83426 85165 85902 85537 84834 84442 84442 84689 85027 85149 84765 84023 83421 83208
51239 83208 83246 83434 83894 84623 85323 85745 85931 86029 86146 86494 87349 88654 89823 90159 89422 87977 86509 85559
51221 85559 85201 85114 85033 85055 85356 85851 86365 86995 87908 88892 89603 90164 91021 92096 92677 92416 91887 91781 92000 92101
51201I2101J51P80J322R75J08k18J89L68l22j200j220m71m5m69j031q55r9M06
51183I0470L55J78K15K91J83J0QK50P18J246J327N20q08j631j418p38m04m71m77
51164H9824k57k6R1J23J01J04L55P88Q81L17m18o24k99O4L20O42Q15L73m73q76
51144I1825m94M9K02K60P16J322J418Q82K24p6R5O50J298J508R35p3p41p40m69
51125I8791l74l24J23R99J744J780J095K30k58k22J21M70N92L20l12q96r00l20
51107A02659K14J91l9K83J179J709J139q8r58j176j324j746j958j455n63k2Q5
51090I8130L18Q46J061N13k92n35k49k47q61j314p15P07J821J956J528J194Q68
51073A04729P7j003j491r49k9M10M06O14J124J276P33J00Q4M70M94j0l93k07J60
$$ plain form
51201 92101 92252 93032 94354 95329 95437 95219 95408 95776 95454 94254 93034 92563 92518 92049 91018 90163 90064 90470
51183 90470 90825 91003 91218 91509 91692 91702 91710 91960 92678 93924 95251 95771 94963 93332 91914 91176 90772 90301 89824
51164 89824 89567 89541 89632 89755 89856 89960 90315 91103 91984 92301 91883 91259 90960 91024 91344 91986 92801 93174 92701 91825
51144 91825 91331 91380 91582 91842 92558 93880 95298 96180 96404 96328 96423 97073 98371 99879 100814 100741 100000 99260 98791
51125 98791 98417 98093 98216 99215 100959 102739 103834 104064 103806 103584 103705 104175 104767 105087 104775 103879 102979 102659
51107 102659 102873 103064 103025 103308 104487 106196 107335 107247 106289 105113 103789 102043 100085 98630 98067 98045 98130
51090 98130 98448 99294 100355 100868 100576 100041 99792 99545 98684 97370 96655 97362 99183 101139 102667 103861 104729
51073 104729 104806 103803 102312 101363 101334 101744 102150 102764 103888 105164 105897 105997 106081 106551 107045 107035 106642 106435 106595
51054A06595J21j98j81L05O46L21l46n95j12P30J414J722J706J562J500J455R62
51037A17607k17j364j285K03J824K298J789J341J256Q48k77j461j758j014J32
51022A19922R59J186J036R06R02P19J98j92K19J372K394K527J798Q03J66J60N01
51005A35576M92k09r86r54j70M46L89R1L4J05J13J97L08j7q03j250p98k2K04J4
50985A32760J76Q12J296J298J124J003Q00N14L98N12N91N20M90O31Q70J159J499
50968A46453J721J645J453J499J746J837J709J745K180K834L499M152M696M869
50954A82038M690M607M984N696O390O909P257P317O951O345O095O749Q192R584
50940B73804J0110R827R466R432R376Q964Q423P990P390O522O071O572P166O380
$$ plain form
51054 106595 106716 106518 106337 106642 107288 107609 107263 106668 106556 107286 108700 110422 112128 113690 115190 116645 117607
51037 117607 117390 116026 114741 114944 116768 119066 120855 122196 123452 124300 124023 122562 120804 119790 119922
51022 119922 120881 122067 123103 124009 124911 125630 125828 125636 125855 127227 129621 132148 133946 134749 134915 135075 135576
51005 135576 136068 135859 134873 133919 133749 134195 134584 134675 134709 134814 134927 135124 135432 135415 134612 133362 132564 132542 132746 132760
50985 132760 132936 133748 135044 136342 137466 138469 139269 139783 140181 140693 141284 141804 142294 142925 143795 144954 146453
50968 146453 148174 149819 151272 152771 154517 156354 158063 159808 161988 164822 168321 172473 177169 182038
50954 182038 186728 191335 196319 202015 208405 215314 222571 229888 236839 243184 249279 256028 264220 273804
50940 273804 283914 293741 303207 312639 322015 330979 339402 347392 354782 361304 367375 373947 381113 387493
50926C87493M103J752L05p57k200l748m790n480o298p006o996o418o117o509p186
50911C30148p609p609p115o059m757l885l733l784l373k558j957j813j611p99
50897B73486M13J283J434J203J046J067J274J797K542K980K808K511K662K956
50883B99462K631J735J087R41O57o3n89n09m42r74j513j173k76M0n37j247j583
50866B97647j828k146k077j350n07k04l82n20l75o5L23P79J176J371J447J627
50850B94916J985K395K735L004L286L703M372N297O342P240P738P852Q106R205
50836C68176J1176J3030J3780J3719J4089J5367J6601J6923J7015J8299K0913
50825E39088K3411K4616K4951K5507K6478K7078K6784K5867K4770K3484K1789
$$ plain form
50926 387493 391596 393348 393653 392896 390696 386948 382158 376678 370380 363374 356378 349960 343843 337334 330148
50911 330148 322539 314930 307815 301756 296999 293114 289381 285597 282224 279666 277709 275896 274285 273486
50897 273486 273899 275182 276616 277819 278865 279932 281206 283003 285545 288525 291333 293844 296506 299462
50883 299462 302093 303828 304915 305856 306513 306450 305861 305352 304910 303936 302423 301250 300974 301014 300477 299230 297647
50866 297647 295819 293673 291596 290246 289739 289535 289153 288633 288258 288193 288516 289295 290471 291842 293289 294916
50850 294916 296901 299296 302031 305035 308321 312024 316396 321693 328035 335275 343013 350865 358971 368176
50836 368176 379352 392382 406162 419881 433970 449337 465938 482861 499876 518175 539088
50825 539088 562499 587115 612066 637573 664051 691129 717913 743780 768550 792034 813823
50814H13823J9685J7308J4718J1996R420P157M976K489k58k790m725o137p274
50801H80388q168q590q294p288n970m910m250l461j953P9J879L267N006P733J1040
50786H56508J4033J6535J9083K1946K4708K6811K8007K8259K7684K6670K5627
50775A115871K4421K2545J9926J7154J4689J2412J0133Q024O022L357o03n338
50763A248613r620j2981j6033j9347k2633k5292k7299k9125l1047l2732l3480
50752I89024l2790l0865k8605k6787k5314k3581k1538j9858j8806j7650j5594
50741G27636j2891j0398q321o122l521q46J616L955O075P551Q397R416J1190J3058
50727G46795J3836J3450J3082J3543J4098J3393J1211Q774P360P034O933O405
$$ plain form
50814 813823 833508 850816 865534 877530 886950 894107 899083 901572 901314 898524 893799 887662 880388
50801 880388 872220 863630 855336 848048 842078 837168 832918 829457 827504 827583 829462 832729 837735 845468 856508
50786 856508 870541 887076 906159 928105 952813 979624 1007631 1035890 1063574 1090244 1115871
50775 1115871 1140292 1162837 1182763 1199917 1214606 1227018 1237151 1245175 1251197 1254554 1253951 1248613
50763 1248613 1238993 1226012 1209979 1190632 1167999 1142707 1115408 1086283 1055236 1022504 989024
50752 989024 956234 925369 896764 869977 844663 821082 799544 779686 760880 743230 727636
50741 727636 714745 704347 696026 689904 686383 685537 687153 691108 697183 704734 713131 722547 733737 746795
50727 746795 760631 774081 787163 800706 814804 828197 839408 848182 855542 862576 869509 875914
50715H75914N510M515L360J904M82k28M0P99J437J974K882M224N386N770N521
50700I19490N236N219N347N598O209P147P831P732P036O388O126O193O628P557
50686A009737Q745R780J0833J2597J5050J6996J7512J7260J7593J8657J9427J9590
50674A193777K0263K2482K5877K9487L3168L7450M2358M7267N1760N5926N9753
50663A619568O2832O4803O5711O5670O4531O2163N8864N5292N1934M8788M5556
50652B265712M2077L8456L4725L0512K5331J9260J3059P549L030o40l678o284
50640B469109q530j0060j0211q835o838n461n060m965m475l649l047l030l565
50627B391383m460n644p219r247j1479j3406j4712j5569j6305j6861j6802j5849
$$ plain form
50715 875914 881424 885939 889299 891203 891685 891457 891497 892296 893733 895707 898589 902813 908199 913969 919490
50700 919490 924726 929945 935292 940890 947099 954246 962077 969809 976845 983233 989359 995552 1002180 1009737
50686 1009737 1018482 1028262 1039095 1051692 1066742 1083738 1101250 1118510 1136103 1154760 1174187 1193777
50674 1193777 1214040 1236522 1262399 1291886 1325054 1362504 1404862 1452129 1503889 1559815 1619568
50663 1619568 1682400 1747203 1812914 1878584 1943115 2005278 2064142 2119434 2171368 2220156 2265712
50652 2265712 2307789 2346245 2380970 2411482 2436813 2456073 2469132 2476681 2479711 2479071 2475393 2469109
50640 2469109 2460579 2450519 2440308 2431473 2424635 2419174 2414114 2409149 2404674 2401025 2397978 2394948 2391383
50627 2391383 2386923 2381279 2374060 2364813 2353334 2339928 2325216 2309647 2293342 2276481 2259679 2243830
50615B243830j4148j2019r592o817l746p70J435K303J769R3k564o124j0206j4274
50601B169170j8399k3299k9196l5108l9867m3479m6792n0077n2754n4432n5373
50590A720394n5779n5399n4168n2614n1265n0015m8472m6522m4301m1888l9278
50579A180693l6382l2944k8860k4629k1023j8107j5140j1737q514o121m143j683
50567I71410J313L975N690O712P603Q595R616J0599J1573J2648J3979J5608J7451
50554A096772J9532K2139K5531K9527L3669L7679M1534M5166M8383N1150N3712
50543A504794N6332N8925O0943O1730O1234O0356O0306O1395O2776O3646O4270
50532B176707O5402O7007O8219O8588O8723O9517P1072P2701P3667P3820P3641
$$ plain form
50615 2243830 2229682 2217663 2208071 2201254 2197508 2196738 2198173 2200476 2202245 2202338 2199774 2193650 2183444 2169170
50601 2169170 2150771 2127472 2098276 2063168 2023301 1979822 1933030 1882953 1830199 1775767 1720394
50590 1720394 1664615 1609216 1555048 1502434 1451169 1401154 1352682 1306160 1261859 1219971 1180693
50579 1180693 1144311 1111367 1082507 1057878 1036855 1018748 1003608 991871 983357 977236 973093 971410
50567 971410 972723 976698 982388 989100 996703 1005298 1014914 1025513 1037086 1049734 1063713 1079321 1096772
50554 1096772 1116304 1138443 1163974 1193501 1227170 1264849 1306383 1351549 1399932 1451082 1504794
50543 1504794 1561126 1620051 1680994 1742724 1803958 1864314 1924620 1986015 2048791 2112437 2176707
50532 2176707 2242109 2309116 2377335 2445923 2514646 2584163 2655235 2727936 2801603 2875423 2949064
50521B949064P3849P4802P6097P6844P6438P4860P2192O8107O2114N4216M5043
50510C703626L5251K4896J3521Q43j2638k5750l7374m7124n5308o2277o7849p1363
50498C398454p2264p0586o6898o1873n5913m9181m1905l4664k8338k3727k1098
50487B872007k0125k0474k2414k6578l2973m0544m8022n4972o1573o7596p2224
50476B404512p4979p6308p6977p7323p7326p7068p6687p6075p5041p3601p1904
50465A571223o9884o7311o4118o0472n6601n2676m8829m5149m1589l7992l4185
50454I92417l0183k6338k3173k0806j8672j6226j3764j1990j0832r474p716o438
50442G96805o144n895m497k245l88P41K015L922N836P130Q155R595J1540J3705
$$ plain form
50521 2949064 3022913 3097715 3173812 3250656 3327094 3401954 3474146 3542253 3604367 3658583 3703626
50510 3703626 3738877 3763773 3777294 3778137 3765499 3739749 3702375 3655251 3599943 3537666 3469817 3398454
50498 3398454 3326190 3255604 3188706 3126833 3070920 3021739 2979834 2945170 2916832 2893105 2872007
50487 2872007 2851882 2831408 2808994 2782416 2749443 2708899 2660877 2605905 2544332 2476736 2404512
50476 2404512 2329533 2253225 2176248 2098925 2021599 1944531 1867844 1791769 1716728 1643127 1571223
50465 1571223 1501339 1434028 1369910 1309438 1252837 1200161 1151332 1106183 1064594 1026602 992417
50454 992417 962234 935896 912723 891917 873245 857019 843255 831265 820433 810959 803243 796805
50442 796805 790661 784766 780269 778024 777636 778377 780392 784314 790150 797280 805435 815030 826570 840275
50428H40275J6039J8630K1339K4003K6679K9361L1755L3741L5726L8090M0555
50417A156193M2676M4703M7274N0305N2841N4337N5473N7265N9736O1975O3290
50406A746068O3777O3705O2915O1138N8543N5555N2303M8654M4652M0500L6080
50395B333890L0902K4653J7388R113k76j0396k0170k8777l6336m3195m8903n2664
50383B175229n4640n5883n6819n6550n4125m9927m5281m1028l7049l2994k8937
50372A661996k5295k2453k0610j9779j9818k0521k1728k3229k4741k6185k7856
50361A409781l0063l2511l4351l5015l4842l4662l4799l4815l4253l3281l2365
50350A038824l1536l0422k8913k7345k5971k4625k3143k1663k0249j8597j6524
$$ plain form
50428 840275 856314 874944 896283 920286 946965 976326 1008081 1041822 1077548 1115638 1156193
50417 1156193 1198869 1243572 1290846 1341151 1393992 1448329 1503802 1561067 1620803 1682778 1746068
50406 1746068 1809845 1873550 1936465 1997603 2056146 2111701 2164004 2212658 2257310 2297810 2333890
50395 2333890 2364792 2389445 2406833 2415946 2415670 2405274 2385104 2356327 2319991 2276796 2227893 2175229
50383 2175229 2120589 2064706 2007887 1951337 1897212 1847285 1802004 1760976 1723927 1690933 1661996
50372 1661996 1636701 1614248 1593638 1573859 1554041 1533520 1511792 1488563 1463822 1437637 1409781
50361 1409781 1379718 1347207 1312856 1277841 1242999 1208337 1173538 1138723 1104470 1071189 1038824
50350 1038824 1007288 976866 947953 920608 894637 870012 846869 825206 804957 786360 769836
50339G69836j4455j2956j1959j0932r706q612p806p057o235n572n195m904m582
50326F59865m468m705m974m872m436m001l742l577l330k802j866p17J83O42J023
50311F18223J793K978M303N634O992Q293R361J0114J0544J0650J0663J1066J2005
50298G22619J2855J2812J1916J0967J0449J0017R253Q353P702P074N787L562Q36
50285H34202j750l907n716p373r016j0567j1734j2341j2634j3022j3439j3332
50273G19371j2472j1447j0950j0804j0218r018q014p906q268q072p007n791n245
50260F04159n448n907o178o123n685m765l450k217j719k151k854k860j991j123
50246E51688j169j942k406j930r21k38l08q85j371j294p05j58r4l04l40l07p32
$$ plain form
50339 769836 755381 742425 730466 719534 709828 701216 693410 686353 680118 674546 669351 664447 659865
50326 659865 655397 650692 645718 640846 636410 632409 628667 625090 621760 618958 617092 616375 616558 617200 618223
50311 618223 620016 622994 627297 632931 639923 648216 657577 667691 678235 688885 699548 710614 722619
50298 722619 735474 748286 760202 771169 781618 791635 800888 809241 816943 824017 829804 833366 834202
50285 834202 832452 828545 822829 815456 806440 795873 784139 771798 759164 746142 732703 719371
50273 719371 706899 695452 684502 673698 663480 654462 646448 638542 630274 622202 615195 609404 604159
50260 604159 598711 592804 586626 580503 574818 570053 566603 564386 562667 560516 557662 554802 552811 551688
50246 551688 550519 548577 546171 544241 543320 543082 542774 541889 540518 539224 538519 538361 538267 537963 537623 537316 536584
50229E36584j523j775r81J49O50N81O57R13O21l90j223j100l99k7k53o12p76q60
50211E30236r85j047j018j075j258j277q32OQ49J326J280Q39L82L04P05J319J792
50194E31546J900J632J240J249K065L453M636N147N327N726O291O560O474O460
50180E89706O757P072P097O932O823O834P010P501Q256Q770Q570P873P488P972
50166F94661R012R711R544R000R162J0534J2455J3931J4815J5689J6742J7478
50154H42734J7746J8338K0169K3243K6839L0332L3389L5877L8162M1177M5617
50143A173623N1106N6723O2103O7524P3048P8183Q2309Q4910Q5456Q3710Q0204
50132A978899P5906P1282O6188O0740N5711N1824M8966M6279M2602L6834K8369
$$ plain form
50229 536584 535061 533286 532305 532454 533104 533685 534342 535255 535876 535486 534263 533163 532764 532737 532484 531872 531096 530236
50211 530236 529251 528204 527186 526111 524853 523576 522744 522750 523599 524925 526205 527044 527426 527730 528435 529754 531546
50194 531546 533446 535078 536318 537567 539632 543085 547721 552868 558195 563921 570212 576772 583246 589706
50180 589706 596463 603535 610632 617564 624387 631221 638231 645732 653988 662758 671328 679201 686689 694661
50166 694661 703673 713384 722928 731928 741090 751624 764079 778010 792825 808514 825256 842734
50154 842734 860480 878818 898987 922230 949069 979401 1012790 1048667 1086829 1128006 1173623
50143 1173623 1224729 1281452 1343555 1411079 1484127 1562310 1644619 1729529 1814985 1898695 1978899
50132 1978899 2054805 2126087 2192275 2253015 2308726 2360550 2409516 2455795 2498397 2535231 2563600
50121B563600J7489N101p995k1328l4353m6404n7141o6541p4283p9652q2348q2893
50109B033252q1996p9964p7088p4064p1502o9210o6433o2726n8317n3771m9539
50098A288642m5692m1936l7960l3874l0106k6861k3996k1412j9204j7186j4879
50087I75536j2166r604p748o530n613m945m528l991k964j677p16k36J39P36J503
50072I17196K200K603K616K508K879M048N536O532O830O953P378Q060Q765R471
50058I93575J0216J0770J0803J0364J0036J0411J1409J2345J2773J3066J3857
50047A119625J5107J6230J7060J8011J9188K0098K0592K1493K3591K6434K8874
50036A346303L0641L2686L5905M0153M4652M9071N3871N9753O6915P4927Q3389
$$ plain form
50121 2563600 2581089 2586190 2578195 2556867 2522514 2476110 2418969 2352428 2278145 2198493 2116145 2033252
50109 2033252 1951256 1871292 1794204 1720140 1648638 1579428 1512995 1450269 1391952 1338181 1288642
50098 1288642 1242950 1201014 1163054 1129180 1099074 1072213 1048217 1026805 1007601 990415 975536
50087 975536 963370 953766 946018 939488 933875 928930 924402 920411 917447 915770 915054 914818 914957 915693 917196
50072 917196 919396 921999 924615 927123 930002 934050 939586 946118 952948 959901 967279 975339 984104 993575
50058 993575 1003791 1014561 1025364 1035728 1045764 1056175 1067584 1079929 1092702 1105768 1119625
50047 1119625 1134732 1150962 1168022 1186033 1205221 1225319 1245911 1267404 1290995 1317429 1346303
50036 1346303 1376944 1409630 1445535 1485688 1530340 1579411 1633282 1693035 1759950 1834877 1918266
50025A918266R2560J02932J14080J24468J32743J38792J43077J45373J44940J41820
50015C199051J37316J32879J28984J25177J20893J15942J10336J03748R5242Q3770
50005D353338O9012N1470L1716R979j3218l6529n8493p8457r6300j11553j23544
49994C997421j32288j38575j43157j46355j48386j49471j49487j48025j44914
49985B696763j40351j34596j27962j20981j14006j06717r8676r0334q2748p6212
49975A604180o9965o3554n7647n3042m9419m5718m1415l6945l3101l0377k8711
49964A094286k7506k6074k4276k2577k1308k0213j8909j7472j6300j5577j5213
49953H68861j5011j4627j3682j2155j0498r069p741o326n156m748n017n227m771
$$ plain form
50025 1918266 2010826 2113758 2227838 2352306 2485049 2623841 2766918 2912291 3057231 3199051
50015 3199051 3336367 3469246 3598230 3723407 3844300 3960242 4070578 4174326 4269568 4353338
50005 4353338 4422350 4473820 4505536 4515515 4502297 4465768 4407275 4328818 4232518 4120965 3997421
49994 3997421 3865133 3726558 3583401 3437046 3288660 3139189 2989702 2841677 2696763
49985 2696763 2556412 2421816 2293854 2172873 2058867 1952150 1853474 1763140 1680392 1604180
49975 1604180 1534215 1470661 1413014 1359972 1310553 1264835 1223420 1186475 1153374 1122997 1094286
49964 1094286 1066780 1040706 1016430 993853 972545 952332 933423 915951 899651 884074 868861
49953 868861 853850 839223 825541 813386 802888 793819 786078 779752 774596 769848 764831 759604 754833
49940G54833l707k550j678j043l40N80J456J931K076K373L087L918M492M927N651
49925G76006O762P877Q599Q905R058R370J0062J1235J2863J4861J7190J9856K2760
49912I35404K5614K8192L0742L4014L8543M3960M9387N4596O0262O6817P3586
49901A441117P9599Q4730Q9296R2832R4218R3065R0107Q6119Q1289P5905P0745
49890B379022O6301O2282N8274N4209M9680M3506L4692K3358J0115m848k1256
49879B755335l7885n3183o6658p8624q8751r5829r9179r9461r7772r4741r0768
49868A852484q6537q2666p9175p5748p2220o8519o4455n9950n5273n0699m6091
49857A111151m1152l6056l1432k7714k4759k2113j9517j7003j4705j2757j1226
$$ plain form
49940 754833 751126 748576 746898 745855 745515 746095 747551 749482 751558 753931 757018 760936 765428 770355 776006
49925 776006 782768 790645 799244 808149 817207 826577 836639 847874 860737 875598 892788 912644 935404
49912 935404 961018 989210 1019952 1053966 1092509 1136469 1185856 1240452 1300714 1367531 1441117
49901 1441117 1520716 1605446 1694742 1787574 1881792 1974857 2064964 2151083 2232372 2308277 2379022
49890 2379022 2445323 2507605 2565879 2620088 2669768 2713274 2747966 2771324 2781439 2776591 2755335
49879 2755335 2717450 2664267 2597609 2518985 2430234 2334405 2235226 2135765 2037993 1943252 1852484
49868 1852484 1765947 1683281 1604106 1528358 1456138 1387619 1323164 1263214 1207941 1157242 1111151
49857 1111151 1069999 1033943 1002511 974797 950038 927925 908408 891405 876700 863943 852717
49846H52717j0016q843p537o355n805n977o270o048n442n160n489n867n628m809
49832G63471m018l672l636l551l277l007l012l254l284k691j643q10o94j226k008
49817G23688k669k906k557j860j310j158j145q97l01N73J514K058J790J033O60
49802G16513R34J050L88l55k5J354K581K784K160J362Q54R32J605K299K296J647
49786G38379J113J088J117O90p7p78j198j166m62O63J367J042K8q34j186j282
49770G38504j374j390j178p88m72m57p06r33r83j093j510j921j765j105o63q41
49754G21325j214j295j201j230j279j155j081j368j891k410l022l746l979l190
49740F93264k000j718k661l698l714k951k506k934l807m368m218l440k414j567
$$ plain form
49846 852717 842701 833858 826321 819966 814161 808184 801914 795866 790424 785264 779775 773908 768280 763471
49832 763471 759453 755781 752145 748594 745317 742310 739298 736044 732760 730069 728426 727616 726922 725696 723688
49817 723688 721019 718113 715556 713696 712386 711228 710083 709186 708885 709458 710972 713030 714820 715853 716513
49802 716513 717447 718497 718885 718530 718505 719859 722440 725224 727384 728746 729600 730532 732137 734436 736732 738379
49786 738379 739492 740580 741697 742387 742310 741532 740334 739168 738706 739369 740736 741778 741806 740972 739786 738504
49770 738504 737130 735740 734562 733774 733302 732845 732139 731206 730223 729130 727620 725699 723934 722829 722166 721325
49754 721325 720111 718816 717615 716385 715106 713951 712870 711502 709611 707201 704179 700433 696454 693264
49740 693264 691264 689546 686885 683187 679473 676522 674016 671082 667275 662907 658689 655249 652835 651268
49726F51268j178j327j906k620l057l021k695k392k162j935j802j829j710j116
49712F22518l14M6j31k59K8L93M73M40M84L53q2l30J5N04M97L31Q99K138K939
49693F30942K682K013J672J434Q11K19N54J819K922K973K238J640J677K080K299
49678F57975K155J908J857J962K041K147K551L270L945M251M173L789L171K630
49664F97825K678L368M015M009L623L513L769L968M040M328M854N201N288N575
49650G56054O288O987P259P296P416P482P287P176P622Q415Q780Q407P843P769
49636H62081Q158Q370P961P227O918P369Q043Q148P597P079P078P328P393P355
49622I68105P509P740P710P441P270P321P432P516P548P361O904O620P067Q097
$$ plain form
49726 651268 650090 648763 646857 644237 641180 638159 635464 633072 630910 628975 627173 625344 623634 622518
49712 622518 622204 622250 622119 621860 621888 622281 622754 623194 623678 624031 623949 623619 623634 624138 624635 624966 625865 628003 630942
49693 630942 633624 635637 637309 638743 639554 639773 640327 642146 645068 648041 650279 651919 653596 655676 657975
49678 657975 660130 662038 663895 665857 667898 670045 672596 675866 679811 684062 688235 692024 695195 697825
49664 697825 700503 703871 707886 711895 715518 719031 722800 726768 730808 735136 739990 745191 750479 756054
49650 756054 762342 769329 776588 783884 791300 798782 806069 813245 820867 829282 838062 846469 854312 862081
49636 862081 870239 878609 886570 893797 900715 908084 916127 924275 931872 938951 946029 953357 960750 968105
49622 968105 975614 983354 991064 998505 1005775 1013096 1020528 1028044 1035592 1042953 1049857 1056477 1063544 1071641
49608A071641Q938R136Q942Q749Q683Q926R771J1059J2075J2416J2520J2922J3445
49595A209223J3692J3977J4948J6460J7612J8013J8326J9221K0412K1188K1477
49584A404549K1855K2690K3804K4914K5899K6625K6936K6995K7207K7636K7853
49573A686963K7635K7489K8047K9131K9932L0064K9979L0251L0871L1427L1633
49562B013422L1424L0858L0166K9691K9573K9629K9710K9876K9980K9444K7883
49551B341656K5749K3848K2331K0686J8742J7040J5986J5166J3850J1910R849
49540B536813Q066O455M758K981J450M64k0m15j130k099k759k566j539k92M53
49525B550620M63K66P57K317M291N555N694N415N641O506P411P984Q497R313J0288
$$ plain form
49608 1071641 1080579 1089715 1098657 1107406 1116089 1125015 1134786 1145845 1157920 1170336 1182856 1195778 1209223
49595 1209223 1222915 1236892 1251840 1268300 1285912 1303925 1322251 1341472 1361884 1383072 1404549
49584 1404549 1426404 1449094 1472898 1497812 1523711 1550336 1577272 1604267 1631474 1659110 1686963
49573 1686963 1714598 1742087 1770134 1799265 1829197 1859261 1889240 1919491 1950362 1981789 2013422
49562 2013422 2044846 2075704 2105870 2135561 2165134 2194763 2224473 2254349 2284329 2313773 2341656
49551 2341656 2367405 2391253 2413584 2434270 2453012 2470052 2486038 2501204 2515054 2526964 2536813
49540 2536813 2544879 2551334 2556092 2559073 2560523 2560987 2560967 2560552 2559422 2557323 2554564 2551998 2550459 2550167 2550620
49525 2550620 2551083 2551349 2552106 2554423 2558714 2564269 2569963 2575378 2581019 2587525 2594936 2602920 2611417 2620730 2631018
49510B631018J0963J1187J1212J1160J0741R680Q158O532M822K834Q19o48j508
49497B716970k497m223o443q657j0914j3480j6024j7970j9454k1130k3041k4591
$$ plain form
49510 2631018 2641981 2653168 2664380 2675540 2686281 2695961 2704119 2710651 2715473 2718307 2719126 2718478 2716970
49497 2716970 2714473 2710250 2703807 2695150 2684236 2670756 2654732 2636762 2617308 2596178 2573137 2548546
$$ [...]
##END NTUPLES=NMR SPECTRUM
##END=
