
##TITLE=AC1258_UGARS11075_6534326_NpLlJCYggR
##JCAMPDX= 6.0         $$ Bruker NMR JCAMP-DX V2.0
##DATA TYPE= NMR SPECTRUM
##DATA CLASS= NTUPLES
##ORIGIN= BRUKER
##OWNER= Administrator
$$ 1.72 TOPSPIN		Version 2.1
$$ 2012-07-17 03:05:19.703 -0500  Administrator@TOPSPIN
$$ Compression mode = diff/dup
##.OBSERVE FREQUENCY= 400.02188249412
##.OBSERVE NUCLEUS= ^1H
##.ACQUISITION MODE= SIMULTANEOUS (DQD)
##.ACQUISITION SCHEME= undefined
##.AVERAGES= 64
##.DIGITISER RES= 22
##SPECTROMETER/DATA SYSTEM= spect
##.PULSE SEQUENCE= noesygpps1d.comp
##.SOLVENT NAME= COFFEE_meoh
##.SHIFT REFERENCE= INTERNAL, COFFEE_meoh, 1, 14.96112
##AUDIT TRAIL= $$ (NUMBER, WHEN, WHO, WHERE, PROCESS, VERSION, WHAT)
$$ ##TITLE= Audit trail, TOPSPIN		Version 2.1
$$ ##JCAMPDX= 5.01
$$ ##ORIGIN= Bruker BioSpin GmbH
$$ ##OWNER= Administrator
$$ $$ C:\Bruker\TOPSPIN/data/COFFEE/nmr/AC1258_UGARS11075_6534326_NpLlJCYggR/12/pdata/1/auditp.txt
$$ ##AUDIT TRAIL=  $$ (NUMBER, WHEN, WHO, WHERE, PROCESS, VERSION, WHAT)
(   1,<2012-07-17 03:05:14.703 -0500>,<Administrator>,<TOPSPIN>,<go>,<TOPSPIN 2.1>,
      <created by zg
	started at 2012-07-17 02:53:44.296 -0500,
	POWCHK enabled, PULCHK disabled,
       configuration hash MD5:
       6B 1B 68 BB D9 2E 58 E2 7F 35 AD 54 07 DF 0E 41
       data hash MD5: 64K
       9B 2E 19 70 C1 E8 F2 E0 70 63 2F 0E D2 BC DA 05>)
(   2,<2012-07-17 03:05:17.484 -0500>,<Administrator>,<TOPSPIN>,<proc1d>,<TOPSPIN 2.1>,
      <Start of raw data processing
       efp LB = 0.3 FT_mod = 6 PKNL = 1 PHC0 = 0 PHC1 = 0 SI = 128K 
       data hash MD5: 128K
       BF AD FF 86 11 BA 26 44 DD 94 07 BA 43 80 A8 D9>)
(   3,<2012-07-17 03:05:18.937 -0500>,<Administrator>,<TOPSPIN>,<proc1d>,<TOPSPIN 2.1>,
      <pk PHC0 = 2.653198 PHC1 = 0 
       data hash MD5: 128K
       AF EE 36 2A 91 A7 FF 4D 36 BE 3A EF FC 63 97 26>)
(   4,<2012-07-17 03:05:19.203 -0500>,<Administrator>,<TOPSPIN>,<proc1d>,<TOPSPIN 2.1>,
      <abs ABSG = 1 
       data hash MD5: 128K
       6A E5 3F 6B 0C A0 40 86 57 EA D6 20 52 9B E7 F7>)
(   5,<2012-07-17 03:05:19.281 -0500>,<Administrator>,<TOPSPIN>,<proc1d>,<TOPSPIN 2.1>,
      <abs ABSG = 2 
       data hash MD5: 128K
       52 6B 75 5C 76 1C 3D D8 AD BF 87 EF A7 FB D3 45>)
(   6,<2012-07-17 03:05:19.390 -0500>,<Administrator>,<TOPSPIN>,<proc1d>,<TOPSPIN 2.1>,
      <abs ABSG = 3 
       data hash MD5: 128K
       6D CF DA 04 EE 1D 62 F4 56 36 6C 4D 4E 77 FD C8>)
(   7,<2012-07-17 03:05:19.562 -0500>,<Administrator>,<TOPSPIN>,<proc1d>,<TOPSPIN 2.1>,
      <abs ABSG = 4 
       data hash MD5: 128K
       1A EE 82 2C 48 FC 38 73 9F 79 95 A0 CB C7 AC FE>)
(   8,<2012-07-17 03:05:19.625 -0500>,<Administrator>,<TOPSPIN>,<proc1d>,<TOPSPIN 2.1>,
      <abs ABSG = 5 
       data hash MD5: 128K
       9C FD E9 1D 1A 14 61 2B 94 A8 99 46 03 40 6A FD>)
$$ ##END=
$$ 
$$ $$ hash MD5
$$ $$ 7D B2 83 2B C3 98 E2 39 CA 3D 30 9D 61 71 5F FD
##$RELAX= 
##$RELAX= 
##$RELAX= 
##$RELAX= 
##$RELAX= 
##$RELAX= 
##$RELAX= 
##$RELAX= 
$$ Bruker specific parameters
$$ [...]
##$TP07= 0
##$TPNAME0= <>
##$TPNAME1= <>
##$TPNAME2= <>
##$TPNAME3= <>
##$TPNAME4= <>
##$TPNAME5= <>
##$TPNAME6= <>
##$TPNAME7= <>
##$TPOAL= (0..7)
0.5 0.5 0.5 0.5 0.5 0.5 0.5 0.5
##$TPOFFS= (0..7)
0 0 0 0 0 0 0 0
##$TUNHIN= 0
##$TUNHOUT= 0
##$TUNXOUT= 0
##$USERA1= <user>
##$USERA2= <user>
##$USERA3= <user>
##$USERA4= <user>
##$USERA5= <user>
##$V9= 5
##$VALIST= <valist>
##$VCLIST= <CCCCCCCCCCCCCCC>
##$VD= 0
##$VDLIST= <DDDDDDDDDDDDDDD>
##$VPLIST= <PPPPPPPPPPPPPPP>
##$VTLIST= <TTTTTTTTTTTTTTT>
##$WBST= 2048
##$WBSW= 25
##$XGAIN= (0..3)
0 0 0 0
##$XL= 0
##$YL= 0
##$YMAX_a= 11014242
##$YMIN_a= -7633738
##$ZGOPTNS= <>
##$ZL1= 120
##$ZL2= 120
##$ZL3= 120
##$ZL4= 120
##$ABSF1= 14.96112
##$ABSF2= -5.597062
##$ABSG= 5
##$ABSL= 3
##$ALPHA= 0
##$AQORDER= 0
##$ASSFAC= 0
##$ASSFACI= 0
##$ASSFACX= 0
##$ASSWID= 0
##$AUNMP= <proc_prof1d_extract.lims>
##$AXLEFT= 0
##$AXNAME= <>
##$AXNUC= <1H>
##$AXRIGHT= 0
##$AXTYPE= 0
##$AXUNIT= <>
##$AZFE= 0.1
##$AZFW= 0.1
##$BCFW= 0
##$BC_mod= 0
##$BYTORDP= 0
##$COROFFS= 0
##$CY= 15
##$DATMOD= 1
##$DC= 0
##$DFILT= <>
##$DTYPP= 0
##$F1P= 0
##$F2P= 0
##$FCOR= 0.5
##$FTSIZE= 131072
##$FT_mod= 6
##$GAMMA= 0
##$GB= 0
##$INTBC= 1
##$INTSCL= 1
##$ISEN= 128
##$LB= 0.3
##$LEV0= 0
##$LPBIN= 0
##$MAXI= 10000
##$MC2= 0
##$MEAN= 0
##$ME_mod= 0
##$MI= 0
##$NCOEF= 0
##$NC_proc= -2
##$NLEV= 6
##$NOISF1= 0
##$NOISF2= 0
##$NSP= 0
##$NTH_PI= 0
##$NZP= 0
##$OFFSET= 14.96112
##$PC= 1
##$PHC0= 2.653198
##$PHC1= 0
##$PH_mod= 1
##$PKNL= yes
##$PPARMOD= 0
##$PPDIAG= 0
##$PPIPTYP= 0
##$PPMPNUM= 2147483647
##$PPRESOL= 1
##$PSCAL= 4
##$PSIGN= 0
##$PYNMP= <proc.py>
##$REVERSE= no
##$SF= 400.020009589188
##$SI= 131072
##$SIGF1= 0
##$SIGF2= 0
##$SINO= 400
##$SIOLD= 131072
##$SPECTYP= <>
##$SREGLST= <1H.CDCl3>
##$SSB= 0
##$STSI= 131072
##$STSR= 0
##$SW_p= 8223.68421052631
##$SYMM= 0
##$S_DEV= 0
##$TDeff= 65536
##$TDoff= 0
##$TI= <>
##$TILT= no
##$TM1= 0
##$TM2= 0
##$TOPLEV= 0
##$USERP1= <user>
##$USERP2= <user>
##$USERP3= <user>
##$USERP4= <user>
##$USERP5= <user>
##$WDW= 1
##$XDIM= 131072
##$YMAX_p= 364437766
##$YMIN_p= -11874
##$CURPLOT= <Network HP LaserJet P1505>
##$CURPRIN= <$Network HP LaserJet P1505>
##$DFORMAT= <normdp>
##$LAYOUT= <+/1D_H.xwp>
##$LFORMAT= <normlp>
##$PFORMAT= <normpl>
##$SURQMSG= 1
$$ End of Bruker specific parameters
$$ ---------------------------------
##NTUPLES= NMR SPECTRUM
##VAR_NAME=  FREQUENCY,     SPECTRUM/REAL,   SPECTRUM/IMAG
##SYMBOL=    X,             R,               I
##VAR_TYPE=  INDEPENDENT,   DEPENDENT,       DEPENDENT
##VAR_FORM=  AFFN,          ASDF,            ASDF
##VAR_DIM=   131072,        131072,          131072
##UNITS=     HZ,            ARBITRARY UNITS, ARBITRARY UNITS
##FACTOR=    0.0627417313425164, 1,          1
##FIRST=     8223.62146879497, 2997,         -49624
##LAST=      0,             4261,            -49203
##MIN=       0,             -11874,          0
##MAX=       8223.62146879497, 364437766,    0
$$ Real data points
##PAGE= N=1
##DATA TABLE= (X++(R..R)), XYDATA
$$ [...]
63881E49106j3914j3218j1808j0384r131p405n091l175k356j990r76Q83K969M781
63867D78291O241P424Q504R826J1630J3743J5772J7519J9227K1373K4159K7021
63855F60730K8972K9703L0053L0930L2072L2476L1824L0759K9837K9014K8143
63844I94513K7169K5708K3191J9680J5810J1784P204K126k607o538j0321j4698
63832A093021j9380k3588k7083k9982l2069l3074l3363l3559l3665l3176l1978
63821G62104l0479k8974k7463k6192k5637k5762k5794k5054k3706k2300k0965
63810D79778j9432j7701j6142j4837j3352j1525j0064r765j0302j0470r637q270
63798C28281o917n570m425m305n427o476o012m396l216l051l024k575k318k852
$$ plain form
63881 549106 535192 521974 510166 499782 490651 483246 478155 474980 472624 470634 469658 470541 473510 478291
63867 478291 484532 491956 500460 510286 521916 535659 551431 568950 588177 609550 633709 660730
63855 660730 689702 719405 749458 780388 812460 844936 876760 907519 937356 966370 994513
63844 994513 1021682 1047390 1070581 1090261 1106071 1117855 1125059 1127185 1124578 1118040 1107719 1093021
63832 1093021 1073641 1050053 1022970 992988 960919 927845 894482 860923 827258 794082 762104
63821 762104 731625 702651 675188 648996 623359 597597 571803 546749 523043 500743 479778
63810 479778 460346 442645 426503 411666 398314 386789 376725 366960 356658 346188 336551 328281
63798 328281 321364 315794 311369 307064 301637 295161 289149 284753 281537 278486 275462 272887 270569 267717
63784B67717l801m480m587l879k149p5R06J36j461k649l099k916j978n71J89l42
63768B36961j256j267m92lj09j87rj7k58j14O50J453J703J421Q02j06j023j341
63750B36808q68k56k65q63j292r88j14P89J464K054K497K230R38n43p63O42K428
63733B43898L244L083K809K860L036L164L175K872K248J833K113K847L579M396
63719B85157N424N990N312L854K910K805K595J663O12J56J33J06P8M4m82j746
63703C14611l069l542l081k291j597j077p97p80p35l21M06J169J934K745L241
63688C06816K841J608N33O58J933L125L003J656M43M93J481K158J919J328J076
63673C31071J155J262J491K072K827L374L643L734L431K473J241N51O91R83N98
$$ plain form
63784 267717 263916 259436 254849 250970 248821 248746 249652 249788 248327 245678 242579 239663 237685 237114 237303 236961
63768 236961 235705 234438 233946 233943 233834 233647 233638 233621 233363 233249 233899 235352 237055 238476 239278 239172 238149 236808
63750 236808 235940 235684 235419 234556 233264 232276 232162 232951 234415 236469 238966 241196 242134 241591 240828 241470 243898
63733 243898 247142 250225 253034 255894 258930 262094 265269 268141 270389 272222 274335 277182 280761 285157
63719 285157 290581 296571 301883 305737 308647 311452 314047 315710 316322 316478 316611 316717 316795 316839 316357 314611
63703 314611 311542 308000 304919 302628 301031 299954 299157 298377 297642 297321 297727 298896 300830 303575 306816
63688 306816 309657 311265 311798 312456 314389 317514 320517 322173 322616 323109 324590 326748 328667 329995 331071
63673 331071 332226 333488 334979 337051 339878 343252 346895 350629 354060 356533 357774 358325 359016 359999 360597
63658C60597n78k051l367m319m758m637m258m131m439m826m910m716m457m062
63644C05088l243j981n59Q70K372L748M467M295L724L402L358L232L046L221L890
63629C38930M689N296N793O346O894P359P852Q469R099R673J0387J1487J2912
63616D45186J4284J5255J5844J6490J7767J9833K2201K4181K5521K6409K6970
63605F69941K7193K7295K7632K8000K7450K5177K1281J6359J0745M645j250n951
63593H78517r046j0937j2157j2958j3609j4548j5837j6930j7424j7702j8331j9090
63581F99948j9221j8586j7762j6933j5517j3297j1183j0107r620q505o466m357
63569E48394k732j155Q57L008M807O242P408Q011P876P517P639Q334R251J0197
$$ plain form
63658 360597 360019 357968 354601 350282 345524 340887 336629 332498 328059 323233 318323 313607 309150 305088
63644 305088 301845 299864 299305 300175 302547 306295 310762 315057 318781 322183 325541 328773 331819 335040 338930
63629 338930 343619 348915 354708 361054 367948 375307 383159 391628 400727 410400 420787 432274 445186
63616 445186 459470 474725 490569 507059 524826 544659 566860 591041 616562 642971 669941
63605 669941 697134 724429 752061 780061 807511 832688 853969 870328 881073 885718 884468 878517
63593 878517 869471 858534 846377 833419 819810 805262 789425 772495 755071 737369 719038 699948
63581 699948 680727 662141 644379 627446 611929 598632 587449 577342 567722 559217 552751 548394
63569 548394 545662 544507 545364 548372 553179 559421 566829 574840 582716 590233 597872 606206 615457 625654
63555F25654J1132J1950J2804J4349J6955J9890K1948K2807K3220K3969K5266
63544H29944K7161K9780L2909L5697L6899L5192K9604K0370R340j023r254j5096
63532A061523j8464j9123j7601j5471j4174j4047j4790j6299j8508k0940k3063
63521H69043k4870k6632k8244k9258k9367k8600k7092k5047k2811k0750j9060
63510E87312j7703j6435j4835j2659j0346q741q161p954p323o270n400n005m813
63497D61667m540m290m260m326m141l640l259l456l967l902k813j372n64m09j09
63482D16619O39J181J028O74R48J964L174M017M174L595K657J985J706J234J51
63467D45746j089j808k098k586l473m365m911n080m848m197l380k787k462k106
$$ plain form
63555 625654 636786 648736 661540 675889 692844 712734 734682 757489 780709 804678 829944
63544 829944 857105 886885 919794 955491 992390 1027582 1057186 1077556 1086896 1085873 1076619 1061523
63532 1061523 1043059 1023936 1006335 990864 976690 962643 947853 931554 913046 892106 869043
63521 869043 844173 817541 789297 760039 730672 702072 674980 649933 627122 606372 587312
63510 587312 569609 553174 538339 525680 515334 506593 498432 490478 483155 476885 471485 466480 461667
63497 461667 457127 452837 448577 444251 440110 436470 433211 429755 425788 421886 419073 417701 417137 416728 416619
63482 416619 417258 418439 419467 420141 421089 423053 426227 430244 434418 438013 440670 442655 444361 445595 445746
63467 445746 444657 442849 440751 438165 434692 430327 425416 420336 415488 411291 407911 405124 402662 400556
63453D00556j581j079p68n19j7R90K401L633M158M343N351P705J0371J1907J2250
63438D59701J2566J3564J4785J5701J6583J7961J9912K2358K5462K9026L1796
63427F79415L2067K9166K4110J8756J4478J1536R528Q301Q315J0031J3134J6649
63415H75486J9884K2860K5698K7970K8959K8308K6088K2372J7171J0858M278j745
63403A108187o887j1195j4617j6954j8231j8901j9520k0363k1496k3024k4941
63392I12058k6836k8147k8751k8977k8890k8024k6061k3425k0825j8486j6235
63381F37401j4067j2151j0347q311o056l947k100j95J925L884N225N991O698P857
63367F11807R662J1940J4332J6554J8488J9949K0662K0740K1026K2396K4701K6933
$$ plain form
63453 400556 398975 397896 397128 396609 396592 397582 399983 403616 407774 412117 417468 425173 435544 447451 459701
63438 459701 472267 485831 500616 516317 532900 550861 570773 593131 618593 647619 679415
63427 679415 711482 740648 764758 783514 797992 809528 819056 827357 835672 845703 858837 875486
63415 875486 895370 918230 943928 971898 1000857 1029165 1055253 1077625 1094796 1105654 1109932 1108187
63403 1108187 1101300 1090105 1075488 1058534 1040303 1021402 1001882 981519 960023 936999 912058
63392 912058 885222 857075 828324 799347 770457 742433 716372 692947 672122 653636 637401
63381 637401 623334 611183 600836 592525 586469 582522 580422 580227 582152 586036 591261 597252 603950 611807
63367 611807 621469 633409 647741 664295 682783 702732 723394 744134 765160 787556 812257 839190
63355H39190K8457K9626L0983L2361L3089L2637L0734K7224K2231J6304J0006
63344A132842L566k782q345j2369j4851j6530j8049j9401k0234k0473k0486k0877
63332I62011k2105k4159k6497k8340k9114k8655k7249k5465k3773k2103j9977
63321F84574j7257j4504j2290j0308p705m300j172J41j179m785r483j3781j6526
63308E71425j7411j6925j5794j4537j3485j2806j2239j1174r355p392o167n838
63296D28302n796n630n609o019o472o298n442m574m292m511m713m501l847k974
63282C57624k235j973k269k823l150k974k451j990j853j909j868j715j783k219
63268C26412k595k331j475o85l80l19j67n1j55j67K78Q35P71J03k42L53J332J702
$$ plain form
63355 839190 867647 897273 928256 960617 993706 1026343 1057077 1084301 1106532 1122836 1132842
63344 1132842 1136408 1133626 1125281 1112912 1098061 1081531 1063482 1044081 1023847 1003374 982888 962011
63332 962011 939906 915747 889250 860910 831796 803141 775892 750427 726654 704551 684574
63321 684574 667317 652813 640523 630215 622510 618210 617038 617179 616000 611215 601732 587951 571425
63308 571425 554014 537089 521295 506758 493273 480467 468228 457054 447699 440307 434140 428302
63296 428302 422506 416876 411267 405248 398776 392478 387036 382462 378170 373659 368946 364445 360598 357624
63282 357624 355389 353416 351147 348324 345174 342200 339749 337759 335906 333997 332129 330414 328631 326412
63268 326412 323817 321486 320011 319326 318946 318627 318460 318409 318254 318087 318365 319200 319971 320074 319832 320185 321517 323219
63250C23219J214M10j72l62j14M75R75Q86L03o9K77J079J746K062K221K345K269
63233C38764J846J323J234J898K969L645L402K502J644J262J385J984L047M201
63219C71106M809M633M118L747L523L363L532M185M807M726M097L711L845L960
63205D28162L667L257L042K765K113J313P53L68j65q25j312j426r80L34K436M421
63189D47923N251M933M518M923O222Q008R948J1757J3145J4048J4663J5058J5017
63176E75414J4417J3537J2784J2330J2038J1665J1026J0156R307Q594P725O349
63164G05342M584K889J393j97k043m012o152q762j1776j4467j6146j6841j7065
63151F16747j7202j7427j7788j8015j7527j6093j4357j3192j2667j2029j0701
$$ plain form
63250 323219 324433 324843 324671 324309 324195 324670 325645 326531 326834 326765 327042 328121 329867 331929 334150 336495 338764
63233 338764 340610 341933 343167 345065 348034 351679 355081 357583 359227 360489 361874 363858 366905 371106
63219 371106 375915 380548 384666 388413 391936 395299 398831 403016 407823 412549 416646 420357 424202 428162
63205 428162 431829 435086 438128 440893 443006 444319 445072 445440 445275 444450 443138 441712 440732 441066 443502 447923
63189 447923 453174 458107 462625 467548 473770 481778 491726 503483 516628 530676 545339 560397 575414
63176 575414 589831 603368 616152 628482 640520 652185 663211 673367 682674 691268 698993 705342
63164 705342 709926 712815 714208 714011 711968 707956 701804 693042 681266 666799 650653 633812 616747
63151 616747 599545 582118 564330 546315 528788 512695 498338 485146 472479 460450 449749
63140D49749q915p236n817m365k735j284m83k65m4N58J245J589J747K243L172
63125D29159M152M989N768O222N814M744M096M524N371N704N653N980O695P001
63111E05872O520N757N242M886M352L627K930K392K021J840J952K436L158L704
63097E56689L723L454L491L906M066L706L523M153M972M855L830L037L041L077
63083F09523K241O58r48k186l101l795m352m890n388n672n748n804n829n558n026
63068E54125m669m604m253l086j515m90l49m59l4J034K285L369M331N231N831
63053E56747N940N987O782Q499J0280J1141J1030J0587J0283J0265J0818J2158
63041F70517J3787J4727J4535J3626J2496J1300J0258R767R744R405Q229O711
$$ plain form
63140 449749 440834 433598 427781 423416 420681 419397 418914 418649 418605 419163 420408 421997 423744 425987 429159
63125 429159 433311 438300 444068 450290 456104 460848 464944 469468 474839 480543 486196 492176 498871 505872
63111 505872 512392 518149 523391 528277 532629 536256 539186 541578 543599 545439 547391 549827 552985 556689
63097 556689 560412 563866 567357 571263 575329 579035 582558 586711 591683 596538 600368 603405 606446 609523
63083 609523 611764 612422 611474 609288 606187 602392 598040 593150 587762 582090 576342 570538 564709 559151 554125
63068 554125 549456 544852 540599 537513 535998 535508 535159 534700 534666 535700 537985 541354 545685 550916 556747
63053 556747 562687 568674 575456 583955 594235 605376 616406 626993 637276 647541 658359 670517
63041 670517 684304 699031 713566 727192 739688 750988 761246 771013 780757 790162 798391 805102
63029H05102N764N559N430M688L257J560M8j248k766m817o988q406q691q318p937
63014G82237p734p588p407p036o183m745k930r21J310L690N950Q029J0219J2682
63000G79573J5137J7278J9084K0528K1420K1820K2142K2527K2599K2106K1358
62989A005572K0568J9485J8065J6946J6490J5902J4236J1883J0049Q891P210M112
62977A169409M9m124q298j2799j7493k1768k5202k7853k9929l1406l2013l1576
62965I26997l0386k9044k7840k6532k5034k3856k3291k2551k0593j7790j5787
62954F64293j5430j5696j5251j4288j3945j4447j4797j4271j3300j2574j1992
62943E08302j1034r800r028r092r424r167q130o845n830n168m759m628m725m734
$$ plain form
63029 805102 810866 816425 821855 826543 829800 831360 831408 830160 827394 822577 815589 807183 798492 790174 782237
63014 782237 774503 766915 759508 752472 746289 741544 738614 737693 739003 742693 748643 756672 766891 779573
63000 779573 794710 811988 831072 851600 873020 894840 916982 939509 962108 984214 1005572
62989 1005572 1026140 1045625 1063690 1080636 1097126 1113028 1127264 1139147 1149196 1158087 1165297 1169409
62977 1169409 1169458 1165334 1157036 1144237 1126744 1104976 1079774 1051921 1021992 990586 958573 926997
62965 926997 896611 867567 839727 813195 788161 764305 741014 718463 697870 680080 664293
62954 664293 648863 633167 617916 603628 589683 575236 560439 546168 532868 520294 508302
62943 508302 497268 487468 478440 469348 459924 450757 442627 435782 429952 424784 420025 415397 410672 405938
62929D05938m395l874l499l230k810k346k271k573k536j594j76O79M74l27r69
62914C76491j176j161j182j250j169p31M7P55R14N64M06R91J873K018J145K29
62898C78764K94J127J720J774K061L145M446M999M684M205M081M167M155M044
62884D23666L903L541K716J586P35N88Q54P82N4q14j214j421k283l949n447n775
62868D17522n029m074l542l520l898m462m761m482l946l770l992l928l073j814
62854C63231j041j216j982k574k472j702n95N41J417J582O94p99j677j148J65
62839C52424Q57L82l95l42O28J582J723J214Q79J153J557J327M42k94l17O0K33
62822C63113J58J96M36O44P03O08J96n83j240j117k50O30J007J068J195J449J597
$$ plain form
62929 405938 401543 397669 394170 390940 388130 385784 383513 380940 378404 376810 376634 377313 377787 377460 376491
62914 376491 375315 374154 372972 371722 370553 369822 369869 370624 371538 372102 372508 373499 375372 377390 378535 378764
62898 378764 379058 380185 381905 383679 385740 388885 393331 398330 403014 407219 411300 415467 419622 423666
62884 423666 427569 431110 433826 435412 436147 436735 437589 438371 438425 437611 436397 434976 432693 428744 423297 417522
62868 417522 412493 408419 404877 401357 397459 392997 388236 383754 379808 376038 372046 368118 365045 363231
62854 363231 362190 360974 358992 356418 353946 352244 351649 352190 353607 355189 355883 355084 353407 352259 352424
62839 352424 353281 353663 353268 352926 353554 355136 356859 358073 358952 360105 361662 362989 363431 363137 362820 362880 363113
62822 363113 363271 363467 363903 364547 365250 365858 366054 365471 364231 363114 362864 363494 364501 365569 366764 368213 369810
62805C69810J395O93l24r91o67N34J767K299K035J355Q23R67J795K561K506J829
62789C88387J397J547J848K118K743L842M904N679O560P618Q098P692P461Q573
62775D58467J0577J1923J1917J1189J0482R972R793J0144J0623J0281Q756O684
62763E80808M736K834O76j537l352m652n631o516p602r160j0931j2046j1984j1327
62749E04316j1147j1736j2396j2396j1708j0765r919r229q577p763o709n675n117
62736C81179n229n600n483m483l006j962j888k337k328j409j03Q11J185J420J760
62721C52527K096K416K976L892M836N380N455N361N491O145P368Q819J0010J0840
62707D33612J1689J2858J4158J5331J6586J8296K0331K2165K3658K5255K7282
$$ plain form
62805 369810 371205 371898 371574 370583 369916 370450 372217 374516 376551 377906 378729 379696 381491 384052 386558 388387
62789 388387 389784 391331 393179 395297 398040 401882 406786 412465 419025 426643 434741 442433 449894 458467
62775 458467 469044 480967 492884 504073 514555 524527 534320 544464 555087 565368 574124 580808
62763 580808 585544 588378 589054 587517 584165 579513 573882 567366 559764 550604 539673 527627 515643 504316
62749 504316 493169 481433 469037 456641 444933 434168 424249 415020 406443 398680 391971 386296 381179
62736 381179 375950 370350 364867 360384 357378 355416 353528 351191 348863 347454 347351 348162 349347 350767 352527
62721 352527 354623 357039 360015 363907 368743 374123 379578 384939 390430 396575 403943 412762 422772 433612
62707 433612 445301 458159 472317 487648 504234 522530 542861 565026 588684 613939 641221
62696F41221K9465L1374L3001L4617L6175L7223L7404L6946L6503L6445L6217
62685A026591L4624L0939K5635J9699J3456O606o98p529j3283j8455k3849k9340
62673A064396l3987l7089l8704l9331l9559l9821m0045l9601l7979l5479l2839
62662F49962l0318k7633k4745k2148k0244j8816j7337j5563j3632j1753r978q289
62650D29506o872o153o307o782o745o093n543n445n218m401l588l431l338k280
62636C57310n69M22L02J38O56J196R40J29o78j498k391k798k334j626j528j918
62620C45753k108j960j791j539r54l39k04l34q5M40M37l34j106j127m47M60J197
62603C35959J429R83K88J39P82J606K026K226K723L608M512N050N145N029N095
$$ plain form
62696 641221 670686 702060 735061 769678 805853 843076 880480 917426 953929 990374 1026591
62685 1026591 1061215 1092154 1117789 1137488 1150944 1157550 1156852 1149323 1136040 1117585 1093736 1064396
62673 1064396 1030409 993320 954616 915285 875726 835905 795860 756259 718280 682801 649962
62662 649962 619644 592011 567266 545118 524874 506058 488721 473158 459526 447773 437795 429506
62650 429506 422634 416481 410174 403392 396647 390554 385011 379566 374348 369947 366359 362928 359590 357310
62636 357310 356741 357163 357465 357603 358259 359455 360395 360524 359846 358348 355957 353159 350825 349199 347671 345753
62620 345753 343645 341685 339894 338355 337401 337062 336858 336524 336439 336879 337316 336982 335876 334749 334302 334762 335959
62603 335959 337388 338371 338659 338798 339580 341186 343212 345438 348161 351769 356281 361331 366476 371505 376600
62588C76600N503N891N779N279M931M834M434L441K355J738J354N43q35k265l261
62573D16321l783m037m211m434m753n128n516n918o221o148n546m632l807l348
62559C48839l346l741m251m384l790k600j308l98k5Q5M10J137J765J624Q01J72
62543C30990K53M92J87l18p4J036K041K201J869J791K083K332K284K034J721J520
62527C52442J745K521L465M110M616N607P232Q799R617R902J0501J1876J3666
62514D46099J5224J6307J7128J7939J8797J9706K0871K2500K4338K5549K5379
62503F69837K4001K2396K1231K0128J8282J5611J2807J0322P802M767J487j236
62491H27435k877l420k963j613J28J444K033K573L985O285Q624J0394J1880J3518
$$ plain form
62588 376600 382103 387994 393773 399052 403983 408817 413251 416692 419047 420785 422139 422682 421847 419582 416321
62573 416321 412538 408501 404290 399856 395103 389975 384459 378541 372320 366172 360626 355994 352187 348839
62559 348839 345493 341752 337501 333117 329327 326727 325419 325021 324996 325081 325491 326628 328393 330017 330818 330990
62543 330990 331243 331735 331922 331604 331530 332566 334607 336808 338677 340468 342551 344883 347167 349201 350922 352442
62527 352442 354187 356708 360173 364283 368899 374506 381738 390537 400154 410056 420557 432433 446099
62514 446099 461323 477630 494758 512697 531494 551200 572071 594571 618909 644458 669837
62503 669837 693838 716234 737465 757593 775875 791486 804293 814615 822417 827184 828671 827435
62491 827435 824558 821138 818175 816562 816690 818134 820167 822740 826725 833010 841634 852028 863908 877426
62477H77426J4866J4767J2527Q605M130L0l347o138q857j2178j6386k1030k5263
62464H39152k8558l0940l2541l3228l2831l1612l0234k9215k8360k6890k4242
62453E10501k0769j7472j4980j3002j0993q960p294o032m854l767l134k889k395
62440C93960j391n43m68o91k38Q98J679J431O33J10Kj11m59r86j667k487l163
62423C86509l313k960k529k296k075j652j219j164j506j837j849j671j543j393
62409C59502r73l55m2l98j112j392p42N28J587J802J187K72l07j01R90K600M043
62392C67089M813N020N135N308N281M992M869N205N699O011O403P233Q093Q207
62378D49358P735P786Q883J0237J0921J1135J1592J2316J2865J3408J4621J6500
$$ plain form
62477 877426 892292 907059 919586 928191 932321 932351 929004 922866 914009 901831 885445 864415 839152
62464 839152 810594 779654 747113 713885 681054 649442 619208 589993 561633 534743 510501
62453 510501 489732 472260 457280 444278 433285 424325 417031 410999 406145 402378 399244 396355 393960
62440 393960 392569 392026 391558 390867 390629 391527 393206 394637 395270 395380 395382 395271 394812 393826 392159 389672 386509
62423 386509 383196 380236 377707 375411 373336 371684 370465 369301 367795 365958 364109 362438 360895 359502
62409 359502 358529 358174 358132 357734 356622 355230 354488 355016 356603 358405 359592 359864 359557 359456 360446 363046 367089
62392 367089 371902 376922 382057 387365 392646 397638 402507 407712 413411 419422 425825 433058 441151 449358
62378 449358 457093 464879 473762 483999 494920 506055 517647 529963 542828 556236 570857 587357
62366E87357J8203J9379K0824K3340K6396K8717K9976L1263L3688L7114M0621
62355H96878M3874M7280N0822N3429N4066N2922N0829M7739M2738L5615K7467
62344A403659J9299J0944K103o289j2884j7769k2367k7455l2283l5904l8434m0416
62332A202204m1671m1558m0078l8108l6457l5161l3751l1965l0011k8216k6602
62321H18626k4954k3261k1816k0790k0016j9432j9347j9837k0141j9348j7562
62310E92122j5749j4440j3291j2009j0875j0058r165p968o898o251n518m170k651
62297D73079j754j345n73P76J949K345K201K038K052K340L119M334N376N590M856
62282E06383L557K240J466J600K427L210L416L267L338L862M672N632O774Q074
$$ plain form
62366 587357 605560 624939 645763 669103 695499 724216 754192 785455 819143 856257 896878
62355 896878 940752 988032 1038854 1092283 1146349 1199271 1250100 1297839 1340577 1376192 1403659
62344 1403659 1422958 1433902 1436005 1429716 1416832 1399063 1376696 1349241 1316958 1281054 1242620 1202204
62332 1202204 1160533 1118975 1078897 1040789 1004332 969171 935420 903455 873444 845228 818626
62321 818626 793672 770411 748595 727805 707789 688357 669010 649173 629032 609684 592122
62310 592122 576373 561933 548642 536633 525758 515700 506535 498567 491669 485418 479900 475730 473079
62297 473079 471325 469980 469407 470183 472132 474477 476678 478716 480768 483108 486227 490561 495937 501527 506383
62282 506383 509940 512180 513646 515246 517673 520883 524299 527566 530904 534766 539438 545070 551844 559918
62268E59918R438J0909J2630J4607J6728J9031K1767K5103K8887L2743L6322L9482
62256H27565M2363M5217M8096N0682N2603N3779N4219N3556N1105M6496L9966
62245A365647L1916K2551J2196J704p865j5952k2717k8660l4261l9778m4990m9144
62233A190647n1549n2271n1965n0970m8992m5793m1812l7843l4394l1513k8995
62222G14550k6482k3658k0675j8144j6435j5112j3446j1314r255p796p032o813
62210E38388o872o789o256n398m595l979l392k781k225j625q27j05M8k69k24P41
62194D93840K270L746N089O421P363P402O848O699P442Q498R044Q975Q835R137
62180E91609J0007J1177J2043J2049J1314J0748J1082J1938J2342J2146J2416
$$ plain form
62268 559918 569356 580265 592895 607502 624230 643261 665028 690131 719018 751761 788083 827565
62256 827565 869928 915145 963241 1013923 1066526 1120305 1174524 1228080 1279185 1325681 1365647
62245 1365647 1397563 1420114 1432310 1434014 1426149 1410197 1387480 1358820 1324559 1284781 1239791 1190647
62233 1190647 1139098 1086827 1034862 983892 934900 889107 847295 809452 775058 743545 714550
62222 714550 688068 664410 643735 625591 609156 594044 580598 569284 560029 552233 545201 538388
62210 538388 531516 524727 518471 513073 508478 504499 501107 498326 496101 494476 493649 493544 493592 493323 493099 493840
62194 493840 496110 499856 504945 511366 518729 526131 532979 539678 547120 555618 564662 573637 582472 591609
62180 591609 601616 612793 624836 636885 648199 658947 670029 681967 694309 706455 718871
62169G18871J4100J6877J9692K2139K4696K7774L1122L4272L6936L8768L9214
62158A024461L7972L5286L1394K6153J9592J2512N930P6n487j0894j5767k0046
62146A141182k4315k8920l3203l6014l6783l5892l4163l2292l0588k8905k6805
62135G93302k3910k0194j6052j2158r150p170n647l830j608L71J446J625J487
62122F98512J618K272L317M383N111N340N056M362L586L260L616M257M645M829
62108G54164N300O271P535Q812R607Q922O064J879j688l630m598n220m786k529
62094G86103N16K127J202j370m000n686o143n508m198k507k58K729N980Q656J0562
62079G88205J2247J4174J6289J8445K0650K2790K4591K6008K7210K8155K8645
$$ plain form
62169 718871 732971 749848 769540 791679 816375 844149 875271 909543 946479 985247 1024461
62158 1024461 1062433 1097719 1129113 1155266 1174858 1187370 1193300 1193376 1187889 1176995 1161228 1141182
62146 1141182 1116867 1087947 1054744 1018730 981947 946055 911892 879600 849012 820107 793302
62135 793302 769392 749198 733146 720988 711838 704668 699021 695191 693583 693954 695400 697025 698512
62122 698512 700130 702402 705719 710102 715213 720553 725609 729971 733557 736817 740433 744690 749335 754164
62108 754164 759464 765735 773270 782082 791689 800611 806675 808554 806866 803236 798638 793418 788632 786103
62094 786103 786619 788746 789948 788578 784578 778892 772749 767241 763043 760536 760278 763007 768987 777643 788205
62079 788205 800452 814626 830915 849360 870010 892800 917391 943399 970609 998764 1027409
62068A027409K8852K9228K9780K9982K9600K9100K9040K9435K9864K9750K8497
62057A350537K5835K2194J8134J3388P178k49p255j2498j6287j9663k2881k5599
62045A332834k8077l1022l4339l6957l8128l8258l8178l8096l7530l6012l3669
62034I42568l1207k9293k7837k6084k3681k1263j9585j8394j6797j4603j2541
62023G01283j1115r974q642p198n971n102m780n338o660p912q300p815o831n428
62009F00217l666k219j890k482k748j722L21K343L597M009L880L578L405L458
61995F10081L525L231K341J055l0m19k91m79j570l230m674n710o853q420r958
61980E78599j0751j0603r876r057q474q203p972p351o250n041m107l499l192l317
$$ plain form
62068 1027409 1056261 1085489 1115269 1145251 1174851 1203951 1232991 1262426 1292290 1322040 1350537
62057 1350537 1376372 1398566 1416700 1430088 1437266 1437017 1429762 1417264 1400977 1381314 1358433 1332834
62045 1332834 1304757 1273735 1239396 1202439 1164311 1126053 1087875 1049779 1012249 976237 942568
62034 942568 911361 882068 854231 828147 804466 783203 763618 745224 728427 713824 701283
62023 701283 690168 680194 671552 664354 658383 653281 648501 643163 636503 628591 620291 612476 605645 600217
62009 600217 596551 594332 592442 589960 587212 585490 585811 588154 591751 595760 599640 603218 606623 610081
61995 610081 613606 616837 619178 620233 620203 619784 619493 619014 617444 614214 609540 603830 596977 588557 578599
61980 578599 567848 557245 547369 538312 529838 521635 513663 506312 500062 495021 490914 487415 484223 480906
61966D80906l770l981l531k777k355k208j757q95j55K27P07J629K570K932K795
61951D70337K721L033L640M415N359O446P608Q784R864J0708J1400J2213J3201
61938E69729J4052J4573J5025J5659J6303J6683J6835J6749J5988J4303J2321
61927G38220J0945J0107Q923P040N091L590K135J58k152m121n394o057o275o243
61913G55967o190o015n184l428j272N48J991L587N590P686R451J0662J1165J0863
61899G95421R810P977N152J409k440n461p627r663j1897j3827j4949j5307j5118
61886G23480j4470j3723j3437j3514j3043j1640j0292j0081j0574j0431r382q518
61874E84375q630r266r704r843r672q734o807m654l215k403j292O46L092N508
$$ plain form
61966 480906 477136 473155 469624 466847 464492 462284 460527 459632 459477 459704 460411 462040 464610 467542 470337
61951 470337 473058 476091 479731 484146 489505 495951 503559 512343 522207 532915 544315 556528 569729
61938 569729 583781 598354 613379 629038 645341 662024 678859 695608 711596 725899 738220
61927 738220 749165 759272 768195 775235 780326 783916 786051 786209 784057 779936 774542 768485 762210 755967
61913 755967 749777 743762 738578 735150 733878 734426 736417 740004 745594 753280 762731 773393 784558 795421
61899 795421 805231 813208 818360 819769 817329 811868 804241 794578 782681 768854 753905 738598 723480
61886 723480 709010 695287 681850 668336 655293 643653 633361 623280 612706 602275 592893 584375
61874 584375 575745 566479 556775 546932 537260 528526 521719 517065 513850 511447 510155 510801 513893 519401
61860E19401P593R193J0348J1516J3258J5541J7745J9453K0853K2270K3699K5000
61848G15870K6188K7284K8166K8725K8902K8457K7076K4868K2409J9893J6685
61837I94523J2158O764J751k151n202p823r882j0987j1036j0178q489o063l252
61824I40133m53K216M747O856Q147Q613Q546P874N968K415k388p635j2862j7838
61810I54339k2036k4808k6119k6552k6507k5893k4803k3843k3363k2807k1481
61799F86127j9605j7944j6594j4884j2633j0698r888r830r380p960o137m946m873
61786E40755n416n585m878l799l225l393l758l790l480l004k440j976j926k187
61772D91898k112j342l72Q8M0l7k6j59k83J69J301K383K677K345K253K905L877
$$ plain form
61860 519401 526994 536187 546535 558051 571309 586850 604595 624048 644901 667171 690870 715870
61848 715870 742058 769342 797508 826233 855135 883592 910668 935536 957945 977838 994523
61837 994523 1006681 1013445 1015196 1013045 1007843 1000020 990138 979151 968115 957937 949448 943385 940133
61824 940133 939680 941896 946643 953499 961646 970259 978805 986679 992647 995062 992674 985039 972177 954339
61810 954339 932303 907495 881376 854824 828317 802424 777621 753778 730415 707608 686127
61799 686127 666522 648578 631984 617100 604467 593769 583881 574051 564671 556711 550574 545628 540755
61786 540755 535339 529754 524876 521077 517852 514459 510701 506911 503431 500427 497987 496011 494085 491898
61772 491898 489786 488444 488072 488160 488200 488163 488137 487978 487695 487864 489165 491548 494225 496570 498823 501728 505605
61755E05605M280L796L075L001L630M164L983L360K961K942K971K762K290J632
61741E50452J033Q98J295J632J336P45P68J666K688L019K606J997J777K298L422
61726E77632M414M501L785L149L140L389L411L392L740M279M476M195L707L125
61712F30335K358J562J103R27L94r62k809m313m919m725m224l860l823m103m610
61697E98331n245n806n980n516m486l346k610k466k690k932k954k596j698l83
61683E49623O19M25r77k464k924k467k023k026k051j809j769k387l211l290k350
61668E20919j124n23p13j140j263j091r85j020p42K40J586K472K531K282K496
61653E23925L378M440N025M775L826K752K248K694L878N035N260M266K913K595
$$ plain form
61755 505605 509885 513681 516756 519757 523387 527551 531534 534894 537855 540797 543768 546530 548820 550452
61741 550452 551485 552383 553678 555310 556646 557391 558159 559825 562513 565532 568138 570135 571912 574210 577632
61726 577632 582046 586547 590332 593481 596621 600010 603421 606813 610553 614832 619308 623503 627210 630335
61712 630335 632693 634255 635358 636285 636679 635717 632908 628595 623676 618951 614727 610867 607044 602941 598331
61697 598331 593086 587280 581300 575784 571298 567952 565342 562876 560186 557254 554300 551704 550006 549623
61683 549623 550242 550667 549690 547226 544302 541835 539812 537786 535735 533926 532157 529770 526559 523269 520919
61668 520919 519795 519272 518559 517419 516156 515065 514080 513060 512318 512558 514144 516616 519147 521429 523925
61653 523925 527303 531743 536768 541543 545369 548121 550369 553063 556941 561976 567236 571502 574415 577010
61639E77010L626M646M214K713J756J870J885Q72n55j441j900k389k549j987j535
61624E86236k271l579l692k270j029j350k562l258l237l175l188k831k193j978
61610E49623k473l200l663l907m167m530n022n666o300o615o515o246o040n847
61596D79432n469m861m181l698l603l808l946l679l084k599k529k694k623k156
61582D30502j678j741k344k837k692k233k234k833l312l126k662k601k897k902
61568C94410k315j508r97j056j733k692l105k375j061m16p84j131o05K03J99n56
61552C74478j022p59l75l65m29j68K34M20M60O07Q68J132J374J459J096L81l4
61535C79357K51P44P61M45M86J042J554J668J552J294O08n10j394j368n97O9j23
$$ plain form
61639 577010 580636 585282 589496 592209 593965 595835 597720 598592 598037 596596 594696 592307 589758 587771 586236
61624 586236 583965 580386 576694 574424 573395 572045 569483 566225 562988 559813 556625 553794 551601 549623
61610 549623 547150 543950 540287 536380 532213 527683 522661 516995 510695 504080 497565 491319 485279 479432
61596 479432 473963 469102 464921 461223 457620 453812 449866 446187 443103 440504 437975 435281 432658 430502
61582 430502 428824 427083 424739 421902 419210 416977 414743 411910 408598 405472 402810 400209 397312 394410
61568 394410 392095 390587 389590 388534 386801 384109 381004 378629 377568 377152 376368 375237 374632 374835 375034 374478
61552 374478 373456 372697 372322 371957 371528 371360 371594 372014 372474 373081 373949 375081 376455 377914 379010 379391 379357
61535 379357 379608 380352 381113 381558 382044 383086 384640 386308 387860 389154 389762 389252 387858 386490 385893 385962 385839
61518C85839j305k917l945l628k211q29m09q66j516j845j599o35P50J644J321
61503C67849J78p17r27r17j009q58j96N41Q00N47k3j005k310l110k589j167k18
61486C54869l70p91m98K48L71m84j497j711j028q8M91N78M46L81M29M83N45O91
61468C53065P44L19n15r90n05M18O66Oo35m95P0L33K61K39J80l12j064j369q99
61449C49517rR31J863K577K588J829R64O17O35N47L79M99Q91J193J384J910K967
61432C71282M066M510M088L112K058J319J085J214J292J022N74L79O03R95J278
61417C98877J453J672J885J874J582J216R34O07K8p11j209j235j015j032j505
61402D03421k175k608k682k658k776k845k427j456m74j01m19r47j173q86j93N12
$$ plain form
61518 385839 384534 381617 377672 374044 371833 371004 370595 369729 368213 366368 364769 364134 364884 366528 367849
61503 367849 368027 367310 366383 365466 364457 363599 363403 363944 364744 365291 365268 364263 361953 358843 356254 355087 354869
61486 354869 354499 353708 353210 353458 353829 353345 351848 350137 349109 349021 349512 350090 350536 350917 351346 351829 352374 353065
61468 353065 353809 354128 353613 352623 352118 352536 353202 353208 352573 352078 352148 352481 352742 352981 353161 352849 351785 350416 349517
61449 349517 349508 350439 352302 354879 357467 359296 360260 360877 361512 362059 362438 362937 363828 365021 366405 368315 371282
61432 371282 375348 379858 383946 387058 389116 390435 391520 392734 394026 395048 395622 396001 396604 397599 398877
61417 398877 400330 402002 403887 405761 407343 408559 409493 410100 410128 409417 408208 406973 405958 404926 403421
61402 403421 401246 398638 395956 393298 390522 387677 385250 383794 383320 383219 382800 381853 380680 379794 379601 380113
61386C80113P15K28m73o58j85L31L49R3J34N74J008J241J588K286K930K826J889
61369C94989Q80O67J361K326K884K817K267J455P32N81J258K406L319L608L486
61354D25036L404L618M099M665N094N278N448N997O998P968Q362Q204Q050Q338
61340E10559Q905R179Q735P600O112M557K998J392q2r86r90m34k52j182k969m585
61324E48557n269n141m691m059l168k268j757j512r61m5N04J37o81j038o44J19
61308E18083R61J953L134M311N269N836N869N539N472O205P432Q282Q286P681
61294E94313O707N149K825J15k320m168n538o543p014o771n951n052m431l908
61280E57413l036j796p44k83j30K52J026K072L285M420N030N098N356O371P596
$$ plain form
61386 380113 380828 381056 380583 379925 379740 380071 380420 380513 380647 381221 382229 383470 385058 387344 390274 393100 394989
61369 394989 395869 396536 397897 400223 403107 405924 408191 409646 410378 410959 412217 414623 417942 421550 425036
61354 425036 428440 432058 436157 440822 445916 451194 456642 462639 469637 477605 485967 494171 502221 510559
61340 510559 519464 528643 537378 544978 551090 555647 558645 560037 559955 558969 557979 557545 557293 556111 553142 548557
61324 548557 543288 538147 533456 529397 526229 523961 522204 520692 519731 519686 520190 520327 519646 518608 517964 518083
61308 518083 519044 520997 524131 528442 533711 539547 545416 550955 556427 562632 570064 578346 586632 594313
61294 594313 601020 606169 608994 609109 606789 602621 597083 590540 583526 576755 570804 565752 561321 557413
61280 557413 554377 552581 551837 551554 551424 551676 552702 554774 558059 562479 567509 572607 577963 584334 591930
61265E91930Q074P821P702Q053Q356Q291Q206Q330Q454Q629R300J0400J1152J1185
61251G15883J1098J1331J1278J0074P744M921J990q93l422n401o984q155q462
61238G41002p843p164p213p520p039n668m282l420k730j792p11J90O93O27j0p24
61222F86396q15j12Q86J662K130K373K308J823J051L84K05M93P19L21n86j221
61206F98017j046l48K70O94J210J910K496K676K490K429L231N242P828R862J1040
61191G48001J2207J4097J6347J8238J9788K1340K2537K2566K1322J9547J7743
61180I53733J5670J3012R991P140M779K911J416K09p03j338j918k731l848n224
61166I93099p038r450j1911j3479j4076j4656j5741j6563j6317j5466j4934j4664
$$ plain form
61265 591930 600004 607825 615527 623580 631936 640227 648433 656763 665217 673846 683146 693546 704698 715883
61251 715883 726981 738312 749590 759664 767408 772329 774319 773426 770004 764603 757619 749464 741002
61238 741002 733159 725995 718782 711262 704223 698555 694273 690853 688123 686331 685620 685810 686503 687130 687120 686396
61222 686396 685581 685469 686355 688017 690147 692520 694828 696651 697702 698086 698291 698784 699503 699824 699238 698017
61206 698017 696971 696623 696893 697587 698797 700707 703203 705879 708369 710798 714029 719271 727099 736961 748001
61191 748001 760208 774305 790652 808890 828678 850018 872555 895121 916443 935990 953733
61180 953733 969403 982415 992406 999546 1004325 1007236 1008652 1008861 1008158 1006820 1004902 1002171 998323 993099
61166 993099 986061 976611 964700 951221 937145 922489 906748 890185 873868 858402 843468 828804
61154H28804j3950j2829j1965j1382j0388q713o894n437m300l216j904r6K036
61141G39766L647M078L680L113K214M40j867l724m811n521n798n085l482j795
61127G24855l28J345L245M779N993P783J0383J2709J3864J4429J5518J7351J9419
61114H51345K1492K3614K5545K6855K7437K7430K6919K5992K4843K3537K1929
61103A126938J9984J7833J5438J2645R640O882M510K246o6k418n126q607j2497
61090A187402j5779j8026j9874k1891k3741k4890k5505k6087k6639k6663k5723
61079I32584k3767k1206j8864j7393j6628j5822j4608j3177j1631r882q231p228
61067G54147o674n629l731j780n65J83J156K420L549M303M758N083N527O278P127
$$ plain form
61154 828804 814854 802025 790060 778678 768290 759577 752683 747246 742946 739730 737826 737730 739766
61141 739766 743413 747491 751171 754284 756498 756938 755071 751347 746536 741015 735217 730132 726650 724855
61127 724855 724527 725872 729117 733896 739889 747672 758055 770764 784628 799057 814575 831926 851345
61114 851345 872837 896451 921996 948851 976288 1003718 1030637 1056629 1081472 1105009 1126938
61103 1126938 1146922 1164755 1180193 1192838 1202478 1209360 1213870 1216116 1216050 1213632 1208506 1199899 1187402
61090 1187402 1171623 1153597 1133723 1111832 1088091 1063201 1037696 1011609 984970 958307 932584
61079 932584 908817 887611 868747 851354 834726 818904 804296 791119 779488 769606 761375 754147
61067 754147 747473 741844 738113 736333 735768 735951 737107 739527 743076 747379 752137 757220 762747 769025 776152
61052G76152P734Q319R516J1364J3116J4261J5090J6032J7120J8389K0079K2100
61040I49272K3921K5290K6452K7436K7886K7861K8089K9044L0392L1662L2795
61029A260100L3824L4659L5454L6438L7352L7825L8328L9742M1959M4024M5884
61018A685589M8707N3133N8373O3448O8112P2328P6185Q0777Q7879R8376J12339
61007B505246J30754J55254J85710K20115K57552K99379L47115M01868M66600
60998D969593N45559O39516P44298Q55670R72158J091266J208538J325360J453802
60989A3805760J608915J802103K048526K365434K730009L024938L055689K672704
60981C3114078J905690R73366J48282l94502o15383n50266k70048R0306L15199
$$ plain form
61052 776152 783886 792205 801721 813085 826201 840462 855552 871584 888704 907093 927172 949272
61040 949272 973193 998483 1024935 1052371 1080257 1108118 1136207 1165251 1195643 1227305 1260100
61029 1260100 1293924 1328583 1364037 1400475 1437827 1475652 1513980 1553722 1595681 1639705 1685589
61018 1685589 1734296 1787429 1845802 1909250 1977362 2049690 2125875 2206652 2294531 2392907 2505246
61007 2505246 2636000 2791254 2976964 3197079 3454631 3754010 4101125 4502993 4969593
60998 4969593 5515152 6154668 6898966 7754636 8726794 9818060 11026598 12351958 13805760
60989 13805760 15414675 17216778 19265304 21630738 24360747 27385685 30441374 33114078
60981 33114078 35019768 35993134 36141416 35746914 35131531 34581265 34311217 34401523 34716722
60972C4716722J93827l37148j134449j939957k538427k847553k899101k772255
60964B0441659k545676k279721k011691j757810j522680j308424j116041r43839
60956F955777p90033o56014n44241m54001l81764l24519k80285k46188k18559
60947C060173j95011j74837j57607j42613j29316j17251j05838r5114q6124p9700
60937A776762p5475p2720p1274p0812p0097o8014o4689o0782n6478n1907m7663
60926A066851m3975m0224l6128l2532l0127k8248k5981k3539k1453j9301j6496
60915G48847j3594j1563j0293r063p894p275o948o188m993l923l091k254j580
60902F60188j345j244q83n69o47o39l8M68j94j764l001l452l730m119m221m076
$$ plain form
60972 34716722 34910549 34573401 33438952 31498995 28960568 26113015 23213914 20441659
60964 20441659 17895983 15616262 13604571 11846761 10324081 9015657 7899616 6955777
60956 6955777 6165744 5509730 4965489 4511488 4129724 3805205 3524920 3278732 3060173
60947 3060173 2865162 2690325 2532718 2390105 2260789 2143538 2037700 1942586 1856462 1776762
60937 1776762 1701287 1628567 1557293 1486481 1416384 1348370 1283681 1222899 1166421 1114514 1066851
60926 1066851 1022876 982652 946524 913992 883865 855617 829636 806097 784644 765343 748847
60915 748847 735253 723690 713397 704334 696440 689165 682217 676029 671036 667113 664022 661768 660188
60902 660188 658843 657599 656716 656147 655500 654861 654823 655291 655097 653333 650332 646880 643150 639031 634810 630734
60886F30734m389n395o394o709o355n672m993m907o042q252j0419j1370j0847
60873E38990r625q860r057r441q684o562m308l011k414j852j498j683j784r91
60859D69220K88J068J526K690M559N904O028N512N009M522M184M593N787O774
60845E27664O725N948N230M857M676M552M274L484K096N02r03k046k908l337l323
60830E57491l108k889k703k685k970l316l276k838k441k346k423k614l112l935
60816E16835m783n417n874o232o562p009p524p613o908n914n537n854n919n008
60802D30681l485k283j958k367k887k877k235j511j116o74K85J299J438P16J01
60787D13127J01K49K05L92J093J813K086K240K784L510L903L952M058M416M904
$$ plain form
60886 630734 626345 620950 614556 607847 601492 595820 590827 585920 579878 571626 561207 549837 538990
60873 538990 529365 520505 511448 502007 493323 486761 482453 479442 477028 475176 473678 471995 470211 469220
60859 469220 469508 470576 472102 474792 479351 485255 491283 496795 501804 506326 510510 515103 520890 527664
60845 527664 534389 540337 545567 550424 555100 559652 563926 567410 569506 570008 569105 567059 564151 560814 557491
60830 557491 554383 551494 548791 546106 543136 539820 536544 533706 531265 528919 526496 523882 520770 516835
60816 516835 512052 506635 500761 494529 487967 480958 473434 465821 458913 452999 447462 441608 435689 430681
60802 430681 427196 424913 422955 420588 417701 414824 412589 411078 409962 409288 409573 410872 412310 413026 413127
60787 413127 413228 413477 413682 414074 415167 416980 419066 421306 424090 427600 431503 435455 439513 443929 448833
60772D48833N395N755N828N653N423N134M709M559N332O768P584P004N781N007
60758E28765M570L637K272J487J755K388K548K158J593J048N67K07j10n64j065
60743E51256j233r97q95j466k499l314l673m056m950o092o702o308n154l850k844
60728D97223k271k010j668p94N75J768K222K240K656L803N264O648Q009R293R989
60713E42947R835R521J0140J1969J4239J6018J7028J7630J8350J9534K1103K2553
60701G30867K3363K3497K3393K3356K3218K2611K1435J9926J8391J6958J5545
60690I62560J3898J1735Q950N609J783k496o990j1157j4583j7387j9914k2045
60678I09963k3195k3160k2547k2122k1997k1814k1465k1092k0544j9425j7754
$$ plain form
60772 448833 454228 459983 465811 471464 476887 482021 486730 491289 496621 503389 510973 517977 523758 528765
60758 528765 533335 536972 539244 540731 542486 544874 547422 549580 551173 552221 552788 552995 552885 552321 551256
60743 551256 550023 549026 548131 546665 544166 540852 537179 533123 528173 522081 515379 509071 503917 500067 497223
60728 497223 494952 492942 491274 490480 491055 492823 495045 497285 499941 503744 509008 515656 523665 532958 542947
60713 542947 552782 562303 572443 584412 598651 614669 631697 649327 667677 687211 708314 730867
60701 730867 754230 777727 801120 824476 847694 870305 891740 911666 930057 947015 962560
60690 962560 976458 988193 997143 1002752 1004535 1002039 995049 983892 969309 951922 932008 909963
60678 909963 886768 863608 841061 818939 796942 775128 753663 732571 712027 692602 674848
60667F74848j6089j4818j3752j2648j1714j1259j1150j0932j0375r601q812q060
60655E35638p253o314n434n070n346n479m369j979L72J416J251Q72Q22Q53O65
60640E00645L32j8l93p66r67q06j82Q98K136L019L281L168L070L021K820K368
60624E21626J717R55L52K11L78K32m35j015j027j000j703k844l423l219l063l514
60608E04228m109m209l809l254k653k055j736j831j948j583q33l78p43j728k603
60593D70756k768k212j336m90K18P25R55J000J014Q70L06m08m65M71J791K830
60577D73257L690M732N762O424O952P755Q595R006R302J0232J1769J3122J3951
60564E84549J4709J5758J7018J8539K0513K2440K3217K2346K0422J8033J4925
$$ plain form
60667 674848 658759 643941 630189 617541 605827 594568 583418 572486 562111 552510 543698 535638
60655 535638 528385 522071 516637 511567 506221 500742 496373 494394 494766 496182 497433 498305 499127 499980 500645
60640 500645 500977 500959 500566 499800 498833 498027 497845 498743 500879 503898 507179 510347 513417 516438 519258 521626
60624 521626 523343 524298 524650 524861 525239 525471 525036 524021 522994 521994 520291 517447 514024 510805 507742 504228
60608 504228 500119 495910 492101 488847 486194 484139 482403 480572 478624 477041 476208 475830 475087 473359 470756
60593 470756 467988 465776 464440 463950 464168 464893 465848 466848 467862 468732 469038 468630 468165 468636 470427 473257
60577 473257 476947 481679 487441 493865 500817 508572 517167 526173 535475 545707 557476 570598 584549
60564 584549 599258 615016 632034 650573 671086 693526 716743 739089 759511 777544 792469
60553G92469J0616N257m56n723r725j1808j1943j0636q299n126j646J421M050
60540G48451O914J0268J3533J6370J9355K3013K6841K9838L1433L1346K9139K4660
60528A011161J8584J1918N215j207o717j0678j3119j4510j4963j4224j2369j0072
60516I49019q098o779n966n266m410l484k714j951o96J331L914O791R961J3421
60502I45073J7017K0775K4927K9456L4068L8878M4555N1432N8930O6256P3175
60491A404542P9697Q5403Q9696R2311R3038R1214Q6052P7410O5731N1365L4295
60480B250754J4456p881l1758n5296p6102r2364j03539j09888j11782j09782j04916
60469A461902r8254r0369q1630p2812o4823n7886n1499m5250l9376l4365l0289
$$ plain form
60553 792469 803085 808342 807886 802163 792438 780630 768687 758051 749752 744626 742980 744401 748451
60540 748451 755365 765633 779166 795536 814891 837904 864745 894583 926016 957362 986501 1011161
60528 1011161 1029745 1041663 1046878 1045671 1038954 1028276 1015157 1000647 985684 971460 959091 949019
60516 949019 940921 934142 928176 922910 918500 915016 912302 910351 909655 910986 914900 921691 931652 945073
60502 945073 962090 982865 1007792 1037248 1071316 1110194 1154749 1206181 1265111 1331367 1404542
60491 1404542 1484239 1569642 1659338 1751649 1844687 1935901 2021953 2099363 2165094 2216459 2250754
60480 2250754 2265210 2257329 2225571 2170275 2094173 2001809 1898270 1788382 1676600 1566818 1461902
60469 1461902 1363648 1273279 1191649 1118837 1054014 996128 944629 899379 860003 825638 795349
60458G95349k6693k3164j9853j7289j5602j4247j2769j1471j0820j0492r805q909
60446F14235q549q583p868n964l938k857k424j872j332j358j715j632r77l44k00
60431E64622o03j452k363k678k234j777j982k512k718k712k866k764j778m06J11
60416E35888n18j322j453r79l01L21N92L96K89R15J893K118J356N96N89Q74P24
60399E41978K17q5N9N10J060J378J138N51L92J155K410L332L544L278K916K607
60383E66440K218J589R74R86J777K596K639K186K182K783L111K629K011K259L465
60368E99845M752N139M370L156K666L361M480N084N412O391P933Q743Q049O596
60354F75977N526N084M906M831M847M830M978N939P958J0341J2328J4005J5797
$$ plain form
60458 795349 768656 745492 725639 708350 692748 678501 665732 654261 643441 632949 623144 614235
60446 614235 605686 597103 589235 583271 579333 576476 574052 572180 570848 569490 567775 566143 565166 564822 564622
60431 564622 564019 562567 560204 557526 555292 553515 551533 549021 546303 543591 540725 537961 536183 535777 535888
60416 535888 535370 534048 532595 531616 531315 531636 532228 532624 532913 533828 535721 537839 539195 539791 540380 541254 541978
60399 541978 542195 542110 542169 542679 543739 545117 546255 546806 547198 548353 550763 554095 557639 560917 563833 566440
60383 566440 568658 570247 571221 572207 573984 576580 579219 581405 583587 586370 589481 592110 594121 596380 599845
60368 599845 604597 609736 614106 617262 619928 623289 627769 632853 638265 644656 652589 661332 669381 675977
60354 675977 681503 686587 691493 696324 701171 706001 710979 716918 724876 735217 747545 761550 777347
60341G77347J7601J9068K0296K1453K1964K0827J7645J2834P008P34n324j0655
60329I20798j5262j9257k2198k3468k3184k2094k0552j8290j5244j2009r163o734
60317G13343m576k840j709r69k03Q04K121L899O190Q706J1009J2899J4438J5689
60303G78801J6700J7668J8902K0678K3294K7004L1404L4862L5249L1681K5303
60292A061546J7923J0189J707p248j5010j9883k1619k1102j9151j6270j3284j1319
60280I46479j0974j2035j4094j6933k0154k2938k4641k5289k5196k4346k2567
60269G27312k0171j7956j6405j5193j3747j2100j0870j0302r695q175n883l956
60257E82859l236l357l403l010k490k122j809j416r84o15m06m52o68o96l22J43
$$ plain form
60341 777347 794948 814016 834312 855765 877729 898556 916201 929035 936043 936777 931453 920798
60329 920798 905536 886279 864081 840613 817429 795335 774783 756493 741249 729240 720077 713343
60317 713343 708767 705927 704218 703249 703046 703850 705971 709870 716060 724766 735775 748674 763112 778801
60303 778801 795501 813169 832071 852749 876043 903047 934451 969313 1004562 1036243 1061546
60292 1061546 1079469 1089658 1091365 1084117 1069107 1049224 1027605 1006503 987352 971082 957798 946479
60280 946479 935505 923470 909376 892443 872289 849351 824710 799421 774225 749879 727312
60269 727312 707141 689185 672780 657587 643840 631740 620870 610568 600873 592698 586815 582859
60257 582859 579623 576266 572863 569853 567363 565241 563432 562016 561032 560417 560011 559559 558891 558195 557873 558016
60241E58016J92j96n28l75L07J296K176K411J890J318J609K829M129M742M654
60226E84470M321M190M552N326N901N610M529L369K564J905J141M45J05K67J055
60211F29750K441L816M261L583K569K003J919K009K216K441K287J573P42L18K99
60196F62227M62Q00J209J193M69m55q69p35m77j69L45Q02O27k59j327k091k421
60179F59331k299j791j261j053r64n20K63Q78J121J301J570J683J590J664K023
60164F63536K177J826J529J969K864L266K912K564K841L264K804J148r44k358
60150F89398k428j263L48J336J158L84K12J136K364K822K443K132K597L663M710
60135G11012N288N312N015M885N263N825N794M825L362K002Q16m49j842l193m353
$$ plain form
60241 558016 558208 558012 557484 557109 557416 558712 560888 563299 565189 566507 568116 570945 575074 579816 584470
60226 584470 588791 592981 597533 602859 608760 614370 618899 622268 624832 626737 627878 628323 628428 628695 629750
60211 629750 632191 636007 640268 643851 646420 648423 650342 652351 654567 657008 659295 660868 661610 661928 662227
60196 662227 662689 663489 664698 665891 666360 665905 665036 664301 663824 663655 664000 664802 665429 665170 663843 661752 659331
60179 659331 657032 655241 653980 652927 651963 651443 651706 652584 653705 655006 656576 658259 659849 661513 663536
60164 663536 665713 667539 669068 671037 673901 677167 680079 682643 685484 688748 691552 692700 691756 689398
60150 689398 686970 685707 686055 687391 688549 688933 689145 690281 692645 695467 697910 700042 702639 706302 711012
60135 711012 716300 721612 726627 731512 736775 742600 748394 753219 756581 758583 759399 758950 757108 753915 749562
60120G49562n108n081m125k711j607j134r77o52L3R31J721K119K119K025K148
60105G39263K554L117L719M282M744N059N119M642L372J510k89j570k362k781
60091G70379k673k027j314j017j032j013j076j581k323k568k050j345j074j163
60077G48123j175r93q67j017j575k722m484o461q026q849q992q516p359n752m433
60062F76902m096m637n230n199m623m018l714l717l913m178m384m596n084n871
60048F13642o357n841m409k850j682o81M32J338J547J199R86J374K175K879L172
60033F06924L112K897K512J712M69p10j313j631k508m065n250n108m079l447l735
60018E85780m335m602m607m630m559m139l491k937k484j787o16Q48K175L052L511
$$ plain form
60120 749562 744454 739373 735248 732537 730930 729796 728819 728167 728200 729131 730852 732971 735090 737115 739263
60105 739263 741817 744934 748653 752935 757679 762738 767857 772499 775871 777381 777092 775522 773160 770379
60091 770379 767706 765679 764365 763348 762316 761303 760227 758646 756323 753755 751705 750360 749286 748123
60077 748123 746948 745955 745088 744071 742496 739774 735290 728829 720803 711954 702962 694446 687087 681335 676902
60062 676902 672806 668169 662939 657740 653117 649099 645385 641668 637755 633577 629193 624597 619513 613642
60048 613642 607285 601444 597035 594185 592503 591822 592254 593592 595139 596338 597324 598698 600873 603752 606924
60033 606924 610036 612933 615445 617157 617626 616916 615603 613972 611464 607399 602149 597041 592962 589515 585780
60018 585780 581445 576843 572236 567606 563047 558908 555417 552480 549996 548209 547593 548441 550616 553668 557179
60003E57179L883M526N473O321O602O343O131O489P171P388O753N722M911M309
59989F39201L554K705K104J608O12r49k322k929l134l530m007m045l694l585m084
59974F17505m870n436n611n598n649n676n141l609j531p0J70j15O0O67R56P44
59958E76796O16R02J274J524J973K790L540L755L572L403L343L296L361L649L841
59943F17635L439K419J290M88o7p32j653k651l487m109m546m659m223l398k918
59928E92828l400m492n061m405k960j636p54K5Q73J420J283O24k8l01j23M78J368
59911E75739K155K429K286K308K799L282L119K450K045K239K513K337J977K058
59897F09736K628L119L173L038L079L283L459L664M127M822N421N689N743N778
$$ plain form
60003 557179 561062 565588 571061 577382 583984 590327 596458 602947 610118 617506 624259 629981 634892 639201
59989 639201 642755 645460 647564 649172 649784 648835 646513 643584 640450 636920 632913 628868 625174 621589 617505
59974 617505 612635 607199 601588 595990 590341 584665 579524 575915 574384 574314 574484 574369 574429 575096 576052 576796
59958 576796 577412 578314 579588 581112 583085 585875 589415 593170 596742 600145 603488 606784 610145 613794 617635
59943 617635 621074 623493 624783 625271 625204 624472 622819 620168 616681 612572 608026 603367 599144 595746 592828
59928 592828 589428 584936 579875 575470 572510 570874 570120 570145 571018 572438 573721 574345 574317 574016 573893 574371 575739
59911 575739 577894 580323 582609 584917 587716 590998 594117 596567 598612 600851 603364 605701 607678 609736
59897 609736 612364 615483 618656 621694 624773 628056 631515 635179 639306 644128 649549 655238 660981 666759
59883F66759N680N131M096K914J885J003K52j52n1L12N37M93K07m21j401k317
59867F84927k773l034l685m713n470n641n580n556n323m673l793k826j662l87
59853F29811O23J351K182K978K971K098J525K139L246L796M057M932O166O706
59839F74581O681P474R633J2008J3354J3630J3121J1412Q159M233J146l64n96
59826G74472j0J173K517L056J701k063p671j3605j8215k0637k1055k0174j8644
59813F60845j6854j4896j2690j0403q639p778p358o600n477m582m031l281k199
59800E56057j440j433j788k067k398k804k732j998j456j843k511k324j425j007
59786E28831j435j816j591j393j881k652k891k504j932j378r24r87j849k881l028
$$ plain form
59883 666759 672439 677570 681666 684580 686465 687468 687720 687568 687517 687829 688366 688859 689066 688645 687244 684927
59867 684927 682154 679120 675435 670722 665252 659611 654031 648475 643152 638479 634686 631860 630198 629811
59853 629811 630434 631785 633967 636945 639916 642014 643539 645678 648924 652720 656777 661709 667875 674581
59839 674581 681262 688736 698369 710377 723731 737361 750482 761894 770053 774286 775432 775068 774472
59826 774472 774462 775635 778152 781208 782909 780846 773175 759570 741355 720718 699663 679489 660845
59813 660845 643991 629095 616405 606002 597363 589585 582227 575627 570150 565568 561537 558256 556057
59800 556057 554617 553184 551396 549329 546931 544127 541395 539397 537941 536098 533587 531263 529838 528831
59786 528831 527396 525580 523989 522596 520715 518063 515172 512668 510736 509358 508434 507447 505598 502717 499689
59771D99689k142j175q44p37j32Q11J232Q37L49O11J551K310K221J509R84J144
59755E08218J724K214K637L417M446M807L974K826K755L797M497L848K535J756
59741E53451J531R74j38r90r38l07J87L09L14M02N08M44J50j80k31L3K61J63n6
59722E55887jK99M42K28j72n73r51j226j193p23J57J290K268K503J844J021R82
59705E62082J810K697K999K846K715K924L587M553N297N375N065N089N587N964
59691F18590N859N561N216M383K900J505R29P98J75j070k144k465k253j967j734
59676F34283j488j267j159j177j352j769k432l130l486l202k412j762j887k610
59662F05150l016k517j578j070j146j180o84J99J126K007K815L318L296K892K522
$$ plain form
59771 499689 497547 496372 495528 494791 494659 495470 496702 497539 497888 498499 500050 502360 504581 506090 507074 508218
59755 508218 509942 512156 514793 518210 522656 527463 531437 534263 537018 540815 545312 549160 551695 553451
59741 553451 554982 555956 555818 554828 553890 553583 553770 554079 554393 554795 555303 555747 555897 555717 555486 555519 555780 555943 555887
59722 555887 555886 556185 556627 556855 556683 556110 555159 553933 552740 552017 552174 553464 555732 558235 560079 561100 562082
59705 562082 563892 566589 569588 572434 575149 578073 581660 586213 591510 596885 601950 607039 612626 618590
59691 618590 624449 630010 635226 639609 642509 644014 644943 645741 645916 644846 642702 640237 637984 636017 634283
59676 634283 632795 631528 630369 629192 627840 626071 623639 620509 617023 613821 611409 609647 607760 605150
59662 605150 602134 599617 598039 596969 595823 594643 593959 594158 595284 597291 600106 603424 606720 609612 612134
59647F12134K328J963J014m09j675k323k580l046l899m726n047m820m341l881
59633E80692l513l111k476j579p26k80k61m15o57j078j529j610j206o37j34M41
59617E61921J042J124K60j156k328k941l186l139k653j925j534j639j549n29J096
59602E42864K035J415j13j001m76O44J006K92o12q96o76m76l97j90J42K88N8l74
59584E43533p22q89j014j290j722k061k117k103k382k862l010k649k327k579l103
59569E12703l153k582k015j920j978j580o86R1K96K49O51J593K293K044J164O19
59553E07789Q34J381J831K326L029L610L719L566L536L586L535L682M509N824
59539E52757O858P267P529Q306R877J2311J5386J7966J8097J4554Q346K106k075
$$ plain form
59647 612134 614462 616425 617439 617030 615355 613032 610452 607406 603507 598781 593734 588914 584573 580692
59633 580692 577179 574068 571592 570013 569287 569007 568746 568331 567674 566596 565067 563457 562251 561614 561480 561921
59617 561921 562963 564087 564347 563191 560863 557922 554736 551597 548944 547019 545485 543846 542297 541768 542864
59602 542864 544899 546314 546201 545200 544724 545368 546374 546666 546054 545158 544482 544006 543609 543419 543561 543849 543907 543533
59584 543533 542811 541922 540908 539618 537896 535835 533718 531615 529233 526371 523361 520712 518385 515806 512703
59569 512703 509550 506968 504953 503033 501055 499475 498789 498880 499176 499425 500076 501669 503962 506006 507170 507789
59553 507789 508623 510004 511835 514161 517190 520800 524519 528085 531621 535207 538742 542424 546933 552757
59539 552757 559615 566882 574411 582717 592594 604905 620291 638257 656354 670908 679254 681360 679285
59526F79285l932m290l785k673j304q9R49K025K942L149K605K007J819J542M59
59511F80709j351l237m962o728q319r042q714q049p792p877p813p429o923o426
59497E86047n893n310m683l909k884j676n32K71N78N26M80P30J259J971K883L852
59481E73710M385M201L745L669M012M481N251O642Q090Q454P526O331N647N102
59467F51246M183L133K293J434M71O2O82J685K214K486L348M971O846Q711J0516
59452G04281J1805J2109J1886J2114J3007J3920J4453J4724J4560J3352J0899
59441H47110P599L645j156o450j1041j4048j5726j6716j6979j6122j4437j2939
59429G32740j2308j2132j1369r493o991m708k839q75J455L756N789Q059J1008
$$ plain form
59526 679285 675353 671063 667278 664605 663301 663212 664161 666186 669128 672277 674882 676889 678708 680250 680709
59511 680709 679358 676121 671159 664431 656112 647070 638356 630307 622515 614638 606825 599396 592473 586047
59497 586047 580154 574844 570161 566252 563368 561692 561160 561431 562009 562535 563015 563745 565004 566975 569858 573710
59481 573710 578095 582296 586041 589710 593722 598203 603454 610096 618186 626640 634166 640497 646144 651246
59467 651246 655429 658562 660855 662289 662760 662822 663504 665189 667403 669889 673237 678208 685054 693765 704281
59452 704281 716086 728195 740081 752195 765202 779122 793575 808299 822859 836211 847110
59441 847110 854709 858354 857198 850748 839707 825659 809933 793217 776238 760116 745679 732740
59429 732740 720432 708300 696931 687438 680447 675739 672900 672025 673480 677236 683025 691084 702092
59416G02092J4025J6132J7291J8169J8855J9009J9355K1429K4958K6615K2664
59405I20594J2721J29j0992j8312k1451k1197j9038j6371j3338q892k845K381
59393H03389L091k271j1440k0262k5885k7892k7192k4806k1672j8632j6062j3755
59381E96611j1457r228p234n535m228l430k883k038p79K71N35K52J45N96J429
59366E53027K239K661K582K344K470L007L520L879M475N390N971N812N527N964
59352F08868P171Q701J0396J2148J3419J3954J4496J5852J7579J8566J8673J8696
59340G78519J8947J8979J8639J8157J7147J4790J1316Q094N795L546M33l115o106
59327I05141q262r797j0718j1148j1693j2644j3261j2691j1212r875r110q435
$$ plain form
59416 702092 716117 732249 749540 767709 786564 805573 824928 846357 871315 897930 920594
59405 920594 933315 933444 922452 904140 882689 861492 842454 826083 812745 803853 801008 803389
59393 803389 806480 804209 792769 772507 746622 718730 691538 666732 645060 626428 610366 596611
59381 596611 585154 575926 568692 563157 558929 555499 552616 550578 549799 550070 550605 550857 551002 551598 553027
59366 553027 555266 557927 560509 562853 565323 568330 571850 575729 580204 585594 591565 597377 602904 608868
59352 608868 616039 624740 635136 647284 660703 674657 689153 705005 722584 741150 759823 778519
59340 778519 797466 816445 835084 853241 870388 885178 896494 904588 910383 913929 914362 911247 905141
59327 905141 896879 887082 876364 865216 853523 840879 827618 814927 803715 793840 784730 776295
59315G76295p375o062m940m362m391m677m604l934l127k694k470j920r91j97R3
59300G24644Q6K78R97K219L615M824N800O791P891Q849R560J0406J1803J3619
59286H11382J5475J7420J9716K1823K2063J8762J1823L066m967j0523j3188j3365
59274H99487j1639q641n154j913P75L032N058O860Q298R177R406R096Q468P493
59260I39803N882L564Q50k021n202q649j1625j3451j4493j5676j7048j7577j6609
59247H27748j4805j3294j2385j1563j0444r231q286p556o559m924k944j335l30
59234G24092N86J800K759K726K046J834K374K605J499o94k858m252m981n648o798
59219G17090q453r977j0583j0064q881p651o799o560o820p029o694n909n011m003
$$ plain form
59315 776295 768920 762858 757918 753556 749165 744488 739884 735950 732823 730129 727659 725739 724748 724551 724644
59300 724644 724730 725008 726005 728224 731839 736663 742463 749254 757145 765994 775554 785960 797763 811382
59286 811382 826857 844277 863993 885816 907879 926641 938464 941530 936563 926040 912852 899487
59274 899487 887848 879207 874053 872140 872915 875947 881005 887865 896163 905340 914746 923842 932310 939803
59260 939803 945685 949249 950099 948078 942876 934227 922602 909151 894658 878982 861934 844357 827748
59247 827748 812943 799649 787264 775701 765257 756026 747740 740184 733625 728701 725757 724422 724092
59234 724092 724678 726478 729237 731963 734009 735843 738217 740822 742321 741627 738769 734517 729536 723888 717090
59219 717090 708637 698660 688077 678013 669132 661481 654682 648122 641302 634273 627579 621670 616659 612656
59205F12656k854k067k128k566k475j873j583j721j452m38O02J193J895L146M260
59190F04595M378L765L431L886M891N949O615O683O499O637P099P346P319P567
59176F86660Q045P813O461N031M704N400O255O875P284P424P442P957R195J0498
59162G87044J1273J1779J2215J1911J0393Q485P137N843L529M88j946l401m730
59149H60020o367p767q662r558j0701j1587j1825j1663j1309j0560r387q195p188
59136G35251o120m858l663k732k001j468j152p01M01K090L793N180O313P137P526
59121G44996P923R114J1164J3215J4522J5143J5538J5978J6484J6825J6552J5555
59109I13009J4448J3834J3284J1826R379O844M799L022J370J07q56k130l859n488
$$ plain form
59205 612656 609802 607735 605607 603041 600566 598693 597110 595389 593937 593499 594101 595294 597189 600335 604595
59190 604595 608973 612738 616169 620055 624946 630895 637510 644193 650692 657329 664428 671774 679093 686660
59176 686660 694705 702518 708979 714010 718714 724114 730369 737244 744528 751952 759394 767351 776546 787044
59162 787044 798317 810096 822311 834222 844615 853100 860237 866080 869609 870097 868151 864750 860020
59149 860020 853653 845886 837224 827666 816965 805378 793553 781890 770581 760021 750634 742439 735251
59136 735251 729131 724273 720610 717878 715877 714409 713257 712556 712957 715047 718840 724020 730333 737470 744996
59121 744996 752919 762033 773197 786412 800934 816077 831615 847593 864077 880902 897454 913009
59109 913009 927457 941291 954575 966401 975780 982624 987423 990445 991815 991922 991066 988936 985077 979589
59095I79589o813q322j0019j0900j0360r220q603q464q106p581p569q234r083
59082H66315r795j0406j0816j0807j0585j0685j1233j1757j1752j1099j0028q990
59070G38362q458q521q731q592p995o962n386l545k433k838m112m642l693k202
59056F60252j482j756k325k724l049l378l456l058k338j615j104r21j133j496
59042F30417j490q78j49N4j62kR27K135L066L863M878N796N952N370M829M917
59026F69523N495O216O995P771Q312Q549Q743R115R540R825R953R883R343Q128
59012G87391O364M304K077m9j491j849j473j150j169r92j4J552K807L192L205
58997H02705L870N467P053P403O292M573L137K195J509Q29q5j446l101m496n277
$$ plain form
59095 979589 972776 964454 954435 943535 933175 923955 915352 906888 898782 891201 883632 875398 866315
59082 866315 856520 846114 835298 824491 813906 803221 791988 780231 768479 757380 747352 738362
59070 738362 729904 721383 712652 704060 696065 689103 683717 680172 677739 674901 670789 666147 662454 660252
59056 660252 658770 657014 654689 651965 648916 645538 642082 639024 636686 635071 633967 633046 631913 630417
59042 630417 628927 628049 627900 627954 627792 627790 628717 630852 633918 637781 642659 648455 654407 659777 664606 669523
59026 669523 675018 681234 688229 696000 704312 712861 721604 730719 740259 750084 760037 769920 779263 787391
59012 787391 793755 798059 800136 800087 798596 796747 795274 794124 792955 791963 791949 793501 796308 799500 802705
58997 802705 806575 812042 819095 826498 832790 837363 840500 842695 844204 845033 844948 843502 840401 835905 830628
58982H30628n782o582p643q321q132p212n935m478k939j548l97Q69K633M613O036
58967G85810O701P428R037J1170J2606J2685J1902J1067J0336R395Q111O594M809
58954I07651K547k32l277o327r357j2378j5076j6733j6827j5689j4355j3503j2841
58941G73603j1848j0724r996r442q246o308m517l568l239l151l417m055m545m555
58927F85992m527m832m998m447l492k852k632k543k643k988k936j834j47J012
58913F46133J435J894K758L487L675L711M097M830N756O915Q307R746J1139J2500
58899G26383J3649J4361J4832J5513J6479J7348J7850J8015J7934J7740J7752
58888I07856J8156J8812J9748K1362K3448K4625K3742K1471J9286J7223J4025
$$ plain form
58982 830628 824846 818264 810621 802300 794168 786956 781021 776543 773604 772056 771659 772528 775161 779774 785810
58967 785810 792511 799939 808976 820146 832752 845437 857339 868406 878742 888137 896248 902842 907651
58954 907651 910198 909966 906689 900362 891005 878627 863551 846818 829991 814302 799947 786444 773603
58941 773603 761755 751031 741035 731593 723347 717039 712522 708954 705715 702564 699147 695092 690547 685992
58927 685992 681465 676633 671635 667188 663696 660844 658212 655669 653026 650038 647102 645268 645121 646133
58913 646133 647568 649462 652220 655707 659382 663093 667190 672020 677776 684691 692998 702744 713883 726383
58899 726383 740032 754393 769225 784738 801217 818565 836415 854430 872364 890104 907856
58888 907856 926012 944824 964572 985934 1009382 1034007 1057749 1079220 1098506 1115729 1129754
58877A129754R527N235K102p43m412q686j2807j6651k0095k2260k2553k1839k1441
58864I95131k1361k0573j8806j6979j5918j5441j4920j4169j3545j3444j3811
58853H16164j4127j3903j3236j2575j2102j1662j1228j0855j0206q909p468o888
58841F83005p225p337o567n672n554n883n821n344m970m781m533m361m396m154
58827F06407l130j755q92o30l95k2J09n6j08J58O04J290K324L246L326K658K152
58810F15286K257K357J833J061Q77J417K001K037J626J304J394J724J869J573
58796F38616Q82n2j088k003k536k640k510k244j689p31M84J795L211M626N616
58781F39737N808N345M803M710N197N857N941M999L464K192J387M06j199k984
$$ plain form
58877 1129754 1139281 1144516 1146618 1145875 1141463 1132777 1119970 1103319 1083224 1060964 1038411 1016572 995131
58864 995131 973770 953197 934391 917412 901494 886053 871133 856964 843419 829975 816164
58853 816164 802037 788134 774898 762323 750221 738559 727331 716476 706270 697361 689893 683005
58841 683005 675780 668443 661876 656204 650650 644767 638946 633602 628632 623851 619318 614957 610561 606407
58827 606407 603277 601522 600630 600000 599605 599583 599692 599636 599528 599686 600290 601580 603904 607150 610476 613134 615286
58810 615286 617543 619900 621733 622794 623671 625088 627089 629126 630752 632056 633450 635174 637043 638616
58796 638616 639498 639446 638358 636355 633819 631179 628669 626425 624736 624005 624489 626284 629495 634121 639737
58781 639737 645545 650890 655693 660403 665600 671457 677398 682397 685861 688053 689440 689846 688647 685663
58767F85663m293n046n478n540n134m560m234m121l933l548k961k083j042k60
58753F33430J68Q39K187L670M427M468M504M827N164N501O265P492Q574R047R155
58738G09718R354R700J0007J0317J0840J1558J2126J2139J1512J0567R684Q914
58726H36436Q057P175O673O686O790O524O003N606N372N096M824M852N283N877
58712I21254O244N990M925L396K117J288J79k003n098q282j1110j3646j5829j7415
58698H72010j8565j9801k1202k2131k2064k1242k0240j9226j7963j6349j4663
58687F58564j3224j2042j0817r299p561n914m641l941l907m367m711m360l409
58674E70371k458j731q26N14J880K776L281L788M467N366O626Q166R480J0194
$$ plain form
58767 685663 681370 676324 670846 665306 660172 655612 651378 647257 643324 639776 636815 634732 633690 633430
58753 633430 633598 634437 636624 640294 644721 649189 653693 658520 663684 669185 675450 682942 691516 700563 709718
58738 709718 719072 728772 738779 749096 759936 771494 783620 795759 807271 817838 827522 836436
58726 836436 844493 851668 858341 865027 871817 878341 884344 889950 895322 900418 905242 910094 915377 921254
58712 921254 927498 933488 938413 941809 943926 945214 945393 943390 938292 930010 918900 905254 889425 872010
58698 872010 853445 833644 812442 790311 768247 747005 726765 707539 689576 673227 658564
58687 658564 645340 633298 622481 613182 605621 599707 595066 591125 587218 582851 578140 573780 570371
58674 570371 567913 566182 565356 565870 567750 570526 573807 577595 582062 587428 594054 602220 611700 621894
58660F21894J0514J0674J0277Q769O307L622J129j217l293m672n207n275n290
58647F48232n313n294n363n704o203o390n811m528l176k304j750r54J56J040J349
58632E97987J330J240R61M37K3K1K46M20N42O07M44J40J90Q50J834K925M271N749
58614F20217O792P355Q244R815J1056J0847R495Q075O778M958K531K49j351k378
58600G02683l005l226l194l091k788k221j837j982k104j359Q5J269J882K643M207
58585F87962O383Q495R922J0348J0069R977J0635J1499J1638J0987J0155R316
58573H07386Q168O912O253O405O955P742R048J0780J2308J3355J4367J5810J7629
58560I43118J9503K1043K1758K1380K0211J8590J6170J2416P698L086q40m219
$$ plain form
58660 621894 632408 643082 653359 662128 668435 672057 673186 671969 668676 664004 658797 653522 648232
58647 648232 642919 637625 632262 626558 620355 613965 608154 603626 600450 598146 596396 595442 595598 596638 597987
58632 597987 599317 600557 601518 601955 601978 601999 602245 602665 603207 603814 604258 604398 604588 605438 607272 610197 614468 620217
58614 620217 627009 634364 642608 652423 663479 674326 683821 691896 698674 703632 706163 706412 705061 702683
58600 702683 699678 696452 693258 690167 687379 685158 683321 681339 679235 677876 677961 679230 681112 683755 687962
58585 687962 694345 702840 712762 723110 733179 743156 753791 765290 776928 787915 798070 807386
58573 807386 815554 822466 828719 835124 842079 849821 858869 869649 881957 895312 909679 925489 943118
58560 943118 962621 983664 1005422 1026802 1047013 1065603 1081773 1094189 1101887 1104973 1104133 1099914
58548A099914p087r253j0985j2806j4467j5062j4399j3397j2909j2973j3438j4453
58536I48685j5946j7314j8042j8085j7498j6297j4823j3568j2474j1043r235p547
58524G76813o114m584l029k096j910j653o26R10K285L131L292K699J702R24N40
58509G72284K59J34O33J732K729L169L216K930K115J113Q03J264J354K54j363
58494G92626k295k327k047j834j630j338q53j0J056J886K351K859L674M559N393
58479H02070O526Q060R423J0159J0612J1242J1735J1313R690P216M386J573j005
58466I03000l333n415o895p298o774o081n669n258m556l738k878j573L97K497
58452H46426M062N033N684N957N570M550L229J843L48j381l269m862n562n271
$$ plain form
58548 1099914 1092827 1083574 1072589 1059783 1045316 1030254 1015855 1002458 989549 976576 963138 948685
58536 948685 932739 915425 897383 879298 861800 845503 830680 817112 804638 793595 784360 776813
58524 776813 770699 766115 763086 760990 759080 757427 756801 757711 759996 763127 766419 769118 770820 771744 772284
58509 772284 772543 772677 773310 775042 777771 780940 784156 787086 789201 790314 791117 792381 793735 793989 792626
58494 792626 790331 788004 785957 784123 782493 781155 780302 780292 781348 783234 785585 788444 792118 796677 802070
58479 802070 808596 816656 826079 836238 846850 858092 869827 881140 890830 898046 902432 904005 903000
58466 903000 899667 894252 887357 880059 873285 867204 861535 856277 851721 847983 845105 843532 843929 846426
58452 846426 850488 855521 861205 867162 872732 877282 880511 882354 882702 881321 878052 873190 867628 862357
58438H62357m582l976l172j755j28R29J445K098L057L868M491N372O397O785O363
58423H89549O068O760Q224R553R922Q936O924M968L919L457K778J965J565J157
58409I65745k47k420m011m606n122n928o187n545m838m468l669k146r26o41m13
58394I14578N19J460J651J659K104K273J378J52k63j59n20j169j137m31l0l62
58378I21703q89j009m65Q15K499L869M711N741P425R064R829J0061J0702J1955
58364I96011J3330J4441J5035J4819J3974J3264J3036J2783J2241J1952J2081
58353A142967J1694J0153Q208O783N661M474L903M633N918O567O627O908P426
58340A231922P680P879Q668R970J1206J2258J3262J3991J4336J4781J5502J5757
$$ plain form
58438 862357 857775 853799 850627 848872 848744 849673 851118 853216 856273 860141 864632 870004 876401 883186 889549
58423 889549 895617 902377 910601 920154 930076 939012 945936 950904 954823 958280 961058 963023 964588 965745
58409 965745 965498 963078 959067 954461 949339 943411 937224 931679 926841 922373 918704 916558 915632 914991 914578
58394 914578 915097 916557 918208 919867 921971 924244 925622 925774 925511 925352 924832 923663 922526 922095 922065 921703
58378 921703 920814 919805 919340 920155 922654 926523 931234 936975 944400 953464 963293 973354 984056 996011
58364 996011 1009341 1023782 1038817 1053636 1067610 1080874 1093910 1106693 1118934 1130886 1142967
58353 1142967 1154661 1164814 1173022 1179805 1185466 1189940 1193843 1198476 1204394 1210961 1217588 1224496 1231922
58340 1231922 1239602 1247481 1256149 1266119 1277325 1289583 1302845 1316836 1331172 1345953 1361455 1377212
58328A377212J5175J4726J5269J5979J5505J3978J2425J1033R429Q112P951Q594
58316A525388Q861Q564Q618R486J0652J1595J2258J2760J3372J4494J5971J6963
58304A668982J7161J7392J8271J9163J9370J9327J9646J9916J9669J9523K0126
58293A878546K0911K1155K1319K2135K3278K4283K5624K7540K8966K9172K9346
58282B152275L0857L3023L4315L4774L5444L6424L7307L8598M0888M3418M5201
58271B562524M6731M8850N0989N2361N3771N6392N9696O2560O5177O8110P0704
58260C197865P2509P4816P8581Q2217Q3832Q4182Q4945Q5723Q5477Q5387Q7231
58249D102765R0297R3027R6316J01862J08623J14417J19849J27115J35969J44531
$$ plain form
58328 1377212 1392387 1407113 1422382 1438361 1453866 1467844 1480269 1491302 1500731 1508843 1516794 1525388
58316 1525388 1534249 1542813 1551431 1560917 1571569 1583164 1595422 1608182 1621554 1636048 1652019 1668982
58304 1668982 1686143 1703535 1721806 1740969 1760339 1779666 1799312 1819228 1838897 1858420 1878546
58293 1878546 1899457 1920612 1941931 1964066 1987344 2011627 2037251 2064791 2093757 2122929 2152275
58282 2152275 2183132 2216155 2250470 2285244 2320688 2357112 2394419 2433017 2473905 2517323 2562524
58271 2562524 2609255 2658105 2709094 2761455 2815226 2871618 2931314 2993874 3059051 3127161 3197865
58260 3197865 3270374 3345190 3423771 3505988 3589820 3674002 3758947 3844670 3930147 4015534 4102765
58249 4102765 4193062 4286089 4382405 4484267 4592890 4707307 4827156 4954271 5090240 5234771
58239E234771J52945J62604J72831J82179J91863K04016K17677K30657K44037
58230F993580K60504K79470K98448L18001L40527L65529L91219M19406M53289
58221A0119973M91825N32148N76144O28341O88840P55214Q30112R19622J025439
58212A6567658J146724J288690J461308J671161J923849K232301K611311L064399
58204C1967401L587835M187537M880011N677160O582258P596609Q710760R888454
58196H3078025J1078900J2247634J3380526J4469123J5529460J6638856J7919558
58189A84342082J9484713K1424696K3760709K6179546K7665037K6574783K1509856
58182C50941422J2442809J053535j0127338j9027203k4753371k7452173k7796574
$$ plain form
58239 5234771 5387716 5550320 5723151 5905330 6097193 6301209 6518886 6749543 6993580
58230 6993580 7254084 7533554 7832002 8150003 8490530 8856059 9247278 9666684 10119973
58221 10119973 10611798 11143946 11720090 12348431 13037271 13792485 14622597 15542219 16567658
58212 16567658 17714382 19003072 20464380 22135541 24059390 26291691 28903002 31967401
58204 31967401 35555236 39742773 44622784 50299944 56882202 64478811 73189571 83078025
58196 83078025 94156925 106404559 119785085 134254208 149783668 166422524 184342082
58189 184342082 203826795 225251491 249012200 275191746 302856783 329431566 350941422
58182 350941422 363384231 364437766 354310428 335283225 310529854 283077681 255281107
58175B55281107k6582321k4501010k2017204j9373363j6699587j4076820j1504270
58168A20526532q936392o479711m527803l569453l782629m829872o071343o968599
58160G5360730p312705p170009o711372o096412n438529m803053m215826l681733
58152B9931091l201521k774954k397899k065216j775585j529209j322217j147591
58144A3716899j000806q80620p84264p05627o39260n83392n37557m99538m66162
58135G619673m35343m05841l76426l46856l18550k92715k68660k45153k22392
58126D707737k01449j82930j67665j57477j53131j52100j50300j45905j39984
58117C256796j33789j27264j20118j12650j05160r7723r0722q4669p9389p4313
$$ plain form
58175 255281107 228698786 204197776 182180572 162807209 146107622 132030802 120526532
58168 120526532 111590140 105110429 100582626 97013173 93230544 88400672 82329329 75360730
58160 75360730 68048025 60878016 54166644 48070232 42631703 37828650 33612824 29931091
58152 29931091 26729570 23954616 21556717 19491501 17715916 16186707 14864490 13716899
58144 13716899 12716093 11835473 11051209 10345582 9706322 9122930 8585373 8085835 7619673
58135 7619673 7184330 6778489 6402063 6055207 5736657 5443942 5175282 4930129 4707737
58126 4707737 4506288 4323358 4155693 3998216 3845085 3692985 3542685 3396780 3256796
58117 3256796 3123007 2995743 2875625 2762975 2657815 2560092 2469370 2384701 2305312 2230999
58107B230999o9408o4991o0989n7362n4829n3851n3331n1686m8992m6676m5234
58096A623650m3737m1665l9608l7881l5840l3152l0516k8505k6683k4542k2480
58085A259041k1180k0570j9980j9048j8108j7869j8768k0411k1725k2038k1798
58074A037546k1798k1953k1546k0482j9426j8785j8240j7440j6500j5677j5051
58063H30648j4591j4128j3322j2054j0763r927r367q617p846p751q595r795j0545
58050F93347j0423r544q477p951q221q818r096q874q273p373o362n625n317n209
58036E83784n278n844o772p167o504n406m842n060n898p265q682r140q384p546
58022D89996p578p819p198o071n486n320m665l671l392l942m267l809l070k486
$$ plain form
58107 2230999 2161591 2096600 2035611 1978249 1923420 1869569 1816238 1764552 1715560 1668884 1623650
58096 1623650 1579913 1538248 1498640 1460759 1424919 1391767 1361251 1332746 1306063 1281521 1259041
58085 1259041 1237861 1217291 1197311 1178263 1160155 1142286 1123518 1103107 1081382 1059344 1037546
58074 1037546 1015748 993795 972249 951767 932341 913556 895316 877876 861376 845699 830648
58063 830648 816057 801929 788607 776553 765790 755863 746496 737879 730033 722282 713687 703892 693347
58050 693347 682924 673380 664903 656952 648731 639913 630817 621943 613670 606297 599935 594310 588993 583784
58036 583784 578506 572662 565890 558723 552219 546813 541971 536911 531013 523748 515066 505926 497542 489996
58022 489996 482418 474599 467401 461330 455844 450524 445859 442188 438796 434854 430587 426778 423708 421222
58008D21222k006j774k046k302j707n27J27P6K68J036J536J295J036J395K011
57993D19640K388K686L048L024K277J200L08k51l42J95R36J054M83Q9L06N24J86
57976D37751l69o78q77j162j250r83p13o78o62o90j206k134k595k205j766k052
57960D17731k673k925k946l185l377l099k782l181m082m519m070l198k442j991
57946C73261j903k018j775q00M22J086J201J477K175K785L010L359M397N899P224
57931C99800Q153Q941R609R657Q729P281O229N933N795N085L798K488J439M56
57917D83393p23k191l955n827p305p982q103q307q878r635j0396j0988j0982j0072
57903C78049q743p896p730p676p403p160o997o568n893n536n638n590n028m301
$$ plain form
58008 421222 419216 417442 415396 413094 411387 410860 410987 411063 411331 412367 413903 415198 416234 417629 419640
57993 419640 422028 424714 427762 430786 433063 434263 434571 434320 433978 434173 435109 436163 436646 436735 437041 437565 437751
57976 437751 437382 436704 435827 434665 433415 432432 431719 431041 430379 429689 428483 426349 423754 421549 419783 417731
57960 417731 415058 412133 409187 406002 402625 399526 396744 393563 389481 384962 380892 377694 375252 373261
57946 373261 371358 369340 367565 366765 367187 368273 369474 370951 373126 375911 378921 382280 386677 392576 399800
57931 399800 407953 416894 426503 436160 444889 452170 458399 464332 470127 475212 479010 481498 482937 483393
57917 483393 482670 480479 476524 470697 463392 455410 447307 439000 430122 420487 410091 399103 388121 378049
57903 378049 369306 361410 353680 346004 338601 331441 324444 317876 311983 306447 300809 295219 290191 285890
57889B85890l581k368n37J018J458J130Q88R37J105J592K547L274K918J768J030
57874B99069J265J816J735P40p34j933k268j807j224r70p79l23Q1k5m31n52k55
57857B93405L23J405L176M941N670N371N168N791O802P473P691P598P075O125
57843C68014N287N085N185M639L003R72k60j98M26M05p19k363l796m937o015o792
57827C67936o712n725m507l781l651l682l427k850k320k101j887j144J3P53O66
57812C27581M42R60K063K858K905K385J438J16j090j549j450j648k399l021l100
57797C26491l253m113n210n497m756l849l627m021m277l865l075k665k906l205
57783B72172k882k101j493j029k3J623K951L152K616K312K612L261M034M769N052
$$ plain form
57889 285890 282309 279941 279404 280422 281880 283010 283898 284835 285940 287532 290079 293353 296271 298039 299069
57874 299069 300334 302150 303885 304625 303891 301958 299690 297883 296659 295689 294910 294587 294668 294643 294212 293660 293405
57857 293405 293728 295133 298309 303250 308920 314291 319459 325250 332052 339525 347216 354814 361889 368014
57843 368014 373301 378386 383571 388210 391213 392185 391925 391727 392153 392558 391839 389476 385680 380743 374728 367936
57827 367936 361224 355499 350992 347211 343560 339878 336451 333601 331281 329180 327293 326149 326162 326915 327581
57812 327581 328023 328983 331046 333904 336809 339194 340632 340748 339658 338109 336659 335011 332612 329591 326491
57797 326491 323238 319125 313915 308418 303662 299813 296186 292165 287888 284023 280948 278283 275377 272172
57783 272172 269290 267189 265696 264667 264644 266267 269218 272370 274986 277298 279910 283171 287205 291974 297026
57768B97026M598L803L274K968K388J594J213J319J085r1j644k556k634k541k818
57753C06984l372l994m754n717o501o434n180l174j334l50j82k96l40m00o61j070
57737B63225j477j833k028j833j340j175j753k555k665k000j330r99m63O50J763
57722B44187K223K271K423K456J891J095R27J380J559J039L28j37m90p10m13K29
57706B60258L10m73j177r78m39n24j020r78k89K70M08O89J453K264K603K480K129
57689B66986J692J335J178J109J038J342K453M120N677P079Q971J1684J4838J8146
57675C47648K1838K5967K9942L3158L5664L7891M0244M3232M7593N3818O1596
57664G78591O9457P4198P0968N5691K8920l139l2440n4094o7573p4224p5167p1530
$$ plain form
57768 297026 301624 305427 308701 311669 314057 315651 316864 318183 319268 319177 317533 314977 312343 309802 306984
57753 306984 303612 299618 294864 289147 282646 276212 271032 267858 266524 266174 265992 265696 265356 264956 264295 263225
57737 263225 261748 259915 257887 256054 254714 253539 251786 249231 246566 244566 243236 242237 241774 242424 244187
57722 244187 246410 248681 251104 253560 255451 256546 257473 258853 260412 261451 261779 261642 261152 260442 260029 260258
57706 260258 260568 260095 258918 257940 257501 256977 255957 254979 254690 254960 255368 256057 257510 259774 262377 264857 266986
57689 266986 268678 270013 271191 272300 273338 274680 277133 281253 286930 294009 302980 314664 329502 347648
57675 347648 369486 395453 425395 458553 494217 532108 572352 615584 663177 716995 778591
57664 778591 848048 922246 993214 1048905 1077825 1074686 1042246 988152 920579 846355 771188 699658
57652F99658o5069n7586n0086m2922l6358l0634k5747k1470j7551j3870j0579
57641C27786q085o550n532m474l526l325l850m104l268j730n49k37m99q49r61
57626B80247o60q6J40n04j586k021j428o95q47j684k122j638q39n44p70r52q41
57609B63170q32j388k343k881k293p14R09J706J603J085M46l12j013j274j118
57594B54751j077j426j707j463j006j027j622k239k468k318j887j258p47p12j034
57579B32760j200r71n60k25j77p75k108l336l277j944p67q05j441j472q67n66
57563B12269q79j041l94O69J192O67m95j251p77O61J802J710Q78O08J468K804
57547B19891L646L596K851J866J102P42N99N47Q53J638K280K046J217Q74J355
$$ plain form
57652 699658 634589 577003 526917 483995 447637 417003 391256 369786 352235 338365 327786
57641 327786 319701 313151 307619 303145 299619 296294 292444 288340 285072 283342 282793 282556 282057 281208 280247
57626 280247 279587 279501 279641 279137 277551 275530 274102 273407 272560 270876 268754 267116 266277 265733 264963 264011 263170
57609 263170 262338 260950 258607 255726 253433 252719 253628 255334 256937 258022 258468 258156 257143 255869 254751
57594 254751 253674 252248 250541 249078 248072 247045 245423 243184 240716 238398 236511 235253 234506 233794 232760
57579 232760 231560 230589 230029 229804 229627 228852 226744 223408 220131 218187 217420 216615 215174 213702 212835 212269
57563 212269 211390 210349 209955 210624 211816 212483 211988 210737 209960 210621 212423 214133 215011 215619 217087 219891
57547 219891 223537 227133 229984 231850 232952 233694 234293 234840 235693 237331 239611 241657 242874 243748 245103
57532B45103J772J312L51k18j50K12P53J626K668L285L056K191J402J361K104
57517B66828K910L043K684K627L054L246K787K342K600L081K854K016J605K121
57503C03798K992L542L672L454K835J984J345J015N77j72q47j090j113j251j387
57488C19354j215p46j93L85R08J038N62j59n07k88K05O80J066J352J530J666J767
57471C27405J673J270P87N76O80Q82J145J683K551L410L763L351K385J465J135
57456C54161J383J727J907K217K868L400L205K485K085K374K823K798K355K002
57442C87790K099K607L199L467L291L092L400M120M565M367L921L730L723L493
57428D36864K937K334K003K121K672L347L687L544L233L069K968K691K275J982
$$ plain form
57532 245103 246875 248187 248538 248320 248170 248382 249135 250761 253429 256714 259770 261961 263363 264724 266828
57517 266828 269738 272781 275465 278092 281146 284392 287179 289521 292121 295202 298056 300072 301677 303798
57503 303798 306790 310332 314004 317458 320293 322277 323622 324637 325214 325042 324195 323105 321992 320741 319354
57488 319354 318139 317393 317200 317585 318493 319531 320093 319934 319427 319139 319344 320024 321090 322442 323972 325638 327405
57471 327405 329078 330348 331135 331711 332391 333273 334418 336101 338652 342062 345825 349176 351561 353026 354161
57456 354161 355544 357271 359178 361395 364263 367663 370868 373353 375438 377812 380635 383433 385788 387790
57442 387790 389889 392496 395695 399162 402453 405545 408945 413065 417630 421997 425918 429648 433371 436864
57428 436864 439801 442135 444138 446259 448931 452278 455965 459509 462742 465811 468779 471470 473745 475727
57414D75727J997K308K686K757K412K212K893M265N210N004M160L542L300L214
57400E21687L433M113M764M870M835N445O532P149O941O483O194N834N261M816
57386E98357M727M843N192O050P191P812P545O927O488O125N654N311N189M868
57372F82279M183L763M215N205N945O184O145N940N639N592O038O619O784O527
57358G61058O290O396O901P686Q325Q302P751P525Q067Q748Q852Q651Q831R356
57344H72739R705R767R679R186Q155P310P531Q545R312R490R538R602R409R164
57330I99132R357R641R145Q091P825Q880J0138J0462J0102R849R811R775R957
57317A122165J0595J1304J1553J1361J1040J0742J0687J1213J2134J2619J2267
$$ plain form
57414 475727 477724 480032 482718 485475 487887 490099 492992 497257 502467 507471 511631 515173 518473 521687
57400 521687 525120 529233 533997 538867 543702 549147 555679 562828 569769 576252 582446 588280 593541 598357
57386 598357 603084 607927 613119 619169 626360 634172 641717 648644 655132 661257 666911 672222 677411 682279
57372 682279 686462 690225 694440 699645 705590 711774 717919 723859 729498 735090 741128 747747 754531 761058
57358 761058 767348 773744 780645 788331 796656 804958 812709 820234 828301 837049 845901 854552 863383 872739
57344 872739 882444 892211 901890 911076 919231 926541 934072 942617 951929 961419 970957 980559 989968 999132
57330 999132 1008489 1018130 1027275 1035366 1043191 1052071 1062209 1072671 1082773 1092622 1102433 1112208 1122165
57317 1122165 1132760 1144064 1155617 1166978 1178018 1188760 1199447 1210660 1222794 1235413 1247680
57306A247680J1679J1543J1785J2141J2788J3733J4274J3924J3267J3127J3388
57295A389329J3472J3416J3624J4005J4240J4471J4798J4619J3519J2408J2567
57284A540468J3769J4607J4508J4224J4315J4425J4343J4466J4854J4897J4446
57273A699322J4240J4603J4767J4175J3610J4120J5423J6357J6510J6489J6766
57262A866382J7097J7184J7187J7383J7677J7703J7273J6582J6103J6158J6558
57251B053287J6750J6448J6007J6063J6805J7727J8059J7467J6400J5568J5118
57240B235699J4614J3929J3685J4330J5203J5280J4597J4135J4328J4650J4775
57229B395225J5164J6069J6850J6893J6547J6508J6761J6812J6505J6021J5398
$$ plain form
57306 1247680 1259359 1270902 1282687 1294828 1307616 1321349 1335623 1349547 1362814 1375941 1389329
57295 1389329 1402801 1416217 1429841 1443846 1458086 1472557 1487355 1501974 1515493 1527901 1540468
57284 1540468 1554237 1568844 1583352 1597576 1611891 1626316 1640659 1655125 1669979 1684876 1699322
57273 1699322 1713562 1728165 1742932 1757107 1770717 1784837 1800260 1816617 1833127 1849616 1866382
57262 1866382 1883479 1900663 1917850 1935233 1952910 1970613 1987886 2004468 2020571 2036729 2053287
57251 2053287 2070037 2086485 2102492 2118555 2135360 2153087 2171146 2188613 2205013 2220581 2235699
57240 2235699 2250313 2264242 2277927 2292257 2307460 2322740 2337337 2351472 2365800 2380450 2395225
57229 2395225 2410389 2426458 2443308 2460201 2476748 2493256 2510017 2526829 2543334 2559355 2574753
57218B574753J4716J4377J4530J4503J3599J2261J1647J2049J2482J1975J0614
57207B717506R133Q053P532P584Q041Q508Q709Q769R042R714J0609J1295J1399
57194B835894J0986J0614J0761J1282J1639J1564J1220J0742J0114R484R208R300
57182B962808R303Q873Q270P878P557O834N668M608M147M282M740N311N748N690
57168C051717N072M496M712N681O464O316N563N168N549O263O709O715O363N613
57154C132401M401K915J510L46p49k097l840n666o890p001o147m929l733k564
57140C097957j507q58n43K07K037M551O669P888Q670R482R898Q994O496L223L88
57125C163552j382k301k892l302l144j883P05M477R214J4865K1500K9031L7053
$$ plain form
57218 2574753 2589469 2603846 2618376 2632879 2646478 2658739 2670386 2682435 2694917 2706892 2717506
57207 2717506 2726639 2734692 2742224 2749808 2757849 2766357 2775066 2783835 2792877 2802591 2813200 2824495 2835894
57194 2835894 2846880 2857494 2868255 2879537 2891176 2902740 2913960 2924702 2934816 2944300 2953508 2962808
57182 2962808 2972111 2980984 2989254 2997132 3004689 3011523 3017191 3021799 3025946 3030228 3034968 3040279 3046027 3051717
57168 3051717 3056789 3061285 3065997 3071678 3078142 3084458 3090021 3095189 3100738 3107001 3113710 3120425 3126788 3132401
57154 3132401 3136802 3139717 3141227 3141573 3140824 3138727 3134887 3129221 3122331 3115330 3109183 3104254 3100521 3097957
57140 3097957 3096450 3095592 3095049 3095256 3097293 3101844 3108513 3116401 3125071 3134553 3144451 3153445 3159941 3163164 3163552
57125 3163552 3162170 3159869 3156977 3153675 3150531 3148648 3149353 3153830 3163044 3177909 3199409 3228440 3265493
57112C265493M5093N3120O1844P2585Q6797J05763J30525J61958K00872K47973
57102D432023L03502L66670M35566N08095N83207O61242P42992Q28374R15833
57093I777504J002718J086312J165146J240128J314869J395008J486788J595180
57085B0063653J720988J856131J978589K052048K035280J899418J642473J290163
57077C4538743Q82795M58659M4142l47431p11358j044595j340247j588617j784461
57068B9107630j931221k034845k093719k098231k041866j930906j782371j614843
57060A3579628j442536j275036j118312r75220q46915p34313o37567n54917m83779
57051E511033m22762l71378l28224k91137k59084k32340k10557j92149j75876
$$ plain form
57112 3265493 3310586 3363706 3425550 3498135 3584932 3690695 3821220 3983178 4184050 4432023
57102 4432023 4735525 5102195 5537761 6045856 6629063 7290305 8033297 8861671 9777504
57093 9777504 10780222 11866534 13031680 14271808 15586677 16981685 18468473 20063653
57085 20063653 21784641 23640772 25619361 27671409 29706689 31606107 33248580 34538743
57077 34538743 35421538 35880197 35924339 35576908 34865550 33820955 32480708 30892091 29107630
57068 29107630 27176409 25141564 23047845 20949614 18907748 16976842 15194471 13579628
57060 13579628 12137092 10862056 9743744 8768524 7921609 7187296 6549729 5994812 5511033
57051 5511033 5088271 4716893 4388669 4097532 3838448 3606108 3395551 3203402 3027526
57042C027526j61713j49670j38970j28916j19598j11205j03449r6165q9655q4014
57032A844171p8836p3853o9185o4705n9939n4884n0016m5242l9695l2873k5043
57021A249900j6444p189J964J0090J7799K6751L6968M6839N6998P1234R0082J04405
57009A689397R9628O8269J7373l6792p9820j05535j15261j14235j08286j01325
56999A213413r4453q7164p9141p0665o2003n3310m5036l7793l1764k6671k2257
56988F03156j8463j5226j2466j0240q577p242o015n169n331o730q851j0871j2286
56975D75689j3079j3520j3853j4016j3631j2428j0678q962p515o062m406k757
56963C54782j237N25K806N046O347O782P450Q930J0230R753O981K669k256p148
$$ plain form
57042 3027526 2865813 2716143 2577173 2448257 2328659 2217454 2114005 2017840 1928185 1844171
57032 1844171 1765335 1691482 1622297 1557592 1497653 1442769 1392753 1347511 1307816 1274943 1249900
57021 1249900 1233456 1226267 1228231 1238321 1256120 1282871 1319839 1366678 1423676 1494910 1584992 1689397
57009 1689397 1789025 1857294 1874667 1837875 1758055 1652520 1537259 1423024 1314738 1213413
56999 1213413 1118960 1031796 952655 881990 819987 766677 721641 683848 652084 625413 603156
56988 603156 584693 569467 557001 546761 538184 530942 524927 519758 514427 507697 498846 487975 475689
56975 475689 462610 449090 435237 421221 407590 395162 384484 375522 368007 361945 357539 354782
56963 354782 353545 354070 356876 361922 368269 375051 382501 391431 401661 411414 418395 421064 418808 411660
56949D11660j1089j2905j2299j0548r399r330r289q058n540k671l59J247K596
56936C24016M146N985P982J0015J2043J4038J5917J7252J6995J3907P770M5p143
56923D42968j2680j6700j9426k0500j9770j8038j6403j5175j3893j2215j0401
56912B67767q944q085p639p058n826m054k546k012k253k393j864q78J3N71J033
56897B15832J838L138M546N403N475N259N435O119O860P322P722Q576J0079J1657
56883C05261J2162J0747P682M087P40k434n444p389p251n293k930j103N19K629
56869C11983N222P826J0249J2573J4746J6701J8708K1184K4168K7298L0169L2282
56857E33109L2560K9443K1983J1023q69j0859j7432k0749k1708k0873j8422j4659
$$ plain form
56949 411660 400571 387666 375367 364819 355420 346090 336801 328743 323203 320532 320173 321420 324016
56936 324016 328162 334147 342129 352144 364187 378225 394142 411394 428389 442296 450066 450111 442968
56923 442968 430288 413588 394162 373662 353892 335854 319451 304276 290383 278168 267767
56912 267767 258823 250738 243099 236041 230215 226161 223615 221603 219350 216957 215093 214215 214228 214799 215832
56897 215832 217670 220808 225354 230757 236232 241491 246926 253045 259905 267227 274949 283525 293604 305261
56883 305261 317423 328170 335852 339939 340679 338245 332801 325412 318161 312868 309938 308835 309354 311983
56869 311983 317205 325031 335280 347853 362599 379300 398008 419192 443360 470658 500827 533109
56857 533109 565669 595112 617095 628118 627249 616390 598958 578209 556501 535628 517206 502547
56845E02547j0160n318j83N190J0506J5512K0198K4524K8245L1403L4772L9368
56833F96604M5276N0930N3443M9701L8014J9580j628k1031l5915m5795n0962n1585
56821G46632m8322m2770l6545l0288k3979j7692j1476n065J524P390J1708J5074
56809E66191J9014K4062K9174L3037L4850L3463K7034J4717j555j7860l0780l8878
56797F92469m2398m2431m0269l6849l2552k7704k2901j8488j4179r730n641k409
56785C96918M95L967P728J0567J2213J3742J5645J6421J3905P489j474j0893j8974
56772D67749k4558k7413k8202k7702k6182k3795k1163j8948j7092j5109j3063
56761B24522j1552j0734r968q653o986n600m800m384m026l583l121k847k906l189
$$ plain form
56845 502547 492387 487069 486886 492076 502582 518094 538292 562816 591061 622464 657236 696604
56833 696604 741880 792810 846253 895954 933968 953548 951920 930889 894974 849179 798217 746632
56821 746632 698310 655540 618995 588707 564728 547036 535560 530495 532019 539409 551117 566191
56809 566191 585205 609267 638441 671478 706328 739791 766825 781542 779987 762127 731347 692469
56797 692469 650071 607640 567371 530522 497970 470266 447365 428877 414698 404968 399327 396918
56785 396918 397413 401380 409108 419675 431888 445630 461275 477696 491601 499090 497616 486723 467749
56772 467749 443191 415778 387576 359874 333692 309897 288734 269786 252694 237585 224522
56761 224522 212970 202236 192268 183615 176629 171029 166229 161845 157819 154236 151115 148268 145362 142173
56747A42173l474l710m025m362m336l694k670j720r50j75N08O00r8r93j257p71
56731A11046j35K13M05O42P46N25J36k24o23j037j070n33M0P5p5M27J510K109
56713A14177J586N60OR7L80N85Q20J230J757K078J707N11p25q56K41J361J408
56696A26923O23r1m64p59q25k36O98R30J7j122j233j82J011J442J257J201J526
56679A30716J738J456J051J027J087N38m73r20l72L38L45mJ34P16R53N51J9j48
56661A38752J43Q77J905K598K291J233M65N90J111J288J121J155J684K448K933
56646A60594K770K023J144N55K77J42K31O69J151J162O91K70J88K39K81M77O90
56629A73554L55o01j239p12M62R84M59k21k14J95J59n58j361j549r95k05J16l14
$$ plain form
56747 142173 138699 134989 130964 126602 122266 118572 115902 114182 113232 113057 113565 114165 114067 113074 111817 111046
56731 111046 110911 111124 111529 112171 112917 113442 113578 113354 112731 111694 110624 110091 110131 110206 110131 110558 112068 114177
56713 114177 115763 116323 116329 116426 116806 117391 118211 119441 121198 123276 124983 125494 124769 123913 124154 125515 126923
56696 126923 127546 127455 126991 126232 125407 125171 125869 126799 126816 125694 124461 124279 125290 126732 127989 129190 130716
56679 130716 132454 133910 134961 135988 137075 137613 137140 136220 135848 136186 136531 136527 136661 137377 138330 138881 138900 138752
56661 138752 138895 139772 141677 144275 146566 147799 148264 148854 149965 151253 152374 153529 155213 157661 160594
56646 160594 163364 165387 166531 167086 167363 167505 167736 168405 169556 170718 171409 171679 171867 172106 172387 172864 173554
56629 173554 173909 173308 172069 171357 171819 172803 173262 173041 172827 173022 173181 172623 171262 169713 168718 168513 168629 168315
56611A68315j031j232o43K26P24P73O41L68j23n11l15K43K01r11k245k613j982
56594A59885j379j410j510q73M38J623K040J704J081P37R43J447J682J411R89
56579A68808Q85J146J523J912K330K587K353J649J026J080J845K722L042K705
56565A95613K287K432L194M060M576M801N102N688O446P098P348O987N971M504
56551B66107K972J739Q52L7q22j268p49M04R72K31j083j705j440j159j449k034
56535B61605k501k867l217l443l564l756l976m003l969m207m510m255l475k984
56521B10878l145l250k666j845j573j826k063k176k454k815k837k406j836j383
56507A78603r80m31L18R59Q94l8r53o89O23J521J124K34J0L71N07K73J34J47k3
$$ plain form
56611 168315 167284 166052 165409 165635 166359 167132 167773 168141 168018 167507 167192 167435 167636 166725 164480 161867 159885
56594 159885 158506 157096 155586 154713 155151 156774 158814 160518 161599 162336 163279 164726 166408 167819 168808
56579 168808 169693 170839 172362 174274 176604 179191 181544 183193 184219 185299 187144 189866 192908 195613
56565 195613 197900 200332 203526 207586 212162 216963 222065 227753 234199 241297 248645 255632 261603 266107
56551 266107 269079 270818 271670 271707 270885 269617 268868 269272 270244 270475 269392 267687 266247 265088 263639 261605
56535 261605 259104 256237 253020 249577 246013 242257 238281 234278 230309 226102 221592 217337 213862 210878
56521 210878 207733 204483 201817 199972 198399 196573 194510 192334 189880 187065 184228 181822 179986 178603
56507 178603 177623 177192 177510 178469 179363 179325 178372 177683 178306 179827 180951 181185 181195 181566 182073 182346 182480 182627 182604
56488A82604l08l68l18n47r18q63k33N42J080J289J137P11L65L08K37j40m49j04
56470A84025Q34J732K165K092J547P71L02L89N53L33J33O18J538J945J434M93
56454B00904k50m75j4R93J889K036J544R56M98J38Q4N29J079J210J111J418K235
56437B15885L012L228K698J495J00p40q94j060j517j403j48J138R73k92j006o08
56421B20861q0j17k95j70P4K78M54J98r29k299k672j903j092q24m84L72J185J279
56403B13836O97j96j023j147j91J092J456Q17K29J42K6k11P0P74Q84K52O6Q42
56385B18415J530J440J525K588L587L164J811J077J338J730J755J635J422R26
56371B43943L90K60M38M88M29N60P99Q29P06P31Q97R67Q33M25m08j404j784j140
$$ plain form
56488 182604 182296 181928 181610 181063 180145 179282 179049 179591 180671 181960 183097 183808 184173 184481 184718 184578 184129 184025
56470 184025 184859 186591 188756 190848 192395 193166 193468 193857 194410 194743 194876 195494 197032 198977 200411 200904
56454 200904 200654 200179 200165 201158 203047 205083 206627 207583 208081 208219 208303 208832 209911 211121 212232 213650 215885
56437 215885 218897 222125 224823 226318 226418 225678 224784 223724 222207 220804 220656 221794 222767 222475 221469 220861
56421 220861 220781 220664 220369 220199 220273 220551 221005 221203 220274 217975 215303 213400 212308 211484 211000 211372 212557 213836
56403 213836 214533 214337 213314 212167 211976 213068 214524 215341 215570 215712 215738 215527 215597 216371 217255 217507 217573 218415
56385 218415 219945 221385 222910 225498 229085 232249 234060 235137 236475 238205 239960 241595 243017 243943
56371 243943 244333 244593 245031 245519 245948 246508 247307 248136 248842 249573 250470 251437 252270 252695 252287 250883 249099 247959
56353B47959r4M61M36M13O89J009J075Q67N50K72km62r95r49J22J543K100J507
56335B56501O00P4n6K39J164K262K544J931J506J921K488K464K163K113K124J952
56319B81990K004K506K775K178J157N03K32Om4K89O53P30R18J631K460K802K828
56302C05618K984L038K503J678J413J984K840L335L252K721K069J540R88J91n11
56287C35643m45L52J078J349J598K027K101J564J083J317K081K903L641M105L953
56272C64350L435L325L745L970L821M083N006N700N701N916P104Q584R467R980
56258D44187J0655J1253J1612J2465J4252J6127J7329J8559K0739K3346K5302
56247F25826K6677K8215K9940L1578L3558L6211L8656L9822L9967L9860L9198
$$ plain form
56353 247959 247865 248326 248762 249175 249864 250873 251948 252815 253365 253637 253635 253173 252178 251229 251351 252894 254994 256501
56335 256501 257101 257175 257119 257358 258522 260784 263328 265259 266765 268686 271174 273638 275801 277914 280038 281990
56319 281990 283994 286500 289275 291453 292610 293113 293345 293351 293307 293596 294249 294979 295897 297528 299988 302790 305618
56302 305618 308602 311640 314143 315821 317234 319218 322058 325393 328645 331366 333435 334975 335963 336154 335643
56287 335643 335198 335550 336628 337977 339575 341602 343703 345267 346350 347667 349748 352651 356292 360397 364350
56272 364350 367785 371110 374855 378825 382646 386729 391735 397435 403136 409052 416156 424740 434207 444187
56258 444187 454842 466095 477707 490172 504424 520551 537880 556439 577178 600524 625826
56247 625826 652503 680718 710658 742236 775794 812005 850661 890483 930450 970310 1009508
56236A009508L7188L4097L0737K6957K2069J6287J0351M233k380q691j3476j6915
56224A149965k0336k4249k7859l0375l1722l2057l1645l1014l0381k9287k7576
56213H33464k6052k5259k4424k2787k1093k0359j9916j8312j5693j3588j2618
56202F13363j1962j0956r755q476p010n690n006m688m074l190k495j963j318p37
56188E36043l41L74J579K268J579K80k86p0J26J36J40k25r84r45O48K438K725
56171E45485K015J894K189J551K88J20J278K211K288K570L641M735N453O435P878
56156E90031Q947R171R013Q795Q451Q398R370J1215J3113J4890J6877J8745K0001
56143G47017K1334K3886K7399L0639L3453L6768M0809M5017M9503N4871O0797
$$ plain form
56236 1009508 1046696 1080793 1111530 1138487 1160556 1176843 1187194 1191427 1189047 1180356 1166880 1149965
56224 1149965 1129629 1105380 1077521 1047146 1015424 983367 951722 920708 890327 861040 833464
56213 833464 807412 782153 757729 734942 713849 693490 673574 655262 639569 625981 613363
56202 613363 601401 590445 580690 572214 565204 559514 554508 549820 545746 542556 540061 538098 536780 536043
56188 536043 535702 536076 537655 539923 541502 541782 541496 541426 541552 541688 541828 541603 540619 539674 540322 542760 545485
56171 545485 547500 549394 551583 553134 553422 553542 554820 557031 559319 561889 565530 570265 575718 582153 590031
56156 590031 598978 608149 617162 625957 634408 642806 652176 663391 676504 691394 708271 727016 747017
56143 747017 768351 792237 819636 850275 883728 920496 961305 1006322 1055825 1110696 1171493
56132A171493O6573P2798Q0688Q9848R8495J05607J10859J12733J08971R9288
56122B117353Q5992P1887N9126M9579M3941M0262L5296K7522J7473N750p032j8793
56110B528356k7080l1846l5100l8112m1238m6118n5003o7460q0137r0229r6946
56099A919087r9723r7800r2108q4940p7133o7857n7554m8399m1282l4859k8337
56088A189095k2766j8761j5303j1631q185n034j525J974M126M954N928P364Q060
56075A138296P890Q248R441J0129R927J0029J0774J1151J1210J2227J3973J4621
56063A267916J4044J4335J6252J7997J8383J8421J8810J8638J7581J6816J6827
56052A456020J6748J6570J7333J8616J8693J7730J7770J9071J9680J9333K0226
$$ plain form
56132 1171493 1238066 1310864 1391552 1481400 1579895 1685502 1796361 1909094 2018065 2117353
56122 2117353 2203345 2275232 2334358 2383937 2427878 2468140 2503436 2530958 2548431 2554181 2547149 2528356
56110 2528356 2501276 2469430 2434330 2396218 2354980 2308862 2253859 2186399 2106262 2016033 1919087
56099 1919087 1819364 1721564 1629456 1544516 1467383 1399526 1341972 1293573 1252291 1217432 1189095
56088 1189095 1166329 1147568 1132265 1120634 1112449 1107415 1105890 1107864 1111990 1116944 1122872 1130236 1138296
56075 1138296 1146186 1154434 1163875 1174004 1183931 1193960 1204734 1215885 1227095 1239322 1253295 1267916
56063 1267916 1281960 1296295 1312547 1330544 1348927 1367348 1386158 1404796 1422377 1439193 1456020
56052 1456020 1472768 1489338 1506671 1525287 1543980 1561710 1579480 1598551 1618231 1637564 1657790
56041A657790K3005K5503K6525K7426K8890K9666K9647L0697L3126L4890L5402
56030A982567L6608L9124M1107M2115M4139M7476M9668N0044N1099N3827N5999
56019B493773N6826N8877O3292O7390O9320P0868P3526P5962P7642Q0637Q5624
56008C273737R0256R3613R7914J03870J09001J12638J17686J25207J32385J38157
55998D394464J45449J55376J64745J72112J80606J92011K03831K15066K28768
55989F052428K45863K62862K78759K97528L20619L44227L67417L95146M29455
55980H994304M65910N03158N47338O02105O63329P29127Q05916Q98800J005781
55971A5215768J128017J276244J460551J684408J955233K288505K692917L163700
$$ plain form
56041 1657790 1680795 1706298 1732823 1760249 1789139 1818805 1848452 1879149 1912275 1947165 1982567
56030 1982567 2019175 2058299 2099406 2141521 2185660 2233136 2282804 2332848 2383947 2437774 2493773
56019 2493773 2550599 2609476 2672768 2740158 2809478 2880346 2953872 3029834 3107476 3188113 3273737
56008 3273737 3363993 3457606 3555520 3659390 3768391 3881029 3998715 4123922 4256307 4394464
55998 4394464 4539913 4695289 4860034 5032146 5212752 5404763 5608594 5823660 6052428
55989 6052428 6298291 6561153 6839912 7137440 7458059 7802286 8169703 8564849 8994304
55980 8994304 9460214 9963372 10510710 11112815 11776144 12505271 13311187 14209987 15215768
55971 15215768 16343785 17620029 19080580 20764988 22720221 25008726 27701643 30865343
55963C0865343L699836M315839N027911N841618O759949P783440Q888363J0022171
55955H3204470J1134874J2201024J3209634J4171204J5157327J6300141J7727835
55948A83106509J9524682K1715347K4090378K5854145K5539034K1653328J3780850
55941C35264273L159079p882406j7153909k3494652k6833927k7741914k6979901
55934B08336643k5239965k3028072k0651217j8281072j6019181j3916998j1987024
55927G9213114j0236147q685274p349185o216389n263104m471971l824748l292045
55919B9874251k845617k471493k160785j898262j670416j474912j311677j172782
55911A4868307j049851r43076q54077p77368p07059o44875n93507n48615n05064
$$ plain form
55963 30865343 34565179 38881018 43908929 49750547 56510496 64293936 73182299 83204470
55955 83204470 94339344 106540368 119750002 133921206 149078533 165378674 183106509
55948 183106509 202631191 224346538 248436916 274291061 299830095 321483423 335264273
55941 335264273 338423352 330540946 313387037 289892385 263058458 235316544 208336643
55934 208336643 183096678 160068606 139417389 121136317 105117136 91200138 79213114
55927 79213114 68976967 60291693 52942508 46726119 41463015 36991044 33166296 29874251
55919 29874251 27028634 24557141 22396356 20498094 18827678 17352766 16041089 14868307
55911 14868307 13818456 12875380 12021303 11243935 10536876 9892001 9298494 8749879 8244815
55902H244815m64826m31356m01753l71677l42791l18436k96681k74214k52659
55893E090422k34832k18868k01873j85531j72351j60140j45685j30474j17539
55884C523129j05945r3392q1169p1512o2938n2898m2484l4045k6627j8100r548
55873B924471l725j378k514q705k0430l4592m8191o2075p7684r2655j03311j09235
55861B359976j11912j11106j06136r8823r1663q4647p6809o9114o2956n7611n1951
55850A437248m6889m3573m1039l8167l5853l4764l3246l0131k7345k6841k7107
55839A052293k5686k3133k1439k0474j9041j7690j7426j7196j5717j4233j4487
55828H45771j5379j4669j2741j1769j2146j2571j2735j3214j3517j2727j1398
$$ plain form
55902 8244815 7779989 7348633 6946880 6575203 6232412 5913976 5617295 5343081 5090422
55893 5090422 4855590 4636722 4434849 4249318 4076967 3916827 3771142 3640668 3523129
55884 3523129 3417184 3323792 3242623 3171111 3108173 3055275 3012791 2978746 2952119 2934019 2924471
55873 2924471 2920746 2919368 2916854 2908149 2887719 2853127 2804936 2742861 2665177 2572522 2469211 2359976
55861 2359976 2248064 2136958 2030822 1931999 1840336 1755689 1678880 1609766 1546810 1489199 1437248
55850 1437248 1390359 1346786 1305747 1267580 1231727 1196963 1163717 1133586 1106241 1079400 1052293
55839 1052293 1026607 1003474 982035 961561 942520 924830 907404 890208 874491 860258 845771
55828 845771 830392 815723 802982 791213 779067 766496 753761 740547 727030 714303 702905
55817G02905j0604j0028q911p904p822p779o587m960m213l929l017j874j404j005
55803F22868K76J726K254K581M016O009O927O389M980K777P5j726j923k107l933
55788F51189o623q600j0101j1911j2952j1759r243p498o824o383o682q636j1014
55775E32963j1600j0380r056p939o020l601k108j360L04L054N016M950L382J000
55761D98605k071n166p178q057q677r211r159q869r263j0133j0374r947r905j0449
55747C80146j0605r952r206q821q440p873p400o937o026m755l720l104k646k306
55733B88355k110j674q04r2n0k55k84o97j974l241l398k755k306k104j751j645
55717B63215k225k696k104j042o79p84l35N43R99J234K059L138L422K938K425
$$ plain form
55817 702905 692301 682273 673362 665458 657636 649857 643270 638310 634097 630168 627151 625277 623873 622868
55803 622868 623144 624870 627124 629705 633721 639730 646657 653046 658026 660803 660878 659152 657229 655122 651189
55788 651189 644566 635966 625865 613954 601002 589243 580000 572502 565678 559295 552613 543977 532963
55775 532963 521363 510983 501927 493988 487968 484367 482259 480899 481203 484257 489273 494223 497605 498605
55761 498605 496534 491368 484190 476133 467456 458245 449086 440217 430954 420821 410447 400500 390595 380146
55747 380146 369541 359589 350383 341562 333122 325249 317849 310912 304886 300131 296411 293307 290661 288355
55733 288355 286245 284571 283767 283675 283625 283370 283086 282389 280415 277174 273776 271021 268715 266611 264860 263215
55717 263215 260990 258294 256190 255148 254469 253685 253350 253893 254892 256126 258185 261323 264745 267683 270108
55702B70108J686L7j989l253l981n199o527o553n287m275m210m338m215m185m021
55687B13798k992j526r80j454j549o16M20Q46J049J312J242Q78Q17Q52M6j478
55671B10665k323j952j493j873k565k844k894k914k376j010M85J410J908K277
55657A94501K414K429K901L903M608M421L830L624L939M391M547L968K451M88
55643B42415j109k170l108m011m559m880n510o369o701o255n667n430n230m592
55629A76824l522k351j462j193j497j768j595j374j514j541q86j63l63j152j279
55614A55164n54k0j49l41l29o39j278j371n91J76J84k38n74r26j391j548j169
55597A44406o82m76l79k09j55l32n91r34j433j661j025J78R38R06P12P05M62j44
$$ plain form
55702 270108 271794 271831 269842 266589 262608 257409 250882 244329 239042 234767 230557 226219 222004 217819 213798
55687 213798 210806 209280 208300 206846 205297 204681 205101 205947 206996 208308 209550 210428 211245 212097 212143 210665
55671 210665 208342 206390 204897 203024 200459 197615 194721 191807 189431 188421 188906 190316 192224 194501
55657 194501 196915 199344 202245 206148 210756 215177 219007 222631 226570 230961 235508 239476 241927 242415
55643 242415 241306 239136 236028 232017 227458 222578 217068 210699 203998 197743 192076 186646 181416 176824
55629 176824 173302 170951 169489 168296 166799 165031 163436 162062 160548 159007 158121 157958 157595 156443 155164
55614 155164 154610 154590 154441 154100 153771 153132 151854 150483 149892 150068 150252 150014 149440 148514 147123 145575 144406
55597 144406 143724 143248 142869 142660 142505 142173 141582 140648 139215 137554 136529 136707 137645 138551 139263 139968 140430 140286
55579A40286m01J47R37J215J046J012J461K405L621M556M677M116L556L298L049
55564A74981K622K187J805J317Q33O39N41m7j285k752m095n184n784n780n638
55549A54360n873o178n851m886l809k743j639j092j611k328j872n43n9r18j656
55534A13302j175l23l06p99p13J36J016J350J079M67J7J33N14M49j57o32o02l96
55516A13360l24l38n49j165j770j639r54o61r66j126r06r84j460j371l20O65O82
55499A00174K56K00K74l3l36p4K84j47j214j811j228J32J176R55n20j971k003
55482I4114p07M94Q16R32J469J866J403M99J4%m0k35m63q17j233j137k83N50M61
55463I7703l60j016j126r45o35j51L07M04J70q1k54m45o04m87L7Q34J548J759
$$ plain form
55579 140286 139885 140032 140969 142184 143230 144242 145703 148108 151729 156285 160962 165078 168634 171932 174981
55564 174981 177603 179790 181595 182912 183745 184384 184925 184878 183593 180841 176746 171562 165778 159998 154360
55549 154360 148487 142309 136458 131572 127763 125020 123381 122289 120678 118350 116478 115935 115876 114958 113302
55534 113302 112127 111804 111498 110699 109986 110122 111138 112488 113567 114034 114051 114184 114698 115147 114990 114358 113756 113360
55516 113360 113036 112698 112149 110984 109214 107575 106621 105960 104994 103868 102962 101978 100518 99147 98827 99492 100174
55499 100174 100430 100630 100904 100871 100535 100461 100745 100598 99384 97573 96345 96477 97653 98608 98088 96117 94114
55482 94114 93407 93901 94717 95649 97118 98984 100387 100886 100900 100900 100860 100625 100162 99345 98112 96975 96692 97242 97703
55463 97703 97343 96327 95201 94256 93621 93470 93777 94181 94351 94270 94016 93571 92967 92480 92517 93351 94899 96658
55445I6658J383Q14L93j01r34j642j550r15n92o26k33P04J295J161J063J527J902
55428A00307J501P11K06j13n90r45p60k36K04O00J144J666J946J991J695Q45j15
55411A10057k18O31J247P93n5k71N7K45J86Q9k74j109j901k084j887j766j537
55394A02203r31m09m68o44k23M54M50k53p79p28o20q83j284j445j263p22J62J077
55376I3694J510J266O63K06J78L99M09L7k46k2K90Ln87n74n7k03j271j878j004
55357I2813M54J011N56j4l32o36q84q89q38q69o11L0L34j13m44K82J519K012J598
55338I4979J049O32Q8k88R1Q22Q19o3q24q99q38j166j536j403q45l32j18o6K04
55319I0306R82J964K309J612N07j63l87o20p99n25N9M00M10M14M52K76J9Q6M80
$$ plain form
55445 96658 98041 98855 99248 99147 98213 96571 95021 94106 93514 92888 92655 93359 94654 95815 96878 98405 100307
55428 100307 101808 102519 102725 102612 102022 101077 100317 100081 100285 100885 102029 103695 105641 107632 109327 110172 110057
55411 110057 109839 110470 111717 112510 112455 112184 112241 112486 112672 112761 112487 111378 109477 107393 105506 103740 102203
55394 102203 101272 100863 100395 99751 99528 99982 100432 100179 99400 98672 98052 97169 95885 94440 93177 92455 92617 93694
55376 93694 95204 96470 97133 97339 97517 97916 98325 98362 98116 98094 98384 98387 97800 97226 97169 96966 95695 93817 92813
55357 92813 93267 94278 94834 94820 94488 93852 92968 92079 91241 90372 89761 89791 90125 90012 89568 89850 91369 93381 94979
55338 94979 96028 96660 96748 96460 96551 97373 98192 98129 97305 96406 95568 94402 92866 91463 90618 90286 90168 90102 90306
55319 90306 91288 93252 95561 97173 97680 97517 97130 96510 95711 95186 95245 95645 96055 96469 96921 97197 97216 97302 97782
55300I7782P90Q67R06R90R58O56J1q68j392r05K09O13j51p85p3J212J432N03k73
55281A02482l58m33q09q84m47j93n07q19n54O5N92R45J139J061Q49Q81J183J331
55263A05524J046M66j63n63m08K41O66L03l96o71n98o94p25j31O18M33n35q39
55245A03574J22J178J046q0j157j520r98K68J491J646P74J61N61J074N33p00j267
55228A06706o79K63O92M69j62r68j600j614q86J40Q02P59K47j51m0M29P89Q24
55210A06020P47Q52J157J422J445J290J231J339J210M29p28j481j556j411j264
55195A10702o79M45J224Q68j57q90j220j567j663q58N47J363J029J69m38n93l52
55178A07930J53M48Q0o06q00l87o2k35n50o15m80k56%K9l49o11l4J157J943J917
$$ plain form
55300 97782 98572 99439 100345 101335 102293 102949 102960 102092 100700 99795 100004 100617 100466 99681 99608 100820 102252 102755 102482
55281 102482 102124 101691 100882 99998 99551 99358 98851 98032 97478 97543 98135 99080 100219 101280 102129 103010 104193 105524
55263 105524 106570 107036 106873 106310 105902 106143 106809 107112 106716 106045 105447 104753 104028 103897 104515 104948 104413 103574
55245 103574 103696 104874 105920 105840 104683 103163 102165 102433 103924 105570 106344 106505 107066 108140 108673 107973 106706
55228 106706 106027 106290 106982 107451 107289 106321 104721 103107 102221 102361 103163 103922 104169 104018 103978 104407 105196 106020
55210 106020 106767 107619 108776 110198 111643 112933 114164 115503 116713 117142 116414 114933 113377 111966 110702
55195 110702 110023 110468 111692 112560 112403 111513 110293 108726 107063 106205 106752 108115 109144 109313 108875 108282 107930
55178 107930 108083 108531 108611 108005 107205 106818 106756 106521 105971 105356 104876 104620 104620 104649 104300 103689 103655 104812 106755 108672
55158A08672J629J526J387J088R51J027Q54K57l84r15j616k338k331j437n57m61
55142A07352p68p31l31r7k66o49r21p44m4O15N32p3k14L71P51K54m55l70L77Q02
55122A05391M50k18n06p9Q86J759J869J197L74j34m54p35p13j58O85J410J777
55105A12801J560O44m97r59m93J97M40M33O13Q62Q38O23N48O79R44J336J601J149
55087A23319k19j728k278j534j31R70J192O89J86K16M91L84m5j51J34R1o06j305
55069A19675j390j167j201j384j283r00n27k42PJ42J76L23N63N25J09k53k93l31
55051A12549o14q02n52r3K12L78M59K41k51n10k95p7k37l80m2M65N78L52J91J35
55031A11707J6l7J25K85K93M55R03J094N93j34l98l53n55r36j005p92p14p06l45
$$ plain form
55158 108672 110301 111827 113214 114302 115253 116280 117134 117391 117007 116092 114476 112138 109807 108370 107813 107352
55142 107352 106584 105853 105522 105425 105159 104510 103589 102845 102801 103416 103948 103875 103661 104032 104783 105037 104582 104212 104589 105391
55122 105391 105841 105623 105117 105038 105924 107683 109552 110749 111123 110989 110535 109800 109087 108929 109614 111024 112801
55105 112801 114361 115005 114508 113549 113056 113253 113693 114126 114739 115601 116439 117062 117610 118289 119233 120569 122170 123319
55087 123319 123100 121372 119094 117560 117429 118399 119591 120280 120466 120682 121173 121557 121512 121361 121495 121586 120980 119675
55069 119675 118285 117118 115917 114533 113250 112350 111823 111581 111588 111730 111906 112229 112792 113317 113426 113173 112880 112549
55051 112549 111935 111133 110581 110488 110700 111078 111537 111778 111527 111017 110722 110645 110408 110028 109986 110451 111029 111381 111572 111707
55031 111707 111723 111686 111811 112096 112389 112844 113747 114841 115434 115300 114902 114549 113994 113058 112053 111261 110547 109841 109496
55012A09496K98P72J060J474J779J299N2j017j175o51r8K11L73M72N09N12N55
54995A15921O98R44J148J185J211J463J753J580R87O35P66O77r3q72q29l62m50
54978A26362j023j125n08L7J00K29P54R97L19p30r95j38J140K002K162J776J137
54961A32496N53J87m0l15o17o67k66L44O80N86M66P14J119J139O63J35n7N4K77
54942A37451L90J23n46j025o53L26J005J138J394K088K547K234J666J550J768
54927A51456J866J946K236K430K296K450L618N474P077Q059Q571Q452P491O200
54913B19622N323M648L288J077j264l325n345p244q297q138p324o588o091n662
54899A74680n191m580l786l029k549k118j357n06k10m77n47M9R82J835K686L535
$$ plain form
55012 109496 109794 110566 111626 113100 114879 116178 116230 115213 114038 113387 113289 113500 113873 114345 114854 115366 115921
54995 115921 116619 117563 118711 119896 121107 122570 124323 125903 126890 127525 128291 128968 128875 128003 127174 126812 126362
54978 126362 125339 124214 123706 123743 123843 124072 124826 125823 126142 125412 124417 124279 125419 127421 129583 131359 132496
54961 132496 133049 133236 133196 132881 132264 131597 131331 131675 132355 132941 133407 134121 135240 136379 137042 137177 137120 137174 137451
54942 137451 137841 137964 137418 136393 135740 136066 137071 138209 139603 141691 144238 146472 148138 149688 151456
54927 151456 153322 155268 157504 159934 162230 164680 168298 173772 180849 188908 197479 205931 213422 219622
54913 219622 224945 229593 232881 233958 232694 229369 224024 216780 208483 200345 193021 186433 180342 174680
54899 174680 169489 164909 161123 158094 155545 153427 152070 151564 151354 150877 150330 150379 151361 153196 155882 159417
54883A59417L913L505K799K574L003L659M210M777N552O399O885O750O175N516
54869B25134M663L110P50j754l689n102o423p632q320q346p908p118o048n023
54855A66294m356l854l187k505k242k405k704l047l328l001j772n23m82j465j921
54840A29502j034K37N89j5p43j183j487j681j458o56M47J214J074J33o78n01L59
54823A24119P97L95o4J81P51P11j46j076j252n38M88J120J201J188J418J547J106
54806A31946L49l9%j35o45r65p06k47n8J2L39Q89J398J835K264K526K361J726
54788A42850Q16n4n35n35l83l59j59O25J583J750R74K49L75J036J600K130K956
54771A54919L843M298M438M889N861O861P295P047O511O255O525O971O973O204
$$ plain form
54883 159417 163330 166835 169634 172208 175211 178870 183080 187857 193409 199808 206693 213443 219618 225134
54869 225134 229797 232907 233657 231903 228214 223112 216689 209057 200737 192391 184483 177365 171317 166294
54855 166294 161938 158084 154897 152392 150150 147745 145041 141994 138666 135665 133893 133370 132888 131423 129502
54840 129502 128468 128705 129294 129279 128536 127353 125866 124185 122727 122071 122518 123732 124806 124939 124261 123760 124119
54823 124119 124916 125311 125247 125428 126179 126890 126744 125668 124416 123878 124366 125486 126687 127875 129293 130840 131946
54806 131946 132295 132256 132256 132121 131476 130511 129805 129558 129500 129512 129851 130740 132138 133973 136237 138763 141124 142850
54788 142850 143666 143612 143077 142542 142159 141800 141641 142266 143849 145599 146573 146822 147197 148233 149833 151963 154919
54771 154919 158762 163060 167498 172387 178248 185109 192404 199451 205962 212217 218742 225713 232686 238890
54757B38890M695K452m05l168m944n724o399p406q080p816p066o576o154n130
54743A77169l618k444j961j709j244o19n0L94N65L06j80l47J21J020J939K627
54727A71969L013L223L537M078M525M431L904L656M217N245N821N342M023K583
54713B29567J491N51q06k852n177o967p583p015n898n096n067n565n975n889n300
54698A62419m434l553k876k437k083j723j456j266r53n92o61j239j479n52J047
54683A38162J970J704R85M54j32j041j850k045j669r28J59J226J389L21j049j576
54667A36080j201o10j02M03O39J91o60j090p96k43R3J31j52p58j270j060j21P62
54649A30236R18M94O1q4N4M43J015J473J489J091P09O94Q46N41m76j532j540k57
$$ plain form
54757 238890 243585 246037 245632 242464 237520 231796 225397 217991 209911 202095 195029 188453 182299 177169
54743 177169 173551 171107 169146 167437 166193 165574 165524 165918 166483 166789 166609 166262 166383 167403 169342 171969
54727 171969 174982 178205 181742 185820 190345 194776 198680 202336 206553 211798 217619 222961 226984 229567
54713 229567 231058 231609 230803 227951 222774 215807 208224 201209 195311 190215 185148 179583 173608 167719 162419
54698 162419 157985 154432 151556 149119 147036 145313 143857 142591 141638 141046 140385 139146 137667 137115 138162
54683 138162 140132 141836 142821 143275 143143 142102 140252 138207 136538 135610 135769 136995 138384 138705 137656 136080
54667 136080 134879 134269 134167 134570 135209 135400 134740 133650 132854 132611 132704 132835 132683 131925 130655 129595 129474 130236
54649 130236 131154 131648 131709 131625 131679 132122 133137 134610 136099 137190 137899 138593 139439 139980 139504 137972 136432 136175
54631A36175J308J973J579Q37K39l32r49j220p90NM27K35m0K18Q58J104N53k44
54613A41936m36O1M91K44l95o69k46M85Q42N00j96m92J5Q93J321J013L95p5m28
54594A45259q42j197j169o69L1M96M63J61J95P72J260R22M3m05j44P4l08q61j003
54575A43078p92m28K74J254J674R18l55j005r12p88p92m12L11N17j38q00n62K82
54557A41324P71O27M24N94Q23O42J71n1J48K96m2n26m06M33J239J337R25O40P07
54538A50076R06J117J386J511J064L6q60p66M35J907K619K314J659J297J061M07
54522A66169n87j208j064m77J27N96P27K10p35j353j333j172j206j008l09K65
54506A57642J25k72k47j61p54j678j834j062l58l12m09j35K28K95K80N24R13J158
$$ plain form
54631 136175 137483 139456 141035 141872 142111 141779 140830 139610 138820 138825 139252 139487 139447 139665 140523 141627 142180 141936
54613 141936 141500 141561 142052 142296 141901 141232 140986 141471 142313 142813 142617 142125 142140 143033 144354 145367 145762 145687 145259
54594 145259 144417 143220 142051 141382 141413 141909 142372 142533 142728 143500 144760 145682 145725 145320 145176 145250 144942 144081 143078
54575 143078 142286 141858 142132 143386 145060 145978 145623 144618 143706 142918 142126 141714 142025 142542 142404 141604 141042 141324
54557 141324 142095 142722 143146 143740 144563 145205 145376 145325 145473 145769 145727 145201 144795 145228 146467 147804 148729 149369 150076
54538 150076 150982 152099 153485 154996 156060 156096 155236 154470 154905 156812 159431 161745 163404 164701 165762 166169
54522 166169 165582 164374 163310 162833 162960 163556 164283 164493 163758 162405 161072 159900 158694 157686 157377 157642
54506 157642 157767 157495 157248 157087 156333 154655 152821 151759 151401 151089 150680 150545 150773 151068 151348 151872 152785 153943
54488A53943J232J154P92J55m22o41n00j26L71P29P18N32O12R88J205J085J025
54471A62852J391J990K354K247J736J119Q16J005J291J139N98J72rk75n96m65
54455A77365K14P51O06J03j99l13n04o37m65j91k27n55q28q95q06m77J21O31O35
54436A74329K67Jr1m04j003j301q51q3J20n07j336j651j433j058n32M93J813K398
54418A69171J547Kp56k85M10L41k39m51o4M01N13L77L22N07Q36J018Q31M63M29
54399A75373Q91J291J013J68n72q39q15p04l89K30R26J291J149O66K65K97P01
54382A80942R35N73j32m72k18P2j89q36j190r33l96p3r8k76l91m11m66o54p93
54363A74994n02K24O75J54r45j334m27P90J021L36j58l1K6m57q99o36M0L80K35
$$ plain form
54488 153943 155175 156329 157121 157276 156854 156213 155713 155587 155958 156687 157405 157937 158549 159537 160742 161827 162852
54471 162852 164243 166233 168587 170834 172570 173689 174505 175510 176801 177940 178538 178710 178701 178426 177830 177365
54455 177365 177579 178330 178936 179039 178840 178527 178023 177386 176921 176730 176503 175948 175120 174225 173419 172942 173063 173694 174329
54436 174329 174596 174597 174506 174102 173099 171798 170947 170864 170984 170477 169141 167490 166057 164999 164467 164960 166773 169171
54418 169171 170718 170720 169964 169679 170089 170430 170191 169740 169676 170077 170590 170967 171289 171796 172632 173650 174481 174944 175373
54399 175373 176264 177555 178568 178736 178164 177325 176510 175806 175417 175647 176573 177864 179013 179679 179944 180241 180942
54382 180942 181877 182450 182318 181846 181628 181700 181511 180675 179485 178552 178156 178083 177985 177709 177318 176907 176441 175787 174994
54363 174994 174492 174716 175391 175545 174600 173266 172839 173629 174650 174986 174828 174797 174823 174366 173467 172831 172871 173251 173486
54344A73486j1k19n79j088j514j720j665j198l57L26K57m85j253j598j520j135
54328A59727n36O4M24N10L02l53j304j758j022N10J667J810J252N23q0k19L69
54311A61886J283J678J315P91M97P1p44j406j307o67j46L7O8Pj64k39k3K88L63
54292A63588J65k43r63j875k288j645l93M45N20L93M70L98k40j125j497j038j45
54275A54527N66Q11P48O65O29M23j00o58o88%R03J259Q43J67j99k77m65p31n15
54256A57908M24J409J560R04K45L5j00n37r56p96j04N26P17O48O36O41K82o92
54238A62750j960k747k475j342r6O57Q33O61M03K13K3l97r87j205p19r2j32o50
54220A52738o56J51R23J058J007J208J090J10r36q34J47M86l92j298j056o8M52
$$ plain form
54344 173486 173475 173256 172677 171589 170075 168355 166690 165492 165135 165461 165718 165233 163980 162382 160862 159727
54328 159727 159191 159255 159679 160189 160491 160138 158834 157076 156054 156564 158231 160041 161293 161816 161736 161517 161886
54311 161886 163169 164847 166162 166953 167450 167521 166777 165371 164064 163397 163251 163288 163356 163363 163199 162960 162937 163225 163588
54292 163588 163753 163510 162547 160672 158384 156739 156346 156791 157311 157704 158174 158572 158332 157207 155710 154672 154527
54275 154527 155093 155904 156652 157317 157946 158369 158269 157611 156923 156923 157826 159085 159928 160095 159896 159619 159154 158423 157908
54256 157908 158332 159741 161301 162205 162450 162485 162385 161848 160892 160096 159992 160518 161235 161883 162519 163160 163442 162750
54238 162750 160790 158043 155568 154226 154130 154787 155620 156281 156684 156897 156920 156523 155536 154331 153612 153520 153388 152738
54220 152738 152082 152233 153156 154214 155221 156429 157519 157629 156693 155859 156006 156492 156100 154802 153746 153678 154130
54203A54130J57k99l98k92k45j85R0N37R30J064Q38K87k97m39J03J006J646J750
54185A60383J574J296O47n60j796k241j808j194q51m89J40N87K98n45j265j496
54169A52680j295p36O3P33R63R81J161J311R37J99r9L32P62M44l78r23r51q94
54151A55290r87q94l37K86K85m10j056r52k24M61P20O64L65k59r08q08L14J580
54133A53130J879J186L98K7k13n10n33j54P3k89q44r21n39k05k7L60J067J682
54115A55567J854J659J338J053J006J350J798J690P94k97q65r60j123j431j315
54100A62118m73N61J029Q09M28L39M76M82J06n28r58p23J83J229J838J857J495
54083A70268R98N78M30N31N48K63l0M7L14K48j74m01j73J12J41K43P92J485J725
$$ plain form
54203 154130 154287 153988 153590 153298 153053 152868 152958 153495 154425 155489 156327 156614 156317 155878 155981 156987 158633 160383
54185 160383 161957 163253 163900 163340 161544 159303 157495 156301 155450 154961 155101 155688 155986 155441 154176 152680
54169 152680 151385 150649 150712 151445 152408 153389 154550 155861 156798 156997 156898 157230 157992 158436 158058 157135 156184 155290
54151 155290 154303 153409 153072 153358 153643 153233 152177 151225 151001 151462 152182 152846 153211 152952 152044 151236 151550 153130
54133 153130 155009 156195 156593 156620 156407 155897 155364 155210 155283 154994 154150 153229 152690 152485 152458 152818 153885 155567
54115 155567 157421 159080 160418 161471 162477 163827 165625 167315 168109 167812 166947 165987 164864 163433 162118
54100 162118 161645 162206 163235 164044 164472 164811 165287 165769 165875 165347 164389 163666 163849 165078 166916 168773 170268
54083 170268 171266 171844 172274 172805 173353 173616 173586 173633 173947 174195 174021 173620 173447 173559 173700 173943 174735 176220 177945
54064A77945J512J339J297R13L0p02n57K81R56J030R68J326J803J534K76j067
54048A88884j333l09J161K037J908J154O20R06J747K294K247K345L286M542N002
54033B16491M580M289M662N042M776M278M366N152O114O769O818O109M966M113
54019B88525L815L538K913K395K417K431J653L38n49p49r27j591k565l481m081
54004B94082m126l695l470l967m561m183k984k366l090m276m623l949k928k022
53990B43842j214n02p7j12n64j029q56J91J429J977K015K552L870N045N345N252
53974B67164N534O112O555O964P398O960M571N47l506o347p863q348p990p226
53960B70525o683o399n718m392l154k757k911k721j844p19J47O85J121J700K471
$$ plain form
54064 177945 179457 180796 182093 183006 183036 182334 181777 182058 183014 184044 185012 186338 188141 189675 189951 188884
54048 188884 187551 187242 188403 190440 192348 193502 194122 195028 196775 199069 201316 203661 206947 211489 216491
54033 216491 221071 225360 230022 235064 239840 244118 248484 253636 259750 266519 273337 279446 284412 288525
54019 288525 292340 295878 298791 301186 303603 306034 307687 308025 307476 306727 305800 304209 301644 298163 294082
54004 294082 289956 286261 282791 278824 274263 270080 267096 264730 261640 257364 252741 248792 245864 243842
53990 243842 242628 242126 242049 241937 241373 240344 239488 239679 241108 243085 245100 247652 251522 256567 261912 267164
53974 267164 272698 278810 285365 292329 299727 306687 311258 311805 308299 301952 294089 285741 277751 270525
53960 270525 263842 257443 251725 247333 244179 241422 238511 235790 233946 233227 233374 234059 235180 236880 239351
53945B39351L128L214K736K375K737L527M002M070M336M967N270M806M289M645
53931B93453N502N553M390L041K417K068J188J21q0O97J404J398J267J743K658
53916C26820L479M251N229N999N895N166M908N591O437O588O304O450P116P415
53902D07648O634N098L681K785K038R19n71j907k622k781k856l151l538l722l666
53887D03989l631l866m434n245o130o894p431p772p932p729p040o097n333m893
53873C19562m512l990l504l333l482l758m033m233m268m125l937l790l645l547
53859B65405l631l739l365k372j445j341j879k223k001j520j007l39L00L35l45
53844B40833j027j122r47j075j418j477j236j126j282j325r87n16l35n14o75l84
$$ plain form
53945 239351 242479 245693 248429 250804 253541 257068 261070 265140 269476 274443 279713 284519 288808 293453
53931 293453 298955 304508 308898 311939 314356 316424 317612 317733 317653 318350 319754 321152 322419 324162 326820
53916 326820 330299 334550 339779 345778 351673 356839 361747 367338 373775 380363 386667 393117 400233 407648
53902 407648 414282 419380 423061 425846 427884 428803 428232 426325 423703 420922 418066 414915 411377 407655 403989
53887 403989 400358 396492 392058 386813 380683 373789 366358 358586 350654 342925 335885 329788 324455 319562
53873 319562 315050 311060 307556 304223 300741 296983 292950 288717 284449 280324 276387 272597 268952 265405
53859 265405 261774 258035 254670 252298 250853 249512 247633 245410 243409 241889 240882 240543 240843 241178 240833
53844 240833 239806 238684 237737 236662 235244 233767 232531 231405 230123 228798 227811 227295 226960 226446 225771 225387
53828B25387L25Q87P75J20m93p71q03n47J73J002J149N59K72J060K317K965K921
53811B37298K954L441M108M756N475O202O763P266P937Q763R778J1284J3028J3629
53797C42682J1796Q003L971O96j918l758m226l568l029l170l178k403j468j084
53783C39346r20m98l16j003k078k617k625k716k948k992l067l559m027l681k776
53768C03523k374k781l255l344l409l566l264k344j565j481j555j051j57M05M06
53753B74188M9o78j813k840l084k608k174k243k597k939l296l654l696l237k632
53738B36746k377k502k597k356j884j434j028m45M64J454J993J725Q66p1p99j309
53722B26446j472r93N4R61J047M40j62l84m13m21k51J48M56M15K11J57K50L20
$$ plain form
53828 225387 225712 226599 227374 227494 227001 226230 225427 224880 225053 226055 227204 227763 228035 229095 231412 234377 237298
53811 237298 240252 243693 247801 252557 258032 264234 270997 278263 286200 294963 304741 316025 329053 342682
53797 342682 354478 362481 366452 367148 365230 361472 357246 353678 350649 347479 344301 341898 340430 339346
53783 339346 338426 337928 337612 336609 334531 331914 329289 326573 323625 320633 317566 314007 309980 306299 303523
53768 303523 301149 298368 295113 291769 288360 284794 281530 279186 277621 276140 274585 273534 273377 273782 274188
53753 274188 274237 273559 271746 268906 265822 263214 261040 258797 256200 253261 249965 246311 242615 239378 236746
53738 236746 234369 231867 229270 226914 225030 223596 222568 222123 222587 224041 226034 227759 228625 228554 227755 226446
53722 226446 224974 223981 224035 224996 226043 226483 226321 225937 225524 225103 224852 225000 225456 225871 226082 226239 226489 226809
53704B26809L91N23N93N18N35Q77J290J338J064R50J213J523J522J313J244J444
53688B43147J660J488Q15L1l13k41l52q84j189o52K09L23m49j187j243r04n25
53671B39734L6P79J085N12m91j159j324j238r35l63K05M17L93N34R68J498J877
53654B42528J799R38m45j350j099l20j60o87q49q4Q34Q94J75l87k36L07O41N40
53636B43039J50l56q75j149p83K36J124R81nm70N19K180K885K157J140J036J712
53619B53521K172J941J472J353J586J758J706J715K089K703L136L176K962K652
53605B83942K275J973J992K289K394J992J369R44O87L02j74m26m05l72m68n88
53589B97726o75p86r25j037j137j160q55k29J40k80j131j535j218p29m78k61J06
$$ plain form
53704 226809 227200 227723 228316 228834 229369 230246 231536 232874 233938 234888 236101 237624 239146 240459 241703 243147
53688 243147 244807 246295 247110 247141 246828 246587 246235 245351 244162 243510 243719 244042 243593 242406 241163 240259 239734
53671 239734 239770 240549 241634 242146 241655 240496 239172 237934 236999 236636 236841 237258 237651 238185 239153 240651 242528
53654 242528 244327 245265 244820 243470 242371 242051 241891 241204 240355 240271 241105 241999 242174 241787 241551 241858 242499 243039
53636 243039 243189 242833 241958 240809 240026 240262 241386 242367 242362 241892 242411 244591 247476 249633 250773 251809 253521
53619 253521 255693 257634 259106 260459 262045 263803 265509 267224 269313 272016 275152 278328 281290 283942
53605 283942 286217 288190 290182 292471 294865 296857 298226 299170 299857 300159 299985 299559 299154 298782 298314 297726
53589 297726 297051 296265 295340 294303 293166 292006 291151 290922 291062 290782 289651 288116 286898 286169 285691 285430 285536
53572B85536L20J30k02l34l44l96l20RK34n1o30q91o40k35mR3K46N12Q65J272
53552B85170J695K153K685L135L113K415J415P54P44J252K052K973L768M226M422
53537C21972M551M559M240L834M029N183O785Q024Q657R080R667J0330J0774J0839
53523D22524J0654J0547J0856J1631J2563J3355J4014J4601J4820J4329J3504
53512E63398J3363J4454J6167J7494J8139J8526J8901J9169J9394J9851K0322
53501G59178K0018J8642J7071J6485J7033J7862J8280J8287J8009J7275J6131
53490I54271J5267J5408J6327J6994J6759J5993J5384J4946J4156J2909J1842
53479A120256J1518J1711J1739J1297J0578R716Q508O683M214J462q73k166k668
$$ plain form
53572 285536 285856 285986 285784 285450 285106 284710 284390 284399 284633 284582 283952 283061 282421 282186 282182 282275 282521 283033 283898 285170
53552 285170 286865 289018 291703 294838 297951 300366 301781 302535 303279 304531 306583 309556 313324 317550 321972
53537 321972 326523 331082 335322 339156 343185 348368 355153 363177 371834 380914 390581 400911 411685 422524
53523 422524 433178 443725 454581 466212 478775 492130 506144 520745 535565 549894 563398
53512 563398 576761 591215 607382 624876 643015 661541 680442 699611 719005 738856 759178
53501 759178 779196 797838 814909 831394 848427 866289 884569 902856 920865 938140 954271
53490 954271 969538 984946 1001273 1018267 1035026 1051019 1066403 1081349 1095505 1108414 1120256
53479 1120256 1131774 1143485 1155224 1166521 1177099 1186815 1195323 1202006 1206220 1207682 1206809 1204643 1201975
53466A201975l606n915q903j0903j1359j1519j2701j4595j5895j6124j6058j6528
53454A057869j7572j8708j9504j9706j9255j8426j7664j7203j6923j6591j6045
53443H60272j5275j4436j3749j3216j2564j1659j0672r690q490o969n508m401
53431G33643l273j618L13J805K776L859N411P082Q497R746J0970J2100J3219J4682
53417H19212J6526J8267J9592K0765K2050K3222K4071K4919K6075K7143K7598
53406A069440K7804K8806L1013L3727L6061L7846L9418M0912M2199M3294M4449
53395A474969M5754M6891M7449M7387M7044M6680M6213M5514M4758M4180M3571
53384A980410M2379M0360L7833L5201L2554K9847K7115K4271K1044J7399J3738
$$ plain form
53466 1201975 1198369 1192454 1183551 1172648 1161289 1149770 1137069 1122474 1106579 1090455 1074397 1057869
53454 1057869 1040297 1021589 1002085 982379 963124 944698 927034 909831 892908 876317 860272
53443 860272 844997 830561 816812 803596 791032 779373 768701 759011 750521 743552 738044 733643
53431 733643 730370 728752 729065 730870 733646 737505 742916 749998 758495 768241 779211 791311 804530 819212
53417 819212 835738 854005 873597 894362 916412 939634 963705 988624 1014699 1041842 1069440
53406 1069440 1097244 1126050 1157063 1190790 1226851 1264697 1304115 1345027 1387226 1430520 1474969
53395 1474969 1520723 1567614 1615063 1662450 1709494 1756174 1802387 1847901 1892659 1936839 1980410
53384 1980410 2022789 2063149 2100982 2136183 2168737 2198584 2225699 2249970 2271014 2288413 2302151
53373B302151J0343O842K750j687n653q829j1786j5329j9711k4668k9734l4394
53361B170295l8250m1367m4227m7122m9724n1473n2193n2119n1512n0519m9388
53350A642401m8388m7547m6586m5264m3627m1962m0626l9835l9337l8501l6977
53339A173751l5257l4143l3605l2735l0959k8785k6960k5411k3612k1587j9842
53328H60855j8364j6506j3998j1422r422q036p018o368o060n665m746l438k215
53315G47597j213j31J313L040M681N825O401O844P752R188J0643J1785J2859J4123
53301H40707J5372J6378J7346J8514J9665K0549K1428K2654K3950K4770K5132
53290A066465K5428K5613K5239K4244K3040K1834K0518J9152J7888J6360J3991
$$ plain form
53373 2302151 2312494 2319336 2322086 2320399 2314746 2305917 2294131 2278802 2259091 2234423 2204689 2170295
53361 2170295 2132045 2090678 2046451 1999329 1949605 1898132 1845939 1793820 1742308 1691789 1642401
53350 1642401 1594013 1546466 1499880 1454616 1410989 1369027 1328401 1288566 1249229 1210728 1173751
53339 1173751 1138494 1104351 1070746 1038011 1007052 978267 951307 925896 902284 880697 860855
53328 860855 842491 825985 811987 800565 791143 783107 776089 769721 763661 757996 753250 749812 747597
53315 747597 746384 746253 747566 750606 755287 761112 767513 774357 782109 791297 801940 813725 826584 840707
53301 840707 856079 872457 889803 908317 927982 948531 969959 992613 1016563 1041333 1066465
53290 1066465 1091893 1117506 1142745 1166989 1190029 1211863 1232381 1251533 1269421 1285781 1299772
53279A299772J1023Q453O692N002K590l50l123n425p331q927j0367j1870j3256
53266A272883j4008j4228j4959j7009j9816k2142k3531k4469k5404k6308k7104
53255A043905k7804k8244k8216k7935k7851k7974k7844k7225k6350k5422k4322
53244G44718k3040k1942k1370k1147k0810k0125j9272j8604j8357j8389j8221
53233E23441j7442j6224j5137j4450j3768j2575j0919r324q118p190o407n914
53221C85973n831n868n590n012m649m827n270n544n626n756n810n337m223l054
53207C13576k550k800l175l020k327j750j903k627l153l053k740k790l046k863
53193B75779k144j460j115p29m5L88p6j128j711j305n02k75r60k055k820k871
$$ plain form
53279 1299772 1310795 1319248 1325940 1330942 1333532 1333182 1330059 1324634 1317303 1308376 1298009 1286139 1272883
53266 1272883 1258875 1244647 1229688 1212679 1192863 1170721 1147190 1122721 1097317 1071009 1043905
53255 1043905 1016101 987857 959641 931706 903855 875881 848037 820812 794462 769040 744718
53244 744718 721678 699736 678366 657219 636409 616284 597012 578408 560051 541662 523441
53233 523441 505999 489775 474638 460188 446420 433845 422926 413602 405484 398294 391887 385973
53221 385973 380142 374274 368684 363672 359023 354196 348926 343382 337756 332000 326190 320853 316630 313576
53207 313576 311026 308226 305051 302031 299704 297954 296051 293424 290271 287218 284478 281688 278642 275779
53193 275779 273635 272175 271060 270331 270286 270674 270598 269470 267759 266454 265952 265677 264717 262662 259842 256971
53177B56971k318j560r84p35o55m43k3K29j37j015j691j647j161q24p32n16k7
53160B42732M89Q14R27P41J09p96j457j490r14NQ45J078M91m57j061j149j009
53143B39898p66m10l77j192k418k815j856l83N74Q94R15O29M2l58j43L25L64j18
53125B32805o63r03p15j42M54M81j55p54o66j2P74J587K344K578J971Q77j89j104
53107B38568j645j204J75J190P30n88j358j442j757k393k410j607j029j280j595
53092B22355j193m95k86m62l98m1J15k13q29j363j522j282j018j117j327r92l2
53075B09900P56O62j03p56p50r3P09Q67l0j392k091j737r80m94k92k13l62o77
53057B02924o89k04K67K94K15N90J329J892J995J707J173O81O21R29R63L91k19
$$ plain form
53177 256971 254653 253093 252109 251374 250719 250276 250253 250482 250345 249330 247639 245992 244831 244007 243275 242759 242732
53160 242732 243221 244035 244962 245703 245812 245016 243559 242069 241155 241160 242005 243083 243574 243117 242056 240907 239898
53143 239898 239132 238722 238345 237153 234735 231920 230064 229681 230255 231149 232064 232693 232735 232377 232234 232559 232923 232805
53125 232805 232142 231239 230524 230382 230836 231317 231162 230408 229742 229730 230504 232091 234435 237013 238984 239861 239672 238568
53107 238568 236923 235719 235894 237084 237814 237226 235868 234426 232669 230276 227866 226259 225230 223950 222355
53092 222355 221162 220667 220381 219919 219521 219480 219595 219382 218553 217190 215668 214386 213368 212251 210924 209932 209900
53075 209900 210656 211318 211215 210459 209709 209616 210325 211192 211162 209770 207679 205942 204962 204468 204176 203963 203601 202924
53057 202924 202235 202031 202298 202592 202807 203397 204726 206618 208613 210320 211493 212174 212795 213724 214687 215078 214859
53040B14859k32Kl35j248j877j687j051n83m22l53k15o3r0m50r77j196q71l47
53022B02864n2R1L84O50L71m97j326j551j242q11m87k20J04M63O80N39R2k30n3
53003A99769M35O38K51l65o38m24j38k66q48j385j325o09K42O52M56p2n02m87
52985A95384OO39R71R07O50K76l07q65p80J28J085J160M46k5M26J367J895J710
52967B05073J282J088J053Q20M13K75N46P16L24k04j04N29P26j7j107j781j995
52950B07637j939j419m41K00l00j548k342k073j151k30K93J78m93j069r80n57
52934A93766n01o32j36R08J332N81m22o56m29n72r90r06k01M44O12N59N40M10
52916A93707J0m93q39q20k57P69J694J846J190K85m79j233k065k562k243j250
$$ plain form
53040 214859 214627 214629 214294 213046 211169 209482 208431 207848 207426 207073 206858 206795 206705 206255 205278 204082 203211 202864
53022 202864 202812 202903 203287 203937 204308 203811 202485 200934 199692 198881 198394 198174 198278 198741 199421 199960 200052 199822 199769
53003 199769 200204 200842 201093 200728 200090 199666 199528 199262 198414 197029 195704 195095 195337 195989 196445 196373 195871 195384
52985 195384 195390 196029 197000 197907 198557 198833 198526 197661 196881 197009 198094 199254 199700 199675 200101 201468 203363 205073
52967 205073 206355 207443 208496 209316 209729 210004 210550 211266 211590 211386 211282 211811 212537 212520 211413 209632 207637
52950 207637 205698 204279 203838 204038 203738 202190 199848 197775 196624 196394 196687 196865 196372 195303 194323 193766
52934 193766 193265 192633 192497 193405 194737 195318 194896 194240 193811 193239 192249 191343 191142 191586 192198 192757 193297 193707
52916 193707 193717 193224 192385 191565 191308 192077 193771 195617 196807 197092 196613 195380 193315 190753 188510 187260
52900A87260l03M6o7k3O00J578K271K263J667Q16n5o93p49j93L64K40m69j005
52882A93548q88l75J5M2k64o78p11K0J136J701J329O97N52P07N27J8k37m4J90
52863A97285K13L04P45J443K139K577K397J406J69k46N47J683K066J601R73N90
52847B15892J90m93j229j542j305r53j154k162l419m008l582k631j741r12Q0R87
52831A92018J252P02k49j124j696j834j412n09M82J087J095O88K79J48J59M8p7
52814A91057J37O69J041J094J269J788K141J976J881K472L072K460P31o86j005
52799B10097r75j444k122k359k321k558k943k859k211j477r83o35l09p4mj34m38
52782A86251o73m55K13P32N53j61p87r18n38K02R61J293J124R36J119J351J128
$$ plain form
52900 187260 186957 187003 186936 186913 187513 189091 191362 193625 195292 196108 196053 195360 194611 194418 194782 195022 194553 193548
52882 193548 192660 192285 192300 192342 192078 191400 190689 190709 191845 193546 194875 195572 196124 196831 197358 197376 197139 197095 197285
52863 197285 197498 197802 198547 199990 202129 204706 207103 208509 208678 208432 208979 210662 212728 214329 215302 215892
52847 215892 216082 215589 214360 212818 211513 210560 209406 207244 203825 199817 196235 193604 191863 190951 191031 192018
52831 192018 193270 193972 193723 192599 190903 189069 187657 187148 187630 188717 189812 190500 190779 190927 191086 191134 191057
52814 191057 191194 191863 192904 193998 195267 197055 199196 201172 203053 205525 208597 211057 211788 211102 210097
52799 210097 209122 207678 205556 203197 200876 198318 195375 192516 190305 188828 187845 187210 186901 186827 186823 186689 186251
52782 186251 185578 185123 185336 186068 186621 186460 185673 184755 184217 184419 185380 186673 187797 188733 189852 191203 192331
52765A92331O36N41R31J076L75q81j816j831j050j17L65L08O8JK09O56J169J313
52747A94284P57q6k98L20Q86P20L45N39R59O96j35l98M50J691K389K285J491J92
52729B07087j049j424p57K10P60Q94Q58N70l5o42r15q96o90k33K47R1r39k044
52711B01093k225j514q10o41p41o84m64l39n09j015j635j891j517q79n55n01m2
52694A85131J115K276K454J478J68n72n48k15K4K05N31R41J139J050R05Q65Q21
52677A97768P21Q07J236J567J109j55j289j378n94m7n15j517j818p67J046K456
52661A98630K824K371J653J020N58K76J86K75M54N56M03K7k56r7N10J227J672
52644B12289J664J235N88o2o98j464k220k463j975j408j592k379k683j864m51
$$ plain form
52765 192331 192967 193508 194439 195515 195890 195009 193193 191362 190312 190195 190560 190868 190936 190937 191146 191802 192971 194284
52747 194284 195041 194955 194657 194977 195863 196583 196928 197467 198426 199122 198987 198589 199039 200730 203119 205404 206895 207087
52729 207087 206038 204614 203857 204067 204827 205721 206579 207149 207114 206472 205557 204661 203971 203738 203985 204076 203137 201093
52711 201093 198868 197354 196544 195903 195162 194478 194014 193675 193166 192151 190516 188625 187108 186229 185674 185173 185131
52694 185131 186246 188522 190976 192454 192622 192050 191502 191287 191311 191516 192047 192988 194127 195177 196082 196947 197768
52677 197768 198489 199296 200532 202099 203208 203053 201764 200386 199792 199745 199230 197713 195895 195128 196174 198630
52661 198630 201454 203825 205478 206498 207056 207332 207518 207793 208247 208803 209206 209233 208977 208880 209390 210617 212289
52644 212289 213953 215188 215776 215714 215016 213552 211332 208869 206894 205486 203894 201515 198832 196968 196517
52629A96517P02J419J997K503K786K868K815K377J319j9r66j277j264j176r06
52614B09695l72K31O42P66N68O3m30l98K86J070J271Q07J88j66k93m05m79l48
52596B12696p6M8n9p9K55O76O51J12l43j32O56J384J552J199Q03Q24J225J423
52578B22815Q91j45q49p49k60n2j75j53K41P00Q36N94J89j80n00q91j332j479
52560B19501r72l1N01J6j165k113k161j271J89J599K258J877Q78n8o69r96r54
52543B16429m60R1J76p3k5M14N89J42l61k94J21K33po4L72J002J399J411J072
52524B22167M45l07q09o87L9P79Q10J09m57j03Q69J503J567J759K437K938K659
52507B35718K084K043K423K391J653O89q1o31r02q18p69j288k093k205j318k89
$$ plain form
52629 196517 197219 198638 200635 203138 205924 208792 211607 213984 215303 215284 214318 213041 211777 210601 209695
52614 209695 209323 209554 210196 210962 211530 211593 211163 210765 211051 212121 213392 214199 214387 214221 213928 213523 213044 212696
52596 212696 212620 212668 212609 212530 212785 213461 214112 214224 213881 213749 214405 215789 217341 218540 219343 220167 221392 222815
52578 222815 223706 223561 222712 221963 221703 221651 221476 221323 221564 222264 223100 223694 223883 223703 223203 222312 220980 219501
52560 219501 218529 218498 218999 219015 217850 215737 213576 212305 212494 214093 216351 218228 219106 219048 218379 217383 216429
52543 216429 215969 216060 216236 216163 216138 216552 217141 217283 216922 216628 216749 216982 216975 216911 217283 218285 219684 221095 222167
52524 222167 222612 222305 221496 220809 220848 221627 222437 222546 222089 221986 222855 224358 225925 227684 230121 233059 235718
52507 235718 237802 239845 242268 244659 246312 247001 246920 246289 245387 244569 243800 242512 240419 238214 236896 236607
52491B36607L7j26j49m9j77l99l21q4j88n85o63j87M07P54J021J342J392R11K64
52472B39807J4J75L28L16L74O09Q77J216J906K845L277K643J487R77J510K224
52456B60585K056R12m83j459j868j920k018k598l663m522m412l435k421j945j816
52441B30993j675j490j299q83j58N05O93M51K2n94j382j907j674q55p5M30Q95
52424B21997J331J339Q11K59J19J86R1n2J49O71J114J273J379J733K351L007L409
52407B41167L375K932K365K034K176K819L823M922N816O299O216N337L552J286
52393B94119o22j766k672l988n368n686m538k943k240k595l020k683j707p17o0
52378B53514L03N04O39P94R53R88R12J061J688K529L022K962K653K409K181J767
$$ plain form
52491 236607 236644 236518 236369 236320 236143 235744 235423 235339 235151 234566 233903 233716 234123 234877 235898 237240 238632 239543 239807
52472 239807 239821 239996 240324 240640 241014 241623 242500 243716 245622 248467 251744 254387 255874 256851 258361 260585
52456 260585 262641 263553 263070 261611 259743 257823 255805 253207 249544 245022 240610 237175 234754 232809 230993
52441 230993 229318 227828 226529 225646 225488 225993 226686 227137 227159 226565 225183 223276 221602 220747 220672 221102 221997
52424 221997 223328 224667 225478 225737 225856 226042 226133 226081 226230 226901 228015 229288 230667 232400 234751 237758 241167
52407 241167 244542 247474 249839 251873 254049 256868 260691 265613 271429 277728 283944 289281 292833 294119
52393 294119 293497 291731 289059 285071 279703 274017 269479 266536 264296 261701 258681 255998 254291 253574 253514
52378 253514 253817 254321 254960 255754 256707 257695 258607 259668 261356 263885 266907 269869 272522 274931 277112 278879
52362B78879J100K08q40j782k245k164j905j747j497r07k34N0j09l17k54O4N05
52345B66805Q96R77O73L27L62O82Q54Q46J178K139L287L856L497K483J514J348
52329B91724K295L908N328O037O075N696N181M930N269N964O378O149N365M139
52315C64438K585J318J188K152L060L053K621K835L978N449O547O823O122M930
52301D17099M318M824N690N806N138M533M359M225L879L515L104K254R96m3m74
52286D69223o15q42j014q43m12n9m0m20r62j123n69L15Q89J271K165L557M404
52269D74925M020L105K814L296L774L738L388L082L006L303M033M878N289M963
52255E27614M036K911K094K109L137M680N855O116N577M711L925L387L059K782
$$ plain form
52362 278879 279979 280187 279347 277565 275320 273156 271251 269504 268007 267100 266866 266916 266807 266490 266236 266300 266805
52345 266805 267701 268678 269351 269678 270040 270722 271576 272422 273600 275739 279026 282882 286379 288862 290376 291724
52329 291724 294019 297927 303255 309292 315367 321063 326244 331174 336443 342407 348785 354934 360299 364438
52315 364438 367023 368341 369529 371681 374741 377794 380415 383250 387228 392677 399224 406047 412169 417099
52301 417099 421417 426241 431931 437737 442875 447408 451767 455992 459871 463386 466490 468744 469740 469697 469223
52286 469223 468608 467766 466752 465909 465497 465438 465398 464978 464016 462893 462324 462639 463528 464799 466964 470521 474925
52269 474925 478945 482050 484864 488160 491934 495672 499060 502142 505148 508451 512484 517362 522651 527614
52255 527614 531650 534561 536655 538764 541901 546581 552436 558552 564129 568840 572765 576152 579211 581993
52241E81993K438K017J574J188J020J195J571J803J821J989K552L174L344L180
52227F10859L320L995M600M452L690L117L212L628L773L586L489L680L838L605
52213F62844L089K687K562K646K936L518M242M742M885M944N231N714O064N966
52199G22070N320M328L472L183L432L785L924L937M030M174M182L948L482K853
52185G76120K199J672J260P98J83m99j170j893k679l343l699l781l833m076m546
52170G52713n014n086m477l333k133j299r15p80n80q6O48J333J852K437L141L346
52154G41767K395O97m17k04O75J200J323J710K498K953K484J459Q00J018J790
52139G62148K407K424J867J010J21n48q35q59j005j372j452o70Q29K350L543M688
$$ plain form
52241 581993 584431 586448 588022 589210 590230 591425 592996 594799 596620 598609 601161 604335 607679 610859
52227 610859 614179 618174 622774 627226 630916 634033 637245 640873 644646 648232 651721 655401 659239 662844
52213 662844 665933 668620 671182 673828 676764 680282 684524 689266 694151 699095 704326 710040 716104 722070
52199 722070 727390 731718 735190 738373 741805 745590 749514 753451 757481 761655 765837 769785 773267 776120
52185 776120 778319 779991 781251 782049 782232 781733 780563 778670 775991 772648 768949 765168 761335 757259 752713
52170 752713 747699 742613 738136 734803 732670 731371 730456 729676 729096 729010 729658 730991 732843 735280 738421 741767
52154 741767 744162 744859 744442 744238 744913 746113 747436 749146 751644 754597 757081 758540 759340 760358 762148
52139 762148 764555 766979 768846 769856 769977 769429 768594 767735 766730 765358 763906 763236 764065 766415 769958 774646
52123G74646O052P467Q611R358R623R345Q751Q304Q126P813P023N921M876M055
52109H79971L424K839J974N38j174k382k605k054j100P1J203J902K228K762L721
52094H91318M575M887M900M810M118K430L33j330k605m012n337n803n354m835
52080H88095m837n046m884m104k768j246l46p09j866k455j702k16Q74J136R38
52065H60864P47P60R93J408J901K317K471K284J880J546J426J438J517J692J838
52050H85082J646J032L01l18r27j589k176k834l993n450o109n300l856l049k952
52035H49508k708k077j692j842k017j697q90J36R82J110M38k19o4N28O36K71J54
52018H40557K60o8n81k06J032J660Q94j73l14J62L45K59L71M08k52j583l215n194
$$ plain form
52123 774646 780698 788165 796776 806134 815757 825102 833853 842157 850283 858096 865119 871040 875916 879971
52109 879971 883395 886234 888208 888746 887572 885190 882585 880531 879431 879502 880705 882607 884835 887597 891318
52094 891318 895893 900780 905680 910490 914608 917038 917371 916041 913436 909424 904087 898284 892930 888095
52080 888095 883258 878212 873328 869224 866456 865210 864864 864155 862289 859834 858132 857916 858790 859926 860864
52065 860864 861611 862371 863364 864772 866673 868990 871461 873745 875625 877171 878597 880035 881552 883244 885082
52050 885082 886728 887760 888061 887743 886816 885227 883051 880217 876224 870774 864665 859365 855509 852460 849508
52035 849508 846800 844723 843031 841189 839172 837475 836585 836721 837703 838813 839251 839032 838968 839496 840132 840403 840557
52018 840557 840817 840749 840168 839962 840994 842654 843548 843375 843061 843223 843568 843827 844198 844606 844354 842771 839556 834362
$$ [...]
##END NTUPLES=NMR SPECTRUM
##END=
