
##TITLE=AC1258_UGARS11075_7163997_x7UjD6Vp5X
##JCAMPDX= 6.0         $$ Bruker NMR JCAMP-DX V2.0
##DATA TYPE= NMR SPECTRUM
##DATA CLASS= NTUPLES
##ORIGIN= BRUKER
##OWNER= Administrator
$$ 1.72 TOPSPIN		Version 2.1
$$ 2013-01-29 22:43:03.374 -0500  Administrator@X
$$ Compression mode = diff/dup
##.OBSERVE FREQUENCY= 400.02188249412
##.OBSERVE NUCLEUS= ^1H
##.ACQUISITION MODE= SIMULTANEOUS (DQD)
##.ACQUISITION SCHEME= undefined
##.AVERAGES= 8
##.DIGITISER RES= 22
##SPECTROMETER/DATA SYSTEM= spect
##.PULSE SEQUENCE= zg30
##.SOLVENT NAME= COFFEE_meoh
##.SHIFT REFERENCE= INTERNAL, COFFEE_meoh, 1, 14.98509
##AUDIT TRAIL= $$ (NUMBER, WHEN, WHO, WHERE, PROCESS, VERSION, WHAT)
$$ ##TITLE= Audit trail, TOPSPIN		Version 2.1
$$ ##JCAMPDX= 5.01
$$ ##ORIGIN= Bruker BioSpin GmbH
$$ ##OWNER= Administrator
$$ $$ E:\/data/COFFEE/nmr/AC1258_UGARS11075_7163997_x7UjD6Vp5X/20/pdata/1/auditp.txt
$$ ##AUDIT TRAIL=  $$ (NUMBER, WHEN, WHO, WHERE, PROCESS, VERSION, WHAT)
(   1,<2013-01-29 22:42:55.109 -0500>,<Administrator>,<X>,<go>,<TOPSPIN 2.1>,
      <created by zg
	started at 2013-01-29 22:41:48.530 -0500,
	POWCHK enabled, PULCHK disabled,
       configuration hash MD5:
       86 BA 57 50 F2 9D 5C 9B 26 00 A9 28 5F 66 2E 89
       data hash MD5: 64K
       4D 7F 29 8F 4C 52 05 CA F8 53 08 81 C2 C0 5B 58>)
(   2,<2013-01-29 22:42:58.155 -0500>,<Administrator>,<X>,<proc1d>,<TOPSPIN 2.1>,
      <Start of raw data processing
       efp LB = 0 FT_mod = 6 PKNL = 1 PHC0 = 0 PHC1 = 0 SI = 32K 
       data hash MD5: 32K
       F8 22 88 2E D5 42 54 AA 36 47 23 53 A7 9E C4 2A>)
(   3,<2013-01-29 22:42:58.624 -0500>,<Administrator>,<X>,<proc1d>,<TOPSPIN 2.1>,
      <pk PHC0 = 98.62427 PHC1 = 0 
       data hash MD5: 32K
       DA 27 D7 99 8B 34 08 9D ED 63 07 69 4F 29 BD 7A>)
(   4,<2013-01-29 22:42:58.859 -0500>,<Administrator>,<X>,<proc1d>,<TOPSPIN 2.1>,
      <abs ABSG = 1 
       data hash MD5: 32K
       08 53 D9 E3 57 D7 65 12 62 DB 5E 25 A9 28 24 20>)
(   5,<2013-01-29 22:42:59.030 -0500>,<Administrator>,<X>,<proc1d>,<TOPSPIN 2.1>,
      <abs ABSG = 2 
       data hash MD5: 32K
       D8 C4 97 F4 95 98 73 46 41 F7 8E 79 38 70 03 75>)
(   6,<2013-01-29 22:42:59.202 -0500>,<Administrator>,<X>,<proc1d>,<TOPSPIN 2.1>,
      <abs ABSG = 3 
       data hash MD5: 32K
       F5 4A C5 BD 5C 26 13 77 9B 50 4E 13 58 70 82 8C>)
(   7,<2013-01-29 22:42:59.343 -0500>,<Administrator>,<X>,<proc1d>,<TOPSPIN 2.1>,
      <abs ABSG = 4 
       data hash MD5: 32K
       09 53 8C 93 BE 3B 43 4B E2 0A 0E D1 6B D3 25 1A>)
(   8,<2013-01-29 22:42:59.484 -0500>,<Administrator>,<X>,<proc1d>,<TOPSPIN 2.1>,
      <abs ABSG = 5 
       data hash MD5: 32K
       4F 67 5C 93 D0 21 98 3E 5D 43 3C B5 CA FF D0 3D>)
$$ ##END=
$$ 
$$ $$ hash MD5
$$ $$ D4 11 E9 60 6F 03 7E 5E CF 29 CD 95 F3 7F F9 EC
##$RELAX= 
##$RELAX= 
##$RELAX= 
##$RELAX= 
##$RELAX= 
##$RELAX= 
##$RELAX= 
$$ Bruker specific parameters
$$ --------------------------
##$DU= <E:\>
##$EXPNO= 20
##$NAME= <AC1258_UGARS11075_7163997_x7UjD6Vp5X>
$$ [...]
150 150 150 150 150 150 150 150
##$TP07= 0
##$TPNAME0= <>
##$TPNAME1= <>
##$TPNAME2= <>
##$TPNAME3= <>
##$TPNAME4= <>
##$TPNAME5= <>
##$TPNAME6= <>
##$TPNAME7= <>
##$TPOAL= (0..7)
0.5 0.5 0.5 0.5 0.5 0.5 0.5 0.5
##$TPOFFS= (0..7)
0 0 0 0 0 0 0 0
##$TUNHIN= 0
##$TUNHOUT= 0
##$TUNXOUT= 0
##$USERA1= <user>
##$USERA2= <user>
##$USERA3= <user>
##$USERA4= <user>
##$USERA5= <user>
##$V9= 5
##$VALIST= <valist>
##$VCLIST= <CCCCCCCCCCCCCCC>
##$VD= 0
##$VDLIST= <DDDDDDDDDDDDDDD>
##$VPLIST= <PPPPPPPPPPPPPPP>
##$VTLIST= <TTTTTTTTTTTTTTT>
##$WBST= 1024
##$WBSW= 4
##$XGAIN= (0..3)
0 0 0 0
##$XL= 0
##$YL= 0
##$YMAX_a= 607467
##$YMIN_a= -515433
##$ZGOPTNS= <>
##$ZL1= 120
##$ZL2= 120
##$ZL3= 120
##$ZL4= 120
##$ABSF1= 14.98509
##$ABSF2= -5.573092
##$ABSG= 5
##$ABSL= 3
##$ALPHA= 0
##$AQORDER= 0
##$ASSFAC= 0
##$ASSFACI= 0
##$ASSFACX= 0
##$ASSWID= 0
##$AUNMP= <proc_prof1d_extract_pilot.lims>
##$AXLEFT= 0
##$AXNAME= <>
##$AXNUC= <1H>
##$AXRIGHT= 0
##$AXTYPE= 0
##$AXUNIT= <>
##$AZFE= 0.1
##$AZFW= 0.1
##$BCFW= 0
##$BC_mod= 0
##$BYTORDP= 0
##$COROFFS= 0
##$CY= 15
##$DATMOD= 1
##$DC= 0
##$DFILT= <>
##$DTYPP= 0
##$F1P= 0
##$F2P= 0
##$FCOR= 0.5
##$FTSIZE= 32768
##$FT_mod= 6
##$GAMMA= 0
##$GB= 0
##$INTBC= 1
##$INTSCL= 1
##$ISEN= 128
##$LB= 0
##$LEV0= 0
##$LPBIN= 0
##$MAXI= 10000
##$MC2= 0
##$MEAN= 0
##$ME_mod= 0
##$MI= 0
##$NCOEF= 0
##$NC_proc= -8
##$NLEV= 6
##$NOISF1= 0
##$NOISF2= 0
##$NSP= 0
##$NTH_PI= 0
##$NZP= 0
##$OFFSET= 14.98509
##$PC= 1
##$PHC0= 98.62427
##$PHC1= 0
##$PH_mod= 1
##$PKNL= yes
##$PPARMOD= 0
##$PPDIAG= 0
##$PPIPTYP= 0
##$PPMPNUM= 2147483647
##$PPRESOL= 1
##$PSCAL= 4
##$PSIGN= 0
##$PYNMP= <proc.py>
##$REVERSE= no
##$SF= 400.02
##$SI= 32768
##$SIGF1= 0
##$SIGF2= 0
##$SINO= 400
##$SIOLD= 32768
##$SPECTYP= <>
##$SREGLST= <1H.CDCl3>
##$SSB= 0
##$STSI= 32768
##$STSR= 0
##$SW_p= 8223.68421052631
##$SYMM= 0
##$S_DEV= 0
##$TDeff= 65536
##$TDoff= 0
##$TI= <>
##$TILT= no
##$TM1= 0
##$TM2= 0
##$TOPLEV= 0
##$USERP1= <user>
##$USERP2= <user>
##$USERP3= <user>
##$USERP4= <user>
##$USERP5= <user>
##$WDW= 1
##$XDIM= 32768
##$YMAX_p= 460931416
##$YMIN_p= -697142
##$CURPLOT= <Network HP LaserJet P1505>
##$CURPRIN= <$Network HP LaserJet P1505>
##$DFORMAT= <normdp>
##$LAYOUT= <+/1D_H.xwp>
##$LFORMAT= <normlp>
##$PFORMAT= <normpl>
##$SURQMSG= 1
$$ End of Bruker specific parameters
$$ ---------------------------------
##NTUPLES= NMR SPECTRUM
##VAR_NAME=  FREQUENCY,     SPECTRUM/REAL,   SPECTRUM/IMAG
##SYMBOL=    X,             R,               I
##VAR_TYPE=  INDEPENDENT,   DEPENDENT,       DEPENDENT
##VAR_FORM=  AFFN,          ASDF,            ASDF
##VAR_DIM=   32768,         32768,           32768
##UNITS=     HZ,            ARBITRARY UNITS, ARBITRARY UNITS
##FACTOR=    0.250966925370066, 1,           1
##FIRST=     8223.43324360094, -139066,      -38819
##LAST=      0,             83125,           -180363
##MIN=       0,             -697142,         0
##MAX=       8223.43324360094, 460931416,    0
$$ Real data points
##PAGE= N=1
##DATA TABLE= (X++(R..R)), XYDATA
$$ [...]
$$ plain form
19516 -301080 33045 -485090 -187621 -288142 -82505 -244770 -126653 -81712 -50678 -85236
19506 -85236 -219321 -111117 -128080 -100589 69536 -129334 46139 -41391 -113101 -131493 -57617
19494 -222571 -26587 109420 -27377 -214300 -287524 258676 129540 111398 -201718 -43929
19483 -10902 -143025 207684 -114708 -357087 -112443 -179528 2353 15908 33744 -398273 -59571
19471 -284375 47762 -160890 221753 -20498 -162054 150010 25899 -227576 102073 78329
19461 78329 -98608 -232883 -165770 -109812 107330 -56802 112718 -267911 -106179 -202867 -54599
19449 -228116 -45103 225555 38071 106470 -16539 205771 -306231 156345 -114970 -149282
19439 -149282 -499597 207803 -222469 -235488 -266466 75528 -72467 -357151 -202412 -119946
$$ packed form
19516c01080C3045d85090a87621j00521h2505j62265J18117M4941L1034l4558
19506h5236j34085J08204j6963K7491F9536a29334D6139d1391p1710j8392e7617
19494b22571b6587A09420b7377j86923p3224B58676j29136j8142b01718d3929
19483a0902j32123B07684a14708k42379a12443o7085B353J3555J7836c98273e9571
19471b84375D7762a60890B21753b0498j41556A50010B5899b27576A02073k3744
19461G8329i8608j34275O7113N5958A07330e6802A12718b67911a06179r6688e4599
19449b28116d5103B25555C8071O8399a6539B05771c06231A56345a14970l4312
19439a49282l50315B07803b22469j3019l0978G5528g2467k84684J54739Q2466
$$ plain form
19429 -119946 -248581 30729 -248165 156447 287703 -260251 -359541 -94753 -174957 -552188
19419 -552188 -41112 -131243 -68696 -320951 -193418 -92169 -153149 -53201 -179111 -194228 -148663
19408 -148663 -244336 -38300 294948 -327593 -252779 1921 -39015 136018 172717 86857 -1094
19396 -309443 -331448 135982 46214 -128026 -174257 -296202 -180842 -303443 -210004 -45993
19385 -319474 311301 264056 120212 182243 -42613 -332939 -43098 10404 12141 151836 -383776
19373 83142 -35455 -228487 -123649 -101041 264937 -13735 -158652 -172861 -14295 -343732 274809
19361 -25976 -93148 -163722 77044 27437 -106476 -203990 41216 216993 28903 -80976 -176303
19350 -176303 124787 -2408 208036 -214312 -113393 -153571 -126574 -177212 -168127 37077 -260887
$$ packed form
19429a19946j28635C0729b48165A56447J31256b60251r9290i4753q0204l77231
19419e52188d1112r0131O2547k52255J27533i2169o0980e3201j25910j5117M5565
19408a48663r5673c8300B94948c27593P4814A921c9015A36018L6699q5860a094
19396c09443k2005A35982D6214a28026m6231j21945J15360j22601R3439d5993
19385c19474C11301m7245A20212O2031d2613k90326d3098A0404J737J39695c83776
19373H3142c5455j93032J04838K2608B64937a3735j44917j4209a4295l29437B74809
19361b5976o7172p0574G7044B7437a06476r7514D1216J75777B8903h0976r5327
19350a76303A24787b408B08036b14312J00919m0178K6997n0638R085C7077b60887
$$ plain form
19338 236451 -6429 -174187 -594334 111548 82659 -34659 61778 193180 -239408 28307 -57769
19326 -61538 -120794 -132770 186671 -50902 -255299 -176947 -144665 -30387 -52523 -99517 -124236
19315 -124236 -114615 -388980 -261516 -336237 93340 5290 -208863 -161948 57294 108894 -337283
19303 -249736 -93981 -5038 -310331 -109255 -77975 -103203 -68086 -177525 61827 -54596 -233380
19292 -233380 -144359 -53613 130828 -217934 1519 -177582 -307716 -130182 -81624 -81704 -48067
19281 -48067 -165858 38800 -230484 -152636 -71606 -390156 -210702 -240767 -121637 -387486
19271 -387486 -28621 122407 8815 -196039 -69142 -311367 -10009 88079 -219890 -225765 -47761
19259 70281 -43186 -3361 -258174 66782 42985 -282547 -130053 -24463 94897 439463 -107639
$$ packed form
19338B36451f429j67758m20147A11548k8889c4659F1778J31402b39408B8307e7769
19326f1538n9256j1976A86671e0902k04397P8352L2282c0387k2136m6994k4719
19315a24236R621k74365J27464p4721I3340E290b08863M6915E7294N1600c37283
19303b49736i3981e038l05293a09255L1280k5228L5117j09439F1827e4596j78784
19292b33380Q9021e3613A30828b17934A519a77582j30134a30182M8558q0L3637
19281d8067j17791C8800b30484P7848g1606l18550J79454l0065J19130k65849
19271c87486b8621A22407H815a96039f9142k42225a0009H8079b19890n875d7761
19259G0281d3186c361k54813F6782k3797b82547a30053b4463I4897L44566a07639
$$ plain form
19247 -179610 -283588 38372 -114328 -50528 -52174 -275019 -194425 234877 14017 -136407 -366774
19236 -366774 171838 189566 -397167 165636 8583 28817 19324 -15888 -231882 105810 -67077
19224 -132673 -290811 -88534 50443 180154 -178118 33890 -78103 85376 -254848 180915
19213 -11946 113285 -44517 150757 -72880 77812 -70171 -307837 -211271 -133968 -231368 153872
19201 -206600 -102959 -277304 -48425 -153438 -158660 -62454 -344631 50872 -153294 -119926 -307498
19190 -307498 273102 -339078 -355421 -152472 103414 213548 59478 -27125 -81685 -86345 -371745
19179 -371745 -161361 -169669 65342 -264318 170186 350274 -5536 -138023 -213920 -362767 289883
19167 -252063 202576 -251271 -81087 -214235 -86781 -430316 -7419 -29681 50178 -183129 14739
$$ packed form
19247a79610j03978C8372a14328e0528j646k22845Q0594B34877A4017a36407k30367
19236c66774A71838J7728c97167A65636H583K0234r493a5888k15994A05810f7077
19224a32673j58138h8534E0443J29711a78118C3890g8103H5376b54848A80915
19213a1946A13285d4517A50757g2880G7812g0171k37666R6566P7303r7400A53872
19201b06600a02959j74345d8425j05013n222f2454k82177E0872a53294L3368j87572
19190c07498B73102c39078j6343a52472A03414J10134E9478b7125n4560m660k85400
19179c71745a61361q308F5342b64318A70186J80088e536j32487p5897j48847B89883
19167b52063B02576b51271h1087j33148h6781l43535g419k2262E0178a83129A4739
$$ plain form
19155 12181 234939 132822 129732 1343 -56282 -137261 -325901 68674 197864 15425 240509
19144 240509 -41834 -242935 -156882 13933 -122967 117248 -73776 -502 -146748 -285128 -28114
19132 27422 -54892 29050 -125975 -49569 -207343 113367 -193609 -46377 -244300 -23114 -297603
19121 -297603 45140 -234102 -48648 -182622 41971 117427 -201786 -46700 -59590 25965 -78587
19109 -359503 -254988 126299 205430 81622 58463 -168970 -89242 -423005 -73061 -222445
19099 -222445 -114569 193370 -18097 -248315 -67214 -21519 -101679 218538 42138 -244476
19088 154519 23044 34309 -66849 -30368 54103 122886 81739 -98907 202451 179121 4677
19076 -95090 68466 -2492 -141537 -477912 269870 102784 -104905 -298139 -16477 71809 80992
$$ packed form
19155A2181K22758j02117l090A343e6282q0979j88640F8674J29190A5425K25084
19144B40509d1834k01101Q6053A3933a22967A17248g3776e02j46246j38380b8114
19132B7422e4892B9050a25975d9569j57774A13367a93609d6377j97923b3114k74489
19121b97603D5140b34102d8648j33974D1971P5456b01786d6700j2890B5965g8587
19109c59503J04515A26299P9131H1622k3159a68970P9728l33763g3061j49384
19099b22445J07876A93370a8097k30218f7214b1519q0160B18538D2138b44476
19088A54519B3044J1265f6849c0368E4103O8783m1147i8907B02451k3330D677
19076i5090F8466b492j39045l36375B69870A02784a04905j93234a6477G1809R183
$$ plain form
19065 80992 54335 426305 2287 299392 -91445 68575 78581 -140007 -322585 -10649 74155
19053 -166612 -75862 -321841 103798 -98551 -269449 -214871 -198599 -6241 99065 -398284 -119307
19041 11692 132596 -131616 9841 -70074 35160 200167 -114317 234047 132955 -59517 17098
19029 -83178 -156703 -238682 33485 24949 55076 217600 -242727 -37018 16600 -14660 -395502
19018 -395502 -129300 -325937 270725 -311609 -19232 -310592 -134665 127013 12037 -498147
19007 6862 104892 17881 75833 232931 113980 47989 -115704 -151187 88842 -1566 45650
18995 154285 -311874 -191231 -127215 57288 129526 128220 -235057 246567 -66872 -27572 48774
18983 -257269 113356 -263646 232828 -66296 -368144 -108481 -172994 -55504 76075 188499
$$ packed form
19065H0992k6657L71970B287K97105i1445F8575J0006a40007j82578a0649G4155
19053a66612g5862k45979A03798i8551j70898N4578J6272f241I9065c98284a19307
19041A1692J20904a31616I841g0074C5160J65007a14317B34047j01092e9517A7098
19029h3178p3525q1979C3485q536L0127J62524b42727c7018A6600a4660l80842
19018c95502a29300j96637B70725c11609a9232k91360a34665A27013A2037d98147
19007F862R8030A7881N7952J57098A13980D7989a15704l5483H8842a566D5650
18995A54285c11874J20643O4016E7288P2238j306b35057B46567f6872b7572D8774
18983b57269A13356b63646B32828f6296l01848a08481o4513e5504G6075J12424
$$ plain form
18973 188499 64318 -18666 -109964 -301928 -185738 255383 127173 -91716 -248843 -145297
18963 -145297 322164 -85412 50866 312955 325253 259637 260543 -71365 -142131 -190130 68069
18951 -209559 -238511 -61509 81469 -125099 129244 86705 -103290 -316793 48776 -42870 -84728
18940 -84728 -24609 -161390 -206871 59638 38748 117963 52796 111429 326007 80742 86966
18929 86966 -180911 -191341 -41179 21068 -180933 -474265 94785 79753 -49243 -6144 113000
18917 263881 103843 215829 -119620 140592 -48310 -116758 22677 19547 -97727 3945 -182264
18905 110669 -133824 -372364 -98096 -226753 19507 -73584 16828 -141879 274629 620711
18895 620711 547479 193573 193881 152027 47498 -335919 -193845 276532 39179 -74530 -229996
$$ packed form
18973A88499F4318a8666r1298j91964J16190B55383A27173i1716j57127J03546
18963a45297C22164h5412E0866K62089J2298o5616R06g1365p0766m7999F8069
18951b09559k8952f1509H1469a25099A29244m2539a03290k13503D8776d2870m1858
18940h4728b4609j36781m5481E9638k0890P9215E2796N8633K14578H0742O224
18929H6966a80911j0430d1179B1068a80933k93332I4785j5032d9243f144A13000
18917B63881A03843J11986a19620A40592d8310o8448B2677l130i7727C945a82264
18905A10669a33824k38540i8096j28657A9507g3584A6828a41879B74629L46082
18895F20711p3232A93573L08m1854D7498c35919J42074B76532C9179g4530j55466
$$ plain form
18884 -229996 43452 -113925 -105692 -63733 83272 15273 -70685 248645 8267 -34131 251589
18872 -188246 47014 -9745 153958 28337 -301501 82963 -81025 48243 256876 23697 137760
18861 137760 -33086 -251089 -261268 -66386 -108224 -2391 -132205 -446444 188701 -396 108760
18849 -7444 -138218 -128012 -25498 -64548 -130026 65856 -188333 -116308 -253508 44128 29392
18838 29392 132388 246341 42133 24636 -237079 -135907 -31165 129768 23438 -64458 -7696
18826 126925 77267 110047 35275 -26797 192523 -316153 18013 46059 -137712 -184182 -42021
18814 323695 -105190 270430 -115882 -71358 -157741 -168762 274285 -4202 28016 8559 -101487
18802 116230 149481 -204282 -269667 -64746 -78080 -4175 -214260 -61895 -173499 -138313 48512
$$ packed form
18884b29996D3452a13925Q233M1959H3272A5273g0685B48645H267c4131B51589
18872a88246D7014i745A53958B8337c01501H2963h1025D8243K08633B3697J14063
18861A37760c3086k18003j0179f6386m1838b391j29814l14239A88701c96A08760
18849g444j30774J0206b5498l9050o5478F5856a88333P2025j37200D4128j4736
18838B9392J02996J13953D2133j7497b37079J01172c1165A29768B3438f4458g696
18826A26925m9658L2780C5275b6797A92523c16153A8013K8046a37712m6470d2021
18814C23695a05190B70430a15882M4524q6383j1021B74285d202B8016H559a01487
18802A16230L3251b04282o5385f4746j3334d175k10085f1895j11604L5186D8512
$$ plain form
18790 -152708 -77468 171913 -89664 -51179 -270756 -352527 31372 -372889 249272 59535 -245817
18778 -1211 152753 254166 -161332 -104139 -275757 -223210 -158464 29296 257837 28725 167698
18767 167698 -17413 261398 -122475 4432 -58887 315334 -131243 61849 -142562 44292 -446147
18755 -26204 -91674 -37841 248109 48080 -153363 -65223 59684 -134263 -267089 -63240 2504
18743 63808 -43078 156442 134199 149521 -122944 -11124 49367 -10210 -3969 -65655 -49121
18732 -49121 266878 -236401 -85214 -48818 -259680 15975 -39802 7287 -65649 454566 44216
18720 -254284 192948 -48434 -148090 -63634 -239312 -36221 -206572 185686 -27196 -130171
18710 -130171 -108060 133269 -222495 165309 14105 71833 -87422 139442 -127214 -16787
$$ packed form
18790a52708P5240A71913h9664L8485k19577q1771C1372c72889B49272E9535b45817
18778a211A52753J01413a61332N7193j71618N2547O4746B9296K28541B8725J38973
18767A67698a7413B61398a22475D432e8887C15334a31243F1849a42562D4292d46147
18755b6204o5470c7841B48109D8080a53363f5223E9684a34263j32826f3240B504
18743F3808d3078A56442k2243J5322a22944a1124D9367a0210c969o1686J6534
18732d9121B66878b36401h5214L6396k10862A5975c9802G287f5649D54566D4216
18720b54284A92948d8434r9656f3634j75678c6221j70351A85686b7196j02975
18710a30171K2111A33269b22495A65309A4105N7728h7422A39442a27214a6787
$$ plain form
18699 159191 -71000 272642 -122458 -416444 -43593 184670 43367 245185 162792 -1916 21778
18687 23201 -21886 13618 23663 -74681 -2448 -116785 26377 -134745 112923 -266497 -34032
18675 -182382 -234176 -300191 -132927 -128243 9068 103668 66987 -141746 264025 -156759 -106162
18664 -106162 -201720 91219 -75725 92532 -108843 178336 -231901 66667 298 -55888 -174053
18653 -174053 -12473 46279 38240 -417410 -54578 20123 -143541 -127886 277427 -318072 32287
18641 -35926 -21482 -222916 -56675 -111297 281059 -456224 -198542 -197362 41711 -143344 145643
18629 118984 -11572 6559 99204 -312731 69653 -330081 -166502 -73259 -217834 -20309 -286464
18618 -286464 -162376 -23695 -316229 -60879 10966 -1386 -329585 -152347 -390404 -242916
$$ packed form
18699A59191g1000B72642a22458k93986d3593A84670D3367K01818q2393a916B1778
18687B3201b1886A3618J0045g4681b448j14337B6377a34745A12923b66497c4032
18675a82382n1794o6015a32927M684I068R4600l6681a41746B64025a56759N0597
18664a06162r5558I1219g5725I2532a08843A78336b31901F6667B98e5888j18165
18653a74053a2473D6279q039d17410e4578B0123a43541J5655B77427c18072C2287
18641c5926J4444k01434e6675n4622B81059d56224a98542J180D1711a43344A45643
18629A18984a1572F559R2645c12731F9653c30081J63579g3259j44575b0309k66155
18618b86464J24088b3695k92534f0879A0966a386l28199a52347k38057J47488
$$ plain form
18608 -242916 -205980 -67308 -425007 -1921 149767 -92051 -158277 -123276 -33866 -147424 -246754
18597 -246754 20220 -66749 -232517 -553732 -116170 6377 -171287 -143391 -226030 -90984 57837
18585 62674 5857 26533 -177216 -11887 -213 23334 128318 -143345 -135313 186943 -257623
18573 -68735 73747 -70227 -48788 152196 -174279 -115513 -131650 -254105 380798 143301 -125589
18561 -4344 -75036 174250 -134533 -251095 -345248 126736 -261810 -97684 -213795 -64470 -246521
18550 -246521 -16580 -100432 -75818 -214846 -246644 45971 165727 -101680 -354627 -9440 85091
18538 35250 -248300 -35993 -125841 -89792 -142814 11406 -155206 -226150 126981 163758 -354483
18526 94790 -474569 21953 -228622 -115772 -9705 33634 -63898 127662 -248453 -159420 203959
$$ packed form
18608b42916L6936f7308l57699a921A49767i2051o6226L5001c3866j13558r9330
18597b46754B0220f6749j65768l21215a16170F377a71287K7896q2639i0984E7837
18585F2674E857K0676a77216a1887b13B3334J04984a43345Q032A86943b57623
18573f8735G3747g0227K1439A52196a74279N8766j6137j22455C80798A43301a25589
18561d344p0692A74250a34533j16562r4153A26736b61810i7684j16111f4470j82051
18550b46521a6580q3852K4614j39028l1798D5971J19756a01680k52947i440H5091
18538C5250b48300c5993q9848L6049n3022A1406a55206p0944A26981L6777c54483
18526I4790d74569B1953b28622J12850i705C3634f3898A27662b48453Q9033B03959
$$ plain form
18514 78903 -210579 106079 -8347 -64624 154857 67859 163892 32190 61527 196937 -110396
18502 107645 -131813 -1217 188706 205379 74060 318611 232148 -5675 -36163 1127 206532
18491 206532 -151156 15982 -141062 -257800 84649 -398506 192590 -124571 -90750 -238365
18481 -238365 -17300 -156775 -295066 -118931 207520 -520787 -176979 -87662 -51517 -85905
18471 -85905 -166626 65739 78536 17217 -36413 -235208 -86282 88100 -248862 82050 30417
18459 8313 55686 130426 49232 -153477 -91939 173830 -347417 -96692 29797 -247987 -203076
18448 -203076 -194843 -38534 -24151 -373037 18646 -333786 160293 40932 183348 256171 157775
18437 157775 -71801 -465213 -251467 276454 -235272 -179718 30924 -234060 2122 225877
$$ packed form
18514G8903b10579A06079h347n6277A54857F7859R6033C2190K9337J35410a10396
18502A07645a31813a217A88706J6673G4060K44551q6463e675l0488A127K05405
18491B06532a51156A5982a41062j16738H4649c98506A92590a24571L3821j47615
18481b38365a7300j39475j38291a18931B07520e20787a76979h7662L6145l4388
18471h5905q0721F5739J2797A7217c6413j98795h6282H8100b48862H2050C0417
18459H313M7373P4740D9232a53477O1538A73830c47417i6692B9797b47987M4911
18448b03076Q233c8534J4383l48886A8646c33786A60293D0932J42416P2823r8396
18437A57775g1801l93412K13746B76454b35272N5554C0924b34060B122K23755
$$ plain form
18427 225877 121944 -413227 4276 -304245 -127150 -100154 -165769 -121877 -105872 -53364 98472
18415 -63235 -236750 86235 131630 -333052 -65724 -129399 -512216 -316863 35846 -154317 -127646
18404 -127646 154996 -45045 -240827 319922 46400 160706 -283447 347378 -298463 308479
18393 260081 25828 -16766 27439 191896 85978 -68859 -82661 -117749 -15073 40576 291124
18382 291124 -35316 -169027 -50326 88506 -74712 -83045 46600 126092 -106195 -295844 44694
18370 117176 75916 285819 -136100 93109 -95210 181712 13962 -350001 -262383 -87738 64425
18358 -3484 -9882 44911 -198773 12857 74379 20704 117549 25381 110705 8317 -113426 132640
18345 -322627 -171540 116834 -96624 -105739 -151751 -128534 -17857 94834 85624 -308098 105082
$$ packed form
18427B25877j03933d13227D276c04245a27150K6996o5615M3892J6005N2508I8472
18415f3235j73515H6235M5395c33052f5724o3675l82817J95353C5846a54317K6671
18404a27646A54996d5045j95782C19922D6400J14306b83447C47378b98463C08479
18393B60081B5828a6766B7439J64457H5978f8859j3802l5088a5073D0576K50548
18382B91124c5316j33711e0326H8506g4712q333D6600P9492a06195j89649D4694
18370A17176m1260K09903a36100I3109i5210A81712A3962c50001Q7618h7738F4425
18358c484o398D4911a98773A2857O1522B0704R6845B5381Q5324H317a13426A32640
18345c22627J51087A16834i6624r115m6012K3217a7857I4834r210c08098A05082
$$ plain form
18333 94390 94499 -204653 -320506 -187049 23218 254643 -154877 64855 -281837 -250425 20165
18321 -256206 115044 20878 331287 -172341 -204883 81245 -228778 -170662 2064 -89470 -322703
18310 -322703 -365832 -35808 -217004 -136446 58867 16868 -315805 263336 -456312 -392189 -206026
18299 -206026 55724 -316957 -218006 223337 -380510 -343643 245593 -54392 -38914 -152402
18289 -152402 -11018 154087 -120563 224451 -179094 -171061 -115210 15407 117428 -257051
18278 247627 118177 -112489 -54782 225022 -69128 89678 -14571 -291285 -133183 -213524
18268 -213524 51458 -100692 -65713 -13252 -27896 -89253 -134106 -33386 -70323 -90784 -87223
18257 -87223 -121531 111616 -277751 81831 105525 90652 -124510 -102475 -287089 103927 -154238
$$ packed form
18333I4390J09b04653j15853J33457B3218K31425a54877F4855b81837L1412B0165
18321b56206A15044B0878L10409a72341l2542H1245b28778N8116B064h9470k33233
18310c22703m3129c5808j81196Q0558E8867A6868c15805B63336d56312O4123J86163
18299b06026E5724c16957R8951B23337c80510L6867B45593e4392J5478j13488
18289a52402a1018A54087a20563B24451a79094Q033N5851A5407J02021b57051
18278B47627A18177a12489e4782B25022f9128H9678a4571k76714a33183q0341
18268b13524E1458a00692L4979a3252j4644o1357m4853c3386l6937k0461L561
18257h7223l4308A11616b77751H1831K3694j4873a24510K2035j84614A03927a54238
$$ plain form
18245 -83160 39374 284253 -212517 38787 86943 -338669 171748 -141731 -160681 -28194 29876
18233 7908 -198046 -371419 -26695 144409 -325038 9208 41160 89126 155865 70899 -136272
18221 -393746 -123848 53342 -64345 -38931 -481775 -321817 161892 170320 -79887 -149311 -182691
18210 -182691 -232158 110469 124466 60119 -60440 257464 103880 6572 40356 -239142 -172874
18199 -172874 347888 -149862 71663 -333711 38767 74101 -104411 -47807 255471 -48612
18188 -61346 -86478 45015 26316 -19124 59376 102170 -158559 -115997 111324 -494147 127062
18176 58539 -2350 -179220 20799 -95817 -165693 39279 212431 95431 100843 3181 226006 -106924
18163 116981 208099 111088 -173356 -257005 448714 21915 10023 -185052 -96416 -168062 13028
$$ packed form
18245h3160C9374K44879b12517C8787M8156c38669A71748a41731j8950b8194B9876
18233G908a98046j73373b6695A44409c25038I208L1952M7966O6739G0899a36272
18221c93746a23848E3342f4345K5414m42844J59958A61892Q428g9887o9424l3380
18210a82691m9467A10469J3997F0119f0440B57464A03880F572L3784b39142O6268
18199a72874C47888a49862G1663c33711C8767L5334a04411d7807B55471d8612
18188f1346k5132D5015j8699a9124E9376M2794a58559M2562A11324d94147A27062
18176E8539b350j76870B0799i5817o9876C9279J73152I5431N412C181K22825a06924
18163A16981R1118r7011a73356q3649D48714B1915A0023a85052Q8636p1646A3028
$$ plain form
18151 -160545 597149 -175166 -30046 93898 273461 -67102 -3618 -170249 -196691 -215176 -211428
18140 -211428 -352356 -392219 -189578 -334912 -45913 292941 -151008 144056 -24833 -173324
18130 -173324 -286129 157445 -76402 -124604 -314200 -157705 -60767 -92206 137071 -47844
18119 -238770 -90087 122097 5821 -44824 -187986 -209600 187688 22748 -65071 22105 37669
18108 37669 -205464 -6749 9265 -173477 -65156 117131 360927 82994 -14321 -158162 18306
18096 -100122 -257173 74486 -76916 70154 283277 -91633 -150668 -2809 -288497 -60750 -110874
18085 -110874 -164564 137913 62389 -28236 -43020 -180111 -345062 118544 100955 30425 111551
18074 111551 -132593 335620 176326 -101332 116535 167770 -200989 134538 -104349 5677
$$ packed form
18151a60545E97149a75166c0046I3898J79563f7102c618j66631k6442j8485L748
18140b11428j40928l9863a89578j45334d5913B92941a51008A44056b4833j48491
18130a73324j12805A57445g6402m8202j89596J56495f0767l1439A37071d7844
18119b38770i0087A22097E821d4824j43162k1614A87688B2748f5071B2105J5564
18108C7669b05464f749I265a73477f5156A17131K43796H2994a4321j43841A8306
18096a00122j57051G4486g6916G0154K13123i1633n9035b809k85688f0750n0124
18085a10874n3690A37913F2389b8236j4784j37091j64951A18544j7589C0425Q1126
18074A11551a32593C35620j59294a01332A16535N1235b00989A34538a04349E677
$$ plain form
18063 -154967 -100809 -53572 88498 -103114 184126 -135033 -134683 80978 4880 202739 90301
18051 35697 244066 -366079 199287 -52706 -321227 -319022 575 -38866 -358312 342301 -369529
18039 -163271 220283 45438 -229123 198945 160695 -283433 -99411 -144600 -372590 185771
18028 -68205 -148562 -27596 -71118 -274807 3448 -206404 -80408 5843 14939 -24828 -108217 166333
18015 25779 9198 -59126 -120128 -294733 -155990 -14666 -326918 238193 -36472 171745 242499
18004 242499 68883 159212 -194989 -159568 36305 335989 57295 178555 107795 60543 93660
17993 93660 55271 -30143 320038 -65207 176384 -130693 -340176 174724 35513 43132 81654
17982 81654 -42254 103076 108338 -10356 -44558 -115862 -35952 -210432 -181423 -151953 -214347
$$ packed form
18063a54967N4158M7237H8498a03114A84126a35033L50H0978D880J97859I0301
18051C5697K08369c66079A99287e2706k68521K205E75c8866l19446C42301c69529
18039a63271B20283D5438b29123A98945l8250b83433i9411m5189k27990A85771
18028f8205q0357b7596m3522k03689C448b06404h0408E843R096b4828q3389A66333
18015B5779I198e9126o1002j74605J38743a4666l12252B38193c6472A71745P0754
18004B42499F8883R0329a94989L5421C6305K99684E7295J21260p0760m7252L3117
17993I3660l8389c0143C20038f5207A76384a30693k09483A74724C5513P619L8522
17982H1654d2254A03076N262a0356l4202p1304c5952j74480K9009K9470o2394
$$ plain form
17971 -214347 293426 125199 -129786 -204779 11722 -179614 -5641 12386 -179094 153277
17960 119937 -23211 -163022 -261467 215848 408866 -131636 -187475 183071 -29245 24279
17949 145287 -91510 -243596 -191694 -219164 -138342 58573 -14833 -82660 287484 28001 -86235
17937 348375 -8542 4900 -108473 124971 -157822 -78678 132950 -269523 162513 287728
17927 287728 -399554 -144036 76188 86594 34592 -159134 -47012 388938 -127748 167112
17916 98572 62576 165857 112580 109594 -10381 -197415 -82788 44804 -217803 342015 137556
17904 -19532 136543 -45163 17011 -129346 99484 90555 110826 -194228 302523 271752 -93681
17892 50255 -67435 119411 -199940 65604 102075 2349 -192264 26609 -63561 -84896 186101
$$ packed form
17971b14347B93426A25199a29786p4993A1722a79614e641A2386a79094A53277
17960A19937b3211j39811r8445B15848J93018a31636n5839A83071b9245B4279
17949A45287i1510j52086N1902k7470Q0822E8573a4833o7827B87484B8001h6235
17937C48375h542D900a08473A24971a57822g8678A32950b69523A62513J25215
17927B87728c99554a44036G6188J0406C4592a59134d7012C88938a27748A67112
17916I8572l5996J03281n3277k986a0381j87034h2788D4804b17803C42015A37556
17904a9532A36543d5163A7011a29346I9484q929K0271a94228C02523l0771i3681
17892E0255f7435A19411a99940F5604L6471B349a92264B6609f3561k1335A86101
$$ plain form
17880 -171726 407859 -8787 -131367 -70682 66025 -172299 189873 -348306 143105 -59558
17869 -41731 131160 -45036 13892 -43788 3534 188701 98299 -238578 177896 60758 -22152
17857 -60999 -233372 -48269 526 -293980 107031 -123845 259158 -268104 170034 -18254 -74856
17846 -74856 -6945 204866 245677 75444 -391985 -33188 -113725 -58334 166018 -81691 -140365
17835 -140365 49233 26199 -44765 150022 -142140 -152857 -194445 -280739 119899 52052 -39683
17823 160563 27878 111714 -60378 -228990 143359 -178181 226648 45394 -59140 155792
17812 -30566 -298272 -61451 -184450 146430 -139148 -28248 -281658 62589 -221457 -215413 232297
17800 189172 -79168 -318768 -46355 100570 -150561 -200379 -387972 22199 -42299 11361 167864
$$ packed form
17880a71726D07859h787j22580O0685F6025a72299A89873c48306A43105e9558
17869d1731A31160d5036A3892d3788C534J85167r0402b38578A77896F0758b2152
17857f0999j72373d8269E26b93980A07031a23845B59158b68104A70034a8254n6602
17846g4856f945B04866M0811G5444c91985c3188q0537N5391A66018h1691n8674
17835a40365D9233k3034d4765A50022a42140j0717m1588q6294A19899E2052c9683
17823A60563B7878Q3836f0378j68612A43359a78181B26648D5394e9140A55792
17812c0566k67706f1451j22999A46430a39148b8248k53410F2589b21457O044B32297
17800A89172g9168k39600d6355A00570a50561m9818j87593B2199d2299A1361J56503
$$ plain form
17789 167864 267502 394767 5184 353922 15705 -222169 -17661 -190181 61596 -556067 35235
17777 -83050 63244 -58161 -221201 -225707 26748 210822 76624 154994 92233 -120224 190144
17765 -133868 83514 -55054 -30375 -264298 67183 -104367 -271688 -268094 141012 199310 130245
17754 130245 -30755 52078 60983 132505 -109901 -13724 5817 305917 -183861 242859 8974
17742 275668 288952 -233126 -69784 328098 106479 299328 274861 32271 22734 -58549 -44610
17731 -44610 -67349 350413 31762 -100171 8309 -186350 -89673 -229716 453488 182770 161141
17720 161141 187974 137333 -302707 -82191 66170 -154641 -98337 -291245 383313 112385
17709 169 114077 -97383 -63607 93922 46148 250097 28024 246308 43149 -230804 28075
$$ packed form
17789A67864R9638J27265E184L48738A5705b22169a7661j72520F1596e56067C5235
17777h3050F3244e8161j63040m506B6748J84074G6624P8370o2761a20224A90144
17765a33868H3514e5054K4679k33923F7183a04367j67321L594A41012N8298o9065
17754A30245c0755E2078Q905P1522a09901a3724E817L00100a83861B42859H974
17742B75668J3284b33126f9784C28098A06479J92849k4467C2271r537e8549J3939
17731d4610k2739C50413C1762a00171H309a86350h9673j40043D53488A82770k1629
17720A61141K6833n0641c02707h2191F6170a54641N6304j92908C83313A12385
17709A69J13908i7383L3776I3922D6148K03949B8024K18284D3149b30804B8075
$$ plain form
17697 205942 -108709 -71026 -153410 -7810 112206 307344 -57838 -38434 205491 32292 168918
17686 168918 -81059 157573 238650 209834 465896 9612 199341 2817 296628 230033 174781
17675 174781 138167 -37837 230616 -43020 234966 53313 172762 109919 -4272 -232898 109422
17663 270396 -259802 52004 199056 304280 -240317 -156150 -375149 138754 -184562 25143
17652 25574 -155651 149339 162965 -40125 200669 -125172 38795 362725 368213 -23582 576
17640 -167197 -116378 -103911 -198122 136637 -103766 48120 -69959 259465 115736 -105936
17629 175841 38102 112640 -277235 125550 77829 -260632 410678 -81677 162898 47983
17618 -66252 408517 48209 -4807 354866 397064 -188544 -53834 -14801 53178 -198626 -46419
$$ packed form
17697B05942a08709L7683q2384g810A12206J95138e7838J9404B05491C2292J36626
17686A68918h1059A57573Q1077k8816K56062I612J89729B817K93811o6595n5252
17675A74781l6614c7837B30616d3020B34966E3313J19449o2843d272k28626A09422
17663B70396b59802E2004J47052J05224b40317Q4167k18999A38754a84562B5143
17652B5574a55651A49339J3626d0125B00669a25172C8795L23930N488b3582E76
17640a67197N0819J2467r4211A36637a03766D8120f9959B59465A15736a05936
17629A75841C8102P4538b77235A25550m7721b60632D10678h1677A62898D7983
17618f6252D08517D8209d807C54866M2198a88544e3834a4801E3178a98626d6419
$$ plain form
17606 -54681 -184545 209863 111116 -25851 -87120 -10408 -155317 -98041 136398 35492 308111
17595 308111 240251 -10053 -67810 21366 41568 266715 34061 -27117 -54267 207362 49578
17583 -150061 669053 432425 239978 -92778 106582 176198 36536 270452 -122853 84481
17572 165966 -137277 -14077 323529 55162 -80772 42575 -95915 -33060 451314 -103344 -110455
17561 -110455 305853 -114561 -48056 448529 253422 372615 387624 33355 -143062 188499
17550 205701 202122 -58023 -7332 264609 36888 94426 190698 102387 225482 5428 -143872
17538 282462 252136 381662 427106 143601 321413 396486 13142 193073 221653 122234 137920
17527 137920 512601 96192 465075 270424 386391 794164 689498 466830 370304 451659
$$ packed form
17606e4681j29864B09863r8747b5851o1269a0408j44909N7276A36398C5492K72619
17595C08111o7860a0053n7757B1366K0202K25147C4061b7117k7150B07362D9578
17583a50061F69053k36628j92447i2778A06582O9616C6536K33916a22853H4481
17572A65966a37277a4077C23529E5162h0772D2575i5915c3060D51314a03344p111
17561a10455C05853a14561d8056D48529j95107J19193J5009C3355a43062A88499
17550B05701l579e8023g332B64609C6888N7538R6272q8311J23095E428a43872
17538B82462l0326J29526M5444A43601J77812P5073A3142J79931K8580r9419J5686
17527A37920L74681I6192L68883j94651J15967M07773j04666k22668r6526Q1355
$$ plain form
17517 451659 479556 319018 612896 224839 235254 194795 154994 148962 500285 614354 581304
17506 581304 484423 132711 208665 24650 133698 410758 439987 123873 197735 125694 215814
17495 215814 250351 281449 219329 176463 257142 300367 207738 381628 346497 420999 341692
17484 341692 351940 227879 308596 158210 377287 562593 217267 -11764 211430 265407
17474 265407 453782 506270 654885 679780 187812 435778 350793 272921 280546 109050 606318
17463 606318 76164 358461 236737 -12627 -33435 165026 557493 375630 237756 640800
17453 640800 267016 305371 280255 205753 601489 591821 601257 332329 610536 816745 1003050
17442 1003050 539266 630478 342441 125941 370026 723283 215522 424164 423549 99772
$$ packed form
17517D51659K7897j60538K93878B24839J0415m0459l9801o032L51323J14069l3050
17506E81304r6881A32711P5954B4650J09048K77060K9229A23873P3862p2041R0120
17495B15814L4537L1098o2120m2866Q0679M3225r2629J73890l5131P4502p9307
17484C41692J0248j24061Q0717j50386K19077J85306B17267a1764B11430N3977
17474B65407J88375N2488J48615K4895A87812K47966q4985p7872P625A09050M97268
17463F06318G6164K82297j21724a2627k0808A65026L92467j81863j37874M03044
17453F40800B67016L8355k5116p4502L95736r668R436k68928K78207K06209J86305
17442A003050m63784R1212k88037A25941K44085L53257B15522K08642o15I9772
$$ plain form
17431 425776 270147 120262 478994 419529 421305 595785 684057 102024 602227 658087
17421 658087 545045 669118 707952 545805 706343 200694 687844 593311 336877 614481
17411 614481 915087 796173 508564 648990 292716 359707 178088 353678 567988 150402
17400 143696 178616 19242 176811 -58211 176079 327507 34114 284082 373472 379944 192954
17389 192954 278105 355711 282386 740499 48749 390499 105495 105329 284586 135741 182391
17378 182391 260642 265220 240126 553256 258661 297026 19743 83242 183705 397227 417485
17367 417485 -258812 -172890 293979 190934 229040 293286 447854 3521 122476 -76967 75901
17355 154789 272364 249815 188178 100399 332657 86041 362964 231745 109570 190367
$$ packed form
17431D25776j55629A20262L58732n9465J776J74480Q8272A02024N00203N5860
17421F58087j13042J24073L8834j62147J60538B00694M87150r4533k56434K77604
17411F14481L00606j18914k87609J40426B92716O6991A78088J75590K14310A50402
17400A43696L4920A9242J57569e8211A76079J51428C4114K49968Q9390O472j86990
17389A92954Q5151P7606p3325M58113D8749L41750A05495j66J79257A35741M6650
17378A82391P8251M578k5094L13130B58661L8365A9743O3499J00463K13522K0258
17367D17485b58812Q5922B93979j03045L8106O4246J54568C521J18955g6967G5901
17355A54789J17575k2549o1637q7779K32258H6041K76923j31219A09570Q0797
$$ plain form
17345 190367 329187 543196 203628 202841 442572 506436 533574 564406 255909 322449 373866
17334 373866 -88279 113540 158941 -92803 282458 380059 446703 82055 116014 250880 176831
17323 176831 286036 328599 102533 110800 43130 207326 308245 183416 390733 155901
17312 -104820 88885 321116 341187 227674 146811 244530 -183784 -153568 473303 -75769 422159
17300 86122 101402 185823 427937 105596 439582 286298 74581 354279 114871 359570
17290 359570 396957 170871 452376 318046 142949 341767 46108 216282 113736 89448
17280 89448 261453 342065 439436 99120 176073 88687 111255 264134 40390 5872 435293
17269 435293 198206 384774 -68339 332590 209405 244811 130664 165657 321082 232319
$$ packed form
17345A90367J38820K14009B03628p87K39731O3864K7138L0832B55909O6540N1417
17334C73866h8279A13540M5401i2803B82458R7601O6644H2055L3959J34866p4049
17323A76831J09205M2563A02533Q267D3130J64196J00919j24829K07317A55901
17312a04820H8885K32231K0071j13513q0863R7719a83784L0216D73303g5769D22159
17300H6122J5280Q4421K42114A05596L33986j53284G4581K79698A14871K44699
17290C59570L7387A70871K81505j34330A42949J98818D6108J70174j02546k4288
17280H9448J72005Q0612R7371I9120P6953q7386K2568J52879D0390E872M29421
17269D35293A98206J86568f8339C32590j23185L5406j14147L4993J55425q8763
$$ plain form
17259 232319 274947 363459 74178 364240 420370 194863 543243 582382 465740 609048
17249 609048 410380 489337 295660 311085 268181 402030 437985 114762 426424 323883
17239 323883 429688 117167 296515 378301 390138 326186 303832 495497 433856 221163
17229 221163 237343 428860 268724 219473 370510 264591 579249 206104 290848 251711
17219 251711 149533 95217 121080 666525 378953 383113 185625 213055 523213 311485
17209 311485 323020 240887 354753 256855 196739 528203 565149 548948 469973 299277 354299
17198 354299 -23659 497987 386421 594211 434390 384701 332939 438967 534972 139574
17187 369895 396769 504407 286740 311072 560199 156128 495635 388033 381955 130441
$$ packed form
17259B32319M2628Q8512G4178K90062N6130A94863L48380L9139j16642J43308
17249F09048j98668P8957j93677J5425m2904J33849L5955A14762L11662j02541
17239C23883J05805A17167J79348Q1786J1837o3952k2354J91665o1641k12693
17229B21163J6180J91517j60136m9251J51037j05919L14658B06104Q4744l9137
17219B51711j02178n4316K5863N45445k87572M160A85625K7430L10158k11728
17209C11485J1535q2133J13866r7898o0116L31464L6946j6201p8975j70696N5022
17198C54299b3659D97987j11566K07790j59821m9689n1762J06028R6005A39574
17187C69895K6874J07638k17667K4332K49127A56128L39507j07602o078A30441
$$ plain form
17176 467737 444371 455009 341051 347464 528222 617196 497821 526201 428050 452299 224447
17164 195255 318868 500997 625320 397179 358923 729666 351810 386906 301076 396758
17154 396758 424787 390055 712075 434302 866723 779534 582672 436326 459201 689463
17144 689463 545170 784303 575562 599498 404929 529894 265472 445139 522398 597450
17134 597450 414435 334704 424602 594970 705781 729323 556866 511885 594473 500127 778136
17123 778136 608970 598645 664061 754878 251387 568458 487364 154401 563800 492987
17113 492987 569438 584675 470260 524278 494334 490363 695616 259921 428027 631554 590071
17102 590071 853145 375369 497856 659470 663330 651628 519631 466528 725589 445057
$$ packed form
17176D67737k3366J0638j13958O413J80758Q8974j19375K8380r8151K4249B24447
17164A95255J23613J82129J24323k28141l8256L70743C51810L5096q5830R5682
17154C96758K8029l4732L22020k77773M32421q7189j96862j46346K2875K30262
17144F89463j44293K39133k08741K3936j94569J24965k64422J79667P7259P5052
17134E97450j83015p9731Q9898J70368J10811K3542j72457m4981Q2588r4346K78009
17123G78136j69166j0325O5416R0817B51387L17071q1094A54401M09399p0813
17113D92987P6451J5237j14415N4018k9944l971K05253B59921J68106K03527m1483
17102E90071K63074C75369J22487J61614L860j1702j31997n3103K59061k80532
$$ plain form
17092 445057 575959 574639 810470 860932 714002 646972 799613 445290 992585 533455
17082 533455 870978 761183 590783 709006 755294 785035 402119 607726 312630 603118
17072 603118 881744 677293 681216 453515 579248 1014048 692095 870184 956691 569967
17062 569967 648516 631424 611259 773267 759041 902644 744175 867613 1026175 561829
17052 561829 810334 907491 623833 710210 716178 704339 486527 897535 924996 615509 764711
17041 764711 983784 898205 1020156 1009376 821980 694534 1098198 718036 757984 1348802
17031 1348802 679231 626764 708336 869911 854559 1107332 953073 1106706 553203 878164
17021 878164 1142946 1275951 1177589 783597 954881 645579 1246084 1293462 813203 895737
$$ packed form
17092D45057J30902j320K35831N0462j46930o7030J52641l54323N47295m59130
17082E33455L37523j09795j70400J18223M6288K9741l82916K05607k95096K90488
17072F03118K78626k04451L923k27701J25733M34800l21953J78089Q6507l86724
17062E69967P8549j7092k0165J62008j4226J43603j58469J23438J58562m64346
17052E61829K48505R7157k83658Q6377N968j1839k17812M11008K7461l09487J49202
17041G64711K19073q5579J21951j0780j87396j27446M03664l80162L9948N90818
17031A348802o69571n2467Q1572J61575j5352K52773j54259J53633E53203L24961
17021H78164K64782J33005r8362l93992J71284l09302O00505M7378m80259Q2534
$$ plain form
17011 895737 858107 1063952 1190120 1076639 1259548 1243348 1208894 1339949 1151589 1452555
17001 1452555 971054 854584 819628 1121836 1045234 921212 889282 1278471 1072953 1187386
16991 1187386 1542975 1282521 1312710 1414340 1257919 1687846 1398946 1434220 1240128 1279207
16981 1279207 1336494 1332464 1037037 1499378 1216028 1405509 1477492 1457411 1695451 1301976
16971 1301976 1572976 1264755 1242037 1542296 1382840 1514219 1476214 1195325 1624698 1728826
16961 1728826 1479995 1188452 1382270 1486053 1756883 1727729 1414073 1921524 1337973 1809442
16951 1809442 1830406 1731398 1335779 1726075 1596496 1840601 1404783 1713668 1834998 1716354
16941 1716354 2012087 1716655 1742742 1926888 1948872 1865108 1826736 1938135 1875206 2016005
$$ packed form
17011H95737l7630K05845J26168j13481J82909j6200l4454J31055j88360L00966
17001A452555m81501j16470l4956L02208p6602j24022l1930L89189k05518J14433
16991A187386L55589k60454L0189J01630j56421M29927k88900L5274j94092L9079
16981A279207N7287m030k95427M62341k83350J89481P1983k0081K38040l93475
16971A301976K71000l08221k2718L00259j59456J31379l8005k80889M29373J04128
16961A728826k48831k91543J93818J03783K70830k9154l13656N07451n83551M71469
16951A809442K0964r9008l95619L90296j29579K44105m35818L08885J21330j18644
16941A716354K95733k95432K6087J84146K1984q3764l8372J11399o2929J40799
$$ plain form
16931 2016005 1842487 2196381 2188775 2278437 2037469 2164985 1835801 2049335 2342380 2165784
16921 2165784 2379959 2076501 2463063 2002661 2552561 2546162 2485386 2367884 2233922 2412655
16911 2412655 2571832 2388775 2472249 2786091 2595674 2792607 2390728 2741047 2575105 2489599
16901 2489599 2572632 2439402 2752892 2431660 2659451 2922955 2748464 3021517 2914722 3009425
16891 3009425 3316240 3172328 3107836 3140243 3052843 3071075 3414572 3358305 3459019 3573668
16881 3573668 3376572 3477486 3497432 3355103 3566259 3651655 3726517 3993274 3887145 3660213
16871 3660213 3823752 3709541 3743409 4253600 4221844 4260182 4186820 4217752 4479659 4435535
16861 4435535 4460424 4652048 4700480 4704541 4554364 4964118 4909529 5187263 4996056 5061002
$$ packed form
16931B016005j73518L53894p606Q9662k40968J27516l29184K13534K93045j76596
16921B165784K14175l03458L86562m60402N49900o399o0776j17502j33962J78733
16911B412655J59177j83057Q3474L13842j90417J96933m01879L50319j65942q5506
16901B489599Q3033j33230L13490l21232K27791K63504j74491K73053j06795R4703
16891C009425L06815j43912o4492L2407q7400J8232L43497n6267J00714J14649
16881C573668j97096J00914J9946j42329K11156Q5396P4862K66757j06129k26932
16871C660213J63539j14211L3868N10191l1756L8338p3362L0932K61907m4124
16861D435535K4889J91624M8432M061j50177M09754n4589K77734j91207O4946
$$ plain form
16851 5061002 5244756 4967661 5182651 5473300 5583595 5585822 5477293 5581141 6064286 5785649
16841 5785649 5821343 6148946 6330190 6346195 6400105 6233505 6843225 6475232 6879265 6630270
16831 6630270 7108388 7223848 7196620 7491577 7285960 7921711 7959973 8001341 8118705 8298026
16821 8298026 8304323 8770545 8829801 8978572 9084598 9042447 9516498 9887127 9848136 10328439
16811 10328439 10310871 10626290 10939444 11018574 11041257 11590595 11682179 12150681 12282908 12472565
16801 12472565 12732406 13070790 13343624 13695963 14326705 14624463 14971651 15112925 15544051
16792 15544051 16200172 16478776 16588993 17149149 17843593 18251782 18715726 19209926 19848335
16783 19848335 20266122 21147366 21215732 22220852 22407261 23640341 24250611 25089680 25470565
$$ packed form
16851E061002J83754k77095K14990K90649J10295K227j08529J03848M83145k78637
16841E785649L5694L27603J81244J6005N3910j66600O09720l67993M04033k48995
16831F630270M78118J15460k7228K94957k05617O35751L8262M1368J17364J79321
16821H298026O297M66222N9256J48771J06026m2151M74051L70629l8991M80303
16811A0328439j7568L15419L13154P9130K2683N49338R1584M68502J32227J89657
16801A2472565K59841L38384K72834L52339O30742K97758L47188J41274M31126
16792A5544051O56121K78604J10217N60156O94444M08189M63944M94200O38409
16783A9848335M17787Q81244O8366J005120J86409J233080O10270Q39069L80885
$$ plain form
16774 25470565 26777710 27327274 28279826 29213158 30154581 31077481 32002005 33116609 34435670
16765 34435670 35308282 36710123 38172800 39345467 40833923 42535047 43731999 45721719
16757 45721719 47339927 48976202 50990716 52895997 54936153 57200082 59625715 61778916
16749 61778916 64142575 66809909 68975283 71829886 74514306 77359732 80266526 83092529
16741 83092529 85984227 88844342 91792763 94758114 97639525 100562889 103318098 105846830
16733 105846830 108541737 110652405 112811561 114557940 116003648 117149076 118217701 119082722
16725 119082722 119489361 119182352 118967337 118121801 116951069 115510672 113984017 111761810
16717 111761810 109514368 107312471 104798516 102019108 99204109 96292306 93078721 90557372
$$ packed form
16774B5470565J307145N49564R52552R33332R41423R22900R24524J114604J319061
16765C4435670Q72612J401841J462677J172667J488456J701124J196952J989720
16757D5721719J618208J636275K014514J905281K040156K263929K425633K153201
16749F1778916K363659K667334K165374K854603K684420K845426K906794K826003
16741H3092529K891698K860115K948421K965351K881411K923364K755209K528732
16733A05846830K694907K110668K159156J746379J445708J145428J068625Q65021
16725A19082722M06639l07009k15015q45536j170732j440397j526655k222207
16717A11761810k247442k201897k513955k779408k814999k911803l213585k521349
$$ plain form
16709 90557372 87269519 84224681 81317540 78349370 75459108 72554915 69940069 67525225
16701 67525225 64509900 62145741 59961967 57510145 55332375 53000255 51431642 49462095
16693 49462095 47160314 45171655 43599407 42172445 40651471 39085980 37450497 36104507
16685 36104507 35198218 33826553 32511409 31390822 30570399 28993932 28047787 27508033 26163938
16676 26163938 25548828 24869921 23867122 23130627 22771536 21679068 21111017 20535435 19750495
16667 19750495 19602830 18562004 18225812 17712944 17234111 16718590 16426688 15747940 15295139
16658 15295139 14997692 14392198 13887143 13743420 13430344 13248317 12624714 12656687 12154780
16649 12154780 11734452 11604538 11419218 10829403 10708277 10585684 10011608 9584217 9823528
$$ packed form
16709I0557372l287853l044838k907141k968170k890262k904193k614846k414844
16701F7525225l015325k364159k183774k451822k177770k332120j568613j969547
16693D9462095k301781j988659j572248j426962j520974j565491j635483j345990
16685C6104507r06289j371665j315144j120587q20423j576467r46145n39754j344095
16676B6163938o15110o78907j002799p36495l59091j092468n68051n75582p84940
16667A9750495j47665j040826l36192n12868m78833n15521k91902o78748m52801
16658A5295139k97447o05494n05055j43723l13076j82027o23603L1973n01907
16649A2154780m20328j29914j85320n89815j21126j22593n74076m27391K39311
$$ plain form
16640 9823528 9393356 9530304 8877227 8601892 8691950 8878548 8001351 8111029 8080154 7871073
16630 7871073 7543777 7570488 7196219 7442729 6756377 6792649 6612359 6638036 6816774 6622034
16620 6622034 6059243 5944153 6142646 5788868 5652715 5367801 5466806 5693829 5358492 5340169
16610 5340169 5312690 5479471 5036009 5091843 5158048 4535423 4431392 4391261 4441923 4546311
16600 4546311 4486314 4189763 4391209 4237139 4058853 4371329 4030162 3978966 3780158 3938234
16590 3938234 3809615 3788534 3731268 3640245 3610792 3744573 3531054 3121297 3561393 3193611
16580 3193611 3082015 3574258 3379311 2873787 2968118 2783382 3081867 3111706 2721293 2736118
16570 2736118 2875890 2633706 2868552 3000301 2679003 2878117 2752006 2578229 2657849 2458065
$$ packed form
16640I823528m30172J36948o53077k75335R0058J86598q77197J09678l0875k09081
16630G871073l27296K6711l74269K46510o86352L6272j80290K5677J78738j94740
16620F622034n62791j15090J98493l53778j36153k84914R9005K27023l35337j8323
16610E340169k7479J66781m43462N5834O6205o22625j04031m0131N0662J04388
16600D546311n9997k96551K01446j54070j78286L12476l41167n1196j98808J58076
16590C938234j28619k1081n7266r1023k9453J33781k13519m09757M40096l67782
16580C193611j11596M92243j94947n05524R4331j84736K98485K9839l90413J4825
16570B736118J39772k42184K34846J31749l21298J99114j26111j73777P9620j99784
$$ plain form
16560 2458065 2539731 2414115 2018484 2625011 2331704 2232034 2122351 2611577 2180497 1891910
16550 1891910 2111193 2208722 2263430 2027295 2181309 2216873 1969243 1933108 2077935 2179366
16540 2179366 1917794 1772093 1726149 1824332 1939076 1823558 1921147 2000602 1579361 1834292
16530 1834292 1975183 1522133 1853781 1643309 1564029 1791945 1676333 1448278 1631217 1470978
16520 1470978 1735042 1684245 1490469 1763556 1639636 1462741 1268767 1321713 1225487 1364055
16510 1364055 1515225 1267668 1543424 1456588 1028104 1035043 1214381 1452616 1311184 1265362
16500 1265362 1203021 1130377 943958 1164421 965553 1240314 1407964 1241360 1392884 1002586
16490 1002586 1027233 1240890 1247677 1129308 1354796 1176151 1239935 968035 1059411 809437
$$ packed form
16560B458065Q1666j25616l95631O06527k93307r9670j09683M89226m31080k88587
16550A891910K19283R7529N4708k36135J54014L5564k47630l6135J44827J01431
16540B179366k61572j45701m5944R8183J14744j15518R7589P9455m21241K54931
16530A834292J40891m53050L31648k10472p9280K27916j15612k28055J82939j60239
16520A470978K64064n0797j93776K73087j23920j76895j93974N2946r6226J38568
16510A364055J51170k47557K75756q6836m28484O939J79338K38235j41432m5822
16500A265362o2341p2644j86419K20463j98868K74761J67650j66604J51524l90298
16490A002586K4647K13657O787j18369K25488j78645O3784k71900R1376k49974
$$ plain form
16480 809437 1037064 850057 695419 1032581 1095529 918110 1184414 899969 830029 934575
16470 934575 915416 1187738 1065802 757029 777153 1072418 816477 616788 746611 790677
16460 790677 1314876 544164 761828 784005 883907 859273 971148 781266 756092 764423 687704
16449 687704 918273 752022 595366 696244 933327 604051 516920 561735 908129 916910
16439 916910 910947 650853 716139 440300 788621 481589 658708 676003 695253 862713
16429 862713 540574 493262 595700 825168 566219 630514 758703 798693 672327 632472
16419 632472 617905 553869 944047 422010 930010 882537 510624 704029 749241 745749 563914
16408 563914 672702 686037 363596 140287 530907 524525 484919 748753 515800 187212
$$ packed form
16480H09437K27627j87007j54638L37162O2948j77419K66304k84445o9940J04546
16470I34575j9159K72322j21936l08773K0124K95265k55941j99689J29823M4066
16460G90677N24199E44164K17664K2177R9902k4634J11875j89882k5174Q331p6719
16449F87704K30569j66251j56656J00878K37083l29276q7131M4815L46394Q781
16439I16910n963k60094O5286k75839L48321l07032J77119J7295J9250J67460
16429H62713l22139m7312J02438K29468k58949O4295J28189L9990j26366l9855
16419F32472j4567o4036L90178D22010N08000m7473l71913J93405M5212l492j81835
16408E63914J08788J3335l22441A40287L90620o382l9606K63834k32953A87212
$$ plain form
16397 566679 453040 345595 750779 286117 583117 392385 434528 157377 629863 493725
16387 493725 813741 443775 493302 297207 697617 574824 410631 353946 374615 324955
16377 324955 653011 554659 499614 287466 359430 172232 680435 423710 641336 541823
16367 541823 395083 382838 677514 362356 563380 619028 512804 278845 625163 498516
16357 498516 216748 181344 144731 222203 300852 378700 348667 506576 485777 483750 264909
16346 264909 425525 504146 316479 133141 -66355 -61667 344110 542981 570768 243544
16335 54401 241257 283705 333166 484950 315117 499874 162623 122679 242058 25918
16324 454064 385459 530980 -15915 -56057 462556 303046 168434 371846 419921 377698
$$ packed form
16397E66679j13639j07445M05184B86117K97000j90732M2143A57377M72486j36138
16387D93725L20016l69966M9527j96095M00410j22793j64193n6685K0669m9660
16377C24955L28056r8352n5045k12148P1964A72232N08203k56725K17626r9513
16367E41823j46740j2245K94676l15158K01024N5648j06224k33959L46318j26647
16357D98516B16748l5404l6613P7472P8649P7848l0033J57909k0799k027k18841
16346B64909J60616P8621j87667A33141f6355M688C44110J98871K7787B43544
16335E4401J86856M2448M9461J51784j69833J84757A62623l9944J19379B5918
16324D54064o8605J45521a5915m0142D62556j59510j34612K03412M8075m2223
$$ plain form
16314 377698 100968 286420 227857 175645 393844 35308 66710 247914 446631 293986
16304 293986 218371 295733 51684 323395 321345 445636 141726 97427 513659 142048 -22605
16292 85384 381670 122125 366171 -91452 -70667 247363 274857 5816 72625 235809 145644
16281 145644 229782 349062 205840 29849 456300 -65144 132959 307272 207325 272680
16271 272680 55667 56459 445288 256333 35777 428970 300879 286766 48695 160764 80122
16259 252531 78773 117867 83870 20570 -150706 136066 268408 352277 197122 225487 290631
16248 290631 203761 224523 245393 153027 15877 178483 158512 -294356 281230 4756 57249
16237 57249 109675 212225 71642 15419 129166 -3649 154298 355865 -38212 361763 237419
$$ packed form
16314C77698A00968J85452n8563n2212K18199C5308L1402J81204J98717j52645
16304B93986p5615P7362E1684K71711k050J24291A41726m4299M16232A42048b2605
16292H5384K96286A22125K44046i1452K0785B47363K7494E816O6809J63184r0165
16281A45644Q4138J19280j43222B9849M26451f5144A32959J74313r9947O5355
16271B72680E5667P92L88829j88955C5777L93193j28091j4113D8695J12069H0122
16259B52531G8773L9094l3997B0570a50706A36066J32342Q3869j55155K8365O5144
16248B90631q6870K0762K0870r2366A5877J62606j9971b94356B81230D756N2493
16237E7249N2426J02550G1642A5419J13747c649A54298K01567c8212C61763j24344
$$ plain form
16226 237419 347160 69813 -109041 -51168 -3007 349732 -105085 281738 -271539 -7996 -41415
16215 -41415 178882 351545 -240188 340927 162495 139748 121408 19978 63271 235390
16205 235390 13048 116293 112283 428645 -15228 26913 86925 -95150 344215 -131804 -37910
16193 205426 -62555 32232 250951 316202 125848 -22230 311661 -59409 213890 140686 140568
16182 140568 -101351 75651 -198466 -91681 219203 72047 160954 20538 154735 -117136
16171 -84324 371416 161903 14594 165773 128375 355921 -93002 179920 225063 -77973 -266389
16160 -266389 -37258 -62430 96349 368485 -84747 -49203 365679 67006 146733 -230891 -6507
16148 49307 -4424 123461 -98834 106332 216684 237560 87539 119933 134049 345135 -68153
$$ packed form
16226B37419J09741F9813a09041e1168c007C49732a05085B81738b71539g996l3419
16215d1415A78882J72663b40188C40927A62495k2747j8340A9978M3293J72119
16205B35390A3048J03245m010L16362a5228B6913O0012i5150C44215a31804c7910
16193B05426f2555C2232K18719O5251A25848b2230C11661e9409B13890p3204j18
16182A40568a01351G5651a98466i1681B19203G2047Q8907B0538J34197a17136
16171h4324C71416A61903A4594J51179l7398K27546i3002A79920M5143g7973j88416
16160b66389c7258k5172I6349K72136h4747L5544C65679F7006P9727b30891f507
16148D9307d424A23461i8834A06332J10352K0876H7539L2394J4116K11086f8153
$$ plain form
16136 303369 -137738 -75573 99861 297233 -172401 137100 -146899 87189 129881 35959
16125 -20280 102432 -314902 -1419 228363 61876 -184311 442963 -195278 329959 179114
16115 179114 -97086 57633 262930 -118598 -74845 352223 209484 280048 -42405 -95547 -58316
16104 -58316 34550 -5815 66126 -78983 270231 123437 -171073 228086 -67258 33646 13067
16092 -87744 50594 -65659 218318 -123881 -27895 -209675 504643 95102 75175 -323101 91601
16080 -190307 306954 270162 -91905 -174015 81452 245608 -30017 -236439 -234091 268041 227402
16069 227402 101199 116888 145238 -368187 33724 -68786 18231 -223748 -125462 -15074 -128304
16058 -128304 -300327 2781 110945 108456 391088 345217 251731 76881 58140 109170 -103950
$$ packed form
16136C03369a37738O2165I9861J97372a72401A37100a46899H7189M2692C5959
16125b0280A02432c14902a419B28363F1876a84311D42963a95278C29959j50845
16115A79114i7086E7633K05297a18598M3753C52223j42739P0564d2405n3142L7231
16104e8316C4550e815F6126g8983B70231A23437a71073B28086f7258C3646A3067
16092h7744E0594f5659B18318a23881b7895j81780E04643I5102j9927c23101I1601
16080a90307C06954l6792i1905q2110H1452J64156c0017k06422K348B68041m0639
16069B27402A01199J5689K8350c68187C3724f8786A8231b23748R8286a5074j13230
16058a28304j72023B781J08164k489K82632m5871r3486G6881j8741N1030a03950
$$ plain form
16046 -132541 15770 -6262 -29406 21332 120021 166826 195582 32131 3565 51491 -217683 42268
16033 329305 -43131 339593 132170 57695 58391 -12116 -167337 -100352 -124891 218413 -209917
16021 312947 -94766 81619 -153221 170760 24668 -78485 -144035 -287197 39496 -52560 -118905
16010 -118905 59950 91139 -104231 -128597 -79779 -139029 107890 187300 -99564 -223762 358415
15998 66594 -14963 210206 -329639 92474 -59082 -2948 154293 -173456 304634 -279277 -62654
15986 21699 -154594 -181913 143975 222473 34754 122303 282708 568424 599582 592701 396664
15975 396664 613907 568815 35366 193998 131689 101082 49933 40896 177790 -108951 203189
15963 -41867 -39605 -130333 127558 59292 119602 -47094 147324 116856 -296546 -8499 28682
$$ packed form
16046a32541A5770f262k3144B1332R8689M6805K8756C2131C565M7926b17683D2268
16033C29305d3131C39593A32170E7695O96a2116j55221O6985k4539B18413b09917
16021C12947i4766H1619a53221A70760B4668g8485o5550j43162C9496e2560o6345
16010a18905E9950L1189a04231k4366M8818n9250A07890P9410i9564j24198C58415
15998F6594a4963B10206c29639I2474e9082b948A54293a73456C04634b79277f2654
15986B1699a54594k7319A43975P8498C4754Q7549J60405K85716L1158o881j96037
15975C96664K17243m5092C5366J58632o2309l0607D9933r037J36894a08951B03189
15963d1867K262r0728A27558E9292O0310d7094A47324l0468b96546h499B8682
$$ plain form
15951 -6602 193200 25939 -127351 165423 116916 109930 236953 -95707 -84802 64979 53959
15940 53959 -139740 21458 -34676 -7174 146758 250389 62682 -271577 131134 130689 103873
15929 103873 -180230 159703 128839 80814 -392811 -231131 -323354 337413 107365 13977
15918 -305185 -159070 7884 -39577 -251628 -373167 -98310 -119453 -159184 106450 -67537 -130436
15907 -130436 -457811 -152141 -77501 -6713 87359 -88865 -124688 228473 302264 529237 -53284
15895 151438 179562 -33098 8484 -108643 -225040 127471 119264 85466 1722 110007 -268279
15883 107845 202418 -98307 -44387 -11511 300682 127934 -67637 -38461 66145 51902 98228
15872 98228 158285 -190591 -204450 -44951 99457 157910 -13415 -27752 95667 -104786 178888
$$ packed form
15951f602A93200B5939a27351A65423m8507o986J27023i5707J0905F4979j1020
15940E3959a39740B1458c4676g174A46758J03631F2682b71577A31134m45k6816
15929A03873a80230A59703l0864m8025c92811J61680r2223C37413A07365A3977
15918c05185J46115G884c9577k12051j21539i8310k1143l9731A06450f7537o2899
15907a30436l27375a52141P4640f713H7359h8865l5823B28473P3791K26973e3284
15895A51438K8124c3098H484a08643j16397A27471q207l3798A722J08285b68279
15883A07845R4573i8307d4387a1511C00682A27934f7637K9176F6145j4243M6326
15872I8228O0057a90591j3859d4951I9457N8453a3415j4337I5667a04786A78888
$$ plain form
15860 -178685 -340620 -221695 19674 187448 -227045 -103052 -281261 127438 -269485 151601
15849 71833 100635 330427 107402 -53827 -64386 38444 -260014 22080 157328 -32656 125063
15837 102172 -73051 -88867 58123 186698 -117566 188374 53188 36916 -41770 187660 -79583
15825 43089 -329399 249781 200843 -80158 -156103 -53768 -92520 -31771 -46079 40539 -70668
15813 -185594 109635 -35029 -175685 127657 174278 257274 -99785 228155 -203585 -201266 -131159
15802 -131159 -240901 -60339 -165250 117753 -108285 83836 -122889 -1632 226067 37799
15791 60537 -511124 -196206 -94611 128649 -80104 269052 -30453 171990 -169077 -31316
15780 24868 -67871 23954 16485 -364046 117521 356591 33198 107807 -324505 124622 -106210
$$ packed form
15860a78685j61935J18925A9674J67774b27045a03052j78209A27438b69485A51601
15849G1833K8802K29792A07402e3827j0559C8444b60014B2080J35248c2656A25063
15837A02172g3051j5816E8123J28575a17566A88374E3188j6272d1770A87660g9583
15825D3089c29399B49781m8938h0158p5945e3768l8752c1771j4308D0539g0668
15813a85594A09635c5029j40656A27657M6621Q2996i9785B28155b03585K319P0107
15802a31159j09742f0339j04911A17753a08285H3836a22889a632B26067C7799
15791F0537e11124a96206i4611A28649h0104B69052c0453A71990a69077c1316
15780B4868f7871B3954p469c64046A17521K39070C3198P4609c24505A24622a06210
$$ plain form
15768 -47843 40609 77463 28235 -116689 -100339 121470 -42726 -224699 84082 66133 -190703
15756 -43085 196454 180717 244467 -135866 51750 279455 -80194 -262568 47052 -226414 -247312
15745 -247312 184403 -100074 -60968 -356682 -99395 -212440 11782 125937 176377 -70568
15734 -107746 219105 -32529 87108 -266109 -37223 13696 -147996 43901 80738 -204638 42645
15722 -24946 -237717 -194287 150070 -86318 50850 127476 -91427 -181887 158037 109 -278576
15710 194750 -14006 -74515 76623 131499 -59068 -88494 362176 -245957 109867 108103 -176173
15698 -56773 -32060 -13037 245147 -239470 160140 -208424 -201891 19654 135883 31822 -152457
15686 201036 -339740 151499 179304 83675 -146480 -52218 -299921 -52835 -285696 38364
$$ packed form
15768d7843D0609L6854B8235a16689J6350A21470d2726j81973H4082j7949a90703
15756d3085A96454j5737O3750a35866E1750K27705h0194j82374D7052b26414k0898
15745b47312A84403a00074L9106k95714i9395j13045A1782J14155N0440g0568
15734a07746B19105c2529H7108b66109c7223A3696a47996D3901L6837b04638D2645
15722b4946k12771M3430A50070h6318E0850P6626i1427r0460A58037A09b78576
15710A94750a4006o0509G6623N4876e9068k9426C62176b45957A09867j764a76173
15698e6773K4713a3037B45147b39470A60140b08424O533A9654J16229C1822a52457
15686B01036c39740A51499K7805H3675a46480e2218k47703e2835k32861C8364
$$ plain form
15675 -129049 -114716 218361 42834 54743 308238 -94636 -25829 -23446 -243158 -174522 45420
15663 198143 -110785 142533 230567 7478 132811 197059 -195190 -160589 12525 -137042 11913
15651 -83951 134064 -24656 -377194 105431 -299120 84048 -38684 93670 167253 -112601 9971
15639 -25656 90901 39581 -53222 -88983 -279042 113971 85332 41744 -103886 -2421 217107
15627 -6830 77690 29389 -54401 29583 77013 -26802 47917 99837 -67690 65220 -246403 -153015
15615 -153015 114324 -346147 58826 -105894 212199 56696 -93393 185781 89973 110147
15605 110147 -35036 208714 -200978 -281017 60479 -165294 -103056 -305692 -60552 156698
15594 66921 -63089 12333 -166669 135397 174989 -136135 45525 -115913 128209 -224394
$$ packed form
15675a29049J4333B18361D2834J1909K53495i4636b5829K383k19712O8636D5420
15663A98143a10785A42533Q8034G478J25333O4248a95190L4601A2525a37042A1913
15651h3951A34064b4656l52538A05431b99120H4048c8684I3670P3583a12601I971
15639b5656I0901C9581e3222l5761j90059A13971k8639D1744a03886b421B17107
15627f830G7690B9389e4401B9583M7430b6802D7917N1920f7690F5220b46403R3388
15615a53015A14324c46147E8826a05894B12199E6696i3393A85781H9973K0174
15605A10147c5036B08714b00978q0039F0479a65294O2238k02636f0552A56698
15594F6921f3089A2333a66669A35397L9592a36135D5525a15913A28209b24394
$$ plain form
15583 138344 -111210 -63814 46447 -108045 1382 -34107 134403 -131797 -76850 -82640 -19553
15571 -48728 73668 -141248 135447 -18833 -35767 103580 -52761 -75527 43315 141806 -124385
15559 101791 -173559 87389 -40915 -22155 -25528 -816 62573 71609 -36399 203032 -265882 246212
15546 156750 410676 69105 91752 -56033 132716 221930 -183043 168292 266392 124982
15535 169992 92946 -5017 6839 211183 88611 -119109 -96427 -478156 187725 1994 238424
15524 238424 253852 33298 -196204 30484 -388206 170538 88408 -285565 100672 148347
15514 148347 24693 -104191 118574 122637 -20978 -190742 47227 -70257 245137 -118927 36012
15502 -245113 -42811 -34568 16082 -62070 -276139 26898 88462 44567 36638 125773 -537331
$$ packed form
15583A38344a11210M7396D6447a08045A382c4107A34403a31797N4947n790a9553
15571d8728G3668a41248A35447a8833j6934A03580e2761k2766D3315R8491a24385
15559A01791a73559H7389d0915J8760l373h16F2573R036c6399B03032b65882B46212
15546A56750K53926F9105K2647e6033A32716Q9214a83043A68292R8100A24982
15535A69992p7046e017F839K04344H8611a19109K2682l81729A87725A994K36430
15524B38424J5428C3298a96204C0484c88206A70538q2130b85565A00672M7675
15514A48347B4693a04191A18574M063b0978j69764D7227g0257B45137a18927C6012
15502b45113d2811Q243A6082f2070k14069B6898O1564m3895p929Q9135e37331
$$ plain form
15490 -138229 313822 315700 -296527 -71834 151461 206845 157171 -6414 114585 99697 371999
15479 371999 -341451 62251 334356 360623 350473 331850 421367 394417 453093 51052 81206
15468 81206 50709 96470 32276 265429 22139 113423 258877 75131 75110 99569 86996 192127
15456 192127 119063 444140 225670 125636 -29984 -171887 -13729 -56482 -106423 -7044 -172321
15445 -172321 21440 287590 171058 358310 523646 745998 676840 560603 30266 161849
15435 161849 77331 46931 74621 -50223 379750 162781 152264 121611 -85231 -99084 -25227
15423 -108640 -93147 134313 -6826 184375 296716 125843 -427873 -65437 118510 -148597
15412 178173 -154785 89637 -9952 -199865 -16092 -156755 210557 71575 -57727 -351227 114783
$$ packed form
15490a38229C13822J878b96527g1834A51461N5384m9674f414A14585j4888K72302
15479C71999c41451F2251K72105K6267j0150j8623Q9517k6950N8676E1052L0154
15468H1206l0497M5761C2276K33153B2139R1284J45454G5131k1K4459j2573J05131
15456A92127p3064L25077k18470j00034b9984j41903a3729m2753m9941g044j65277
15445a72321B1440K66150j16532J87252J65336K22352o9158j16237C0266J31583
15435A61849G7331l0400K7690e0223C79750A62781j0517l0653h5231j3853b5227
15423a08640J5493A34313f826A84375J12341A25843d27873f5437A18510a48597
15412A78173a54785H9637i952j89913a6092j40663B10557G1575e7727k93500A14783
$$ plain form
15400 179518 53044 -75163 -32639 -233353 -62344 95762 -394847 53298 -109056 42221 71589
15389 71589 -147513 -104182 -85628 24533 133946 155704 -337144 188638 -27047 63633 -126172
15377 -110277 -110573 -44780 -68575 167522 141518 6100 265833 -250479 30230 -566 -82535 154029
15364 105511 -142522 -152227 364542 381159 176798 154367 -61481 281261 162823 113265 208855
15353 208855 254287 -140024 140009 -183195 233533 -322723 -201271 255530 239883 375646
15343 375646 350967 148943 -159362 183026 314487 -67022 238281 60207 -107934 -265978
15333 -265978 56586 201569 198566 -142729 57168 175639 442535 167142 131850 406956
15323 406956 135054 415971 26185 -185347 277112 104418 -237354 31576 252099 174389
$$ packed form
15400A79518E3044g5163c2639k00714f2344I5762c94847E3298a09056D2221K9368
15389G1589a47513M3331J8554B4533J09413K1758c37144A88638b7047F3633a26172
15377a10277k96d4780k3795A67522k6004F100K59733b50479C0230e66q1969A54029
15364A05511a42522r705C64542J6617A76798k2431f1481B81261j18438m9558R5590
15353B08855M5432a40024A40009a83195B33533c22723J21452B55530j5647J35763
15343C75646k4679A48943a59362A83026J31461f7022B38281F0207a07934j58044
15333b65978E6586J44983l003a42729E7168J18471K66896A67142l5292K75106
15323D06956A35054K80917B6185a85347B77112A04418b37354C1576K20523p7710
$$ plain form
15313 174389 102889 -81366 110921 422705 167535 31463 183856 -108009 -378178 -125522
15302 -67598 -77769 -18027 147819 53720 71878 167744 80968 138221 299935 263378 148314
15291 148314 27224 140836 33537 179902 108075 58370 24128 -137834 181315 -2091 51579
15279 -3888 42944 -29660 -207092 119288 117285 20208 -139383 -64717 332631 -279996 108813
15267 -5209 -157907 -494046 241718 -387566 -148324 84202 175604 159239 538333 122704
15256 96395 317112 155755 50503 95166 202901 -106099 -160541 -31399 -15289 236886 34647
15244 -59180 -30024 -158803 -233325 -180169 -87950 36527 95627 254617 158790 175540 994963
15233 994963 2518960 3421597 2512426 2940632 2367896 1026352 121828 -56295 179790
$$ packed form
15313A74389p1500h1366A10921L11784A67535C1463J52393a08009k70169a25522
15302f7598j0171a8027A47819E3720J8158R5866H0968N7253J61714l6557j15064
15291A48314B7224J13612C3537J46365p1827m9705B4128a37834A81315b091E1579
15279c888D2944b9660j77432A19288k003B0208a39383f4717C32631b79996A08813
15267e209j52698l36139B41718c87566a48324H4202R1402j6365L79094A22704
15256I6395K20717A55755E0503M4663J07735a06099n4442c1399a5289B36886C4647
15244e9180K9156j28779p4522N3156h7950C6527N9100J58990r5827J6750Q19423
15233I94963J523997R02637r09171M28206n72736A026352A21828e6295A79790
$$ plain form
15223 130455 143141 160589 22597 115291 264303 441002 54345 206374 947 -199332 -8483
15211 -47077 -56278 99133 -1471 -104774 311614 152205 -138193 128045 361430 -76012 190293
15199 192899 142551 -110755 -130533 -114889 93020 49377 29475 35104 64401 -160403 -92636
15188 -92636 195210 -29112 -154591 60868 286231 100972 49268 192906 186558 -357184 89017
15176 -253781 239511 176342 156111 -50101 75690 17190 17869 -65969 -12021 50187 -229788
15164 47801 78705 -94802 -11287 352246 1649 -27626 -39960 -35752 90100 28129 47364 36451
15152 36451 -2894 -16993 -28004 -63170 -146389 173196 221692 -132008 55187 261009 54637
15140 121562 352764 205298 243936 -112236 6290 -59647 246793 44787 -114637 80543 -207300
$$ packed form
15223A30455J2686J7448B2597R2694J49012J76699E4345J52029I47a99332h483
15211d7077r201I9133a471j03303C11614A52205a38193A28045K33385g6012A90293
15199A92899n0348a10755j9778J5644I3020m3643j9902N629K9297a60403O7767
15188i2636A95210b9112j25479F0868K25363A00972D9268J43638o348c57184H9017
15176b53781B39511o3169k0231e0101G5690A7190O79f5969a2021E0187b29788
15164D7801L0904i4802a1287C52246A649b7626j2334M208I0100B8129J9235j0913
15152C6451b894j4099j1011l5166q3219A73196M8496a32008E5187K05822E4637
15140A21562K31202j47466L8638a12236F290e9647B46793D4787a14637H0543b07300
$$ plain form
15128 -280348 236424 221161 348713 344258 -113717 285919 244671 -173619 -75853 315997
15117 -84798 330678 253745 199724 589791 205902 249030 445809 198374 534011 508314
15107 508314 416344 568441 71741 121924 356375 232164 513478 104966 109944 137406 50892
15095 2033 210332 48053 302663 -46208 322425 131198 148909 3302 -19 161609 -66984 -140642
15083 -140642 309954 -48206 154431 -42028 214477 -163247 32485 223399 213547 231872 117638
15072 117638 401063 300303 93334 333120 -126222 247014 153269 78282 65664 188785
15062 188785 106351 163884 245986 6444 167656 126253 138179 -87032 -60035 153281 38331
15050 -7204 318995 187247 10254 279790 210911 -25109 -212343 163803 261891 328483 421493
$$ packed form
15128b80348B36424j5263J27552m455a13717B85919m1248a73619g5853C15997
15117h4798C30678p6933n4021L90067B05902M3128J96779A98374L35637k5697
15107E08314r1970J52097G1741N0183K34451j24211K81314A04966M978K7462E0892
15095B033K08299D8053K54610d6208C22425A31198J7711C302a9A61609f6984p3658
15083a40642C09954d8206A54431d2028B14477a63247C2485J90914r852J8325j14234
15072A17638K83425j00760I3334K39786a26222B47014r3745p4987j2618J23121
15062A88785q2434N7533Q2102F444J61212m1403J1926h7032K6997A53281C8331
15050g204C18995j31748A0254K69536o8879b5109j87234A63803R8088O6592R3010
$$ plain form
15039 421493 449549 207782 220776 465770 236828 253607 74495 267555 449736 136743
15028 506417 315110 384329 243317 365358 264201 237948 522644 280403 409660 339377
15018 339377 417406 419511 120171 75380 589350 300204 351699 443465 365936 203889 567218
15007 567218 301545 95409 532636 218816 90452 231794 144259 384534 -95841 308550
14996 455697 261364 82052 558305 307914 205472 440037 445838 189309 557146 501234
14986 501234 258780 15168 485089 114089 -48953 341610 289213 -40900 263295 388591
14976 388591 126245 154381 142020 95905 293036 335657 606650 116733 209331 125700 422136
14965 422136 28559 256486 265037 -110993 -121829 195629 197243 296724 40076 49962 139353
$$ packed form
15039D21493K8056B07782J2994K44994k28942J6779G4495J93060J82181A36743
15028E06417j91307O9219j41012J22041j01157k6253K84696k42241J29257p0283
15018C39377P8029K105A20171m4791N13970k89146N1495R1766p7529j62047L63329
15007E67218k65673I5409M37227B18816I0452J41342q7535K40275i5841C08550
14996D55697j94333H2052M76253k50391j02442K34565N801A89309L67837n5912
14986E01234k42454A5168M69921A14089d8953C41610n2397d0900B63295J25296
14976C88591A26245K8136j2361m6115J97131M2621K70993A16733R2598q3631K96436
14965D22136B8559K27927Q551a10993j0836A95629J614R9481D0076R886Q9391
$$ plain form
14954 139353 -37949 42266 232085 479392 312143 446407 260768 -47604 382263 339733
14944 339733 172987 156741 177340 330364 271392 601793 183786 493407 595173 396756
14934 396756 546739 494619 638607 27297 609312 515250 652653 613790 754736 588312
14924 588312 754829 1001586 936624 855079 945000 546339 840827 1230182 1115374 1313672
14914 1313672 1033478 643091 749028 801100 557794 216104 101325 356310 494046 174094
14903 716563 56635 220223 478520 279393 215853 143587 450342 288700 437336 375777
14893 375777 754895 617530 293404 249023 263620 453449 425981 485451 567972 481118 513433
14882 513433 778792 -14695 566315 499299 456606 258227 507242 197751 497668 377760
$$ packed form
14954A39353c7949D2266J89819K47307j67249J34264j85639d7604C82263m2530
14944C39733j66746j6246K0599J53024n8972L30401A83786L09621J01766j98417
14934C96756J49983n2120J43988B7297N82015r4062J37403l8863J40946j66424
14924E88312J66517K46757o4962q1545Q9921l98661K94488L89355j14808J98298
14914A313672k80194l90387J05937N2072k43306B16104A01325K54985J37736A74094
14903G16563E6635J63588K58297j99127o3540p2266L06755j61642J48636o1559
14893C75777L79118j37365B93404m4381J4597J89829k7468N9470Q2521q6854L2315
14882E13433K65359a4695E66315o7016m2693j98379K49015A97751K99917j19908
$$ plain form
14872 377760 676938 192576 456905 122496 624140 342896 513802 329791 557300 725596
14862 725596 555067 329251 484376 492643 267782 260129 239161 368818 374723 385907 476426
14851 476426 641616 604133 314604 411101 518620 435570 526521 379046 731162 524995
14841 524995 782302 949727 812957 1022327 673195 677578 587991 565559 525068 781531
14831 781531 606498 488866 701844 235845 285239 564905 432199 447630 398001 541541
14821 541541 423432 469276 481164 494601 481736 433930 243709 160694 290366 369296 577887
14810 577887 801368 458717 592755 591538 624539 492869 630956 1016202 342912 511586
14800 511586 598366 177660 269960 488796 195887 138114 678165 421344 615949 559899
$$ packed form
14872C77760K99178A92576K64329A22496N01644k81244J70906j84011K27509J68296
14862G25596j70529k25816J55125Q267k24861p653k0968J29657N905J1184R0519
14851D76426J65190l7483k89529R6497J07519q3050R0951j47475L52116k06167
14841E24995K57307J67425j36770K09370l49132M383q9587k2432m0491K56463
14831G81531j75033j17632K12978B35845M9394K79666j32706J5431m9629J43540
14821E41541j18109M5844J1888J3437j2865m7806j90221q3015J29672P8930K08591
14810E77887K23481l42651J34038j217L3001j31670J38087L85246C42912J68674
14800E11586Q6780A77660R2300K18836A95887n7773N40051k56821J94605n6050
$$ plain form
14790 559899 454595 492381 676338 286266 545058 416069 622594 321937 588098 789245
14780 789245 360395 468088 425942 435747 101116 512195 749442 652050 568595 748532
14770 748532 709189 728889 513652 532219 415686 344676 506497 324520 634638 452965
14760 452965 546814 567704 557336 530348 518909 623076 849833 447825 526149 239221 621530
14749 621530 705194 543233 627456 439825 483119 447328 629876 592565 819486 234226
14738 930020 792220 525108 285405 712881 548947 753453 790778 487273 549558 1009436
14728 1009436 1072308 594830 952000 1235319 952586 1138052 608481 746902 460638 671139
14718 671139 925655 1024235 815662 520929 579762 461632 823842 483685 876162 855175
$$ packed form
14790E59899j05304L7786J83957B86266K58792j28989K06525l00657K66161K01147
14780G89245C60395J07693m2146R805A01116M11079K37247r7392q3455J79937
14770G48532l9343J9700k15237J8567j16533p1010J61821j81977L10118j81673
14760D52965R3849K0890j0368k6988j1439J04167K26757m02008P8324B39221L82309
14749F21530Q3664j61961Q4223j87631M3294l5791J82548l7311K26921B34226
14738I30020j37800k67112k39703M27476j63934K04506L7325l03505O2285M59878
14728A009436O2872m77478L57170K83319k82733J85466n29571J38421k86264K10501
14718F71139K54516R8580k08573k94733N8833j18130L62210l40157L92477k0987
$$ plain form
14708 855175 664835 515264 779899 894512 780520 635672 665635 1058284 882637 1265155
14698 1265155 1238133 985976 892564 737814 727258 872244 801288 1137587 411908 559875
14688 559875 622376 734224 861053 1055583 946330 789511 646303 1121108 684019 795967
14678 795967 873470 859011 605962 895019 665986 1034241 753390 988606 807838 770419
14668 770419 782198 1079164 821999 847165 1241932 878483 630223 575473 908768 824684
14658 824684 1203301 733896 1233979 782304 842635 1237401 795740 1142192 1219002 1369356
14648 1369356 896141 718850 1113945 987842 1064249 1032347 999930 1109553 1385728 1450338
14638 1450338 1122501 1135901 1162747 1096703 922106 788076 1021415 1189324 966340 789932
$$ packed form
14708H55175j90340j49571K64635J14613j13992j44848K9963L92649j75647L82518
14698A265155k7022k52157r3412j54750j0556J44986p0956L36299D11908J47967
14688E59875O2501J11848J26829J94530j09253j56819j43208M74805m37089J11948
14678G95967P7503j4459k53049K89057k29033L68255k80851K35216j80768l7419
14668G70419J1779K96966k57165K5166L94767l63449k48260n4750L33295q4084
14658H24684L78617m69405N00083m51675O0331L94766m41661L46452P6810J50354
14648A369356m73215j77291L95095j26103P6407l1902l2417J09623K76175O4610
14638A450338l27837J3400K6846o6044j74597j34030K33339J67909k22984j76408
$$ plain form
14628 789932 967194 915497 1197591 1224011 1258446 1405497 1113976 1351207 1319744 1080028
14618 1080028 1145342 1312861 1227419 906728 1424195 1162206 1562752 1280374 1308781 1244784
14608 1244784 1417722 1308622 1291771 1510434 1607953 1421676 1263192 989218 1476680 1631510
14598 1631510 1759123 1656712 1653137 1469587 1581022 1710976 1419328 1478652 2055853 1436247
14588 1436247 1639448 1468868 1529219 1444829 1395179 1556145 1450432 1652286 1524296 1560539
14578 1560539 1782621 1698972 1718616 1894746 1460008 1937582 1606248 1641023 1843879 1972131
14568 1972131 1869956 2168852 1679986 1890329 1831110 2026653 1963146 1933996 2392920 1972460
14558 1972460 2350908 2748467 2476928 2100295 2735638 2679144 3002277 3694504 4196986 6403779
$$ packed form
14628G89932J77262n1697K82094K6420L4435J47051k91521K37231l1463k39716
14618A080028O5314J67519q5442l20691N17467k61989M00546k82378K8407o3997
14608A244784J72938j09100j6851K18663R7519j86277j58484k73974M87462J54830
14598A631510J27613j02411l575j83550J11435J29954k91648N9324N77201o19606
14588A436247K03201j70580O0351q4390m9650J60966j05713K01854j27990L6243
14578A560539K22082q3649J9644J76130m34738M77574l31334L4775K02856J28252
14568A972131j02175K98896m88866K10343n9219J95543o3507k9150M58924m20460
14558A972460L78448L97559k71539l76633O35343n6494L23133O92227N02482K206793
$$ plain form
14548 6403779 9547620 17291874 35104462 51171025 19886579 6167717 2934268 2109921
14540 2109921 1609856 1405473 1697743 1665040 1468959 1742897 1835199 2063337 1959474 2070319
14530 2070319 2610818 3669169 6520487 7802562 3313206 2315569 2411781 2130357 1967158
14521 1967158 1992495 2416083 2483147 2390445 2258754 2160318 2382913 2124233 2156317 2108977
14511 2108977 2469346 2173183 2350217 2199605 2713775 2492418 2261394 2401915 2349445 2621937
14501 2621937 2627472 2714033 2647026 2841642 2768719 2872840 2950699 3079805 2719506 2923888
14491 2923888 2877094 2765746 3179745 2663548 3236288 3170317 3172384 3006760 3220267 3164279
14481 3164279 3260355 3205804 3307471 3102216 3330381 3239529 3363128 3469458 3640675 3511088
$$ packed form
14548F403779L143841P744254J7812588J6066563A9886579F167717B934268q24347
14540B109921n00065k04383K92270l2703j96081K73938R2302K28138j03863J10845
14530B070319N40499J058351K851318J282075C313206r97637R6212k81424j63199
14521A967158K5337M23588O7064r2702j31691r8436K22595k58680L2084m7340
14511B108977L60369k96163J77034j50612N14170k21357k31024J40521n2470K72492
14501B621937N535Q6561o7007J94616p2923J04121P7859J29106l60299K04382
14491B923888m6794j11348M13999n16197N72740o5971K067j65624K13507n5988
14481C164279R6076n4551J01667k05255K28165r0852J23599J06330J71217j29587
$$ plain form
14471 3511088 3624538 3429315 3738763 3654221 3712441 3770183 3718957 3958330 3944675 3707638
14461 3707638 4122630 3759318 4152319 4015682 4307486 4238609 4475379 4437561 4322522 4471255
14451 4471255 4393042 4849073 4508309 4764901 4906522 4665820 4785403 4771768 4893820 5211429
14441 5211429 5080141 5365202 5361471 5175441 5129991 5330694 5644307 5690149 5458837 5555042
14431 5555042 5774747 5770102 5849822 5853440 6049724 6291981 6294899 6688630 6473969 6529734 6610804
14420 6610804 6742376 6993483 7213646 7056067 7296658 7286342 7604483 7664179 7321155 7551760
14410 7551760 7752726 7743044 8030415 8057549 8360660 8527750 8453213 8658097 8908696 9050129
14400 9050129 9372271 9120042 9262484 9428004 9526801 9684319 9581224 10153563 10136257 10510917
$$ packed form
14471C511088J13450j95223L09448q4542N8220N7742n1226K39373j3655k37037
14461C707638M14992l63312L93001j36637K91804o8877K36770l7818j15039J48733
14451D471255p8213M56031l40764K56592J41621k40702J19583j3635J22052L17609
14441E211429j31288K85061l731j86030m5450K00703L13613M5842k31312R6205
14431E555042K19705m645P9720L618J96284K42257K918L93731k14661N5765Q1070
14420F610804J31572K51107K20163j57579K40591j0316L18141N9696l43024K30605
14410G551760K00966r682K87371K7134L03111J67090p4537K04884K50599J41433
14400I050129L22142k52229J42442J65520R8797J57518j03095N72339j7306L74660
$$ plain form
14390 10510917 10319371 10649049 10988917 11419291 11313783 11565722 11853416 11920188 12390433
14381 12390433 12385380 12641614 13156346 13154739 13379141 13710397 13899068 13799829 14100527 14741571
14371 14741571 14721325 15198263 15177287 15873122 16270243 16446431 17023447 17559386 17676051 17555488
14361 17555488 18198215 18653735 19077129 18989205 19722966 20217150 21122191 21115827 21991786 22308595
14351 22308595 23103674 23568390 23985486 24604124 25190934 25434844 26498892 27277713 27912582
14342 27912582 28330003 29625522 30033430 31084569 31867226 32655037 33776630 34484332 35811394
14333 35811394 36938660 37845178 39087905 40261358 41331531 43227545 44297227 45759892
14325 45759892 47449105 48902768 50259094 52183652 54148091 56006180 57848266 60029065
$$ packed form
14390A0510917j91546L29678L39868M30374j05508K51939K87694O6772M70245
14381A2390433n053K56234N14732j607K24402L31256J88671r9239L00698O41044
14371A4741571k0246M76938k0976O95835L97121J76188N77016N35939J16665j20563
14361A7555488O42727M55520M23394q7924P33761M94184R05041o364Q75959L16809
14351B2308595P95079M64716M17096O18638N86810K43910J064048P78821O34869
14342B7912582M17421J295519M07908J051139P82657P87811J121593P07702J327062
14333C5811394J127266R06518J242727J173453J070173J896014J069682J462665
14325D5759892J689213J453663J356326J924558J964439J858089J842086K180799
$$ plain form
14317 60029065 62365805 64719639 67016292 69508471 72761475 75534679 78660180 81768997
14309 81768997 85418325 89160314 93291625 97475646 101862125 106859404 111527931 117264862
14301 117264862 122701470 129100134 135455035 142108686 149908030 157889013 166433504 175225406
14293 175225406 185070007 194982929 206059501 217664247 229890778 242989345 256436976
14286 256436976 271105123 286440599 302211353 318209399 334976198 351599184 368580563
14279 368580563 385124343 401426810 416604920 431088386 443480429 452414051 455873412
14272 455873412 458413968 458393748 458690965 460931416 458337334 455497300 446760329 435985314
14264 435985314 423918976 410855803 395828573 379571758 362895123 345761795 329022663
$$ packed form
14317F0029065K336740K353834K296653K492179L253004K773204L125501L108817
14309H1768997L649328L741989M131311M184021M386479M997279M668527N736931
14301A17264862N436608O398664O354901O653651P799344P980983Q544491Q791902
14293A75225406R844601R912922J1076572J1604746J2226531J3098567J3447631
14286B56436976J4668147J5335476J5770754J5998046J6766799J6622986J6981379
14279C68580563J6543780J6302467J5178110J4483466J2392043Q933622L459361
14272D55873412K540556k0220K97217K240451k594082k840034q736971j0775015
14264D35985314j2066338j3063173j5027230j6256815j6676635j7133328j6739132
$$ plain form
14257 329022663 312614192 296376336 281155396 266110180 252102297 238586833 225691440
14250 225691440 213421144 202312587 191292886 181479483 171945770 163121550 155217834
14243 155217834 147222005 139557220 132666908 126492471 124136364 119010346 112263865 106950405
14235 106950405 101795436 96979084 92659062 89026750 85605299 82040595 78845269 75216326
14227 75216326 72082666 69108763 66656485 64190590 61907237 59709466 57698911 55565855
14219 55565855 53451263 51923025 49965306 48143305 46643400 45595289 44345105 42475237
14211 42475237 41178712 40040530 38813432 37335024 36974623 35834413 34747264 33523879
14203 33523879 32570356 31438707 30790134 30751072 29426228 28407576 27648330 26893397 26457308
$$ packed form
14257C29022663j6408471j6237856j5220940j5045216j4007883j3515464j2895393
14250B25691440j2270296j1108557j1019701r813403r533713q824220p903716
14243A55217834p995829p664785o890312o174437k356107n126018o746481n313460
14235A06950405n154969m816352m320022l632312l421451l564704l195326l628943
14227G5216326l133660k973903k452278k465895k283353k197771k010555k133056
14219E5565855k114592j528238j957719j822001j499905j048111j250184j869868
14211D2475237j296525j138182j227098j478408l60401j140210j087149j223385
14203C3523879r53523j131649o48573l9062j324844j018652p59246p54933m36089
$$ plain form
14194 26457308 25920264 25290332 24478328 24023119 23188556 22699721 22097207 21822250 21022024
14185 21022024 20735584 20198499 19076737 19277771 18908956 18382604 18073672 17729784 17173398
14176 17173398 16913481 16502800 16507813 16121552 15696193 15172220 15255231 14822111 14418575 14095300
14166 14095300 14338406 13511427 13124186 13325443 12809950 12426133 12649751 12186924 11884811
14157 11884811 11900815 11643155 11104568 11065654 11126991 10786682 10791145 10605523 10110495 9925648
14147 9925648 9931941 9882504 9671942 9605919 9490002 9244729 9208548 9071795 9064040 8883973 8680484
14136 8680484 8490268 8292081 7984490 8164962 7932914 7596542 7931384 7708633 7478010
14127 7478010 7635255 7377349 7418642 6928977 7003282 7238355 6800591 6751641 6598977 6735706
$$ packed form
14194B6457308n37044o29932q12004m55209q34563m88835o02514k74957q00226
14185B1022024k86440n37085j121762K01034l68815n26352l08932l43888n56386
14176A7173398k59917m10681N013l86261m25359n23973Q3011m33120m03536l23275
14166A4095300K43106q26979l87241K01257n15493l83817K23618m62827l02113
14157A1884811J6004k57660n38587l8914O1337l40309M463j85622m95028j84847
14147I925648O293m9437k10562o6023j15917k45273l6181j36753p755j80067k03489
14136H680484j90216j98187l07591J80472k32048l36372L34842k22751k30623
14127G478010J57245k57906M1293m89665P4305K35073m37764m8950j52664J36729
$$ plain form
14117 6735706 6363920 6204195 6318806 6377861 6158399 6044333 5999027 5760710 5822844 5631485
14107 5631485 5830734 5772145 5823489 5328887 5481801 5409354 5184864 5274338 5466328 4974439
14097 4974439 4777718 5076428 5021505 5059945 4703796 4387105 4552287 4563686 4672967 4312625
14087 4312625 4502773 4552476 4208018 4136389 4254327 4283299 3916915 4331359 4291230 4222352
14077 4222352 4188809 4103294 3829379 3645906 3972566 3784067 3387771 3703971 3606478 3912788
14067 3912788 3684485 3661072 3718894 3563263 3373460 3569182 3758786 3470420 3200728 3533662
14057 3533662 3373893 3467776 3388501 3124517 3108282 3149247 2842707 2782498 3103580 2844556
14047 2844556 3011860 2891649 3064828 3160446 2640368 2802445 2685050 3054786 3239160 2809784
$$ packed form
14117F735706l71786j59725J14611N9055k19462j14066m5306k38317O2134j91359
14107E631485J99249n8589N1344m94602J52914p2447k24490Q9474J91990m91889
14097D974439j96721K98710n4923L8440l56149l16691J65182J1399J09281l60342
14087D312625J90148M9703l44458p1629J17938K8972l66384M14444m0129o8878
14077D222352l3543q5515k73915j83473L26660j88499l96296L16200r7493L06310
14067C912788k28303k3413N7822j55631j89803J95722J89604k88366k69692L32934
14057C533662j59769R3883p9275k63984j6235M0965l06540o0209L21082k59024
14047B844556J67304j20211J73179R5618n20078J62077j17395L69736J84374m29376
$$ plain form
14037 2809784 2822732 2701386 2537663 2605763 2672138 2880417 2655681 2410951 2478582 2614097
14027 2614097 2496198 2395898 2932450 2507087 2748622 2688368 2328554 2019658 2048064 2228963
14017 2228963 2301324 2123971 2337538 1957892 2153603 2218625 2068019 2174996 1966169 1949806
14007 1949806 1782196 2179593 1900325 2165125 1588573 1764020 1463359 1866060 2036990
13998 2036990 1422007 1736379 1669401 1614450 1521662 1619031 1443426 1309923 1857342 2997538
13988 2997538 4994092 10829517 26503053 52290435 29177694 11824337 6574896 4767213
13980 4767213 3695747 3400296 3336377 2739358 2752466 2500525 2574668 2300842 2409790 2642211
13970 2642211 2351912 2207361 2123353 2112401 2026503 2057259 2227013 2198659 2330159 2028724
$$ packed form
14037B809784J2948j21346j63723O8100O6375K08279k24736k44730O7631J35515
14027B614097j17899j00300N36552m25363K41535o0254l59814l08896K8406J80899
14017B228963P2361j77353K13567l79646J95711O5022j50606J06977k08827j6363
14007A949806j67610L97397k79268K64800n76552J75447l00661M02701J70930
13998B036990o14983L14372o6978n4951r2788R7369j75605j33503N47419J140196
13988B997538J996554N835425J5673536K5787382k3112741A1824337n249441j807683
13980D767213j071466k95451o3919n97019J3108k51941P4143k73826J08948K32421
13970B642211k90299j44551q4008j0952q5898L0756J69754k8354J31500l01435
$$ plain form
13960 2028724 1947613 1916515 1621693 1621685 1593456 1785417 1970287 1595456 1734860 1953166 1803519
13949 1803519 1442401 2059157 1654748 1576728 1774168 1525404 1683112 1736511 1723261 1867894
13939 1867894 1801260 1526440 1759068 1641143 1218665 1656189 1544123 1373868 1456384 1254131
13929 1254131 1522140 1407770 1524684 1144095 1157148 1296851 1295308 1326726 1514140 1299813
13919 1299813 1211648 1223495 1203488 951023 1090220 1207686 1163545 1270381 1362651 1021042
13909 1021042 1250029 1285880 1264669 1216395 887465 1615700 1187814 1270417 1494220 1222727
13899 1222727 1035678 1531543 1035431 1205101 1411194 1118170 1335751 810918 1090318
13890 1090318 1173453 1080694 1127052 1010264 1183825 1100840 1302051 1260456 902698 983531
$$ packed form
13960B028724q1111l1098k94822qk8229J91961J84870l74831J39404K18306j49647
13949A803519l61118O16756m04409p8020J97440k48764J57708N3399j3250J44633
13939A867894o6634k74820K32628j17925m22478M37524j12066j70255Q2516k02253
13929A254131K68009j14370J16914l80589J3053J39703j543L1418J87414k14327
13919A299813q8165J1847k0007k52465J39197J17466m4141J06836R2270l41609
13909A021042K28987L5851k1211m8274l28930P28235m27886Q2603K23803k71493
13899A222727j87049M95865m96112J69670K06093k93024K17581n24833K79400
13890A090318Q3135r2759M6358j16788J73561q2985K01211m1595l57758Q0833
$$ plain form
13880 983531 929738 885742 869467 1262617 1067519 1167421 902745 972772 1105564 1013685 1040950
13869 1040950 975440 1098894 897372 793450 738591 1392108 963467 986896 1097393 911153
13859 911153 977482 722555 980501 753793 975434 821311 894330 922588 1225600 723016
13849 723016 1041354 671815 1092509 1018004 856813 826861 820454 1116041 797999 887747
13839 887747 606858 832797 419488 504116 1107268 569521 849844 644145 658896 858791
13829 858791 808586 856045 752049 699177 1018445 773782 943951 970988 742033 895249
13819 895249 997983 798733 640329 525006 850274 721604 868084 504870 651608 862471
13809 862471 694405 697966 1189081 595063 882381 694118 664915 338237 458205 843289
$$ packed form
13880I83531n3793m3996j6275L93150j95098R9902k64676P0027J32792r1879K7265
13869A040950o5510J23454k01522j03922n4859O53517m28641K3429J10497j86240
13859I11153O6329k54927K57946k26708K21641j54123P3019K8258L03012n02584
13849G23016L18338l69539M20694p4505j61191k9952o407K95587l18042Q9748
13839H87747k80889K25939m13309Q4628O03152n37747K80323k05699J4751J99895
13829H58791n0205M7459j03996n2872L19268k44663J70169K7037k28955J53216
13819H95249J02734j99250j58404j15323L25268j28670J46480l63214J46738K10863
13809H62471j68066L561M91115n94018K87318j88263k9203l26678J19968L85084
$$ plain form
13799 843289 739604 747178 840420 928065 623167 489070 729733 587705 626424 780871
13789 780871 687581 442582 609221 854782 802088 300189 498458 699414 402263 731459
13779 731459 603913 300755 796654 695537 675310 525789 552928 487823 645547 680215
13769 680215 430106 258702 490253 597231 394514 451077 765614 603612 509358 553822
13759 553822 696717 231521 322817 307436 547195 590234 660150 679604 525542 652114
13749 652114 493817 472246 535221 330830 490421 285249 914084 553592 921499 447842
13738 521485 369622 613757 722743 439076 350924 420068 349830 329427 577147 543122
13728 543122 593310 376303 501467 553654 360566 571598 475312 848895 124660 754601
$$ packed form
13799H43289j03685P574R3242Q7645l04898j34097K40663j42028L8719J54447
13789G80871r3290k44999J66639K45561n2694C00189J98269K00956k97151L29196
13779G31459j27546C00755M95899j01117k0227j49521K7139o5105J57724L4668
13769F80215k50109j71404K31551J06978k02717N6563L14537j62002r4254M4464
13759E53822J42895B31521R1296j5381K39759M3039O9916J9454j54062J26572
13749F52114j58297k1571O2975k04391J59591k05172O28835l60492L67907D47842
13738E21485j51863K44135J08986k83667q8152O9144p0238k0403K47720l4025
13728E43122N0188k17007J25164N2187j93088K11032r6286L73583A24660O29941
$$ plain form
13718 754601 735766 337375 516545 448641 428303 341699 187426 358434 493346 344599
13708 344599 315991 445797 370147 535270 767134 697581 493491 806926 332595 542449
13698 542449 290788 581705 617610 370459 646948 899670 572229 421314 736402 542034
13688 542034 306902 410547 389904 330287 561358 58176 491853 587211 531939 333288
13678 333288 652045 389671 550260 362910 202862 510637 162016 442749 163054 636219
13668 636219 281575 571388 281807 427931 431150 255296 454038 532354 728909 407905
13658 407905 15331 107346 190606 548625 410442 68187 400036 442707 724756 343175
13647 286798 513223 403651 489662 499687 195532 495543 643956 448429 413280 330735
$$ packed form
13718G54601j8835C37375J79170o7904k0338q6604j54273J71008J34912j48747
13708C44599k8608J29806p5650J65123K31864o9553k04090L13435C32595K09854
13698E42449k51661K90917L5905k47151K76489K52722l27441j50915L15088j94368
13688E42034k35132J03645k0643n9617K31071E8176M33677R5358n5272j98651
13678C33288L18757k62374J60589j87350j60048L07775A62016K80733A63054M73165
13668F36219B81575K89813B81807J46124L219j75854J98742P8316J96555l21004
13658D07905A5331R2015Q3260L58019j38183F8187L31849M2671K82049C43175
13647B86798K26425j09572Q6011J0025A95532L00011J48413j95527l5149q2545
$$ plain form
13637 330735 448291 758786 226243 284454 547410 966373 413814 521054 311377 664903
13627 664903 605016 567895 355257 83351 281222 403481 353496 270358 339161 71329 414288
13616 414288 251634 150268 141923 336488 561300 574920 251736 312370 380959 247356
13606 247356 247510 448084 562840 543882 428916 531944 146157 446289 -54085 503024
13595 558322 419955 -133735 372270 409454 505747 459913 197914 614781 -16923 190605
13584 96069 182915 598965 319979 405417 531350 287503 397044 262803 382421 138714
13573 137816 282098 263546 72154 324440 375846 417630 54778 144693 140218 399277 393249
13562 393249 229756 367638 181916 -104877 565968 685260 443101 248511 44809 201312
$$ packed form
13637C30735J17556L10495B26243N8211K62956M18963D13814J07240k09677L53526
13627F64903n9887l7121k12638H3351J97871J22259m9985q3138O8803G1329L42959
13616D14288j62654j01366q345J94565K24812J3620B51736O0634O8589j33603
13606B47356J54K00574J14756j8958j14966J03028A46157L00132e4085E03024
13595E58322j38367a33735C72270L7184R6293m5834A97914M16867a6923A90605
13584I6069Q6846M16050k78986Q5438J25933k43847J09541j34241J19618A38714
13573A37816J44282j8552G2154K52286N1406M1784E4778Q9915m475K59059o028
13562C93249j63493J37882A81916a04877E65968J19292k42159j94590D4809J56503
$$ plain form
13552 201312 327556 419112 309033 285599 310278 6223 80520 142741 -772 -25008 399908
13540 218960 250285 80907 483376 356317 120968 302747 149923 156353 144378 122012 388937
13529 388937 186583 326077 -76295 322047 41679 419523 -119774 369258 333090 68775
13518 435266 348927 17612 343411 367444 222085 20633 252739 140820 186129 -2300 799761
13506 132869 544766 197698 280908 -68373 276753 178005 207541 323105 109397 307835
13496 307835 -7751 117837 321399 352977 31381 177872 214507 263091 515846 231118 432294
13485 432294 235024 354131 332228 372510 91350 -27261 356685 101935 274987 277364 52076
13473 247543 77079 150989 137091 206642 463849 101613 307898 396958 461704 -112521 282030
$$ packed form
13552B01312J26244R1556j10079k3434K4679F223P4297O2221g72k4236C99908
13540B18960L1325H0907M02469j27059A20968J81779A49923O430j1975k2366K66925
13529C88937A86583J39494g6295C22047D1679L77844a19774C69258l6168F8775
13518D35266q6339A7612L25799K4033j45359B0633K32106j11919M5309b300G99761
13506A32869M11897A97698Q3210f8373B76753r8748K9536J15564A09397J98438
13496C07835g751A17837K03562L1578C1381J46491L6635M8584K52755B31118K01176
13485D32294j97270J19107k1903M0282I1350b7261C56685A01935J73052K377E2076
13473B47543G7079P3910j3898O9551K57207A01613K06285Q9060O4746a12521B82030
$$ plain form
13461 249047 257811 143637 148134 641944 270672 293797 238530 413413 126618 93562 430445
13450 430445 183731 254855 28504 -84916 255088 230504 38293 149240 315188 170211
13440 170211 195219 137337 18633 205982 226682 654652 -89839 202319 -185998 270991
13429 109225 105831 -69177 307911 -45271 -59586 273461 194326 343408 281201 333576 -34945
13417 327495 430418 -173841 173063 275803 -79493 97641 104600 -91372 563999 -5575 77045
13405 129315 73205 43008 65528 241109 7172 272701 170076 75704 479330 -3621 101363
13393 114025 533432 189623 29499 371459 101534 16546 45654 220502 259441 99893
13382 333444 469423 309848 257093 -186253 85441 152198 131431 -3412 397807 -147738 114699
$$ packed form
13461B49047Q764j14174M497M93810B70672K3125n5267J74883A26618l3056L36883
13450D30445A83731P1124B8504h4916B55088k4584C8293J10947J65948j44977
13440A70211K5008n7882A8633J87349K0700M27970h9839B02319a85998B70991
13429A09225l394f9177C07911d5271j4315B73461p9135J49082o2207N2375c4945
13417C27495J02923a73841A73063J02740g9493I7641O959i1372E63999e575G7045
13405A29315n6110l0197K2520J75581G172K65529j02625G5704M03626c621A01363
13393A14025M19407A89623B9499L41960A01534A6546K9108J74848L8939I9893
13382C33444J35979j59575n2755a86253H5441O6757k0767c412C97807a47738A14699
$$ plain form
13370 -88854 -47808 80269 258500 605075 294516 278670 110667 461317 23913 244326
13360 244326 538784 102101 376595 505188 198918 103773 262243 332899 409281 496152
13350 496152 212342 65352 209645 -102840 88349 254893 255010 122268 392687 359446 412494
13339 412494 326755 150486 345852 141037 410631 436990 280666 157653 498988 203221
13328 586051 229893 151331 333902 135216 23072 263495 89974 123467 351528 352534 96687
13316 440573 324040 -1144 265496 151019 21226 746293 307785 235254 32419 -77912 344266
13304 220722 7250 71596 301383 -164561 -171709 345811 269152 112161 26013 103815 399210
13293 399210 20431 292190 455590 -160535 8485 345007 -12404 151200 264425 53328
$$ packed form
13370h8854M1046H0269J78231L46575B94516j5846A10667L50650B3913K20413
13360B44326K94458A02101K74494J28593A98918r5145J58470P0656P6382Q6871
13350D96152B12342F5352J44293a02840H8349J66544J17A22268K70419l3241N3048
13339D12494q5739A50486J95366A41037K69594K6359j56324j23013L41335B03221
13328E86051B29893p8562J82571A35216B3072K40423H9974L3493K28061J006I6687
13316D40573j16533a144B65496j14477B1226P25067C07785p2531C2419g7912C44266
13304B20722G250O4346K29787a64561p148C45811p6659A12161B6013P7802K95395
13293C99210B0431K71759J63400a60535H485L36522a2404A51200J13225E3328
$$ plain form
13282 128352 340830 190467 -43486 117075 124871 106076 -89936 -82720 235946 50432 -33329
13270 258768 396885 112386 180372 -6141 39548 -52511 91607 176160 -64512 169874 216898
13259 216898 127356 154347 -80944 -137552 196143 43569 254232 215173 54330 -99173 162661
13247 90878 115454 153211 299129 -100676 -152156 -161199 17214 419662 238080 324752 142769
13235 32824 15987 118399 33745 18397 -54397 107337 575049 457834 117277 78170 393131
13224 393131 410688 -71739 -61233 -44556 -19289 289892 195050 177816 254640 177651 89436
13213 89436 -62915 -157310 -144772 -210934 243716 521495 121323 319983 -170917 -65245 87274
13201 28942 289060 -1481 -79986 126359 75175 127461 15381 209307 -24868 -204042 312468
$$ packed form
13282A28352K12478j50363d3486A17075P796j8795h9936P216B35946E0432c3329
13270B58768J38117A12386O7986f141C9548e2511I1607Q4553f4512A69874M7024
13259B16898q9542K6991h0944n6608A96143D3569K10663l9059E4330i9173A62661
13247I0878K4576L7757J45918a00676n1480r043A7214M02448j81582Q6672A42769
13235C2824A5987J02412C3745j5348e4397A07337M67712j17215A17277l9107L14961
13224C93131J7557g1739J0506J6677a9289B89892r4842j7234P6824p6989q8215
13213H9436f2915r4395J2538o6162B43716K77779A21323J98660a70917f5245H7274
13201B8942K60118a481p8505A26359n1184N2286A5381J93926b4868j79174C12468
$$ plain form
13189 -140771 62006 383366 78884 278343 172545 115603 157255 -118829 211690 -144963
13178 -252054 -29306 242171 127895 152209 225880 5395 -238277 184247 10881 133112 148078
13167 148078 105744 200567 224247 157378 284408 -44981 -20547 293272 233666 314263 217927
13156 217927 127334 -409256 358147 -65992 -67679 -127460 230078 -24978 -73909 97248 234520
13145 234520 -269358 209629 49129 -20931 208697 -353946 -213724 -228200 220710 104901
13134 240081 113310 -26899 72157 138145 157809 241404 -334641 184290 35896 32432 -282092
13122 125942 183885 24168 70673 -126426 63912 96613 428687 -74330 -56958 29182 -3833
13110 306765 -77117 255907 127723 9076 -111600 108870 56554 -54986 397709 -12746 253525
$$ packed form
13189a40771F2006L21360G8884J99459j05798n6942M1652a18829B11690a44963
13178b52054b9306B42171j14276K4314P3671E395b38277A84247A0881J22231J4966
13167A48078m2334R4823K3680o6869J27030d4981b0547B93272n9606Q0597r6336
13156B17927r0593d09256C58147f5992j687n9781B30078b4978m8931I7248J37272
13145B34520b69358B09629D9129b0931B08697c53946J40222j4476B20710A04901
13134B40081A13310b6899G2157O5988J9664Q3595c34641A84290C5896l464b82092
13122A25942N7943B4168M6505a26426F3912L2701L32074g4330J7372B9182c833
13110C06765g7117B55907A27723I076a11600A08870n2316e4986C97709a2746B53525
$$ plain form
13098 -114766 -3748 7091 109108 -197908 266601 -228886 10531 130857 43276 44162 -105000
13086 -340514 31414 -3586 137650 -67244 64132 49006 -135526 -124781 16363 -207425 141501
13074 -43697 26601 193546 249255 116213 31884 53675 215141 190234 688 238017 24585
13062 -204163 193369 184547 -67795 156450 88494 -170735 -451941 -139212 -79193 62398 147635
13051 147635 11742 -485 55151 259930 209243 -311115 61301 58172 94590 7215 -68285 198477
13038 90993 134248 -20158 -243718 -198286 225858 -399059 -62268 -20007 361496 46980 -182901
13026 -244296 158317 231027 51838 45533 -173311 -22942 241961 -194773 119118 -6820 -174916
13015 -174916 -109154 -260410 238412 56118 48161 -211727 137694 73945 19266 32631 -54241
$$ packed form
13098a14766c748G091J02017a97908B66601b28886A0531J20326D3276Q86a05000
13086c40514C1414c586A37650f7244F4132j5126a35526J0745A6363b07425A41501
13074d3697B6601J66945N5709A16213C1884K1791J61466k4907F88K37329B4585
13062b04163A93369q822f7795A56450o7956a70735k81206a39212O0019F2398Q5237
13051A47635A1742d85E5151K04779n0687c11115F1301l129L6418G215f8285A98477
13038I0993M3255b0158k23560M5432B25858c99059f2268b0007C61496D6980a82901
13026b44296A58317P2710E1838o305a73311b2942B41961a94773A19118f820j68096
13015a74916O5762j51256B38412E6118p957b11727A37694o3749A9266J3365e4241
$$ plain form
13003 -368373 320156 169393 -111522 251233 177184 13590 19397 116353 -41563 -310547 39508
12991 -371836 19662 -195674 85148 -329699 67846 379490 56863 108562 292725 26071 -27924
12979 234649 17502 -114370 180587 55702 -127641 86723 -104088 185510 -271983 24040
12968 -244833 -28025 186507 134380 -79566 -56390 -5766 250221 -153108 51781 -32006 149948
12956 -175196 207997 -109537 -187971 -179141 19797 111100 254215 -50449 -107816 -84146 32690
12944 124680 438984 -266267 -88632 127218 -68039 117967 -119932 36247 -136457 -32329
12933 113397 94559 -116472 3112 152625 27567 -150976 102085 -183404 248937 149316
12923 149316 -74529 113962 129117 45208 133692 -226489 45801 -278780 -180663 60476 -147146
$$ packed form
13003c68373C20156j50763a11522B51233p4049A3590N807R6956d1563k68984C9508
12991c71836A9662a95674H5148c29699F7846L11644E6863N1699J84163B6071b7924
12979B34649A7502a14370A80587E5702a27641H6723a04088A85510b71983B4040
12968b44833b8025A86507n2127g9566K3176e766B50221a53108E1781c2006A49948
12956a75196B07997a09537p8434Q830A9797R1303J43115e0449n7367K3670C2690
12944A24680L14304b66267h8632A27218f8039A17967a19932C6247a36457c2329
12933A13397j8838a16472C112J49513B7567a50976A02085a83404B48937r9621
12923A49316g4529A13962J5155D5208Q8484b26489D5801b78780R8117F0476a47146
$$ plain form
12911 -24569 171629 84506 34195 -72406 -55484 -54870 -75982 -78638 -12564 -24808 -200824 66632
12898 -233525 -68128 95139 -197736 -178441 -68063 -673 166218 -30382 30195 107631 -124015
12886 -315440 -477902 55448 270807 -45978 -69 188840 -202344 38397 68383 109990 -136340
12874 29820 -22132 160480 169330 -257421 -11876 132012 231743 120581 -55909 -161617 68494
12862 145337 24246 51571 151007 -256160 137116 -241497 176876 -287169 -20284 336947
12851 -175768 96074 -127737 238523 -166994 113383 -127468 302530 -69340 -93919 181597
12840 -40065 -179278 -294461 33996 -76908 -120203 14950 3104 -85013 20226 237595 1654
12828 -109428 346372 -29039 -133206 49390 204516 -118665 24757 247204 -74991 263402
$$ packed form
12911b4569A71629H4506C4195g2406J6922O14k1112k656a2564j2244j76016F6632
12898b33525f8128I5139a97736J9295f8063f73A66218c0382C0195P7436a24015
12886c15440j62462E5448K15359d5978f9A88840b02344C8397K9986M1607a36340
12874B9820b2132A60480Q850b57421a1876A32012R9731j11162e5909j05708F8494
12862A45337B4246K7325R9436b56160A37116b41497A76876b87169b0284C36947
12851a75768I6074a27737B38523a66994A13383a27468C02530f9340k4579A81597
12840d0065j39213j15183C3996g6908m3295A4950C104h5013B0226K17369A654
12828a09428C46372b9039j04167D9390J55126a18665B4757K22447g4991B63402
$$ plain form
12817 -232016 25966 107312 146411 -70188 217084 279018 -453852 -34490 -318485 14924 304423
12806 304423 -50518 -7011 -331005 222320 148397 11558 315029 -132637 -325485 113141
12795 89484 156550 255974 -12267 -275494 -517690 85224 232398 139928 -47577 -16962 -152167
12784 -152167 -220057 18417 353166 179362 -173564 -38206 191207 173193 -213300 -181988
12774 -181988 32126 -16087 -161223 -63278 139013 -49806 140735 190128 -65631 -352917 92387
12762 -90918 -256036 123277 -183270 230229 -29460 43801 111410 -127251 279835 -66921
12751 -263849 -214902 111203 -359754 -3730 28858 -49839 -39336 77109 51964 48879 49765 -147689
12738 -141380 169220 189888 28259 -59503 -397372 252888 -149121 -95036 -89288 -210867 9123
$$ packed form
12817b32016B5966Q1346L9099g0188B17084O1934d53852c4490k83995A4924K89499
12806C04423e0518g011l23994B22320p3923A1558L03471a32637j92848A13141
12795H9484O7066R9424a2267k63227k42196H5224J47174r2470d7577a6962j35205
12784a52167o7890A8417L34749j73804a73564c8206A91207j8014b13300L1312
12774a81988C2126a6087j45136f3278A39013d9806A40735M9393f5631k87286I2387
12762i0918j65118A23277a83270B30229b9460D3801O7609a27251B79835f6921
12751b63849M8947A11203c59754c730B8858d9839J0503G7109k5145l085Q86a47689
12738a41380A69220K0668B8259e9503l37869B52888a49121N4085N748j21579I123
$$ plain form
12726 -28270 90653 -160178 -94221 -119828 -186160 -87593 -116458 -97067 -80955 71483 -74892
12714 -180777 60293 5262 144618 161075 54336 449111 -110118 -105038 238371 -113673 -413830
12703 -413830 22956 -124589 -36592 -359999 -32528 96482 -357050 -221783 126190 344554
12693 344554 -265422 -337620 -15109 420716 509268 143490 177567 721 -435221 -236944 147830
12681 16296 -101511 178699 -215411 -138737 -95113 183178 28671 190897 85657 -82469 135355
12669 -91525 303871 206200 7820 50030 233140 245848 267850 200471 73836 -21122 182767
12657 167776 -277257 -23597 350768 -240428 118874 105960 301830 308375 573 208710 -324648
12645 18734 -191652 -131703 100025 -77618 62588 168809 23303 202546 355331 22284 196051
$$ packed form
12726b8270I0653a60178O5957k5607o6332h7593k8865J9391J6112G1483g4892
12714a80777F0293E262J39356J6457E4336L94775a10118N080B38371a13673l00157
12703d13830B2956a24589c6592l23407c2528I6482c57050J35267A26190K18364
12693C44554b65422p2198a5109D20716Q8552A43490L4077G21d35221J98277A47830
12681A6296a01511A78699b15411P6674M3624A83178B8671J62226H5657h2469A35355
12669i1525C03871r7671G820M2210J83110J2708K2002o7379G3836b1122A82767
12657A67776b77257b3597C50768b40428A18874j2914J95870O545E73K08137c24648
12645A8734a91652N9949A00025g7618F2588J06221B3303J79243J52785B2284J73767
$$ plain form
12634 196051 91089 -34021 224404 159970 328670 348687 122537 166972 -160814 261845
12623 196604 25958 101966 -121875 438918 -207157 -8092 173758 224061 -73922 -96878 91556
12611 35152 -4983 200377 16564 54770 -49836 244355 278865 66194 16465 288199 -6719
12599 -355654 -10083 58786 -33420 189114 139554 104810 -13095 237920 349742 21089 -173924
12587 83253 18967 162613 -80854 23256 -549986 609 -34490 -176942 135031 248373 -11802
12575 -36498 -184555 -83533 -204356 -140352 -63967 -92625 408953 -15457 37279 -140532 307343
12563 50937 22903 132932 11470 -216053 -82651 61661 176147 -88507 111418 -123222 -193397
12552 -193397 207114 -131871 -276006 -35695 -108492 70606 -90653 -271468 254 85399 -90542
$$ packed form
12634A96051I1089c4021B24404o4434J68700K0017A22537M4435a60814B61845
12623A96604B5958P6008a21875D38918b07157h092A73758N0303g3922k2956I1556
12611C5152d983B00377A6564L8206d9836B44355L4510F6194A6465K71734f719
12599c55654a0083E8786c3420A89114m9560l4744a3095B37920J11822B1089a73924
12587H3253A8967J43646h0854B3256e49986F09c4490j42452A35031J13342a1802
12575c6498j48057h3533j20823O4004f3967k8658D08953a5457C7279a40532C07343
12563E0937B2903J10029A1470b16053h2651F1661J14486h8507A11418a23222p0175
12552a93397B07114a31871j44135c5695p2797G0606i0653j80815B54Q5145i0542
$$ plain form
12540 -153589 111913 44118 45582 138455 244063 -37987 396593 165664 303853 419343
12530 419343 491039 239141 -48622 113452 149061 -41147 -129685 35359 -216263 198399 324981
12519 324981 -204406 -124520 33918 51974 208588 -82321 -195158 219702 376226 226345
12509 226345 253177 101371 321135 381211 371282 606688 653846 815896 881677 572144 194074
12497 594514 286597 -29846 302188 97776 9866 339715 152752 295980 -220834 251254
12486 -132126 -57376 -226730 69264 87618 120025 -21852 289925 50573 94598 -115294 162518
12474 38923 341952 368023 504484 306650 287570 124469 169047 30036 -60128 184930 73407
12462 63456 381395 217351 -23110 -10703 -195364 31973 -24265 -27525 -169860 -153962 277749
$$ packed form
12540a53589A11913D4118J464R2873J05608c7987C96593A65664J38189J15490
12530D19343P1696B39141d8622A13452L5609d1147q8538C5359b16263A98399J26582
12519C24981b04406P9886C3918J8056J56614h2321j12837B19702J56524j49881
12509B26345K6832A01371K19764O0076r929K35406M7158J62050O5781l09533A94074
12497E94514B86597b9846C02188I7776I866L29849A52752J43228b20834B51254
12486a32126e7376j69354F9264J8354L2407b1852B89925E0573M4025a15294A62518
12474C8923L03029K6071J36461j97834j9080A24469M4578C0036f0128A84930G3407
12462F3456L17939j64044b3110a0703j84661C1973b4265l260j42335J5898B77749
$$ plain form
12450 118899 296673 -119490 -133445 -135515 91136 -469386 -437074 135491 180413 145525 197642
12439 197642 119695 -65683 -38519 -193133 -38402 57992 52766 -202412 350655 221238 271526
12428 271526 -106545 30464 25595 -106707 113296 -103329 8984 56562 168905 -25603 -4639
12416 109002 248266 -4141 176772 245365 223282 214828 63700 103201 -445297 -167 101800
12404 -18690 128472 -406000 -154321 74371 69410 244002 -13007 41307 -246885 65329 -66699
12392 214882 35950 116638 -133113 405481 24990 -90853 -178029 -31235 63075 79971 89232
12381 89232 -50542 -73180 -237653 299327 -21599 168321 214906 214164 237891 365851 -95690
12369 298230 -50947 -6174 -239119 184323 -118861 174698 110030 114802 -38359 64 -262690
$$ packed form
12450A18899J77774a19490j3955k070I1136d69386L2312A35491M4922l4888N2117
12439A97642p7947f5683K7164j54614c8402E7992n226b02412C50655j29417N0288
12428B71526a06545C0464m869a06707A13296a03329H984M7578J12343b5603d639
12416A09002J39264d141A76772O8593k2083q454F3700L9501d45297a67A01800
12404a8690A28472d06000a54321G4371m961J74592a3007D1307b46885F5329f6699
12392B14882C5950Q0688a33113D05481B4990i0853q7176c1235F3075J6896R261
12381H9232e0542k2638j64473B99327b1599A68321M6585p42K3727J27960i5690
12369B98230e0947f174k32945A84323a18861A74698o4668M772c8359F4b62690
$$ plain form
12357 196065 -86590 -88367 75997 -144428 -36328 55153 33872 -79475 162361 29114 -84890
12345 85420 50813 39892 -79093 286232 -4357 -179039 -215057 -93044 259941 208979 -333333
12333 163177 101657 32137 310996 146827 265819 448030 378174 272129 3893 284735
12323 284735 116833 -159636 331692 113035 36240 94876 294485 276599 88445 290272
12313 290272 170902 84778 60839 200527 -41406 248862 17893 247634 37958 43291 -192637
12301 412406 219747 -7812 159345 135463 -113054 -54509 398612 101835 272534 88310
12290 -83623 116269 -21728 -60461 219290 381824 345066 81578 36316 369420 126219 121337
12279 121337 138464 -21606 -17213 244967 -71211 26175 75453 -116039 182044 163200 -135401
$$ packed form
12357A96065h6590j777G5997a44428c6328E5153k1281g9475A62361B9114h4890
12345H5420l4607j0921g9093B86232d357j74682l6018i3044B59941n0962c33333
12333A63177o1520C2137K78859A46827J18992J82211o9856j06045C893K80842
12323B84735A16833a59636C31692A13035C6240N8636J99609j7886H8445K01827
12313B90272j19370H4778k3939J39688d1406B48862A7893K29741C7958N333a92637
12301D12406j92659g812A59345k3882a13054e4509C98612A01835J70699H8310
12290h3623A16269b1728l8733B19290J62534l6758H1578C6316L33104A26219m882
12279A21337J7127b1606M393B44967g1211B6175M9278a16039A82044j8844a35401
$$ plain form
12267 -60572 -261609 -127501 74098 55591 -460 -220337 -245250 -284128 87978 56014 139469
12256 139469 228681 -10963 200922 237442 314057 -243112 -167060 10762 94602 130840 318040
12245 318040 418826 555870 -20114 127362 127695 130679 -107136 176233 -32564 -157663 57085
12233 196349 -81532 128420 153497 6260 -52969 -14546 224944 91437 320676 461947 166806
12221 178691 169218 109426 452363 725908 391422 289828 247119 314465 -51328 161292 470480
12210 470480 308127 250801 110141 302821 81054 175509 124890 365218 146412 308409
12200 308409 379157 417511 392932 433663 312869 389675 511343 575568 466229 462375 562036
12189 562036 569764 539151 640767 555089 317905 336271 433474 428879 126944 303098 -18085
$$ packed form
12267f0572k01037a27501G4098j8507d60k19877k4913l8878H7978l1964Q3455
12256A39469Q9212a0963B00922L6520P6615b43112P6052A0762Q3840L6238J87200
12245C18040J00786J37044b0114A27362L33K984a07136A76233c2564j25099E7085
12233A96349h1532A28420K5077F260e2969a4546B24944I1437K29239J41271A66806
12221A78691r473n9792L42937K73545l34486j01594m2709O7346e1328A61292L09188
12210D70480j62353n7326A10141J92680H1054R4455n0619K40328A46412J61997
12200C08409P0748L8354k4579M0731j20794P6806J21668O4225j09339l854R9661
12189E62036P728l0613J01616q5678k37184J8366R7203m595A26944J76154a8085
$$ plain form
12177 296367 -7043 21506 263403 256775 62664 17445 197492 248722 153710 304471 452066
12166 452066 284604 72594 -22162 205254 -77388 455577 465555 231042 249958 79292 -77856
12154 484829 382254 256440 416895 228191 220127 -147077 303014 152431 226135 290192
12144 290192 475040 220842 69870 271784 277790 171182 79517 353628 380385 411493 430629
12133 430629 447832 299127 128271 532627 -1091 77442 240637 214144 -104023 223661
12122 365302 240012 129147 82644 -54121 202837 118550 45987 235694 -61052 -125908 132857
12110 354876 92171 355577 328887 351032 52388 229633 28216 111739 27814 72200 -231218
12098 -3294 18668 139403 61874 383413 -210337 -110032 172583 -12730 21898 22511 -44127
$$ packed form
12177B96367g043B1506K41897o628F2664A7445J80047N1230r5012J50761J47595
12166D52066j67462G2594b2162B05254g7388D55577R978B31042J8916G9292g7856
12154D84829j02575j25814J60455j88704q064a47077C03014j50583P3704O4057
12144B90192J84848B20842F9870K01914O006j06608G9517K74111K6757L1108J9136
12133D30629J7203j48705A28271M04356a091G7442J63195k6493a04023B23661
12122C65302j25290j10865m6503e4121B02837q4287D5987J89707f1052o4856A32857
12110C54876I2171K63406k6690K2145E2388J77245B8216Q3523B7814M4386b31218
12098c294A8668J20735F1874L21539b10337J00305A72583a2730B1898O13d4127
$$ plain form
12086 353606 97349 168872 -3357 233420 -149797 -84427 -46013 27397 202482 69804 182768
12075 182768 48694 -4688 122510 -212676 19664 -17549 95666 -17325 236895 216774 -61078
12063 -156420 197028 -159345 477804 -247184 -1457 -15830 -269282 -216471 -54662 34415 -218342
12051 95067 61124 117798 188151 182357 84039 -66333 -44205 76432 281366 14152 338631
12040 338631 173438 -80971 -21005 -125398 -14185 -59180 152718 -182472 325222 -55641
12029 306405 -237859 -332860 -77313 7178 152154 -336602 -22833 67846 218540 292219 -296602
12017 -201036 -114241 137544 168637 -14861 1923 122013 320541 -252041 62718 -164488 -43182
12005 286856 -94173 164224 261870 212762 -80970 24231 -68468 -284676 62791 -90165 -125831
$$ packed form
12086C53606I7349P1523c357B33420a49797O5370L8414B7397J75085F9804J12964
12075A82768D8694d688A22510b12676A9664a7549I5666a7325B36895k0121f1078
12063a56420A97028a59345D77804b47184a457j4373k53452N2811e4662C4415b18342
12051I5067l3943N6674P0353n794H4039f6333K2128G6432K04934A4152L24479
12040C38631j65193h0971b1005j04393a4185m4995A52718a82472C25222e5641
12029C06405b37859r5001g7313G178J44976c36602b2833F7846J50694P3679b96602
12017b01036Q6795A37544L1093a4861A923J20090J98528b52041F2718a64488d3182
12005B86856i4173A64224R7646m9108h0970B4231f8468k16208F2791i0165l5666
$$ plain form
11994 -125831 355337 -171951 -169732 -234651 -205958 110237 51313 -33792 -93504 -287629 -28734
11982 -143883 53861 -63623 132979 -199838 -3546 -199888 24010 -242206 41496 -33585 236902
11970 6452 -91090 -38667 -289690 -27018 -204178 -98811 69192 -153155 -205740 -39433 -159088
11959 -159088 17406 199365 88199 253924 12325 239902 -56936 185294 -94468 -315617
11949 -315617 -1198 -380653 374283 436733 -141148 -15563 209081 -76931 -105449 47536 -42553
11937 117808 -89410 -83634 211184 -87489 62505 -20796 90545 -121695 -229736 -115203 10207
11925 -59848 13864 -134297 -28664 -200633 -39383 -161273 -79714 163311 63516 -26148 109830
11913 77920 163877 9512 -344409 -45689 -8239 89051 -148521 201343 53506 33866 -91685
$$ packed form
11994a25831C55337a71951K219o4919K8693A10237E1313c3792n9712j94125b8734
11982a43883E3861f3623A32979a99838c546j96342B4010b42206D1496c3585B36902
11970F452i1090c8667k51023b7018j77160i8811F9192a53155n2585c9433j19655
11959a59088A7406J81959H8199J65725A2325K27577e6936A85294i4468k21149
11949c15617a198l79455C74283O2450a41148a5563B09081g6931k8518D7536d2553
11937A17808h9410N776B11184h7489F2505b0796I0545a21695j08041J14533A0207
11925e9848A3864a34297b8664j71969c9383j21890g9714A63311F3516b6148A09830
11913G7920Q5957I512c44409d5689h239H9051a48521B01343E3506j9640i1685
$$ plain form
11901 105742 193683 179070 31416 15032 133648 -182655 -178652 -146036 76277 -453147 -58461
11889 24455 -18378 -90911 -17761 69389 39204 -176207 62699 85877 -399948 -94382 -324107
11878 -324107 -329707 3071 112334 49275 -351363 -83349 56728 -242637 -40314 -274984 -115517
11866 -123379 -310658 130134 -146703 178482 -196068 -136421 -214953 -61568 -101167 -22143
11855 -259800 -42507 -198080 129087 -155907 -86702 42114 68759 52126 213937 -4921 308497
11843 -430226 152878 -158974 -46069 88881 -192894 -285646 -391026 -82367 70014 -256035
11832 79720 -240626 -484993 -121379 -170686 -75271 229216 89333 -228407 -112977 -404712
11822 -404712 -80955 250459 114624 -1446 47477 -168342 -47866 49503 -41249 -139920 -61103
$$ packed form
11901A05742Q7941j4613C1416A5032J18616a82655M003L2616G6277d53147e8461
11889B4455a8378p2533a7761F9389l0185a76207F2699K3178c99948i4382k29725
11878c24107n600C071J09263D9275c51363h3349E6728b42637d0314k34670a15517
11866a23379j87279A30134a46703A78482a96068N9647p8532f1568l9599b2143
11855b59800d2507j55573A29087a55907O9205D2114K6645j6633J61811d921C08497
11843d30226A52878a58974d6069H8881a92894r2752j05380h2367G0014b56035
11832G9720b40626k44367a21379m9307g5271B29216H9333b28407a12977k91735
11822d04712h0955B50459A14624a446D7477a68342d7866D9503d1249r8671f1103
$$ plain form
11810 18307 -190628 -173181 -24857 -41186 74319 155483 -195448 254670 -68094 -267837 -29207
11798 272934 -126526 -89154 -145362 40219 131428 -119782 228608 -211886 -244624 103179
11787 37561 219181 -14022 13920 -203544 127607 -28314 -109909 65506 -222663 -130356 -30019
11775 3352 -146766 38979 -154967 58301 234976 80559 -47561 -84895 -97841 52737 -238504
11763 -295575 -273907 -233189 78362 5296 152020 16559 149176 91310 165432 240387 -140350
11751 -306120 -156783 -130827 76955 -190294 -206302 323576 273094 -314699 -2552 -246254 -111482
11739 -16041 114130 -178080 -100420 -75307 -134462 -134110 281779 -174420 237373 216044 7700
11727 -75810 -202701 -409367 -235183 -95589 -75069 -197675 -119515 106528 104369 -321924 32166
$$ packed form
11810A8307a90628J7447b4857j6329G4319Q1164a95448B54670f8094j99743b9207
11798B72934a26526L7372n6208D0219R1209a19782B28608b11886l2738A03179
11787C7561J81620a4022A3920b03544A27607b8314q1595F5506b22663R2307c0019
11775C352a46766C8979a54967E8301J76675H0559d7561l7334j2946E2737b38504
11763b95575K1668M0718G8362E296J46724A6559J32617n7866P4122P4955a40350
11751c06120J49337K5956G6955a90294j6008C23576n0482c14699b552k43702a11482
11739a6041A14130a78080P7660K5113n9155L52B81779a74420B37373k1329G700
11727g5810j26891k06666J74184i5589K0520j22606P8160A06528k159c21924C2166
$$ plain form
11715 48303 73622 -137388 10094 -453505 -147035 -68146 194038 -74781 -282765 113166
11704 -225017 -158639 -193060 -93408 -47402 -164328 49093 460631 11679 116952 -258558 -105523
11692 81966 -33888 -223560 360410 142666 -345778 -48493 -436141 -86101 -284121 77527
11681 48759 -39676 -68720 -93012 13364 123436 -111366 99464 -189318 -176307 -22649 177408
11669 -182713 -137318 -30102 -67396 -26382 -270893 151542 103131 10163 144258 -132430 -76005
11658 -76005 71722 16674 30175 60813 -106890 -269261 -79222 10051 177024 -388868 -9993
11646 -108501 -78062 -109613 26981 -203617 41038 -24360 68440 135676 -179136 -193702 -269830
11635 -269830 93899 -19639 -118264 3542 -391988 5571 -100706 -89538 20146 194445 -1288
$$ packed form
11715D8303K5319a37388A0094d53505a47035f8146A94038g4781k07984A13166
11704b25017O6378l4421i3408M6006j16926D9093M11538A1679J05273b58558a05523
11692H1966c3888j89672C60410A42666c45778d8493l87648h6101j98020G7527
11681D8759c9676k9044k4292A3364J10072a11366I9464a89318J3011b2649A77408
11669a82713M5395c0102l7294b6382k44511A51542m8411A0163J34095a32430N6425
11658g6005G1722A6674J3501L0638a06890j62371g9222A0051J66973c88868i993
11646a08501L0439l1551B6981b03617D1038b4360F8440O7236a79136j4566p6128
11635b69830I3899a9639r8625C542c91988E571a00706J1168B0146J74299a288
$$ plain form
11623 -44607 -126989 -95806 -40705 154281 2937 -41685 102114 184520 18352 177734 -211850
11611 12531 -164076 -46798 -248290 111480 -217929 -24410 87805 64046 32040 -93867 348536
11599 -53427 -88649 129637 -359257 189521 137526 59601 -139216 7003 -192898 114232 -248921
11587 -143740 -326874 -122759 -154986 -42836 84562 -95617 446514 -173420 -279711 -165324
11577 -165324 -189652 -109934 178797 52470 -236569 172944 -161480 133324 -359145 258159
11566 166248 27766 28007 -15487 61935 136931 -202018 9060 -14905 -377418 -146871 361441
11554 171732 311405 -75135 -432765 127752 -7042 33628 -193947 -349131 31247 -153724
11543 78531 -372798 59926 -367174 -66102 7652 140858 -127341 -92943 84169 -28756 -107713
$$ packed form
11623d4607q2382L1183d0705A54281B937d1685A02114Q2406A8352J59382b11850
11611A2531a64076d6798k01492A11480b17929b4410H7805k3759l2006i3867C48536
11599e3427l5222A29637c59257A89521n1995E9601a39216G003a92898A14232b48921
11587a43740j83134a22759l2227d2836H4562i5617D46514a73420j06291J14387
11577a65324k4328P9718A78797E2470b36569A72944a61480A33324c59145B58159
11566A66248B7766K41a5487F1935P4996b02018I060a4905l62513a46871C61441
11554A71732J39673g5135l57630A27752g042C3628a93947j55184C1247a53724
11543G8531c72798E9926c67174f6102G652J33206a27341L4398H4169b8756p8957
$$ plain form
11532 -107713 71429 -76 65056 -71788 80018 252072 93592 48971 -254885 -80485 -35826 149005
11519 172727 202461 42086 108505 15597 171647 321056 40001 -189702 -59272 68040 87082
11508 87082 277969 -77736 55775 174690 434561 154249 165078 186953 213811 373144 140355
11496 498531 88995 70924 250504 233806 25845 381026 442782 366734 339237 677404 119321
11484 190979 123138 -132183 60419 222862 162335 -73315 259073 360408 280820 117951
11473 387569 166493 70180 69806 155899 324655 -58233 241779 59953 375780 -138442 122109
11461 611658 322627 438627 485635 256918 386045 255344 458551 300639 242926 218680
11451 218680 97541 324721 182258 127174 254371 389439 102110 -53075 118355 -14844
$$ packed form
11532a07713G1429g6F5056g1788H0018J72054I3592m4621b54885h0485c5826A49005
11519A72727K9734D2086O6419A5597J56050J49409D0001a89702e9272F8040J9042
11508H7082J90887g7736E5775J18915K59871A54249J0829K1875K6858J59333A40355
11496D98531H8995j8071J79580j6698B5845L55181O1756p6048k7497L38167A19321
11484A90979o7841a32183F0419J62443o0527g3315B59073J01335p9588A17951
11473C87569A66493G0180l74Q6093J68756e8233B41779E9953L15827a38442A22109
11461F11658k89031J16000M7008k28717J29127j30701K03207j57912n7713k4246
11451B18680I7541K27180j42463n5084J27197J35068A02110e3075A18355a4844
$$ plain form
11440 242026 55702 -13093 101996 157420 200578 222823 -6238 35366 -27861 154503 305770
11429 305770 138584 192962 285719 81777 409911 301345 368654 112146 -121019 165341
11418 256123 416957 -112110 122850 33911 -45860 -28339 -59812 -32253 -16959 -286457 -3420
11406 -18978 367079 -72711 52001 -500525 -93654 -22544 141679 59426 -242565 -60873 -53064
11395 -53064 -36121 79368 42358 -267894 -5231 8519 41000 -109740 -168133 232539 -58682
11383 27856 112378 -92736 -106487 -53346 179001 -78632 -45716 -295987 -209533 23971 44581
11372 44581 205277 -125050 -56696 -270389 -151452 -119897 -345440 47397 153335 -81507
11361 -46319 -211250 71878 44628 -109581 40920 -154998 -273882 -62641 45233 199563 65425
$$ packed form
11440B42026E5702a3093A01996N5424M3158K2245f238C5366b7861A54503J51267
11429C05770A38584N4378R2757H1777L28134j08566O7309A12146a21019A65341
11418B56123J60834a12110A22850C3911d5860J7521l1473K7559J5294k69498c420
11406a8978C67079g2711E2001e00525i3654b2544A41679E9426b42565f0873P809
11395e3064J6943G9368l7010b67894e231H519L2481a09740n8393B32539e8682
11383B7856Q4522i2736j3751N3141A79001g8632L2916k50271Q6454B3971K0610
11372D4581J60696a25050e6696k13693J18937L1555k25543D7397J05938h1507
11361d6319j64931G1878k7250a09581D0920a54998j18884f2641D5233J54330F5425
$$ plain form
11349 -32594 381245 -170462 162390 -104474 -101053 36892 208789 66686 87344 -23428 -183772
11338 -183772 232480 243727 75902 44744 -79910 -271744 74005 72418 -106058 90141 -24874
11326 31880 -348064 187474 -21935 -331622 -91409 -105566 53958 14046 131983 293467 41874
11314 -64514 47302 111452 153833 100839 261007 557 -66033 -327672 -1587 -118729 4393 181495
11302 181495 -135303 -284149 40302 -100570 179354 98801 192529 56716 18194 114656 -161174
11290 -302281 -42597 -4738 -134546 -31872 181101 115201 154829 -209405 -131863 400455 213049
11279 213049 -73113 144130 -102736 -219686 -243791 -10057 -94228 -7068 15792 -165360 119408
11267 -92074 -236287 -37252 150247 -115858 -36329 -214768 -92598 115167 -109400 133906
$$ packed form
11349c2594C81245a70462A62390a04474L421C6892J71897F6686K0658b3428j60344
11338a83772B32480J1247G5902l1158g9910j91834G4005j587a06058I0141b4874
11326C1880c48064A87474b1935l09687i1409j4157E3958A4046J17937J61484D1874
11314f4514D7302O4150M2381n2994J60168E57f6033k61639a587j17142D393J77102
11302A81495a35303j48846D0302a00570A79354q0553R3728E6716A8194R6462a61174
11290c02281d2597d738j29808c1872A81101o5900L9628b09405P7542D00455j87406
11279B13049g3113A44130a02736j16950k4105a0057q4171g068A5792a65360A19408
11267i2074j44213c7252A50247a15858c6329j78439i2598A15167a09400A33906
$$ plain form
11256 -80738 -8281 -187301 18828 -93131 -6840 -302479 -412755 -34479 -92201 -335547 -48929
11244 -330821 198114 10533 -184387 -46526 -117740 -54455 107901 -146255 214492 219848 -42703
11232 118317 -24171 -45491 -352299 -180299 -221440 210253 -36047 85950 -163698 20876 -122589
11220 -39049 -145731 -391845 -29821 181850 -54270 -177697 -285965 64574 -282797 86992
11209 -47287 -47065 -73262 -129501 -264536 -26072 -130179 -92530 -274811 156776 -139785 -44475
11197 -108880 15095 -115198 79504 -253053 -27492 100321 327780 124188 106471 -3308 -300070
11186 -300070 171859 -123420 -57630 -457557 274336 -95233 -71014 -212366 51981 254335
11176 254335 -149321 -115928 13448 164023 -298937 -143786 -149547 54990 -65463 -153254 -144255
$$ packed form
11256h0738h281j79020A8828i3131f840k95639j10276c4479n7722k43346d8929
11244c30821A98114A0533a84387d6526p1214e4455A07901a46255B14492N356d2703
11232A18317b4171k1320l06808J72000m1141B10253c6047H5950a63698B0876a22589
11220c9049j06682k46114b9821A81850e4270j23427j08268F4574b82797H6992
11209d7287K22k6197n6239j35035b6072j04107L7649j82281A56776a39785d4475
11197a08880A5095a15198G9504b53053b7492A00321K27459A24188j7717c308k96762
11186c00070A71859a23420e7630l99927B74336i5233K4219j41352E1981K02354
11176B54335a49321L3393A3448J50575b98937a43786n761E4990f5463q7791Q999
$$ plain form
11165 -144255 -59766 83663 -113303 -149678 -12639 -209219 250868 -218422 98090 -21821 85639
11153 141568 -387576 132282 -199802 -130203 42638 -127029 56923 -17556 129316 98830
11143 98830 -41288 -378087 280883 -334848 -262067 180600 -52593 50932 284034 247989 140271
11132 140271 77305 398670 218701 -31134 -172302 69484 123453 104470 -11715 160769 212708
11121 212708 179906 -98051 233724 34261 -63759 70982 319738 127711 46698 -33650 117378
11109 54436 178962 28419 238848 -1540 270980 101075 240020 70810 -53996 239813 558199
11098 558199 111693 226067 365874 558166 485146 369245 161241 353532 248597 40411
11087 439513 277603 245151 122887 344056 337028 257165 280291 399101 461078 391136 458458
$$ packed form
11165a44255e9766H3663a13303l6375a2639j96580B50868b18422I8090b1821H5639
11153A41568c87576A32282a99802O9599D2638a27029E6923a7556A29316l0486
11143I8830d1288l36799B80883c34848P2781A80600e2593E0932K33102l6045j07718
11132A40271o2966L21365j79969c1134j41168F9484N3969j8983a1715A60769N1939
11121B12708l2802i8051B33724C4261f3759G0982K48756A27711D6698c3650A17378
11109E4436J24526B8419K10429a540B70980A01075J38945G0810e3996B39813L18386
11098E58199A11693J14374J39807J92292p3020j15901A61241J92291j04935D0411
11087D39513j61910l2452j22264K21169p028p9863K3126J18810O1977o9942O7322
$$ plain form
11076 458458 591300 394139 619068 381661 615513 533377 552523 477032 538382 674436
11066 674436 617091 722203 719576 627995 504953 652357 685620 685037 472049 1127668 1017365
11055 1017365 1006682 1037496 1184241 1100293 917414 1092782 1187410 1301153 1552228 953585
11045 953585 1442016 1920553 1578521 1609500 1566076 1806916 1471993 1577491 1648783 1724142
11035 1724142 1601065 1716539 1726037 1792740 1576108 1723087 1643354 1259815 1541262 1456297
11025 1456297 1595939 1536904 1350161 1190911 1836186 1276861 1456023 1127370 1277981 1173995
11015 1173995 1400833 1030156 1046554 872218 1205159 988155 1062036 1293395 1400225 1160330
11005 1160330 1246126 1122383 1390749 1354337 1394017 1001463 1204174 1088393 1062056 1078956
$$ packed form
11076D58458J32842j97161K24929k37407K33852q2136J9146p5491O1350J36054
11066F74436n7345J05112k627r1581j23042J47404L3263n83k12988O55619j10303
11055A017365j0683L0814J46745q3948j82879J75368R4628J13743K51075n98643
11045I53585M88431M78537l42032L0979m3424K40840l34923J05498P1292P5359
11035A724142j23077J15474R498O6703k16632J46979p9733l83539K81447q4965
11025A456297J39642n9035j86743j59250O45275n59325J79162l28653J50611j03986
11015A173995K26838l70677J6398j74336L32941k17004P3881K31359J06830k39895
11005A160330Q5796j23743K68366l6412L9680l92554K02711j15781k6337J6900
$$ plain form
10995 1078956 1032384 1407888 1224402 999123 1151596 1184748 994095 966584 1459887 1303924
10985 1303924 1414795 1389695 1495310 1532086 1816714 1535269 1804590 2156128 2067041 2143539
10975 2143539 2265616 2003413 2426971 2782742 3381893 3731202 4450322 4669392 4952769
10966 4952769 6189360 6331961 7190012 6609971 6189053 5272659 4063045 2893069 2275043
10957 2275043 2178821 1606327 1319202 1466078 1337180 1242879 1227490 912449 995285 546209
10947 546209 548220 396932 462127 419404 93761 363222 125616 171324 161130 335934 382522
10936 382522 46604 200581 113505 137400 351376 164083 -99558 -107997 -114043 -3627 203492
10924 -167675 20419 195737 313736 366650 318469 -42328 -145684 -140228 3084 98308 77241
$$ packed form
10995A078956m6572L75504j83486k25279J52473L3152j90653k7511M93303j55963
10985A303924J10871k5100J05615L6776K84628k81445K69321L51538q9087P6498
10975B143539J22077k62203M23558L55771N99151L49309P19120K19070K83377
10966D952769J236591J42601Q58051n80041m20918r16394j209614j169976o18026
10957B275043r6222n72494k87125J46876j28898r4301j5389l15041Q2836m49076
10947E46209K011j51288O5195m2723I3761K69461A25616M5708j0194J74804M6588
10936C82522D6604J53977q7076K3895K13976A64083i9558q439o046c627B03492
10924a67675B0419J75318J17999N2914m8181d2328j03356N456C084R5224k1067
$$ plain form
10913 77241 290170 -239759 211229 -75542 236174 -50826 -3437 147679 72306 160764 285611
10902 285611 60616 135010 46441 73485 -15976 201471 -173348 -141697 146466 308366 -120307
10890 -261475 -57692 -166543 -311191 -209362 60194 -311530 -142857 10192 -149335 138675
10879 -235204 -169491 -251429 -169982 -251542 -223814 162492 -10651 -220420 -48533 106992 -139572
10867 -410856 115230 -234095 52794 -4766 -236127 -319160 -279421 -52274 -263963 -170355 198590
10855 129677 39176 -208221 -342677 -101851 198493 -12047 -239714 293623 -331203 107475
10844 -33928 -73139 -14159 -263221 -32338 188508 87281 -218120 235531 -65578 -128260 69808
10832 -127658 -269454 -80520 -153997 269209 -340248 -138137 -113152 -68795 176112 -17215
$$ packed form
10913G7241K12929b39759B11229g5542B36174e0826c437A47679G2306Q8458J24847
10902B85611F0616P4394D6441K7044a5976B01471a73348L1651A46466J61900a20307
10890b61475e7692j08851j44648J01829F0194c11530a42857A0192a49335A38675
10879b35204O5713q1938Q1447q1560K7728A62492a0651k09769d8533A06992a39572
10867d10856A15230b34095E2794d766k31361q3033L9739e2274k11689R3608A98590
10855A29677C9176b08221j34456a01851A98493a2047k27667B93623c31203A07475
10844c3928l9211a4159k49062c2338A88508H7281b18120B35531f5578o2682F9808
10832a27658j41796h0520p3477B69209c40248a38137K4985M4357A76112a7215
$$ plain form
10821 -30937 -167941 -57912 -8856 -154693 91408 -61777 -122171 -208651 -28539 -125893 501913
10809 126986 -204854 116326 -28981 35660 -117099 187721 69229 51504 41917 81116 -227013
10797 -29901 -139712 153654 96351 -166905 37040 -160134 -217100 -352681 169786 214613
10787 214613 -345916 -68692 7931 -118766 -88410 -72362 -182748 34934 -88343 -123213 237425
10775 168146 82734 -89321 110175 115995 -33995 -317264 -172329 16156 -214366 -128740 -135878
10764 -135878 32998 60888 -44381 55691 -371470 74282 -333609 59084 -1726 -146404 -240162
10753 -240162 434376 -66356 -5134 107958 -56229 -57265 -289336 -194635 13627 254542 -70868
10741 104398 -269 32353 -174168 136873 41687 58221 -177545 15567 -44031 19737 168117
$$ packed form
10821c0937j37004e7912h856j45837I1408f1777o0394q6480b8539r7354E01913
10809A26986b04854A16326b8981C5660a17099A87721F9229j7725r587L9199b27013
10797b9901j09811A53654n7303a66905C7040a60134n6966j35581A69786M4827
10787B14613c45916f8692G931a18766L0356J6048j10386C4934h8343l4870B37425
10775A68146H2734h9321A10175N820c3995k83269J44935A6156b14366Q5626p138
10764a35878C2998K7890d4381E5691c71470G4282c33609E9084a726j44678r3758
10753b40162D34376f6356e134A07958e6229j036k32071R4701A3627K40915g0868
10741A04398b69C2353a74168A36873D1687J6534a77545A5567d4031A9737J48380
$$ plain form
10730 168117 105764 -57851 -295874 -184389 -141173 -347474 -311343 536 198663 212158 -155989
10718 -43610 -67502 424754 90885 74629 -60361 -222137 -170182 -315408 -240288 -42179 -278345
10707 -278345 29230 49997 58329 -99982 -89897 -10975 -254727 -34596 -116120 113545 -296348
10695 305414 85569 -269446 -75201 -219785 -156057 -13533 -72348 -127981 -312286 -272205 -16192
10683 -248910 163008 -49502 -27012 -135889 322221 -129184 335007 58991 -274294 -151410
10673 -151410 -103943 -70405 -58751 -230821 24493 -111086 70467 -309589 44636 -190023 -338768
10662 -338768 -80981 108425 -114170 -133233 -318177 -181198 232534 109358 -253493 23446
10651 48586 -67237 -48534 -46568 255147 -18580 -131761 -158080 -248602 75799 -64263 -79879
$$ packed form
10730A68117o2353e7851k38023J11485M3216k06301L6131E36J98127J3495a55989
10718d3610k3892D24754I0885j6256f0361j61776N1955j45226P5120d2179k36166
10707b78345B9230K0767Q332i9982J0085a0975k43752c4596q1524A13545b96348
10695C05414H5569b69446g5201j44584O3728a3533n8815n5633j84305M0081a6192
10683b48910A63008d9502K2490j08877C22221a29184C35007E8991b74294J22884
10673a51410M7467L3538J1654j72070B4493a11086G0467c09589D4636a90023j48745
10662c38768h0981A08425a14170j9063j84944J36979B32534A09358b53493B3446
10651D8586f7237J8703J966B55147a8580j13181k6319r0522G5799f4263j5616
$$ plain form
10640 -79879 -87996 89704 -252181 -396706 75579 -174731 -250422 -123667 -102548 -279384 27271
10628 157908 -108639 -169227 233358 -187529 -245310 339237 68484 24836 -160570 -289585
10618 -289585 26181 -165854 48787 -59133 186513 -218527 -236704 50695 4283 148084 234209
10607 234209 -204261 95761 -189113 -85742 -66123 -102410 -159631 106516 -75763 -8806 -6016
10596 -6016 1515 11888 43737 42044 138446 -76364 326312 -23586 -165450 -303488 296443
10584 178760 84084 -284708 -6924 -108973 204961 88072 87049 -233417 -213498 -231931 -269556
10573 -269556 323480 350374 -214444 -340895 201221 -82909 -452260 243596 -193924 54621
10562 -267470 -272986 -271404 -285660 -102796 -186268 71885 109868 -17979 328713 109041 114509
$$ packed form
10640g9879q117H9704b52181j44525G5579a74731p5691a23667K1119j76836B7271
10628A57908a08639o0588B33358a87529n7781C39237F8484B4836a60570j29015
10618b89585B6181a65854D8787e9133A86513b18527j8177E0695D283J43801Q6125
10607B34209b04261I5761a89113h5742J9619l6287n7221A06516g5763h806K790
10596f016A515J0373L1849j693R6402g6364C26312b3586j41864j38038B96443
10584A78760H4084b84708f924j02049B04961H8072j023b33417J9919j8433l7625
10573b69556C23480K6894b14444j26451B01221h2909l69351B43596a93924E4621
10562b67470n516J582j4256a02796q3472G1885L7983a7979C28713A09041N468
$$ plain form
10551 114509 85999 180047 125734 273745 47665 -88612 100440 -121713 -195599 -161690 47664
10539 16364 179812 19553 330855 -18414 -270215 -14059 -308419 -296872 -152620 -145669 -120952
10528 -120952 -49648 -296693 -104858 -279308 15955 155038 53491 -268930 -92879 121105
10517 50598 -91985 -118066 133554 -140900 -392363 -99531 62441 -67313 -232228 -90957 128941
10505 89076 70651 -127068 -334231 116264 164244 -43289 44977 -10750 -314081 -81869 -81582
10494 -81582 -366536 -315670 -73146 -290212 193529 -309112 -189066 53335 123757 158532 -184191
10482 -205911 -221206 96133 -44351 -128697 169588 -103152 75796 -151751 267580 -146993
10471 -121229 277759 45068 -83864 -132166 -226676 -2121 62192 78350 -155066 -114742 -26474
$$ packed form
10551A14509k8510R4048n4313J48011D7665h8612A00440a21713p3886L3909D7664
10539A6364J63448A9553L11302a8414k51801a4059k94360J1547J44252O951K4717
10528a20952d9648k47045a04858j74450A5955J39083E3491b68930i2879A21105
10517E0598i1985k6081A33554a40900k51463i9531F2441f7313j64915i0957A28941
10505H9076j8425a27068k07163A16264M7980d3289D4977a0750l03331h1869K87
10494h1582k84954N0866g3146k17066A93529c09112J20046E3335P0422L4775a84191
10482b05911j5295I6133d4351q4346A69588a03152G5796a51751B67580a46993
10471a21229B77759D5068h3864m8302r4510b121F2192J6158a55066M0324b6474
$$ plain form
10459 -239621 228119 22234 -106802 -202378 159522 -407179 -31882 -96442 853 -73074 -328
10447 98046 -222086 -262269 -101598 14798 103084 81504 40187 92208 -320235 -53814 36270
10435 -89937 -421515 -148796 277734 60974 -95658 -310036 391613 188744 -34759 -93251
10425 -93251 -205733 -119752 -381168 -5925 10051 -480216 -64479 150675 -113906 116070 34253
10413 441452 14588 -149586 -171374 -30444 -30567 -78816 274996 36549 -85664 -193070 -266677
10402 -266677 -9512 -224397 -169305 91772 -151121 119834 14056 63562 315424 92220 36090
10390 510470 177487 609102 397614 530532 450295 266536 100067 -188380 141717 216953
10380 216953 118337 166307 148949 520105 509032 456926 354249 489526 769844 546702
$$ packed form
10459b39621B28119B2234a06802r5576A59522d07179c1882o4560H53g3074c28
10447I8046b22086m0183a01598A4798Q8286k1580D0187N2021c20235e3814C6270
10435h9937l31578a48796B77734F0974i5658k14378C91613A88744c4759n8492
10425i3251j12482Q5981k61416e925A0051d80216f4479A50675a13906A16070C4253
10413D41452A4588a49586k1788c0444j23m8249B74996C6549h5664j07406p3607
10402b66677i512k14885N5092I1772a51121A19834A4056M9506K51862I2220C6090
10390E10470A77487M31615k11488J32918q0237j83759A00067a88380A41717P5236
10380B16953r8616M7970j7358L71156j1073n2106j02677J35277K80318k23142
$$ plain form
10370 546702 395033 473649 170308 439181 409009 406142 684630 1095748 732455 825529
10360 825529 1026847 734683 301868 106352 470185 274837 225502 521561 267391 589532
10350 589532 683475 806903 1256451 1181882 1162990 893114 278190 555419 144048 395982
10340 395982 498700 208918 -248103 374481 138488 605355 79261 614301 704506 141435
10329 226672 78975 13130 252789 105149 -46062 335247 471576 127067 254772 270856
10319 270856 209933 473536 269050 183728 -11255 283901 56577 186458 -179801 192332
10308 -248268 193102 -136928 340459 -2474 -270583 -121075 8532 -544125 54198 105436 -354046
10296 257914 233381 487303 320561 -177898 406019 244147 241109 -110417 256963 -101004
$$ packed form
10370E46702j51669P8616A70308K68873l0172k867K78488M11118l63293R3074
10360H25529K01318k92164C01868A06352L63833j95348m9335K96059k54170L22141
10350E89532R3943J23428M49548p4569j8892k69876B78190K77229A44048K51934
10340C95982J02718B08918b48103C74481A38488M66867G9261N35040R0205A41435
10329B26672G8975A3130K39659A05149d6062C35247J36329A27067J27705J6084
10319B70856o0923K63603k04486q5322a1255B83901E6577J29881a79801A92332
10308b48268A93102a36928C40459b474k68109a21075H532e44125E4198N1238c54046
10296B57914k4533K53922j66742a77898D06019j61872l038a10417B56963a01004
$$ plain form
10285 248287 56603 48696 -50077 -1896 -293050 134743 -181560 87813 -289785 96455 -387788
10273 250088 -203504 -342781 -165105 -206465 -314865 -75433 28752 -136957 -41545 -34958 -174546
10262 -174546 -159806 -64797 91761 -92504 -118012 -435957 -55453 285904 -28104 -124842 -108682
10251 -108682 153820 21241 -91662 7182 239384 -282139 122764 -47514 -107292 -213716 -78624
10239 -183433 480177 -42626 -168999 -169507 31650 81371 209574 -281057 101518 -87040 -142743
10228 -142743 -64037 35337 -37369 -136862 -270372 -40859 57592 -27888 -134680 -18976 -98710
10217 -98710 -365878 -2391 -118641 177378 87209 165490 -259009 -55322 18921 -43284 -180804
10206 -180804 -39565 -153993 -51330 -173650 135133 -86202 -291472 -302127 25544 -197289
$$ packed form
10285B48287E6603p907e0077a896k91154A34743a81560H7813b89785I6455c87788
10273B50088b03504j39277a65105m1360j08400g5433B8752a36957d1545O587j39588
10262a74546J4740f4797I1761i2504k5508l17945e5453B85904b8104r6738J6160
10251a08682A53820B1241i1662G182K32202b82139A22764d7514n9778j06424g8624
10239a83433D80177d2626j26373n08C1650M9721J28203b81057A01518h7040n5703
10228a42743f4037C5337c7369r9493j33510d0859E7592b7888j06792a8976p9734
10217i8710k67168b391j16250A77378H7209P8281b59009e5322A8921d3284j37520
10206a80804c9565j14428e1330j22320A35133h6202k05270j0655B5544a97289
$$ plain form
10195 -65610 74733 105940 331641 -206596 -210966 -25536 -106088 -134043 -332181 -23369 -233089
10184 -233089 -9374 125524 -168622 362456 37723 -339278 25566 69006 345712 226518
10174 226518 235655 -128472 17067 -173377 -189798 -53530 -132339 43036 -19496 -163930 -61594
10162 -241586 146081 15283 -142884 -417309 71786 -362703 -173641 142561 -306058 -65070
10151 -278007 -162882 65920 108898 -32985 -270881 -418073 -103214 -266527 -34027 -72019
10141 -72019 -2090 -2249 182335 -24235 10214 -151482 -81877 -62425 -219001 -129478 5282 -46376
10128 -29416 -296802 -176942 -209358 -121353 120709 56447 -78267 8485 -131715 -76879 -123852
10117 -123852 -12152 -31017 -112180 -165122 -90315 58937 -54956 8836 131819 28334 11760
$$ packed form
10195f5610G4733L1207K25701b06596m370b5536q0552k7955j98138b3369k09720
10184b33089i374A25524a68622C62456C7723c39278B5566M3440K76706j19194
10174B26518R137a28472A7067a73377j6421e3530p8809D3036a9496j44434f1594
10162b41586A46081A5283a42884k74425G1786c62703a73641A42561c06058f5070
10151b78007J15125F5920M2978c2985k37896j47192a03214j63313c4027l7992
10141g2019b090j59A82335b4235A0214a51482O9605J9452j56576Q9523E282d6376
10128b9416k67386J19860l2416Q8005A20709E6447g8267H485a31715N4836m6973
10117a23852a2152j8865q1163n2942P4807E8937e4956H836J22983B8334A1760
$$ plain form
10105 -74132 -126990 -20938 22351 -21899 -10505 -39286 -317257 -128568 -18490 116179 61667
10094 61667 -19035 -236979 -387482 -174219 337224 56195 35621 352298 -260012 76976
10083 -306695 -34505 -147692 89164 -126738 -5913 41042 -52667 48039 -486512 -286283 21751
10071 -6018 -474184 131087 -49402 -232211 327651 -82715 -229414 56070 163724 -154278
10060 100977 23609 42342 66456 -77344 -39317 4679 1682 690 95837 -547636 -294461 -181660
10048 -181660 -14147 -61739 -145717 -155497 110564 -111485 -72406 98251 74256 33094 -200935
10036 -40678 -117178 -107050 -75752 -34019 -194124 -7889 -51513 -423640 -293969 -89233 54683
10024 156626 141452 -238111 235861 -45250 50811 -170150 120692 -204587 -60260 -456419
$$ packed form
10105g4132n2858b0938B2351b1899a0505k8781k77971a28568a8490A16179n4512
10094F1667a9035k17944j50503a74219C37224E6195k0574L16677b60012G6976
10083c06695c4505j13187H9164a26738e913D1042e2667D8039d86512K00229B1751
10071f018m68166A31087d9402j82809C27651h2715j46699E6070J07654a54278
10060A00977B3609J8733K4114g7344L8027D679A682F90R5147e47636K53175J12801
10048a81660a4147m7592q3978r780A10564a11485L9079I8251k3995C3094b00935
10036d0678p6500J0128L1298c4019j60105g889m3624l72127J29671h9233E4683
10024A56626j5174b38111B35861d5250E0811a70150A20692b04587f0260l96159
$$ plain form
10014 -456419 -227851 35662 34897 250901 114872 -254666 -455 -362791 -191998 -224614 -153352
10003 -153352 -37855 141865 71959 267367 167200 -42427 -89109 118639 -149643 230606
9992 96882 -64742 -38670 -61118 -48373 -48597 32253 -94494 -296457 -46570 38606 588 187582
9980 187582 -199901 -198317 -169051 -168837 -143168 -304775 -66528 -199281 112557 -37705 -152651
9969 -152651 275821 -59451 35468 43111 149165 -117915 -298447 22775 -87907 200626 -8800
9957 73878 -316179 -106558 -169453 -282059 112260 10301 -312710 68314 21908 -133500 -2245
9945 -183637 -224146 -44932 117626 -203867 -111624 93844 162398 113132 1600 38257 131132
9934 131132 330466 97705 -14988 110646 -116182 127702 -161553 -395186 -34394 -48641
$$ packed form
10014d56419b27851C5662p65K16004A14872b54666d55l62336J70793l2616P1262
10003a53352c7855A41865o9906J95408j00167d2427m6682A18639a49643B30606
9992I6882f4742K6072k2448J2745k24C2253i4494k01963d6570C8606E88J86994
9980A87582a99901J584K9266K14K5669j61607f6528j32753A12557c7705j14946
9969a52651B75821e9451C5468P643J06054a17915j80532B2775h7907B00626h800
9957G3878c16179a06558o2895j12606A12260A0301c12710F8314B1908a33500b245
9945a83637m0509d4932A17626b03867R2243I3844O8554m9266A600L6657R2875
9934A31132J99334I7705a4988A10646a16182A27702a61553k33633c4394j4247
$$ plain form
9924 -48641 -51131 -30153 -85548 2707 -53858 297992 -295569 67040 -174759 89304 -201903
9912 194188 -154714 -263064 100215 -28565 -264481 -36220 -12061 -6319 -349115 -234237 287916
9900 3485 -192354 20761 -192163 4415 -135699 35449 -117457 -160845 388898 -236939 -247688
9889 -247688 -333911 -115386 -391755 -190890 107293 -13773 269603 35244 -232827 69561
9878 87802 46845 -87143 -7210 -416944 268139 -111465 -39274 -239259 -36128 -415420 -107620
9866 -1927 -62629 -36663 -207190 -220349 -194914 130751 -18033 -139880 -270667 -112518 -468953
9855 -468953 20865 43017 -42534 -124689 2583 -178628 -76801 106207 20082 -130749 -159232
9844 -159232 3773 161642 -70065 -12548 -157071 268529 6840 -18855 -196956 -358626 -146439
$$ packed form
9924d8641k490K0978n5395B707e3858B97992b95569F7040a74759H9304b01903
9912A94188a54714j08350A00215b8565k35916c6220a2061N742l42796J14878B87916
9900C485a92354B0761a92163D415a35699C5449a17457m3388C88898b36939j0749
9889b47688q6223a15386k76369a90890A07293a3773B69603C5244b32827F9561
9878H7802m0957h7143g210m09734B68139a11465c9274j99985c6128l79292a07620
9866a927o0702K5966j70527j3159K5435A30751a8033j21847j30787a12518l56435
9855d68953B0865K2152d2534q2155B583a78628g6801A06207B0082a30749k8483
9844a59232C773J57869g0065a2548j44523B68529F840a8855j78101j61670a46439
$$ plain form
9832 7892 -185023 271317 -111217 -302135 223754 -213669 -303538 -25270 22922 -82003 41294
9820 -223335 -253231 -225386 305689 -123846 -216304 217193 -7048 -274494 -46504 -697142 153965
9808 128324 -401368 -13920 -40331 -291394 -70410 92033 44953 -160420 -72135 -61387 -88251
9797 -88251 38679 14779 -104551 -214239 -30049 41145 13771 33679 10450 -459047 -63121
9785 -352666 306027 124334 195559 147478 54902 78282 -259167 35131 153574 242123 -264346
9773 -130491 -255360 29016 -349792 -190892 182821 66539 -134090 146870 -52254 326483
9762 -66216 -32128 22896 230631 112994 85269 -59368 -91145 -410497 -204351 -291647 -51134
9750 -172016 -284179 -191155 -382061 -334202 -330189 -124338 -212490 -37673 -390619 -26632 -280252
$$ packed form
9832G892a85023B71317a11217j90918B23754b13669q9869b5270B2922h2003D1294
9820b23335k9896K7845C05689a23846r2458B17193g048k67446d6504o50638A53965
9808A28324d01368a3920k6411k51063g0410I2033D4953a60420g2135J0748k6864
9797h8251C8679A4779a04551j09688c0049D1145A3771J9908A0450d59047f3121
9785c52666C06027A24334P1225m8081E4902K3380b59167C5131J18443Q8549b64346
9773a30491j24869B9016c49792J58900A82821F6539a34090A46870e2254C26483
9762f6216c2128B2896K07735A12994k7725e9368l1777l19352b04351q7296e1134
9750a72016j12163R3024j90906M7859M013a24338q8152c7673l52946b6632k53620
$$ plain form
9739 -280252 -19467 52280 142689 13886 -64714 204158 74989 -275495 -56398 108847 -40529
9727 -193407 -179280 -104560 -24998 57032 -135013 202704 -309565 -16253 80944 -353593 38029
9715 213125 -111801 13492 -4658 173476 -27482 -31383 -44980 -140008 -369254 -135688 -105345
9704 -105345 -214463 133710 34262 -79507 -328430 13924 132567 193632 445817 194232
9693 -228893 -167287 137024 84333 -141792 66276 -81457 88388 8304 -35357 -175023 -247586
9682 -247586 144767 -95452 192800 79737 -193588 -184315 23653 193667 203086 -101590 -297286
9671 -297286 -267104 -43011 -80332 -144129 -95933 -94244 42105 -19880 -11251 -150534 136414 -109982
9658 -261919 -2294 -50412 -219902 -172544 -187855 228264 -119983 425814 129036 -165479 330370
$$ packed form
9739b80252a9467E2280R0409A3886f4714B04158G4989b75495e6398A08847d0529
9727a93407J4127P4720b4998E7032a35013B02704c09565a6253H0944c53593C8029
9715B13125a11801A3492d658A73476b7482l901j3597r5028k29246a35688L0343
9704a05345j09118A33710C4262g9507k48923A3924J18643O1065K52185A94232
9693b28893O1606A37024n2691a41792F6276h1457H8388H304c5357j39666p2563
9682b47586A44767i5452A92800G9737a93588R273B3653J70014R419a01590j95696
9671b97286L0182d3011l7321o3797M8196J689D2105a9880Q629j39283A36414a09982
9658b61919b294m8118j69490M7358j5311B28264a19983D25814A29036a65479C30370
$$ plain form
9646 -120725 -68296 -137512 -74074 5463 -113380 77403 85726 -112574 -210453 -40275 -124443 -36670
9633 -122142 -314862 -107408 -91695 -126674 413702 45260 214015 123254 -205146 -510372
9623 -510372 -30104 -410485 -300646 -27011 3840 -110480 64497 -203565 -118884 -219964 -313960
9612 -313960 -116164 -87455 105472 -220799 -430076 18347 -332353 -50076 -244689 -51781
9601 -53727 -40514 -60425 107994 -155270 -17838 -90069 93512 -156842 -338570 59830 182755
9590 182755 257958 -36938 -365249 165888 -112249 144283 -170617 321705 -86198 -65908
9580 -65908 -28694 273821 -86636 -172634 -15798 -73699 168958 -33966 138255 59628 131277
9569 131277 -360196 -142517 25292 -54341 -35228 -1410 -76645 -59961 11964 35235 -341486
$$ packed form
9646a20725N2429o9216O3438E463a13380G7403Q323a12574r7879d0275q4168c6670
9633a22142j92720a07408J5713l4979D13702D5260J68755r0761b05146l05226
9623e10372c0104l80381J09839b7011C840a10480F4497b03565Q4681j01080r3996
9612c13960a16164K8709A05472b20799k09277A8347c32353e0076j94613e1781
9601e3727J3213j9911A07994a55270a7838p2231I3512a56842j81728E9830J22925
9590A82755P5203c6938l28311A65888a12249A44283a70617C21705h6198K0290
9580f5908b8694B73821h6636q5998a5798n7901A68958c3966A38255E9628P1649
9569A31277c60196a42517B5292e4341J9113a410p5235J6684A1964K3271c41486
$$ plain form
9557 -167905 -290904 -195814 -212880 -409809 182730 92726 -511715 -129791 -118636 -250746
9547 -250746 62135 -15931 -19277 98540 -379972 119551 -335909 -147876 1411 17950 -25002
9535 -428666 -175072 -31055 -151055 -246953 -249025 -163827 -111562 -197275 -107088 -2286 57625 -83783
9522 -117346 -122626 -222246 -343127 -330099 -40990 -75053 16353 88334 -17206 38787 -145903
9510 -68414 -12746 -42460 -90614 -50699 -152630 12573 -332106 -61978 -267512 190151 144964
9499 144964 -93401 -224847 -295984 -115297 148579 -13987 -221213 -93448 -273977 40098 -124329
9487 75773 34701 170443 -109143 -117005 231271 39570 -33850 -13821 4254 -152156 -132497
9476 -132497 -5575 106197 7503 -39502 -28844 -219137 158311 -395150 -74481 -220038 19289
$$ packed form
9557a67905j22999R5090j7066j96929A82730r0004e11715a29791J1155j32110
9547b50746F2135a5931l346I8540c79972A19551c35909a47876A411J6539b5002
9535d28666a75072c1055j20000r5898k072Q5198N2265q5713R0187b286E7625h3783
9522a17346n280r9620j20881J3028d0990l4063A6353P1981a7206C8787a45903
9510f8414a2746k9714m8154L9915j01931A2573c32106f1978k05534A90151m5187
9499A44964i3401j31446p1137a15297A48579a3987k07226i3448j80529D0098a24329
9487G5773C4701J35742a09143p862B31271C9570c3850a3821D254a52156J9659
9476a32497e575A06197G503c9502J0658j90293A58311c95150g4481j45557A9289
$$ plain form
9464 -8734 3398 -76317 55114 43005 118582 -452497 19276 158338 180969 -79105 161382 10528
9451 -173052 -327254 107337 199937 -247168 -380056 -26175 -54326 -15370 -196743 -62218 -58167
9440 -58167 107246 -94081 99073 -51122 -59715 119139 -3331 -32025 -258236 -148628 -191319
9429 -191319 -10065 15637 -122694 -238179 -54535 187463 -225887 -334263 -321606 296410
9418 -146680 -147605 -206404 -43017 -54678 -239982 -240008 12005 -109865 -25882 -41046 50781 -264543
9405 -107826 52408 -80183 154101 59671 23065 -122934 -163604 -67763 -179531 -323243 134265
9393 -188381 107994 152173 -234808 -53715 60090 218705 -89085 166805 5242 8634 -463705
9381 30925 -48063 59406 -164243 -22661 -6802 -18029 -62816 180194 -89833 124252 44298
$$ packed form
9464h734C398g6317E5114j2109P5577d52497A9276J39062K2631g9105A61382A0528
9451a73052j54202A07337R2600b47168j32888b6175k8151a5370j81373f2218M051
9440e8167A07246i4081I9073e1122q593A19139c331k8694k26211J09608m2691
9429a91319a0065A5637a22694j15485e4535A87463b25887j08376J2657B96410
9418a46680r25n8799d3017j1661j85304k6A2005a09865b5882j5164E0781b64543
9405a07826E2408h0183A54101E9671B3065a22934m0670f7763j11768j43712A34265
9393a88381A07994M4179b34808e3715F0090J58615h9085A66805E242L392d63705
9381C0925d8063E9406a64243b2661f802j1227m4787A80194h9833A24252D4298
$$ plain form
9369 203102 111224 -159915 63230 -148213 -110220 75103 79395 -316058 -212019 -182902 -247019
9358 -247019 187378 93271 48040 -145584 216486 -40926 110844 155309 -5323 -60396 -242089
9347 -242089 -41010 12047 -147260 -26726 -208489 -183594 83805 -291315 -53680 -78485 81587
9335 -232074 103182 -143545 -63426 155219 -333683 -177077 -267120 82318 -425757 130515
9324 100655 -16361 -22985 -295695 -91265 8266 -45611 -32009 7065 -31287 -209842 65311 -122532
9311 -107100 266514 -297404 -193895 -154495 -34905 -206050 -102488 -186374 -120221 -13314 -32226
9300 -32226 -197120 -246214 40049 -173411 -154392 -182844 102770 -67683 -127161 -291381 -2391
9288 -115485 378364 -292902 -270229 42422 -60804 -198090 117468 -196172 -362933 -246364
$$ packed form
9369B03102r1878a59915F3230a48213L7993G5103M292c16058J04039K9117o4117
9358b47019A87378I3271m5231a45584B16486d0926A10844M4465e323n5073j81693
9347b42089d1010A2047a47260b6726j81763K4895H3805b91315e3680k4805H1587
9335b32074A03182a43545f3426A55219c33683J56606r0043H2318d25757A30515
9324A00655a6361o624k72710i1265H266d5611J3602G065c1287j78555F5311a22532
9311a07100B66514b97404J03509L9400c4905j71145a02488q3886O6153a3314j8912
9300c2226j64894m9094D0049a73411J9019k8452A02770f7683n9478j64220b391
9288a15485C78364b92902K2673D2422f0804j37286A17468a96172j66761J16569
$$ plain form
9278 -246364 -64269 -63666 -22781 56597 -183194 -167824 -334928 54074 -18194 18397 -158528
9266 -207779 45183 115385 -175043 76636 -271468 -27801 372084 231029 210175 -139346 39942
9254 -94396 -49436 -275454 -86065 182518 -1075 314399 -506864 -8924 -267574 83662 179787
9243 179787 60346 112645 -145864 -73841 -142116 36145 -95640 77217 178771 139906 212603
9232 212603 -129794 -181680 -152670 -133985 256675 8352 132763 -446235 78505 116375 -133958
9220 -391809 -344539 -444 6570 -470522 -107389 64454 -74666 53967 -125711 -207834 147529
9208 -124055 37955 1724 -65454 43170 220081 258206 213026 101667 -44693 -271509 -32477
9196 -80149 -212219 39194 -155684 -98761 173106 148524 -92843 -73917 -121242 -6748 -280792
$$ packed form
9278b46364f4269O03b2781E6597a83194J5370j67104E4074a8194A8397a58528
9266b07779D5183P0202a75043G6636b71468b7801C72084j41055k0854a39346C9942
9254i4396M4960k26018h6065A82518a075C14399e06864h924k58650H3662R6125
9243A79787F0346N2299a45864P2023o8275C6145i5640G7217J01554l8865P2697
9232B12603a29794n1886K9010J8685B56675H352J24411d46235G8505L7870a33958
9220c91809M7270d44F570d70522a07389F4454g4666E3967a25711q2123A47529
9208a24055C7955A724f5454D3170J76911L8125m5180A01667d4693k26816c2477
9196h0149j32070C9194a55684N6923A73106k4582i2843J8926m7325f748k74044
$$ plain form
9185 -280792 -315657 286438 -2243 -78717 424002 -123599 -349749 -77360 -339156 -88244 -82217
9174 -82217 56052 44801 -178887 -12344 94567 175451 -53330 177730 -109620 -75381 -58127
9163 -58127 84335 182731 -69339 -38854 -81997 -271749 -357690 4675 -168339 -172879 -91253 -48293
9151 -48293 530256 -329089 70605 -381619 157506 -343658 -97249 195676 -145566 44517
9140 36833 51022 -138194 -101945 -179360 -344921 193219 99448 -161841 110739 -10175 143703
9128 35686 -253193 42312 -419828 68683 109202 -185463 127249 190636 -5966 -201256 -113101
9117 -113101 60540 -192893 -119449 14010 -3655 15974 7180 145720 53415 -116818 6933 107264
9105 107264 157979 -35612 -179160 -169941 -135519 66577 63661 -231251 48888 -101622 176903
$$ packed form
9185b80792l4865B86438b243p6474D24002a23599k26150g7360k61796h8244O027
9174h2217E6052j1251a78887a2344I4567Q0884e3330A77730a09620L4239J7254
9163e8127H4335R8396f9339L0485m3143j89752q5941D675a68339m540Q1626M2960
9151d8293E30256c29089G0605c81619A57506c43658i7249A95676a45566D4517
9140C6833J4189a38194L6249p7415j65561A93219r3771a61841A10739a0175A43703
9128C5686b53193D2312d19828F8683M0519a85463A27249O3387e966j95290Q8155
9117a13101F0540a92893P3444A4010c655A5974G180J38540E3415a16818F933J00331
9105A07264N0715c5612j43548R219L4422F6577k916b31251D8888a01622A76903
$$ plain form
9093 106630 98901 -317830 439546 -398543 -72076 -98264 109529 225705 -80873 -255680 -55125
9081 208437 -203993 22624 85418 -29395 179053 -63421 -254602 -13936 -170771 108607 186456
9070 186456 71809 -6039 18040 -223806 -107687 -161487 -238119 -19359 14322 -70908 9741 -178211
9057 -253827 164137 -150573 238417 -30321 -118162 42926 -201268 -396096 -409059 -292403
9047 -292403 -141964 169328 -14120 -71944 -422872 106550 -11791 -244609 139850 89699
9037 89699 -486835 -163177 -410738 129329 63796 24148 100863 -139513 -67121 -26220 -458276
9026 -458276 -97236 145190 299474 157294 -2909 -44709 -4483 -158469 36516 -144257 51661
9014 280649 205989 -315436 11268 -138531 -277692 -252970 40092 12486 -81163 271504 97410
$$ packed form
9093A06630p729c17830D39546c98543g2076k6188A09529J16176h0873j74807e5125
9081B08437b03993B2624O2794b9395A79053f3421j91181a3936j56835A08607P7849
9070A86456G1809f039A8040b23806a07687n3800p6632a9359A4322g0908I741a78211
9057b53827A64137a50573B38417c0321q7841D2926b01268j94828j2963J16656
9047b92403a41964A69328a4120n7824l50928A06550a1791k32818A39850n0151
9037H9699d86835a63177k47561A29329F3796B4148P6715a39513f7121b6220m32056
9026d58276i7236A45190J54284j42180b909m1800d483j53986C6516a44257E1661
9014B80649p4660c15436A1268a38531j39161K4722D0092A2486h1163B71504I7410
$$ plain form
9002 26692 249091 417136 49099 -218845 -245907 48463 -12044 -289695 4543 -320509 -36496
8990 18778 -39283 45806 -100633 -78814 -64040 -135135 28007 -304541 -69744 -57454 -141914
8979 -141914 -262065 -175899 45175 195870 -55708 -70287 209414 -145454 -141107 121488 -83344
8967 -169615 -101112 216141 -270883 -123423 109229 -228840 285705 -198140 28087 -179978
8956 -58313 -3970 -75923 32278 -140411 -123966 -20528 209550 -340265 -76761 -14232 229744
8944 -344728 231966 177305 60058 15677 -79497 -252982 80841 -65443 -353479 188019 -233856
8932 132580 417466 135061 -34376 136361 -14187 -248638 83224 151193 434498 276533
8922 276533 1050444 1908412 4239766 13644361 9682520 1998618 591179 543335 327530
$$ packed form
9002B6692K22399J68045D9099b18845k7062D8463a2044k77651D543c20509c6496
8990A8778c9283D5806a00633K1819J4774p1095B8007c04541f9744J2290q4460
8979a41914j20151Q6166D5175J50695e5708j4579B09414a45454M347A21488h3344
8967a69615O8503B16141b70883a23423A09229b28840B85705a98140B8087a79978
8956e8313c970p1953C2278a40411J6445b0528B09550c40265g6761a4232B29744
8944c44728B31966n4661F0058A5677g9497j73485H0841f5443k88036A88019b33856
8932A32580K84886A35061c4376A36361a4187k34451H3224O7969K83305j57965
8922B76533P73911Q57968K331354R404595l961841A998618E91179m7844k15805
$$ plain form
8913 327530 156045 571802 228934 86659 -44600 31817 -129426 5560 152047 -88500 180175
8901 -74458 154363 -66753 10911 -78732 -445270 -73493 -121271 142717 -97151 -135083 -36033
8889 -267228 -306671 127405 -192700 -309334 -160928 -227113 100399 17219 -122840 -68559
8879 -68559 -76698 85275 102394 -32488 180352 134688 -355164 66162 41124 81183 -176055
8867 -127971 6063 317634 -10714 -150041 -289897 -141026 210027 139400 45080 213225 190062
$$ packed form
8913C27530A56045M15757B28934H6659d4600C1817a29426E560J46487h8500A80175
8901g4458A54363f6753A0911g8732l66538g3493m7778A42717i7151l7932c6033
8889b67228l9443A27405a92700j16634J48406o6185A00399A7219a22840N4281
8879f8559q139H5275J7119c2488A80352m5664c55164F6162k5038M0059a76055
8867a27971F063L11571a0714j39327j39856a41026B10027p0627D5080J68145k3163
$$ [...]
##END NTUPLES=NMR SPECTRUM
##END=
