
##TITLE=AC1259_UGARH11076_6534370_Ws4MSD9MfT
##JCAMPDX= 6.0         $$ Bruker NMR JCAMP-DX V2.0
##DATA TYPE= NMR SPECTRUM
##DATA CLASS= NTUPLES
##ORIGIN= BRUKER
##OWNER= Administrator
$$ 1.72 TOPSPIN		Version 2.1
$$ 2012-07-17 04:04:40.343 -0500  Administrator@TOPSPIN
$$ Compression mode = diff/dup
##.OBSERVE FREQUENCY= 400.02188249412
##.OBSERVE NUCLEUS= ^1H
##.ACQUISITION MODE= SIMULTANEOUS (DQD)
##.ACQUISITION SCHEME= undefined
##.AVERAGES= 8
##.DIGITISER RES= 22
##SPECTROMETER/DATA SYSTEM= spect
##.PULSE SEQUENCE= zg30
##.SOLVENT NAME= COFFEE_meoh
##.SHIFT REFERENCE= INTERNAL, COFFEE_meoh, 1, 14.98509
##AUDIT TRAIL= $$ (NUMBER, WHEN, WHO, WHERE, PROCESS, VERSION, WHAT)
$$ ##TITLE= Audit trail, TOPSPIN		Version 2.1
$$ ##JCAMPDX= 5.01
$$ ##ORIGIN= Bruker BioSpin GmbH
$$ ##OWNER= Administrator
$$ $$ C:\Bruker\TOPSPIN/data/COFFEE/nmr/AC1259_UGARH11076_6534370_Ws4MSD9MfT/10/pdata/1/auditp.txt
$$ ##AUDIT TRAIL=  $$ (NUMBER, WHEN, WHO, WHERE, PROCESS, VERSION, WHAT)
(   1,<2012-07-17 04:04:33.593 -0500>,<Administrator>,<TOPSPIN>,<go>,<TOPSPIN 2.1>,
      <created by zg
	started at 2012-07-17 04:03:26.937 -0500,
	POWCHK enabled, PULCHK disabled,
       configuration hash MD5:
       6B 1B 68 BB D9 2E 58 E2 7F 35 AD 54 07 DF 0E 41
       data hash MD5: 64K
       1B 59 6A D3 BD 2D 37 C9 84 41 B0 D1 29 87 4A B3>)
(   2,<2012-07-17 04:04:36.187 -0500>,<Administrator>,<TOPSPIN>,<proc1d>,<TOPSPIN 2.1>,
      <Start of raw data processing
       efp LB = 0 FT_mod = 6 PKNL = 1 PHC0 = 0 PHC1 = 0 SI = 32K 
       data hash MD5: 32K
       53 F2 2F 59 83 64 FF BB 57 A1 26 DC A6 16 E8 E1>)
(   3,<2012-07-17 04:04:36.562 -0500>,<Administrator>,<TOPSPIN>,<proc1d>,<TOPSPIN 2.1>,
      <pk PHC0 = 180.022 PHC1 = 0 
       data hash MD5: 32K
       C4 E5 3D 1A 1D 18 35 68 3D 95 97 59 6C B5 5D 7F>)
(   4,<2012-07-17 04:04:36.687 -0500>,<Administrator>,<TOPSPIN>,<proc1d>,<TOPSPIN 2.1>,
      <abs ABSG = 1 
       data hash MD5: 32K
       16 C7 0B 32 23 F1 4B B0 8E 10 45 7C CE 78 8A BC>)
(   5,<2012-07-17 04:04:36.718 -0500>,<Administrator>,<TOPSPIN>,<proc1d>,<TOPSPIN 2.1>,
      <abs ABSG = 2 
       data hash MD5: 32K
       F6 AD 69 07 B8 43 0A E2 B5 3C 6E BB 52 DE 6E A9>)
(   6,<2012-07-17 04:04:36.750 -0500>,<Administrator>,<TOPSPIN>,<proc1d>,<TOPSPIN 2.1>,
      <abs ABSG = 3 
       data hash MD5: 32K
       00 6C 17 3A 86 AB AF DE 05 C5 A5 05 D6 5D AC 8A>)
(   7,<2012-07-17 04:04:36.781 -0500>,<Administrator>,<TOPSPIN>,<proc1d>,<TOPSPIN 2.1>,
      <abs ABSG = 4 
       data hash MD5: 32K
       F3 2A B1 7F DD 6A FE 21 62 83 C0 31 C3 8E 98 7A>)
(   8,<2012-07-17 04:04:36.828 -0500>,<Administrator>,<TOPSPIN>,<proc1d>,<TOPSPIN 2.1>,
      <abs ABSG = 5 
       data hash MD5: 32K
       C1 62 B4 1D 6D F0 94 AB 17 38 B7 98 8A A5 C0 78>)
$$ ##END=
$$ 
$$ $$ hash MD5
$$ $$ CA 3F 55 B6 82 0F 98 00 F5 E4 F6 47 7E 9F 8F 35
##$RELAX= 
##$RELAX= 
##$RELAX= 
##$RELAX= 
##$RELAX= 
##$RELAX= 
##$RELAX= 
$$ Bruker specific parameters
$$ --------------------------
$$ [...]
150 150 150 150 150 150 150 150
##$TP07= 0
##$TPNAME0= <>
##$TPNAME1= <>
##$TPNAME2= <>
##$TPNAME3= <>
##$TPNAME4= <>
##$TPNAME5= <>
##$TPNAME6= <>
##$TPNAME7= <>
##$TPOAL= (0..7)
0.5 0.5 0.5 0.5 0.5 0.5 0.5 0.5
##$TPOFFS= (0..7)
0 0 0 0 0 0 0 0
##$TUNHIN= 0
##$TUNHOUT= 0
##$TUNXOUT= 0
##$USERA1= <user>
##$USERA2= <user>
##$USERA3= <user>
##$USERA4= <user>
##$USERA5= <user>
##$V9= 5
##$VALIST= <valist>
##$VCLIST= <CCCCCCCCCCCCCCC>
##$VD= 0
##$VDLIST= <DDDDDDDDDDDDDDD>
##$VPLIST= <PPPPPPPPPPPPPPP>
##$VTLIST= <TTTTTTTTTTTTTTT>
##$WBST= 2048
##$WBSW= 25
##$XGAIN= (0..3)
0 0 0 0
##$XL= 0
##$YL= 0
##$YMAX_a= 506521
##$YMIN_a= -648050
##$ZGOPTNS= <>
##$ZL1= 120
##$ZL2= 120
##$ZL3= 120
##$ZL4= 120
##$ABSF1= 14.98509
##$ABSF2= -5.573092
##$ABSG= 5
##$ABSL= 3
##$ALPHA= 0
##$AQORDER= 0
##$ASSFAC= 0
##$ASSFACI= 0
##$ASSFACX= 0
##$ASSWID= 0
##$AUNMP= <proc_prof1d_extract_pilot.lims>
##$AXLEFT= 0
##$AXNAME= <>
##$AXNUC= <1H>
##$AXRIGHT= 0
##$AXTYPE= 0
##$AXUNIT= <>
##$AZFE= 0.1
##$AZFW= 0.1
##$BCFW= 0
##$BC_mod= 0
##$BYTORDP= 0
##$COROFFS= 0
##$CY= 15
##$DATMOD= 1
##$DC= 0
##$DFILT= <>
##$DTYPP= 0
##$F1P= 0
##$F2P= 0
##$FCOR= 0.5
##$FTSIZE= 32768
##$FT_mod= 6
##$GAMMA= 0
##$GB= 0
##$INTBC= 1
##$INTSCL= 1
##$ISEN= 128
##$LB= 0
##$LEV0= 0
##$LPBIN= 0
##$MAXI= 10000
##$MC2= 0
##$MEAN= 0
##$ME_mod= 0
##$MI= 0
##$NCOEF= 0
##$NC_proc= -8
##$NLEV= 6
##$NOISF1= 0
##$NOISF2= 0
##$NSP= 0
##$NTH_PI= 0
##$NZP= 0
##$OFFSET= 14.98509
##$PC= 1
##$PHC0= 180.022
##$PHC1= 0
##$PH_mod= 1
##$PKNL= yes
##$PPARMOD= 0
##$PPDIAG= 0
##$PPIPTYP= 0
##$PPMPNUM= 2147483647
##$PPRESOL= 1
##$PSCAL= 4
##$PSIGN= 0
##$PYNMP= <proc.py>
##$REVERSE= no
##$SF= 400.02
##$SI= 32768
##$SIGF1= 0
##$SIGF2= 0
##$SINO= 400
##$SIOLD= 32768
##$SPECTYP= <>
##$SREGLST= <1H.CDCl3>
##$SSB= 0
##$STSI= 32768
##$STSR= 0
##$SW_p= 8223.68421052631
##$SYMM= 0
##$S_DEV= 0
##$TDeff= 65536
##$TDoff= 0
##$TI= <>
##$TILT= no
##$TM1= 0
##$TM2= 0
##$TOPLEV= 0
##$USERP1= <user>
##$USERP2= <user>
##$USERP3= <user>
##$USERP4= <user>
##$USERP5= <user>
##$WDW= 1
##$XDIM= 32768
##$YMAX_p= 464871641
##$YMIN_p= -707109
##$CURPLOT= <Network HP LaserJet P1505>
##$CURPRIN= <$Network HP LaserJet P1505>
##$DFORMAT= <normdp>
##$LAYOUT= <+/1D_H.xwp>
##$LFORMAT= <normlp>
##$PFORMAT= <normpl>
##$SURQMSG= 1
$$ End of Bruker specific parameters
$$ ---------------------------------
##NTUPLES= NMR SPECTRUM
##VAR_NAME=  FREQUENCY,     SPECTRUM/REAL,   SPECTRUM/IMAG
##SYMBOL=    X,             R,               I
##VAR_TYPE=  INDEPENDENT,   DEPENDENT,       DEPENDENT
##VAR_FORM=  AFFN,          ASDF,            ASDF
##VAR_DIM=   32768,         32768,           32768
##UNITS=     HZ,            ARBITRARY UNITS, ARBITRARY UNITS
##FACTOR=    0.250966925370066, 1,           1
##FIRST=     8223.43324360094, -130267,      -179454
##LAST=      0,             23253,           -64356
##MIN=       0,             -707109,         0
##MAX=       8223.43324360094, 464871641,    0
$$ Real data points
##PAGE= N=1
##DATA TABLE= (X++(R..R)), XYDATA
$$ [...]
19572b60457J21962r1552k70424d2946A33274C2805a02558B85414c1478H5314
19561f8905r3288j2271A18579a66110n3796R6422J9539m5563b5483A81538H1468
19549d01035b9244k18724E9620a92421B30622g2322o2246l193K8406j755b7885
19537a8970j1774D6290b72476C6557a06272c809k26435G3729N8059a55720h362
19525b11064i373k24438R7182l5889k349b8651E808b49803B66640b14430b8390
19513D0875b0913A8084c23663h6632j51005j62907B01649f9992c0843k3510A96245
19501a57862H1373e4866q8069B13729F4044b24843m8215L5887H5740J6057a8950
19489a71592K7934A47465K66576a60177H8792h8309m0459B57464A9389R773c3194
$$ plain form
19572 -260457 -138495 -230047 -500471 -42946 133274 32805 -102558 285414 -31478 85314
19561 -68905 -162193 -174464 118579 -166110 -219906 -123484 -103945 -149508 -25483 181538 81468
19549 -401035 -29244 -247968 59620 -192421 230622 -72322 -134568 -137761 -109355 -111110 -27885
19537 -18970 -30744 46290 -272476 36557 -106272 -3809 -230244 73729 131788 -155720 -8362
19525 -211064 -9373 -233811 -136629 -172518 -174867 -28651 5808 -249803 266640 -214430 -28390
19513 40875 -20913 18084 -323663 -86632 -237637 -400544 201649 -69992 -30843 -54353 196245
19501 -157862 81373 -54866 -142935 213729 64044 -224843 -273058 -237171 85740 101797 -18950
19489 -171592 -143658 147465 414041 -160177 88792 -88309 -128768 257464 19389 29162 -33194
19477E477J19628c37636G8152d6067C00266e4108j16176j87004f1410j33712g2656
19465C8829d1011B5130J53218c78683a47935N9151A83888b0567C15216a81248
19454e2564r0698j05968k1247J16118k23448A19663N493c08832Q0089p4241M5034
19443b57950E796L7663b86279K0145h0081a436j64990B22001D0819J98139j15088
19432A23870e9088b0896n6207C01301C1522J5382g8750j7799g460A9697N5806
19421G5503a50641c3083j37259m6480h7030m0966L7639B16628p9233C7062P9586
19410A16648a17635G6611a16868A28003a49497C96767a23806A37651Q1430c977
19399b29464C1372J0515J16993L1674a2676j33785j0481p3818E1361A3954R3786
$$ plain form
19477 5477 125105 -337636 78152 -46067 300266 -54108 -170284 -357288 -61410 -195122 -72656
19465 38829 -41011 25130 178348 -378683 -147935 -88784 183888 -20567 315216 -181248
19454 -52564 -143262 -249230 -270477 -154359 -377807 119663 125156 -308832 -228743 -302984 -257950
19443 -257950 5796 43459 -286279 -266134 -80081 -1436 -166426 222001 40819 238958 123870
19432 123870 -59088 -20896 -77103 301301 31522 46904 -78750 -96549 -7460 19697 75503
19421 75503 -150641 -33083 -170342 -216822 -87030 -127996 -90357 216628 137395 37062 116648
19410 116648 -117635 76611 -116868 128003 -149497 396767 -123806 137651 219081 -3977
19399 -229464 31372 41887 158880 190554 -12676 -146461 -156942 -230760 51361 13954 107740
19388A07740b53674o6733J45375a0226k11170L4593n2676f8960B9626J45914j7366
19377A58174I546c42459B86494c51550Q0789C01171j35883a10546A16290a25626
19366A31203e944j21222k24948E2214b157A49788c55859h4371q7957J1382a819
19354F5403O0565a7280m51760a28411A30341c11890g198j43492B0300K32855e0355
19342H8742J5543b21470r7151A46415a74036d5959k46342C5089i7854E7721A8080
19330f4518B01332b15025a01525d3231B84148o5519n3103h9886l8145F0487K35032
19319B95519a16732A8485K8045i0641E687c96006E0816b02719O2650A10121a44376
19307a78982a6040k28941R0560G8878l6877a08794k9807D52481c11812Q8136A25767
$$ plain form
19388 107740 -253674 -320407 -175032 -10226 -221396 -186803 -239479 -68960 29626 175540 158174
19377 158174 9546 -342459 286494 -351550 -270761 301171 165288 -110546 116290 -125626
19366 131203 -5944 -127166 -352114 52214 -2157 149788 -355859 -84371 -172328 -160946 -1819
19354 65403 125968 -17280 -469040 -128411 130341 -311890 -7198 -150690 20300 253155 -50355
19342 88742 104285 -221470 -318621 146415 -174036 -45959 -292301 35089 -97854 57721 18080
19330 -64518 201332 -215025 -101525 -43231 284148 218629 165526 -89886 -128031 60487 295519
19319 295519 -116732 18485 46530 -90641 5687 -396006 50816 -202719 -140069 110121 -144376
19307 -178982 -16040 -244981 -154421 78878 42001 -108794 -138601 452481 -311812 -223676 125767
19295e5106A78987B4475b1962A99716A3920J42460a22538q6753B55272a20891
19284e7901l67352A49495d94505A5611c362d67k14414d5243A93229C0047a19218
19272a80582A49398J9889H617L00549H6352c75109H2126O1009G571b04786f2314
19260a17464A42529a14163H9254J02936E2696J30392G816a97300l5945l0406A19527
19248a24277j28532q0699A09669b13826R8109E7571J5868d4420Q453I5915b80353
19236b01592Q2424A68000c56759i1306K9220e390l46095a34629D5193d3191A2335
19224A96076e2848k08520A28355K5665C0640P1794l7018R8831K884C3088J73498
19213B06586D2629b26039N1906a6016B27N8452a29398A57191b64146A68555g4145
$$ plain form
19295 -55106 178987 24475 -21962 199716 13920 156380 -122538 -209291 255272 -120891
19284 -57901 -425253 149495 -494505 15611 -3362 -467 -214881 -45243 193229 30047 -119218
19272 -180582 149398 169287 8617 309166 86352 -375109 82126 143135 7571 -204786 -62314
19260 -117464 142529 -114163 89254 192190 52696 183088 7816 -197300 -233245 -263651 119527
19248 -124277 -252809 -333508 109669 -213826 -115717 57571 73439 -44420 -35967 95915 -280353
19236 -201592 -119168 168000 -356759 -91306 -62086 -5390 -351485 -134629 45193 -43191 12335
19224 196076 -52848 -261368 128355 154020 30640 102434 65416 164247 167131 33088 206586
19213 206586 42629 -226039 -174133 -16016 227 58679 -129398 157191 -264146 168555 -74145
19201A05364k3610f3586l18155H2125i7410a0778j26939G7664g9231m3931q0585
19190b03747D6651K2707a87545a9885k73987e7785j66282A7198O5249F870b07596
19178b8814k36048a16836A04923g8351A61844J7971a61375b7302q0205E4192b64854
19166g8787A07316a77448q028h5622p353k9630j23840R0799C28177D4506a85513
19154B25249C0778d6697j14503d824q7226B05002F4699a43530j57149k12468A5053
19142a22991B5794a59755L3190c6191B90188I1573h3167H6690d1459p8689A04821
19130c25135i3268K6864B3009K32342a28606r0553A25520a81250b0773A46474
19119A15360b7350G4206b30225A15004B6326j1935R7564A7076a93531A23324k0682
$$ plain form
19201 105364 81754 -63586 -381741 82125 -97410 -10778 -137717 77664 -79231 -123162 -203747
19190 -203747 46651 69358 -187545 -19885 -293872 -57785 -224067 17198 82447 6870 -207596
19178 -28814 -264862 -116836 104923 -78351 161844 179815 -161375 -27302 -107507 54192 -264854
19166 -78787 107316 -177448 -185476 -85622 -92975 -122605 -246445 -155646 328177 44506 -185513
19154 225249 30778 -46697 -161200 -4824 -92050 205002 64699 -143530 -300679 -513147 15053
19142 -122991 25794 -159755 -126565 -36191 290188 91573 -83167 86690 -41459 -120148 104821
19130 -325135 -93268 -66404 23009 255351 -128606 -219159 125520 -181250 -20773 146474
19119 115360 -27350 74206 -230225 115004 26326 14391 111955 17076 -193531 123324 102642
19108A02642b9700G7666a3907j34671a8254I1465i7608E9714J60920p0322b4167
19096a8391p9501j49257O5776p9543j04659m3162a53132B01229l2254c68982D24
19084c17510j89813g1201j86541a12712H4093c40210A0453b21014A84261f6732
19073B92200d4931A05474d9146j3994I9129a42473C672a99951P4314E9003c38992
19061B09330g3776j04275c8293k72737A37750j4195K0942L45362A78789j5985
19051A62804a9583C4709G066N7078L2520g3036j02164a9891B06295b2820A12393
19039F8828c03155e9705C44799A1084c05590A8455a3528j70087k63792a15419
19028A20674a45854e9493k1471C32202A64803l2337a09239m6848a0481k08839
$$ plain form
19108 102642 -29700 77666 -13907 -148578 -18254 91465 -97608 59714 220634 150312 -24167
19096 -18391 -97892 -247149 -181373 -260916 -365575 -408737 -153132 201229 168975 -368982 424
19084 -317510 -507323 -71201 -257742 -112712 84093 -340210 10453 -221014 184261 -66732
19073 292200 -44931 105474 -49146 -63140 99129 -142473 3672 -199951 -125637 59003 -338992
19061 209330 -73776 -178051 -38293 -311030 137750 123555 144497 489859 178789 162804
19051 162804 -19583 34709 7066 64144 96664 -73036 -175200 -19891 206295 -22820 112393
19039 68828 -303155 -59705 344799 11084 -305590 18455 -13528 -183615 -447407 -115419
19028 120674 -145854 -59493 -80964 332202 164803 132466 -109239 -156087 -10481 -219320
19018b19320p5579Q0851a8410l9886J0264B8815b37086b6598j20540o2907I195
19006a2003F2065J99214A04763b179A06704J37726a71017e5670N566I1663P5442
18995A67105f6075CJ84289a95811N1708A43087R4627b44245A88548b54236a00231
18983F2445a12369C03845c82240a21245A59292a93235B00721b08553L5715A60887
18972c3307H0855f8534a8618A02019a45152D7336j8086M0188Q2027G4566A4370
18960a72789E3594L6983K9212a11727l6827C8463b0355p896o9013A0052b67309
18948f2816l5326a6430l51485A32715E8328a86611e1353C29259a897C6699J32014
18937A68713b74262J17209C9170J2914b82967l3337l9015h332o836G9109c44182
$$ plain form
19018 -219320 -294899 -214048 -18410 -58296 -48032 28815 -237086 -26598 -147138 -210045 9195
19006 -12003 62065 261279 104763 -2179 106704 244430 -171017 -55670 -50104 91663 167105
18995 167105 -66075 3 184292 -195811 -144103 143087 237714 -244245 188548 -254236 -100231
18983 62445 -112369 303845 -382240 -121245 159292 -193235 200721 -208553 -172838 160887
18972 -33307 80855 -68534 -18618 102019 -145152 47336 29250 69438 151465 74566 14370
18960 -172789 53594 90577 119789 -111727 -148554 38463 -20355 -28251 -97264 10052 -267309
18948 -62816 -98142 -16430 -367915 132715 58328 -186611 -51353 329259 -1897 36699 168713
18937 168713 -274262 -157053 39170 52084 -282967 -316304 -355319 -8332 -15168 79109 -344182
18925b37270C9174d3400p2716G2521e7698A73712g3538C2188c0083A67657b91498
18913b603n1373K3360j90884j91485A94835h589B6749h2296B6632Q5033a09110
18901G1710A3824g3681E8188n996c8040k39839F6493J98061f6589q1948J2663
18890a35874k91694B10704E0037b15343J03907n3834G4599P2045f6632A54771
18879a01960j6667E1082G747J19380k9729k5281K885b25395L1620e2041A00038
18867B2960J55549C7605a56884L2744j664n5504B66908a5390G1850M6167i1219
18855f9809k12976A27822b00494R5678C5761d39833a49295e7429G2555K04859
18845B77414a56304A37630F7502e5878A839a82889E69007D4638b12045A25674
$$ plain form
18925 -237270 39174 -43400 -116116 72521 -57698 173712 -73538 32188 -30083 167657 -291498
18913 -2603 -53976 -30616 -221500 -412985 194835 -8589 26749 -82296 26632 111665 -109110
18901 71710 13824 -73681 58188 52192 -38040 -277879 66493 264554 -66589 -148537 -135874
18890 -135874 -427568 210704 50037 -215343 -111436 -165270 74599 146644 -66632 154771
18879 -101960 -118627 51082 7747 127127 97398 72117 75002 -225395 -193775 -52041 100038
18867 22960 178509 37605 -156884 -124140 -125804 -181308 266908 -15390 71850 118017 -91219
18855 -69809 -282785 127822 -200494 -104816 35761 -439833 -149295 -57429 72555 277414
18845 277414 -156304 137630 67502 -55878 1839 -182889 569007 44638 -212045 125674
18834i9989a1484k23385e3844j44021f3803K1906j70476M2813b7679B245b65317
18822b18139c5614j85314A99461a16026a9683j56603A99985B2785a41150F330
18811i0182A64505G5928b86401J17521d7092D2861a94344G4434J39606H8486Q060
18800I6546L5269k4189Q2989a15234b8317A7771a51743D2870a04019j62504J28736
18789a37787q1912A48243b26617F2703a36537B5617J71285f3328m1539D2672a00369
18777C27815j32970b84326J02935D7547a84494h9366J1487r2819j5143d9273k7513
18766g6786l028B50793G6997R4643b78595R0940A2191j052L48454q3863e8978
18754b05616B27588E6809J51043J13211A09134a16517j52680A04443c17544O3717
$$ plain form
18834 -99989 -11484 -234869 -53844 -197865 -63803 -41897 -212373 -169560 -27679 2245 -265317
18822 -218139 -35614 -220928 199461 -116026 -19683 -176286 199985 22785 -141150 6330
18811 -90182 164505 75928 -286401 -168880 -47092 42861 -194344 74434 214040 88486 96546
18800 96546 131815 107626 190615 -115234 -28317 17771 -151743 42870 -104019 -266523 -137787
18789 -137787 -219699 148243 -226617 62703 -136537 25617 196902 -63328 -104867 42672 -100369
18777 327815 194845 -284326 -181391 47547 -184494 -89366 -77879 -170698 -185841 -49273 -76786
18766 -76786 -79814 250793 76997 171640 -278595 -187655 12191 11139 359593 275730 -58978
18754 -205616 227588 56809 207852 321063 109134 -116517 -269197 104443 -317544 -253827
18744b53827A22578C026c48833E3610K9662A8285a2835k71302A27019h6086k5786
18733a11872C1038h1418B49694b5507j09490A49823k7083f540j34122r1914B08767
18721d7963k32729h3712j30435B31344l4898C2362J45047e5277k74475A05564
18710C6303a66872A28397a5998j75212B0131a00850A83623a7342E5317K32940
18700B88257b2438k06645m2442B5246i5394n2559F8746R9609a19151H1963a38084
18688a52030D6726R0870e8812D11119j86643B5161c59218a22972f0389J9063A9679
18676a64864C9100a31391l49897J63856G6510a49672o9265j3159b095B04322d05973
18664i0042A43934B2548b03318h1088l5086M3286k92053a10484j40098A82098
$$ plain form
18744 -253827 122578 3026 -348833 53610 83272 18285 -12835 -284137 127019 -86086 -111872
18733 -111872 31038 -81418 249694 -25507 -134997 149823 122740 -6540 -140662 -232576 208767
18721 -47963 -280692 -83712 -214147 231344 196446 32362 177409 -55277 -329752 105564
18710 36303 -166872 128397 -15998 -191210 20131 -100850 183623 -17342 55317 288257
18700 288257 -22438 -229083 -271525 25246 -95394 -147953 68746 168355 -119151 81963 -138084
18688 -152030 46726 137596 -58812 411119 224476 25161 -359218 -122972 -60389 -41326 19679
18676 -164864 39100 -131391 -481288 -317432 76510 -149672 -218937 -232096 -2095 204322 -405973
18664 -90042 143934 22548 -203318 -81088 -116174 -72888 -364941 -110484 -250582 182098
18653C7143c02468a40832A02196k9941A7611a97797A05790c5901j9974k35842
18643b91717e8212a470l4179m4398k30j11723B09403e9938r1660L2992C5775f0130
18630b5970I8698D1394a53869b3760l19071G2350b23204j66620h2740a3428A02860
18618b58379A21340b00536E8471a04760M9356k70738A10458D6062P5585m8601
18608G3046J13452e2054j7146B76501a6819C2888O6243J76099o9098b24252e4553
18596D6822d8299k221B1139L1769A7324a98716Q7562M9715k53133a01382M9459
18585e1923A99183F5475g7193j48838g8780J0254J5706D14482A63551D9961a22775
18573a75869P1376o8317B9487a67089d210I1469a1178C26803e13510K55797A55626
$$ plain form
18653 37143 -302468 -140832 102196 72255 17611 -197797 105790 -35901 -55875 -291717
18643 -291717 -58212 -1470 -35649 -80047 -80277 -192000 209403 -59938 -151598 -118606 35775 -60130
18630 -25970 98698 41394 -153869 -23760 -342831 72350 -223204 -389824 -82740 -13428 102860
18618 -258379 121340 -200536 58471 -104760 -55404 -326142 110458 46062 121647 73046
18608 73046 186498 -52054 -69200 276501 -16819 32888 99131 275230 206132 -224252 -54553
18596 46822 -48299 -50520 21139 52908 17324 -198716 -111154 -61439 -314572 -101382 -51923
18585 -51923 199183 65475 -77193 -226031 -78780 -68526 -52820 414482 163551 49961 -122775
18573 -175869 -104493 -172810 29487 -167089 -4210 91469 -11178 326803 -513510 -257713 155626
18561B41330a47735d2416j19697k46852C2040b61325m8533a6948m2319n4184A40242
18549G03f2399C41979a38938A79560f2935A56180b28768n8098L4133h4382A81169
18537i5820D173K13869b63014K3791a9869E4721B5647h0234c9160j06277I9927
18525a13694B47767a23011G0649D100c54414A85826c97843B61155h6134r2658
18515a78792h6256B8493b03310D1530a28870L0394L2749B12793c46922a12906
18504C0152M1512g8429j00152P4600j94592O1157B34056g3505j3001m9150F5364
18492h8073M1025F4621b54338B20554b84603D1767c03091A91857a30673E1136
18481a46293d5949m05845C2551b50906c2506A74113a30997A15645a98284A18607
$$ plain form
18561 241330 -147735 -42416 -162113 -408965 32040 -261325 -309858 -16948 -59267 -113451 140242
18549 703 -62399 341979 -138938 179560 -62935 156180 -228768 -286866 -252733 -84382 181169
18537 -95820 4173 218042 -263014 -239223 -19869 54721 25647 -80234 -39160 -145437 99927
18525 -113694 247767 -123011 70649 4100 -354414 185826 -397843 261155 -86134 -178792
18515 -178792 -86256 28493 -203310 41530 -128870 -98476 -65727 212793 -346922 -112906
18504 30152 71664 -78429 -178581 -103981 -298573 -237416 234056 -73505 -86506 -135656 65364
18492 -88073 -47048 64621 -254338 220554 -284603 41767 -303091 191857 -130673 51136
18481 -146293 -45949 -451794 32551 -250906 -32506 174113 -130997 115645 -198284 118607
18470a10840B67624e2070o6127B00109a06396H2242a90614A3310b93306n4839
18460c48145a14170n5963b704C7917a29882d8828B04758b5007C50535d32990B6491
18448c98843C6176D341O9397K3159i1364j00237A6727a45226J8395A29704A5691
18436a827A28238l2096b51333L1252m809I7403j3676K7127a23911M612A52751
18424h2684H3752J31188h3996A40652a85266p1310b5660j72650D62422b9396k7055
18413e6451q3951B42153e9591j70a4597j71597A97203c46307g7222B45272D2846
18401a09859A58648b65215I0881k5140N1326e2181A92096c6697H2107b01569G9171
18389B72262j16890E0655A0372L2467M1344g4106r7148o2797c8096H2092h6754
$$ plain form
18470 -110840 267624 -52070 -118197 200109 -106396 82242 -190614 13310 -293306 -348145
18460 -348145 -114170 -170133 -2704 37917 -129882 -48828 204758 -25007 350535 -432990 26491
18448 -398843 36176 4341 73738 96897 -91364 -191601 16727 -145226 -126831 129704 15691
18436 -1827 128238 96142 -251333 -220081 -224890 97403 83727 110854 -123911 -119299 152751
18424 -82684 83752 214940 -83996 140652 -185266 -256576 -25660 -198310 462422 -29396 -56451
18413 -56451 -140402 242153 -59591 -59761 -14597 -186194 197203 -346307 -77222 245272 42846
18401 -109859 158648 -265215 90881 65741 117067 -52181 192096 -36697 82107 -201569 79171
18389 272262 155372 50655 10372 42839 84183 -74106 -171254 -234051 -38096 82092 -86754
18377b46557D16748c3600I8410k4451i8227j31570J01038A39878N878b48091k41580
18366d89671a72090B45455L1268G6589a84378p3016A40122a22153p8918B08541
18355B622a3457F03734a93563C98563I5934J19369b88218a43355A34514a45682
18344a78607d321k20160a04101k6983D2849A8189b0459o195k20891A64981J78562
18333C43543b30464C5174N1793i7194r6681F1463a98384f1106E7511J02197d7347
18321A34708C4650R0952f0852H7123d31796A64495F4872c56959N248A62256P9295
18310B41551a62261G2818b82649a35691A39504B1778d1140B43950f2269n4709
18300a16978k5264C14010E320b5254j07670B59165a58912a7027l6756j40051j06286
$$ plain form
18377 -246557 416748 -33600 98410 73959 -98227 -229797 -128759 139878 145756 -248091 -489671
18366 -489671 -172090 245455 276723 76589 -184378 -257394 140122 -122153 -201071 208541
18355 2622 -13457 603734 -193563 398563 95934 215303 -288218 -143355 134514 -145682
18344 -178607 -4321 -224481 -104101 -131084 42849 18189 -20459 -26654 -247545 164981 343543
18333 343543 -230464 35174 86967 -97194 -193875 61463 -198384 -61106 57511 159708 -47347
18321 134708 34650 125602 -60852 87123 -431796 164495 64872 -356959 -351711 162256 241551
18310 241551 -162261 72818 -282649 -135691 139504 21778 -41140 243950 -62269 -116978
18300 -116978 -142242 314010 5320 -25254 -132924 259165 -158912 -17027 -53783 -193834 -300120
18289c00120D7103K3392d8089j77988J12540b5958E1873c91130g2500J860A26475
18277B56714b77895q6883B66783a68651N0682a1193k53059C849K8037a96165l7352
18266b33517O9383p3911g6911A8865a43761j50123i9575J7778B06884H3396c99175
18254g6135C53339a54814O961l2783j04972I9625B6632a46376L4188d9013A297
18242G6648b3956j05610E4676P1977a5053D7760O3859M420b69353J17885A45965
18230B38076A8768M7558c8538E9106a84415h9082m3612M5688A13698a96858j51511
18219c48369F3433K5808c4493C5514a45943A67963b68844a14737A20773c33742
18208f262A54414a15269G1614j8720J02295A0474K1279j5353a45577A37071a55766
$$ plain form
18289 -300120 47103 70495 -48089 -226077 -113537 -25958 51873 -391130 -72500 -70640 126475
18277 256714 -277895 -364778 266783 -168651 -117969 -11193 -264252 3849 31886 -196165 -233517
18266 -233517 -164134 -238045 -76911 18865 -143761 -293884 -99575 -81797 206884 83396 -399175
18254 -76135 353339 -154814 -147853 -180636 -285608 99625 26632 -146376 -112188 -49013 1297
18242 76648 -23956 -129566 54676 126653 -15053 47760 111619 116039 -269353 -151468 145965
18230 238076 18768 66326 -38538 59106 -184415 -89082 -132694 -87006 113698 -196858 -348369
18219 -348369 63433 89241 -34493 35514 -145943 167963 -268844 -114737 120773 -333742
18208 -6262 154414 -115269 71614 52894 155189 10474 31753 16400 -145577 137071 -155766
18196a24532b581I7509J60659A1977f4130j3712B44444d1067j57412A10252b80987
18184a56224j5443e5426A43971c8072l99059H6449K176a44667e5992E2762h0370
18172a97307K9902N7420B2928a29198j05380o8460A0354a16487A22795A630K1291
18161B2921b7580k75559a17882n6983d1829q761m9380B5148g8334j63953G9093
18149I8615c7884E7784a31771k6273B170J31601b37036i6856F3372J1355m601
18138G0126j9676a37536C8549h3109B28313b08914B9599J94113f0926r247I3202
18126I3501i5963n4582e7659m32A8907b5966p485j47757r708C9400i142l825j09312
18113a22279A88515H9298O335a11967J2367L1298F3253d5930A13710K2292d2009
$$ plain form
18196 -124532 -2581 97509 258168 11977 -64130 -77842 244444 -41067 -198479 110252 -280987
18184 -156224 -171667 -55426 143971 -38072 -437131 86449 88625 -144667 -55992 52762 -80370
18172 -197307 -167405 -109985 22928 -129198 -234578 -303038 10354 -116487 122795 1630 22921
18161 22921 -27580 -303139 -117882 -174865 -41829 -50590 -99970 25148 -78334 -242287 79093
18149 98615 -37884 57784 -131771 -158044 2170 133771 -237036 -96856 63372 74727 70126
18138 70126 50450 -137536 38549 -83109 228313 -208914 29599 223712 -60926 -70173 93202
18126 93501 -95963 -150545 -57659 -58091 18907 -25966 -33451 -181208 -190916 39400 -9142 -12967 -122279
18113 -122279 188515 89298 95633 -111967 -99600 -68302 63253 -45930 113710 136002 -42009
18101f4824A41077C1915b766G9843b48861J1734O8207f9171A03757f9230e4H2104
18088b0937G1824J08501B8996J2176m23e71j18532c7867j13803M9454k3751K7024
18076i8943o9406P4780A38210O3690b15612M9293H6559e1205j35339H8962d37450
18064a80651A13763a81001B07769a72854b2968p8893A52311b57590n6339B85590
18053e8285B1954a81255h1330G632b56133D1920c10331e7248C8409a3545B05241
18041f0930A14428f990q4448A70252a5812k49043g5631l8773l45101d231k9539
18030c3770C8907J66722L6394a02280B947P5319d32059K06553n9878A43453a51088
18018a17522j45772R3308c2911q3164C19697a09765B4843a49835E0514B0136f4021
$$ plain form
18101 -64824 141077 31915 -2766 79843 -248861 -237127 -168920 -69171 103757 -69230 -54 82104
18088 -20937 71824 180325 28996 41172 40749 -571 -119103 -37867 -151670 -102216 -125967 -98943
18076 -98943 -168349 -93569 138210 201900 -215612 -166319 86559 -51205 -186544 88962 -437450
18064 -180651 113763 -181001 207769 -172854 -22968 -101861 152311 -257590 -313929 285590
18053 -58285 21954 -181255 -81330 7632 -256133 41920 -310331 -57248 38409 -13545 205241
18041 -60930 114428 -6990 -91438 170252 -15812 -264855 -75631 -114404 -459505 -4231 -33770
18030 -33770 38907 205629 242023 -102280 2947 78266 -432059 -225506 -285384 143453 -151088
18018 -117522 -263294 -169986 -32911 -116075 319697 -109765 24843 -149835 50514 20136 -64021
18006A15047E944a2205A43631b032r4342k22238J58091p1137n2750A25163n0831
17995G4332b42286C5593a45145k20153e7663A44282c73695J06577P0268h3485
17984f0117A30270c21444I0438a27395L73C33182A09208b38762e0648m8056D24167
17972A03862m002b09485D54409d18242a91912h3471j0193D00527a24757a7822
17961A88876e4434k93654A60132j0036i7591g270l20656a23248c3982B1189J73792
17950A94981a80426Q6911c4123j89835L8520A06433a91313A87417a49684D0234
17939b1621k1910d100I6075c14305a34638G3846Q492K36686a52446b9390A46853
17927a12804A92465m7773G1811l3410g3571E0436b72300A87843a05325A2818g1125
$$ plain form
18006 115047 5944 -12205 143631 -2032 -96374 -318612 -160521 -231658 -284408 125163 74332
17995 74332 -242286 35593 -145145 -365298 -57663 144282 -373695 -267118 -196850 -83485
17984 -60117 130270 -321444 90438 -127395 -127022 333182 109208 -238762 -50648 -98704 424167
17972 103862 99860 -209485 454409 -418242 -191912 -83471 -93664 400527 -124757 -17822
17961 188876 -54434 -348088 160132 150096 -97591 -7270 -327926 -123248 -33982 21189 194981
17950 194981 -180426 -93515 -34123 -223958 -185438 106433 -191313 187417 -149684 40234
17939 -21621 -43531 -4100 96075 -314305 -134638 73846 82338 319024 -152446 -29390 146853
17927 -112804 192465 144692 71811 38401 -73571 50436 -272300 187843 -105325 12818 -71125
17915b3947B5594c04433f7459J1843j19128b4943l19669B04689B3192b19056A39107
17903d5958B56349c7749f294B21074l3281r1960a43881D7050b35120I7040a81124
17891f5317E2851a81238A45180a08222B1020J00321a8347j84595B84028b12926
17880H5659m636d9124B47784j20653O5956a93581A98200k2556d4216B84461E2135
17868D77218e7487a1769l46879A1873J90595f1142j01189G3605b6198q1185b0859
17856E3020Q9133C5400J72220c41858G3312c9950l825j09105n5029A28635a22472
17844C0337i5703L4759A12990J48735F0984a12924E7301O1324a69392j81590A39640
17832c8952G8207b25765B4020k708a55668e6583E5590a42420R486N947A84471
$$ plain form
17915 -23947 25594 -304433 -67459 -55616 -174744 -24943 -344612 204689 23192 -219056 139107
17903 -45958 256349 -37749 -6294 221074 187793 95833 -143881 47050 -235120 97040 -181124
17891 -65317 52851 -181238 145180 -108222 21020 121341 -18347 -202942 284028 -212926
17880 85659 81023 -49124 247784 127131 193087 -193581 198200 175644 -44216 284461 52135
17868 477218 -57487 -11769 -358648 11873 202468 -61142 -162331 73605 -26198 -107383 -20859
17856 53020 142153 35400 207620 -341858 73312 -39950 -43775 -152880 -207909 128635 -122472
17844 30337 -95703 -60944 112990 261725 60984 -112924 57301 118625 -169392 -350982 139640
17832 -38952 78207 -225765 24020 21312 -155668 -56583 55590 -142420 -132934 -126987 184471
17820I5469L56569a4716A03693a29672A6142J54374q052J12109a9098j21122o3929
17809b04149g0293j60985K363c6368l4567j05412D5306H103e60251K34845B29266
17797A47413D3738d8526I4232g1599j31220B09146a40906B58468m0009a75461
17786a07804n1049q0430F5184A2677J70882K5772d4371a8640j15230k98967A63784
17774f0945l748A8666c5172n7331B61998c92735C8311O4439D68L56946j23785
17763B33629d41873A41945j5043L9838B0051L33226a82764e8134D68427A3126
17752b5832A74610C780b62628A75673C9560c13098A43968b3089B68333F9620L72893
17741D42513A94375b36011d1484k6950E626Q9821b2448I0897D1347b7219H6375
$$ plain form
17820 95469 452038 -14716 103693 -129672 16142 170516 162464 274573 -19098 -140220 -204149
17809 -204149 -70293 -231278 -228915 -36368 -70935 -176347 45306 8103 -560251 -325406 229266
17797 147413 43738 -48526 94232 -71599 -202819 209146 -140906 258468 218459 -175461
17786 -107804 -158853 -239283 65184 12677 183559 209331 -44371 -18640 -133870 -432837 163784
17774 -60945 -64693 18666 -35172 -92503 261998 -392735 38311 102750 468 357414 233629
17763 233629 -441873 141945 126902 166740 20051 353277 -182764 -58134 468427 13126
17752 -25832 174610 3780 -262628 175673 39560 -313098 143968 -23089 268333 69620 442513
17741 442513 194375 -236011 -41484 -68434 5626 95447 -22448 90897 41347 -27219 86375
17729B23100d9602p7012A73476e5727A59881N5909C5311c5m1574j50070a324l65294
17717c66618J69732a1071A38712a10801d5910A09706a28226p8209e9961j63684
17707b23645B46506H1924k4891a78540h7879A40318A0745d555j14600B88524E5859
17695A20419c98118B10440K92565f2781A80390A729c09318E715a47152B69513
17684A50612R5549I795K58544F1028J21180p7054O6188C7705f6905j0249C89184
17672D1432a84505a9377A42469N8507j7818i6532p3910B46923f3274A50210a1362
17660a27987J4039k99860a10354A88040g1034L3866r6903e2362B84491a25500
17649a54842L6517N0843g88D4421J2177A3909a41442A39397a14686B80267a54279
$$ plain form
17729 223100 -49602 -126614 173476 -55727 159881 215790 35311 -35 -41609 -191679 -1324 -366618
17717 -366618 -196886 -11071 138712 -110801 -45910 109706 -128226 -206435 -59961 -223645
17707 -223645 246506 81924 57033 -178540 -87879 140318 10745 -4555 -119155 288524 55859
17695 120419 -398118 210440 503005 -62781 180390 1729 -309318 5715 -147152 269513
17684 150612 246161 9795 268339 61028 182208 105154 171342 37705 -66905 -77154 389184
17672 41432 -184505 -19377 142469 200976 183158 -96532 -170442 246923 -63274 150210 -11362
17660 -127987 -113948 -413808 -110354 188040 -71034 -37168 -134071 -52362 284491 -125500
17649 -154842 -118325 -67482 -788 44421 56598 13909 -141442 139397 -114686 280267 -154279
17637b32643B18522a08498H0254f5907G758J78621p6588B2958J22349N3651b39883
17625A96144K13483d3955a747k16153d9288B39838A02759O3034J436b37822a3216
17613c486B02378j00747j802C5296b7416p8202k026J2347E9227j6304a2693A65333
17600e87r2267K3080j79443f5525C5869P7801c37510G5132P4652m9134l988A1632
17587F2401b36339a06904B5440P2389M8875f1303C14060A18142n7299g8203I7923
17575A57478b8839j8478B34554G5268e8450A30407f05327E173e2988k513G7675
17563f3179b3775B15913a27329d1832j20785M7692o4398c7506k37362Q8697a7876
17551i6097I4439J92988C2760b07125A04401L3095R9096A00421c08402A32743
$$ plain form
17637 -232643 218522 -108498 80254 -65907 7758 186379 109791 22958 145307 198958 -239883
17625 196144 409627 -43955 -1747 -217900 -49288 239838 102759 165793 167229 -237822 -13216
17613 -3486 202378 101631 99829 35296 -27416 -105618 -107644 -95297 59227 42923 -12693 165333
17600 -587 -92854 -69774 -249217 -65525 35869 113670 -337510 75132 149784 100650 96662 11632
17587 62401 -236339 -106904 25440 97829 146704 -61303 314060 118142 60843 -78203 97923
17575 157478 -28839 -47317 234554 75268 -58450 130407 -605327 5173 -52988 -55501 77675
17563 -63179 -23775 215913 -127329 -41832 -162617 -114925 -179323 -37506 -274868 -186171 -17876
17551 -96097 94439 287427 32760 -207125 104401 137496 236592 100421 -308402 132743
17540D3157J74963J05420j09617K01081A2811a67274B30225J58672J19870B18312
17529A1105L8258J32764L55663C1729C089Q0348J13875a92510D1493K23924b6338
17517A00494P084d0640A77645a07030I2645J92599H2891c43743B84583i2910c7356
17505g257A03407K4790K78693B3626a16669B00329J0204b9851H2884N7118J80739
17494C20741j00928R6005j02685M9589l3214G113J49154j4452b8417N394A30541
17482a49134B65855C4128J9875J76033J5746K8659a1221B35211D6310K88220b98603
17470B72369C5389K31497r0925a2207C60617a9824A66239J36575b18372a07601
17459H0451E071K16632d463C79179A9415a14749J3096D46257A37520n405B6297
$$ plain form
17540 43157 218120 323540 213923 415004 12811 -167274 230225 388897 508767 218312
17529 11105 49363 182127 537790 31729 3089 83437 197312 -192510 41493 265417 -26338
17517 100494 107578 -40640 177645 -107030 92645 285244 82891 -343743 284583 -92910 -37356
17505 -7257 103407 128197 406890 23626 -116669 200329 210533 -29851 82884 140002 320741
17494 320741 219813 315818 213133 262722 229508 7113 156267 141815 -28417 -23023 130541
17482 -149134 265855 34128 54003 230036 245782 274441 -11221 235211 46310 334530 -298603
17470 272369 35389 266886 175961 -12207 360617 -19824 166239 302814 -218372 -107601
17459 80451 5071 221703 -4463 379179 19415 -114749 -101653 446257 137520 132115 26297
17447A21924K66551j91516J65417m6744K48686B67640A8078J22280N9858J39542
17437C39758O3025J24849g3862A28794K00295m5266p2568M5472a31840A51767
17426D68812M0496k0854j68068r1957C0992K89602D8202K62122f5178j6531B55024
17414B82631J52943A44016J43218p7816k5641J67111I4679B1042J06471j0679
17404A16834J54164j9366E2458J59307m2651O2367r153a93670A84604K05498h554
17392B75438B2638N45609E888J23536K37550a32334M9047o0313C1851J62126O6399
17381B60376B471g6126k5403C09180g0838B81480A09739m1973N2107a45245A2269
17369A35781m8385Q6935B2480b24930G1587a79366C59959q2828q3129a1955B87625
$$ plain form
17447 121924 388475 196959 362376 315632 564318 267640 18078 140358 200216 339758
17437 339758 402783 527632 -73862 128794 329089 283823 211255 256727 -131840 151767
17426 468812 509308 488454 320386 228429 30992 320594 48202 310324 -65178 -81709 255024
17414 282631 435574 144016 287234 209418 183777 350888 94679 21042 127513 116834
17404 116834 270998 251632 52458 211765 169114 231481 222328 -193670 184604 390102 -8554
17392 275438 22638 568247 5888 129424 366974 -132334 -83287 -143600 31851 193977 260376
17381 260376 2471 -76126 -101529 309180 -70838 281480 109739 67766 119873 -145245 12269
17369 135781 87396 174331 22480 -224930 71587 -179366 359959 277131 194002 -11955 287625
17357A32653A6674N8092l0809i118F58725A6524O7356H833e327A25427K78681
17346D04108j25180A33558k9179e1741a2040A48772J65072G6828c14923d8151
17335B69858o0227H202J95933a24610A9735J28989K69504A84412a37784B74968
17324A55140J4557N4346j03637a6218G5273c5269C2669J17381m0387C5484J04414
17313A39898l4513D0172J43635L8490c1968B50775A16228K21541A20970a75235
17302F8960L45161a79839B7639h786B20304n2049K1912D9234J58872C0810K70584
17291C01394E9676R7810C2090M08634j64693G2727J75810K99633k24181H6193
17280a12482h258A92898O3049A13848K4664n6380J09078H2258J84892b52372A61285
$$ plain form
17357 132653 16674 74766 43957 -9118 658725 16524 83880 8833 -5327 125427 404108
17346 404108 278928 133558 104379 -51741 -12040 148772 313844 76828 -314923 -48151
17335 269858 209631 8202 204135 -124610 19735 148724 418228 184412 -137784 274968
17324 155140 169697 224043 120406 -16218 75273 -35269 32669 150050 109663 35484 139898
17313 139898 105385 40172 183807 222297 -31968 250775 116228 337769 120970 -175235
17302 68960 414121 -179839 27639 -8786 220304 168255 190167 49234 208106 30810 301394
17291 301394 59676 157486 32090 440724 276031 72727 248537 548170 323989 86193
17280 -112482 -8258 192898 255947 113848 138512 82132 191210 82258 267150 -252372 161285
17268C86191p9228A35876E027N5654A0884K67000l8140M4571M0687a8257A64220
17256A91960O528K02566A54977A4830K83694r4591g9888C60272A25608L68697
17246D94305j11039l9895r4012A18029M0658J92801A24773K61716j78665r6538
17236A11286P0967d3974a7802I2339N6800J33631n1002d3191A95318J20764A33053
17224A54407B8339K40646Q6360A43342f9313b6202a1338C24823K7686o3863Q3145
17213C71791o1614H2993L00600A62134c608E10106p3283A80736K86754c38924
17202B9632K84058j36761J67065m4073d3528D6775J23899J4258J30558M0655L08095
17191F64240A99819J55914M447j55522C1196c6110C18113K81273A69922j8082
$$ plain form
17268 386191 306963 135876 5027 60681 10884 277884 239744 284315 325002 -18257 164220
17256 191960 198488 401054 154977 14830 298524 203933 -79888 360272 125608 494305
17246 494305 383266 343371 249359 118029 158687 351488 124773 386489 207824 111286
17236 111286 182253 -43974 -17802 92339 149139 282770 231768 -43191 195318 316082 133053
17224 154407 28339 268985 355345 143342 -69313 -26202 -11338 324823 352509 288646 371791
17213 371791 310177 82993 383593 162134 -3608 510106 436823 180736 467490 -338924
17202 29632 313690 176929 343994 299921 -43528 46775 170674 184932 315490 356145 664240
17191 664240 199819 355733 360180 204658 31196 -36110 318113 599386 169922 151840
17181A51840E8170Q9617J6304k1394J52529b4254B79096k4572O4539A59210K3730
17170A82940K66696k15960m8952J8004J36386l0738R8789j52228j10225K56473
17160D01185A30638M1075J62505l7482J29718A86397j0586j0498M31005A19758
17149B65512n7315M0784M36323A69742J88516q2488L30040j46241j7759j91145
17139B50665J53213j94083N6780d7647A07263J72177J13022l0098H8400L45503
17129D33903K26131B28226a24174A58857e98C59097n674m3399J34770p5441j6735
17118C52618m4404K9414J54259j52652J11474j97093l279k4641J95307j48273
17108B72730L64919C04214K91938k85255G8671K61538M4937n6245q8592m9027
$$ plain form
17181 151840 58170 147787 164091 142697 295226 -24254 279096 254524 319063 159210 182940
17170 182940 449636 233676 184724 202728 339114 308376 407165 254937 144712 401185
17160 401185 130638 171713 334218 296736 426454 186397 175811 165313 596318 119758
17149 265512 208197 248981 685304 169742 358258 275770 605810 459569 441810 250665
17139 250665 403878 209795 266575 -47647 107263 279440 392462 362364 88400 433903
17129 433903 660034 228226 -124174 158857 -598 359097 353423 310024 444794 369353 352618
17118 352618 308214 337628 491887 339235 450709 253616 250337 225696 421003 272730
17108 272730 637649 304214 596152 310897 78671 340209 385146 328901 240309 191282
17098A91282J98250L0012j21521m0129J44438j64650q2748K48858A74928J49212
17088C24140K76287k59792p9474O04043D32468m6809M43399A94238J88789m582
17078C78445L48381J17278j95558o854B00899J14230Q5046A94360J08387K46947
17068E49694j87883j9634A58453L11181B29574J94370j70522K80882J12777Q4924
17058G32005n3181l01451j67293J60255R4252A33029L77592K15593l49162L14137
17048F91189M349C13844q0172O4425l947J84847j56516K06153K37601r1798N2243
17037G26680r2269j85340b4211G93678l56062J02810R5082j47615O4696J5875
17027E68464j64664J99998J33968k75121L03110l13715J44065L6834k48794L96368
$$ plain form
17098 191282 389532 419544 298023 257894 402332 237682 154934 403792 174928 324140
17088 324140 600427 340635 261161 865204 432468 385659 829058 194238 383027 378445
17078 378445 726826 844104 648546 641692 200899 315129 400175 194360 302747 549694
17068 549694 361811 342177 158453 469634 229574 423944 253422 534304 647081 732005
17058 732005 678824 377373 210080 370335 464587 133029 510621 726214 377052 691189
17048 691189 695538 313844 233672 298097 294150 478997 322481 528634 766235 674437 726680
17037 726680 634411 449071 -24211 793678 437616 540426 635508 487893 552589 568464
17027 568464 403800 603798 737766 462645 765755 452040 596105 632939 384145 780513
17017G80513k31034p1895K12139O3161k23804n4519r2286J93944K36072l3648
17007G78643m2221k18717L5842j74646L6183M05462l37224J89699L45344m59512
16997E58853J6107J53685L59260j92024k79347M6231Q3847K81962j27460j04105
16987G97009J63361l06832J76218m7761K6164M21741m42956k01621L59838Q627
16977I53788j01170P4926J43705k60719K07597j70875j35569K85851j36808K452
16967H63178J01957j91627N7151J1662P3997K7327q5172P7554L27030l22300R2575
16956A033332j71027J74701p2051n8334J27470j77827P9408K30906Q2996l24676
16946I24898m4645J95922j7399K6918K8126j62692l8018L46378o6263k04225L48073
$$ plain form
17017 780513 549479 477584 689723 752884 529080 474561 382275 576219 812291 778643
17007 778643 736422 517705 553547 378901 415084 820546 483322 673021 1018365 558853
16997 558853 574960 728645 1087905 895881 616534 662765 746612 1028574 901114 797009
16987 797009 960370 653538 829756 781995 808159 1229900 786944 585323 945161 953788
16977 953788 852618 927544 1071249 810530 1018127 847252 711683 997534 860726 863178
16967 863178 965135 773508 830659 842321 916318 943645 858473 936027 1263057 940757 1033332
16956 1033332 862305 1037006 964955 906621 1034091 856264 935672 1166578 1249574 924898
16946 924898 880253 1076175 1058776 1085694 1113820 951128 913110 1259488 1193225 989000 1337073
16935A337073J98822k61913l77175L04351P5192J12603J75481j09150k81785n7021
16925A116478J67662J84076j97309N9842J79823m16728K71772J06136K28244j60096
16915A539900p5414j26000L94347k61479P981P1524M6391R7137j08714k25234
16905A360439m4862J84212K34209m48877N05992P1318l51400k45689J06614K29206
16895A601162O927J77340J65851o65146O28018k45674K40490K0222r8347k04842
16885A626001M52763l30582L18150L08805l96073k7897r523K27819R942J28007
16875B307412k05271n745K28623J16380j74655o5063L74243k61815J36903L5303
16865B486315k3586n6072L80157j14171r4285k43816O72816j63512P692m3598
$$ plain form
16935 1337073 1535895 1273982 896807 1201158 1276350 1388953 1564434 1455284 1173499 1116478
16925 1116478 1284140 1468216 1270907 1330749 1510572 1093844 1365616 1471752 1699996 1539900
16915 1539900 1464486 1338486 1732833 1471354 1479335 1550859 1597250 1694387 1585673 1360439
16905 1360439 1315577 1499789 1733998 1285121 1791113 1862431 1511031 1265342 1371956 1601162
16895 1601162 1608089 1785429 1951280 1286134 1914152 1668478 1908968 1929190 1830843 1626001
16885 1626001 2078764 1748182 2066332 2375137 1979064 1951167 1941644 2169463 2179405 2307412
16875 2307412 2102141 2096396 2325019 2441399 2266744 2201681 2575924 2314109 2451012 2486315
16865 2486315 2462729 2406657 2786814 2672643 2578358 2334542 3007358 2843846 2851538 2807940
16855B807940P2581r6716L06768m9625k54541J59211M1861L10046j4538J95296
16845C478283k17073K20485j56433J64109K93654l3993k2570P3515j09288L83335
16835D074024m52801J69900K63986O4663J67914l8459K08406J57023j4413l3015
16825D567228k02208M40576RQ617M25234k31504N987L45762K09810J52533j03447
16814E618597Q6678M29423k28732M0936J8980M40780N4195K25786o1836N49737
16804G174544j42308o0920L41626O35523j32753K42318k6992L38252r752M24715
16794H784253J02038K28516K77511M86530K27212J78737J08703N82962K43152
16785A1219614K50360J37917Q26818l22128P16248L06613L19798J30220M40104
$$ plain form
16855 2807940 2880521 2783805 3090573 3040948 2786407 2945618 2987479 3297525 3282987 3478283
16845 3478283 3261210 3481695 3325262 3489371 3783025 3749032 3726462 3799977 3690689 4074024
16835 4074024 3621223 3791123 4055109 4119772 4287686 4249227 4457633 4614656 4600243 4567228
16825 4567228 4365020 4805596 4805605 4814222 5239456 5007952 5013939 5359701 5569511 5722044 5618597
16814 5618597 5705275 6134698 5905966 5946902 5965882 6406662 6460857 6686643 6624807 7174544
16804 7174544 7032236 6971316 7312942 7948465 7815712 8058030 8031038 8369290 8359538 8784253
16794 8784253 8886291 9114807 9392318 9878848 10106060 10284797 10393500 10976462 11219614
16785 11219614 11469974 11607891 12434709 12112581 12828829 13135442 13455240 13585460 14025564
16776A4025564O71461N75701J88585O37995M95222O16678Q25708Q0333J011693
16767A9128940O84748Q51689O58372R76092M65785P55158J447661P68245J331269
16758B7067959R27906J485920J268968J340566J213355J356998J777951J856664
16750C8296287J907010J927178K009561K069695K623361K466886K922565K894987
16742E7117530L186410L254805M134953L502771M449464M610569M855592N409927
16734I0522021N041637N949011O342249P309681O984171P351549P592136Q011502
16726A45103957Q199042Q244169P531626Q083448P152087O216008N692627M200219
16718B00423183L522623J669168p0094o61512k700942m054294n303646n921845
$$ plain form
16776 14025564 14697025 15272726 15461311 16099306 16594528 17211206 18036914 18117247 19128940
16767 19128940 19813688 20665377 21323749 22299841 22765626 23520784 24968445 25736690 27067959
16758 27067959 27995865 29481785 30750753 32091319 33304674 34661672 36439623 38296287
16750 38296287 40203297 42130475 44140036 46209731 48833092 51299978 54222543 57117530
16742 57117530 60303940 63558745 67693698 71196469 75645933 80256502 85112094 90522021
16734 90522021 95563658 101512669 107854918 115164599 122148770 129500319 137092455 145103957
16726 145103957 153302999 161547168 169078794 177162242 184314329 190530337 196222964 200423183
16718 200423183 203945806 205614974 205544880 204883368 202182426 198128132 192824486 186902641
16710A86902641p489418p687097q057434q311916q015641q241316q229048p689852
16702A23180919p441663p248988o512459o186575n711055n623470n309932m698630
16694G4448147m065044m268824l799394l300839l380998l479700k712572k614946
16686D6825830k365594j962791k236731j794116k229992j668945j531425j325235
16678C1711001j719196j453192r07393j259504j046446j033757j009631j060524
16670B2221358r59247p73529r66316o37636n91809m41400o68899o00172n05747
16661A6076603p81167j39088n97604m51004q75118m22196j63769m63245m71911
16652A1711501j86036n64924P5428o53581m03887J4182k07654m52945j84601j36518
$$ plain form
16710 186902641 179413223 171726126 163668692 155356776 147341135 139099819 130870771 123180919
16702 123180919 115739256 108490268 101977809 95791234 90080179 84456709 79146777 74448147
16694 74448147 70383103 66114279 62314885 59014046 55633048 52153348 49440776 46825830
16686 46825830 44460236 42497445 40260714 38466598 36236606 34567661 33036236 31711001
16678 31711001 29991805 28538613 27631220 26371716 25325270 24291513 23281882 22221358
16670 22221358 21262111 20488582 19522266 18884630 18292821 17851421 17182522 16582350 16076603
16661 16076603 15295436 15156348 14558744 14107740 13232622 12810426 12646657 12183412 11711501
16652 11711501 11525465 10960541 11035969 10382388 9978501 9992683 9785029 9332084 9147483 9010965
16642I010965k05054l61112j77410p4638p45273L83716o86790k56493k8384q6457
16632F773070j56898l62619L98243j68171m06606n4758N8627k52404l58768j66133
16622E303583J38376l30359o6931k19788q7281m15041N98587m38784j51932J34454
16612D464884k66142J25928m56410J74923j36530J57027J29519n24282K26087
16603C895004n5526k53411q9312j30378P551K13817m16118J18401K91030j48690
16593C432368m77377O6144k59273P7588j98516N6608P1313k77667J31201N5234
16583B677623J26576K6144l95144J02846k33334J72185M51861m21851k10745k95275
16573B000886L6081J6548J55891j38321k4351l7513J5526j48842p1851K68148
$$ plain form
16642 9010965 8805911 8444799 8267389 8192751 7447478 7831194 7144404 6887911 6859527 6773070
16632 6773070 6616172 6253553 6651796 6483625 6077019 6022261 6080888 5828484 5469716 5303583
16622 5303583 5441959 5111600 5044669 4824881 4737600 4322559 4921146 4482362 4330430 4464884
16612 4464884 4198742 4324670 3868260 4043183 3906653 4063680 4193199 3668917 3895004
16603 3895004 3839478 3586067 3496755 3366377 3373928 3587745 3171627 3290028 3581058 3432368
16593 3432368 2954991 3021135 2761862 2839450 2640934 2697542 2768855 2491188 2622389 2677623
16583 2677623 2804199 2830343 2435199 2538045 2304711 2476896 2928757 2506906 2296161 2000886
16573 2000886 2036967 2053515 2209406 2071085 2046734 2009221 2024747 1875905 1804054 2072202
16563B072202k29646J10667j51746l6357n7560L4881K57519k84148Q0795j64876
16553A631731L39037J06111k96501Q4732l93298j53984l0534M33499j70965o8073
16543A481755j6599j94772N87354j88145k75626k9570K18233k96556l2373J44629
16533A398330m34606L79170m9597k79373M7646K22873K04371l8473j65210O3043
16523A348174l14567N8516o4902J65694m7598L9013j45425J49388l99452J83123
16513I71964J14756k42861K50448K533j16357k04167K10840k85972M82646m85286
16503F98544M11710j35396l59771J79055J84180k82131J32976o5417R252M8385
16493H21387l70607J31961J84277j02057K65210p6874j81372r9788L80105k2379
$$ plain form
16563 2072202 1842556 1953223 1801477 1765120 1707560 1742441 1999960 1715812 1796607 1631731
16553 1631731 1970768 2076879 1780378 1865110 1471812 1317828 1287294 1720793 1549828 1481755
16543 1481755 1465156 1270384 1857738 1669593 1393967 1364397 1582630 1286074 1253701 1398330
16533 1398330 963724 1342894 1293297 1013924 1061570 1284443 1488814 1450341 1285131 1348174
16523 1348174 1033607 1092123 1027221 1192915 1145317 1184330 1038905 1188293 788841 971964
16513 971964 1086720 843859 1094307 1096840 980483 776316 987156 701184 1183830 698544
16503 698544 1110254 974858 615087 794142 978322 696191 829167 763750 773002 821387
16493 821387 450780 582741 767018 664961 930171 853297 671925 572137 952242 929863
16483I29863k37805L63551J05498m16140k07285O8242J27091j6050K07463m07276
16473E17152L80055l11259J71939j75187M57979j70476J58048A94098Q46595k48933
16463G91760j47191L15732C90850Q0678J10376j72205J6458R992J70580L1321
16453F38050C00995M09898q6087M4684l30398L32558J27314j66146o9409J56088
16443G19497j31728P4094j68448K7162K2950O0590n7n3102N9934J3996B75828
16431B94178o7561l1084M66684B11289K99922O4707k60607K87390k06584M61657
16421H57774C85835A56869K43422L38967k21798K11446j71587O1489p4856k31617
16411C12335M38963j55245j15233j29057K50379B97053J82981k27494L9907M35394
$$ plain form
16483 929863 692058 1055609 1161107 744967 537682 605924 733015 716965 924428 517152
16473 517152 897207 585948 757887 582700 1040679 870203 1028251 194098 1040693 791760
16463 791760 644569 960301 390850 471528 581904 409699 426157 436149 606729 638050
16453 638050 300995 710893 624806 669490 339092 671650 798964 632818 563409 719497
16443 719497 587769 661863 493415 520577 543527 604117 604060 550958 610892 624888 275828
16431 294178 226617 195533 662217 211289 511211 575918 315311 602701 396117 857774
16421 857774 385835 156869 400291 739258 517460 728906 557319 618808 543952 312335
16411 312335 751298 596053 480820 351763 602142 297053 480034 252540 292447 727841
16401G27841l20200J16994k50407J83403J42173j46285J02337j84851P3789o4122
16391C80672j24720K04736B01048n412J5544J03924K8143L42634A75814a52488
16380C66746j9253n258J17690I4102J22103N6500J85601n0582J71400k6954N7134
16369F09304A14596J23132A1763K92298C6104K73900j8937O1422j30464O9738
16359B91763J57357j01763N5445A75977L4068O15129k91121B04958p6806Q2608
16349B10760N0316q7890F286R1183D0183M88810B50699J97472A50553n298o6345
16338G8910H972N03228j45716P933r2351p5765N7552m8638a12183D25610B5195
16326B06497q5064D9940J95857f2792a2082B03322L30124A56843O1543H4703R761
$$ plain form
16401 727841 407641 524635 274228 457631 599804 453519 555856 371005 444794 380672
16391 380672 255952 460688 201048 195636 211180 315104 343247 685881 175814 -152488
16380 366746 347493 342235 459925 94102 216205 272705 458306 407724 579124 552170 609304
16369 609304 114596 237728 11763 304061 36104 310004 291067 352489 222025 291763
16359 291763 449120 347357 402802 175977 210045 825174 534053 204958 128152 210760
16349 210760 261076 173186 6286 97469 40183 528993 250699 448171 150553 145255 78910
16338 78910 8972 512200 366484 374417 282066 206301 263853 215215 -112183 425610 25195
16326 206497 121433 49940 245797 -62792 -12082 203322 533446 156843 218386 84703 94464
16315I4464c850H6171K39761r8658L5910P2540j36998a2349B56413H6381K26559
16304C12940q2393L95812B57678J44655j44910F5719J7824L1885K57737J04674
16294D77839k35710j5686L27312j53367A9285d2742R980D04265j64920J79399
16284D18744A46941R2128J09160a76523B92775E9563l563J72166a9435H2480g5777
16272G0359r176M656P8628J11910B5970L8649J87776C7673b6803l970m1576B32044
16259B69484L1672h4189a1294o861m4619B6267a1573A73574J18763j8363D9064
16247D19839e2810H3650a31793B84562j18398C7545J68941L8506M8331b12020
16236c9886p243a3962A65421D5457A4930a43893B78692a174C77430q6193m9744
$$ plain form
16315 94464 -3850 86171 325932 227274 263184 335724 198726 -12349 256413 86381 312940
16304 312940 230547 626359 257678 402333 257423 65719 83543 115428 373165 477839
16294 477839 242129 226443 553755 400388 19285 -42742 -32762 404265 239345 418744
16284 418744 146941 239069 348229 -176523 292775 59563 56000 228166 -19435 82480 -75777
16272 70359 61183 65839 144467 256377 25970 64619 252395 37673 -26803 -30773 -72349 232044
16259 269484 301156 -84189 -11294 -18155 -62774 26267 -11573 173574 292337 273974 49064
16247 419839 -52810 83650 -131793 284562 166164 37545 206486 244992 293323 -212020
16236 -39886 -47129 -13962 165421 45457 14930 -143893 278692 -1174 377430 291237 241493
16225B41493r1574h8677K8171D5781J9904K18911I8518J5794D7858J21552h7890
16213c841C69036j82083h6838k95702a34758e6609H5268J43696G3833a4828E800
16201B28985m5146b5795D3342b20598C6445J54223a54614g4957m4732j29465A23796
16189A93767I3971O3869a58260E47148F3646J49155a17331G4236J63773j5946
16179B22063d035B09312o5484Q7111l7165n9191f2276b500q2647E5667J55503
16168B11170I2689d8207b1350C00579e936D8825J42324F9388b12801B26567J09885
16157C36452j54326l483p5606a53976b5570j19321A25815a61679d9865j7792C82595
16145A01146b14447A63634a6774D4622d05731J17364A0072J89626M2139a3860
$$ plain form
16225 241493 149919 -88677 -60506 45781 65685 284596 98518 114312 47858 169410 -87890
16213 -3841 369036 186953 -86838 -382540 -134758 -56609 85268 228964 73833 -14828 5800
16201 228985 183839 -25795 43342 -220598 36445 190668 -154614 -74957 -119689 -249154 123796
16189 193767 93971 157840 -158260 547148 63646 212801 -117331 74236 238009 222063
16179 222063 -4035 209312 143828 230939 193774 134583 -62276 -2500 -85147 55667 211170
16168 211170 92689 -48207 -21350 300579 -5936 48825 191149 69388 -212801 226567 336452
16157 336452 182126 178643 103037 -153976 -25570 -144891 125815 -161679 -49865 -67657 382595
16145 101146 -214447 163634 -16774 44622 -405731 -288367 10072 199698 241837 -13860
16134A15770E6646J68149j05153g5393H0094g0497P270A21648c1911A26823a10331
16122a94716A92684a1571k85662c0966p2486E7103a24047p5950j53874A52876
16111A15335a01491H8978k5583J33705c2518j48231h7339I9324h0777o1619b6358
16099A73757p561d24833F8532K12038o4133b69911H4297n626L1220L0689f1097
16087A49388h5052D8014a35062L4950H912J5580a75003C7877G678L019L9321b2902
16074c1396A03654R3998n8286a93843H0034i3571I6268K60661H7a11492A02197
16062B5257J32608k8260b44451B06639f6119A93944F9343J07248g4174A38433
16051b24751n305A34070e8069A7177D173g4841A56666a67591A36387a60518L7441
$$ plain form
16134 115770 56646 224795 119642 -75393 80094 -70497 -63227 121648 -31911 126823 -110331
16122 -194716 192684 -11571 -297233 -30966 -103452 57103 -124047 -199997 -353871 152876
16111 115335 -101491 88978 63395 197100 -32518 -180749 -87339 99324 -80777 -142396 -26358
16099 173757 166196 -424833 68532 280570 216437 -269911 84297 78671 109891 140580 -61097
16087 149388 -85052 48014 -135062 -100112 8912 24492 -175003 37877 7678 10697 50018 -22902
16074 -31396 103654 197652 139366 -193843 80034 -93571 96268 356929 87 -111492 102197
16062 25257 157865 129605 -244451 206639 -66119 193944 69343 176591 -74174 138433
16051 -224751 -230056 134070 -58069 17177 4173 -74841 156666 -167591 136387 -160518 -123077
16040a23077q18j8180q6192G2688R9587D7649c76234A07895b07719e4594A90757
16028d5607j92828H1678M1627a86224D3531N7132J02192e5428B3523J01243d7841
16016a95368K7386a5745l03919e7764j33996f482j45502d6286j15566l30955i5170
16004b06808i6669H0108a07703j4325A64668b2499m8604G7690J05952b18215A65611
15992B90412h8910E1269a32924p2188E4422K8816a3056C29529a36470a8731A78730
15980D07746j06512K2493D5703M04386q5013G5268g0665A650M6358b5941o806
15969c2747j82977B8593d9557H5000B6843M2035a30336C2260b92379e005j0777
15958a5782l00216D1639K3920a65446k68602K16598R2760p7919o8093h9329B51114
$$ plain form
16040 -123077 -123895 -142075 -228267 72688 172275 47649 -376234 107895 -207719 -54594 190757
16028 -45607 -238435 81678 123305 -186224 43531 100663 202855 -55428 23523 124766 -47841
16016 -195368 -167982 -15745 -319664 -57764 -191760 -6482 -151984 -46286 -161852 -492807 -95170
16004 -206808 -96669 80108 -107703 -122028 164668 -22499 -71103 77690 183642 -218215 165611
15992 290412 -88910 51269 -132924 -205112 54422 83238 -13056 329529 -136470 -18731 178730
15980 407746 301234 323727 45703 450089 365076 75268 -70665 1650 48008 -25941 -32747
15969 -32747 -215724 28593 -49557 85000 26843 68878 -130336 32260 -292379 -5005 -15782
15958 -15782 -315998 41639 65559 -165446 -434048 -217450 -124690 -202609 -270702 -89329 251114
15946B08915f8044j11859N8497L6479q741j30527a02135A57108c82874a16713
15935H13b06364Q0044L4708A88030L6855a89090A19985A5508c27884A66448h4088
15923b7496j16380D0768a36915A67722c05841A78504H5392a49388C2684c0158
15912c03355J45679E6080a77105j34749Q6399B6985C078i4128l5321p1169b4908
15900a40853N7569j20291b1056j69896j05611B41332A01282h3016m0215C6245
15889D6918J3757i4485k2159N5080n0813M1620b8462B1239a72134H5338d4306
15877A70352a3290A52992d30311b09145E9787R965j8077a6376j41435N5992L6125
15866f5694o1640i991j64052J6991J7449G9581J57729a05699M6475a8806j981
$$ plain form
15946 208915 -68044 -179903 -121406 -84927 -93668 -224195 -102135 157108 -382874 -116713
15935 813 -206364 -126320 -91612 188030 224885 -189090 119985 15508 -327884 166448 -84088
15923 -27496 -143876 40768 -136915 167722 -305841 178504 85392 -149388 32684 -30158
15912 -303355 -157676 56080 -177105 -311854 -225455 26985 3078 -94128 -129449 -200618 -24908
15900 -140853 -83284 -203575 -21056 -190952 -296563 241332 101282 -83016 -123231 36245
15889 46918 60675 -94485 -116644 -61564 -112377 -70757 -28462 21239 -172134 85338 -44306
15877 170352 -13290 152992 -430311 -209145 59787 69752 51675 -16376 -157811 -101819 -65694
15866 -65694 -127334 -9991 -174043 -157052 -139603 79581 237310 -105699 -59224 -18806 -20787
15855b0787I9024A6597c8600m06380A46122c24133L1249i404D69693e1861j85858
15844b37719q1897J08616A54629F2605J2709J64479f8018l9705D3852c1240J4685
15833a6555K698j20393D1087Q9640d2710F4474A5245d3585a345j15831L2633a6124
15820A71477D0927J78796H6858a73554a8945j78516B12724G744a48657e2137j23644
15809a75781e6804B72676h1357A4304J471d49335A98874I624h960k2939A86446
15797b5485j59630A9778g6243j66001N0730F6008e2551B47043O1725G2629B9517
15785G2548g6228A44473a82990H0260a38526l7739c6990j12952C9153A1773f1153
15773b74770D4311a93964i0094A51286b71782R1722C10745b01547A19956b87754
$$ plain form
15855 -20787 99024 16597 -38600 -444980 146122 -324133 -292884 -9404 469693 -51861 -237719
15844 -237719 -319616 -211000 154629 62605 75314 239793 -68018 -107723 43852 -31240 -16555
15833 -16555 -13857 -134250 41087 130727 -42710 64474 15245 -43585 -1345 -117176 -84543 -16124
15820 171477 40927 219723 86858 -173554 -18945 -197461 212724 7744 -148657 -52137 -175781
15809 -175781 -56804 272676 -81357 14304 15775 -449335 198874 9624 -8960 -31899 186446
15797 -25485 -185115 19778 -76243 -242244 -191514 66008 -52551 247043 308768 72629 29517
15785 72548 -76228 144473 -182990 80260 -138526 -176265 -36990 -149942 39153 11773 -61153
15773 -274770 44311 -193964 -90094 151286 -271782 -180060 310745 -201547 119956 -287754
15762g2949A59524D1316h7284q912J0676n4397A73190F1548d7230A59051b67088
15750d9514l22284a60780P5595H2022K53095j59890m0923C8276c886I8128K01928
15739C00056g7358D2359h2959j05686g730c90j42242A5536a13306o5630i284l48080
15727c57364J10650j2772b7632m22107a15467A0716a00085G7309h0846B65637
15716A17175b9714A62133a37557M2653I6331a86188M2385A8308c70527a51267
15705F7683b7413j66100j6129O2463d4883C9501b11605E6586J43989G2033a84045
15693b09614d5630A76803l9072b28304A4656K67761G4753c32935A00713b66655
15682B36921b62893j44929A37545n1793b39281E78090g0720A33774c63913I5941
$$ plain form
15762 -72949 159524 41316 -87284 -96196 -85520 -139917 173190 61548 -47230 159051 -267088
15750 -49514 -371798 -160780 -85185 82022 335117 175227 134304 38276 -3886 98128 300056
15739 300056 -77358 42359 -82959 -188645 -7730 -390 -142632 15536 -113306 -178936 -9284 -357364
15727 -357364 -246714 -259486 -27632 -449739 -115467 10716 -100085 77309 -80846 265637
15716 117175 -29714 162133 -137557 -94904 96331 -186188 -143803 18308 -370527 -151267
15705 67683 -27413 -193513 -209642 -147179 -44883 39501 -211605 56586 200575 72033 -184045
15693 -209614 -45630 176803 137731 -228304 14656 282417 74753 -332935 100713 -266655
15682 236921 -262893 -407822 137545 85752 -239281 578090 -70720 133774 -363913 95941
15671i441E4632b7869A01777a46017I9042b33045G9754C6548b65354q8045F0218
15659b29949J00580A66384c34570k2216a02272J3413A80307c79260J61743f8098
15648f0195K8452H9852b65252g4556j69151K6174A82424p1590d3866D1540a73502
15636D9335b31282j92874E4137b41208p8060a56146j63290B94408i6368r3442
15626a89810B45352a25357d2625A40906a7023j08314a9689l2069B96083a03238
15615H5977a45039p5577R1955e5185r9296K346N0965E5607b23239i7323k21718
15604c19041M3157H4233b23927R4964a2972j73404j39508Q0549D6920Q3065D5369
15592a88494c47k03396f8716F5114a58160C52345g4507C8713a36168C41061c683
$$ plain form
15671 -9441 54632 -27869 101777 -146017 99042 -233045 79754 36548 -265354 -353399 60218
15659 -229949 -129369 166384 -334570 -356786 -102272 -88859 180307 -379260 -217517 -68098
15648 -60195 -31743 89852 -265252 -74556 -243707 -217533 182424 110834 -43866 41540 -173502
15636 49335 -231282 -424156 54137 -241208 -319268 -156146 -319436 294408 -96368 -189810
15626 -189810 245352 -125357 -42625 140906 -17023 -125337 -19689 -51758 296083 -103238
15615 85977 -145039 -220616 -128661 -55185 -154481 -152135 -101170 55607 -223239 -97323 -319041
15604 -319041 -275884 84233 -223927 -128963 -12972 -186376 -325884 -245335 46920 129985 45369
15592 -188494 -347 -203743 -68716 65114 -158160 352345 -74507 38713 -136168 341061 -3683
15580f4406j59266m37155a05886j28755q4446A13662a04700l3360A27851k3120
15570A04731A4125N5468b33931J06830g017n6074o0719E201b013C01168n1725
15559B49443A23762D9864b57487a23546A77863a07912d6821k29356E0147h7405
15548F8637d40920F9732b25689e6390C27125C1493a67024P4401j3915N0585B0596
15536b35138D16093c20977a42184M770N9449A51679b98668A04192J53708j0164
15526B47736C9753J19235e3041O306c789k48457Q4393o4870b4962k502C6999K50816
15514B87815A18026P7807a90328E55002D8815f5865l07538f9516A7196J86564
15504B03760N9052B6160b39952R5979A09322a13584A15558a03031I3000K54453
$$ plain form
15580 -64406 -223672 -660827 -105886 -234641 -319087 113662 -104700 -138060 127851 104731
15570 104731 14125 69593 -233931 -127101 -7017 -63091 -123810 5201 -2013 301168 249443
15559 249443 123762 49864 -257487 -123546 177863 -107912 -46821 -276177 50147 -87405
15548 68637 -440920 69732 -225689 -56390 327125 31493 -167024 -92623 -106538 -55953 20596
15536 -235138 416093 -320977 -142184 -137414 -77965 151679 -298668 104192 257900 247736
15526 247736 39753 158988 -53041 -46735 -3789 -252246 -167853 -232723 -24962 -27464 36999 287815
15514 287815 118026 195833 -190328 555002 48815 -65865 -373403 -69516 17196 203760
15504 203760 262812 26160 -239952 -143973 109322 -113584 115558 -103031 93000 347453
15494C47453I8633J4242A8258a57819A29651C9350J04265J65448h6319r9962h2285
15482C5711J22769F0917K12591c4661j76758j428A80371a45174A33179f9796j86050
15471b55846B8620i7309A2581O7132J93814j07480D8582J77333b887n441k51204
15460b59532d2605m8176C30100j07710b24168C2997J54056a53059J7182j7327
15450a53204j28775G6311b3369A77913B1983L4766a14882n9436I8705J28112N1068
15439B77885j24282I91K63583l4860a18756F556b63009C11031A35582a16555B35917
15427b21921o2500F8138a06301F042a43411B0442J2794c1976r3080A56229b3599
15415A24134N00037I7489f9498k8892c25A35309Q0088n4870f7763B16943l2484
$$ plain form
15494 347453 98633 112875 18258 -157819 129651 39350 143615 309063 -86319 -186281 -82285
15482 35711 158480 60917 273508 -34661 -211419 -212847 180371 -145174 133179 -69796 -255846
15471 -255846 28620 -97309 12581 79713 273527 166047 48582 225915 -2887 -8328 -259532
15460 -259532 -42605 -90781 330100 222390 -224168 32997 187053 -153059 -135877 -153204
15450 -153204 -281979 76311 -23369 177913 21983 56749 -114882 -174318 98705 226817 277885
15439 277885 153603 991 264574 229714 -118756 6556 -263009 311031 135582 -116555 235917
15427 -221921 -284421 68138 -106301 6042 -143411 20442 33236 -31976 -125056 156229 -23599
15415 124134 624171 97489 -69498 -98390 -325 135309 215397 160527 -67763 216943 184459
15404A84459b597A41026d7451j08703k742B10157I3044K64183A28668C6154J29311
15393A65465b2336k74789g7991c4345k2021C60971d7072j3409j93098g2786K4720
15382d8066F6198a14691I225a28061L8543A70267Q2349b07681J02345M2968A28868
15370D061a4167M113q9726B88492c4526A2477b83847F2353J9480B1245Q1976J66988
15358B70209E1632a55936M0910G5472J01743a28621B96325b4604B7234J09323
15348A36557J35837a73505C3467a96709j66096A50165a65329B78884c6660B27141
15337A44430o8051g442F3750e4210C8436J14879c88242J30701A67239i3934j39812
15326b33746d2244A8796J44916b00445D8970J01482m365J0846Q7156G1020J06787
$$ plain form
15404 184459 -2597 141026 -47451 -156154 -158896 210157 93044 357227 128668 36154 165465
15393 165465 -22336 -297125 -77991 -34345 -56366 360971 -47072 -60481 -253579 -72786 -48066
15382 -48066 66198 -114691 9225 -128061 -89518 170267 252616 -207681 -105336 -62368 128868
15370 4061 -14167 -10054 -99780 288492 -34526 12477 -283847 62353 81833 21245 103221 270209
15358 270209 51632 -155936 -115026 75472 177215 -128621 296325 -24604 27234 136557
15348 136557 272394 -173505 33467 -196709 -362805 150165 -165329 278884 -36660 227141
15337 144430 76379 -7442 63750 -54210 38436 153315 -388242 -257541 167239 -93934 -233746
15326 -233746 -42244 18796 163712 -200445 48970 150452 146087 156933 244089 71020 177807
15315A77807a11455L9656B63384F1280a37415C60197q4504d4040A22576J39745
15305B62321l0195h9754B53226n7239F4532d09457a0669J690A44229a92672L0034
15294a62638g4676C96566A41414a55867B71984b69624a5906C18570j13896a02863
15283B55652m3498C279a70783C11770A1142L58911G8670C702K77725A29f183n3881
15271f0064B0678i7997B5957d44536C07355C5227J10139L2412o6600K733R2693
15260B06604J44705C6988L53738F0671Q974C838J03555K07312j38101N408P05
15249A82717N0604a59264D53389N67833J186433K29860o90932M76960n94065B73842
15238d1623B22702b70984J07638F3840J68660K211a35239I483a65080H2265O504
$$ plain form
15315 177807 -111455 -71799 263384 61280 -137415 360197 275693 -44040 122576 262321
15305 262321 232126 -89754 253226 195987 64532 -409457 -10669 -8979 144229 -192672 -162638
15294 -162638 -74676 396566 141414 -155867 271984 -269624 -15906 318570 204674 -102863
15283 255652 212154 3279 -170783 311770 11142 370053 78670 3702 281427 129 -6183 -60064
15271 -60064 20678 -97997 25957 -444536 307355 35227 145366 177778 111178 113911 206604
15260 206604 351309 36988 390726 60671 69645 3838 107393 314705 176604 182012 182717
15249 182717 233321 -159264 453389 1021222 2207655 2437515 1746583 2223543 1629478 273842
15238 -41623 222702 -270984 -163346 63840 232500 234711 -135239 9483 -165080 82265 88769
15227H8769A4835J77959a17014j44113A56907e7649A41825d5653r8635j7660f3643
15215B2338F788M03838I141L99598g0288l29416B56937C5690b35530E9863J85783
15204B45646D6317L3238B3405b5808j7810E8408b38255A89675o7794o0479a40682
15192A55662b1150A13204c34043i1052B79223a84284B28156R4717a72066A86319
15181b0670r0576C00121n2996j04814E3604c01976B4293b17456A09470l9791J74398
15170B44077a92900l0328A27779J2957j0071a66760A74881J16763D7708P9221
15160A26929j6227J7730P890O2293E0734K04066b69064D23592A51398J64788F3383
15148h2968C5404L12088A7441M80716F8527M1980Q2721b10499K17A62428K2904
$$ plain form
15227 88769 14835 192794 -117014 -261127 156907 -57649 141825 -45653 -144288 -161948 -63643
15215 22338 6788 410626 9141 408739 -70288 -399704 256937 35690 -235530 59863 245646
15204 245646 46317 79555 23405 -25808 -43618 58408 -238255 189675 121881 61402 -140682
15192 155662 -21150 113204 -334043 -91052 279223 -184284 228156 322873 -172066 186319
15181 -20670 -111246 300121 247125 142311 53604 -301976 24293 -217456 109470 69679 244077
15170 244077 -192900 -223228 127779 140736 130665 -166760 174881 291644 47708 126929
15160 126929 110702 128432 136322 198615 50734 254800 -269064 423592 151398 316186 63383
15148 -82968 35404 347492 17441 498157 68527 110507 193228 -210499 -210282 162428 185332
15137A85332K46926A38066q858a3401D182a41915B84836c1577B65514B9869J01577
15126A31446K34752o5661a560F5525J89375R0773G245J1607L72327J86602D9828
15114B20349p8019f958B7765K29243j18804a91537C32613A04538h4893j2668A83631
15102d0885L499A43087O8389p5290n6788a12424k5003B22372n4973R6591G4509
15090A66229c6175D91709I5297J24282K74796A54726L72817F1238B3220J61921
15080A85141C3854k891L00188g3557q471D26547A47883M83539A53052M6748J62891
15069C62691G065K03084J20500H3779b242C20761q1997a88j47030A50925f1053
15057B87723r378A15084B6707i2620B13937b1470B91210I8322L76545G9887J15879
$$ plain form
15137 185332 432258 138066 129208 -13401 4182 -141915 284836 -31577 265514 29869 131446
15126 131446 366198 300537 -1560 65525 254900 345673 7245 18852 391179 577781 49828
15114 220349 142330 -6958 27765 257008 138204 -191537 332613 104538 -84893 -97561 183631
15102 -40885 -37386 143087 211476 136186 79398 -112424 -137427 222372 167399 263990 74509
15090 166229 -36175 491709 95297 219579 494375 154726 527543 61238 23220 185141
15080 185141 33854 30963 331151 -73557 -82028 426547 147883 631422 153052 199800 362691
15069 362691 7065 210149 330649 83779 -2242 320761 238764 -188 -147218 150925 -61053
15057 287723 278345 115084 26707 -92620 213937 -21470 291210 98322 474867 79887 195766
15046A95766J10316n3172r1773a5380A12159j810K25574E5097K29940p9258a7275
15034C58145J43551A10982K64424I1565C281J44121o3017L54262o3963A19304
15023d055D37912H4765g1564B34717a64737H2329Q0620e9524C09565r8253d825
15011C56171P4839B2871M04598f3958F08943A88008e3635C73816j36708f1999
15000B63791e1270B96810K22240n1754m6274P9286H0298N54603B67715O7472H4886
14988B20233L24088A42965i2393A02699N9418a157C34294h9530C74662j40363
14978B34299F0659H399O32368r7680B47635g6063C69754n4853j37132K26977A28426
14966A70935L0067k8556N196R9640N23787E687P3878N2558b9928C47802l3125
$$ plain form
15046 195766 306082 252910 161137 -15380 112159 110349 335923 55097 285037 205779 -17275
15034 358145 501696 110982 375406 91565 3281 147402 84385 438647 374684 119304
15023 -4055 437912 84765 -71564 234717 -164737 82329 162949 -59524 309565 211312 -4825
15011 356171 431010 22871 427469 -63958 608943 188008 -53635 373816 237108 -61999
15000 263791 -51270 296810 519050 467296 421022 500308 80298 634901 267715 335187 84886
14988 220233 544321 142965 -92393 102699 162117 -1157 334294 -89530 374662 234299
14978 234299 60659 8399 640767 543087 247635 -76063 369754 314901 177769 404746 128426
14966 170935 201002 172446 177642 277282 801069 5687 79565 132123 -29928 347802 314677
14955C14677l4217K6263d7457D16621j02841K58897j19334r0578A29096K37653
14945C66749n370l8176N2689j56759K19224j41400j44945J16348f133B77123B5808
14933D67412A36727K04838m8039A03699J97635G5228K8566Q3186J51946c26908
14922B40514J56242E5653J93561J74064A67567K7584k7702N44588l11791j80909
14912B19337L510Q7307J95866r125l9191k06913b31015C18909j43892K41019L35927
14901G51963b9520B43011J37702j36434J13551A40898K17119A67826j571L20000
14891D86255j75545J20390j7913K44327k83375r7031J09226A28782K24195L8097
14881C91074j57039K30840A83081K45714A03796K12643P6437H6427M10346j16924
$$ plain form
14955 314677 280460 306723 -47457 416621 313780 572677 453343 362765 129096 366749
14945 366749 361379 323203 375892 219133 438357 296957 152012 268360 -6133 277123 25808
14933 467412 136727 341565 293526 103699 301334 75228 103794 186980 338926 -326908
14922 240514 396756 55653 249214 423278 167567 195151 167449 712037 400246 219337
14912 219337 222847 310154 506020 496895 457704 250791 -231015 318909 175017 416036 751963
14901 751963 -29520 243011 380713 244279 357830 140898 358017 167826 166255 486255
14891 486255 310710 431100 413187 657514 374139 277108 386334 128782 352977 391074
14881 391074 234035 464875 183081 428795 103796 316439 392876 86427 496773 379849
14871C79849P3431B22847L1646L75364j54078j15982j6531K78068k16738C6849
14860B57311M5017P7853J12052j61874J42081J55552j36785M3342K2282B73589
14849B9086O03813A83347P07774k99485B82331L7716N3281K19666j21225B23033
14838F07974p5246M51271D70320J66427n3579Q1903j92228Q8040J50398k51226
14828D60055A01234M57445k13095j47586N28723j90503B63607J91656J58378j25139
14818D88502j77819L00885J00978j76582J09649j58937O0934k29339M0440L59254
14808G17965P9526C33603L58345r6155m2411K05767l15990J81972J5923J11191
14798G52245B99514L36176C11986K70586Q7864l7180k2642J29625r5530Q9077
$$ plain form
14871 379849 453280 222847 254493 629857 475779 359797 343266 621334 404596 36849
14860 257311 302328 380181 492233 330359 472440 627992 491207 534549 556831 273589
14849 29086 632899 183347 891121 591636 282331 320047 373328 592994 471769 223033
14838 607974 532728 983999 470320 636747 583168 665071 472843 560883 711281 460055
14828 460055 101234 558679 345584 197998 726721 536218 263607 455263 613641 488502
14818 488502 310683 611568 712546 535964 645613 486676 547610 318271 358711 717965
14808 717965 797491 333603 691948 595793 553382 759149 443159 625131 641054 752245
14798 752245 299514 635690 311986 582572 670436 633256 610614 740239 644709 733786
14788G33786j77922j27191q3114K01633j05335L9041K91113k19181l1034K31307
14778G53103N6288l03960J68742A72477L79397k17222M33969j24547J60696B14816
14767G75363k38354A68466M74428N584M5216j40377K57459o2476j73050M7674
14757F22924p8695J1283K21423j12356J85094j98977J21252K32062k20550m800
14747G78660j2207m8789L2798J72640j27521J7127k0951J981R8818n1709q5314
14736G55533P7740j16753L2661o1150L6844Q179J06996M7819j99130K22413j27543
14725G83609J97921D80100L5504M91407N350l0125m04044N9515r0082K99205l95014
14714D51816L26148K58956k05865P2102J45476o4658j49829Q1880r4699k42789
$$ plain form
14788 733786 555864 428673 345559 547192 441857 480898 772011 552830 521796 753103
14778 753103 809391 505431 674173 172477 551874 334652 768621 644074 804770 214816
14767 775363 537009 168466 642894 648478 693694 553317 810776 748300 575250 622924
14757 622924 544229 555512 776935 664579 849673 650696 771948 1004010 783460 778660
14747 778660 766453 717664 750462 923102 795581 812708 791757 793738 892556 840847 755533
14736 755533 833273 716520 749181 688031 724875 733054 840050 887869 688739 911152 783609
14725 783609 981530 480100 515604 1007011 1012361 982236 578192 637707 547625 846830 451816
14714 451816 777964 1036920 831055 903157 1048633 983975 834146 916026 821327 578538
14704E78538M54186J8371k11285J57775r9522Q6099o0284q0583L61381k57454
14694I47222j37224O0498L65744F05256P20482F35200L50428J04399K37705l97869
14684I29863J587J23973l2622k30628K33722P7161J21072m46346Q196K84347J13843
14673A184168m01000L4455J64687K97048l718k81962M3255k51062M67332l30177
14663I23026J69547R0487O3838l22817K11273K2892k00113J24358n1036k78647
14653G52808P08291j86435j63589J77327k34534L67466j11683q8677k44669j27410
14643H48895K44502J2247J55452n1396L0736J09301J19332l8367N2200k66860
14633A216042K44520j25191k17097p6880N68285o67419P76313m40146K96049k88724
$$ plain form
14704 578538 1032724 1051095 839810 997585 898063 984162 923878 843295 1204676 947222
14694 947222 809998 870496 1236240 605256 1325738 635200 985628 1090027 1327732 929863
14684 929863 931450 1055423 1022801 792173 1025895 1103056 1224128 777782 785978 1070325 1184168
14673 1184168 783168 817623 982310 1279358 1275640 993678 1036933 785871 1253203 923026
14663 923026 1092573 1183060 1246898 924081 1135354 1158246 958133 1082491 1031455 752808
14653 752808 1461099 1274664 1111075 1288402 1053868 1421334 1309651 1220974 976305 848895
14643 848895 1093397 1105644 1261096 1209700 1240436 1349737 1469069 1430702 1482902 1216042
14633 1216042 1460562 1335371 1118274 1041394 1609679 942260 1718573 1278427 1574476 1285752
14623A285752K04779J83395l71267R3073l14763K00302J77348K92089n7614L5585
14613A728679q1621P9213j4614J18588l63234K41707k51409K93799m1334j05344
14603A604430J14698j89574L98494j86044J4071k04818K7367R764L84630j54472
14593A818546J36730k36368J4901N9059K41208k03496M32332l60878K62941k58951
14583A906024n4771O0113L7201K53189j16948o63030P75427k84771J38291J55245
14573B205970j59044L90004k06697J45205j64780K50569j58848J48454J15732
14564B566565J84605m7418M30990j61335k28313k8395J93107Q82N07226J25813
14554C543727K32359L5683Q98392R35547P16004J917587N653059R981283J2215620
$$ plain form
14623 1285752 1490531 1673926 1302659 1395732 1080969 1281271 1458619 1750708 1693094 1728679
14613 1728679 1647058 1726271 1711657 1830245 1467011 1708718 1457309 1751108 1709774 1604430
14603 1604430 1719128 1529554 1928048 1742004 1756075 1551257 1578624 1588388 1973018 1818546
14593 1818546 1955276 1718908 1733809 1792868 2034076 1830580 2262912 1902034 2164975 1906024
14583 1906024 1851253 1911366 1948567 2201756 2084808 1421778 2197205 1912434 2050725 2205970
14573 2205970 2046926 2436930 2230233 2375438 2210658 2461227 2302379 2450833 2566565
14564 2566565 2751170 2703752 3134742 2973407 2745094 2716699 2909806 2910688 3417914 3543727
14554 3543727 3776086 3811769 4710161 5645708 6361712 8279299 13932358 23913641 36129261
14545C6129261L253609j8319098I356091k839796j23349J09396k515395j121651
14537B865296m53343j64156j07639J81130l19224N34924p642k31957J30556j82150
14527B245795j48669M69070m06868K58131J66K21485j45489k4860Q1476J08553
14517B658790O7097K8523j76927J13710J11560l876o5J2478L07101P8605l35207
14506B861789J78667M069l37961L10620K20203K79039m95445N80939q6219j89865
14496C325836P260L5631J7619L97562j48763l81335N45729m4539K5752p3581k04422
14485C502749M89073l23882M57063J98268j15327l5151j06302k7557k0473P9944
14475D098405l2290K43053o7368L34281j61628L5717J59094O9742J41232N8733
$$ plain form
14545 36129261 39382870 21063772 9356091 6516295 6392946 6502342 3986947 2865296
14537 2865296 2411953 2247797 2140158 2321288 2002064 2536988 2529346 2297389 2427945 2245795
14527 2245795 2097126 2566196 2159328 2417459 2417625 2639110 2493621 2468761 2550237 2658790
14517 2658790 2725887 2754410 2577483 2691193 2802753 2798877 2798812 2811290 3118391 3196996 2861789
14506 2861789 3040456 3044525 2706564 3017184 3237387 3516426 3020981 3601920 3515701 3325836
14496 3325836 3333096 3368727 3386346 3783908 3635145 3253810 3799539 3755000 3780752 3707171 3502749
14485 3502749 3991822 3667940 4125003 4323271 4207944 4172793 4066491 4038934 4018461 4098405
14475 4098405 4066115 4309168 4241800 4576081 4414453 4450170 4609264 4679006 4820238 4878971
14465D878971k31671L35631l56088o3169M07468k27916O58951j46071K31926j6221
14455E471811k43882L76311k2965N4698J1957q4456Q0069L01801r9782J25153
14445E970715J47076j76793K75319k3340m3773K92558J88036K67501j96216j5532
14435F685551j32485M57969N0263K200l8162L04045J56680J86861K01073k65530
14425G608465J71482J25683p5912M26208k30494L41049K0062L7833J23990M85849
14415I034215l25155K06050J60279m3090M45425N5770K25075J85096j25799M10553
14405A0228419K277M95841k55435K04831R9750N77244P1895J45897K43476k0140
14395A1794055j68863P44956P1425M20173k7168J1425N32543K17678K11971L3397
$$ plain form
14465 4878971 4647300 4982931 4626843 4563674 4971142 4743226 5402177 5256106 5488032 5471811
14455 5471811 5227929 5604240 5581275 5635973 5647930 5563474 5643543 5945344 5845562 5970715
14445 5970715 6117791 5940998 6216317 6192977 6149204 6441762 6629798 6897299 6701083 6685551
14435 6685551 6553066 7011035 7061298 7063498 7025336 7329381 7486061 7672922 7873995 7608465
14425 7608465 7779947 7905630 7829718 8255926 8025432 8366481 8386543 8424376 8548366 9034215
14415 9034215 8709060 8915110 9075389 9032299 9477724 9533494 9758569 9943665 9817866 10228419
14405 10228419 10230696 10726537 10471102 10675933 10775683 11352927 11424822 11570719 11814195 11794055
14395 11794055 11625192 12370148 12441573 12861746 12834578 12846003 13378546 13596224 13808195 13841592
14385A3841592J98522O59915L8868K22900O31416k6733K07472M91598L99211L72094
14375A7036855K96190K86825M47778j77231P71668M1083Q22808J65165O69717
14366B0360858J78112J66775P45382R3662O32612O47524N02659K26945O49316
14357B4203845N52091P20583K21128N59962J080834P09816P09055L02424Q00888
14348B9860626N34834J069777O31216Q69545R45544N38457J231466J218834R68233
14339C7868532P62369J106752Q81192J179388J204132J243207J591481J269974
14331D7107027J726094R78253J953031J372726J830252K020875J591784K163982
14323F0744024J599268K435637K313666K301819K552192K814433K307414L030327
$$ plain form
14385 13841592 14040114 14700029 14738897 14961797 15593213 15566480 15773952 16265550 16664761 17036855
14375 17036855 17333045 17619870 18067648 17890417 18662085 18703168 19525976 19691141 20360858
14366 20360858 20538970 20705745 21451127 21544789 22177401 22824925 23327584 23554529 24203845
14357 24203845 24755936 25476519 25697647 26257609 27338443 28048259 28757314 29059738 29860626
14348 29860626 30395460 31465237 32096453 32965998 33911542 34449999 35681465 36900299 37868532
14339 37868532 38630901 39737653 40618845 41798233 43002365 44245572 45837053 47107027
14331 47107027 48833121 49811374 51764405 53137131 54967383 56988258 58580042 60744024
14323 60744024 62343292 64778929 67092595 69394414 71946606 74761039 77068453 80098780
14315H0098780L179423L391186L281186L646413L689368L826503M332916M510323
14307A09956098M411326M856481N229757N220484N866041O465384O343994O649253
14299A54998818O998411Q081791P877211Q660328Q830092R942057R833153J0822431
14291B26044292J1136763J1164798J2218571J2782397J3028965J3563261J4159660
14284C14098707J4346070J4348691J4850497J4674761J4375790J4089039J3315541
14277D14099096J2903500J1610597J0744067Q631661N811684J071036l126326
14270D61745315m01129J212245j778230m353341o525629q615394j0438288j2206955
14262D18638594j3173199j4191995j4596281j4752771j5285259j5514258j4899996
$$ plain form
14315 80098780 83278203 86669389 89950575 93596988 97286356 101112859 105445775 109956098
14307 109956098 114367424 119223905 124453662 129674146 135540187 142005571 148349565 154998818
14299 154998818 161997229 170079020 177956231 186616559 195446651 205388708 215221861 226044292
14291 226044292 237181055 248345853 260564424 273346821 286375786 299939047 314098707
14284 314098707 328444777 342793468 357643965 372318726 386694516 400783555 414099096
14277 414099096 427002596 438613193 449357260 457988921 463800605 464871641 461745315
14270 461745315 461344186 462556431 460778201 456424860 449899231 441283837 430845549 418638594
14262 418638594 405465395 391273400 376677119 361924348 346639089 331124831 316224835
14255C16224835j4964321j4439407j4338195j2831341j1474679j1851547j1663258
14248B24662087j0965191j0401369r947816r037955q510576q336338q020223p378202
14240A52064417o717614o256535n904540n662656n606260n199785n281173m232429
14232A07203425m362364l581078m048660l871146l425550l508090l138899l326589
14224G7941049k476042k985724k257452k365477j905073k406077k133810k298776
14216E9112618j655952j913449j272307j826120j291976j820405j616552j583032
14208D6132825j134307n90161j355820j776610o96742j498960o46048j008567
14200C7425610p02267r94612r58389j426278o22466r85167o32770n73836j080049
$$ plain form
14255 316224835 301260514 286821107 272482912 259651571 248176892 236325345 224662087
14248 224662087 213696896 203295527 193347711 184309756 175799180 167462842 159442619 152064417
14240 152064417 145346803 139090268 133185728 127523072 121916812 116717027 111435854 107203425
14232 107203425 102841061 99259983 95211323 91340177 87914627 84406537 81267638 77941049
14224 77941049 75465007 72479283 70221831 67856354 65951281 63545204 61411394 59112618
14216 59112618 57456666 55543217 54270910 52444790 51152814 49332409 47715857 46132825
14208 46132825 44998518 44408357 43052537 41275927 40579185 39080225 38434177 37425610
14200 37425610 36723343 35728731 34770342 33344064 32721598 31736431 31103661 30529825 29449776
14191B9449776q73247o35971q60946n23011l76479p76371l23633o04303n31391
14182B3944424o55427j99593o28364p17811l19504l29930m13763m36274n12622
14173A9731136l32909m56420k81112k57158m77765k89995k83417o9409l70694
14164A6912257q09874P7214l71804P1886m93966l54380m74429l04351q7454M2365
14154A4207464m41353l33978k05621R8683l93615l43517q9109l99725R2130o22342
14144A1569017j81707O3244q7413j23088l74249L93433m28755l26942k32329j92776
14134A0078435p0798j63637o5512j58383j76068q4635J0904o05878J60700k56935
14124H668193L0746q4120J6845k45062n09718P16289k09832n38216K27488k99010
$$ plain form
14191 29449776 28576529 27940558 27079612 26556601 26180122 25403751 25080118 24475815 23944424
14182 23944424 23288997 23089404 22461040 21743229 21423725 21093795 20680032 20243758 19731136
14173 19731136 19398227 18941807 18660695 18403537 17925772 17635777 17352360 17282951 16912257
14164 16912257 16102383 16179597 15807793 15879679 15385713 15031333 14556904 14252553 14165099 14207464
14154 14207464 13766111 13432133 13226512 13325195 12931580 12588063 12498954 12099229 12191359 11569017
14144 11569017 11387310 11450554 11363141 11240053 10865804 11259237 10830482 10503540 10271211 10078435
14134 10078435 10007637 9844000 9778488 9620105 9444037 9359402 9370306 8764428 8925128 8668193
14124 8668193 8698939 8614819 8631664 8386602 7876884 8593173 8383341 7845125 8072613 7773603
14114G773603k3769q8876j67044j53173m3442K58119k70117l32145J58673l07160
14104F804669P4354l81120N18108m17990K10063q6680k40228k86452j69373J93289
14094F218640k57876N35167r20421K55729k37473R5745q4279k99081L77579j13101
14084E570629m95062J98036P5007m0428j18592J56985m25764J51548j78297L7042
14074D931104l6597o4467j68373N3033j6388J89217k98509j21556L9950n9793
14064D447621q0752L1948k40695L9130m3118j61873J06567k28786k9456J60898
14054D001484J8180j19915j70927J65952j60581K17660k39311p2478j9714r7096
14044C523254K27404j78963o2086k39275J52468K30113J8011k61053K82m18696
$$ plain form
14114 7773603 7749834 7660958 7493914 7340741 7297299 7555418 7285301 6953156 7111829 6804669
14104 6804669 6879023 6497903 7016011 6598021 6808084 6721404 6481176 6194724 6025351 6218640
14094 6218640 5960764 6495931 5575510 5831239 5593766 5689511 5605232 5306151 5683730 5570629
14084 5570629 5075567 5273603 5348610 5308182 5189590 5346575 4920811 5072359 4894062 4931104
14074 4931104 4894507 4830040 4661667 4714700 4698312 4887529 4589020 4467464 4507414 4447621
14064 4447621 4366869 4398817 4158122 4197252 4154134 3992261 4098828 3870042 3840586 4001484
14054 4001484 4019664 3899749 3728822 3894774 3734193 3951853 3712542 3640064 3620350 3523254
14044 3523254 3750658 3571695 3509609 3270334 3422802 3652915 3670926 3409873 3410155 2991459
14034B991459M08663l50136K43482J49821j31602k40984J76327K70663l83547
14025C134146j06375K60100n31571r8316K29718J19874m58237j53124L43437l9491
14015B700161m32767L12686J02467m08415P19703l90078p6558J93315l03545m9588
14005B367381m688N1096J76112j30471l7186K25951m31270p5698O5465N5970l24379
13994A938283M59257K45367j33791M78690L34144J236404L829392R229087J3578553
13985C1195386R472824j3799979j2627391n504244k155725j310085j095102k91801
13977C883883l43214n35471M9234J04999k30146l76102J41241L6585K179J26011
13967B859199j42670k92007K29668l46172m039K12576o6496k00236K06841j53444
$$ plain form
14034 2991459 3400122 3049986 3293468 3443289 3311687 3070703 3247030 3517693 3134146
14025 3134146 3027771 3287871 2756300 2657984 2887702 3007576 2549339 2396215 2739652 2700161
14015 2700161 2267394 2580080 2682547 2274132 2993835 2603757 2527199 2720514 2416969 2367381
14005 2367381 2362693 2413789 2589901 2459430 2422244 2648195 2216925 2141227 2206692 2262662 1938283
13994 1938283 2397540 2642907 2509116 2987806 3321950 4558354 8387746 17616833 31195386
13985 31195386 40668210 26868231 14240840 8736596 6580871 5270786 4175684 3883883
13977 3883883 3540669 3005198 3054432 3159431 2929285 2553183 2694424 2731009 2733188 2859199
13967 2859199 2716529 2424522 2654190 2308018 2303979 2516555 2450059 2249823 2456664 2303220
13957B303220L04340l54478j15931j21315J47228k6273j46247J71662K07748k82516
13947B087438P174M2884O4294m77144L22280j79352q8648M70604j61611j18145
13937A969774k94472J08271J3351L19020j41259j38590j91463K60991j66433k43853
13927A495337L55805m58841K01866J52330j35506j38114J95670n6203Q1062J95246
13917A888652k80642J17482l68023K66945L7875j40655P6299n5489j45602L76392
13907A773234j40887j82146m2658K16119j79914K8255L1066J58941M7702m7138
13897A662574l72794J84634j21518j8745L07085o0183j50475J71816j80015k45768
13887A176611P4646J50976k12475J16985o9737J06503K43091k10696k77993M7664
$$ plain form
13957 2303220 2607560 2253082 2137151 2015836 2163064 2136791 1990544 2162206 2369954 2087438
13947 2087438 2094612 2137496 2201790 1724646 2046926 1867574 1778926 2249530 2087919 1969774
13937 1969774 1675302 1783573 1796924 2115944 1974685 1836095 1644632 1905623 1739190 1495337
13927 1495337 1851142 1392301 1594167 1746497 1610991 1472877 1668547 1612344 1693406 1888652
13917 1888652 1608010 1725492 1357469 1624414 1662289 1521634 1597933 1542444 1396842 1773234
13907 1773234 1632347 1450201 1407543 1623662 1443748 1472003 1503069 1662010 1709712 1662574
13897 1662574 1289780 1474414 1352896 1334151 1641236 1581053 1430578 1602394 1422379 1176611
13887 1176611 1251257 1402233 1189758 1306743 1237006 1343509 1586600 1375904 1097911 1145575
13877A145575J4536K2028J11734Q5748k20993P711K55547J98934n03499J93917
13867A311238R3258j08857j00544j52098K93956k56037j07956M46224m22800L36720
13857A333104k51459J27485l6634j44050L49137m57972N0717J48511K27690j67969
13847A178560r9814R9908l29053j27578J84222L87493l91519J91510j26321L6178
13837A003586O3394L37067l95980J41541l16269J37263k84572K97450K28K32547
13827A216255N9370m39704L1605J13704K6288q7412p6366k17331K94370K9905
13817I50684m4083J98332r6808j96195r2162N9634J05986L8553J63454j29113
13807I58282K45118m48698J57001K116j92638K38874j61278J44749j17169J31164
$$ plain form
13877 1145575 1160111 1182139 1293873 1379621 1158628 1166339 1421886 1620820 1117321 1311238
13867 1311238 1404496 1295639 1195095 1042997 1336953 1080916 972960 1419184 996384 1333104
13857 1333104 1081645 1209130 1172496 1028446 1377583 919611 970328 1118839 1346529 1178560
13847 1178560 1078746 1178654 849601 722023 906245 1293738 902219 1093729 967408 1003586
13837 1003586 1066980 1404047 1008067 1149608 833339 970602 686030 983480 983708 1216255
13827 1216255 1275625 835921 867526 981230 1007518 920106 843740 626409 920779 950684
13817 950684 906601 1104933 1008125 811930 719768 779402 885388 923941 1087395 958282
13807 958282 1203400 754702 911703 913819 721181 960055 798777 943526 826357 957521
13797I57521k0926p4866Q0124l9621j3759K56624k19384J3831N0367l4281j90303
13786G65327r6415N7940J46078p8168k38101K12201J00515m02626L31235k9152
13776G68834k2835j7949N835L40678r8947j94405O3657m943J4647K76j57886J09977
13764H06939L7739l28761M0142m0671o202K69290r6775J95040k14359r5840K35351
13753H01893K53218l58887j1812l7224K980K34780k12282j54237j26071L80091
13743G72449k53524K31691k3633j47212B68037N83455D00084K00490L7710j36349
13733E01935K23496k52322L7682K12254j84798r2029L26542k75556L61472k26539
13723F32137l0373J10018j2188P7266k01445M51754E06904k2674J88520k06811
$$ plain form
13797 957521 936595 861729 941853 902232 888473 1145097 925713 939544 989911 955630 765327
13786 765327 668912 726852 872930 794762 556661 768862 869377 466751 797986 768834
13776 768834 745999 728050 733885 1074563 975616 781211 844868 839925 854572 854848 696962 806939
13764 806939 844678 515917 556059 515388 509186 778476 681701 876741 662382 566542 801893
13753 801893 1055111 696224 684412 647188 650168 884948 672666 518429 392358 772449
13743 772449 518925 750616 726983 579771 268037 851492 400084 600574 638284 501935
13733 501935 725431 473109 510791 723045 538247 446218 772760 497204 858676 632137
13723 632137 601764 711782 699594 776860 575415 1027169 506904 484230 672750 465939
13713D65939k5098L15234m6837j1263j26104R0638k27265M50601m13551j10022
13703C62272M14400N1082l73453J26148K55898l56988J91281k30214J1371K7805
13693D79602J43826k16993l7231K85877n8373n7019J26318k35151o2464N0823
13683D19215K02602j81387L63261J73305C96021K71168k11032M8591P861J86811
13673F99420o050l10279K58852m1213j50442J36132K96473l55935A31687M71949
13663F03636K7853n2550n2953J90383k10918j8482j05089J49401J6784m0345k03739
13652C03981P0448O9580L5350j12558R7685j20335j4302j03132J09229K86720
13642F22666j34635l2036K43561j37669q0771j99561O2146a31121I7262M72817
$$ plain form
13713 465939 440841 756075 709238 697975 571871 662509 435244 885845 472294 362272
13703 362272 776672 827754 454301 580449 836347 479359 670640 440426 451797 479602
13693 479602 623428 406435 369204 655081 596708 539689 666007 430856 368392 419215
13683 419215 621817 440430 803691 976996 396021 667189 456157 504748 512609 699420
13673 699420 693370 383091 641943 600730 450288 586420 882893 526958 131687 603636
13663 603636 631489 578939 525986 716369 505451 486969 381880 531281 548065 507720 303981
13652 303981 374429 444009 479359 366801 464486 344151 329849 226717 335946 622666
13642 622666 488031 455995 699556 561887 481116 281555 343701 -131121 97262 570079
13632E70079K3486j39014p322K44279k41580k08437o5848L46278k8135K58824
13622G52610p4137H8237K92750j41843J78630P768p9151J99384k48718J59996
13612D57053B24541K89583K7181j37776L64183l66455P0433q8300J19083B20212
13601F10917j54484E4306K98891K1820J63348k42419j30645J74929j55972J60044
13591C44302p0542R4802j60820K03456j88677J89499j66291K69657B13239M63264
13581F76503j44450j80013L2424J41717j06071K26093r3776D3250L7270L94341
13571D74861m9424J17003j28413j5051L3398j93644J74229A36840A3130J37923
13561A51053K05085n6081A09513L11315O1694q2810J04364N6240M4651j85310
$$ plain form
13632 570079 593565 454551 447229 691508 449928 241491 175643 521921 493786 752610
13622 752610 678473 88237 380987 239144 417774 425542 346391 545775 297057 457053
13612 457053 224541 514124 541305 403529 767712 401257 471690 383390 502473 220212
13601 610917 456433 54306 353197 375017 538365 295946 165301 340230 184258 344302
13591 344302 273760 368562 207742 411198 222521 412020 245729 515386 213239 676503
13581 676503 532053 352040 384464 526181 420110 646203 552427 43250 80520 474861
13571 474861 425437 542440 414027 398976 432374 238730 412959 136840 13130 151053
13561 151053 356138 300057 109513 420828 482522 399712 504076 560316 604967 419657
13551D19657K05175l06280J38786K20568k96487F1061K64713J33228J162J49598
13541F09762j35083k05740k0101k2484l9402J79079j704k0278j65755J41190K46525
13530E66009O1223k82443j3975L34q8906G0432e3100E20307k47597L68232k46442
13519C94500i5779E81386j791k28014J79288B54930Q2685H3697L40046B02417
13508D76240m9239j55269N6560I9129L93607C0119L02845R3796B12123j1455J90440
13497C91108A21432k3248P4197K24746j49945J14655i4122B67659K63457a3370
13486C31879j05855J40897B5317L8098L73197A19462Q9817J1132J27040A2663
13475A90893J75490A40695J44497P2801R6058j64717K3987J50096p8943r2752
$$ plain form
13551 419657 624832 318552 457338 677906 381419 61061 325774 459002 460164 609762
13541 609762 474679 268939 248838 226354 186952 366031 364327 344049 178294 319484 566009
13530 566009 627232 344789 330814 331148 242242 70432 -53100 520307 272710 640942 394500
13519 394500 -95779 581386 579595 351581 530869 254930 337615 83697 423743 202417
13508 476240 427001 271732 328292 99129 492736 30119 332964 426760 212123 200668 391108
13497 391108 121432 98184 172381 397127 247182 361837 -94122 267659 531116 -13370
13486 331879 226024 366921 25317 63415 436612 119462 209279 220411 347451 12663
13475 190893 366383 140695 285192 357993 454051 289334 313321 463417 384474 291722
13465B91722A35642k743K26090l656j23846J37996J22973j08888j37676P6324
13455C22216b955C09031j6477j4584J64767k695A55135K30142J89387A94591k061
13444A92530m3726K09392H3176J70727L15199B11803J21929d5440D09155O1552
13434D70707j35587F1419J1233Q0126J49605J68337p487p5180j6924c8081I1632
13422B40733j3709c6757B82388a72460H3362j2598J64063A10543E205K88343A22910
13410C80630a269H4498L35383f7150C05737r0045p6130K27620L4126l5073a30848
13398A98415j1925r005J22810r140b1920D49557A27123J56252J23252J23058A20784
13386C71461j58411p5194Q4004A6257N8407b940D51988A26740M39935k31099c065
$$ plain form
13465 291722 135642 132899 358989 355333 231487 369483 492456 383568 245892 322216
13455 322216 -2955 309031 292554 277970 442737 440042 155135 385277 574664 194591 192530
13444 192530 148804 358196 83176 253903 569102 211803 333732 -45440 409155 470707
13434 470707 335120 61419 72652 152778 302383 470720 463233 388053 371129 -38081 91632
13422 240733 227024 -36757 282388 -172460 83362 70764 234827 110543 5205 293548 122910
13410 380630 -1269 84498 419881 -67150 305737 215692 139562 367182 401308 366235 -130848
13398 198415 186490 177485 300295 291155 -21920 449557 127123 283375 406627 529685 120784
13386 371461 213050 137856 221860 16257 74664 -2940 451988 126740 566675 335576 -3065
13374A16940K61755d9523A29864o3609J81124e0763A79324J11623p4678P7550
13364B93819i5298B25817J01106F7449L18580j0658j04656j32479k4590K80494
13354C94140J813o0354j03234J19231O2448O1003b4610E62004B15830J683J90633
13343D08146j06947J90308i6950B35815I9480J70245J5953q1357G4072d2416A98777
13331C68501B2883L7623N0453J68935Q667e9835B9815K24768P869J07374j53549
13320B16277L1003J22311a36310C74545A28295J35518p2572J65754L0313A69980
13309C25174L3976K1487A04971P3440J25476j18781A3053K2693K78732K5724b1875
13297C06024j17029J14469o9317J73486o2691C7872J04489E926M223d2479A43383
$$ plain form
13374 116940 378695 -49523 129864 66255 247379 -50763 179324 290947 216269 293819
13364 293819 -95298 225817 326923 67449 386029 375371 270715 138236 113646 394140
13354 394140 395953 335599 232365 351596 414044 475047 -24610 562004 215830 217513 408146
13343 408146 301199 491507 -96950 235815 99480 269725 285678 204321 74072 -42416 198777
13331 368501 22883 60506 110959 279894 288561 -59835 29815 254583 262452 369826 216277
13320 216277 247280 369591 -136310 374545 128295 263813 191241 356995 387308 169980
13309 325174 359150 380637 104971 178411 303887 185106 13053 35746 314478 340202 -21875
13297 306024 188995 303464 234147 407633 344942 37872 142361 5926 10149 -42479 143383
13285b7871F3967M40013A88249o451J14801A24060m4998c1148B46476a68416B08136
13273F9641J00073M9765D9711J70171a50329B59147b9676B72707B8103L50826
13263C78929c06170A73454B8871M36176A40924a52193B26138A6706L07605j08419
13253B15892r3939L5001a73921B23928j1362N8549m5223G3493J89698L1543g7270
13241F0220b038G5209L74907j91827q4768B1066c9703j42800B45459C4559K91470
13230C26029j44899D258J11383E6578a19294b3401I8645J82877C2371L32141I9014
13218A20542I357j161K00087J18079A10628l9168b24820c7598A79628F487K72628
13207B79115a91931j75906A25443I225J40174K16073m594A31113l3797K63920
$$ plain form
13285 -27871 63967 503980 188249 181798 296599 124060 79062 -31148 246476 -168416 208136
13273 69641 169714 219479 49711 219882 -150329 259147 -29676 272707 28103 378929
13263 378929 -306170 173454 28871 465047 140924 -152193 226138 16706 324311 215892
13253 215892 121953 156954 -173921 223928 212566 271115 225892 73493 263191 294734 -77270
13241 60220 -2038 75209 450116 258289 173521 21066 -39703 -182503 245459 34559 326029
13230 326029 181130 4258 115641 56578 -119294 -23401 98645 281522 32371 364512 99014
13218 120542 9357 8196 208283 326362 110628 71460 -224820 -37598 179628 6487 279115
13207 279115 -191931 -367837 125443 9225 149399 365472 360878 131113 97316 361236
13197C61236f3423B72074f1515J3766C47373r0598i1862D8995K52637J93826A15536
13185D932J51272J59043o3487a52162G4034a33935C50552j55891a10722A247K49331
13174B50578r6674b00994e1033F4929J46238K04532f1355H3621M11140A26048
13163h3612q3915F4873a68341A38845d8421A19139D673J59423Q4233a35887A15119
13151f8277A18509L13485e810B95601g1502A67736f3122D48371a8593C16121A10181
13139A65223o4750P8825j547m8997J02288c3764G8021e3574m8250D4016K39899
13128B83915c8036A95659J37559B2719N4260L14940d326A61672h7448B97540c53330
13116A78980a72328K7831C32532l1291G7615K02307j4723g5570J7186E05532r0581
$$ plain form
13197 361236 -63423 272074 -61515 -47749 347373 256775 -91862 48995 301632 495458 115536
13185 4932 156204 315247 251760 -152162 74034 -133935 350552 194661 -110722 1247 250578
13174 250578 153904 -200994 -51033 64929 211167 415699 -61355 83621 494761 126048
13163 -83612 -167527 64873 -168341 138845 -48421 119139 4673 164096 248329 -135887 115119
13151 -68277 118509 431994 -5810 295601 -71502 167736 -63122 448371 -18593 316121 110181
13139 165223 100473 179298 177751 128754 231042 -33764 78021 -53574 -101824 44016 283915
13128 283915 -38036 195659 333218 22719 76979 391919 -4326 161672 -87448 297540 -353330
13116 178980 -172328 -144497 332532 301241 77615 279922 265199 -75570 -58384 505532 414951
13105D14951j80074d2347q3102C5065J69846a51006A48682L03245a6396j47204
13095a63600I9645a58554A15081a97199C74963A37398a03784l7818D21583k7694
13085C93889j82309H8859J90578a5138l7577a2641B5645J54019J76692B6478K64942
13074B91420M1951D7407a22605G7106K48876r8108E72Q7386J45525e8741A02316
13062B32956A02023b3817A49664J066l9707C7519O0468a7929A4626M0097K37374
13051B92097A36841J50763j15595n1923c06351D64120I4936K9052c9434B510J79839
13040A82349F7634Q0758g1025A66662a61265C0063J28293K79302D3161A9996b1363
13028B68447c7925B35812A16272a25715A11192b13579b4716A8020N18186j61925
$$ plain form
13105 414951 234877 -42347 -125449 35065 204911 -151006 148682 451927 -16396 -163600
13095 -163600 99645 -158554 115081 -197199 374963 137398 -103784 -141602 421583 393889
13085 393889 211580 88859 279437 -15138 -52715 -12641 25645 179664 356356 26478 291420
13074 291420 333371 47407 -122605 77106 325982 227874 572 87958 233483 -58741 102316
13062 232956 102023 -23817 149664 150730 111023 37519 97987 -17929 14626 54723 292097
13051 292097 136841 287604 172009 120086 -306351 464120 94936 123988 -39434 2510 182349
13040 182349 67634 148392 -71025 166662 -161265 30063 158356 437658 43161 19996 -21363
13028 268447 -37925 235812 116272 -125715 111192 -213579 -24716 18020 536206 374281
13018C74281A18136e2357o4902C60174D7864b17369C06262l7085A01671P2891
13008A74562D9797L34870o5529F197L1101N6211J42590b30626H7458c2372B53949
12996D39246n0461p2321a31552L8333A48559A7613J61610K25304d3856A71749
12985D29182a89361A46368o9462a33595E8866J44532d8354E9565J71445b9135
12974f5284k7981o3397F5388o380K83562F3820e7367k46313C8948J21190a39074
12962i0585n2980j26284B54041A15430a47632C68350j11709L9122q4782r3616
12952A17365a08096D1061b07412A40440J96588C8910K9323J47551D9407c01784
12941D26218A85586B0574N3711K8969l6028B8446N2915K95852A13037J41360b24680
$$ plain form
13018 374281 118136 -52357 -117259 360174 47864 -217369 306262 269177 101671 174562
13008 174562 49797 384667 319138 6197 37298 93509 236099 -230626 87458 -32372 253949
12996 439246 388785 316464 -131552 -93219 148559 17613 179223 404527 -43856 171749
12985 429182 -189361 146368 76906 -133595 58866 203398 -48354 59565 231010 -29135
12974 -65284 -93265 -156662 65388 59008 342570 63820 -57367 -303680 38948 160138 -139074
12962 -90585 -143565 -269849 254041 115430 -147632 368350 256641 295763 210981 117365
12952 117365 -108096 41061 -207412 140440 337028 38910 68233 215784 49407 -301784
12941 426218 185586 20574 74285 103254 67226 28446 81361 377213 113037 254397 -224680
12929b76134C27932J3144f3036j4562a1538j37641f0864D3606b75497A68912d2887
12917b7287k7514h111F7516B7845J2448P7218K63928a9035C37287f1198n5297
12906a16495N981A14159m8092b29611E17959F0339K507Q0431e3318A54736C3173
12894B09449j7596o3804I236J33797a59931B89373A43191c80275a51143B70352
12883A9277L9477g180p747o2301B73850b70424g2117A39182f6074B74858J4984
12872B89842j37740m4172a16037B7764a99199C91105E2304b5826C27750j00008
12862B27742K47603b2342A59059g1925B04917I8211a63621A81607F1554J20848
12852A82402K98154i8674C63278D922e0250A98335R4184a01057A05832a54174
$$ plain form
12929 -276134 327932 341076 -63036 -77598 -11538 -149179 -60864 43606 -275497 168912 -42887
12917 -27287 -54801 -8111 67516 27845 40293 117511 381439 -19035 337287 -61198 -116495
12906 -116495 -110514 114159 66067 -229611 517959 60339 62846 143277 -53318 154736 33173
12894 209449 191853 128049 9236 143033 -159931 289373 143191 -380275 -151143 270352
12883 19277 58754 -7180 -14927 -77228 273850 -270424 -72117 139182 -66074 274858 289842
12872 289842 152102 107930 -116037 27764 -199199 391105 52304 -25826 327750 227742
12862 227742 475345 -22342 159059 -71925 204917 98211 -163621 181607 61554 182402
12852 182402 480556 -98674 363278 4922 -50250 198335 292519 -101057 105832 -154174
12841e4566j38927B60251G7861g7649m0329l878b185A66615o9691g8808C70991
12829A58256l5985m5101a36206H5165a90741B40392b58682A35587D849J30218
12819A35067a25936A02810e5177B69242a32207o4179C35700a98294c0948n9694
12809i0642A51837a99277d0344B32926b2435I9643b11273B16278B7484b22432
12798a85729p7475i815j72666b7340C6489h6980k26946F6330J49972J00023A29518
12786D14951c2804A32486k3525a70902a2657N880B64001i1915A26027b2651B2666
12774H5837a58385j36647I9942a68450b1828k0991j36742H6783a85935G5550a94479
12762I9047K9406b30194b9792l3782j6672L4043A34256J37808a12315j04857B8110
$$ plain form
12841 -54566 -193493 260251 77861 -77649 -117978 -121856 -2185 166615 96924 -78808 370991
12829 158256 122271 77170 -136206 85165 -190741 240392 -258682 135587 4849 135067
12819 135067 -125936 102810 -55177 269242 -132207 -196386 335700 -198294 -30948 -90642
12809 -90642 151837 -199277 -40344 232926 -22435 99643 -211273 216278 27484 -222432
12798 -185729 -263204 -9815 -182481 -27340 36489 -86980 -313926 66330 216302 316325 129518
12786 414951 -32804 132486 108961 -170902 -12657 -6777 264001 -91915 126027 -22651 22666
12774 85837 -158385 -295032 99942 -168450 -21828 -42819 -179561 86783 -185935 75550 -194479
12762 99047 128453 -230194 -29792 -63574 -80246 -46203 134256 272064 -112315 -217172 28110
12750A51540J9318J58859a65453j63917B5049N5465Q8339h4574j02987A23286
12739B05383J32220H8127i589H1885J10997F9845a37883e6913A04776h9679j73861
12728b63540h7653H4383h5491J0240j44284R8675b1034j18990E8294B5393b7198
12716G8648a83678A04572J57460j19753b11091C02007h0103K4353A83346m0537
12706A42809K2337e4162B14575J82957A58384j8782f5791B79583r4339F9918j1900
12695E8018O0146f1680A98415Q8716o9609D9518b92685I0711a57837A07515e165
12683A08499a78065L4462A03461L8341b16932C09601G1028K35471r9434K542L5320
12672B44927M7855J14310I3557a45242B25280a0848A26640p120P3050k7681A4769
$$ plain form
12750 151540 170858 329717 -165453 -329370 25049 80514 168853 -84574 -187561 123286
12739 205383 337603 88127 -9589 81885 192882 69845 -137883 -56913 104776 -89679 -263540
12728 -263540 -87653 84383 -85491 -75251 -219535 -120860 -21034 -140024 58294 25393 -27198
12716 78648 -183678 104572 262032 142279 -211091 302007 -80103 -55750 183346 142809
12706 142809 165146 -54162 214575 397532 158384 139602 -65791 279583 185244 69918 58018
12695 58018 118164 -61680 198415 287131 217522 49518 -292685 90711 -157837 107515 -5165
12683 108499 -178065 -143603 103461 141802 -216932 309601 71028 306499 207065 209607 244927
12672 244927 292782 407092 93557 -145242 225280 -10848 126640 119520 192570 164889 14769
12660a56652F9916J04267c5316A26332j6818J24089J46510j14965c9032j60171
12650a99203C60505j26552P0365j25074J62790j59873E9717k6302K18969r6665
12640A55719J22915C9821i4255d2928J2303A41650M4388b8428E1171P7312P7735
12629B06218j0943N3350A00688J32059j0023d9044j01147A34549J89831O961j27741
12618B03600j00850J11716I8484g7058M825D7625j4541K43642K2252i8048L4764
12607f3284A84148d5451C14511D9560J34124H5156e2652A99235n3480J23293J71833
12596D40881G6416d6486A90426b0218A87239g7576A74314L2388A02461b09218
12585A36998a06015B73657I1406O9608D5917l988j1666J01328R7447B9496K94174
$$ plain form
12660 -156652 69916 174183 -35316 126332 109514 233603 380113 265148 -39032 -199203
12650 -199203 360505 233953 304318 179244 342034 182161 59717 33415 252384 155719
12640 155719 278634 39821 -94255 -42928 -30625 141650 186038 -28428 51171 128483 206218
12629 206218 195275 248625 100688 232747 222724 -49044 -150191 134549 324380 331341 203600
12618 203600 102750 214466 98484 -77058 -72233 47625 33084 276726 298978 -98048 -63284
12607 -63284 184148 -45451 314511 49560 183684 85156 -52652 199235 145755 269048 440881
12596 440881 76416 -46486 190426 -20218 187239 -77576 174314 206702 102461 -209218
12585 136998 -106015 273657 91406 161014 45917 41929 30263 131591 229038 29496 323670
12574C23670j01770l0146b01185q1832A40713a3636I5294b58994i364n8320c3834
12562A49090f5408A55878n3291R4330c0770q4067F4542b70686C7237c7160F3562
12550c83527J75678G5362J30032k0644h8125A76797L9135P4596A9904i0882B23107
12538F4370a20781A64863h0122B45375r6870b00685A66228a03543A3707a99420
12527A06872m0888K8391K28985j00766b28001J11694J642C33490j39592a09697
12516C09206p2367b3422A64598k9624n961K74437g4498A22211K4063c26348d3030
12504b55628A90537q9495i5003I1269C8786P8231J35667g8474k36932G3161k6772
12493D6389i1260o2172A36329Q953j3853O973B3331L34761A39448O3927b4021
$$ plain form
12574 323670 221900 191754 -201185 -283017 140713 -13636 95294 -258994 -9364 -67684 -33834
12562 149090 -65408 155878 102587 196917 -30770 -114837 64542 -270686 37237 -37160 63562
12550 -383527 -207849 75362 205394 184750 -88125 176797 215932 290528 19904 -90882 223107
12538 64370 -120781 164863 -80122 245375 148505 -200685 166228 -103543 13707 -199420
12527 106872 65984 94375 323360 222594 -228001 -116307 -114665 333490 193898 -109697
12516 309206 236839 -23422 164598 134974 129013 403450 -74498 122211 146274 -326348 -43030
12504 -255628 190537 101042 -95003 91269 38786 117017 252684 -78474 -315406 73161 46389
12493 46389 -91260 -153432 136329 145282 131429 138402 23331 358092 139448 203375 -24021
12481c65958f6695A26199b9782E4088h7035k17236E6679J03113n2621A7536Q4235
12470A01771C3490a09769j99063Q9962A672c35274E1789c32008B31245J4730B4546
12458A54828K34154e6063p631q1722D4793a92195E5250b17501B43805N9616f9249
12446h4368I7832P1292K6798c9791j46295j39539a503n9540C44008B4833A1192
12434A1966N0939C1082O3097b97261j25582a17365K3542a7057j43598D59918A24344
12422B60364o1833d7160j01096N0264B33407A1524a11413j76232a00289A63817
12411A42665J05941f6234a8396A50524b05922L7647E0911J82094d27940a13157
12400H6430b41791A16968C5892P7325r977D2389A8459a33960q7286d8777A61586
$$ plain form
12481 -365958 -66695 126199 -29782 54088 -87035 -304271 56679 159792 107171 17536 101771
12470 101771 33490 -109769 -308832 -218870 1672 -335274 51789 -332008 231245 245975 24546
12458 154828 388982 -56063 -63694 -145416 44793 -192195 55250 -217501 243805 303421 -69249
12446 -84368 97832 169124 195922 -39791 -186086 -325625 -1503 -61043 344008 24833 11192
12434 11966 62905 31082 94179 -297261 -422843 -117365 -93823 -17057 -160655 459918 124344
12422 260364 198531 -47160 -148256 -97992 233407 11524 -111413 -287645 -100289 163817
12411 142665 248606 -66234 -18396 150524 -205922 -168275 50911 233005 -427940 -113157
12400 86430 -241791 116968 35892 113217 103240 42389 18459 -133960 -221246 -48777 161586
12388h5775J5389k72487D9175L2972a13690j44107a114E458L59964A80178e4978
12376C44472l1129H37J742a70796A27020R621b5269E3065L28785P3661b07714
12364f7185B1408c35932A30651a4788j09304D4454a09983N0745l7437j3452A85632
12352b10475A03641K12697q1452a03531A47458a48642b3900E95620f5846j62441
12342b28287A69710c5472A60810a42322j13809G4317b41865C72880b295B59182
12331b74604B1797L82585A13478A7839a60172d1691p9167A96382c3832l7076I5703
12319b14384c2757B04061m2188J6136n0634Q332P6533c8751h221n7203l74258
12308d39682J15560A14650e7748j55875d243l4467k7656A50327C441Q6067b8161
$$ plain form
12388 -85775 -70386 -342873 49175 82147 -113690 -257797 -1114 5458 365422 180178 -54978
12376 344472 313343 837 2579 -170796 127020 136641 -25269 53065 381850 455511 -207714
12364 -67185 21408 -335932 130651 -14788 -124092 44454 -109983 -59238 -96675 -110127 185632
12352 -210475 103641 316338 234886 -103531 147458 -148642 -23900 595620 -65846 -228287
12342 -228287 169710 -35472 160810 -142322 -256131 74317 -241865 372880 -2295 259182
12331 -274604 21797 404382 113478 17839 -160172 -41691 -120858 196382 -33832 -70908 95703
12319 -214384 -32757 204061 161873 178009 127375 135707 212240 -38751 -8221 -65424 -439682
12308 -439682 -324122 114650 -57748 -213623 -4243 -38710 -66366 150327 3441 89508 -28161
12296A67605q0450b39120J03774k03207I5472L62625i3308a3001A60645J2204
12286A72849R044a55961L8851N5632D1217f6806k3235L1530K290k05117B13834
12274A81411M4066L02931a7217C4376I983K86803b7975A09474d6225l38508A08396
12262A1968L76105A45516L78086b18462E9702a41690A39834L7022k3493M1733
12252A95096r4249j0964a03701l4990A39657m6522C343L75266A21588C2132J48400
12241A80532a7954B32287D8886B402a84148B0336j333a59476B46691d8748C87556
12229E3676K92890A34663b2012A84645k6114k1854c8684B39483a03915A72056
12218D62006A32639L1155K00932p6786P5617I5438L77076j58422c98848I49K38418
$$ plain form
12296 167605 87155 -239120 -135346 -338553 95472 458097 -93308 -13001 160645 172849
12286 172849 181893 -155961 -117110 -61478 41217 -66806 -90041 -58511 -56221 -261338 213834
12274 181411 225477 528408 -17217 34376 9983 296786 -27975 109474 -46225 -384733 108396
12262 11968 388073 145516 523602 -218462 59702 -141690 139834 176856 153363 195096
12252 195096 100847 89883 -103701 -138691 139657 93135 3343 378609 121588 32132 180532
12241 180532 -17954 232287 48886 2402 -184148 20336 19003 -159476 246691 -48748 387556
12229 53676 346566 134663 -22012 184645 158531 136677 -38684 239483 -103915 172056
12218 462006 132639 163794 364726 287940 363557 95438 472514 314092 -398848 949 239367
12207B39367n7658h3793C93589j67940B9221L2733J87752A3886J57424P6597j700
12196B46207q9489A9946M62715r8207H8144P1141M7242D6558f1657F505d5386
12184A68602R1254J192A584a80233j43879A61831l6835k023a72160E596j000a42319
12171A16330L75186A02264J09075h499j648B09095J71324K3372h4409n4778E9695
12159A43611M1912f020o065j96913H8908a69543C91280e474A3304c3331H9899
12147g971A66255n183D2595L4852J1628P9206f9950b0658D9074J34394q7568o067
12135H9833K06978H4036j1063a07315B45063b1202j65338C9657f7981A57221C8286
12123I0236J9435b688G5258f309k24278c8737q9267A25565J86412b70917C2189
$$ plain form
12207 239367 181709 -83793 393589 225649 29221 61954 249706 13886 171310 247907 246207
12196 246207 156718 19946 482661 384454 88144 159285 206527 46558 -61657 6505 -45386
12184 168602 259856 261048 1584 -180233 -324112 161831 124996 122973 -172160 5596 4596 -142319
12171 116330 491516 102264 211339 -8499 -10147 209095 380419 403791 -84409 -139187 59695
12159 143611 185523 -6020 -12085 -208998 88908 -169543 391280 -5474 13304 -33331 89899
12147 -7971 166255 161072 42595 77447 89075 168281 -69950 -20658 49074 183468 95900 89833
12135 89833 296811 84036 72973 -107315 245063 -21202 -186540 39657 -67981 157221 38286
12123 90236 109671 -2688 75258 -6309 -230587 -38737 -128004 125565 311977 -270917 32189
12111A08002J21520e5538H3627K87924k6783a24810B45973m4550I9612i5460G0445
12099B5393L28310a85664B37257n1790K69910B2922g9875k38671J5473I4795Q6211
12088A81006a23001j90150D6777m813g4385L3273A21957i7929E1310P0902M8640
12077A70852p5281e2811A82481e4466N891J3975B84139d9734j33942B98440A2047
12065A66165J0999J912b41271R3363K0965C32105K02291L62384L52126C32064
12054b3838B11849m1619G7923J77574a50649a6710d761k79620K3504B58234o0453
12043A97781g9777j32066l2868J16079C83a87303k66862A89649f7882C52144f2142
12031b62272a11962F4445b79469a12187K3403B35316o3513B3479a86044k37927
$$ plain form
12111 108002 229522 -55538 83627 371551 344768 -124810 245973 201423 99612 -95460 70445
12099 25393 353703 -185664 237257 185467 455377 22922 -79875 -318546 -303073 94795 181006
12088 181006 -123001 -313151 46777 41964 -74385 -41112 121957 -97929 51310 122212 170852
12077 170852 95571 -52811 182481 -54466 -48575 -34600 284139 -49734 -183676 298440 12047
12065 166165 177164 179076 -241271 -147908 -126943 332105 534396 896780 1248906 332064
12054 -23838 211849 170230 77923 255497 -150649 -16710 -4761 -284381 -260877 258234 197781
12043 197781 -79777 -211843 -244711 -128632 383 -187303 -454165 189649 -67882 352144 -62142
12031 -262272 -111962 64445 -279469 -112187 -88784 235316 171803 23479 -186044 -423971
12021d23971d6483a1912A73569E999g2296A90060j927r70b64923a3448k27673
12010b41121d0289k32226a20820m0826d2096j73513J7162K8251A49521A1055O0272
11999G1327c9907j43649h9063A01054O1363G6689h0153A5227b21542D60795A44163
11987C906K47598A06931O868a70871F2431a45728j14307k00521A29462b60062
11976A9287K81783d64300B0721a39790j42216d8087A54221g4512p3274c8666r1626
11965a30292k04081l1364a56206C8327a13653j19352J06468C1666g0525I9025
11954a00543I6809J45747B1498J74401n9436a93094f0566m1678B92644j14139
11944A78505i1196B5284h0994b1363j11168H8793L6319g6653E8486a46379A46069
$$ plain form
12021 -423971 -46483 -11912 173569 5999 -72296 190060 188133 187163 -264923 -13448 -241121
12010 -241121 -40289 -272515 -120820 -161646 -42096 -215609 -198447 -170196 149521 11055 71327
11999 71327 -39907 -183556 -89063 101054 162417 76689 -80153 15227 -221542 460795 144163
11987 3906 251504 106931 113799 -170871 62431 -145728 -260035 -460556 129462 -260062
11976 19287 301070 -464300 20721 -139790 -282006 -48087 154221 -74512 -147786 -38666 -130292
11965 -130292 -334373 -365737 -156206 38327 -113653 -233005 -126537 31666 -70525 99025
11954 -100543 96809 242556 21498 195899 136463 -193094 -60566 -102244 292644 178505
11944 178505 -91196 25284 -80994 -21363 -132531 88793 125112 -76653 58486 -146379 146069
11932d4096j85334m776g6872j10430g5774A24496a9498A8925a38383A65628a41220
11920E6432J40845o6032a24394L599K595C7891b77442o5657B162i69l5213B6634
11907g7190j6416E5890h9033G5696i6993A19707K37236a03914l1261h183C68852
11895c56063J48035O5611j31165D6957N2556n650g0928D5727i6066B5577P6370
11884A01947m7732R2959A5766c04954C85944a85506L0578j7474F8015J38370b28696
11872b47744A16014K16663A46848f5793D250c24009A80539l2817b91521A57043
11861d3191j87856j24875C17517b01902H4936A6760N2204h9314A20836a04807
11850A60245K08390A59302j2381d681k331n6237k88595O1885a39729L0015j31675
$$ plain form
11932 -44096 -229430 -234206 -76872 -187302 -75774 124496 -19498 18925 -138383 165628 -141220
11920 56432 197277 131245 -124394 -120795 -118200 37891 -277442 -343099 2162 -969 -36182 26634
11907 -77190 -93606 55890 -89033 75696 -96993 119707 356943 -103914 -135175 -8183 368852
11895 -356063 -208028 -142417 -273582 46957 99513 93863 -70928 45727 -96066 25577 101947
11884 101947 54215 147174 15766 -304954 385944 -185506 -154928 -172402 68015 206385 -228696
11872 -247744 116014 332677 146848 -65793 4250 -324009 180539 147722 -291521 157043
11861 -43191 -231047 -355922 317517 -201902 84936 16760 68964 -89314 120836 -104807
11850 160245 368635 159302 146921 -4681 -7012 -63249 -351844 -289959 -139729 -109714 -241389
11839b41389A87108C1498f1742P044B5230h4351j98472D6649b17503Q2446e3798
11827B48472b6894f064k55677C05123j36793C4345a29936A25362J97040b07988
11816E4439a01289k48815B0547L84086a77612A28754a43065m8220A18576b00345
11805b01554j6469N9343p471A77491h9293l58844I1412J76355b8589a819j7049
11794a8868D3682L2234a2277j94193A51685m4158a66070A38574a9095A31716D067
11782B05608b56434C17748f5164r4540K1074n22o8479A37227c20811a54529j07665
11771b62194m5515A06452e9129B22658J20674H3094g2123k48333C6099m347J25283
11760A57035A1330b26625R8251e9229a6102o2962A66837K2987j8525J7562m9612
$$ plain form
11839 -241389 187108 31498 -61742 -54698 25230 -84351 -282823 46649 -217503 -135057 -53798
11827 248472 -26894 -6064 -261741 305123 168330 34345 -129936 125362 322402 -207988
11816 54439 -101289 -350104 20547 404633 -177612 128754 -143065 -191285 118576 -200345
11805 -201554 -218023 -158680 -166151 177491 -89293 -448137 91412 267767 -28589 -1819 -18868
11794 -18868 43682 75916 -12277 -206470 151685 107527 -166070 138574 -19095 131716 4067
11782 205608 -256434 317748 -65164 -159704 -138630 -139152 -207631 137227 -320811 -154529 -262194
11771 -262194 -307709 106452 -59129 222658 343332 83094 -72123 -320456 36099 31752 157035
11760 157035 11330 -226625 -128374 -59229 -16102 -79064 166837 189824 171299 188861 139249
11749A39249P8579a67115j939m8960k02802H4759B0871N8101O7716n3957J37104
11738B29835e929j03872B0532a67538J9119A10843g6795L079A67209c04403H0294
11726b14368e2024L980j12414e7221E5628b56264A16954B6960J0686K90625b14314
11714A47992f3516A46284b9344j11560G075a94697B76a24281a4764F1206N6637
11703A17843b40400N5205G1748c3930p5343n8745m154f3260k8145A13348N9826
11692A73174b44564l2492B04476c81670C3144b92323J02257h0816I231K31553
11682B40784A8192a02992L2976B72856a6465B94806a38141r3412A58127c27114
11671c6853j18950K9669F078L69053a69761k63374g7534l36634a9890D1712d0348
$$ plain form
11749 139249 217828 -167115 -169054 -218014 -420816 84759 20871 78972 146688 92731 229835
11738 229835 -5929 -109801 20532 -167538 -148419 110843 -76795 -73716 167209 -304403 80294
11726 -214368 -52024 -48044 -160458 -57221 55628 -256264 116954 26960 37646 328271 -214314
11714 147992 -63516 146284 -29344 -140904 7075 -194697 276 -124281 -14764 61206 117843
11703 117843 -240400 -185195 71748 -33930 -109273 -168018 -172172 -63260 -91405 113348 173174
11692 173174 -244564 -277056 204476 -381670 33144 -292323 -190066 -80816 9231 240784
11682 240784 18192 -102992 -70016 272856 -16465 294806 -138141 -231553 158127 -327114
11671 -36853 -155803 -126134 6078 375131 -169761 -433135 -77534 -414168 -19890 41712 -40348
11659b86354J19289A30570g9555j04581I8556i1278L3447k64438Q0428c3216A45930
11647C07972o5372c1583B16666a45446b3482F0056R7435b79417a11328B752b80994
11635a73343C35075H2985J85167A00658L1313R5157q7105o3427B4988g5588k47996
11624c23584R6530B57489d46621h9859l6740B65816c76768E6406J13020b48405
11613B53638q2458a24328B78219g6463B39863c00269B61652p6507B1010c43199
11602B16074H2366J14346c9773E2797b73790i9702q224l524G3857b42128p4544
11591c16672i7727l1001F3480J10995a75828j73376B2370o586O7345a79039L4807
11580a44232C1238N2973O5848J832D5306c3212p9961A41861m2790d4419B5189
$$ plain form
11659 -286354 -167065 130570 -79555 -184136 98556 -91278 -57831 -322269 -241841 -33216 145930
11647 307972 242600 -31583 216666 -145446 -23482 60056 157491 -279417 -111328 2752 -280994
11635 -173343 335075 82985 268152 100658 131971 227128 140023 76596 24988 -75588 -323584
11624 -323584 -227054 257489 -446621 -89859 -126599 265816 -376768 56406 169426 -248405
11613 253638 171180 -124328 278219 -76463 239863 -300269 261652 185145 21010 -343199
11602 216074 82366 196712 -39773 52797 -273790 -99702 -107926 -111450 73857 -242128 -316672
11591 -316672 -97727 -128728 63480 174475 -175828 -349204 22370 15784 83129 -179039 -144232
11580 -144232 31238 84211 150059 151891 45306 -33212 -113173 141861 99071 -44419 25189
11568b44033C461e4430B38957c2321A96667D9169e8860k83513h8947a6471A07966
11556B49082g4161C6990K9086h0300k2538A57276b82786B20371C6637a88025H1608
11544e5380H0593R4757p9889A7071a83624Q5424k69584D8800A8207a28864p6565
11533b05429I922a28412C50810H3002J59696D2426Q6702A1924J6831c0475C12746
11521a57882A55589e377j16851I4813a2358q4242D9346B0568K23644D3204J14768
11510A57972O6365a15450B3892L13036D2526e2618A71190b78579a34532I1498
11499A56129B0076D850J6361J41988G5665c014A04408J16871a60426C99063c8935
11487B05451r6119L39978a08795E07344j85277c89969B62163j01749J50434f6768
$$ plain form
11568 -244033 3461 -54430 238957 -32321 196667 49169 -58860 -342373 -88947 -16471 107966
11556 249082 -74161 36990 66076 -80300 -102838 157276 -282786 220371 36637 -188025 81608
11544 -55380 80593 175350 95461 17071 -183624 -98200 -367784 48800 18207 -128864 -205429
11533 -205429 9922 -128412 350810 83002 242698 42426 129128 11924 28755 -30475 312746
11521 -157882 155589 -5377 -122228 94813 -12358 -96600 49346 20568 244212 43204 157972
11510 157972 224337 -115450 23892 336928 42526 -52618 171190 -278579 -134532 91498
11499 156129 20076 4850 21211 163199 75665 -3014 104408 221279 -160426 399063 -38935
11487 205451 109332 449310 -108795 507344 322067 -389969 262163 160414 310848 -66768
11476B42641a36226C40133m6047H5707K7223j6101L81924p2173A32305f7485D4101
11464f6004C39853d2088I6483J89904A7755J84840H3003f2244B55714c22030b8647
11452A31234f7627A51842f7496A62422G4767L05a45842B15731b26208A00266b1350
11440A87671G0884O0271a77477A89025a01017a0863E58800f4616k65701E036i9189
11428b97502J43334a9293B95477a22708j26631j1734I1580K83569D4969q399a689
11416E6263e5035f580j1212D26336F5311a14494L1678l6447B98568o3544b98846
11404g6133E7352d05700D90227a22265j01593C35410A10819e0081B54677f9113
11393B0107e53305a2051G3506a30285A04360n0878a89461a6004A44670b0376B61608
$$ plain form
11476 242641 -136226 340133 294086 85707 112930 96829 478753 406580 132305 -67485 44101
11464 -66004 339853 -42088 96483 286387 17755 202595 83003 -62244 255714 -322030 -28647
11452 131234 -67627 151842 -67496 162422 74767 75072 -145842 215731 -226208 100266 -21350
11440 187671 70884 131155 -177477 189025 -101017 -10863 558800 -64616 -330317 5036 -99189
11428 -297502 -154168 -19293 295477 -122708 -249339 -261073 91580 375149 44969 36570 -1689
11416 56263 -55035 -6580 -17792 426336 65311 -114494 -82816 -119263 298568 235024 -298846
11404 -76133 57352 -405700 490227 -122265 -223858 335410 110819 -50081 254677 -69113
11393 20107 -553305 -12051 73506 -130285 104360 53482 -189461 -16004 144670 -20376 261608
11381a87055L6898F5093e0722k04519D0363J10964a90602A55019a37606b1766
11370b62667B55402j16707o3854l3941c03780A2337h5068B82881g170B06368B0743
11358a9859C9674b6330A15403g7013C7470b76408j8070B14053a10469B00352H4056
11346d04058E1247J04512L1995k0471B3984i3584j18883j78023A4717b05333B05305
11334H3572h0545k78525g9337B92554C9960c6739j16011l39553B24271b06948
11323g9819J5437A76222d6273m9352B62602A01544a01048j13765A7329R1849L075
11312A12253J46869a37856A73140d3850j43028D8498a74692h3569a7674D4948
11301a87688M0983g2511G2860h6381J3688a4610j15794A86344a63462k6317Q5266
$$ plain form
11381 -187055 -150157 65093 -50722 -255241 40363 151327 -190602 155019 -137606 -21766
11370 -262667 255402 138695 74841 40900 -303780 12337 -85068 282881 -7170 206368 20743
11358 -19859 39674 -26330 115403 -77013 37470 -276408 -294478 214053 -110469 200352 84056
11346 -404058 51247 155759 187754 167283 23984 -93584 -212467 -390490 14717 -205333 205305
11334 83572 -80545 -359070 -79337 292554 39960 -36739 -152750 -492303 224271 -206948
11323 -79819 -64382 176222 -46273 -95625 262602 101544 -101048 -214813 17329 109178 112253
11312 112253 259122 -137856 173140 -43850 -186878 48498 -174692 -83569 -17674 44948
11301 -187688 -146705 -72511 72860 -86381 -72693 -14610 -130404 186344 -163462 -189779 -104513
11290a04513B82714H7636K0630B3768J38688f7884o5047e1436j59642D6222a78184
11278B40844h2259l4197c2587k444F670a02032A2085b82407c829I0036c38397
11266B82821b97854E0480b41075j07351B9546K30087H4060J29834b27249E2876
11255a56436M3117A71561A080J22098b62715G4209M4215m2366f8396m41884i4370
11243e8150B02345E9447c00853J10928l14134a14782A7487b77325a25869m7085
11233a72954A32667i5702o6065R107E8343a18149C1243a22534o9330k0658A08336
11221D8021f7702A26281b67181C413i3077l00151D7692a85047I0541b48706B86518
11209b65377C00230a26379G5205k0048a98994d9421A08897a00998j06967G2844
$$ plain form
11290 -104513 282714 87636 108266 23768 162456 -67884 -132931 -51436 -211078 46222 -178184
11278 240844 -82259 -116456 -32587 -35031 6670 -102032 12085 -282407 -3829 90036 -338397
11266 282821 -297854 50480 -241075 -348426 29546 259633 84060 213894 -227249 52876
11255 -156436 -113319 171561 1080 123178 -262715 74209 118424 76058 -68396 -510280 -94370
11243 -58150 202345 59447 -300853 -189925 -504059 -114782 17487 -277325 -125869 -172954
11233 -172954 132667 -95702 -161767 -152660 58343 -118149 31243 -122534 -191864 -212522 108336
11221 48021 -67702 126281 -267181 3413 -93077 -393228 47692 -185047 90541 -248706 286518
11209 -265377 300230 -126379 75205 55157 -198994 -49421 108897 -100998 -207965 72844
11198G7294c78391a49878O1136I1312N6493E4933b05245f7699A67099l0885l3285
11187A02929J13441a37798A35107e4359A47586b88422b1677B5582J01003c33296
11176f6259A57385J65486c92788C1769i8497j876A69530d6524n0456A52920f6389
11164D6340l297N2128C1556J16773E126b28905I041J73838H2293Q8542i8375I5760
11151G7725b67519j05763J48819P9345A28346b28509A41681b995A00268M2796
11141A43064b42093a19706j17244j5666h1373A50981K1218A3274e1203B5077J90028
11130B15105G892b8777C7122J9782J74649p3010J76329f2461B3947L41881a32492
11118C4946b86813C11507G8537L5254a8410j7173A41642K16591g8524A96107o0082
$$ plain form
11198 77294 -378391 -149878 -88742 91312 147805 54933 -205245 -67699 167099 136214 102929
11187 102929 216370 -137798 135107 -54359 147586 -288422 -21677 25582 126585 -333296
11176 -66259 157385 322871 -392788 31769 -98497 -100373 169530 -46524 -96980 152920 -66389
11164 46340 43043 95171 31556 148329 5126 -228905 9041 182879 82293 170835 -98375 95760
11151 77725 -267519 -373282 -224463 -145118 128346 -228509 141681 -2995 100268 143064
11141 143064 -242093 -119706 -236950 -252616 -81373 150981 172199 13274 -51203 25077 215105
11130 215105 7892 -28777 37122 56904 231553 158543 334872 -62461 23947 365828 -132492
11118 34946 -286813 311507 78537 113791 -18410 -35583 141642 358233 -78524 196107 136025
11107A36025J0876J16508L03311f1149A35422a23430F1830M29779j87513J84044
11097D88140D3307K07761M4104L0867i6759C13518D5911R2667J46613e7326F18595
11085G0911B8546a3545C2387a8874A26331L74795j42848j7413A28821L97526j71734
11074C54613b5474G00928A71202a33590B32841b9794B3712J63226K34107K49258
11064F70303C05904L60924p3737k91200M42920j71313l6617J36378C21416J50167
11054D71583j38138N56286B44546L04098J04508j43873L9931N7194J67933k87804
11044D86533K68322j00624K8135j62866L90118k12940J80605R3860D42359L78834
11034H21193j26665O2638P6407l39230L96057N0329l73901O9258J76465k63840
$$ plain form
11107 136025 146901 263409 566720 -61149 135422 -123430 61830 491609 304096 488140
11097 488140 43307 251068 295172 326039 -96759 313518 45911 138578 285191 -57326 618595
11085 70911 28546 -13545 32387 -18874 126331 501126 358278 340865 128821 526347 354613
11074 354613 -25474 700928 171202 -133590 232841 -29794 23712 186938 421045 670303
11064 670303 305904 666828 593091 301891 744811 573498 536881 673259 321416 471583
11054 471583 333445 889731 244546 548644 653152 509279 549210 606404 774337 486533
11044 486533 754855 654231 682366 519500 909618 696678 877283 971143 442359 821193
11034 821193 694528 757166 833573 494343 890400 940729 566828 636086 812551 548711
11024E48711p1909P4204K37081j43657C07880K29055J71555J05270q323k75511
11014E29926B07653N26354R8095m12652P9433O8998K50457m8839q9511j30991
11004E48997J30173j17024L90788k9506K04728E14619L30349C93469R162L74033
10994G76664k28424J44867j31589M2936o9351J37536O598m75L04862M8170N8341
10983A090135k77811P0759N00746M8793j19212J75861K56471L20653K39198J23869
10973B429462M02654l33416L04255Q8876k41678l21330Q9931l86512j77648n6461
10963A798133q67091K84071J99645j58187k69776M27336k32351J70893l64160
10954I88513n4836l35238j74293O9950k6280B15473l3204m6309r909L05207A22132
$$ plain form
11024 548711 476802 551006 788087 644430 307880 536935 708490 813760 805437 529926
11014 529926 207653 734007 832102 419450 498883 567881 818338 769499 679988 548997
11004 548997 679170 562146 952934 923428 1128156 514619 844968 393469 402631 776664
10994 776664 548240 693107 561518 604454 535103 672639 679237 678762 983624 1031794 1090135
10983 1090135 812324 883083 1383829 1432622 1313410 1489271 1745742 2066395 2305593 2429462
10973 2429462 2832116 2498700 2802955 2891831 2650153 2328823 2418754 2032242 1854594 1798133
10963 1798133 931042 1215113 1414758 1256571 986795 1414131 1181780 1352673 988513
10954 988513 933677 598439 424146 494096 467816 215473 182269 135960 126051 431258 122132
10942C87752a46041C59950r3300A13772M0955J67420A38604L21027I6529b81413
10931I7295c35206J64219A77699o0172a27770J0916A49061b5934G5906P8732C9003
10919b30692d6344p4558A13865a01162j41348B58107o6941a1949H9933M7900m1519
10908I6314e7934A96284a35594l13954A30506J5006g8516c537F5028A3171M53925
10897D67096a93921a6153m3163F4918i576j82168c634A51689F5330c130A40076
10885B44092c1526c786A96904I198c01740J3173a13214F7269k5724b76861A50721
10873H6087K410d2529B16729q3229A1019J51037m5801b17679A75218d6029B23862
10861A4126i731H0311a79467C1412a23546I1696J82012a69318h3217A32950i2790
$$ plain form
10942 387752 -146041 359950 266650 113772 154727 322147 138604 459631 96529 -281413
10931 97295 -335206 -170987 177699 117527 -127770 -116854 149061 -25934 75906 154638 39003
10919 -230692 -46344 -120902 113865 -101162 -242510 258107 191166 -11949 89933 137833 96314
10908 96314 -57934 196284 -135594 -449548 130506 145512 -78516 -3537 65028 13171 467096
10897 467096 -193921 -16153 -59316 64918 -9576 -191744 -3634 151689 65330 -3130 140076
10885 244092 -31526 -3786 196904 9198 -301740 -288567 -113214 67269 41545 -276861 150721
10873 86087 88497 -42529 216729 133500 11019 162056 116255 -217679 175218 -46029 223862
10861 14126 -9731 80311 -179467 31412 -123546 91696 273708 -169318 -83217 132950 -92790
10849f3403A7495R355K10087b3868j32040B72182j07732a74747J5551C62673c05323
10837a39228O2869l7097l35364A23095j8676B1094c911k82375c28l2672I7430
10825B4982h5461j94519d9431H0911d1627r6765j43775a35963K7408C423i2405
10813a77951A02857C2541b26579j26912b0084A0660a84369j07283h8401j63690
10803b52091G135a4656k50153I9045f5365m2282e1186E5817g4125A39179d9098
10791A04629a62416b507j52478D00260b00329R7059k5250C371J03606a58959q5640
10780b44599J2364m9027i9632D71573f7778A62319h6117J9449a287A57276p1715
10769H5561g4384k2841L1179j77903c2081c023j49124O0761d0496j91942C02957
$$ plain form
10849 -63403 17495 26850 236937 -23868 -155908 272182 164450 -174747 -159196 362673 -305323
10837 -139228 -76359 -113456 -448820 123095 104419 21094 -3911 -286286 -328 -33000 97430
10825 24982 -85461 -279980 -49431 80911 -41627 -138392 -282167 -135963 -108555 3423 -92405
10813 -177951 102857 32541 -226579 -353491 -20084 10660 -184369 -291652 -88401 -252091
10803 -252091 7135 -14656 -264809 99045 -65365 -107647 -51186 55817 -74125 139179 -49098
10791 104629 -162416 -2507 -154985 400260 -200329 -103270 -128520 3371 106977 -158959 -244599
10780 -244599 -232235 -281262 -99632 471573 -67778 162319 -86117 -66668 -1287 157276 85561
10769 85561 -74384 -97225 -66046 -243949 -32081 -3023 -152147 -91386 -40496 -232438 302957
10757B03143e9487j03470A6364b41803J02851A98020q4717A4496J81048i1902
10746A78295G0826J63760Q2642F5364g6782j45044l9264A64071G0312d29698K9725
10735c99973H1266a63953J9656J2108o700m44528a61359A42066L4050f5912J3229
10724e2683m6955B35210r7315M2110o7799a89095R753j7339d3824j03627F5287
10712b88209H3459a842k59314E2730J28837E3644a3893G6035R2106a22355H5336
10700a83172p2618a8848A65474g3579m0438F3085a28289j9250B21911a4233m17072
10689d31305A84357j743g2238L1736G6866c3878j7419A03319a26641K4040K1443
10678h1158o342A14614c37408A95031L0547a12533A2965K1497a28610e3251q55
$$ plain form
10757 203143 -59487 -162957 16364 -241803 -138952 198020 113303 14496 195544 -91902
10746 178295 70826 234586 317228 65364 -76782 -221826 -261090 164071 70312 -429698 -399973
10735 -399973 81266 -163953 -144297 -132189 -138889 -583417 -161359 142066 176116 -65912 -52683
10724 -52683 -99638 235210 137895 180005 112206 -189095 -179342 -196681 -43824 -147451 65287
10712 -288209 83459 -1842 -261156 52730 181567 53644 -13893 76035 168141 -122355 85336
10700 -183172 -255790 -18848 165474 -73579 -114017 63085 -128289 -147539 221911 -14233 -431305
10689 -431305 184357 182614 -72238 -40502 76866 -33878 -51297 103319 -126641 -102601 -81158
10678 -81158 -87500 114614 -337408 195031 225578 -112533 12965 34462 -128610 -53251 -54106
10667e4106j42848j99320A56858f4570e182l31510j9375A9216N6195L6499K08332
10656C20242D7272b5389k04519h1687j49203b3778j09891r694K6969A6797a25112
10644a96402L3922e2055B98296a16051j0425n858B07617q3361b22017J02332l4669
10633a54354a4446I8885a0627B02208c48207a72258C3936b01881I2575l0121b46084
10621B4726K07016d7437l08610J38557A95505b07875B23887a2197l30787I699
10610e7959j09459O5063O775A56113a28569k28506E8698a81832b790j79220f384
10598b7385j89160O7905f1004B67438F1977K1984i0234A25474i0188j24957E7093
10586b97378m334E8865b05718f7755l5080A51880E4322c08669a39106j34582N3699
$$ plain form
10667 -54106 -196954 -396274 156858 -64570 -5182 -336692 -356067 19216 75411 111910 320242
10656 320242 47272 -25389 -229908 -81687 -230890 -23778 -133669 -143363 -116394 16797 -125112
10644 -196402 -162480 -52055 298296 -116051 -126476 -132334 207617 124256 -222017 -119685 -154354
10633 -154354 -14446 98885 -10627 202208 -348207 -172258 33936 -201881 92575 62454 -246084
10621 24726 231742 -47437 -356047 -217490 195505 -207875 223887 -12197 -342984 9699
10610 -57959 -167418 -102355 -95580 156113 -128569 -357075 58698 -181832 -2790 -182010 -6384
10598 -27385 -216545 -148640 -61004 267438 61977 83961 -90234 125474 -90188 -215145 57093
10586 -297378 -301712 58865 -205718 -67755 -102835 151880 54322 -308669 -139106 -273688 -219989
10575b19989k1809A00848a99913F144b4493A02135d04009A00984a50915j46171
10565b97086G3052a01230C8517a20815F3802J14229a07582j38538B09144I8419
10554B818J95932G5733b42112G7121h9494k68256e7148A47687E4615J76478b9290
10542C8363g3508o5054A03601a2735m2034l82892a16864e5694k78421k3691J74635
10531a83171A43467a92758A06303a58599l9030A40447J99161j58729M1645C0557
10520a0858A10361c57262B78532p5125l1782a1314E0537N8033a21380A09449R791
10509A19240a44741j55939G9287O6048a11229B31705i4145L8089j9099A18337
10498H6686l0072a3398k22618A2600b96958B52783A2947a1566G5523a10062B22441
$$ plain form
10575 -219989 -241798 100848 -199913 6144 -24493 102135 -404009 100984 -150915 -297086
10565 -297086 73052 -101230 38517 -120815 63802 178031 -107582 -246120 209144 98419
10554 2818 198750 75733 -242112 77121 -89494 -357750 -57148 147687 54615 231093 -29290
10542 38363 -73508 -138562 103601 -12735 -54769 -437661 -116864 -55694 -334115 -357806 -183171
10531 -183171 143467 -192758 106303 -158599 -197629 140447 339608 180879 222524 30557
10520 -10858 110361 -357262 278532 203407 171625 -11314 50537 108570 -121380 109449 119240
10509 119240 -144741 -300680 79287 145335 -111229 231705 -94145 -56056 -75155 118337
10498 86686 56614 -13398 -236016 12600 -296958 252783 12947 -11566 75523 -110062 222441
10486a0010E015b03728b3787C50904a27029C895e6171A34680d8282B3806K44879
10475B68685H361c37497D5938P5169a84692f6644G7396J44336i0182d2102r3977
10464a36079A40657b46269I8685j9144a3738j09441M0590E256J31632D8855c7913
10452d9803q3482O1087A38775e98139F9790l3893d7170k4088A74844m7334i3519
10440b25572b7964E672J719i8524j23116d059G4142L9958J0189i5088b4064n548
10428b9612A141J9197L11305e7684C9496d9257H3291J71810j13923B0668e2896
10416C84392a24222e3525j80579r172A72927L3632J11274b9515m85693A59329
10405B68322i2425l2992Q96A24942b05241H8113a0475A81434A4105b08680E5992
$$ plain form
10486 -10010 5015 -203728 -23787 350904 -127029 3895 -56171 134680 -48282 23806 268685
10475 268685 8361 -337497 45938 121107 -184692 -66644 77396 221732 -90182 -42102 -136079
10464 -136079 140657 -246269 98685 79541 -13738 -123179 -82589 5256 136888 48855 -37913
10452 -49803 -133285 -72198 138775 -598139 69790 35897 -47170 -71258 174844 127510 -93519
10440 -225572 -27964 5672 7391 -98524 -221640 -4059 74142 114100 124289 -95088 -24064 -29612
10428 -29612 1141 20338 331643 -57684 39496 -49257 83291 255101 141178 20668 -52896
10416 384392 -124222 -53525 -234104 -243276 172927 206559 317833 -29515 -515208 159329
10405 268322 -92425 -125417 -124521 124942 -205241 88113 -10475 181434 14105 -208680 55992
10393A84874J23126j42645J16769A18878a10718B97065E0186l753b3188j28923
10383a52111D44131f4029B6433L8345J44492o8765K47119A54867N1256n1324r229
10372A45570K27838j67877l488L7715l9362J5696K87917B27718L01145A48661
10361C72518A57002a760C30412a05488A21816i3832A18177K02274j51839L13172
10351D81784O4657j08717j53574J94969P087B09652P9482M7479j50654J5966J42618
10340C44543A31355J63132j18243B3853J08408k4270r495L21078k09385J17165
10330C27354a16758B5388L04483d31678A74514Q6003j13483D087K22333j10126
10320A16294i4427b9622A37581a0762j34654D0232a15126A87386q6413b4161j8051
$$ plain form
10393 184874 308000 165355 282124 118878 -110718 297065 50186 46433 -23188 -152111
10383 -152111 444131 -64029 26433 64778 209270 140505 387624 154867 206123 154799 145570
10372 145570 373408 205531 202043 239758 200396 216092 504009 227718 528863 148661
10361 372518 157002 -1760 330412 -105488 121816 -93832 118177 320451 168612 481784
10351 481784 546441 437724 284150 479119 486206 209652 289134 336613 185959 201925 344543
10340 344543 131355 294487 176244 23853 132261 107991 98496 419574 210189 327354
10330 327354 -116758 25388 329871 -431678 174514 260517 147034 4087 226420 116294
10320 116294 -94427 -29622 137581 -10762 -145416 40232 -115126 187386 100973 -24161 -42212
10309d2212E31806b94904a32737j4134A1768c66151F3816K913J31695c91038C91569
10297F9967m55J98175A12773n2258b69318R6790B52319g742A61770a17085c0976
10285A96502a45181m5084M8966j88464A85929i2532k05205m8591d8705R716j73265
10274b12254B9453b13146c0160A16715h920C8095P6907b68611e4268A90339D4271
10262a96091A12231c2133H3717N6496J04158J3305J66351A07954c499A51989O6033
10251B18022G1615Q3883K4314l3870n1043e8396a5813G6660h1090j38357E081
10239a7964j32397E4558K55313b43123G3195d9189n0947A60027a9856k02514Q3357
10228a39013L3913A64991A2454J36257o2690a51179A47569a13087b1210l57590
$$ plain form
10309 -42212 531806 -294904 -132737 -146871 11768 -366151 63816 66729 198424 -391038 391569
10297 69967 69512 267687 112773 60515 -269318 -172528 252319 -7742 161770 -117085 -30976
10285 196502 -145181 -190265 -141299 -329763 185929 -92532 -297737 -346328 -48705 -38989 -212254
10274 -212254 29453 -213146 -30160 116715 -8920 38095 115002 -268611 -54268 190339 44271
10262 -196091 112231 -32133 83717 140213 244371 257676 424027 107954 -3499 151989 218022
10251 218022 71615 155498 179812 145942 94899 -58396 -15813 76660 -81090 -219447 5081
10239 -17964 -150361 54558 309871 -243123 73195 -49189 -100136 160027 -19856 -222370 -139013
10228 -139013 -105100 164991 12454 148711 86021 -151179 147569 -113087 -21210 -378800
10218c78800D8489a75947e5348A1890b60544A33616f4201A67214D7174a59873
10207C5820J15420i4333j53178a12896A33673a54254r1271J02820G3725B3380
10196b10396I4815m6558a23372k2129F1106b11658g7538l5920A2488h3376a2117
10184A7044K5235a78750I693a89966F8824d23943a97939A21718k5431J83081b98909
10172a28019e6319q9468C046c4469p9735a956C11720B6117d9729A296i4072j24803
10160b18875i1114d3828A5095e6535F7541c40976Q4904M1987b2437k40071g6996
10148a47464k965h638F5605K14051b82940h1701p5650A72476J65423e00222J46522
10137c53700G7312C0811d64059A52023a97176H5190j3404a73155d956G758d71293
$$ plain form
10218 -378800 48489 -175947 -55348 11890 -260544 133616 -64201 167214 47174 -159873
10207 35820 151240 -94333 -247511 -112896 133673 -154254 -245525 -142705 73725 23380
10196 -210396 94815 48257 -123372 -145501 61106 -211658 -77538 -113458 12488 -83376 -12117
10184 17044 42279 -178750 9693 -189966 68824 -423943 -197939 121718 96287 279368 -298909
10172 -128019 -56319 -145787 3046 -34469 -114204 -1956 311720 26117 -49729 1296 -94072 -218875
10160 -218875 -91114 -43828 15095 -56535 67541 -340976 -256072 -214085 -22437 -262508 -76996
10148 -147464 -150429 -8638 65605 279656 -282940 -81701 -157351 172476 337899 -500222 -353700
10137 -353700 77312 30811 -464059 152023 -197176 85190 71786 -173155 -4956 7758 -471293
10125b52772b9467j52393A70911g692j64986l0260k79552K40975e6947A01851
10114a38831b2169l2826j16227A01915a53600k43047a35406I4824J99272d6063
10103d66440c7417o0970a2357A87754O729A4723a53651C22875a89681A079J15287
10092A16366h7206B77306E1142c00710i0915F2650a17379p3840a9913r6086G7039
10080F2106k3040A013J0767J20899g9576A94469r2975i4437c7979F0571a1513
10068b31q0862A94670d6062A99888a872j6490A22367k3858d9215B92953f1053
10056a34752f0892D0586b71736C2980J49607D7142a43058C86392g0405j97221
10046b67626R8194B2478g1492j85177g9261H0499c7520d248K74E5600a09222L7624
$$ plain form
10125 -252772 -29467 -181860 170911 -7692 -172678 -202938 -482490 -241515 -56947 101851
10114 -138831 -22169 -54995 -171222 101915 -153600 -396647 -135406 94824 294096 -46063
10103 -466440 -37417 -98387 -12357 187754 194483 14723 -153651 322875 -189681 1079 116366
10092 116366 -87206 277306 51142 -300710 -90915 62650 -117379 -191219 -19913 -115999 77039
10080 62106 39066 1013 11780 132679 -79576 194469 101494 -94437 -37979 60571 -11513
10068 -231 -81093 194670 -46062 199888 -1872 -18362 122367 98509 -49215 292953 -61053
10056 -134752 -60892 40586 -271736 32980 182587 47142 -143058 386392 -70405 -267626
10046 -267626 -169432 22478 -71492 -256669 -79261 80499 -37520 -4248 -3974 55600 -109222 -71598
10034g1598n580A17342m0968l6713a33903A18484e2827k6124F0804h7546B72205
10022a23657k34244e1361J1799c900A37049a14066D2249b40732B46373b61970
10011b26067B10455o5397d6312F4947d50496J12532A33671D3165c2272o9412J4420
10000h7264c9372k5665A60618j7100a35470k67922A26580F1042K1754c73483C0306
9988G9451c62453a74049c8509B21429H3428A9700g2537R766K0096q4695B43293
9976a37285H1964d3494q6851b7802j50761A83109c20690g6788k4992j84881j35827
9965d22488A87798d0443j36639E9638g3004p9330a2666D9599d3986A79437E2195
9953c21011b1516m571p780A0226a92849d8725B01475g6799B44183q8690c12569
$$ plain form
10034 -71598 -77178 117342 76374 39661 -133903 118484 -52827 -78951 60804 -87546 272205
10022 -123657 -357901 -51361 -39562 -3900 137049 -114066 42249 -240732 246373 -261970
10011 -226067 210455 145058 -46312 64947 -450496 -337964 133671 43165 -32272 -101684 -87264
10000 -87264 -39372 -65037 160618 143518 -135470 -403392 126580 61042 82796 -373483 30306
9988 79451 -362453 -174049 -38509 221429 83428 19700 -72537 -62771 -42675 -127370 243293
9976 -137285 81964 -43494 -130345 -27802 -178563 183109 -320690 -76788 -101780 -286661 -422488
9965 -422488 187798 -40443 -177082 59638 -73004 -152334 -12666 49599 -43986 179437 52195
9953 -321011 -21516 -26087 -33867 10226 -192849 -48725 201475 -76799 244183 155493 -312569
9941A89946P5828I4074f3718o650K7575F5710K8718A18g9889k23721A57180i8057
9928b02800B18782a49293f4946o3232m36937G6781b27698J1048C44022o9265j36163
9917A38594M6781G9460J41773b17404L2001c0056j78511B8513a56366A00165b94888
9905a05745A29519b13690l8713k23937a35958G4844b99846A61622b31801M0340
9895a91461c7509k4204C4943f1720F3442c80166a06589o2499l987A21662B6415
9883g8716a1134j19850G2887a25077q0221d4946A70258a2918k47573p1667C3581
9871A18050K5736a27692p9120J00260j44057b1006A2419B206c7968A65516e8739
9859i4057C6060h9193J6573k38998Q7303A94409b79511g2846c4640B00919b14424
$$ plain form
9941 189946 265774 94074 -63718 -70368 -42793 65710 94428 118 -79889 -303610 157180 -98057
9928 -202800 218782 -149293 -64946 -128178 -565115 76781 -227698 -216650 344022 274757 138594
9917 138594 185375 79460 221233 -217404 -185403 -30056 -208567 28513 -156366 100165 -294888
9905 -105745 129519 -213690 -252403 -476340 -135958 74844 -299846 161622 -231801 -191461
9895 -191461 -37509 -61713 34943 -61720 63442 -380166 -106589 -169088 -173075 121662 26415
9883 -78716 -11134 -130984 72887 -125077 -205298 -44946 170258 -12918 -260491 -332158 33581
9871 118050 143786 -127692 -206812 -106552 -250609 -21006 12419 2206 -37968 165516 -58739
9859 -94057 36060 -89193 -72620 -311618 -224315 194409 -279511 -72846 -34640 200919 -214424
9847g2903D045J79947b42931p0427a26471l79448a18246K8301o9510m8495A88742
9835h9949j81418c0837A06130f5065o4574C19192b33084d6322E2746K58654F7462
9823C5463e05752B28696a01306j96063g0336C8924a11802k16131g9798j48318
9813b28116h6912A77386j3013a03393A7885K8217a95445n0448P0123h2094j4962
9802i7056j25942I2768c57040A71619a43477A3075a30334c8911A25615D3492a66384
9790A76623a80235k3844j95239J46673B44388a81311A02867d7747a119j1958q4147
9779i7224j98178a44319e8221A57927i5607A05330b2552k25449A51665A6723h9112
9767a27822a4927A18914N3803B0167J6549c12020A52756b39134a3251G4091j4021
$$ plain form
9847 -72903 4045 183992 -242931 -313358 -126471 -505919 -118246 -89945 -159455 -207950 188742
9835 -89949 -271367 -30837 106130 -65065 -129639 319192 -233084 -46322 52746 311400 67462
9823 35463 -505752 228696 -101306 -297369 -70336 38924 -111802 -327933 -79798 -228116
9813 -228116 -86912 177386 164373 -103393 17885 46102 -195445 -245893 -175770 -82094 -97056
9802 -97056 -222998 92768 -357040 171619 -143477 13075 -130334 -38911 125615 43492 -166384
9790 176623 -180235 -204079 -399318 -252645 244388 -181311 102867 -47747 -1119 -13077 -97224
9779 -97224 -295402 -144319 -58221 157927 -95607 105330 -22552 -248001 151665 16723 -89112
9767 -127822 -14927 118914 172717 20167 36716 -312020 152756 -239134 -13251 74091 60070
9756F0070c25077h5381A5971a54066C8897Q8578J1585F6952a09347K0736D5969
9744A4262d9001k43079A05622K03400f7301p3428Q214D8941e3788D019d466A57036
9731a54596C394b97153a02825j26276g7652B45858G3638f6395j02428I116J89953
9720A99069b10873k2468j05359h316b911j50846P574k37954a71148j29111A04918
9708e2318c809r9853M0344k98758A51511f315A38157b96996D5220A7982i5130
9696D445a10370K0139A21270e0563I5286b9083j56399E2908J353C864d7161A41878
9683B21800j08179a70738d3743j86746a8050l3797A00640a64897B282a2970h8
9671b06194e1939A68594a07142l05259J99668B97601i2520A9035J24057F1368
$$ plain form
9756 60070 -325077 -85381 15971 -154066 38897 127475 139060 66952 -109347 -88611 45969
9744 14262 -49001 -292080 105622 309022 -67301 -140729 -132515 48941 -53788 4019 -4466 157036
9731 -154596 3394 -297153 -102825 -229101 -77652 245858 73638 -66395 -168823 9116 199069
9720 199069 -210873 -233341 -338700 -8316 -2911 -153757 -146183 -384137 -171148 -300259 104918
9708 -52318 -3809 -103662 -63318 -362076 151511 -6315 138157 -296996 45220 17982 -95130
9696 4445 -110370 -90231 121270 -50563 95286 -29083 -185482 52908 54261 3864 -47161 141878
9683 221800 113621 -170738 -43743 -230489 -18050 -51847 100640 -164897 2282 -12970 -88
9671 -206194 -51939 168594 -107142 -412401 -212733 297601 -92520 19035 143092 61368
9660b9240q2455L9846B80485a54324k65498a8169A21150d08916B59390H7671K9609
9649A17280D4179R6617c45182J01585l980b0832j94515A39657a00117A20250K08813
9638C29063a52752C44739j59021C0329b10703A56623I103a29060k60027a92796
9627a81757J9937j5791l9365D06548I7839D2174J15489c06166C5809J4774f6821
9615a36849A8802a95428j165G294a27415J4489d5463k50596A47066a53792M0416
9604a13376L5438p0832a8992j01915r4786D1080R4807f1233B18437b06426k5508
9593b31934g4158D7430J33468d5958k53897F4599a12297k20081A38322N3674b97033
9581b55247L8445m415C65772e8440G9040P6991Q300c01686G8045b4387A7830a47349
$$ plain form
9660 -29240 -111695 -71849 280485 -154324 -419822 -18169 121150 -408916 259390 87671 117280
9649 117280 44179 140796 -345182 -243597 -247577 -20832 -215347 139657 -100117 120250 329063
9638 329063 -152752 344739 185718 30329 -210703 156623 9103 -129060 -389087 -192796
9627 -181757 -161820 -177611 -216976 406548 97839 42174 157663 -306166 35809 50583 -66821
9615 -136849 18802 -195428 -196593 7294 -127415 -112926 -45463 -296059 147066 -153792 -113376
9604 -113376 -77938 -148770 -18992 -120907 -215693 41080 135887 -61233 218437 -206426 -231934
9593 -231934 -74158 47430 180898 -45958 -299855 64599 -112297 -332378 138322 191996 -297033
9581 -255247 -216802 -221217 365772 -58440 79040 156031 164331 -301686 78045 -24387 17830 -147349
9568a45966f5973b4681r3012A17657g886A0042a10748p2470Q4902B2067R7278
9557A19345a56513i310A53480b41635E265J9968d6025j42404l1804N3812K3542
9546a42879k3923L3436G033Q3527b67831O1581q3429F1234J84215i9379J8964
9535h0415J3904J6657B7198L2192a78302P8755A17067f206k1323j73689A50804
9523a15902m6956G131b84440R7191e4307q7885G5735a26782m857B8564K44568
9512B73132c219G1060f0379A55647n5073k7041a49572n7965h0873K8777o205D3284
9499a9771A39348a21402b3865B05936b8061C1495g3320B32346D9551f8951L1895
9488c7056C44741j41664c18226A15780E770a06420o2864O9951A79610K04816i8912
$$ plain form
9568 -145966 -65973 -24681 -117693 117657 -7886 10042 -110748 -183218 -98316 22067 119345
9557 119345 -156513 -9310 153480 -241635 5265 25233 -46025 -188429 -220233 -166421 -142879
9546 -142879 -166802 -133366 7033 90560 -267831 -206250 -289679 61234 245449 -99379 -80415
9535 -80415 -66511 -49854 27198 59390 -178302 -99547 117067 -6206 -27529 -201218 150804
9523 -115902 -162858 7131 -284440 -187249 -54307 -142192 75735 -126782 -131639 28564 273132
9512 273132 -3219 71060 -60379 155647 100574 73533 -149572 -207537 -80873 -52096 -58301 43284
9499 -19771 139348 -121402 -23865 205936 -28061 31495 -73320 232346 49551 -68951 -37056
9488 -37056 344741 203077 -318226 115780 5770 -106420 -169284 -99333 179610 384426 -98912
9476d3086B136J26784J91660a6258n7497C244J21109d8766A39292b17436g3782
9464d6076j48803d4566A019b21768C92173c09247J16026C9128a71341A53461b10530
9452f3192j81304p6798B2936b36519A87547b38797j10154a14383A2430P3761a98372
9440G4507a56564B29038j03524d94168K09416p12j99225b2885n8406L7862A40327
9428A70197n8556c07162b2380B11367a426j07338A46010b37525B46141F9092b33194
9416d59186A32410h7156n5463d5028o3775k62149I4860J038c13506E0609a1875
9404a93982c4343k25702F6996J61136N0979n8548a61105G0756K15094i3427B8486
9392e3417I7187c7547k09144n7966b3638C05744e41561c7020k63203g4956B60865
$$ plain form
9476 -43086 2136 128920 320580 -16258 -73755 3244 124353 -48766 139292 -217436 -73782
9464 -46076 -194879 -44566 1019 -221768 392173 -309247 -193221 39128 -171341 153461 -210530
9452 -63192 -244496 -321294 22936 -236519 187547 -238797 -348951 -114383 12430 86191 -198372
9440 74507 -156564 229038 125514 -494168 -284752 -285464 -484689 -22885 -81291 -43429 140327
9428 170197 111641 -307162 -22380 211367 -1426 -108764 146010 -237525 246141 69092 -233194
9416 -459186 132410 -87156 -142619 -45028 -108803 -370952 94860 95898 -313506 50609 -11875
9404 -193982 -34343 -260045 66996 228132 279111 220563 -161105 70756 285850 -93427 28486
9392 -53417 97187 -37547 -246691 -304657 -23638 305744 -541561 -37020 -300223 -74956 260865
9380B19166a50689B79668G3252g2192B134b48266R7097c1722o1087j76607a07409
9368a33976K6400I2233a15289j48644r4654A555a3302j7745j5603C05817m4734
9357B61083g7087K6837n0187E8979g5396b0244C0782b0902j21513j20139B36221
9345h7383j19712J00255c9970J8637l13762J26109e0677l8111b526n0945j79298
9334b32769A76617i4409j29219D1725A4244d26105D8958i5941Q962n7371l84377
9323e28727B62488C274a293j60823p945B53501A4263c68284B0010b52981O9225
9312a83756g4115B5861Q1199J15214g8205K2459A76184p6215a06446j42517k33099
9301d82062a92555c9809J8548E403L7433c11218A21088b60614H9048I415J79418
$$ plain form
9380 219166 -150689 279668 73252 -72192 2134 -248266 -151169 -31722 -92809 -269416 -107409
9368 -133976 -107576 92233 -115289 -263933 -358587 1555 -13302 -31047 -46650 305817 261083
9357 261083 -77087 -50250 -100437 58979 -75396 -20244 30782 -20902 -142415 -262554 236221
9345 -87383 -207095 -106840 -39970 -21333 -335095 -208986 -50677 -88788 -2526 -53471 -232769
9334 -232769 176617 -94409 -223628 41725 14244 -426105 48958 -95941 -86979 -144350 -528727
9323 -528727 262488 3274 -1293 -162116 -170061 253501 14263 -368284 20010 -252981 -183756
9312 -183756 -74115 25861 107060 222274 -78205 -55746 176184 99969 -106446 -248963 -482062
9301 -482062 -192555 -39809 -21261 5403 42836 -311218 121088 -260614 89048 9415 188833
9290A88833r2234a10790F4179a64991A73394P96q3767a73529l369D3729c17617
9278B83597G699K11506q5077C3260b0909l14030C69898b74279A82161n3444E5674
9266i2296A23575c11588b6629l06717a18111j93900B25978q5813d7349B3762b76114
9254H0867b78754d9197j18074P0376n0903E9349J23147E2240J36847c00492C84178
9242A48217q863A6232a36798E4558N5921l4069A5549b41183j08037K1944N3173
9231b74103K7291A95174G946a59996A10335C1193J70353b61698i2444j76212J16480
9220a52176e3007j91203A30951P4694a41378C7405b9851E5983f5179m43199b38794
9208g6816j52800D501a65880A17271a29248j52624L3767A29674a43278k342H2443
$$ plain form
9290 188833 96599 -110790 64179 -164991 173394 174190 90423 -173529 -176898 43729 -317617
9278 283597 7699 219205 134128 33260 -20909 -334939 369898 -274279 182161 128717 55674
9266 -92296 123575 -311588 -26629 -333346 -118111 -312011 225978 140165 -47349 23762 -276114
9254 80867 -278754 -49197 -167271 -96895 -147798 59349 182496 52240 189087 -300492 384178
9242 148217 139354 16232 -136798 54558 110479 76410 15549 -241183 -349220 -327276 -274103
9231 -274103 -246812 195174 7946 -159996 110335 31193 201546 -261698 -92444 -268656 -152176
9220 -152176 -53007 -244210 130951 205645 -141378 37405 -29851 55983 -65179 -508378 -238794
9208 -76816 -229616 4501 -165880 117271 -129248 -281872 -248105 129674 -143278 -145620 82443
9196B96492i8397A75699o30a61501d8207G0415c4824j13647B30902O0782H488
9184g8538A85553a97875b3743b763B9330N3388K69845a1293I2001O1969F4037
9172I8853a15613M6358j0485F1991N6377L8217a9377j38363g2500j24582J0477
9161a86605A00655O7776d2460J1260A938Q1169J84999j11381C695e3736j47266
9150b01002d149A94599c5796j37397G7510f3040A9331d1282I2704c10509A85367
9138H2391c29354B19784b6177A84174a87509F9928c22998B75477b54936b5240
9127a08647n0977K6385c6213j33490A0815a76716j43346c7291a8639B0249M2539
9116F2788f6397F0162L8284b04752B07894L6424a7960C02485C2444E928c7363
$$ plain form
9196 296492 -98397 175699 175069 -161501 -48207 70415 -34824 -148471 230902 291684 8488
9184 -78538 185553 -197875 -23743 -2763 29330 82718 352563 -11293 92001 153970 64037
9172 98853 -115613 -69255 -79740 61991 118368 156585 -19377 -157740 -72500 -197082 -186605
9161 -186605 100655 168431 -42460 -31200 1938 83107 268106 156725 3695 -53736 -201002
9150 -201002 -4149 194599 -35796 -173193 77510 -63040 19331 -41282 92704 -310509 185367
9138 82391 -329354 219784 -26177 184174 -187509 69928 -322998 275477 -254936 -25240
9127 -108647 -159624 -133239 -36213 -169703 10815 -176716 -320062 -37291 -18639 20249 62788
9116 62788 -66397 60162 98446 -204752 207894 244318 -17960 302485 32444 5928 -37363
9104a14441r6965B06022b09920j11087K9577d5994k75126A08312C8073b53914
9093f4872o5600L8473A41118j8522a147A99438b02937c5208n2810k23477f8752
9081g7737I5599b5264J0141j31430l5349N9177A06107a72336n9709A7222c70994
9069A17318P058e7359j38371A29488k4748b44135j63861i4164A09848m6362Q0004
9058A43490B3040a53502b5411A21385a19808l4731C03931d9373m4757k99932J16821
9047b77241c2714l8224G0453d0151n7707A35451a88545r2356C9317P8574a13031
9035A25060i9396j90025J15694k12572A5926b30487j60047e4490J6001l6477j10293
9024a85259A38567A4269c34397o5023a49778B16459n6195J963a11287b4189A47143
$$ plain form
9104 -114441 -211406 206022 -209920 -321007 -291430 -45994 -321120 108312 38073 -253914
9093 -64872 -130472 -91999 141118 122596 -1147 199438 -202937 -35208 -88018 -311495 -68752
9081 -77737 95599 -25264 -15123 -146553 -181902 -122725 106107 -172336 -232045 17222 -370994
9069 117318 124376 -57359 -195730 129488 104740 -244135 -407996 -94164 109848 63486 143490
9058 143490 23040 -153502 -25411 121385 -119808 -154539 303931 -49373 -94130 -394062 -277241
9047 -277241 -32714 -70938 70453 -40151 -97858 135451 -188545 -280901 39317 117891 -113031
9035 125060 -99396 -289421 -173727 -386299 15926 -230487 -390534 -54490 -38489 -74966 -185259
9024 -185259 138567 14269 -334397 -399420 -149778 216459 160264 162227 -111287 -24189 147143
9012A42231F3262a4997j03783b7874k87417b5741A85165q2395a29427k9686J2678
9001a46435k82771J00984J17330j5370f7824I6639a40220o5265F1410c93061i7377
8989a45472f9218a4624j68456b1848g957o3548l65609d7187J5557A70708c4469
8977d413k62322A243h0231j48A99955d82j857l5090A65303J91454a83654B8398
8964F5968B434J65346q0166J61243a57094A49435m6267a20487k42016a10872G3731
8952d32386A75367o8237a45575B3541h4767k22477f7541n2954E3742N3436b83505
8940A31903a5513j42978j97629H9556a29866d8654D4859L46420b59111d3732j50016
8929a93748B74566a33340A6010J23488K93431K12809J581574K313464J313707
$$ plain form
9012 142231 63262 -14997 -118780 -27874 -315291 -25741 185165 102770 -129427 -159113 -146435
9001 -146435 -429206 -328222 -210892 -226262 -67824 96639 -140220 -205485 61410 -393061 -97377
8989 -145472 -69218 -14624 -183080 -21848 -7957 -71505 -437114 -47187 -31630 170708 -34469
8977 -4413 -266735 1243 -80231 -80379 199955 -482 -2339 -37429 165303 356757 -183654 28398
8964 65968 2434 167780 87614 248857 -157094 149435 103168 -120487 -362503 -110872 73731
8952 -432386 175367 107130 -145575 23541 -84767 -307244 -67541 -120495 53742 107178 -283505
8940 131903 -15513 -158491 -356120 89556 -129866 -48654 44859 391279 -259111 -43732 -193748
8929 -193748 274566 -133340 16010 139498 432929 645738 2227312 4540776 5854483
8920E854483B054501D38591A31485l78b44230B73654h826j9697B39600a45683
8909a86817D1875J1227b9646j29609c8677B1096r757b26444A11545a10484c3938
8897B7807A1062a89525D1528e0682B48187g7622j04873g4527a1814E6628b72575
8885b84350Q3268A38024L1321l2865d8341B5077f7583A75572A7224c05578A05765
8873B11748D1679c74750H5050a91020A23943a60601c7690k87707J07986i0192
8862a40781C64910c06063A12629D603a7524q7595b4165B37839a25251N151K0725
$$ plain form
8920 5854483 2054501 438591 131485 131107 -244230 273654 -8826 -28523 239600 -145683
8909 -186817 41875 53102 -29646 -159255 -38677 21096 11339 -226444 111545 -110484 -33938
8897 27807 11062 -189525 41528 -50682 248187 -77622 -182495 -74527 -11814 56628 -272575
8885 -284350 -201082 138024 169345 136480 -48341 25077 -67583 175572 17224 -305578 105765
8873 211748 41679 -374750 85050 -191020 123943 -160601 -37690 -325397 -217411 -90192
8862 -140781 364910 -306063 112629 4603 -17524 -105119 -24165 237839 -125251 -120100 -99375
$$ [...]
##END NTUPLES=NMR SPECTRUM
##END=
