
##TITLE=AC1259_UGARH11076_6534370_Ws4MSD9MfT
##JCAMPDX= 6.0         $$ Bruker NMR JCAMP-DX V2.0
##DATA TYPE= NMR SPECTRUM
##DATA CLASS= NTUPLES
##ORIGIN= BRUKER
##OWNER= Administrator
$$ 1.72 TOPSPIN		Version 2.1
$$ 2012-07-17 04:17:44.359 -0500  Administrator@TOPSPIN
$$ Compression mode = diff/dup
##.OBSERVE FREQUENCY= 400.02188249412
##.OBSERVE NUCLEUS= ^1H
##.ACQUISITION MODE= SIMULTANEOUS (DQD)
##.ACQUISITION SCHEME= undefined
##.AVERAGES= 64
##.DIGITISER RES= 22
##SPECTROMETER/DATA SYSTEM= spect
##.PULSE SEQUENCE= noesygpps1d.comp
##.SOLVENT NAME= COFFEE_meoh
##.SHIFT REFERENCE= INTERNAL, COFFEE_meoh, 1, 14.96094
##AUDIT TRAIL= $$ (NUMBER, WHEN, WHO, WHERE, PROCESS, VERSION, WHAT)
$$ ##TITLE= Audit trail, TOPSPIN		Version 2.1
$$ ##JCAMPDX= 5.01
$$ ##ORIGIN= Bruker BioSpin GmbH
$$ ##OWNER= Administrator
$$ $$ C:\Bruker\TOPSPIN/data/COFFEE/nmr/AC1259_UGARH11076_6534370_Ws4MSD9MfT/12/pdata/1/auditp.txt
$$ ##AUDIT TRAIL=  $$ (NUMBER, WHEN, WHO, WHERE, PROCESS, VERSION, WHAT)
(   1,<2012-07-17 04:17:39.671 -0500>,<Administrator>,<TOPSPIN>,<go>,<TOPSPIN 2.1>,
      <created by zg
	started at 2012-07-17 04:06:09.484 -0500,
	POWCHK enabled, PULCHK disabled,
       configuration hash MD5:
       6B 1B 68 BB D9 2E 58 E2 7F 35 AD 54 07 DF 0E 41
       data hash MD5: 64K
       78 90 27 A7 A0 88 83 4E AF 27 6E DD 9B 52 25 1A>)
(   2,<2012-07-17 04:17:42.390 -0500>,<Administrator>,<TOPSPIN>,<proc1d>,<TOPSPIN 2.1>,
      <Start of raw data processing
       efp LB = 0.3 FT_mod = 6 PKNL = 1 PHC0 = 0 PHC1 = 0 SI = 128K 
       data hash MD5: 128K
       39 F5 5E B8 F3 2C DC 28 BD C4 FF 8B D4 7C 74 6B>)
(   3,<2012-07-17 04:17:43.531 -0500>,<Administrator>,<TOPSPIN>,<proc1d>,<TOPSPIN 2.1>,
      <pk PHC0 = 2.664185 PHC1 = 0 
       data hash MD5: 128K
       9C 9C E3 CC A7 9C 7E 46 06 89 24 31 D5 73 1E 99>)
(   4,<2012-07-17 04:17:43.796 -0500>,<Administrator>,<TOPSPIN>,<proc1d>,<TOPSPIN 2.1>,
      <abs ABSG = 1 
       data hash MD5: 128K
       30 CD C7 41 00 7E 8E 66 BA 2F AF D3 2B 99 97 00>)
(   5,<2012-07-17 04:17:43.875 -0500>,<Administrator>,<TOPSPIN>,<proc1d>,<TOPSPIN 2.1>,
      <abs ABSG = 2 
       data hash MD5: 128K
       8E 74 62 70 A4 18 3E B9 D7 2C 4E 40 6E E1 6C 03>)
(   6,<2012-07-17 04:17:44.171 -0500>,<Administrator>,<TOPSPIN>,<proc1d>,<TOPSPIN 2.1>,
      <abs ABSG = 3 
       data hash MD5: 128K
       24 23 A2 99 76 92 32 E1 45 A0 AD 46 CA 35 13 75>)
(   7,<2012-07-17 04:17:44.218 -0500>,<Administrator>,<TOPSPIN>,<proc1d>,<TOPSPIN 2.1>,
      <abs ABSG = 4 
       data hash MD5: 128K
       DF 54 00 A4 FA 39 95 40 4E C4 F4 84 9C B3 E0 AC>)
(   8,<2012-07-17 04:17:44.281 -0500>,<Administrator>,<TOPSPIN>,<proc1d>,<TOPSPIN 2.1>,
      <abs ABSG = 5 
       data hash MD5: 128K
       58 28 D5 46 1E 7F 2D 73 22 A8 E0 93 B4 B4 83 E6>)
$$ ##END=
$$ 
$$ $$ hash MD5
$$ $$ E0 6E 2B B4 11 6E 31 68 11 64 1E 6C 67 B7 8B D5
##$RELAX= 
##$RELAX= 
##$RELAX= 
##$RELAX= 
##$RELAX= 
##$RELAX= 
##$RELAX= 
##$RELAX= 
$$ Bruker specific parameters
$$ [...]
##$TP07= 0
##$TPNAME0= <>
##$TPNAME1= <>
##$TPNAME2= <>
##$TPNAME3= <>
##$TPNAME4= <>
##$TPNAME5= <>
##$TPNAME6= <>
##$TPNAME7= <>
##$TPOAL= (0..7)
0.5 0.5 0.5 0.5 0.5 0.5 0.5 0.5
##$TPOFFS= (0..7)
0 0 0 0 0 0 0 0
##$TUNHIN= 0
##$TUNHOUT= 0
##$TUNXOUT= 0
##$USERA1= <user>
##$USERA2= <user>
##$USERA3= <user>
##$USERA4= <user>
##$USERA5= <user>
##$V9= 5
##$VALIST= <valist>
##$VCLIST= <CCCCCCCCCCCCCCC>
##$VD= 0
##$VDLIST= <DDDDDDDDDDDDDDD>
##$VPLIST= <PPPPPPPPPPPPPPP>
##$VTLIST= <TTTTTTTTTTTTTTT>
##$WBST= 2048
##$WBSW= 25
##$XGAIN= (0..3)
0 0 0 0
##$XL= 0
##$YL= 0
##$YMAX_a= 11628012
##$YMIN_a= -8219765
##$ZGOPTNS= <>
##$ZL1= 120
##$ZL2= 120
##$ZL3= 120
##$ZL4= 120
##$ABSF1= 14.96094
##$ABSF2= -5.597241
##$ABSG= 5
##$ABSL= 3
##$ALPHA= 0
##$AQORDER= 0
##$ASSFAC= 0
##$ASSFACI= 0
##$ASSFACX= 0
##$ASSWID= 0
##$AUNMP= <proc_prof1d_extract.lims>
##$AXLEFT= 0
##$AXNAME= <>
##$AXNUC= <1H>
##$AXRIGHT= 0
##$AXTYPE= 0
##$AXUNIT= <>
##$AZFE= 0.1
##$AZFW= 0.1
##$BCFW= 0
##$BC_mod= 0
##$BYTORDP= 0
##$COROFFS= 0
##$CY= 15
##$DATMOD= 1
##$DC= 0
##$DFILT= <>
##$DTYPP= 0
##$F1P= 0
##$F2P= 0
##$FCOR= 0.5
##$FTSIZE= 131072
##$FT_mod= 6
##$GAMMA= 0
##$GB= 0
##$INTBC= 1
##$INTSCL= 1
##$ISEN= 128
##$LB= 0.3
##$LEV0= 0
##$LPBIN= 0
##$MAXI= 10000
##$MC2= 0
##$MEAN= 0
##$ME_mod= 0
##$MI= 0
##$NCOEF= 0
##$NC_proc= -2
##$NLEV= 6
##$NOISF1= 0
##$NOISF2= 0
##$NSP= 0
##$NTH_PI= 0
##$NZP= 0
##$OFFSET= 14.96094
##$PC= 1
##$PHC0= 2.664185
##$PHC1= 0
##$PH_mod= 1
##$PKNL= yes
##$PPARMOD= 0
##$PPDIAG= 0
##$PPIPTYP= 0
##$PPMPNUM= 2147483647
##$PPRESOL= 1
##$PSCAL= 4
##$PSIGN= 0
##$PYNMP= <proc.py>
##$REVERSE= no
##$SF= 400.020009661733
##$SI= 131072
##$SIGF1= 0
##$SIGF2= 0
##$SINO= 400
##$SIOLD= 131072
##$SPECTYP= <>
##$SREGLST= <1H.CDCl3>
##$SSB= 0
##$STSI= 131072
##$STSR= 0
##$SW_p= 8223.68421052631
##$SYMM= 0
##$S_DEV= 0
##$TDeff= 65536
##$TDoff= 0
##$TI= <>
##$TILT= no
##$TM1= 0
##$TM2= 0
##$TOPLEV= 0
##$USERP1= <user>
##$USERP2= <user>
##$USERP3= <user>
##$USERP4= <user>
##$USERP5= <user>
##$WDW= 1
##$XDIM= 131072
##$YMAX_p= 392145910
##$YMIN_p= -12350
##$CURPLOT= <Network HP LaserJet P1505>
##$CURPRIN= <$Network HP LaserJet P1505>
##$DFORMAT= <normdp>
##$LAYOUT= <+/1D_H.xwp>
##$LFORMAT= <normlp>
##$PFORMAT= <normpl>
##$SURQMSG= 1
$$ End of Bruker specific parameters
$$ ---------------------------------
##NTUPLES= NMR SPECTRUM
##VAR_NAME=  FREQUENCY,     SPECTRUM/REAL,   SPECTRUM/IMAG
##SYMBOL=    X,             R,               I
##VAR_TYPE=  INDEPENDENT,   DEPENDENT,       DEPENDENT
##VAR_FORM=  AFFN,          ASDF,            ASDF
##VAR_DIM=   131072,        131072,          131072
##UNITS=     HZ,            ARBITRARY UNITS, ARBITRARY UNITS
##FACTOR=    0.0627417313425164, 1,          1
##FIRST=     8223.62146879497, 3647,         -50444
##LAST=      0,             5016,            -50438
##MIN=       0,             -12350,          0
##MAX=       8223.62146879497, 392145910,    0
$$ Real data points
##PAGE= N=1
##DATA TABLE= (X++(R..R)), XYDATA
$$ [...]
63865D62882Q34K451L653M791O192P719R124J0557J2452J4946J7778K0651K3420
63852E97450K5851K7635K8761K9657L0731L1941L2896L3305L3180L2661L1728
63841I35796L0193K8042K5682K3514K1152J7565J2353O492J358k839o941j1401
63829A080966j5705j9295k2294k4994k7299k9155l0995l3261l5668l7450l8119
63818G66731l7715l6551l5017l3446l1814k9793k7385k5188k3597k2098j9880
63807D44247j7096j4829j3751j3289j2429j0943r471q541p932p101n956m942m378
63794C13589m054l650l334l534m239m917n213n316n471n475m980m045l117k582
63780B53662k511k688k775k574k240k064k055j980j836j856j945j612o98K81Q17
$$ plain form
63865 462882 463716 466167 469820 474611 480803 488522 497646 508203 520655 535601 553379 574030 597450
63852 597450 623301 650936 679697 709354 740085 772026 804922 838227 871407 904068 935796
63841 935796 965989 994031 1019713 1043227 1064379 1081944 1094297 1100789 1102147 1099308 1092367 1080966
63829 1080966 1065261 1045966 1023672 998678 971379 942224 911229 877968 842300 804850 766731
63818 766731 729016 692465 657448 624002 592188 562395 535010 509822 486225 464127 444247
63807 444247 427151 412322 398571 385282 372853 361910 352439 343898 335966 328865 322909 317967 313589
63794 313589 309535 305885 302551 299017 294778 289861 284648 279332 273861 268386 263406 259361 256244 253662
63780 253662 251151 248463 245688 243114 240874 238810 236755 234775 232939 231083 229138 227526 226828 227109 227926
63765B27926R56Q48L25n71j167r57m45m83r90j123n85M4K95L99O92J032J079P35
63747B28010J57l67m92j63J71L9l15k01N57J427J995K378K659K582K071J543J396
63730B43447J533J718J989K417K821L071L312L656L955M135M407M896N328N415
63716B92100N219M850M207L291K487K050J632P01p05k092l103l630l565k863j829
63701B98750j006p53j128j971k858l196k734j789p32M04J459J805J110J63J22
63686B87646J031J892K189K389K763K674J653M08K6N71J258J691K152K710K912
63671C13965K576K242K470L081L547L837M354N130N566N152M115L058K164J103
63657C62360k81j633k589l336m272n294n859n792n581n645n697n159m022k898
$$ plain form
63765 227926 228882 229730 230055 229484 228317 227360 226915 226432 225442 224319 223734 223778 224073 224472 225164 226196 227275 228010
63747 228010 228167 227800 227308 227145 227316 227355 227040 226839 227396 228823 230818 233196 235855 238437 240508 242051 243447
63730 243447 244980 246698 248687 251104 253925 256996 260308 263964 267919 272054 276461 281357 286685 292100
63716 292100 297319 302169 306376 309667 312154 314204 315836 316537 315832 313740 310637 307007 303442 300579 298750
63701 298750 297744 296991 295863 293892 291034 287838 285104 283315 282583 282987 284446 286251 287361 287524 287646
63686 287646 288677 290569 292758 295147 297910 300584 302237 302645 302671 303242 304500 306191 308343 311053 313965
63671 313965 316541 318783 321253 324334 327881 331718 336072 341202 346768 351920 356035 359093 361257 362360
63657 362360 362079 360446 357857 354521 350249 344955 339096 333304 327723 322078 316381 311222 307200 304302
63643C04302k290k089j866j378o85N8Q01J621K597L608M311M489M415M637N393
63628C27924O336O907O815O117N126M364M399N314O448O972O847O941Q061J0089
63614D18660J2208J3874J5278J6894J8830K0821K2654K4424K6345K8469L0633
63603F49090L2558L3944L4514L4051L2416K9507K5306K0015J4056P882J834l755
63591I11418q403j1647j3395j4023j4125j4252j4771j5759j6967j8073j9002j9825
63579G31176k0393k0286j9220j7366j5184j3157j1567j0304q810o606l926j478
63567E82879M70K308M233N794O630P094P585P778P198O162N429N210N302N944
63553F60016P495R340J0262J0168J0483J2409J5658J9285K2970K6827L0693L4373
$$ plain form
63643 304302 302012 299923 298057 296679 295994 296052 296853 298474 301071 304679 308990 313479 317894 322531 327924
63628 327924 334260 341167 347982 354099 359225 363589 367988 373302 379750 386722 393569 400510 408571 418660
63614 418660 430868 444742 460020 476914 495744 516565 539219 563643 589988 618457 649090
63603 649090 681648 715592 750106 784157 816573 846080 871386 891401 905457 913339 915173 911418
63591 911418 903015 891368 877973 863950 849825 835573 820802 805043 788076 770003 751001 731176
63579 731176 710783 690497 671277 653911 638727 625570 614003 603699 594889 588283 584357 582879
63567 582879 583349 585657 589890 595684 602314 609408 616993 624771 631969 638131 643560 648770 654072 660016
63553 660016 667511 676851 687113 697281 707764 720173 735831 755116 778086 804913 835606 869979
63541H69979L8063M1799M4724M5446M2893L6523K6453J4056J947p577j3980j8015
63529A122311k0248k0763j9939j8589j7358j6605j6781j8191k0488k2977k5389
63518I04983k7718k9525l0165k9697k8809k7757k6149k3826k1289j9020j7027
63507F24001j5172j3418j1611r608p734o540o059n853n799o075o367o011n067
63494E18687m396m397m532m395m287m264l745k719k294l113m049l725k574k150
63480D68047k680k762j471M43J785K289K421K529K764L208L590L241J767l96k339
63465D82436l477l871l987m280m810n210n156m816m604m551m299l742l243l093
63451D23297l017k498j436k78M57O53O66R54J700K776L985N166O036O298O103
$$ plain form
63541 869979 908042 949841 994565 1040011 1082904 1119427 1145880 1159936 1161883 1154306 1140326 1122311
63529 1122311 1102063 1081300 1061361 1042772 1025414 1008809 992028 973837 953349 930372 904983
63518 904983 877265 847740 817575 787878 759069 731312 705163 681337 660048 641028 624001
63507 624001 608829 595411 583800 574192 566458 559918 553859 548006 542207 536132 529765 523754 518687
63494 518687 514291 509894 505362 500967 496680 492416 488671 485952 483658 480545 476496 472771 470197 468047
63480 468047 465367 462605 461134 461577 463362 465651 468072 470601 473365 476573 480163 483404 485171 484775 482436
63465 482436 478959 475088 471101 466821 462011 456801 451645 446829 442225 437674 433375 429633 426390 423297
63451 423297 420280 417782 416346 416068 416525 417178 417844 418798 420498 423274 427259 432425 438461 444759 450862
63436D50862O202P322R489J2178J4986J7968K1450K5716L0634L5315L8270L8313
63424G08705L5296K9889K3037J5912R992O365N055N485P522J1407J6766K2440
63412H97871K7478L1678L4949L6765L6534L4027K9175K2050J3413M760k671q596
63400A157433j3151j6225j7873j8829j9901k1124k2152k3230k4910k7002k8585
63389I24451k9217k9312k9191k8479k6794k4411k1770j8927j5948j3361j1610
63378F75431j0302q639o445m256k480j019L55J771L402N345P235Q435Q888R339
63364F87060J0533J2466J4572J6346J7582J8405J9295K0797K2877K4887K6464
63353H91284K8125L0552L3550L6233L7978L8575L7529L3955K7551J9230J0533
$$ plain form
63436 450862 457064 464386 473875 486053 501039 519007 540457 566173 596807 632122 670392 708705
63424 708705 744001 773890 796927 812839 822831 829196 834251 839736 847258 858665 875431 897871
63412 897871 925349 957027 991976 1028741 1065275 1099302 1128477 1150527 1163940 1168700 1166029 1157433
63400 1157433 1144282 1128057 1110184 1091355 1071454 1050330 1028178 1004948 980038 953036 924451
63389 924451 895234 865922 836731 808252 781458 757047 735277 716350 700402 687041 675431
63378 675431 665129 656490 650045 645789 643309 642290 642645 644416 647818 653163 660398 668833 677721 687060
63364 687060 697593 710059 724631 740977 758559 776964 796259 817056 839933 864820 891284
63353 891284 919409 949961 983511 1019744 1057722 1096297 1133826 1167781 1195332 1214562 1225095
63342A225095K638l975r220j3183j6089j8231j9912k1338k2530k3357k3919k4726
63330A031253k6224k8214l0038l1295l1969l1839l0419k7719k4510k1509j8654
63319G28863j5584j2377r268n941j891K459N577O005L521r65o218j1211j5188
63306F67782j7731j8857j8868j8010j6394j4333j2538j1677j1633j1561j0815
63295E05365r705q984q859q832q451p755o971o224n616n200m815m292l931m250
63281D11480n117n714n567n058m590l896k744j717j552k019k225j887j543j565
63267C66286j672j581j488j646j928k060k011j965k094k413k699k562j859j001
63253C39307n70o98j087j439j514r61K56J347J263Kj243j435p83j58K1o9j99k94
$$ plain form
63342 1225095 1227733 1223758 1214538 1201355 1185266 1167035 1147123 1125785 1103255 1079898 1055979 1031253
63330 1031253 1005029 976815 946777 915482 883513 851674 821255 793536 769026 747517 728863
63319 728863 713279 700902 691634 685693 683802 686261 691838 697843 701364 700399 694181 682970 667782
63306 667782 650051 631194 612326 594316 577922 563589 551051 539374 527741 516180 505365
63295 505365 495660 486676 477817 468985 460534 452779 445808 439584 433968 428768 423953 419661 415730 411480
63281 411480 406363 400649 395082 390024 385434 381538 378794 377077 375525 373506 371281 369394 367851 366286
63267 366286 364614 363033 361545 359899 357971 355911 353900 351935 349841 347428 344729 342167 340308 339307
63253 339307 338737 338039 336952 335513 333999 333038 333294 334641 335904 335906 334663 333228 332445 332287 332308 332239 332040 331746
63235C31746k13J41N98Q38P90O53N95O06O29O41N95N01N31R08J576K031J780J029
63217C45975P28J585L057L781L235K437K575L357L447K385J221J151K127L223
63203C80284L761L782L726M067M940N836N961N148M159L743L818L912M069M762
63189D41968O082P530Q664R492J0237J1036J1959J3063J4269J5383J6261J6854
63177E82798J7156J7243J7279J7312J7109J6413J5275J3941J2534J1053R633Q470
63165G56216P480O377N067L700K221K58k463n795r397j3013j6316j8787k0129
63152F95419k0691k1188k1878k2296k1794k0288j8334j6628j5405j4323j2907
63141D89687j1117r374q025o974n996n155m627m162l157j424M59J757K256K240
$$ plain form
63235 331746 331533 331674 332272 333110 333900 334553 335148 335754 336383 337024 337619 338120 338651 339559 341135 343166 344946 345975
63217 345975 346703 348288 351345 355126 358361 360798 363373 366730 370177 372562 373783 374934 377061 380284
63203 380284 384045 387827 391553 395620 400560 406396 412357 417505 421664 425407 429225 433137 437206 441968
63189 441968 448050 455580 464244 473736 483973 495009 506968 520031 534300 549683 565944 582798
63177 582798 599954 617197 634476 651788 668897 685310 700585 714526 727060 738113 747746 756216
63165 756216 763696 770073 775140 778840 781061 781319 778856 773061 763664 750651 734335 715548 695419
63152 695419 674728 653540 631662 609366 587572 567284 548950 532322 516917 502594 489687
63141 489687 478570 469196 461171 454197 448201 443046 438419 434257 431100 429676 430135 431892 434148 436388
63127D36388K064K079K678L876N005N289M785M352M577N138N438N415N430N646
63113D98160N937O254O639O927O796O224N663N536N729N676N022M110L698M130
63099E76501M901N206M870M424M294M311M241M401N260O625P677P918P700P635
63085F55964P746P417O148M149K116N33p26k041l586n302p172r126j0758j1575
63071F33787j1583j1227j0700r772q527p651p562p687p198o098n043m302l599
63058E32838k818k164j624r20j05M30P10J416L009N074O800P743P931P555O926
63043E72801O499O610P229Q101Q888R200Q837Q198Q084Q778R591R631Q836P880
63029F89163P208O601N688M512L357K268J025m30j795k743l299l691l949l948
$$ plain form
63127 436388 438452 440531 443209 447085 452090 457379 462164 466516 471093 476231 481669 487084 492514 498160
63113 498160 504097 510351 516990 523917 530713 536937 542600 548136 553865 559541 564563 568673 572371 576501
63099 576501 581402 586608 591478 595902 600196 604507 608748 613149 618409 625034 632711 640629 648329 655964
63085 655964 663710 671127 677275 681424 683540 684073 683347 681306 677720 672418 665246 656120 645362 633787
63071 633787 622204 610977 600277 590505 581978 574327 566765 559078 551880 545782 540739 536437 532838
63058 532838 530020 527856 526232 525312 525207 525637 526347 527763 530772 535846 542646 550389 558320 565875 572801
63043 572801 579300 585910 593139 601240 610128 619328 628165 636363 644447 653225 662816 672447 681283 689163
63029 689163 696371 702972 708660 713172 716529 718797 719822 719392 717597 714854 711555 707864 703915 699967
63015F99967l774l696l659l174k002n62O43J748L224N137P171R282J1711J4403
63001G36419J6946J9180K1404K3824K6146K7878K8687K8471K7438K6166K5180
62990A007739K4402K3401K2222K1439K1270K1183K0558J9234J7211J4393J1020
62979A224072P814N095K065k372q245j4384j9689k4050k8031l2016l5742l8531
62967A035986l9791l9470l8003l5952l3711l1496k9390k7326k5207k3161k1435
62956F91044k0028j8644j7118j5682j4637j3989j3527j3121j2742j2391j2114
62945E27051j1985j1966j1868j1523j0904j0122r414r023q900q627p915p053o535
62932D01216o346o041n411m658l947l304k951l108l446l313k689k282k458k728
$$ plain form
63015 699967 696193 692497 688838 685664 683662 683100 683743 685491 688715 693852 701023 710305 722016 736419
63001 736419 753365 772545 793949 817773 843919 871797 900484 928955 956393 982559 1007739
62990 1007739 1032141 1055542 1077764 1099203 1120473 1141656 1162214 1181448 1198659 1213052 1224072
62979 1224072 1231886 1236981 1239046 1236674 1228429 1214045 1194356 1170306 1142275 1110259 1074517 1035986
62967 1035986 996195 956725 918722 882770 849059 817563 788173 760847 735640 712479 691044
62956 691044 671016 652372 635254 619572 604935 590946 577419 564298 551556 539165 527051
62945 527051 515066 503100 491232 479709 468805 458683 449269 440246 431346 422719 414804 407751 401216
62932 401216 394870 388829 383418 378760 374813 371509 368558 365450 362004 358691 356002 353720 351262 348534
62918C48534k581k215j990j736j064n4Q31J222R59J41o50o16L49J409J783J602
62902C45924J421J415J501J770K250K624K717K945L693M558M895M855N213O218
62888C91999P294P885Q075Q184Q110P319N484L167J664J762K606K477Q17j184
62874D55659k350k978l943n215o208o980p976q854q737p586o327n543m922m150
62860C73890l515l405l736m119m211l865l307l028l073k786j829r81j080j599
62846C33356j379n71m47j253j649p95L46N03j35n59m59k16K1L00L44r3o25o82
62828C26007l46j9M12J326K451K944K487J704J307J287J098L63p71j735j961j335
62812C35219k76O38J000O35k62r85p69K64J054Q70K01j19j89o64j374j343k49
$$ plain form
62918 348534 345953 343738 341748 340012 338948 338894 339725 340947 341906 342047 341397 340781 341130 342539 344322 345924
62902 345924 347345 348760 350261 352031 354281 356905 359622 362567 366260 370818 375713 380568 385781 391999
62888 391999 399293 407178 415253 423437 431547 438866 444350 447517 449181 450943 453549 456026 456843 455659
62874 455659 453309 450331 446388 441173 434965 427985 420009 411155 402418 394832 388505 382962 378040 373890
62860 373890 370375 366970 363234 359115 354904 351039 347732 344704 341631 338845 337016 336035 334955 333356
62846 333356 331977 331406 330959 329706 328057 327262 327608 328111 327976 327417 326958 326742 326763 327063 327407 327314 326689 326007
62828 326007 325661 325642 326054 327380 329831 332775 335262 336966 338273 339560 340658 341021 340250 338515 336554 335219
62812 335219 334943 335581 336581 337216 336954 335969 335200 335464 336518 337388 337589 337470 337281 336617 335243 333900 333651
62795C33651J004J533J501J431J195M05o04j051q30o04p16p00q2R04J757K397
62779C41191K998L462L589L579L839M419M982N311N373N073M388L766L753M166
62765C99889M206L546K746K306J852P86p21j852k093j682j281j462k280l150l414
62750C97396l223l373m088m580m257l757m002m715m803l948k933k394k149j861
62736C47313j656j796k200k531k411j613l71N39N17q9l83lO91J331J845K109K003
62719C43295J839K101K730L261L673M386N398O222O797P599Q711R629J0299J1394
62705D27334J3054J4344J4711J5130J6956K0128K3494K6417K9105L1603L3502
62694F65778L4880L6599L9279M2462M5108M6667M7372M7667M7552M6464M3746
$$ plain form
62795 333651 334655 336188 337689 339120 340315 340720 340116 339065 338235 337631 336915 336215 336133 337037 338794 341191
62779 341191 344189 347651 351240 354819 358658 363077 368059 373370 378743 383816 388204 391970 395723 399889
62765 399889 404095 407641 410387 412693 414545 415331 414610 412758 410665 408983 407702 406240 403960 400810 397396
62750 397396 394173 390800 386712 382132 377875 374118 370116 365401 360598 356650 353717 351323 349174 347313
62736 347313 345657 343861 341661 339130 336719 335106 334735 335274 335791 335702 335319 335316 336007 337338 339183 341292 343295
62719 343295 345134 347235 349965 353226 356899 361285 366683 372905 379702 387301 396012 405641 415940 427334
62705 427334 440388 454732 469443 484573 501529 521657 545151 571568 600673 632276 665778
62694 665778 700658 737257 776536 818998 864106 910773 958145 1005812 1053364 1099828 1143574
62683A143574L9204L3230K6363J8858J0729K063o838j5574k3774l1151l7468m2489
62671A116727m6003m7991m8705m8504m7672m6422m4845m2726l9692l5880l2097
62660F36190k9027k6544k4209k2074k0347j8650j6404j3819j1665j0151q887p947
62648D26466p867q376q269p055n768n464n715n402m362l364k873k658k450k221
62634C54622j897j316n10L02R38J218R48K02o02j129j404j557j630j781k212k720
62618C41472k863k707k778l046k750j685q04q82j359j313q81p50q17m66J43K42
62602C18756k07m15j09M9l37p12m50K13N81M40K24M71J238K002K120J635J415
62585C26914K125L222L495K533J150K97O7l9l04n70o45o79j065j966k958l371
$$ plain form
62683 1143574 1182778 1216008 1242371 1261229 1271958 1274021 1267183 1251609 1227835 1196684 1159216 1116727
62671 1116727 1070724 1022733 974028 925524 877852 831430 786585 743859 704167 668287 636190
62660 636190 607163 580619 556410 534336 513989 495339 478935 465116 453451 443300 434413 426466
62648 426466 418599 410223 401954 394899 389131 383667 377952 372550 368188 364824 361951 359293 356843 354622
62634 354622 352725 351409 350899 351201 352139 353357 354305 354507 353905 352776 351372 349815 348185 346404 344192 341472
62618 341472 338609 335902 333124 330078 327328 325643 324839 323957 322598 321285 320404 319654 318837 318371 318514 318756
62602 318756 318549 318134 318025 318074 317737 317025 316575 316788 317369 317809 318033 318504 319742 321744 323864 325499 326914
62585 326914 329039 332261 335756 338289 339439 339736 339803 339764 339460 338890 338245 337566 336501 334535 331577 328206
62569C28206k993k249j575j050p16p99j295j772j969k127k295j903o60N95P61
62554C08159rm89L4J035J592J334N25k00k56K96O60L37m9M19J544K259K209K149
62536C21549K673L375L573L189K626K239K187K369K357J833J187J228K226L715
62522C56326N208O593P797Q711R545J0618J1708J2313J2637J3595J5541J7779
62510D88371J9722K1712K4160K6513K7853K8130K8152K8460K8733K8235K6524
62499G76565K3758K0532J7274J3774R566M832M42l007n719p968r417r606q612
62486H22414o760m039m22L553P198J0556J4195J8149K1627K3947K5176K5701K5503
62473I86798K4206K1556J7602J2535O672N67n254j0801j6670k3327l0323l6396
$$ plain form
62569 328206 325213 322964 321389 320339 319623 318824 317529 315757 313788 311661 309366 307463 306803 307398 308159
62554 308159 308150 307661 307695 308730 310322 311656 312181 311981 311725 312021 312681 313018 312969 313388 314932 317191 319400 321549
62536 321549 324222 327597 331170 334359 336985 339224 341411 343780 346137 347970 349157 350385 352611 356326
62522 356326 361534 368127 375924 384635 394180 404798 416506 428819 441456 455051 470592 488371
62510 488371 508093 529805 553965 580478 608331 636461 664613 693073 721806 750041 776565
62499 776565 800323 820855 838129 851903 861469 866301 866743 863736 858017 850049 840632 831026 822414
62486 822414 815654 811615 811193 814746 821944 832500 846695 864844 886471 910418 935594 961295 986798
62473 986798 1011004 1032560 1050162 1062697 1069369 1069936 1064682 1053881 1037211 1013884 983561 947165
62461I47165m0395m2096m2196m1721m1357m1071m0183l8053l4759l0991k7266
62450E27077k3641k0233j7583j6025j5045j3696j1525q811o136m029k817k439
62438C85097k488k730l220l731l543k349r06j71j67l71q36j899l104l410k620
62423C53552j598j072r78j116j499j811j511p20k17k60k02L05P18O21M40N73N89
62406C45814O8m98l92K26O32N64K65kQ5R46K403L373L012J870J227J585K536L688
62388C67402M863N632N557M998M809N247N754N961O183O794P673Q446Q907R048
62374D57274R125R705J1126J2862J3902J3941J3753J4187J5269J6573J7985J9745
62362F25447K1972K4570K7482L0665L3914L7017M0180M4040M9066N4965O0789
$$ plain form
62461 947165 906770 864674 822478 780757 739400 698329 658146 620093 585334 554343 527077
62450 527077 503436 483203 465620 449595 434550 420854 409329 400518 394382 390353 387536 385097
62438 385097 382609 379879 376659 372928 369385 367036 366130 365959 365792 365421 364585 362686 359582 356172 353552
62423 353552 351954 350882 349904 348788 347289 345478 343967 343247 343030 342770 342568 342873 343591 344212 344652 345225 345814
62406 345814 345882 345384 344992 345218 345850 346414 346679 346677 346762 347708 350111 353484 356496 358366 359593 361178 363714 367402
62388 367402 372265 377897 383454 388452 393261 398508 404262 410223 416406 423200 430873 439319 448226 457274
62374 457274 466399 476104 487230 500092 513994 527935 541688 555875 571144 587717 605702 625447
62362 625447 647419 671989 699471 730136 764050 801067 841247 885287 934353 989318 1050107
62351A050107O5559O8713O9981O9064O5676N9771N1564M1371K9686J7373N480
62340A594345n241j4542k2420k9033l4794m0115m4784m7959m9093m8639m7608
62329A210117m6547m5206m3107m0243l7202l4665l2711l0800k8604k6699k5958
62318H18375k6346k6806k6445k5285k3792k2261k0911j9890j8869j7272j5242
62307E75256j3719j3047j2263j0507q498p512p431o921n440l858k921k212j137
62294D79790l0M06K21J07M13Q82J271J745K534L522M334M724M745M578M345M175
62278E17762M230M528M780M720M544M678N094N369N519O216P809R646J0916J1728
62264F07539J2850J4643J6898J9495K2581K6151L0021L4274L9123M4383M9606
$$ plain form
62351 1050107 1115666 1184379 1254360 1323424 1389100 1448871 1500435 1541806 1571492 1588865 1594345
62340 1594345 1589104 1574562 1552142 1523109 1488315 1448200 1403416 1355457 1306364 1257725 1210117
62329 1210117 1163570 1118364 1075257 1035014 997812 963147 930436 899636 871032 844333 818375
62318 818375 792029 765223 738778 713493 689701 667440 646529 626639 607770 590498 575256
62307 575256 561537 548490 536227 525720 517222 509710 502279 495358 489918 486060 483139 480927 479790
62294 479790 479760 480166 480387 480494 480907 481789 483060 484805 487339 490861 495195 499919 504664 509242 513587 517762
62278 517762 521992 526520 531300 536020 540564 545242 550336 555705 561224 567440 575249 584895 595811 607539
62264 607539 620389 635032 651930 671425 694006 720157 750178 784452 823575 867958 917564
62253I17564N4755O0140O5511O9776P1833P1330O8374O2924N4837M4306L2002
62242A573352J8891N921o189j7029k6396l4241m0867m6861n2417n6920n9579o0417
62230A197248o0115n8965n6534n2571m7704m2960l8885l5311l1758k7958k4158
62219G20329k0989j8830j7243j5432j3221j1223r993r378q882q241p487o770o361
62206E66279o431o653o402n508m537l960l566l009k495k342k161j181N73K071
62192E20678K507K317K645M054O038P730Q791R541J0355J1161J1603J1613J1584
62179F20617J1854J2173J1966J1077J0012R329R028Q766Q506Q684R732J1711J4516
62166G57971J8149K2611K7689L3060L8503M3745M8241N1423N3109N3397N2083
$$ plain form
62253 917564 972319 1032459 1097970 1167746 1239579 1310909 1379283 1442207 1497044 1541350 1573352
62242 1573352 1592243 1598164 1591975 1574946 1548550 1514309 1473442 1426581 1374164 1317244 1257665 1197248
62230 1197248 1137133 1078168 1021634 969063 921359 878399 839514 804203 772445 744487 720329
62219 720329 699340 680510 663267 647835 634614 623391 613398 604020 595138 586897 579410 572640 566279
62206 566279 559848 553195 546793 541285 536748 532788 529222 526213 523718 521376 519215 518034 518607 520678
62192 520678 523185 525502 528147 532201 538239 545969 554760 564301 574656 585817 597420 609033 620617
62179 620617 632471 644644 656610 667687 677699 687028 696056 704822 713328 722012 731744 743455 757971
62166 757971 776120 798731 826420 859480 897983 941728 989969 1041392 1094501 1147898 1199981
62155A199981M8541M2302L3642K3522J3178L654m608j1834j8418k4363k9472l3863
62143A242262l7754m0714m1872m1164l9711l8461l7022l4406l0576k6495k2904
62132H51183j9674j6403j3066j0010p654o165n161l892k119n77q2l47l37K88P47
62117G66731L36n62j053q44m53m22o27l92Q09K732M612O072P565R604J1829J3145
62101H19082J2698J0369O631K396j120k985l128j968K16K989N031M708J758k171
62087H54506n072o226o092n194l592j175K066N958J0050J3711J6512J8534K0210
62074I14196K1967K3922K5754K6890K7193K7363K8281K9956L1541L2434L2885
62063A222382L3365L3979L4655L5476L6368L6895L6685L5700L3738L0032K3908
$$ plain form
62155 1199981 1248522 1290824 1324466 1347988 1361166 1364820 1360212 1348378 1329960 1305597 1276125 1242262
62143 1242262 1204508 1163794 1121922 1080758 1041047 1002586 965564 931158 900582 874087 851183
62132 851183 831509 815106 802040 792030 784376 778211 773050 769158 767039 766462 766380 766033 765696 765984 766731
62117 766731 767067 766505 765452 764608 764155 763733 763106 762714 763523 766255 770867 776939 784504 794108 805937 819082
62101 819082 831780 842149 848780 851176 850056 847071 843943 841975 842191 845180 850211 854919 856677 854506
62087 854506 849434 843208 837116 831922 828330 827155 829221 835179 845229 858940 875452 893986 914196
62074 914196 936163 960085 985839 1012729 1039922 1067285 1095566 1125522 1157063 1189497 1222382
62063 1222382 1255747 1289726 1324381 1359857 1396225 1433120 1469805 1505505 1539243 1569275 1593183
62052A593183J5677O590k057r507j5578k0516k4859k9068l3167l6808l9698m1878
62040A362314m3617m5048m5879m5681m4549m3123m1637l9378l5713l1446k8195
62029I18048k6355k4671k2106j9122j6627j4580j2604j1073j0493j0262r339p969
62017G32847p562q593r840j0068r538r192r133q720p769o802o172n651m902l918
62003F24987k793j533l03N02P58R81J821L207M334M536L928L034K127J120j03
61988F46603j609l485n616p451q460q856r436j0499j1409j1484j0905j0343r922
61975E37128r146p822o527n869n701n357m509l495k815k641k877l338l664l312
61961D70055k067n27M05N08L70M61O43Q22J459K826M211M628M097L500L364L555
$$ plain form
62052 1593183 1608860 1615450 1613393 1603886 1588308 1567792 1542933 1513865 1480698 1443890 1404192 1362314
62040 1362314 1318697 1273649 1227770 1182089 1137540 1094417 1052780 1013402 977689 946243 918048
62029 918048 891693 867022 844916 825794 809167 794587 781983 770910 760417 750155 740816 732847
62017 732847 725285 716692 706852 696784 687246 678054 668921 660201 652432 645630 639458 633807 628905 624987
62003 624987 622194 620661 620358 620860 621618 622599 624420 627627 631961 636497 640425 643459 645586 646706 646603
61988 646603 644994 641509 635893 628442 619982 611126 601690 591191 579782 568298 557393 547050 537128
61975 537128 527982 520160 513633 507764 502063 496706 492197 488702 485887 483246 480369 477031 473367 470055
61961 470055 467988 467461 467866 468374 468744 469205 469848 470670 472129 474955 479166 483794 487891 491391 494755 498310
61945D98310M148N511P375Q768R449J0575J3241J6869J9826K1271K1665K1703
61933F58711K1521K1018K0283J9508J8829J8376J8180J7986J7388J6131J4132
61922H62063J1262P511L342n20l785o765r701j2154j3402j3295j2362j1069r222
61909G91903o343k436J912O090R784J2724J4679J5846J6772J7481J7046J4621
61897I10079J0651O405K503j452n755r907j3216j5494j6862j7419j7369j7080
61885H15084j6674j5968j4986j4126j3604j3271j3159j3610j4525j5035j4441
61874F55685j3095j1866j1139j0791j0683j0604j0001q391n990l442j104J068
61862E59647L071M726N946O854P686Q744J0224J1998J3833J5905J8607K1764K4693
$$ plain form
61945 498310 502458 507969 515344 524112 533561 544136 557377 574246 594072 615343 637008 658711
61933 658711 680232 701250 721533 741041 759870 778246 796426 814412 831800 847931 862063
61922 862063 873325 880836 884178 883658 879873 873108 863407 851253 837851 824556 812194 801125 791903
61909 791903 785560 783124 785036 791126 800910 813634 828313 844159 860931 878412 895458 910079
61897 910079 920730 927135 929638 928186 922431 912524 899308 883814 866952 849533 832164 815084
61885 815084 798410 782442 767456 753330 739726 726455 713296 699686 685161 670126 655685
61874 655685 642590 630724 619585 608794 598111 587507 577506 569115 563125 559683 558579 559647
61862 559647 562718 567444 573390 580244 587930 596674 606898 618896 632729 648634 667241 689005 713698
61849G13698K7255L0080L3324L6021L7347L7775L8119L8080L6806L4362L1426
61838A094293K7851K2763J6117R004K301l952r648j4113j6892j8155j8013j6198
61826A075358j2818q704m495l1M929R927J4154J7064J8273J7354J4288R700M248
61813A159247j939q847j5957k2449k7769l1708l4220l5540l6124l6166l5410l3759
61801H39359l1756l0015k8447k6471k3897k1205j8972j7327j5998j4635j3106
61790E97530j1561j0312r503q978q456p788p040o382n844n168m119l030k699l334
61776E03316l987l656k662k105k057j359M68K190K478J777J611K509L535L763
61762E05821L333K945L061L763M864N973O770P335P905Q299P988O883N608M836
$$ plain form
61849 713698 740953 771033 804357 840378 877725 915500 953619 991699 1028505 1062867 1094293
61838 1094293 1122144 1144907 1161024 1170028 1172329 1168377 1158729 1144616 1127724 1109569 1091556 1075358
61826 1075358 1062540 1053836 1049341 1049310 1054239 1064166 1078320 1095384 1113657 1131011 1145299 1154999 1159247
61813 1159247 1157308 1148461 1132504 1110055 1082286 1050578 1016358 980818 944694 908528 873118 839359
61801 839359 807603 777588 749141 722670 698773 677568 658596 641269 625271 610636 597530
61790 597530 585969 575657 566154 557176 548720 540932 533892 527510 521666 516498 512379 509349 506650 503316
61776 503316 499329 495673 493011 490906 488849 487490 487958 490148 492626 494403 496014 498523 502058 505821
61762 505821 509154 512099 515160 518923 523787 529760 536530 543865 551770 560069 568057 574940 580548 585384
61748E85384M563M308L717K815J776P16l54j424k378k952k973k624k290k123j914
61733E84247j483r48m62J04R12J702J915J406P89R14J964L197L577K739J377O49
61717F02599J041J802J709M76q67j158m40J51k40j344k333k827l143l781m821
61702E86824n743n882n183m485m660n502n886n167l982l400l656m130m184l663
61688E21301k775j943j586j758k038k081k015k007j812j197n57n32j128j698j709
61673D96465j114k11M37J97q83j705j218K51J401J624J500J627J935K238K604
61658E05148K838K472J693J492K333L424L913M101M687N372N255M336L678L993
61644E54735M842N411N481N316N096M791M389L915L290K335R89n35j857k783l468
$$ plain form
61748 585384 589947 594255 597972 600787 602563 603279 602925 601501 599123 596171 593198 590574 588284 586161 584247
61733 584247 582764 581816 581354 581458 582370 584072 585987 587393 588182 589096 591060 594257 597834 600573 601950 602599
61717 602599 603640 605442 607151 607627 606760 605602 605162 605313 605073 603729 601396 598569 595426 591645 586824
61702 586824 581081 575199 570016 565531 560871 555369 549483 544316 540334 536934 533278 529148 524964 521301
61688 521301 518526 516583 514997 513239 511201 509120 507105 505098 503286 502089 501532 501000 499872 498174 496465
61673 496465 495351 495140 495577 495774 494891 493186 491968 492219 493620 495244 496744 498371 500306 502544 505148
61658 505148 507986 510458 512151 513643 515976 519400 523313 527414 532101 537473 542728 547064 550742 554735
61644 554735 559577 564988 570469 575785 580881 585672 590061 593976 597266 599601 600590 600055 598198 595415 591947
61629E91947m102m588m710m528m338m272m288m479m924n217m722l540k657k760
61615E32822l396l661l356k984k889k976l117l393l959m872o017o960p181o649
61601D71412n994n776n835n662n161m713m571m613m564m289l876l609l659l745
61587D05345l441k911k900l645m311m025l056k365k284k273j897j410j294j692
61573C67841k321k706k513j924j578j842k361k651k776k959k861k018p81j35m07
61558C38008q96q99m91p4L16Q69J504J909J941J757J634J676J684J409J011R39
61542C52297J216J183M00o23j065q59m21K65J376K339K296J540J396K316L176
61527C66832K944K007J211N31l74j022o69K92N72l76j802k680k670k026j253r04
$$ plain form
61629 591947 587845 583257 578547 574019 569681 565409 561121 556642 551718 546501 541779 538239 535582 532822
61615 532822 529426 525765 522409 519425 516536 513560 510443 507050 503091 498219 492202 485242 478061 471412
61601 471412 465418 459642 453807 448145 442984 438271 433700 429087 424523 420234 416358 412749 409090 405345
61587 405345 401904 398993 396093 392448 388137 384112 381056 378691 376407 374134 372237 370827 369533 367841
61573 367841 365520 362814 360301 358377 356799 354957 352596 349945 347169 344210 341349 339331 338550 338415 338008
61558 338008 337112 336213 335722 335648 335964 336833 338337 340246 342187 343944 345578 347254 348938 350347 351358 352297
61542 352297 353513 354696 355096 354473 353408 352549 352128 352393 353769 356108 358404 359944 361340 363656 366832
61527 366832 369776 371783 372994 373525 373151 372129 371460 371752 372324 371948 370146 367466 364796 362770 361517 360613
61511C60613j149j419r93k6M88p8j257k133k270j783r41p4L78J91l35o37m96k72
61493C47807m28r31j218q03J27Q27O67l13j497k187k040j307o96p58j292j541
61477C34417j091k48N03J018J232Q95Q0m88k25M03M73m5l13jJ66m33j381j851
61459C33111j703j353r99m98J49O31O52J71n61j011p01K29J040J267J226J353
61443C33003J454J164P90R65J618K060K085K214K685L014K881K727K929L061K546
61428C65196J708J363J658J996K027J964J902J508P15J73N70J798L115L960M256
61413C93909M093L529K749K065J595J070J21j242k558l315l378l019k637k481
61399C90501k540k624k585k479k450k400k000j219n48m00m20M4Q70J241Q79N28
$$ plain form
61511 360613 359464 358045 357052 357026 357514 357436 356179 354046 351776 349993 349052 348978 349356 349547 349212 348575 348079 347807
61493 347807 347379 346448 345230 344427 344554 345381 346048 345735 344238 342051 340011 338704 338008 337250 335958 334417
61477 334417 333326 333078 333581 334599 335831 336726 336806 336318 336093 336496 336969 336924 336611 336610 336776 336343 334962 333111
61459 333111 331408 330055 329056 328558 328707 329338 329990 330161 329600 328589 327888 328117 329157 330424 331650 333003
61443 333003 334457 335621 336411 337376 338994 341054 343139 345353 348038 351052 353933 356660 359589 362650 365196
61428 365196 366904 368267 369925 371921 373948 375912 377814 379322 380037 380210 380780 382578 385693 389653 393909
61413 393909 398002 401531 404280 406345 407940 409010 409131 407889 405331 402016 398638 395619 392982 390501
61399 390501 387961 385337 382752 380273 377823 375423 373423 372204 371656 371256 370836 370880 371750 372991 373870 374398
61383C74398Q07J268J178P27O23R09J004Q25R71J664K308K378K051J715J399J085
61367C95310R55J061J086Q75P50R13R93O11N1j19J57N36R48J598K438L135L545
61350D14843L847M175M478M821N446O485P839R352J0904J2304J3312J3825J3885
61337E25516J3506J2672J1450R955Q193O028L384M67k187l920m491m385m379m675
61323E67134m796m481m245m673n563o258o536o621o395n404l731k239j570j383
61309E03239r86l71p5k12k29L30J257K166L077M170N249N978O598P747R449J0799
61293E58186J1001J0146Q598O143K611j201m178o264q172r731r800q184o326n502
61279E37327n237m420l038j789p07O18J858K310K270K851M360N909O813P410Q267
$$ plain form
61383 374398 375205 376473 377651 378378 379001 379910 380914 381739 382710 384374 386682 389060 391111 392826 394225 395310
61367 395310 396265 397326 398412 399287 400037 400950 401943 402554 402605 402486 402643 403179 404127 405725 408163 411298 414843
61350 414843 418690 422865 427343 432164 437610 444095 451934 461286 472190 484494 497806 511631 525516
61337 525516 539022 551694 563144 573099 581292 587320 590704 591171 588984 585064 580573 576188 571809 567134
61323 567134 562338 557857 553612 548939 543376 537118 530582 523961 517566 512162 508431 506192 504622 503239
61309 503239 502253 501882 501807 501595 501366 501696 502953 505119 508196 512366 517615 523593 530191 537938 547387 558186
61293 558186 569187 579333 587931 594074 596685 595484 591306 585042 576870 567139 557339 549155 542829 537327
61279 537327 532090 527670 524632 522843 522136 522754 524612 526922 529192 532043 536403 542312 549125 556535 564802
61264E64802R362J0432J1346J1881J1764J1240J1008J1270J1441J1115J0789J1250
61252F97700J2672J4635J6549J7824J7995J7000J5024J1943P450J971l207p073
61240H20483r761j1897j3570j4446j4467j3887j2871j1523j0107q779p274n348
61228F86553l431k359k362k680k393j465p40q89j483j396j74J321J932J513P48
61213F72695q6j345l018m318m610m132l488k932k481k203j985j491p85n28j064
61198F38229j716j563n77N15J312K104L341N192P603J0376J3259J6105J8883K1387
61184G34450K3213K4246K4736K4687K3567K1078J7770J4426J1250Q198N756M580
61172I37957M461M333L436J876J01j727l610n403o879p929q674r438j0511j1826
$$ plain form
61264 564802 574164 584596 595942 607823 619587 630827 641835 653105 664546 675661 686450 697700
61252 697700 710372 725007 741556 759380 777375 794375 809399 821342 828792 830763 827556 820483
61240 820483 810722 798825 785255 770809 756342 742455 729584 718061 707954 699175 691901 686553
61228 686553 683122 680763 678401 675721 673328 671863 671123 670234 668751 667355 667181 668502 670434 671947 672695
61213 672695 672609 671264 668246 663928 659318 655186 651698 648766 646285 644082 642097 640606 639821 639293 638229
61198 638229 636513 634950 634373 634888 636200 638304 641645 646837 654440 664816 678075 694180 713063 734450
61184 734450 757663 781909 806645 831332 854899 875977 893747 908173 919423 927621 933377 937957
61172 937957 942418 946751 950187 952063 952164 950437 946827 941424 934545 926616 917942 908504 897993 886167
61158H86167j3023j3926j4737j5533j5966j5757j5135j4444j3627j2485j1088
61147G30446r469p305m488j706J99J267K206L351M541N714O765O895N093J470
61133G44979k617o016q617j0573j1543j1201r883q160o172l845j453N95K341M213
61119F72048O410Q697J0793J2698J4549J6367J8011J9352K0347K0921K0904K0301
61107H61398J9538J9153J9150J9004J8439J7758J7312J7010J6625J6102J5211
61096A056700J3531J1177R000P343N292J896k367o374j0101j4368j9028k2704
61084A029997k4533k5100k5292k5209k4551k3307k1655j9810j8199j7176j6388
61073G88777j5076j3093j1010r164p408n799m629l689k520j432j216j661j537
$$ plain form
61158 886167 873144 859218 844481 828948 812982 797225 782090 767646 754019 741534 730446
61147 730446 720977 713672 709184 707478 707677 708944 711150 714501 719042 724756 731521 738416 743509 744979
61133 744979 742362 736346 727729 717156 705613 694412 684529 676369 670197 666352 664899 665494 667835 672048
61119 672048 678458 687155 697948 710646 725195 741562 759573 778925 799272 820193 841097 861398
61107 861398 880936 900089 919239 938243 956682 974440 991752 1008762 1025387 1041489 1056700
61096 1056700 1070231 1081408 1090408 1097751 1103043 1104939 1102572 1096198 1086097 1071729 1052701 1029997
61084 1029997 1005464 980364 955072 929863 905312 882005 860350 840540 822341 805165 788777
61073 788777 773701 760608 749598 740434 733026 727227 722598 718909 716389 714957 713741 712080 710543
61060G10543m20P84J467K198L315M078M038M040M822N761O084O383P653R655J1449
61045G81850J2916J4556J6314J7795J9125K0617K1928K2605K3042K3938K5236
61034I99922K6476K7677K9018L0171L0838L1358L1945L2086L1596L1428L2306
61023A334821L3490L4166L5091L7374M0518M3411M6393N0435N4987N8643O1480
61012A830809O4566O7589O9290P0264P3041P9252Q8679J00980J16139J33121J50333
61001B844063J67609J85902K05604K27938K57433K99543L56044M26646N14676
60992E485458O25856P61485R20077J107520J336679J612627J929115K286878K695321
60983A8761016L122722L440356L454048L036406K243473J294139M34266j75543
$$ plain form
61060 710543 710123 710907 712374 714572 717887 721965 726003 730043 734865 740626 746710 753093 760746 770401 781850
61045 781850 794766 809322 825636 843431 862556 883173 905101 927706 950748 974686 999922
61034 999922 1026398 1054075 1083093 1113264 1144102 1175460 1207405 1239491 1271087 1302515 1334821
61023 1334821 1368311 1402477 1437568 1474942 1515460 1558871 1605264 1655699 1710686 1769329 1830809
61012 1830809 1895375 1962964 2032254 2102518 2175559 2254811 2343490 2444470 2560609 2693730 2844063
61001 2844063 3011672 3197574 3403178 3631116 3888549 4188092 4544136 4970782 5485458
60992 5485458 6111314 6872799 7792876 8900396 10237075 11849702 13778817 16065695 18761016
60983 18761016 21883738 25324094 28778142 31814548 34058021 35352160 35786426 35610883
60975C5610883m65947m20839r2040L49977O37439N37661n920q52052j765561k540528
60965C0993073l056566l275711l225800k982510k638177k266790j910444j589465
60957A0047610j313966j085090q95868p38471o09346n06245m24568l59393l08121
60948C806542k68690k37570k11712j90350j72999j57670j42807j29033j17103
60939B178608j05964r4750q4982p8737p5923p5051p5340p6153p5790p2917o8409
60928A294592o3901n9437n4220m8806m4481m1158l7720l4037l0886k8229k5321
60917H26396k2296k0033j8572j7075j5312j3778j2483j0896r040p447o105m572
60905F68787k970j750o83P16J993K204J479Q80P98O61J66l84r42j829k947l987
$$ plain form
60975 35610883 35144936 34724097 34632057 34982034 35619473 36157134 36151214 35299162 33533601 30993073
60965 30993073 27936507 24660796 21434996 18452486 15814309 13547519 11637075 10047610
60957 10047610 8733644 7648554 6752686 6014215 5404869 4898624 4474056 4114663 3806542
60948 3806542 3537852 3300282 3088570 2898220 2725221 2567551 2424744 2295711 2178608
60939 2178608 2072644 1977894 1892912 1814175 1738252 1663201 1587861 1511708 1435918 1363001 1294592
60928 1294592 1230691 1171254 1117034 1068228 1023747 982589 944869 910832 879946 851717 826396
60917 826396 804100 784067 765495 748420 733108 719330 706847 695951 686911 679464 673359 668787
60905 668787 665817 664067 663384 664100 666093 668297 669776 670656 671454 672115 672281 671897 670955 669126 666179 662192
60889F62192n253p128q890r414q985q997r785j0238r857r659j0424j1475j1844
60876E40243j1553j1023j0264r299q537q010p098n561m113l353k989k632k453
60863D53358k387j616K11K025K569K093J891K542L485M135M545N016N603O113
60849D89583O244N891N436N452N859N886N193M489M519M947M868M079L097K172
60835E57715R60p58k617m036m790n140n521o033o224n605m448l678l847m606n436
60820D95936o289p145p482o853n731n123n441o181o611o385n582m596l906l651
60806D14960l499l157k818k806l026l112k910k432j590m01O58J084J053J257J962
60791C95223K694K893K520J948J549J465J529J387J028J073K167L996N465N947
$$ plain form
60889 662192 656939 649811 640921 631507 622522 613525 603740 593502 583645 573986 563562 552087 540243
60876 540243 528690 517667 507403 498104 489567 481557 474459 468898 464785 461432 458443 455811 453358
60863 453358 450971 449355 449566 451591 454160 456253 458144 460686 464171 468306 472851 477867 483470 489583
60849 489583 495827 501718 507154 512606 518465 524351 529544 534033 538552 543499 548367 552446 555543 557715
60835 557715 558675 557917 555300 551264 546474 541334 535813 529780 523556 517951 513503 509825 505978 501372 495936
60820 495936 489647 482502 475020 468167 462436 457313 451872 445691 439080 432695 427113 422517 418611 414960
60806 414960 411461 408304 405486 402680 399654 396542 393632 391200 389610 389209 389867 390951 392004 393261 395223
60791 395223 397917 400810 403330 405278 406827 408292 409821 411208 412236 413309 415476 419472 424937 430884
60777D30884N923O136O584O749O508O174N813N122M088L197K800K662K517K633
60763D97790L364M406N089N268N292N153M361K929J742J513J909K197K266K351
60749E45630K176J234k18j222j266p04MP71J437J561R90J85m02q31j271j504j180
60732E45390l12Q00J946L094M312N787P660R703J1423J2693J3908J5349J6772
60719F48525J7904J8959K0196K1285K1682K1498K1394K1564K1350K0136J8194
60708H72687J6174J4020J0971O712J987k253n985r815j3833j7361j9903k1670
60696H31731k2936k3567k3490k3111k2728k2121k1185k0429k0109j9460j7647
60685E94948j5183j3425j2828j2637j2201j1603j0891r671p881o140m974m256
$$ plain form
60777 430884 436807 442943 449527 456276 462784 468958 474771 479893 483981 487178 489978 492640 495157 497790
60763 497790 501154 505560 510649 515917 521209 526362 530723 533652 535394 536907 538816 541013 543279 545630
60749 545630 547806 549040 548822 547600 546334 545630 545634 546405 547842 549403 550393 550578 550176 549345 548074 546570 545390
60732 545390 545078 545878 547824 550918 555230 561017 568677 578380 589803 602496 616404 631753 648525
60719 648525 666429 685388 705584 726869 748551 770049 791443 813007 834357 854493 872687
60708 872687 888861 902881 913852 920564 922551 920298 914313 904498 890665 873304 853401 831731
60696 831731 808795 785228 761738 738627 715899 693778 672593 652164 632055 612595 594948
60685 594948 579765 566340 553512 540875 528674 517071 506180 496509 488628 482488 477514 473258
60673D73258l644l068k514j935j485j402j526j481j260j095q26k32J20o63k381
60658D49866l740m053l887l825l591k859j936j083l5J203K002K119K261K963L803
60643D39208M280M651N084M924L748K402K003K384K505J968J245Q09Q28J352K057
60628D79448K178J393M10K9J38K32L52O51O80l7j129j924k409k839k950k489k033
60611D69701k212k613k446j908j734j824j448o09L3M26J127K094K588K376J913
60596D65464J385N95k03l78l5On02q74o96m46o39j007q54K04J924L415L690K823
60578D73872K220K983M372M891M461M314M995N864O612P816R741J1850J3947J6586
60564E74524J9909K3205K6072K9016L2294L5130L6637L6651L5076L1278K4871
$$ plain form
60673 473258 469614 466546 464032 462097 460612 459210 457684 456203 454943 453848 453022 452790 452910 452247 449866
60658 449866 446126 442073 438186 434361 430770 427911 425975 424892 424857 426060 428062 430181 432442 435405 439208
60643 439208 443488 448139 453223 458147 461895 464297 466300 468684 471189 473157 474402 475211 476039 477391 479448
60628 479448 481626 483019 483429 483458 483596 483828 484180 484831 485511 485474 484345 482421 480012 477173 474223 471734 469701
60611 469701 467489 464876 462430 460522 458788 456964 455516 454907 454940 455366 456493 458587 461175 463551 465464
60596 465464 466849 467444 467241 466863 466828 466834 466332 465458 464762 464316 463677 462670 461816 462020 463944 467359 471049 473872
60578 473872 476092 479075 483447 488338 492799 497113 502108 507972 514584 522400 532141 543991 557938 574524
60564 574524 594433 617638 643710 672726 705020 740150 776787 813438 848514 879792 904663
60553I04663J6537P497j396r606j6476k1331k3726k3479k0863j6707j1762o102
60541G77249K11O286J1270J5856K1564K8564L5604M2130M8802N5427O0018O0837
60529A163818N7962N2063M3022L0892J7050L295r335j9907k6939k9727k9490k8001
60517A224703k5775k2679j9444j7176j5939j5100j4571j4493j4086j2216q914
60506A044310n190j554K237O179R916J3581J7789K2828K8704L5722M4215N3893
60494A272630O4382P6052Q9280J03142J15909J26692J35404J41281J42694J38751
60484B406217J30048J17675J02415Q5132O6752M7437K6534L737k0387m5196p0384
60473B849980r5141j17629j35877j48797j56107j57813j54209j46045j34481j21108
$$ plain form
60553 904663 921200 928697 927301 917695 901219 879888 856162 832683 811820 795113 783351 777249
60541 777249 777460 783746 795016 810872 832436 861000 896604 938734 987536 1042963 1102981 1163818
60529 1163818 1221780 1273843 1316865 1347757 1364807 1368102 1358767 1338860 1311921 1282194 1252704 1224703
60517 1224703 1198928 1176249 1156805 1139629 1123690 1108590 1094019 1079526 1065440 1053224 1044310
60506 1044310 1039120 1037566 1039803 1045982 1055898 1069479 1087268 1110096 1138800 1174522 1218737 1272630
60494 1272630 1337012 1413064 1502344 1605486 1721395 1848087 1983491 2124772 2267466 2406217
60484 2406217 2536265 2653940 2756355 2841487 2908239 2955676 2982210 2985947 2965560 2920364 2849980
60473 2849980 2754839 2637210 2501333 2352536 2196429 2038616 1884407 1738362 1603881 1482773
60463A482773j07802r5878q5239p5000o4982n5984m8563m2399l7101l2739k9233
60452H07853k6027k2954k0683j9625j8966j7501j5112j2701j0979r877r004q061
60440F16363o895n588m501l890l569l184k589j794q16rj05j324k729l132k648
60425E73590k560l564m888n442n248n143n502n867n697m941l886k892k276k066
60411E13618j835j188l99j31m10n02j1M76L86J52N25J275J492J081R30J411J720
60394E18590J184M23N27J523K439K628K399K325K527K719K596K034J183M36J81
60379E43714M63R87J379J421J181J006J318K197L266M038M333M267M004L643L304
60364E80521L218L659M712O014O932P173P083P084P034O515N520M402L326K286
$$ plain form
60463 1482773 1374971 1279093 1193854 1118854 1053872 997888 949325 906926 869825 837086 807853
60452 807853 781826 758872 738189 718564 699598 682097 666985 654284 643305 633428 624424 616363
60440 616363 609468 603880 599379 595489 591920 588736 586147 584353 583537 583528 583423 582099 579370 576238 573590
60425 573590 571030 567466 562578 557136 551888 546745 541243 535376 529679 524738 520852 517960 515684 513618
60411 513618 511783 510595 510196 510065 509655 509153 509142 509618 510004 510156 510681 511956 513448 514529 515459 516870 518590
60394 518590 519774 520197 520724 522247 524686 527314 529713 532038 534565 537284 539880 541914 543097 543533 543714
60379 543714 544177 545164 546543 547964 549145 550151 551469 553666 556932 560970 565303 569570 573574 577217 580521
60364 580521 583739 587398 592110 598124 605056 612229 619312 626396 633430 639945 645465 649867 653193 655479
60350F55479J632J897L048M610O513R118J2311J5404J8267K1618K5724K9553L1877
60337H37051L2446L1397K8240K2432J4547N929k608j0930j8597k4536k7887k8629
60325H58855k7402k5106k2540k0048j7465j4733j2221j0186q299o245m358l033
60313F87219j835J9K484M723O231P280Q242R219J0360J2002J4346J7437K1545
60300G99272K7077L3985M1388M7725N1155N0347M5317L7267K7103J4641l4j4866
60288A160377k6536l2953l4287l1799k6727k0560j5210j2058j1207j2098j4463
60277I22479j8260k2894k7124k9778l0583l0203k9386k8021k5386k1441j7400
60266F42003j4528j2778j1329r949r032q399p237n307l407k313k033k309l019
$$ plain form
60350 655479 657111 659008 662056 666666 673179 682297 694608 710012 728279 749897 775621 805174 837051
60337 837051 869497 900894 929134 951566 966113 972042 969434 958504 939907 915371 887484 858855
60325 858855 831453 806347 783807 763759 746294 731561 719340 709154 700855 694610 690252 687219
60313 687219 685384 685403 687887 692610 698841 706121 714363 723582 733942 745944 760290 777727 799272
60300 799272 826349 860334 901722 949447 1000602 1050949 1096266 1133533 1160636 1175277 1175243 1160377
60288 1160377 1133841 1100888 1066601 1034802 1008075 987515 972305 960247 949040 936942 922479
60277 922479 904219 881325 854201 824423 793840 763637 734251 706230 680844 659403 642003
60266 642003 627475 614697 603368 593419 584387 575988 568751 563444 560037 557724 555691 553382 550363
60253E50363l791l939l336k703k572k550k122j616j659k045j951j161l50m8P8
60238E20598N96J348J603J070L37J84O93J362J865K303K775L272M060N524P334
60223E54924Q386Q020O792N586M505L305K317K012J979J405M41J01P40J546J749
60208F03808J531J460J680K025K337K409K077J529J139Q64L80j95l04K29R34J416
60192F23319J715J806J445P03J35O8K73N17Q34J102R31L11k67n48q01j170j362
60175F29011j286j334j607j501n90O59J533J985K399K837L145L400L811M362M964
60160F51788N688O452O808O437N609M784L992L007J923J137Q51R34J134J174Q11
60145G02529N0p55j238j323j172q93m40M12J839L573M862N248N178N418N926N992
$$ plain form
60253 550363 546572 542633 539297 536594 534022 531472 529350 527734 526075 524030 522079 520918 520568 520520 520598
60238 520598 521194 522542 524145 525215 525552 525736 526429 527791 529656 531959 534734 538006 542066 547590 554924
60223 554924 563310 571330 578122 583708 588213 591518 593835 595847 597826 599231 599672 599773 600513 602059 603808
60208 603808 605339 606799 608479 610504 612841 615250 617327 618856 619995 620859 621239 621044 620740 620969 621903 623319
60192 623319 625034 626840 628285 628988 629123 629191 629464 629981 630815 631917 632848 633159 632892 632344 631543 630373 629011
60175 629011 627725 626391 624784 623283 622693 623352 624885 626870 629269 632106 635251 638651 642462 646824 651788
60160 651788 657476 663928 670736 677173 682782 687566 691558 694565 696488 697625 698476 699410 700544 701718 702529
60145 702529 702579 701824 700586 699263 698091 697198 696758 697170 699009 702582 707444 712692 717870 723288 729214 735206
60129G35206N416M718M077K882P02j950m254n886o863p174o976o586n919m502
60115G02891k442p11P4M78J268K269K876L234L974N128O109O612O834O975P206
60100G52775P888R141J0235J0175Q878P168N596L954K095M84m58j091k135l734
60086H10971n313o298o695o828o836o561n976n351m899m435l760l149l105l661
60072G38104m394n072n838o640p068o977o780o783o676o069n238m873n208n744
60058F54744n836n418n139n647o719p316o865o130o226p014p282o452n223m333
60044E69144l709l096k640k227j164P72K704L750M170M622M899M310L016J961
60030E86512J577J351P33j26p12q06p12r22j578k227k421k465l042m059m612m330
$$ plain form
60129 735206 740622 745340 749417 752299 753001 751051 746797 740911 734048 726874 719898 713312 707393 702891
60115 702891 700449 699738 699812 700290 701558 703827 706703 709937 713911 719039 725148 731760 738594 745569 752775
60100 752775 760663 769804 780039 790214 799092 806260 811856 815810 817905 818389 817931 816840 814705 810971
60086 810971 805658 799360 792665 785837 779001 772440 766464 761113 756214 751779 748019 744870 741765 738104
60072 738104 733710 728638 722800 716160 709092 702115 695335 688552 681876 675807 670569 665696 660488 654744
60058 654744 648908 643490 638351 632704 625985 618669 611804 605674 599448 592434 585152 578700 573477 569144
60044 569144 565435 562339 559699 557472 556308 557080 559784 563534 567704 572326 577225 581535 584551 586512
60030 586512 588089 589440 590173 590047 589335 588529 587817 586895 585317 583090 580669 578204 575162 571103 566491 562161
60014E62161l929l933l794k939j902j502j546j349r22o09J1J605L637M752M640
59999E54381M464N261O837Q528J0074J1337J1921J1600J0697R625Q436O981N225
59986F65367L151P66j628l477m526n044n379n556n464n217n066n048m935m588
59972F13356m267m439n116n699n699n436n424n319m260k365q81m85l99K43J134
59957E64944J704K423L929N518N782M605L250K536K101J617J567K299L226L537
59943F09038L194K759K534K273J521J40j444k563l101l605m350m761m367l828
59929E93440m110m896m916l845k782k514k395j514j88N20K64l06n51m28j00M87
59913E66166J447K551L339L612L658L776L833L526L057K921L049K766J820Q24
$$ plain form
60014 562161 558232 554299 550505 547566 545664 544162 542616 541267 540345 539736 539747 541352 544989 549741 554381
59999 554381 558845 564106 570943 579471 589545 600882 612803 624403 635100 644725 653161 660142 665367
59986 665367 668518 669284 667656 664179 659653 654609 649230 643674 638210 632993 627927 622879 617944 613356
59972 613356 609089 604650 599534 593835 588136 582700 577276 571957 567697 565332 564451 563966 563567 563810 564944
59957 564944 566648 569071 573000 578518 584300 588905 592155 594691 596792 598409 599976 602275 605501 609038
59943 609038 612232 614991 617525 619798 621319 621459 620015 617452 614351 610746 606396 601635 597268 593440
59929 593440 589330 584434 579518 575673 572891 570377 567982 566468 566280 566800 567064 566758 566207 565779 565679 566166
59913 566166 567613 570164 573503 577115 580773 584549 588382 591908 594965 597886 600935 603701 605521 606345
59899F06345K95Ok58n2Q68J764J945K018L032M750N901N989N634N292M691L758
59883F51978K912K309J631Q70M42L41J07k35j25M76R67J255J890K721K534P41
59867F70814j580l092l873m795n993o855p085o841o092m781l422k759k765k625
59853F08256j853q77l46k59j06L65Q04Q44P45J210K370L451L713L503L825N089
59837F30734O869Q870J1353J4378J7152J8504J7711J4791J0468O000K616P25p7
59824G60094k42N8L92k06k524o434j1103j5624j9298k1544k2022k0793j8351j5479
59810F06924j2954j1101r690q407p317o513n677m455l128k323k151k214k396k972
59796E25626l862m422m220l495k727k162j869j801j688j291q02o26q06j087j388
$$ plain form
59899 606345 606640 606646 606388 606336 607204 608968 610913 612931 615963 620713 626614 632603 638237 643529 648220 651978
59883 651978 654890 657199 658830 659700 660142 660483 660590 660355 660230 660706 661673 662928 664818 667539 670073 670814
59867 670814 669234 666142 662269 657474 651481 644626 637541 630700 624608 619827 616405 613646 610881 608256
59853 608256 606403 605526 605180 604921 604815 605180 605984 606828 607573 608783 611153 614604 618317 621820 625645 630734
59837 630734 637603 646473 657826 672204 689356 707860 725571 740362 750830 756830 759446 760171 760094
59824 760094 759852 759910 760302 760096 757572 751138 740035 724411 705113 683569 661547 640754 622403 606924
59810 606924 593970 582869 573179 564772 557455 550942 545265 540810 537682 535359 533208 530994 528598 525626
59796 525626 521764 517342 513122 509627 506900 504738 502869 501068 499380 498089 497287 496661 495855 494768 493380
59781D93380j674j621j094p42j344k601l468l569l417l249k721j829j083n25K57
59766D64700R57O29o04j173j52J392J981J672J426J476J412J324J711K553L417
59751D82721M203N012N573N536N066M467L609K448J687J938K520K062L47j408
59737E25781k216k403k711l093k932k060j012l67k01k45l32n13p73q65o41k95
59721E05122p0J32M91P66N53n5n09n20k38K18R18J733K403K977L698M405M707
59704E26731M697M860N232N459N636O178O803O764O234O357P504Q615Q821Q520
59690F18411Q287P826O724N169L220M95k509m099l569k531k712l462l090j776
59676F26384j229j870k372j972j470j615k022k258k633l364l926l869l564l548
$$ plain form
59781 493380 491706 490085 488991 488249 486905 484304 480836 477267 473850 470601 467880 466051 464968 464443 464700
59766 464700 465657 466286 465682 464509 464357 465749 467730 469402 470828 472304 473716 475040 476751 479304 482721
59751 482721 486924 491936 497509 503045 508111 512578 516187 518635 520322 522260 524780 526842 527189 525781
59737 525781 523565 521162 518451 515358 512426 510366 509354 508987 508786 508541 508209 507696 506923 506058 505417 505122
59721 505122 505052 505184 505675 506441 506994 506939 506430 505910 505672 505890 506808 508541 510944 513921 517619 522024 526731
59704 526731 531428 536288 541520 546979 552615 558793 565596 572360 578594 584951 592455 601070 609891 618411
59690 618411 626698 634524 641248 646417 649637 650132 647623 643524 639955 637424 634712 631250 628160 626384
59676 626384 625155 623285 620913 618941 617471 615856 613834 611576 608943 605579 601653 597784 594220 590672
59662E90672l703l437k315m48J387K100J401L98M66J654K965L902M776N551N618
59647F10987M876L987L258K193N48j128k400l614n128o575p421p679p646p415
59633E76843p018o568n922m808l465k584k250j656m10O70O54j90q68j030j029
59618E40369j025p41j95J04l45j602l284m641m895l985k788k155j935j481q50
59603E10551p02j057j063k56P23J080Q44L86l91j541k261j601R3J343J331P10
59587E08189L89L81K76J24J26K1n66j431k156k760l359l575l151k776l326m417
59571D81989m770l997l013k479k028j346r34j156j459j263q54o70l62N83J788
59556D60029K375K149J676J445J526J838K177K177J710J160R55J104J557K523
$$ plain form
59662 590672 586969 583532 581217 580769 582156 584256 585657 586055 586521 588175 591140 595042 599818 605369 610987
59647 610987 615863 619850 623108 625301 625849 624721 622321 618707 613579 607004 599583 591904 584258 576843
59633 576843 569825 563257 557335 552527 549062 546478 544228 542572 542162 542832 543486 543296 542428 541398 540369
59618 540369 539344 538603 538408 538512 538167 536565 533281 528640 523745 519760 516972 514817 512882 511401 510551
59603 510551 509849 508792 507729 507473 508196 509276 510120 510506 510115 508574 506313 504712 504805 506148 507479 508189
59587 508189 508578 508959 509235 509359 509485 509506 508940 507509 505353 502593 499234 495659 492508 489732 486406 481989
59571 481989 477219 473222 470209 467730 465702 464356 463422 462266 460807 459544 458690 458020 457658 458241 460029
59556 460029 462404 464553 466229 467674 469200 471038 473215 475392 477102 478262 479217 480321 481878 484401
59542D84401L968N223N753O000O866Q566J0573J2497J4498J6841J9315K0927K0154
59529F35582J5989R167J938l672o996q091o972m117q42J721L562N043N905N807
59515F54024N153M377L001N52k124l725m355n208o651p896q587r298j0238j0702
59501E98323j0239r383q728q172p434o605n771m699l347k105j260o66j42K79O05
59486E30656Q86R34O23M59J137K479L546L971M391N287O224O646O770P150P816
59471E88975Q267Q033O929N062K839P81q40k027k814l304l766m183l865k144N74
59456E98517L150N095O884Q770J0221J0881J1374J2560J4461J6376J7710J8302
59444G34301J8233J7567J6157J3555R423M073j701p319j2452j6409j8281j7976
$$ plain form
59542 484401 488369 493592 499345 505345 512211 520777 531350 543847 558345 575186 594501 615428 635582
59529 635582 651571 660738 662676 659004 652008 643917 636945 632828 631986 633707 637269 642312 648217 654024
59515 654024 659177 663554 666555 667107 664983 661258 656903 651695 645044 637148 628561 619263 609025 598323
59501 598323 588084 578701 569973 561801 554367 547762 541991 537292 533945 531840 530580 529914 529772 530051 530656
59486 530656 531542 532476 533099 533558 534695 537174 540720 544691 549082 554369 560593 567239 574009 581159 588975
59471 588975 597242 605275 612204 617266 620105 620886 620046 618019 615205 611901 608135 603952 600087 597943 598517
59456 598517 601667 606762 613646 622416 632637 643518 654892 667452 681913 698289 715999 734301
59444 734301 752534 770101 786258 799813 809236 813309 811608 804289 791837 775428 757147 739171
59432G39171j6585j5285j4339j3401j2381j1538j1077j0949j0829j0044p939m661
59420F00143j270J358L430N716Q387J0940J3147J5464J8301K1391K4308K7280
59408G48595L0601L3124L2065K5196J3214n15j2371k0288k3737k3261k0208j5887
59396G66528j0423l404L872P904N865j587j1166j9880k6224k9418k9176k6327
59384F26564k2463j8726j5504j2967j1032r024o460m017k757k491j950n62J009
59371E19620K144K891L212K769J818J359J873K639K696J961J130R67J790L131
59357E50000L926L625K949K923L501L981M516N940Q228J0342J1871J3496J5598
59344F40896J7600J9127K0679K2544K3968K4122K3149K1784K0524J9515J8547
$$ plain form
59432 739171 722586 707301 692962 679561 667180 655642 644565 633616 622787 612743 604804 600143
59420 600143 598873 600231 603661 609377 617764 628704 641851 657315 675616 697007 721315 748595
59408 748595 779196 812320 844385 869581 882795 882280 869909 849621 825884 802623 782415 766528
59396 766528 756105 752701 756573 764477 770342 768755 757589 737709 711485 682067 652891 626564
59384 626564 604101 585375 569871 556904 545872 536848 530388 526371 523614 521123 519173 518611 519620
59371 519620 521764 524655 527867 530636 532454 533813 535686 538325 541021 542982 544112 545079 546869 550000
59357 550000 553926 557551 560500 563423 566924 570905 575421 581361 589589 599931 611802 625298 640896
59344 640896 658496 677623 698302 720846 744814 768936 792085 813869 834393 853908 872455
59333H72455J6885J3816R655N554K147q62l664n914p532q998j0511j1680j2295
59320H59056j2510j2140j0863r295q669r037r076q114p069o826o954o804o609
59307G45090o580o090m799l632l561m182m476m210l649k653j133K20Q05J210K486
59292G04846M682O891Q468R477J0355J1762J4303J7814K1377K4380K6782K7751
59280H88888K5193J7804P101l579j1628j6160j7305j5866j3195j0278o961k810
59268H41204J690N530Q329J0194J0897J0241Q889P798O872N123K084j709n565
59255I11577r196j2419j5007j6876j8028j8394j8095j7586j7132j6430j5223j3823
59243G23368j2550j1111r168p103n566m538l564k572j775j062j21R35J678J944
$$ plain form
59333 872455 889340 903156 912811 918365 920512 919650 915986 910072 902540 893542 883031 871351 859056
59320 859056 846546 834406 823543 814248 805579 796542 787466 779352 772283 765457 758503 751699 745090
59307 745090 738510 732420 727621 723989 720428 716246 711770 707560 703911 701258 700125 700345 701150 702360 704846
59292 704846 709528 716419 724887 734364 744719 756481 770784 788598 809975 834355 861137 888888
59280 888888 914081 931885 938986 935407 923779 907619 890314 874448 861253 850975 844014 841204
59268 841204 842894 848424 856753 866947 877844 888085 896974 904772 911644 916767 918851 917142 911577
59255 911577 902381 889962 874955 858079 840051 821657 803562 785976 768844 752414 737191 723368
59243 723368 710818 699707 690539 683436 677870 673332 669768 667196 665421 664359 664238 665173 666851 668795
59229F68795J910J826J961K407K632J764k47k388m012n688p946r945j0462r702
59215F30905q994q962r000q426p269n864m419l106k142j689j865k544l007k383
59201E61235p94N18P23L80L68O58R37J585K988M467N062M957N089N655O099O372
59185F06299P070Q339R510R958R595Q595P283O194N634N303M782M156L679L277
59171F99674K928L040L760M491M843N445O895Q484R085Q860Q878R407R749R649
59157G95188R532R327Q258O030L305P46j608l857n857p506q885r986j0793j1451
59143G72443j1901j1642j0441q968q041p507o657n438m395l679k981k288j811
59130F86694j362n71M04J216K172L824N898P506Q410R149J0064J0967J1815J2831
$$ plain form
59229 668795 670705 672531 674492 676899 679531 681295 681048 678660 674648 668960 661014 651069 640607 630905
59215 630905 621911 612949 603949 595523 588254 582390 577971 574865 572723 571034 569169 566625 563618 561235
59201 561235 560441 560959 561682 562062 562430 563088 564025 565610 568598 573065 578127 583084 588173 593828 599927 606299
59185 606299 613369 621708 631218 641176 650771 659366 666649 672843 678477 683780 688562 692718 696397 699674
59171 699674 702602 705642 709402 713893 718736 724181 731076 739560 748645 757505 766383 775790 785539 795188
59157 795188 804720 814047 822305 828335 831640 832386 830778 826921 821064 813558 804673 794687 783894 772443
59143 772443 760542 748900 738459 729491 721450 713943 707286 701848 697453 693774 690793 688505 686694
59130 686694 685332 684761 685165 686381 688553 692377 698275 705781 714191 723340 733404 744371 756186 769017
59116G69017J3968J4928J5688J6388J6843J6805J6456J5997J5045J3184J0723
59105I35042Q193N567K884J003N32M98n84k628m301n190o162p522q429q397q088
59090I02418q140q365q465q501q333p625o706o509p289q396r491j0956j2750j3935
59076G76957j3900j3174j2518j2026j1583j1369j1338j0832r431p712o666o595
59064F49813o915o776n775m273l089k602k324j736j255j708l073m399m931m684
59050E96273l994l214k671k406j970j116l14m2P3O01J320J768K278L317M239M017
59034E98159K986K517L039L717M043M310M465L955L086L122M498O103O884P197
59020F58081Q050R770J1934J3881J4940J4801J3847J2594J0850Q152M844J859
$$ plain form
59116 769017 782985 797913 813601 829989 846832 863637 880093 896090 911135 924319 935042
59105 935042 943235 948802 951686 952689 953221 953719 953135 950507 946206 941016 934854 927332 918903 910506 902418
59090 902418 894278 885913 877448 868947 860614 852989 846283 839774 832485 824089 814598 803642 790892 776957
59076 776957 763057 749883 737365 725339 713756 702387 691049 680217 670786 663074 656408 649813
59064 649813 642898 636122 630347 626074 622985 620383 618059 616323 615068 613360 610287 605888 600957 596273
59050 596273 592279 589065 586394 583988 582018 580902 580588 580546 580619 581220 582540 584308 586586 589903 594142 598159
59034 598159 601145 603662 606701 610418 614461 618771 623236 627191 630277 633399 637897 644000 650884 658081
59020 658081 666131 675901 687835 701716 716656 731457 745304 757898 768748 776900 781744 783603
59008G83603m89k484l931m221l472k448j390k8J319J949K157L023M616N717N651
58993G89572N011M291L119J346l89j685k913m302n485o378p386q506r239r653
58979G47403j0363j1177j1089r874q469p337n877l833j943n35J139L549O037P936
58965F95567R381J0451J0750J0426J0318J0556J0233R081P991P217N575K393j171
58952G98768l822n887q214j0480j1888j2568j3047j3140j2447j1331j0363r432
58940F76149q252p052n997m661k901j494j133j526k112k850l604l770l340l296
58926F24161m101m757m340l550l573m270m664m525m316m100l602k948k365j518
58912E71532j15J281J850J735J876K767L971M718M673M318M741O555R084J1176
$$ plain form
59008 783603 783114 780630 776699 772478 769006 766558 765168 765140 766459 768408 770565 773588 778204 783921 789572
58993 789572 794583 798874 801993 803339 802950 801265 798352 794050 788565 782187 774801 766295 757056 747403
58979 747403 737040 725863 714774 704900 696431 689094 683217 679384 677441 676906 678045 681594 687631 695567
58965 695567 704948 715399 726149 736575 746893 757449 767682 776763 784754 791971 797546 799939 798768
58952 798768 794946 789059 780845 770365 758477 745909 732862 719722 707275 695944 685581 676149
58940 676149 667897 660845 654848 650187 647286 645792 644659 643133 641021 638171 634567 630797 627457 624161
58926 624161 620060 615303 610963 607413 603840 599570 594906 590381 586065 581965 578363 575415 573050 571532
58912 571532 571417 572698 574548 576283 578159 580926 584897 589615 594288 598606 603347 609902 618986 630162
58898F30162J2708J4295J5704J5935J5011J4149J3781J2999J1638J1164J2573
58887G80119J4818J6521J7887J9742K1834K3316K3908K3411K1159J7131J2737
58876I92583R278O448L340K7k982n783q481j0482j1528j2487j3935j4950j4605
58863I16443j3645j3349j3625j3640j3514j3863j4355j4292j4050j4496j5428
58852G62186j5955j5983j6043j5998j5229j3773j2143j0418q567p188o834p016
58840F17039o916o600o512o407n888n431n705o335o396n669m533l190k000j729
58826E43728k449k933k345j641k039k972l015k117j326r25l99J91M20P15J774
58811E24667L064L341K445J289L63l74m66O30K240K978K568J975J846J980K232
$$ plain form
58898 630162 642870 657165 672869 688804 703815 717964 731745 744744 756382 767546 780119
58887 780119 794937 811458 829345 849087 870921 894237 918145 941556 962715 979846 992583
58876 992583 1001861 1008309 1011649 1011676 1008694 1002911 994430 983948 972420 959933 945998 931048 916443
58863 916443 902798 889449 875824 862184 848670 834807 820452 806160 792110 777614 762186
58852 762186 746231 730248 714205 698207 682978 669205 657062 646644 638077 630889 624055 617039
58840 617039 610123 603523 597011 590604 584716 579285 573580 567245 560849 555180 550647 547457 545457 543728
58826 543728 541279 538346 536001 534360 532321 529349 526334 524217 522891 521966 521567 521758 522178 522893 524667
58811 524667 527731 531072 533517 534806 535169 534795 534329 534959 537199 540177 542745 544720 546566 548546 550778
58796E50778K735L203L117K511J794R91M4n42l01L89R75J667K721L501L466L474
58780E80523M683O715Q178Q685Q943R287R467R531R536Q635N841J650k286m928
58766F64460o373p045p442q207r354r864r046p684o752n866m303k659j834j218
58752E76813L29K281L124K805K688L291L872M136M606N326N821O290P361Q806
58738F37549R869J0647J1621J2320J2013J1429J1906J3186J3812J3494J3156J2842
58726G83844J1676R909Q868Q657P913O251M959M779M866M650M961O411Q107Q914
58712H84765Q870Q604Q301P799O919N277K500j155m981q555j1672j3946j5435
58699H77291j7164j9877k2676k4100k4138k3874k3669k3125k2338k1563k0097
$$ plain form
58796 550778 553513 556716 559833 562344 564138 565129 565173 564631 564330 564719 565694 567361 570082 573583 577049 580523
58780 580523 585206 591921 600099 608784 617727 627014 636481 646012 655548 664183 670024 671674 669388 664460
58766 664460 658087 651042 643600 635393 626039 616175 607129 599445 592693 586827 582524 579865 578031 576813
58752 576813 577142 579423 582547 585352 588040 591331 595203 599339 603945 609271 615092 621382 628743 637549
58738 637549 647418 658065 669686 682006 694019 705448 717354 730540 744352 757846 771002 783844
58726 783844 795520 805429 814297 822954 830867 837118 842077 846856 851722 856372 861333 867744 875851 884765
58712 884765 893635 902239 910540 918339 925258 930535 933035 931880 926899 918344 906672 892726 877291
58699 877291 860127 840250 817574 793474 769336 745462 721793 698668 676330 654767 634670
58688F34670j7211j3878j1827j1128j0403r180q186p573o740n761n193m612l229
58675E19749j739j544k266k110o93O81J545K784M459N449N680O541Q559J0628
58661E57723J1956J2810J2959J1517Q784O181L885P06l152n590n657m983n128
58648F02011n604n507n238n395n629n678o019o672o789o197n753n526m418k307
58634E25279p53o55q67j91R09J583K040K638K899K469J866J393N22r32k142k463
58618E33595k105j229L50K200L389M003N050O595P599P867Q333Q998Q565O704
58604E99914M744L441J986rj478j800j855k289k425j835j286j266j159o82m17
58589E93584k25R81L123M555M701N187P238R806J1378J1909J1935J1490J0939
$$ plain form
58688 634670 617459 603581 591754 580626 570223 561043 552857 545284 538544 532783 527590 522978 519749
58675 519749 518010 516466 514200 512090 511397 512078 513623 516407 520866 526315 531995 538536 547095 557723
58661 557723 569679 582489 595448 606965 615749 621930 625815 626521 623369 617779 612122 607139 602011
58648 602011 596407 590900 585662 580267 574638 568960 562941 556269 549480 543283 537530 532004 527586 525279
58634 525279 524526 523871 523004 522813 523722 525305 527345 529983 532882 535351 537217 538610 539132 538200 536058 533595
58618 533595 531490 530261 530611 532811 536200 540203 545253 551848 559447 567314 575647 584645 593210 599914
58604 599914 604658 608099 610085 610076 608598 606798 604943 602654 600229 598394 597108 595842 594683 594001 593584
58589 593584 593359 594340 597463 602018 606719 611906 619144 628950 640328 652237 664172 675662 686601
58576F86601J1160J1835J1264Q958O659N878O086O388P096Q522J0052J1493J3754
58563H05746J7034K0073K2081K3743K5400K6227K6056K5890K5582K3277J8465
58552A059574J3352R770O788K912j473n431r227j3035j5762j6842j7502j8685
58540I94439j9530j9330j9114j9706k0250k0220k0821k2533k3365k1666j8774
58529G69130j6797j5495j3540j1211r552q253o539m950m241l736k604j502j171
58516F69539p11Q11K399K652J984J521J076J47l71N07J859K059J085N1o13r32
58500F83063n20N77J216P06p9l55p16j590k019j380p24q34p04N31J865K285K650
58483F83972L968N487O333P325R327J1436J2592J3495J4991J6234J6200J5463
$$ plain form
58576 686601 697761 709596 720860 729818 736477 742355 748441 754829 761925 770447 780499 791992 805746
58563 805746 822780 842853 864934 888677 914077 940304 966360 992250 1017832 1041109 1059574
58552 1059574 1072926 1082696 1089484 1092396 1090923 1085492 1076265 1063230 1047468 1030626 1013124 994439
58540 994439 974909 955579 936465 916759 896509 876289 855468 832935 809570 787904 769130
58529 769130 752333 736838 723298 712087 702535 694282 687743 682793 678552 674816 672212 670710 669539
58516 669539 668828 669639 672038 674690 676674 678195 679271 679418 679047 679554 681413 683472 684557 684608 683995 683063
58500 683063 682543 683120 684336 685042 684963 684608 683892 682302 680283 678903 678179 677345 676641 677172 679037 681322 683972
58483 683972 687940 693427 699760 707085 716412 727848 740440 753935 768926 785160 801360 816823
58471H16823J4654J2882R429N361J723k034o169r210j0321j0957j2183j2576j0961
58458G86461q953q260p658n323k191j89J069K988N025N861O010O572O769N349
58444G93530L023J072r58l772o170o874o857p352p291n382k866j495m97J551L647
58429G53309M143L911M685N879O039N940P157Q975R791J0033J0691J0674Q823
58416H50050O842O848P471O030L217J987K803L526L080J977Ml352o871q865r641
58401H65106j0218r928q003n937n303m878k943o66jk9J147K662K614J765J853
58386H27241J953L37j734j995j337j938k901j915K10R89Q73K143M491N931O859
58371H39207Q819J0551R786P850P920R713J0370R615R535J0198J0094R913J1349
$$ plain form
58471 816823 831477 844359 853788 859149 860872 858838 852669 843459 833138 822181 809998 797422 786461
58458 786461 777508 769248 761590 756267 754076 753887 754956 757944 762969 768830 774840 781412 788181 793530
58444 793530 796553 797625 796667 792895 786725 779851 772994 765642 758351 752969 750103 748608 748111 749662 753309
58429 753309 757452 761363 766048 771927 777966 783906 791063 800038 809829 819862 830553 841227 850050
58416 850050 856892 863740 871211 877241 880458 882445 885248 888774 891854 893831 893835 890483 883612 874747 865106
58401 865106 854888 844960 836957 831020 825717 820839 817896 817230 817229 817200 818347 821009 823623 825388 827241
58386 827241 829194 829531 827797 825802 824465 822527 819626 817711 817921 818910 819783 821926 826417 832348 839207
58371 839207 848026 858577 868363 876213 884133 893846 904216 913831 923366 933564 943658 953571 964920
58358I64920J3121J2769J1362J1735J3211J2934J1304J0913J1111R024N285L314
58346A091003L424K955J875K754N393O839O802P799J0020J1102J1038J2162J4253
58333A187419J4758J3865J4331J6250J6949J6072J5841J6405J5849J4537J4521
58322A356797J5059J3712J1286J0550J0831R346P001P102R130R775R358J0925
58310A480872J3660J3819J1845J1865J4292J5637J5447J6651J9015J9204J7540
58299A649847J7764J9859K0041J8071J7583J8943J8940J7664J8497K1074K1726
58288A860009K1005K2996K7070K8437K7151K8186L2050L3938L3043L3860L7204
58277B184949L8779L7954L9097M2697M4162M2950M3881M7710M9672M9100N1132
$$ plain form
58358 964920 978041 990810 1002172 1013907 1027118 1040052 1051356 1062269 1073380 1082404 1087689 1091003
58346 1091003 1094427 1097382 1099257 1102011 1107404 1114243 1121045 1128844 1138864 1149966 1161004 1173166 1187419
58333 1187419 1202177 1216042 1230373 1246623 1263572 1279644 1295485 1311890 1327739 1342276 1356797
58322 1356797 1371856 1385568 1396854 1407404 1418235 1427581 1434582 1441684 1450814 1460589 1469947 1480872
58310 1480872 1494532 1508351 1520196 1532061 1546353 1561990 1577437 1594088 1613103 1632307 1649847
58299 1649847 1667611 1687470 1707511 1725582 1743165 1762108 1781048 1798712 1817209 1838283 1860009
58288 1860009 1881014 1904010 1931080 1959517 1986668 2014854 2046904 2080842 2113885 2147745 2184949
58277 2184949 2223728 2261682 2300779 2343476 2387638 2430588 2474469 2522179 2571851 2620951 2672083
58266B672083N6838O1104O2471O5528P1396P5418P6534P9259Q4096Q5929Q4148
58255C474804Q4274Q7240Q7625Q4741Q4610Q8453R0426Q9518R2043R9443J05421
58244D468598J08268J13930J23651J31123J35341J43240J56032J66267J72386
58235E718836J82235J97976K11832K21398K34431K53534K71231K85321L03565
58226G880359L27855L49988L68627L93506M27008M59355M88166N24023N70192
58217A1789079O16588O61032P15634P84457Q56838R31138J021723J133558J254999
58208A9765046J385683J544896J741689J965850K220747K534038K923013L384229
58200C7465191L933414M618586N476614O518223P774789R312394J1177634J3383715
$$ plain form
58266 2672083 2728921 2790025 2852496 2918024 2989420 3064838 3141372 3220631 3304727 3390656 3474804
58255 3474804 3559078 3646318 3733943 3818684 3903294 3991747 4082173 4171691 4263734 4363177 4468598
58244 4468598 4576866 4690796 4814447 4945570 5080911 5224151 5380183 5546450 5718836
58235 5718836 5901071 6099047 6310879 6532277 6766708 7020242 7291473 7576794 7880359
58226 7880359 8208214 8558202 8926829 9320335 9747343 10206698 10694864 11218887 11789079
58217 11789079 12405667 13066699 13782333 14566790 15423628 16354766 17376489 18510047 19765046
58208 19765046 21150729 22695625 24437314 26403164 28623911 31157949 34080962 37465191
58200 37465191 41398605 46017191 51493805 58012028 65786817 75099211 86276845 99660560
58192I9660560J5969480J8991809K2415557K6093262K9878434L3551118L6395819
58185B82956039L6942413L3514377K5363314J3369767l25375j3328791k3806906
58178C54684838l0781416l4105332l4297483l2250508k8891550k4957016k0935065
58171A48466468j7104926j3605592j0489809p731237n243102l013897j280348
58164H9997557m68333q38263k185346l941115n545060o679103p234668p222456
58156E5883213o761013o049349n265381m500354l795794l189216k696137k292633
58148B1333336j951470j671129j450581j266849j100608r58412q48923p60096
58140A1325268o78635o10231n62023n24264m86346m53332m30706m09314l80323
$$ plain form
58192 99660560 115630040 134621849 157037406 183130668 213009102 246560220 282956039
58185 282956039 319898452 353412829 378776143 392145910 391820535 378491744 354684838
58178 354684838 323903422 289798090 255500607 223250099 194358549 169401533 148466468
58171 148466468 131361542 117755950 107266141 99534904 94291802 91277905 89997557
58164 89997557 89529224 88690961 86505615 82564500 77019440 70340337 63105669 55883213
58156 55883213 49122200 43072851 37807470 33307116 29511322 26322106 23625969 21333336
58148 21333336 19381866 17710737 16260156 14993307 13892699 12934287 12085364 11325268
58140 11325268 10646633 10036402 9474379 8950115 8463769 8010437 7579731 7170417 6790094
58131F790094l49859l25079l00370k70194k41376k20218k00952j78929j61918
58122D541199j56631j56375j53229j50310j51310j50007j41305j31442j26513
58113C224077j21501j10931r9946r4500r0537q3017p6112p4481p3488o7988o2183
58102B269393o1230o1341n7481n3016n2557n2776m9310m5442m5323m5559m1992
58091A703366l7934l7370l6768l1918k6429k5191k5570k3125k0135k0499k1868
58080A396559k0700j9669k2341k5673k5330k3492k4162k5571k4361k2544k3321
58069A139395k4507k2909k0715k0984k1303j8524j5246j5034j5599j3313j0271
58058I40990j0250j1702j1230j0131j1070j2095j0322p973q459j0035r428q258
$$ plain form
58131 6790094 6440235 6115156 5814786 5544592 5303216 5082998 4882046 4703117 4541199
58122 4541199 4384568 4228193 4074964 3924654 3773344 3623337 3482032 3350590 3224077
58113 3224077 3102576 2991645 2891699 2797199 2706662 2623645 2547533 2473052 2399564 2331576 2269393
58102 2269393 2208163 2146822 2089341 2036325 1983768 1930992 1881682 1836240 1790917 1745358 1703366
58091 1703366 1665432 1628062 1591294 1559376 1532947 1507756 1482186 1459061 1438926 1418427 1396559
58080 1396559 1375859 1356190 1333849 1308176 1282846 1259354 1235192 1209621 1185260 1162716 1139395
58069 1139395 1114888 1091979 1071264 1050280 1028977 1010453 995207 980173 964574 951261 940990
58058 940990 930740 919038 907808 897677 886607 874512 864190 856217 847758 837723 828295 820037
58046H20037r653j1860j1422r551r336r720q138o173o681q162p703o673p778r295
58032F97892q067n650n781q076r591j0251j1449j1806r633p244p557q772p650
58019E86365n486n487o590n617l471l526n415n904m620l861l930l359k626l092
58005E23381l573k111J73R09N43Q08J122M07K65K270M342L930K485K527K854J191
57989E41523q21k66J655J799O32O35J164n7k059k324j732k803m486l868j750j300
57973E25942k344k081o00n53j934k132p76N5L0N90J258K70j647k183j555j708
57957E10632k357j977j680l607o356o670m984m601n851n945m414l808m739m850
57943D48793l212j567p16L97J642J566O45J061K858L891L785M414O172P347P444
$$ plain form
58046 820037 810384 798524 787102 777551 768215 758495 750357 744184 737503 729341 721638 714965 707187 697892
58032 697892 689825 684175 678394 670318 660727 650476 639027 627221 617588 610344 602787 594015 586365
58019 586365 580879 575392 568802 563185 559714 556188 550773 544869 540249 536388 532458 529099 526473 523381
58005 523381 519808 517697 517870 518779 519322 520130 521252 521659 521924 524194 528536 532466 534951 537478 540332 541523
57989 541523 540702 540436 542091 543890 544522 545157 546321 546264 544205 541881 540149 537346 532860 528992 527242 525942
57973 525942 523598 521517 520917 520364 518430 516298 515522 515577 515607 516197 517455 517725 516078 513895 512340 510632
57957 510632 508275 506298 504618 501011 494655 487985 483001 478400 472549 466604 462190 458382 453643 448793
57943 448793 445581 444014 443298 443695 445337 446903 447548 448609 451467 455358 459143 463557 469729 477076 484520
57928D84520P771Q449Q148P059O924P915Q451Q173Q130Q134O958N020L782K881
57914E82315Q60j676k961l536n412q208r719r951j0850j2307j2249j0745j0192
57901D85369j1206j1960j1752j1688j1692j0433q469p900q584q188o292m897m635
57888C67673m051k912k631k999k129j48P87N63J467L834N178M543L951M462M460
57873C82048L129K201K749L354K807J738M56j836m615n756m866m065m447m655
57859C68242l933l473l602k742n02J170J325J637L247M789N201N731P434R115
57845C93639R550R550J0150J0775J0735J0604J0697J0031Q090N960M510L158J333
57832D98782n67k416m672o835p649p432p992r540j0104q800p274o831o585n521
$$ plain form
57928 484520 492291 500740 508888 515947 522871 530786 539237 547410 555540 563674 570632 575652 579434 582315
57914 582315 583175 581499 578538 575002 569590 561382 551663 541712 530862 518555 506306 495561 485369
57901 485369 474163 462203 450451 438763 427071 416638 408169 400269 391685 383497 377205 372308 367673
57888 367673 363622 360710 358079 355080 352951 352803 353590 354153 355620 359454 364632 369175 373126 377588 382048
57873 382048 385177 387378 390127 393481 396288 398026 398482 396646 392031 386275 381409 377344 372897 368242
57859 368242 364309 360836 357234 354492 353990 355160 356485 358122 361369 366158 371359 377090 384524 393639
57845 393639 403189 412739 422889 433664 444399 455003 465700 475731 483821 489781 494291 497449 498782
57832 498782 498215 495799 491127 484292 476643 469211 461219 451679 441575 432775 425501 418670 412085 406564
57818D06564m153k973j442L70J272J127J424K613L140K207J276J517J982J582
57804D16506Q58M11m74k221l751m215m320m803n191n058m965n196n153m746m657
57789C63025m697l749k002j139j684k265k127k070k279j687l90n5r00q94P95K258
57773C40140K140J805K631L633L700L796N000O433P081P648Q705Q972P502N721
57759D14907N196N053L717J656L00m34j553l027m316n686p327q243p644o345n344
57744C80910m231k518j182j173j655j389p90q90j330j191q47j273k131k234j345
57729C56731k38O13J223J512J546J779K295K490K146J916K153K275J887J453J231
57714C81012P47o9n52o71j272k386k824k139j336j017n59R2j81j529k350j758
$$ plain form
57818 406564 402411 399438 397996 398366 399638 400765 402189 404802 407942 410149 411425 412942 414924 416506
57804 416506 417364 417775 417301 415080 411329 407114 402794 397991 392800 387742 382777 377581 372428 367682 363025
57789 363025 358328 354579 352577 351438 349754 347489 345362 343292 341013 339326 338936 338881 337981 337087 337882 340140
57773 340140 342280 344085 346716 350349 354049 357845 362845 369278 376359 384007 392712 401684 409186 414907
57759 414907 420103 425156 428873 430529 430829 430395 428842 425815 421499 415813 408486 400243 392599 386254 380910
57744 380910 376679 374161 372979 371806 370151 368762 367972 367082 365752 364561 363714 362441 360310 358076 356731
57729 356731 356493 357106 358329 359841 361387 363166 365461 367951 370097 372013 374166 376441 378328 379781 381012
57714 381012 381759 381690 381138 380467 379195 376809 373985 371846 370510 369493 368934 369026 368845 367316 364966 363208
57698C63208q44m40L52K009L138K756K032K111K114J125K39O17J152K36j531k460
57682C75814k369k021j152Q90L445N457P306J0097J3891J8090K2754K8168L4060
57669E14430M0544M8780N9370P1211Q2842R2976R8274R2839P2778M0591L293l2583
57657A185345o2499q2731r1250q9780q2533p2791o1992n1327m2043l4342k7693
57646D86364k2099j7825j4382j1134q313o253m416k425j124j136j424q01J22J82
57632C95336j42M18J676K460K601K678K472J366j69j124j421j466j013K5N19m88
57616D03728k096k812k715k702k557j616n09l35p67q05o23r07j148n65J29o0k48
57599C83392R28K472K091j73j923j982j665k219l168l647l560l010k096j516j978
$$ plain form
57698 363208 362364 361924 362276 364285 367423 370179 372211 374322 376436 377561 377800 378417 379569 379805 378274 375814
57682 375814 373445 371424 370272 371162 374607 380064 387370 397467 411358 429448 452202 480370 514430
57669 514430 554974 603754 663124 734335 817177 910153 1008427 1101266 1174044 1214635 1217928 1185345
57657 1185345 1122846 1040115 948865 859085 776552 703761 641769 590442 548399 514057 486364
57646 486364 464265 446440 432058 420924 412611 406358 401942 399517 398393 397257 395833 395032 395154 395336
57632 395336 395194 395612 397288 399748 402349 405027 407499 408865 408696 407572 406151 404685 403672 403697 404216 403728
57616 403728 401632 398820 396105 393403 390846 389230 388721 388386 387619 386814 386191 385284 384136 383571 383700 383640 383392
57599 383392 384320 386792 388883 388710 386787 384805 383140 380921 377753 374106 370546 367536 365440 363924 361946
57584C61946k926l204k848k768k892k314j160o15j022j511j640j884k387k683
57570C32092k716k812k658j717n68m13j220j761j482j014q04n79k38kK74R43J688
57553C17013J925J806J803J698J198J034J974L228L316K245J313R92O60J79J60
57538C40544O83J243J898L051M222M394L519K431J521P55N78J295J992J647R74
57523C70747J392K595L033K559K579L465L882L038J839J315J384J646K086K554
57509D04114K666K468K250J810Q93Q6K8J36n11j388j241k66J37l82r07j137j671
57492D07085k359k178r99J07N16N44L43k31o35j63O36O44J36L04R56P52k59m85
57474D04714N59J479J316P15K36n09j436j506m59O08J035J451K235K688K463K287
$$ plain form
57584 361946 359020 355816 352968 350200 347308 344994 343834 343219 342197 340686 339046 337162 334775 332092
57570 332092 329376 326564 323906 322189 321621 321208 319988 318227 316745 315731 314927 314348 314110 314108 314382 315325 317013
57553 317013 318938 320744 322547 324245 325443 326477 328451 331679 334995 337240 338553 339545 340205 340384 340544
57538 340544 341227 342470 344368 347419 351641 356035 359554 361985 363506 364261 364839 366134 368126 369773 370747
57523 370747 372139 374734 377767 380326 382905 386370 390252 393290 395129 396444 397828 399474 401560 404114
57509 404114 406780 409248 411498 413308 414201 414287 414315 414451 413940 412552 411311 411045 411182 410800 409893 408756 407085
57492 407085 404726 402548 401549 401656 402172 402716 403059 402828 402193 402030 402666 403310 403446 403750 404706 405458 405199 404714
57474 404714 405273 406752 408068 408783 409019 408510 407074 405568 405109 405717 406752 408203 410438 413126 415589 417876
57458D17876K594K794K532K376K662K941L072L548M307M532M033L537L302K827
57444D62933K226K306K951L032K334J991K492K899K649K480K870L128K775K459
57430D99525K709L134L478M063M722M682M093M154N098N577M792L754L571L877
57416E57229L821L317K629J880J624K594M253M966M215L288L157L221K835K545
57402F01574K887L386L669M213N150N630N228M759M856N052M965N095N654N987
57388F68105N916O252P201P700P263O889P228P417O797O239O544O992O775O522
57374G63840O991P483P025O021N380M977M354L964M399N140N392N473O147P221
57360H43807P864P816P378O821O518O916P694P833P146O741P273P902P822P604
$$ plain form
57458 417876 420470 423264 425796 428172 430834 433775 436847 440395 444702 449234 453267 456804 460106 462933
57444 462933 465159 467465 470416 473448 475782 477773 480265 483164 485813 488293 491163 494291 497066 499525
57430 499525 502234 505368 508846 512909 517631 522313 526406 530560 535658 541235 546027 549781 553352 557229
57416 557229 561050 564367 566996 568876 570500 573094 577347 582313 586528 589816 592973 596194 599029 601574
57402 601574 604461 607847 611516 615729 620879 626509 631737 636496 641352 646404 651369 656464 662118 668105
57388 668105 674021 680273 687474 695174 702437 709326 716554 723971 730768 737007 743551 750543 757318 763840
57374 763840 770831 778314 785339 791360 796740 801717 806071 810035 814434 819574 824966 830439 836586 843807
57360 843807 851671 859487 866865 873686 880204 887120 894814 902647 909793 916534 923807 931709 939531 947135
57346I47135Q025Q703Q910Q761Q597Q202P589P494Q131Q578Q377Q536R776J1058
57332A067872J1175J0651J0654J0992J0753J0101R907J0164J0185J0012J0302
57321A182768J1131J1890J2116J1702J0734R749R572J0298J1188J1964J3144J4594
57309A320850J5111J4298J3451J3539J3728J3122J2563J3141J4166J4345J4019
57298A472333J4409J5373J5681J5131J4743J5027J5487J5706J5821J5982J6235
57287A641928J6706J7259J7433J7301J7654J8690J9474J9462J9514K0460K1727
57276A847608K2541K3287K4436K5175K4632K3562K3299K3768K4047K4204K4965
57265B111524K6033K6315K5592K4647K4016K3752K4055K5018K6019K6428K6531
$$ plain form
57346 947135 955160 963863 972773 981534 990131 998333 1005922 1013416 1021547 1030125 1038502 1047038 1056814 1067872
57332 1067872 1079047 1089698 1100352 1111344 1122097 1132198 1142105 1152269 1162454 1172466 1182768
57321 1182768 1193899 1205789 1217905 1229607 1240341 1250090 1259662 1269960 1281148 1293112 1306256 1320850
57309 1320850 1335961 1350259 1363710 1377249 1390977 1404099 1416662 1429803 1443969 1458314 1472333
57298 1472333 1486742 1502115 1517796 1532927 1547670 1562697 1578184 1593890 1609711 1625693 1641928
57287 1641928 1658634 1675893 1693326 1710627 1728281 1746971 1766445 1785907 1805421 1825881 1847608
57276 1847608 1870149 1893436 1917872 1943047 1967679 1991241 2014540 2038308 2062355 2086559 2111524
57265 2111524 2137557 2163872 2189464 2214111 2238127 2261879 2285934 2310952 2336971 2363399 2389930
57254B389930K6921K7454K7738K8005K8623K9327K9832L0475L1315L1533L0698
57243B711851K9738K9568K9597K8781K7223K5638K4163K2855K2309K2529K2336
57232B996588K1210K0527K1410K2669K2636K1890K2161K3446K4353K4522K4647
57221C246059K4659K3992K3214K3330K3799K3295K2105K1735K2399K2896K2863
57210C500346K3098K3628K3428K2347K1459K1280K1137K0536J9783J9166J8879
57199C735087J9632K1912K4761K6630K7236K7238K6666K5339K4363K5100K6839
57188D010803K7539K6887K6534K7196K7673K7217K6681K6728K6684K6076K5669
57177D305687K6081K6714K6837K6569K6180K5387K3983K2200K0126J7594J4963
$$ plain form
57254 2389930 2416851 2444305 2472043 2500048 2528671 2557998 2587830 2618305 2649620 2681153 2711851
57243 2711851 2741589 2771157 2800754 2829535 2856758 2882396 2906559 2929414 2951723 2974252 2996588
57232 2996588 3017798 3038325 3059735 3082404 3105040 3126930 3149091 3172537 3196890 3221412 3246059
57221 3246059 3270718 3294710 3317924 3341254 3365053 3388348 3410453 3432188 3454587 3477483 3500346
57210 3500346 3523444 3547072 3570500 3592847 3614306 3635586 3656723 3677259 3697042 3716208 3735087
57199 3735087 3754719 3776631 3801392 3828022 3855258 3882496 3909162 3934501 3958864 3983964 4010803
57188 4010803 4038342 4065229 4091763 4118959 4146632 4173849 4200530 4227258 4253942 4280018 4305687
57177 4305687 4331768 4358482 4385319 4411888 4438068 4463455 4487438 4509638 4529764 4547358 4562321
57166D562321J3069J2171J1782J1463J1000R999Q419P205P153P384O382M240K328
57153D674916R08j103l966o488p932q930j0047j1009j1761j2838j4129j4684j4238
57140D558699j3621j3091j1602q407m286n00K529M992O934Q238Q762Q246O623
57127D553516M420K156k87k981n055n538m636k989j76M632J0915J7239K3130K9001
57113D623347L4571L9157M3353M8680N5725O4407P5918R2150J13125J37070J63581
57102E491084J94828K33287K80236L36973M05639M88033N85219O98733Q30453
57093I544485R80427J146077J323714J509119J696105J876178K040412K180795
57085B2297312K289858K359924K381539K340288K216825J995312J674498J268848
$$ plain form
57166 4562321 4575390 4587561 4599343 4610806 4621806 4631805 4640224 4647429 4654582 4661966 4668348 4672588 4674916
57153 4674916 4675824 4674721 4670755 4664267 4656335 4647405 4637358 4626349 4614588 4601750 4587621 4572937 4558699
57140 4558699 4545078 4531987 4520385 4511978 4507692 4507192 4509721 4514713 4521647 4529885 4538647 4546893 4553516
57127 4553516 4557936 4560092 4559805 4556824 4551769 4546231 4541595 4538606 4538430 4543062 4553977 4571216 4594346 4623347
57113 4623347 4657918 4697075 4740428 4789108 4844833 4909240 4985158 5077308 5190433 5327503 5491084
57102 5491084 5685912 5919199 6199435 6536408 6942047 7430080 8015299 8714032 9544485
57093 9544485 10524912 11670989 12994703 14503822 16199927 18076105 20116517 22297312
57085 22297312 24587170 26947094 29328633 31668921 33885746 35881058 37555556 38824404
57077C8824404P98657K82851k56845p89201j276510j685997j998978k212370k334791
57068B9351220k380364k362924k293902k184129k045155j887587j719591j548253
57060A2929315j380747j222719j076675r43425q24021p19098o27675n48279m80305
57051E106371m22988l74088l31156k93441k61188k33854k10225j89651j72015
57042B617765j56999j44335j34093j25925j18666j11429j04245r7115q9547q1723
57032A453688p4830o9355o4241n8617n3087m8286m3524l8017l2246k6903k1535
57021I23047j5406q621j279P465J8344L0960M4767O0167P7850R7865J19016J36841
57009A491016J41755J23143P8747J8993m0146q7719j20513j38806j43693j38011
$$ plain form
57077 38824404 39623061 39905912 39649067 38859866 37583356 35897359 33898381 31686011 29351220
57068 29351220 26970856 24607932 22314030 20129901 18084746 16197159 14477568 12929315
57060 12929315 11548568 10325849 9249174 8305749 7481728 6762630 6134955 5586676 5106371
57051 5106371 4683383 4309295 3978139 3684698 3423510 3189656 2979431 2789780 2617765
57042 2617765 2460766 2316431 2182338 2056413 1937747 1826318 1722073 1624958 1535411 1453688
57032 1453688 1378858 1309503 1245262 1186645 1133558 1085272 1041748 1003731 971485 944582 923047
57021 923047 907641 899020 897741 905206 923550 954510 999277 1059444 1137294 1235159 1354175 1491016
57009 1491016 1632771 1755914 1834661 1853654 1813508 1725789 1605276 1466470 1322777 1184766
56999A184766j26036j11137r5226q0158o7659n7788m9299m1617l5037k9351k3898
56988D67560j8809j4628j0903o774k753l14K28j21q87k643n592r022j2235j4849
56974C68258j6317j6300j5466j4688j3701j1696q975o659m934l041q46R53K331
56961B58919M247P223J0607J3467J5301J5836J4936J2716R158L962k519q749j3324
56948C41780j6303j8241j8652j6834j3628j0790q828o863m431j925O30L713P089
56935B36717R868J1991J4435J7718K1164K3755K4627K2727J7263Q913l24q762
56923D00092j5827k1282k4641k5648k4646k2303j9383j6670j4490j2511j0500
56912A92191q909q076p445o341m992l897k803j310K9M47L18N62J162J438J439
$$ plain form
56999 1184766 1058730 947593 852367 772209 704550 646762 597463 555846 520809 491458 467560
56988 467560 448751 434123 423220 416446 413693 413379 413607 413486 412599 409956 404364 395342 383107 368258
56974 368258 351941 335641 320175 305487 291786 280090 271115 264456 259522 256481 255635 256588 258919
56961 258919 263166 270389 280996 294463 309764 325600 340536 353252 362410 366372 363853 355104 341780
56948 341780 325477 307236 288584 271750 258122 247332 238504 231641 227210 225285 225915 229628 236717
56935 236717 246585 258576 273011 290729 311893 335648 360275 383002 400265 409178 408854 400092
56923 400092 384265 362983 338342 312694 288048 265745 246362 229692 215202 202691 192191
56912 192191 183282 175206 167761 161420 156428 152531 149728 148418 148447 148894 149212 149774 150936 152374 153813
56897A53813J699K038K022K304M051P026R734J1434J2679J3918J4937J5820J6953
56884B68428J7811J6975J3802R057L659k070p636j1910j3990j3879j2143r482
56872B58622o605l830p79K829O436R456J2420J6364K1312K6424L1341L6268M0941
56859D51199M4531M6267M5113L9326K7968J2830k506j5492k5425l1936l4473l3456
56847E23946l0272k5708j9685j2690n998m7O064J3017K0423K7945L5998M4805
56835E77798N3836O2542P0398P5593P4807O5279M6826K1852n736l1523n1896o5271
56823H94505p1835p2180o7068n8359m8731l9865l1675k3579j5501p388J177J0220
56811D69721J9057K7121L4555M1601M7882N2295N2976M7654L5170J6979l485k2990
$$ plain form
56897 153813 155512 157550 159572 161876 165927 172953 182687 194121 206800 220718 235655 251475 268428
56884 268428 286239 303214 317016 326073 329732 327662 320026 308116 294126 280247 268104 258622
56872 258622 252017 248187 247408 250237 256673 266129 278549 294913 316225 342649 373990 410258 451199
56859 451199 495730 541997 587110 626436 654404 667234 664728 649236 623811 591875 557402 523946
56847 523946 493674 467966 448281 435591 429593 429546 435610 448627 469050 496995 532993 577798
56835 577798 631634 694176 764574 840167 914974 980253 1027079 1048931 1043195 1011672 959776 894505
56823 894505 822670 750490 683422 625063 576332 536467 504792 481213 465712 458324 459501 469721
56811 469721 488778 515899 550454 592055 639937 692232 745208 792862 828032 845011 841526 818536
56799H18536l9398n1033n6784n7206n4219m9318m2923l5535k8252k1671j5422
56788C66775r288l807O83M748R060J3673J8385K2945K6494K7566K5078J8888R446
56775E30646k248j4278k4397l1373l5261l6443l5287l2647k9608k6499k2997j9191
56763B20417j5696j2765j0266q467p711p442o725n685n189n180m703l663l020
56750A23905l081l013k394j779j458j062p33j212k251k545j680p59n07k93L34
56735A01472O76K44l06m08m93q45q88m07j67m72m26M32J072O34k13n73p84j354
56717I7194j662j040j59O6N3O70J528J588R39N54O64O18J99j19q3R1K94N96Q27
56698A02818P31M07J29o0j99k12j79l61o11m08J71K40n89j382j066J24J092J260
$$ plain form
56799 818536 779138 728105 671321 614115 559896 510578 467655 432120 403868 382197 366775
56788 366775 357487 353680 354363 359111 368171 381844 400229 423174 449668 477234 502312 521200 530646
56775 530646 528398 514120 489723 458350 423089 386646 351359 318712 289104 262605 239608 220417
56763 220417 204721 191956 181690 173223 165512 158070 151345 145660 140471 135291 130588 126925 123905
56750 123905 120824 117811 115417 113638 112180 111118 110385 109173 106922 104377 102697 101938 101431 101138 101472
56735 101472 102148 102392 102086 101678 101185 100340 99452 99045 98878 98406 97980 98412 99484 100118 99905 99332 98548 97194
56717 97194 95532 94492 94333 94399 94452 95122 96650 98238 99177 99731 100395 101013 101212 101093 101010 101101 101395 101991 102818
56698 102818 103549 103956 104085 104025 103826 103614 103435 103074 102463 102055 102226 102466 101877 100495 99429 99553 100645 101905
56680A01905Q79L69LJ3M29R51J251J235R69O54O58R81R51K2j174j500q74j86K58
56661A07794R44J794J956J288P30P68Q48O87Q83J572J860J260N50L84L03j66n42
56644A22913l60J0K11N49J041J069O84R86K311L356L139K522K629L006K730K246
56628A49042K581L520M044L952L700L250K313J299P83M79j05n54j90N14M91k61
56612A74858o68j75O24R22N98J00m7K39L17m90j801k496k323k295k960l409k723
56595A58271j456p48p57q69q24p07l76K20O43N55K53J39J86L06N56O60J71n64
56577A55659o33m5J77k09j41Q30J659J559J278J593K041K192K727M000M932M728
56561A82347M482N525P351Q669R471J0391J0925R976P610M834K228K6j139r36
$$ plain form
56680 101905 102784 103153 103156 103169 103598 104549 105800 107035 108004 108658 109316 110297 111248 111270 110096 108596 107722 107536 107794
56661 107794 108738 110532 112488 113776 114506 115274 116122 116809 117692 119264 121124 122384 122934 123318 123621 123455 122913
56644 122913 122553 122563 122774 123323 124364 125433 126117 127103 129414 132770 135909 138431 141060 144066 146796 149042
56628 149042 151623 155143 159187 163139 166839 170089 172402 173701 174484 174963 174858 174304 174114 174628 175119 174858
56612 174858 174190 174015 174639 175561 176159 176259 176212 176451 176768 176278 174477 171981 169658 167363 164403 160994 158271
56595 158271 156815 156067 155310 154441 153617 152910 152534 152754 153397 153952 154205 154344 154530 154836 155392 156052 156223 155659
56577 155659 155026 154981 155158 154949 154808 155638 157297 158856 160134 161727 163768 165960 168687 172687 177619 182347
56561 182347 186829 192354 199705 208374 217845 228236 239161 249137 256747 261581 263809 263835 262696 261760
56547B61760j38L50O51J081J150N49Q2L34M34n56k024k946l542m376m966m826
56531B43017m743n356n648m639l392l349l764l091j865j753k459k151p05N7o78
56516A99481j759k221k310k171j529q45r69j478j149j92j67j407k351j859o12
56501A78462K59N01K62l85j024j080o99m91m39n8M84N91M25O09R14N26m43j018
56483A77396q17l32J57O99R44M73k39l26J65N71P78R92R01L38J71J110K172J954
56465A87107Q60M69J084J645J686J642J580J268J196J833K321J664P02R72K094
56450B08123K422J887J885K560K603J811J472J922J984J203N55N10L87PK4L18
56434B29673k7p81o67K20K34j061k017j475l25K42K64J00l16p09n18j86p64j858
$$ plain form
56547 261760 261622 261972 262623 263704 264854 265403 265485 265819 266253 265697 263673 260727 257185 252809 247843 243017
56531 243017 238274 232918 227270 222631 219239 215890 212126 209035 207170 205417 202958 200807 200102 200159 199481
56516 199481 197722 195501 193191 191020 189491 188646 187677 186199 185050 184858 184691 183284 180933 179074 178462
56501 178462 178721 179222 179484 179099 178075 176995 176296 175805 175366 175308 175792 176383 176808 177417 178331 178857 178414 177396
56483 177396 176579 176247 176404 177103 178047 178520 178281 177955 178120 178691 179469 180461 181362 181700 181871 182981 185153 187107
56465 187107 187967 188436 189520 191165 192851 194493 196073 197341 198537 200370 202691 204355 205057 206029 208123
56450 208123 210545 212432 214317 216877 219480 221291 222763 224685 226669 227872 228427 228937 229324 229331 229355 229673
56434 229673 229646 228865 228198 228418 228652 227591 225574 224099 223774 224016 224280 224380 224064 223355 222837 222651 221887 220029
56416B20029j776j44J449J858J607J225L48q92j485j280j317j818j655m70N51
56401B16230P51R50J560J728J182J003J639J991J503J273J988K512J835P63M30
56386B37338N69M97M44P36Q97O24M75P20P38L17K54R14J522J668K011K728K848
56369B55300J986J249J401J637J141M34K23K03or2ql79j162j406r91r80j541j326
56351B55683J32J336J243Q68J217J423N14o33p55k33m8J9N91J200J144Q67J141
56334B65709J691J902J986K332K613K504K409K519K311J745J816K917L955M020
56320C00429L656L450K874J659Q85J291J783J065l49j088q95l34M51J356J655
56305C17888R07j64p44r96j160o33R66K732L499L224K534J726R15K80l46j221
$$ plain form
56416 220029 218253 218109 219558 221416 223023 224248 224596 223704 222219 220939 219622 217804 216149 215679 216230
56401 216230 216981 217931 219491 221219 222401 223404 225043 227034 228537 229810 231798 234310 236145 236908 237338
56386 237338 237907 238404 238848 239584 240481 241105 241580 242300 243038 243355 243609 244523 246045 247713 249724 252452 255300
56369 255300 257286 258535 259936 261573 262714 263148 263371 263574 263568 263476 263468 263089 261927 260521 259530 258550 257009 255683
56351 255683 255815 257151 258394 259262 260479 261902 262416 261783 261028 260795 260747 260766 261357 262557 263701 264568 265709
56334 265709 267400 269302 271288 273620 276233 278737 281146 283665 285976 287721 289537 292454 296409 300429
56320 300429 304085 307535 310409 312068 312953 314244 316027 317092 316743 315655 314760 314426 314877 316233 317888
56305 317888 318795 318631 317887 316891 315731 315098 316064 318796 322295 325519 328053 329779 330694 330974 330628 329407
56289C29407j813j318k59rn02k53R93J681J198Q75J402J561O89J64R28J739J469
56272C37952J106J761K527K241J587J572J557P03q4M23J696K507K870L274L380
56257C65072L024L176M279N059M566L972M674O065O868P245P869Q386Q448Q930
56243D47633J0358J1596J1695J1593J2329J3174J3263J3406J4307J4722J3433
56232E87509J1567J0824J0747R835Q004N960L600J026l70k7J36j658m231n531
56218F37391n920o840p689o896n116m481n348o287o667o936o878n914m679m341
56204E53399m703m700m166l566k802j806j285j512j435m56L93M11O59J802K484
56189E32717J688Q14J277K030J679J072J395J696R26M26J611L099L015K279K651
$$ plain form
56289 329407 327594 326276 326017 326008 325506 325253 326246 327927 329125 330000 331402 332963 333652 333816 334744 336483 337952
56272 337952 339058 340819 343346 345587 347174 348746 350303 351006 350922 351345 353041 355548 358418 361692 365072
56257 365072 368096 371272 375551 380610 385176 389148 393822 399887 406755 414000 421869 430255 438703 447633
56243 447633 457991 469587 481282 492875 505204 518378 531641 545047 559354 574076 587509
56232 587509 599076 609900 620647 630482 638486 644446 648046 649072 648702 648675 648811 647153 642922 637391
56218 637391 631471 624631 616942 610046 604930 600449 595101 588814 582147 575211 568333 562419 557740 553399
56204 553399 548696 543996 539830 536264 533462 531656 530371 528859 527424 526968 527361 527772 528431 530233 532717
56189 532717 534405 535219 536496 538526 540205 541277 542672 544368 545294 545720 547331 550430 553445 555724 558375
56174E58375L348K783J902K397L212K388Q77R98K301K611K056K477L733M184M046
56159E97688M834O141O378N995O714Q211Q799Q664R296J0470J0918J1168J2510
56146G07786J4092J4302J4072J5451J7846J9225K0059K2445K6091K8915L1006
56135I31290L4514M0126M7021N5609O6938Q0195R3991J08958J25669J41343J52254
56124A877908J57926J59078J53423J38515J17565R7288Q0759O7045N6668N1511
56114B957686M9333M4156L3071J8343K762j2342k4455l0693l2437l4893m1363
56103B929168n1719o6204q5669j07540j26209j38337j44001j42894j34183j20274
56093A812138j05732r1905p7091o2005m9988m1522l3818k6263k1074j7916j3499
$$ plain form
56174 558375 561723 564506 566408 568805 572017 574405 575282 576280 578581 581192 583248 585725 589458 593642 597688
56159 597688 602522 608663 615041 621036 627750 635961 644760 653424 662720 673190 684108 695276 707786
56146 707786 721878 736180 750252 765703 783549 802774 822833 845278 871369 900284 931290
56135 931290 965804 1005930 1052951 1108560 1175498 1255693 1349684 1458642 1584311 1725654 1877908
56124 1877908 2035834 2194912 2348335 2486850 2604415 2701703 2782462 2849507 2906175 2957686
56114 2957686 3007019 3051175 3084246 3102589 3105351 3093009 3068554 3037861 3005424 2970531 2929168
56103 2929168 2877449 2811245 2725576 2618036 2491827 2353490 2209489 2066595 1932412 1812138
56093 1812138 1706406 1614501 1537410 1475405 1425417 1383895 1350077 1323814 1302740 1284824 1271325
56082A271325p418l039j426K37K985M269L241K674L938M989M819N175O429O663
56068A304861O165P874J2011J5121J5807J6495J8303J9277J9005J9820K2025K3034
56056A499798K2498K3044K4770K4503K1798K0071K0343J9670J7230J6191J7780
56045A727696J9301J9699K1295K4397K6044K5847K7047L0227L2087L1940L3088
56034B018668L6169L7809L7510L8951M2669M4554M3710M4406M8075N0780N1028
56023B494329N2506N6473N9156N9408O1183O5633O8687O9242P1603P6954Q0829
56012C216003Q2048Q5342R1962R6795R8284J01730J09107J15209J17932J22414
56002D236826J30737J37726J41452J47464J57888J67049J72862J81424J95028
$$ plain form
56082 1271325 1263907 1260868 1259442 1259679 1262664 1266933 1270174 1272848 1276786 1281775 1286594 1291769 1298198 1304861
56068 1304861 1311026 1318900 1330911 1346032 1361839 1378334 1396637 1415914 1434919 1454739 1476764 1499798
56056 1499798 1522296 1545340 1570110 1594613 1616411 1636482 1656825 1676495 1693725 1709916 1727696
56045 1727696 1746997 1766696 1787991 1812388 1838432 1864279 1891326 1921553 1953640 1985580 2018668
56034 2018668 2054837 2092646 2130156 2169107 2211776 2256330 2300040 2344446 2392521 2443301 2494329
56023 2494329 2546835 2603308 2662464 2721872 2783055 2848688 2917375 2986617 3058220 3135174 3216003
56012 3216003 3298051 3383393 3475355 3572150 3670434 3772164 3881271 3996480 4114412 4236826
56002 4236826 4367563 4505289 4646741 4794205 4952093 5119142 5292004 5473428 5668456
55993E668456K07367K16128K28214K46406K63526K76293K91923L13940L35155
55984H047408L52351L73808M03946M34994M62834M96054N39856N86471O31606
55975A2329328O84168P49193Q18326Q88553R72222J076521J192477J317374J467185
55966B1495347J652738J866554K109170K404193K770419L206985L726291M372038
55958D3603735N182799O171466P365237Q826355J0604378J2714110J5190540J8095317
55950A27753937K1411967K5007311K8747249L2468559L5569611L6659020L3990103
55943C41607757K6610225J5194949J769589j1317446k2228075k9891827l3981724
55936B87763448l4851277l3336187l0390208k6789159k3067555j9572036j6483222
$$ plain form
55993 5668456 5875823 6091951 6320165 6566571 6830097 7106390 7398313 7712253 8047408
55984 8047408 8399759 8773567 9177513 9612507 10075341 10571395 11111251 11697722 12329328
55975 12329328 13013496 13762689 14581015 15469568 16441790 17518311 18710788 20028162 21495347
55966 21495347 23148085 25014639 27123809 29528002 32298421 35505406 39231697 43603735
55958 43603735 48786534 54958000 62323237 71149592 81753970 94468080 109658620 127753937
55950 127753937 149165904 174173215 202920464 235389023 270958634 307617654 341607757
55943 341607757 368217982 383412931 385182520 373865074 351636999 321745172 287763448
55936 287763448 252912171 219575984 189185776 162396617 139329062 119757026 103273804
55929A03273804j3836169j1597421r733040q203916o946271n898731n030625m321291
55921C7706340l734417l235436k813702k465677k173227j917289j696364j512950
55913A8157278j355938j212799j085813r80513q90188q06066p31226o70733o18595
55904I805407n67298n20235m82600m49545m14782l81869l55952l32930l07395
55895E992801k82977k64691k48757k29981k11586j98226j86416j71209j55554
55886D043404j43886j33044j18393j02820r0853p9648o4340m6952l1765j7005
55876C214698Q09J9014L2877M2774M9954M9961L8053J7272o056l0991n9389q8522
55864C280454j13312j32712j47611j55785j55166j48903j41289j31753j18491
$$ plain form
55929 103273804 89437635 77840214 68107174 59903258 52956987 47058256 42027631 37706340
55921 37706340 33971923 30736487 27922785 25457108 23283881 21366592 19670228 18157278
55913 18157278 16801340 15588541 14502728 13522215 12632027 11825961 11094735 10424002 9805407
55904 9805407 9238109 8717874 8235274 7785729 7370947 6989078 6633126 6300196 5992801
55895 5992801 5709824 5445133 5196376 4966395 4754809 4556583 4370167 4198958 4043404
55886 4043404 3899518 3766474 3648081 3545261 3454408 3374760 3310420 3263468 3231703 3214698
55876 3214698 3215507 3234521 3267398 3310172 3360126 3410087 3448140 3465412 3459356 3428365 3368976 3280454
55864 3280454 3167142 3034430 2886819 2731034 2575868 2426965 2285676 2153923 2035432
55855B035432j04451r3764q5349p5969o6694o0583n6710n2150m7453m4755m2912
55844A304642l9698l6451l5474l5181l2741k9257k7490k6694k4472k1553k0014
55833I75617j8900j6300j3702j3735j5297j5380j4066j3500j3668j3216j2818
55822H15035j3817j5128j5129j4825j5693j6401j5246j3599j3315j2994j0617
55811F58271p695o793p031o012m258l641l348j467J070K127K354L702N556O178
55797F39013O359P766R154Q166N543L701K494J98k598l971m508o329r211j1144
55783F44633j1792j2085j1507r292p245p817j0281j2126j3158j4688j5861j4520
55771E04261j1125q124n910k730J720N768Q424R713Q917N393O62l064n796q687
$$ plain form
55855 2035432 1930981 1837217 1751868 1675899 1609205 1548622 1491912 1439762 1392309 1347554 1304642
55844 1304642 1264944 1228493 1193019 1157838 1125097 1095840 1068350 1041656 1017184 995631 975617
55833 975617 956717 940417 926715 912980 897683 882303 868237 854737 841069 827853 815035
55822 815035 801218 786090 770961 756136 740443 724042 708796 695197 681882 668888 658271
55811 658271 650576 643783 636752 630740 626482 622841 619493 618026 619096 621223 623577 627279 632835 639013
55797 639013 645372 653138 662292 670458 676001 679702 682196 682394 679796 675825 671317 664988 655777 644633
55783 644633 632841 620756 609249 599957 592712 584895 574614 562488 549330 534642 518781 504261
55771 504261 493136 485012 479102 476372 478092 483860 492284 501997 510914 516307 516969 513905 508109 499422
55757D99422j1019j1182r801r011r271r585r990j1120j2135j1864j1140j1388
55745C71916j1931j1376j0420j0420j0391q568n816m278l723k473r01n69q39Q8
55731B90299J478R92j193k655k765l029l822m094m037m771n608m892l254k793
55717B49856l338k854j256m13m93J51J522J927J470K118L998N065M816M921N651
55702B73141N047K406o24l070n713q441r616q969q247q165p508n959m944m818
55688B04520m036k155q73j042j291o62r3j63J25J231J974J670J184R40J33j225
55672B00237j782j324j430k686l559l118k503k589k450j511r48j453j694n27J024
55657A73687J542J350J489J982K468L211M289N009N129N396O016N976M805L550
$$ plain form
55757 499422 488403 477221 467420 458409 449138 439553 429563 418443 406308 394444 383304 371916
55745 371916 359985 348609 338189 327769 317378 308810 302994 298716 294993 292520 291619 291050 290211 290299
55731 290299 291777 292769 291576 288921 286156 283127 279305 275211 271174 266403 260795 255903 252649 249856
55717 249856 246518 243664 242408 241995 241502 241653 243175 245102 246572 248690 252688 257753 262569 267490 273141
55702 273141 278188 280594 279970 276900 271187 262746 253130 244161 235914 227749 220241 214282 209338 204520
55688 204520 200484 198329 197456 196414 195123 194461 194368 194205 194330 195561 197535 199205 200389 201329 201462 200237
55672 200237 198455 197131 195701 193015 189456 186338 183835 181246 178796 177285 176337 174884 173190 172663 173687
55657 173687 175229 176579 178068 180050 182518 185729 190018 195027 200156 205552 211568 217544 222349 225899
55643B25899L095K815J842K96j510l726o035p367p381p030o970o759o204o000
55629A74965o283o066m901l683l034k343j186k96j64j49J91K39l57q02o07n96
55613A44928j465k489k608j963j412j392j846k485k606j667l07J57m05q74p68
55598A22798p95j204j213n98l24q67j381j193p42m26J15Q98J183Q26O73J010R83
55581A19743J99m86m91l60m33p4J076K398L455M498N274M971L895L578M442N113
55565A56798M807M559N090N270M011K047M98q85k595l942m202m102m703n746o342
55550A50563o414o269n724m700l846l577l349k684j966j507r78m74q04j888k318
55535A04065j449n26o02r13n35j37n44r76m42K94j28j383k004j542o96R2P76J046
$$ plain form
55643 225899 228994 231809 233651 233947 232437 228711 222676 215309 207928 200898 193928 187169 180965 174965
55629 174965 168682 162616 157715 154032 150998 148655 147469 147173 147009 146860 147051 147290 146933 146131 145524 144928
55613 144928 143463 140974 138366 136403 134991 133599 131753 129268 126662 124995 124688 124845 124440 123566 122798
55598 122798 122003 120799 119586 118988 118664 117797 116416 115223 114481 114055 114170 115068 116251 117077 117750 118760 119743
55581 119743 119942 119456 118965 118605 118172 118098 119174 121572 125027 129525 134799 139770 143665 147243 151685 156798
55565 156798 161605 166164 171254 176524 180535 182582 183080 182195 179600 175658 171456 167354 162651 156905 150563
55550 150563 144149 137880 132156 127456 123610 120033 116684 114000 112034 110527 109549 109075 108271 106383 104065
55535 104065 102616 102090 101488 100575 100040 99903 99359 98383 97941 98235 98107 96724 94720 93178 92482 92574 93350 94396
55517I4396P64N34P54P69Lr52j374j621k161k415j779r38p50q10m38j39n31p87
55499H2525J90J682K074J316P87R91J093O12O9j23j34q8L0q8o86j265j167n62
55481H7256o1K29M46L91M4J05Q98J497J007Q8l3N49Q17N76L65J29n45j163q18
55462I1777J39L56n77j678k101j924j367l96O59J090O79j10q15j222j056k64N55
55445H3745P04K88p8j97k24LO94J448J607J085K57o39j340j322n57P2j28o14n57
55426H4247k28l32n80j30Q39J285Q59K27p7p9K05Q52J615K198K707L156L044K213
55408A02021J533J648J726O97q30j345o93m1M5Nj25q24j765j924j238p01o16k54
55390I7319M72N17n02j475j480j057j050j280j218j065j178j178n76J69K08l69
$$ plain form
55517 94396 95160 95694 96448 97217 97220 96268 94894 93273 91112 88697 86918 85980 85230 84420 83982 83843 83312 82525
55499 82525 82715 84397 86471 87787 88574 89565 90658 91270 91339 91216 91082 90994 91024 90936 90250 88985 87818 87256
55481 87256 87195 87424 87870 88261 88305 88410 89308 90805 91812 91900 91867 92416 93233 93809 94174 94303 93758 92595 91777
55462 91777 91916 92272 91695 90017 87916 85992 84625 84229 84888 85978 86657 86547 85732 84510 83454 83190 83745
55445 83745 84449 84737 84659 84462 84238 84241 84935 86383 87990 89075 89332 88693 87353 86031 85474 85546 85418 84804 84247
55426 84247 84019 83687 83107 82977 83816 85101 85960 86187 86110 86031 86236 87088 88703 90901 93608 96764 99808 102021
55408 102021 103554 105202 106928 107625 106795 105450 104757 104716 104761 104766 104641 103817 102052 100128 98890 98189 97573 97319
55390 97319 97791 98308 97806 96331 94851 93794 92744 91464 90246 89181 88003 86825 86249 86418 86626 86257
55374H6257o05l9O42N44k65q28m67M09Q96P44M52K97Rl75j73P89J508J065mn79
55354I0277o21r47j686k093j779j091l12N92J401J691J515J266R54L72j38N1Q35
55337I0287J453J520J266P83o0r85j366j033l84J62K88l27j415j809p75O80R19
55320H9204q7q96q24o18q31q99k93O15J291J699J747J070j80j139j320j126j010
55303H6403q64n25j26L81J211J936J630K65q98r14l44k15n24n15L0N05L60l41
55285H7455j112j495j352r33n92m29l61l41l12n8M74R87J232J367J443J063J22
55268H7158n74l16L50L93j34m11l92p32j261r67L02J397J503J086Q23O91N34N39
55250H9989O31L78o9P5Q61J187M01o13o87M0N05J98n41j242j658j674j336q30
$$ plain form
55374 86257 85652 85613 86255 86799 86534 85706 85239 85648 86544 87288 87740 88037 88046 87671 87498 88287 89795 90860 90856 90277
55354 90277 89656 88709 87023 84930 83151 82060 81748 82340 83741 85432 86947 88213 89167 89539 89401 89452 90287
55337 90287 91740 93260 94526 95309 95249 94264 92898 91865 91481 91643 91931 91604 90189 88380 87605 88285 89204
55320 89204 89117 88221 87397 86779 85948 85049 84756 85371 86662 88361 90108 91178 90998 89859 88539 87413 86403
55303 86403 85539 85014 84888 85269 86480 88416 90046 90311 89413 88499 88155 87940 87416 86901 86931 87436 87796 87455
55285 87455 86343 84848 83496 82563 81971 81542 81181 80840 80528 80470 80944 81931 83163 84530 85973 87036 87158
55268 87158 86584 86268 86618 87011 86877 86466 86074 85342 84081 83114 83416 84813 86316 87402 88225 88916 89450 89989
55250 89989 90620 90998 90929 91004 91865 93052 93453 92840 92153 92193 92698 92896 92355 91113 89455 87781 86445 85615
55232H5615k27M77J061J270J291J440J477R38J69M7O21R73O55K66K65K94P7J4
55214I6723L45N99M88M26O68P37L70J05K41J30o79j393j045JO01M28R9L2K0j32
55194I8764k72k39r6p2l88r26j010j21J066J162q0j191q53M07J164R63M72K16
55176I8966J26J33L39O12N75R4n78j078j203j053j026j359j653j286l50M53Q62
55159I2574J277J740J656R08K96L18L89m3m51j31N14N62l3n68p21o86n34k25o9
55140I6773l66p72o73r1L87M74L79K99J85L3k7J30N10R41R98M26l38n40k07k15
55120I8306r41j589j292k48P27J189J059L84l86m74K43Q98Q61N94O39O07K7n87
55102A00017n28j36j44l36N1Q61J207Q94N99O84Q31Q51Q91Q73N17J5j16J46L71
$$ plain form
55232 85615 85388 85865 86926 88196 89487 90927 92404 93342 93511 93558 94179 95152 95807 96073 96338 96632 96709 96723
55214 96723 97068 97667 98155 98581 99249 99986 100356 100461 100702 100832 100153 98760 97715 97716 98317 98745 98844 98876 98896 98764
55194 98764 98492 98253 98157 98085 97697 96771 95761 95640 96706 97868 97788 96597 95744 96151 97315 98278 98750 98966
55176 98966 99092 99225 99564 100176 100751 100845 100267 99189 97986 96933 95907 94548 92895 91609 91259 91712 92574
55159 92574 93851 95591 97247 98155 98451 98769 99158 99115 98664 98533 99047 99609 99576 99008 98287 97601 97067 96842 96773
55140 96773 96407 95635 94962 94871 95258 95732 96111 96410 96595 96628 96601 96731 97241 98182 99180 99606 99268 98728 98521 98306
55120 98306 97365 95776 94484 94236 94963 96152 97211 97595 97209 96735 96978 97876 98737 99331 99970 100577 100604 100017
55102 100017 99489 99353 99209 98873 98924 99785 100992 101886 102485 103169 104000 104851 105742 106615 107132 107147 107031 107177 107548
55083A07548M62O45P68M07l36q78j048j201j432j456j251j178j314j358j239j227
55067I5912j331j174n48L07J048J400J143L74l23n04m62o91r81p08J45R71J387
55050I5965J485J339R66O07M52K25k96o47l66N0j67p27p15j63O3j33R7Q96J316
55031A00247J013R34J648K217J680O07J50K69J18l90n93m03m85j058j456j092
55015A03406k06N90R94J018P61M35L38M96M71j47j109j610j172k23M22N32O16
54998A05612R93J250R16L10J92P31J294J285P05q2p40j055r78o66k57L54J235
54981A11099K062K390K166J651R41P6n54m69J39M91J92l11m15j27J45J76J15K32
54963A19999O35J105J224Q35L06O0M9K5J03N59J161J270O83j18o19p58o36k48
$$ plain form
55083 107548 108010 108655 109423 109830 109494 108616 107568 106367 104935 103479 102228 101050 99736 98378 97139 95912
55067 95912 94581 93407 92859 93166 94214 95614 96757 97131 96808 96304 95842 95151 94170 93462 93607 94578 95965
55050 95965 97450 98789 99755 100362 100814 101039 100743 100096 99730 99780 99613 98886 98171 98008 98071 97938 98035 98931 100247
55031 100247 101260 102194 103842 106059 107739 108346 108496 108765 108883 108493 107900 107497 107012 105954 104498 103406
55015 103406 103200 103790 104784 105802 106563 106998 107336 107832 108303 108156 107047 105437 104265 104042 104464 104996 105612
54998 105612 106605 107855 108771 109081 109273 110004 111298 112583 113288 113206 112466 111411 110433 109767 109510 109864 111099
54981 111099 113161 115551 117717 119368 120309 120385 119831 119362 119501 119992 120184 119873 119458 119331 119476 119652 119767 119999
54963 119999 120634 121739 122963 123798 124104 124164 124213 124238 124341 124900 126061 127331 128014 127896 127277 126519 125883 125635
54945A25635L39Q74J141J044N29k29o40k28O75J229J104O99L34j16o42q40n17
54928A30391n8K06N24J277K316L179L765M398N293O276P006P359P533P819Q248
54913A95532Q563Q528Q060O943M829J854j130l446n372p459r368j0158r639q632
54899A79105p820p081o122n025l973l012k338k204k367k215j580q64k27O12J547
54884A36436J848J260O16Q00J652K441K925L400M056M838N754O797P778Q496Q886
54869A97983Q845Q225P143N814L931Q75l084o489q114q240q007q004q062p949
54855A74867p507o495m977l671l240l429l511l314l089k670j687n57l28j235k198
54840A26959k176j393q39r45j279j313j031p77p96r69r37m53L11Q78R08M99Q2
$$ plain form
54945 125635 125974 126848 127989 129033 129562 129333 128693 128465 129140 130369 131473 132172 132506 132390 131748 130908 130391
54928 130391 130333 130539 131063 132340 134656 137835 141600 145998 151291 157567 164573 171932 179465 187284 195532
54913 195532 204095 212623 220683 227626 232455 234309 233179 229733 224361 216902 207534 197376 187737 179105
54899 179105 171285 164204 158082 153057 149084 146072 143734 141530 139163 136948 135368 134504 134277 134889 136436
54884 136436 138284 139544 140160 140960 142612 145053 147978 151378 155434 160272 166026 172823 180601 189097 197983
54869 197983 206828 215053 222196 228010 231941 232816 229732 223243 215129 206889 198882 190878 182816 174867
54855 174867 167360 160865 155888 152217 148977 145548 142037 138723 135634 132964 131277 130720 130392 129157 126959
54840 126959 124783 123390 122551 121606 120327 119014 117983 117206 116410 115441 114504 114051 114362 115240 116148 116647 116729
54823A16729M7M34Q64Q51K54n92j176j197o93N0O22P00L43q5l19l57j87L66J284
54804A17938K061K115J452O07M6k07l15l24k60k46l51l41J49J113J944J938R88
54787A28307l28j322j657j263k40R78J678J554J045P48O87O21P22J342K207K594
54771A37673K341K040K139K491K954L773N012O251P193Q131R359J0585J1301J1373
54757B22616J0823R413O906L603J72k858n266p073q530r838j0656j0328q825p056
54743A83103n830n013m137l274k737k314j531m63L57P22Q66R27Q05N21K07j62
54727A62047n94o98k8J346K919M327N389N876N844N940O698P583P553O543N560
54712B26305N100M336K295q18l966o464q171q998q920q382q044q041p830o919
$$ plain form
54823 116729 116776 117210 118074 118925 119179 118587 117411 116214 115521 115571 116193 116893 117236 117151 116832 116475 116288 116654 117938
54804 117938 119999 122114 123566 124173 124219 124012 123697 123373 123113 122867 122516 122175 122324 123437 125381 127319 128307
54787 128307 127979 126657 125000 123737 123497 124475 126153 127707 128752 129500 130187 130808 131530 132872 135079 137673
54771 137673 140014 142054 144193 146684 149638 153411 158423 164674 171867 179998 189357 199942 211243 222616
54757 222616 233439 242852 249758 253361 253533 250675 245409 238336 229806 219968 209312 198984 190159 183103
54743 183103 177273 172260 168123 164849 162112 159798 158267 157804 158161 158883 159749 160676 161481 162002 162209 162047
54727 162047 161453 160755 160727 162073 164992 169319 174708 180584 186428 192368 199066 206649 214202 220745 226305
54712 226305 231405 235741 238036 237218 233252 226788 218617 209619 200699 192317 184273 176232 168402 161483
54698A61483n463m014k891j957j032l33k82q93j522j480q06j92j72o24j070j227
54682A37525j161j096j193j397j448j151o90m55n28n81l60p5j03m38o58m68n6
54665A25667K01K68N02J073J527J191N3j056j319p72r7K22K24M5l82j067j674
54648A24606j743j131j45O72R53P74O07Q29J265J345Q26J61RM27Q27O73O9m77
54630A30547o68o31n79n36m31l18l09l67k56K82J290K430L075K779J750P01Q8
54613A38847k24m35l46K17Q17Q27L10p4NK40L94O20Q89P64R9n16n19k17l31r26
54593A40441j366j204o47j36J17J02j33m32n14k32K26M90M15K50L22N58N89L65
54575A39211L29O57P42Kj026j202l04P04J074J113J319J498J310R80Q78Q85P88
$$ plain form
54698 161483 156020 152006 149115 147158 146126 145793 145511 144618 143096 141616 140810 140618 140446 139822 138752 137525
54682 137525 136364 135268 134075 132678 131230 130079 129389 128934 128406 127825 127465 127390 127287 126849 126191 125723 125667
54665 125667 125868 126136 126638 127711 129238 130429 130482 129426 128107 127335 127238 127460 127684 127729 127347 126280 124606
54648 124606 122863 121732 121587 122259 123212 123986 124593 125422 126687 128032 128858 129019 129028 129455 130282 130955 131024 130547
54630 130547 129879 129248 128669 128133 127702 127384 127075 126708 126452 126734 128024 130454 133529 136308 138058 138759 138847
54613 138847 138623 138188 137842 138059 138876 139703 140013 139939 139944 140184 140578 141198 142087 142851 142950 142434 141915 141698 141367 140441
54593 140441 139075 137871 137224 137088 137205 137307 137174 136742 136228 135996 136222 136712 137127 137377 137699 138257 138846 139211
54575 139211 139540 140197 140939 140941 139915 138713 138409 139113 140187 141300 142619 144117 145427 146407 147285 148170 148958
54558A48958P79R46P68j07j009j005k31L81M74N18P86R42Q20P73J033J312J286
54541A57424J073R41R94J215J489J577J377J198J370J712J807J692J708J804J599
54526A78980J102P19N62L85K92O63J277J274L88n34o85l67m06j007j734k237k434
54509A76238k273j806j280q18j95O35J140P74k09r69j010n78k02k22o63j230j471
54492A65861j164n66n2L19P04J060J210J221J361J650J746J387P44K26O2K04M70
54475A76443P14Q40Q34Q35J123J842K685L044K701K221K368L077L418K704J382
54460B06231N59P46J346J392O14l14n44M3P86J039Q06N14L62K49J42J25Q6k90
54442B13892j060j822k142j982j613j363j486k006k555k626k143j563j260j105
$$ plain form
54558 148958 149737 150683 151451 151344 150335 149330 149099 149480 149954 150472 151258 152200 153020 153793 154826 156138 157424
54541 157424 158497 159438 160432 161647 163136 164713 166090 167288 168658 170370 172177 173869 175577 177381 178980
54526 178980 180082 180801 181363 181748 182040 182703 183980 185254 185642 185108 184423 184056 183650 182643 180909 178672 176238
54509 176238 173965 172159 170879 170061 169866 170501 171641 172415 172206 171237 170227 169649 169447 169225 168562 167332 165861
54492 165861 164697 164131 164079 164398 165102 166162 167372 168593 169954 171604 173350 174737 175481 175707 175769 175973 176443
54475 176443 177157 177997 178831 179666 180789 182631 185316 188360 191061 193282 195650 198727 202145 204849 206231
54460 206231 206790 207536 208882 210274 210888 210574 210030 210073 210859 211898 212704 213218 213580 213829 213971 214096 214182 213892
54442 213892 212832 211010 208868 206886 205273 203910 202424 200418 197863 195237 193094 191531 190271 189166
54428A89166q37n56n18o65p24o39n44l52J67Q46J104P08K43M54J279J933J880
54411A92945J324O16l11j474k253j927p28K98O06P15J171J643J542J026P23P56
54395A96672P59O77P83R63P35Q1l85k56J98N73P89Q43O66M86P30J243J141l7j511
54376B05150k094j595q03l96m26p33j239j692j643r32P4Q24J050Q55M81J28r0
54359A96919j19N3L51N64N07K47J6j40m09q40j231j481j779k171k292j863j264
54342A85068j175j695k213k173j650j078p70q47j322j927k075j345o5Q50P95R4
54326A68472m03k74J19J87j80n32l97J73O13L73m61j123r48j14N70O53M32L16
54308A67476K10j46n60n75r6N30J006J251J199P75J55l39n86p24q85j096j339
$$ plain form
54428 189166 188329 187773 187255 186590 185866 185227 184683 184331 184498 185344 186448 187156 187399 187853 189132 191065 192945
54411 192945 194269 194885 194574 193100 190847 188920 188192 188490 189096 189811 190982 192625 194167 195193 195916 196672
54395 196672 197431 198108 198891 199854 200589 200670 200285 200029 200227 200800 201589 202432 203098 203584 204314 205557 206698 206661 205150
54376 205150 203056 201461 200658 200262 199836 199103 197864 196172 194529 193597 193671 194495 195545 196400 196881 197009 196919
54359 196919 196800 196853 197204 197768 198275 198522 198538 198398 197989 197149 195918 194437 192658 190487 188195 186332 185068
54342 185068 183893 182198 179985 177812 176162 175084 174314 173467 172145 170218 168143 166798 166733 167583 168378 168472
54326 168472 168069 167795 167914 168101 167921 167389 166992 167165 167778 168151 167690 166567 165619 165505 166075 166728 167160 167476
54308 167476 167686 167540 166980 166405 166309 166839 167845 169096 170295 171070 171225 170886 170300 169576 168691 167595 166256
54291A66256j471j266q05n77q35j154j032o63n00m28p4K43j53j035j308n71K87
54274A54914M09O6o0J11L44P04J261J613J377P98K99j49p29j180j171q90o54j90
54256A56873R02K161K517J597K27n44m91r7J90L32N08P27P52M43K5k62o37j435
54238A63788k315k400j483m13RJ9K29O12O98M20P5k14m45m60k59k99q33j280r06
54219A54543R2Q27Q42L13m94j251j312l14J015J512J013L33o3m00o89n53j93m26
54201A54795j316j755r90K25O85L22J4K86Q78J278J130L26p73j458j409j014p20
54184A50504m16O7L87J99q9J66P51P91Pq45r71m46P8J99J2j84j96j04j64m87p66
54163A48493n67J71J004J426J241O05j04m29j97J86N7o49j140o75M07R81N37j93
$$ plain form
54291 166256 164785 163519 162714 162137 161302 160148 159116 158453 157953 157525 157451 157694 157541 156506 155198 154627 154914
54274 154914 155323 155389 155329 155440 155784 156488 157749 159362 160739 161537 161836 161687 160958 159778 158607 157717 157063 156873
54256 156873 157775 159936 162453 164050 164277 163733 163242 163145 163335 163667 164175 164902 165654 166097 166122 165860 165223 163788
54238 163788 161473 159073 157590 157177 157186 157205 157434 158046 158744 159164 159239 159025 158580 158120 157861 157562 156729 155449 154543
54219 154543 154635 155462 156304 156617 156123 154872 153560 153246 154261 155773 156786 157119 157056 156656 155967 155414 155221 154795
54201 154795 153479 151724 150734 150959 151644 151966 151980 152266 153144 154422 155552 155878 155105 153647 152238 151224 150504
54184 150504 150088 150155 150542 150741 150652 150818 151569 152360 152367 151522 150551 150105 150183 150382 150394 150210 150014 149910 149746 149259 148493
54163 148493 147926 148097 149101 150527 151768 152373 152269 151840 151643 151829 151886 151237 150097 149422 149829 150810 151347 151154
54145A51154k48K98N52J07m93o71n32m36l04Q5M97M79N5l26m36m04k74P5N41Q65
54125A50584J099J489J830J539O75J92P25J545J353m8j467j767j065l75l33o08
54109A55368n41k4M72O25O44O91M49k67p97k87R55J561Q34l12n89J13R25J260
54091A61080J171P67P9m88l82K89O86K78m80p59l95L3N6j29L6P26J486J775J583
54072A67412J368J451J701J863J850J663J301R50R13J108J050N78K96P36J435
54057A85675J456O71j02k69q4O3L04Q09J191R46L11J64J026K491L658L972L615
54040B05897L265L491M284N088N313M870M275M266N205O708P920Q320Q144P945
54026B84991P912P900P950Q262Q639Q525P717O626N601M527L360K529K310K222
$$ plain form
54145 151154 150906 151204 151756 151863 151370 150699 150167 149731 149427 149512 150009 150488 150543 150217 149781 149377 149103 149178 149719 150584
54125 150584 151683 153172 155002 156541 157216 157408 158133 159678 161031 160983 159516 157749 156684 156309 155976 155368
54109 155368 154827 154803 155275 155900 156544 157235 157684 157417 156620 156333 157288 158849 159683 159371 158782 158895 159820 161080
54091 161080 162251 163018 163097 162609 162227 162516 163202 163480 163000 162241 161846 161879 161935 161806 161842 162568 164054 165829 167412
54072 167412 168780 170231 171932 173795 175645 177308 178609 179559 180472 181580 182630 183208 183504 184240 185675
54057 185675 187131 187802 187700 187431 187347 187410 187714 188523 189714 190660 190971 191135 192161 194652 198310 202282 205897
54040 205897 209162 212653 216937 222025 227338 232208 236483 240749 245954 252662 260582 268902 277046 284991
54026 284991 292903 300803 308753 317015 325654 334179 341896 348522 354123 358650 362010 364539 366849 369071
54012C69071J667P97J39l94j390k869m172m937n445n865n925n613n502n851o048
53997C17663n516m655m244m221l877l082k522k696l239l440l013k229j526j068
53983B72335n28N47J997L013L216L454M798O968Q509Q468P081M785J615k021m965
53968C19272o492p237q169r065q905p531n983n114m672m046l259k735k423j701
53954B41940k49J318J978J462O29N02J100J620J645J671K259L171L701L592L174
53939B69513K884K920L268L781M393N304O634P787P806O680N703N859O401N849
53925C44782M055K385J902K331K914L421M035M761N441N971O309O529O897P609
53911D09342Q468R312J0460J2144J3569J3531J2089J0707J0340J0241R230P338
$$ plain form
54012 369071 370738 371535 371674 371280 369890 367021 362849 357912 352467 346602 340677 335064 329562 323711 317663
53997 317663 312147 307492 303248 299027 295150 292068 289546 286850 283611 280171 277158 274929 273403 272335
53983 272335 271807 272354 274351 277364 280580 284034 288832 295800 304309 312777 319858 324643 326258 324237 319272
53968 319272 312780 305543 297374 288309 279404 271873 265890 260776 256104 252058 248799 246064 243641 241940
53954 241940 241691 243009 244987 246449 247078 247580 248680 250300 251945 253616 255875 259046 262747 266339 269513
53939 269513 272397 275317 278585 282366 286759 292063 298697 306484 314290 320970 326673 332532 338933 344782
53925 344782 348837 351222 353124 355455 358369 361790 365825 370586 376027 381998 388307 394836 401733 409342
53911 409342 417810 427122 437582 449726 463295 476826 488915 499622 509962 520203 529433 536771
53899E36771N411L722J900mj386j975k210k635l379m302n154n634n699n850o677
53884E02899q071r282r861j0162j0718j1432j1691j1108r932q779q102p897p772
53871C78092p274o301n226m583m563m852n064n204n510n891n925n522n095m859
53857C02223m421l619l204l845m775m490k874j537j661k497k627j874j099p64
53843B62936o85q16j285j732j512o91r7l14j069j769k100k024j704j520j664j683
53827B42271r59K64Q75K40r64j552j114j41P43J302J539J521J386J359J659K356
53811B50785L290M191M980N930P337R130J1063J3070J5025J6204J5606J3076R676
53798C79363O540L773Q81k006l929m126k809q86P51J558J453Q83O16J107J999
$$ plain form
53899 536771 542182 545904 547804 547800 546414 544439 542229 539594 536215 531913 526759 521125 515426 509576 502899
53884 502899 494828 485546 475685 465523 454805 443373 431682 420574 410642 401863 393761 385864 378092
53871 378092 370818 364517 359291 354708 350145 345293 340229 335025 329515 323624 317699 312177 307082 302223
53857 302223 297802 294183 290979 287134 282359 277869 274995 273458 271797 269300 266673 264799 263700 262936
53843 262936 262251 261435 260150 258418 256906 256215 256118 255804 254735 252966 250866 248842 247138 245618 243954 242271
53827 242271 241312 241576 242451 242691 241727 240175 239061 238920 239663 240965 242504 244025 245411 246770 248429 250785
53811 250785 254075 258266 263246 269176 276513 285643 296706 309776 324801 341005 356611 369687 379363
53798 379363 385903 389676 390557 388551 384622 380496 377687 376801 377552 379110 380563 381446 382062 383169 385168
53783C85168K485K139J280N15Q2k29o37j089j418j656k011k613l328l884m115
53768C70689m146m309m784n338n505n091m440m094m333n073n997o669o695o078
53754B98137n323m963m974m878m432l894l587l478l376l325l456l619l418k695
53740B42719j772j103p73n19k05r4m91j173j462r82j93M9n53j446j871j578q46
53723B27707q6M37O69P54Q66Q79L69p64j891k193j657j107j131j382j185m79K11
53706B20017N61P46J023J427J843K122K043J589J141J104J277J143Q00R71J844
53691B39651K537K245J342P32N64M00K63N57J034Q24k22j097j033n16m17o60m85
53674B45719K90R50Q44J63l62k27L94Q23N74j08n43m76l15m21n46k64L27P33O45
$$ plain form
53783 385168 387653 389792 391072 391587 391669 391440 390803 389714 388296 386640 384629 382016 378688 374804 370689
53768 370689 366543 362234 357450 352112 346607 341516 337076 332982 328649 323576 317579 310910 304215 298137
53754 298137 292814 287851 282877 277999 273567 269673 266086 262608 259232 255907 252451 248832 245414 242719
53740 242719 240947 239844 239071 238552 238347 238253 237762 236589 235127 234145 233952 234001 233448 232002 230131 228553 227707
53723 227707 227621 228058 228727 229481 230347 231226 231595 230831 228940 226747 225090 223983 222852 221470 220285 219806 220017
53706 220017 220578 221324 222347 223774 225617 227739 229782 231371 232512 233616 234893 236036 236836 237807 239651
53691 239651 242188 244433 245775 246507 247071 247471 247734 248291 249325 250149 249927 248830 247797 247281 246864 246204 245719
53674 245719 246009 246959 247803 247966 247604 247377 247771 248594 249168 249060 248517 248041 247726 247305 246759 246495 246822 247555 248200
53655B48200R7p32j503j697j098k08K06p2o02r48j056r98p34k81J05R5l70r13
53637B37491r52k25Q07J336J143Q88J200J767J741R60K45L54J083J577J338O59
53621B51412J61J45N26J168K000K705K719J922J142J365K486L375L344K856K539
53606B79865K266J701J120R72J039R12Q60J422K228K249J259J33m24o54r22r36
53590B93090l51M44P34L67k56p79j085j095q34n81n48n16j18N02P01J26p46j112
53572B87943q28o23j167k081k358j763j275j687k296j726J29J834K249J768J398
53557B79517J326J129R17J298K283K943K561J618J180J563K028J848J315J353
53543C02879K309L477L952L670L338L533M156M744N097N420O010O797P307P176
$$ plain form
53655 248200 248297 247565 246062 244365 243267 243059 243265 243193 242591 241643 240587 239589 238855 238574 238679 238774 238404 237491
53637 237491 236539 236314 237121 238457 239600 240488 241688 243455 245196 246156 246401 246755 247838 249415 250753 251412
53621 251412 251573 251718 252244 253412 255412 258117 260836 262758 263900 265265 267751 271126 274470 277326 279865
53606 279865 282131 283832 284952 285924 286963 287875 288735 290157 292385 294634 295893 296026 295602 294948 294026 293090
53590 293090 292739 293183 293917 294284 294028 293249 292164 291069 290235 289654 289106 288590 288472 288974 289675 289801 289055 287943
53572 287943 287115 286492 285325 283244 280886 279123 277848 276161 273865 272139 272268 274102 276351 278119 279517
53557 279517 280843 281972 282889 284187 286470 289413 291974 293592 294772 296335 298363 300211 301526 302879
53543 302879 305188 308665 312617 316287 319625 323158 327314 332058 337155 342575 348585 355382 362689 369865
53529C69865O765O900P876R026R601R792J0373J1537J2693J3353J3677J3979J4254
53516E09691J4496J4994J5960J7059J7778J8084J8466J9277K0290K0911K0801
53505G07807K0211J9723J9703K0006K0272K0303K0114J9824J9687J9967K0548
53494I28165K0856K0477J9645J8840J8157J7521J7197J7521J8126J8172J7346
53483A132023J6144J5063J4122J3263J2643J2262J1750J0824R607Q252O707N030
53471A267690L577K548J625K94j670m209p076r785j1739j2718j3085j3427j4176
53458A187849j5476j7153j8694j9710k0370k1111k1904k2351k2370k2261k2007
53447I64442k1238k0032j9060j8668j8441j7927j7182j6253j4869j3022j1263
$$ plain form
53529 369865 376630 383530 391406 400432 410033 419825 430198 441735 454428 467781 481458 495437 509691
53516 509691 524187 539181 555141 572200 589978 608062 626528 645805 666095 687006 707807
53505 707807 728018 747741 767444 787450 807722 828025 848139 867963 887650 907617 928165
53494 928165 949021 969498 989143 1007983 1026140 1043661 1060858 1078379 1096505 1114677 1132023
53483 1132023 1148167 1163230 1177352 1190615 1203258 1215520 1227270 1238094 1247701 1255953 1262660 1267690
53471 1267690 1271267 1273815 1275440 1275734 1274064 1269855 1262779 1252994 1241255 1228537 1215452 1202025 1187849
53458 1187849 1172373 1155220 1136526 1116816 1096446 1075335 1053431 1031080 1008710 986449 964442
53447 964442 943204 923172 904112 885444 867003 849076 831894 815641 800772 787750 776487
53436G76487r892q473o638m831l606k729j603j70J250K644M261O091P933R717
53422G70441J1357J2663J3842J5566J7944J9941K0516K0026J9835K0819K2814
53411I65764K5241K7516K9193L0381L1763L3601L5138L5724L6117L7651M0386
53400A328475M3139M5197M6884M8400M9266M9255M8957M8987M9359M9854N0420
53389A858193N0844N0670M9811M8676M7490M5955M3776M0996L7658L3717K9547
53378B337333K5905K3071K0524J7720J4732J1804Q755N208J134l115p142j0881
53366B445048j4885k0095k6832l4102m0448m5431m9562n2950n5028n5747n6001
53355A993967n6417n6591n6019n4982n3912n2613n0824m8967m7613m6647m5696
$$ plain form
53436 776487 766595 758122 751484 746653 743047 740318 738715 738545 739795 742439 746700 752791 760724 770441
53422 770441 781798 794461 808303 823869 841813 861754 882270 902296 922131 942950 965764
53411 965764 991005 1018521 1047714 1078095 1109858 1143459 1178597 1214321 1250438 1288089 1328475
53400 1328475 1371614 1416811 1463695 1512095 1561361 1610616 1659573 1708560 1757919 1807773 1858193
53389 1858193 1909037 1959707 2009518 2058194 2105684 2151639 2195415 2236411 2274069 2307786 2337333
53378 2337333 2363238 2386309 2406833 2424553 2439285 2451089 2459844 2465052 2466186 2463071 2455929 2445048
53366 2445048 2430163 2410068 2383236 2349134 2308686 2263255 2213693 2160743 2105715 2049968 1993967
53355 1993967 1937550 1880959 1824940 1769958 1716046 1663433 1612609 1563642 1516029 1469382 1423686
53344A423686m4881m4445m4045m3192m2052m1066l9980l8140l5625l3321l1715
53333I85224l0303k8394k5956k3401k0935j8400j5696j3091j1068r819q957p939
53321G71265o733n719m943l883k203k50J419K647L511M077M664N813P559R152
53307G86376J0095J0954J2494J4404J5741J6378J7132J8533K0266K1936K3524
53296I67833K4891K5579K5452K5070K5025K5311K5624K5866K6108K6248K6020
53285A249027K5191K3593K1161J8072J4757J1710R299P628O329M725K547L44j218
53272A393165k322l807o015q421j0470j2251j4087j6045j8067k0233k2517k4604
53260A234326k6270k7661k8977l0113l0881l1359l1768l2164l2401l2260l1483
$$ plain form
53344 1423686 1378805 1334360 1290315 1247123 1205071 1164005 1124025 1085885 1050260 1016939 985224
53333 985224 954921 926527 900571 877170 856235 837835 822139 809048 797980 788161 779204 771265
53321 771265 764532 758813 753870 749987 747784 747534 748953 751600 755111 759188 763852 769665 777224 786376
53307 786376 796471 807425 819919 834323 850064 866442 883574 902107 922373 944309 967833
53296 967833 992724 1018303 1043755 1068825 1093850 1119161 1144785 1170651 1196759 1223007 1249027
53285 1249027 1274218 1297811 1318972 1337044 1351801 1363511 1372810 1380438 1386767 1391492 1394039 1394383 1393165
53272 1393165 1390843 1387036 1381021 1372600 1362130 1349879 1335792 1319747 1301680 1281447 1258930 1234326
53260 1234326 1208056 1180395 1151418 1121305 1090424 1059065 1027297 995133 962732 930472 898989
53249H98989k9989k8139k6556k5468k4524k3508k2794k2758k3077k3080k2668
53238F26428k2374k2540k2853k2722k1806k0086j7824j5571j3954j3082j2379
53227D21237j1172r474p947p127o846o484n668m589l715l367l585m155m722n019
53213C37367n105n213n289m941m110l424l523m122m306l698k831k282j968j555
53199B85000j119r54j048j178j294j500j706j702j461j178j003r99j306k017k882
53184B63653l350l076k384k070k598l441l485k302q45l83q53j010k54M82J68p93
53168B37459j229r16o58q28r01m75O0J95m9m20p96r94p41k35j69q08j470j390
53150B25635p30j83N3L07O23N89N9m97n49j41K63L49J82j8j73l40n31o60p37r06
$$ plain form
53249 898989 869000 840861 814305 788837 764313 740805 718011 695253 672176 649096 626428
53238 626428 604054 581514 558661 535939 514133 494047 476223 460652 446698 433616 421237
53227 421237 410065 400591 392644 385517 378671 372187 366519 361930 358215 354848 351263 347108 342386 337367
53213 337367 332262 327049 321760 316819 312709 309285 305762 301640 297334 293636 290805 288523 286555 285000
53199 285000 283881 282927 281879 280701 279407 277907 276201 274499 273038 271860 270857 269858 268552 266535 263653
53184 263653 260303 257227 254843 252773 250175 246734 243249 240947 240102 239719 238866 237856 237602 238084 238252 237459
53168 237459 236230 235314 234656 233828 232927 232452 232512 232707 232658 232238 231442 230448 229707 229472 229303 228495 227025 225635
53150 225635 224905 224722 224775 225082 225705 226294 226353 225856 225307 225166 225429 225778 225960 225942 225769 225429 224898 224238 223501 222595
53130B22595j142j107o33j32j25l80j76N93J193J144P89M50j92j253j929j462
53114B18233l83J64J9J0M99R42R56Q23P67N78K08j3p7m24j087j488j435j546k146
53095B14600k535k041j119o21n43k66L06O62N23Op52j484j578p15L76O61J28l15
53077B05293k19L6J96N43J071J205P15J66Lj65q26j645j972j796j583j412r43
53060A98667j87K89P1n70r63p13n5L72J37m90p99m96lK01K54O07J226J558J243
53041B00349M96k57q43j280j473j239o45j90m22j252j824j342r2O79R6j324k215
53024A87222j785m65P13J058O40Ll84m90n80p74q47o16k66r5o5O9K70J59l80q77
53004A82510p78j17N69R46J168J366J236M93m37o64M2Q16P62P8l62l40m72j016
$$ plain form
53130 222595 221453 220346 219713 219581 219456 219076 218900 219493 220686 221830 222619 223069 222877 221624 219695 218233
53114 218233 217850 218014 218033 218043 218542 219484 220440 221263 222030 222608 222816 222803 222726 222302 221215 219727 218292 216746 214600
53095 214600 212065 210024 208905 208284 207741 207475 207781 208443 208966 208972 208220 206736 205158 204443 204819 205480 205608 205293
53077 205293 205074 205110 205306 205849 206920 208125 208840 209006 209009 208844 208018 206373 204401 202605 201022 199610 198667
53060 198667 198480 198769 198840 198270 197307 196594 196539 196911 197048 196558 195759 195263 195260 195461 195715 196322 197548 199106 200349
53041 200349 200845 200588 199745 198465 196992 195753 195108 194918 194496 193244 191420 190078 189986 190665 190761 189437 187222
53024 187222 185437 184972 185685 186743 187383 187386 187002 186512 185932 185158 184311 183695 183429 183334 183269 183338 183608 183767 183387 182510
53004 182510 181732 181615 182184 183130 184298 185664 186900 187393 186956 186292 186334 187150 187912 187990 187628 187288 186816 185800
52986A85800j322q44j06K3l45l12M10J045Q66K05r3J54L84K08n9Q1N88R99J121
52967A88803J239J550J753J498J046R70J253J193M84j77PP55J024M07m59r30j162
52950A99254j546j884j684j005m59m16o37p93r28j172j342j127o17k72l75p11
52934A84286q78p55n48n11o77q29o68j69K24k9q24j310q07K52P30J82n72n18K69
52915A76848P79M00l93p57m50J53P24J189J322P17n07j413j200l01M5n72j211
52898A75373q98Q4P77R03R41J120J084O67K47J72K97L67L36J66l18j036j519j392
52880A77371p39J52R99J371Q71k31j003r29m89l34k85J41P10P07J25k09K51J110
52862A79589J642J585J185Q50R09J430K107K537K613K519K379K241K231K330K065
$$ plain form
52986 185800 184478 183634 183528 183551 183206 182894 183304 184349 185215 185420 185327 185481 185865 186073 186014 186095 186683 187682 188803
52967 188803 190042 191592 193345 194843 195889 196859 198112 199305 199789 199612 199619 200374 201398 201805 201346 200416 199254
52950 199254 197708 195824 194140 193135 192676 192260 191623 190830 189902 188730 187388 186261 185644 185372 184997 184286
52934 184286 183408 182653 182105 181594 180917 180088 179420 179251 179475 179446 178622 177312 176505 176757 177487 177669 177097 176579 176848
52915 176848 177627 178027 177634 176877 176427 176580 177304 178493 179815 180532 180025 178612 177412 177111 177156 176584 175373
52898 175373 174475 174559 175336 176239 177180 178300 179384 180051 180298 180470 180767 181134 181470 181636 181318 180282 178763 177371
52880 177371 176632 176784 177783 179154 180025 179794 178791 177862 177373 177039 176754 176895 177605 178312 178437 178228 178479 179589
52862 179589 181231 182816 184001 184851 185760 187190 189297 191834 194447 196966 199345 201586 203817 206147 208212
52847B08212R37p63k038k288j955j862k238k667k697k259j642j265j351j718j947
52832A82459j825j471j047o37l73l58l37J95J306K385K826K671K291J694O30p22
52816A89687j716j995j962k177k529k332j281L7P83Q48Q37J179J668K056K591
52801A85694L526M315L972K293J82j343k093k408k414k049j618j710k427l087
52787A80833k961k130j345j078j081r91r76j313j602j031L67J396J066j64j039
52772A67951r94m12K97J035J578J632J436J514J687J199Q6m51K98J321J149j27
52756A79199j041p46N6K76k37q12q93n40k13k25l75j56N14J026Q18J46k26j9M35
52737A76987R10J517K165K432K221J977J884J440L40o83o33L34J022P26M4j11
$$ plain form
52847 208212 209149 208386 206348 204060 202105 200243 198005 195338 192641 190382 188740 187475 186124 184406 182459
52832 182459 180634 179163 178116 177479 177106 176748 176411 176606 177912 180297 183123 185794 188085 189779 190409 189687
52816 189687 187971 185976 184014 181837 179308 176976 175695 175732 176515 177363 178200 179379 181047 183103 185694
52801 185694 189220 193535 197507 199800 199982 198639 196546 194138 191724 189675 188057 186347 183920 180833
52787 180833 177872 175742 174397 173319 172238 171247 170271 168958 167356 166325 166692 168088 169154 168990 167951
52772 167951 166957 166545 166842 167877 169455 171087 172523 174037 175724 176923 177009 176558 176856 178177 179326 179199
52756 179199 178158 177412 177468 177744 177507 176695 175802 175262 175049 174824 174449 174293 174807 175833 176651 176797 176571 176552 176987
52737 176987 177897 179414 181579 184011 186232 188209 190093 191533 191873 191190 190557 190891 191913 192639 192683 192572
52721A92572L07O43N12Q3l61o94q43p80o68p13q69r50r85j157j402j481j464j661
52703A80089j987j860j058j72J69J02R9J81J32J81O13R66M63p13j460j227o46
52686A73872l70r9P06J791K453K402J800P94l24r45p32j62J21K20O27J243J480
52669A84877J212Q82O79L56m8p6L29N76L18MJ46N26N81K38j04j44R9M91Q61J078
52649A92881J184J367J633J809J957K337K758K467J091o53j797k233k457k482
52635A99862j880p98m4L1p3N2R3k03l34J67P79O16k82j003j077q98q76q40n81
52616A92711l26l44n10n75m71j54M57J116J283Q79N46P22R72P74M53O24J019P80
52598A99956k02j093j292j015o10p6M91P43O81P22Q89O68j3m45k71j27m49m84
$$ plain form
52721 192572 192879 193522 194034 194117 193756 193062 192219 191439 190771 190058 189189 188239 187254 186097 184695 183214 181750 180089
52703 180089 178102 176242 175184 175012 175181 175283 175382 175563 175695 175876 176489 177455 177918 177205 175745 174518 173872
52686 173872 173502 173403 174109 175900 178353 180755 182555 183349 183025 182080 181348 181186 181307 181527 182154 183397 184877
52669 184877 186089 186971 187650 188006 187958 187882 188211 188787 189105 189109 189255 189781 190362 190600 190496 190352 190451 190942 191803 192881
52649 192881 194065 195432 197065 198874 200831 203168 205926 208393 209484 208831 207034 204801 202344 199862
52635 199862 197982 197184 197140 197171 197098 197150 197243 197040 196706 196873 197652 198268 197986 196983 195906 195008 194132 193292 192711
52616 192711 192385 192041 191531 190956 190485 190331 190788 191904 193187 194066 194612 195334 196306 197080 197533 198157 199176 199956
52598 199956 199754 198661 197369 196354 195744 195668 196159 196902 197583 198305 199194 199862 199849 199404 199133 199006 198557 198073
52580A98073N84K123K735K106J144N16J02j36J16O73P98L00j14kJ38k10o40m30
52562B07876L67J039J084N39k35p28n56J5J48n38j332j327o17k8R2J29L11L32
52544B06571j7l71l60j87k86n71m96J48Q34Q80K96k34j88J75K15k64p81p50o0
52525B04554Q72J434J250M97j82l37k20k86l94L9J003J691J625J344J548K027
52509B16465K116J837J815K222K508K252J622Q58o8j055j636j535j091q34q58
52494B24618r72j169j592k110k346k101j567j077p92o07l20O6K11j97q85j038
52478B08122k07J070J892K126K395K932L080K271J063O04J224K140K509K225J528
52463B34974O04j73j20R56K253K797K497J841Q90n35j908k257j555q93r46j233
$$ plain form
52580 198073 198657 200780 203515 205621 206765 207281 207383 207247 207363 208036 208834 209134 209020 209018 209156 208946 208306 207876
52562 207876 208243 209282 210366 210905 210670 209942 209386 209401 209549 209011 207679 206352 205735 205707 205799 205928 206239 206571
52544 206571 206554 206183 205823 205636 205350 204779 204283 204431 205265 206145 206441 206207 206019 206194 206409 206145 205364 204614 204554
52525 204554 205426 206860 208110 208607 208425 208088 207868 207582 207188 207227 208230 209921 211546 212890 214438 216465
52509 216465 218581 220418 222233 224455 226963 229215 230837 231695 231627 230572 228936 227401 226310 225476 224618
52494 224618 223646 222477 220885 218775 216429 214328 212761 211684 210892 210285 209965 210031 210242 210045 209160 208122
52478 208122 207915 208985 210877 213003 215398 218330 221410 223681 224744 225348 226572 228712 231221 233446 234974
52463 234974 235578 235405 235285 236241 238494 241291 243788 245629 246519 245984 244076 241819 240264 239371 238425 237192
52447B37192j310j655k566l140k466j292j152k161k901k424j229q6Q59J538J531
52432B18738Q06K5l55n65p64o03q6M8m98q37j90P95R90N01L21O37P25L95K81N70
52412B20934N78m1n57j59R96K163K848K906K397J787J813K749M073N213O118O868
52396B60686P153O589N165L090N79j861l471m028m203m585m834m376l486k876
52382B49542k508j688k80J030J738K000J947J399N72L24J070J946J802P89K75
52367B59958J146K682L371K576J071Pk96l81o38p95n36j67k29o73r74r48r14j023
52349B63237j011p63n43m66k69J11K69M3m5M32J048J185J101J526K414K898K646
52332B73813K359K622L030K985K867L627N406P209Q029P794P170O752O720O874
$$ plain form
52447 237192 235882 234227 231661 228521 226055 224763 223611 221450 218549 216125 214896 214810 215669 217207 218738
52432 218738 219544 219569 219214 218649 217885 217282 217196 217244 216746 215909 215719 216514 217504 218005 218326 218963 219688 220083 220364 220934
52412 220934 221512 221471 220914 220755 221751 223914 226762 229668 232065 233852 235665 238414 242487 247700 253818 260686
52396 260686 267839 274428 279593 282683 283262 281401 277930 273902 269699 265114 260280 255904 252418 249542
52382 249542 247034 245346 245066 246096 247834 249834 251781 253180 253752 254076 255146 257092 258894 259683 259958
52367 259958 261104 263786 267157 269733 270804 270811 270515 270134 269496 268701 268165 267998 267769 267096 266122 265174 264260 263237
52349 263237 262226 261463 260920 260454 260185 260296 260565 260608 260563 260995 262043 263228 264329 265855 268269 271167 273813
52332 273813 276172 278794 281824 284809 287676 291303 296709 303918 311947 319741 326911 333663 340383 347257
52318C47257O758N992M760L839L757M049L785K812K032K179K852L119K801K574
52304C98566K946L682M311M685M913N086N294N557N639N243M545M076L856L177
52290D61576J589k90j482j842k029k437k778k636k011j281q59q69q69j56J275
52275D44901K425K442J815J740K476L162L207K972K890K839K770L120M045M901
52261D85705N108M957M971N029M794M531M688M999M879M459M390M740M937M823
52247E53010M836N059M932M161L167K284J291K17j76O27J928K571K354K063K326
52232E90650L091M074N037N630N566N160N159N797O434O366N678N002M697M605
52218F62946M514M534M870N436N847N838N565N398N457N561N616N786O130O351
$$ plain form
52318 347257 354015 360007 364767 368606 372363 376412 380197 383009 385041 387220 390072 393191 395992 398566
52304 398566 401512 405194 409505 414190 419103 424189 429483 435040 440679 445922 450467 454543 458399 461576
52290 461576 463165 462875 461393 459551 457522 455085 452307 449671 447660 446379 445520 444651 443782 443626 444901
52275 444901 447326 449768 451583 453323 455799 458961 462168 465140 468030 470869 473639 476759 480804 485705
52261 485705 490813 495770 500741 505770 510564 515095 519783 524782 529661 534120 538510 543250 548187 553010
52247 553010 557846 562905 567837 571998 575165 577449 578740 578957 578781 579408 581336 583907 586261 588324 590650
52232 590650 593741 597815 602852 608482 614048 619208 624367 630164 636598 642964 648642 653644 658341 662946
52218 662946 667460 671994 676864 682300 688147 693985 699550 704948 710405 715966 721582 727368 733498 739849
52204G39849O232O058O257O752P080P097P005O691N723M234L200L329M074M372
52190H17953M056L875M201M532M357L923L711L675L468L081K716K180R91q60k693
52175H59166l870m457m983n720o460o813o539n631m327l089k401k471l052l584
52161G95769l491k468o87J247K657L317L546L728L819L432K382J008j09n74l38
52146H13238L67J153J672J925K249K828L257K925J848P87L34J54n24j750k673
52131H27790k637k052j841k182k308j560j89J192K572M404O610Q345R029R156
52117H56329R638J0568J1106J0591R285P925O817N648L942J529j252l656n018
52104I23452n347n261n116m492k860n96J243K223L010M227N385N496M555L654
$$ plain form
52204 739849 746081 752139 758396 765148 772228 779325 786330 793021 798744 802978 806178 809507 813581 817953
52190 817953 822009 825884 830085 834617 838974 842897 846608 850283 853751 856832 859548 861728 862719 861859 859166
52175 859166 855296 850839 845856 840136 833676 826863 820324 814693 810366 807277 804876 802405 799353 795769
52161 795769 792278 789810 789123 790370 793027 796344 799890 803618 807437 810869 813251 814259 814150 813576 813238
52146 813238 813605 814758 816430 818355 820604 823432 826689 829614 831462 832249 832583 832737 832213 830463 827790
52131 827790 825153 823101 821260 819078 816770 815210 815021 816213 818785 823189 829799 838144 847173 856329
52117 856329 865967 876535 887641 898232 907517 915442 922259 927907 931849 933378 932126 928470 923452
52104 923452 918105 912844 907728 903236 900376 899780 901023 903246 906256 910483 915868 921364 925919 929573
52090I29573L556L746L270K013O27n31j785l431n211o625p385p303o172m092j772
52075H98478j07N75O05M57M10N97J053J613J982K077K158K545L224L813L836L174
52059I26490K256J714J694J681J134J96n33p32o06m63m00l96m86p42j332k467
52043I27008m011n337n974o270o854p556p583o855o271o322o243n178l501k210
52029H46843j453o24M65J340J832K343L002L317K988K426K185K307K581K992L493
52014H76037L668L149K203J534J522J913K245K288K044J505N75q29k685m859p185
$$ plain form
52090 929573 933129 936875 940145 942158 942785 942254 940469 937038 931827 925202 917817 910514 904342 900250 898478
52075 898478 898371 898946 899551 900008 900418 901015 902068 903681 905663 907740 909898 912443 915667 919480 923316 926490
52059 926490 928746 930460 932154 933835 934969 935165 934632 933900 933294 932831 932431 932035 931549 930807 929475 927008
52043 927008 922997 917660 911686 905416 898562 891006 883423 876568 870297 863975 857732 852554 849053 846843
52029 846843 845390 844766 845231 846571 848403 850746 853748 857065 860053 862479 864664 866971 869552 872544 876037
52014 876037 879705 882854 885057 886591 888113 890026 892271 894559 896603 898108 898683 897854 895169 890310 883125
$$ [...]
##END NTUPLES=NMR SPECTRUM
##END=
