##TITLE=AC1259_UGARH11076_6534370_Ws4MSD9MfT
##JCAMPDX= 6.0         $$ Bruker NMR JCAMP-DX V2.0
##DATA TYPE= NMR SPECTRUM
##DATA CLASS= NTUPLES
##ORIGIN= BRUKER
##OWNER= Administrator
$$ 1.72 TOPSPIN		Version 2.1
$$ 2013-07-18 13:57:17.337 -0700  Administrator@X
$$ Compression mode = diff/dup
##.OBSERVE FREQUENCY= 400.02188249412
##.OBSERVE NUCLEUS= ^1H
##.ACQUISITION MODE= SIMULTANEOUS (DQD)
##.ACQUISITION SCHEME= undefined
##.AVERAGES= 8
##.DIGITISER RES= 22
##SPECTROMETER/DATA SYSTEM= spect
##.PULSE SEQUENCE= zg30
##.SOLVENT NAME= COFFEE_meoh
##.SHIFT REFERENCE= INTERNAL, COFFEE_meoh, 1, 14.98509
##AUDIT TRAIL= $$ (NUMBER, WHEN, WHO, WHERE, PROCESS, VERSION, WHAT)
$$ ##TITLE= Audit trail, TOPSPIN		Version 2.1
$$ ##JCAMPDX= 5.01
$$ ##ORIGIN= Bruker BioSpin GmbH
$$ ##OWNER= Administrator
$$ $$ E:\/data/COFFEE/nmr/AC1259_UGARH11076_6534370_Ws4MSD9MfT/10/pdata/1/auditp.txt
$$ ##AUDIT TRAIL=  $$ (NUMBER, WHEN, WHO, WHERE, PROCESS, VERSION, WHAT)
(   1,<2013-07-18 13:57:10.759 -0700>,<Administrator>,<X>,<go>,<TOPSPIN 2.1>,
      <created by zg
	started at 2013-07-18 13:56:04.916 -0700,
	POWCHK enabled, PULCHK disabled,
       configuration hash MD5:
       C8 4E 4E 5D D3 5C D8 9E 9F 52 82 E0 59 8A DE 15
       data hash MD5: 64K
       79 DF 58 8E 78 F1 C2 95 90 08 CC 46 39 89 46 CF>)
(   2,<2013-07-18 13:57:13.634 -0700>,<Administrator>,<X>,<proc1d>,<TOPSPIN 2.1>,
      <Start of raw data processing
       efp LB = 0 FT_mod = 6 PKNL = 1 PHC0 = 0 PHC1 = 0 SI = 32K 
       data hash MD5: 32K
       AB 81 63 7E 46 15 AB AD 4E 72 E0 1C 69 9F B0 5E>)
(   3,<2013-07-18 13:57:13.947 -0700>,<Administrator>,<X>,<proc1d>,<TOPSPIN 2.1>,
      <pk PHC0 = 98.08594 PHC1 = 0 
       data hash MD5: 32K
       95 70 AF 44 63 CD 4C 44 20 BA 73 C4 3C B5 30 1C>)
(   4,<2013-07-18 13:57:14.087 -0700>,<Administrator>,<X>,<proc1d>,<TOPSPIN 2.1>,
      <abs ABSG = 1 
       data hash MD5: 32K
       2D EC 91 E4 66 9E B4 3E 3D A8 A0 94 07 D4 69 60>)
(   5,<2013-07-18 13:57:14.150 -0700>,<Administrator>,<X>,<proc1d>,<TOPSPIN 2.1>,
      <abs ABSG = 2 
       data hash MD5: 32K
       72 89 BB EC 24 A1 18 69 7C 42 83 4F 49 B2 F3 64>)
(   6,<2013-07-18 13:57:14.228 -0700>,<Administrator>,<X>,<proc1d>,<TOPSPIN 2.1>,
      <abs ABSG = 3 
       data hash MD5: 32K
       D4 7C 28 9F C6 BF FF 99 13 84 76 A7 61 01 98 ED>)
(   7,<2013-07-18 13:57:14.291 -0700>,<Administrator>,<X>,<proc1d>,<TOPSPIN 2.1>,
      <abs ABSG = 4 
       data hash MD5: 32K
       04 60 04 20 51 D6 AB 4C F3 69 68 F9 92 17 D1 29>)
(   8,<2013-07-18 13:57:14.353 -0700>,<Administrator>,<X>,<proc1d>,<TOPSPIN 2.1>,
      <abs ABSG = 5 
       data hash MD5: 32K
       46 64 7A 18 7B B0 40 C5 F5 50 03 7C 10 16 4F C5>)
$$ ##END=
$$ 
$$ $$ hash MD5
$$ $$ 0B 22 13 96 92 E1 37 A1 AA 21 D5 D1 18 A4 EC 34
##$RELAX= 
##$RELAX= 
##$RELAX= 
##$RELAX= 
##$RELAX= 
##$RELAX= 
##$RELAX= 
$$ Bruker specific parameters
$$ --------------------------
##$DU= <E:\>
##$EXPNO= 10
##$NAME= <AC1259_UGARH11076_6534370_Ws4MSD9MfT>
$$ [...]
150 150 150 150 150 150 150 150
##$TP07= 0
##$TPNAME0= <>
##$TPNAME1= <>
##$TPNAME2= <>
##$TPNAME3= <>
##$TPNAME4= <>
##$TPNAME5= <>
##$TPNAME6= <>
##$TPNAME7= <>
##$TPOAL= (0..7)
0.5 0.5 0.5 0.5 0.5 0.5 0.5 0.5
##$TPOFFS= (0..7)
0 0 0 0 0 0 0 0
##$TUNHIN= 0
##$TUNHOUT= 0
##$TUNXOUT= 0
##$USERA1= <user>
##$USERA2= <user>
##$USERA3= <user>
##$USERA4= <user>
##$USERA5= <user>
##$V9= 5
##$VALIST= <valist>
##$VCLIST= <CCCCCCCCCCCCCCC>
##$VD= 0
##$VDLIST= <DDDDDDDDDDDDDDD>
##$VPLIST= <PPPPPPPPPPPPPPP>
##$VTLIST= <TTTTTTTTTTTTTTT>
##$WBST= 1024
##$WBSW= 4
##$XGAIN= (0..3)
0 0 0 0
##$XL= 0
##$YL= 0
##$YMAX_a= 642685
##$YMIN_a= -547306
##$ZGOPTNS= <>
##$ZL1= 120
##$ZL2= 120
##$ZL3= 120
##$ZL4= 120
##$ABSF1= 14.98509
##$ABSF2= -5.573092
##$ABSG= 5
##$ABSL= 3
##$ALPHA= 0
##$AQORDER= 0
##$ASSFAC= 0
##$ASSFACI= 0
##$ASSFACX= 0
##$ASSWID= 0
##$AUNMP= <proc_prof1d_extract_pilot.lims>
##$AXLEFT= 0
##$AXNAME= <>
##$AXNUC= <1H>
##$AXRIGHT= 0
##$AXTYPE= 0
##$AXUNIT= <>
##$AZFE= 0.1
##$AZFW= 0.1
##$BCFW= 0
##$BC_mod= 0
##$BYTORDP= 0
##$COROFFS= 0
##$CY= 15
##$DATMOD= 1
##$DC= 0
##$DFILT= <>
##$DTYPP= 0
##$F1P= 0
##$F2P= 0
##$FCOR= 0.5
##$FTSIZE= 32768
##$FT_mod= 6
##$GAMMA= 0
##$GB= 0
##$INTBC= 1
##$INTSCL= 1
##$ISEN= 128
##$LB= 0
##$LEV0= 0
##$LPBIN= 0
##$MAXI= 10000
##$MC2= 0
##$MEAN= 0
##$ME_mod= 0
##$MI= 0
##$NCOEF= 0
##$NC_proc= -8
##$NLEV= 6
##$NOISF1= 0
##$NOISF2= 0
##$NSP= 0
##$NTH_PI= 0
##$NZP= 0
##$OFFSET= 14.98509
##$PC= 1
##$PHC0= 98.08594
##$PHC1= 0
##$PH_mod= 1
##$PKNL= yes
##$PPARMOD= 0
##$PPDIAG= 0
##$PPIPTYP= 0
##$PPMPNUM= 2147483647
##$PPRESOL= 1
##$PSCAL= 4
##$PSIGN= 0
##$PYNMP= <proc.py>
##$REVERSE= no
##$SF= 400.02
##$SI= 32768
##$SIGF1= 0
##$SIGF2= 0
##$SINO= 400
##$SIOLD= 32768
##$SPECTYP= <>
##$SREGLST= <1H.CDCl3>
##$SSB= 0
##$STSI= 32768
##$STSR= 0
##$SW_p= 8223.68421052631
##$SYMM= 0
##$S_DEV= 0
##$TDeff= 65536
##$TDoff= 0
##$TI= <>
##$TILT= no
##$TM1= 0
##$TM2= 0
##$TOPLEV= 0
##$USERP1= <user>
##$USERP2= <user>
##$USERP3= <user>
##$USERP4= <user>
##$USERP5= <user>
##$WDW= 1
##$XDIM= 32768
##$YMAX_p= 444265345
##$YMIN_p= -666411
##$CURPLOT= <Network HP LaserJet P1505>
##$CURPRIN= <$Network HP LaserJet P1505>
##$DFORMAT= <normdp>
##$LAYOUT= <+/1D_H.xwp>
##$LFORMAT= <normlp>
##$PFORMAT= <normpl>
##$SURQMSG= 1
$$ End of Bruker specific parameters
$$ ---------------------------------
##NTUPLES= NMR SPECTRUM
##VAR_NAME=  FREQUENCY,     SPECTRUM/REAL,   SPECTRUM/IMAG
##SYMBOL=    X,             R,               I
##VAR_TYPE=  INDEPENDENT,   DEPENDENT,       DEPENDENT
##VAR_FORM=  AFFN,          ASDF,            ASDF
##VAR_DIM=   32768,         32768,           32768
##UNITS=     HZ,            ARBITRARY UNITS, ARBITRARY UNITS
##FACTOR=    0.250966925370066, 1,           1
##FIRST=     8223.43324360094, -21492,       -109529
##LAST=      0,             -190106,         -333314
##MIN=       0,             -666411,         0
##MAX=       8223.43324360094, 444265345,    0
$$ Real data points
##PAGE= N=1
##DATA TABLE= (X++(R..R)), XYDATA
$$ [...]
23867 276771 55712 35090 -142529 73355 -253883 355726 -245661 85961 -31636 -93365 12773
23855 115837 -152606 39857 -114733 -12394 -20803 97048 -128 59158 261980 -40068 18619
23843 190641 22583 -120768 -135126 -291043 103155 -65092 73344 -204027 131410 167220
23833 167220 -100770 -156332 196298 139624 4486 13405 -68927 88478 -68560 102668 -315563
23821 -224168 375030 -409615 -262991 22598 30562 174495 40096 -127345 243899 182195
23811 182195 -112593 -19431 89881 317081 -71030 323496 -88762 -24904 -260829 -135268
23801 -135268 -211064 -136152 -117875 -227485 -92183 -84383 -31016 -18154 -17329 -225379 -473195
23790 -473195 65941 477265 -108799 59708 -8975 -16875 92722 -234419 23893 -76417 -51546
23779 -51546 -123371 -44600 -81879 -114832 122694 -178434 389220 -471123 68110 241824 -222058
23767 209026 247257 -295268 -62240 -163735 -34817 -215969 -123312 -227916 -175316 -3767 -86385
23756 -86385 235422 -291870 184792 18836 -131379 -62733 -184700 -43816 317542 -44851
23745 -52977 -92222 -13732 -7453 -116370 230222 10951 76974 -447533 59254 44674 -124094
23733 136151 59294 -86997 -74880 -372671 34558 -199493 -14205 180693 -128797 319586
23722 -100575 82861 86259 -448494 -159495 457760 230053 -113911 -381002 -303622 132081
23711 61112 -211834 -100672 -8359 -108121 -38560 -114213 -168907 -84828 -93311 7466 -230931 -133719
23699 -133719 308535 -134590 80127 -65610 -58656 -146347 -21346 93176 35232 162494 17904
23687 -84778 49533 1665 80921 -403134 177231 5019 -212091 -49788 -266019 38311 -44725
23675 -41281 -220349 365967 -55970 332952 133647 -75230 -69186 36014 -69950 -118303 58353
23663 -159273 -79212 203979 28268 -61176 -82871 -248939 361436 -134632 271281 73726
23652 70088 147954 -307902 -98703 -21629 203982 275429 -238686 -76312 -70529 -115737 123012
23640 165861 124266 135573 3934 -155853 101934 -39161 175094 -15530 100 240485 1534
23628 291814 -16909 -175082 -195712 93032 -76457 251361 -138997 183321 -259765 -38876
23617 238533 185617 -185006 -53723 11855 -116453 51741 258204 -51402 -221703 -384142
23607 -384142 -235192 -239211 73624 -297800 8086 170291 -299206 -79489 -145641 66442 -237628
23595 -56671 136144 -199265 150445 -96034 -274432 -345644 223085 -10744 -1776 257923 146974
23584 146974 120543 478959 117839 -153719 82496 21633 -141849 253049 79101 -47698
23573 -284818 -288386 167886 161466 -259942 -255868 -54077 -56822 -171665 284508 -88778 15672
23561 92551 -158005 -52470 43084 -178459 -78837 -48931 32787 -112167 69133 -198049 -34432
23549 5540 17063 134761 -3504 129232 -19675 -151771 22471 -18919 -23184 12071 -196616
23537 -114311 -289511 436879 164929 -188444 201326 -323672 83722 240211 252458 -27921
23526 -300787 -72441 20096 -33791 -6134 -47990 -296714 -81581 -75190 158559 145450 -21637
23514 57625 133215 51891 117565 147257 -64268 -104861 2095 42172 55116 35616 233077 -294172
23501 144947 -420442 -163293 -163222 33884 115945 279387 -131298 -97060 -178918 54223 293714
23490 293714 -267959 -136594 -340046 -46979 55668 -243138 -170870 -155316 -47103 116202
23479 256771 -13308 165010 -434651 76600 44976 -3536 -63907 117247 -146842 -238415 10448
23467 346049 35146 -218218 -117584 -31659 48668 -252151 -18041 176838 -274917 116503
23456 33481 -182331 36309 36782 -139584 302407 118224 256778 -30257 74527 -65018 -131295
23445 -131295 122904 -81541 142158 37214 -32782 -117918 4616 57009 118522 -55456 32547
23433 50423 163222 -106789 488139 -43347 -207193 94837 33780 77447 32179 -71768 -332703
23422 -332703 125227 -176761 -221313 -171385 -142669 -151927 -26641 -274894 -96970 41651 192119
23411 192119 -61432 67322 -48243 -35663 -197670 -267294 -88200 248882 16845 -120265 1739
23399 -241212 -89272 9764 23819 4660 -78529 208783 -184635 193640 -144583 219215 -21497
23387 207565 30412 30166 166594 14605 462405 4277 105649 -86051 -54430 12592 -130215
23375 -24607 -87363 213363 -179841 -148717 -214582 -36938 -52886 -236693 -96373 79309 -48710
23363 210230 -104549 331616 -309771 -123881 -296663 -9510 -39921 25740 -133680 98397
23352 -173477 200275 -139800 -93035 153478 -85925 -138759 381 118478 -60543 -265382 105870
23340 -245509 -299059 25411 198032 85581 -24926 -63437 214139 -132494 -432477 38218 317072
23329 317072 -131456 -220512 254944 -118199 47398 64119 -26736 -296810 -66222 -92330 -341510
23318 -341510 23628 6409 84542 19669 256682 -15058 -185867 -116306 -255858 -214588 60032
23306 -188963 -200014 107299 -27153 -81953 240395 275480 -20897 101642 95361 -146291 69544
23294 2599 -22388 -96630 27611 -259963 -21924 85750 5497 15021 -56604 99805 -296410 -50628
23281 -194298 -53393 -300681 -114862 21248 -11194 -47483 -133400 51812 99551 -226535 -16836
23269 -23091 -40633 144199 159656 106235 -58978 -104843 107354 -26616 -56272 132504 275080
23258 275080 292693 -51285 292907 40812 -177987 -50470 145030 204300 -185018 87132 247492
23247 247492 -201143 -7705 46283 -161053 -51979 -138769 231471 210215 75242 -65517 -76924
23236 -76924 123047 351732 -8109 -175363 -194476 -161700 97364 -517661 77 -64207 -260899
23225 -260899 -26809 55523 66259 193085 -98857 -171181 117300 -14466 -133306 173032 -88639
23213 -29646 163894 48401 -20259 -56448 89136 -253107 -185368 32895 141213 158569 -132940
23201 -102070 -127076 209359 172388 -29568 -115975 19897 -75310 263983 344068 -293417 123011
23189 -202303 194724 58417 142863 246310 -171493 3298 -230017 -412106 -277308 43380
23178 -218819 5832 -229931 -116653 113563 -7409 155146 -42321 -112865 311133 -99986 120766
23166 75636 -237941 -157820 109676 -115775 -59267 -102266 239072 356713 -13701 -188348
23156 -188348 120894 -241356 -48784 104605 195307 10235 -262711 -288110 307191 -124980
23145 87463 45845 -53132 -175924 200341 -10527 104474 83635 162450 -18413 178920 233506
23134 233506 -274256 52695 95562 137626 221721 98149 -154771 -75818 154686 186262 262512
23123 262512 -120395 181796 65 -182982 -228180 -296641 -164244 142119 50445 -138190 184427
23111 -94765 54083 -162680 -105853 188283 49263 -75118 -19043 157701 -129784 -192883 17696
23099 121836 -15771 -66922 -100801 -180892 50262 -334537 -180838 173964 70793 63564 -311216
23087 -274203 48434 -174978 45958 -6718 71790 87529 -271385 909 -388598 -61990 -149862
23076 -149862 15929 272103 -20591 -252750 157163 111502 7872 44870 282561 -276031 -156070
23065 -156070 25325 -345106 197860 131294 -44228 -291043 -210164 53666 18217 130414 -117741
23053 -352111 -129680 -176551 -70113 -151195 63033 68195 170731 17540 -321679 238225 -151421
23041 -121980 -148183 138623 -312345 266691 -264768 127672 69082 49303 -246986 -20806
23030 106937 -79062 94515 -88033 143375 141844 64871 100608 8293 55700 -193063 220184
23018 180502 -16833 -275668 260897 -1364 71907 -87559 11527 65705 175659 -55991 328847
23006 74310 53461 -39208 234601 -302152 183619 133773 -48533 47977 71146 110172 243632
22995 243632 -121874 -137325 58136 -220088 66854 -17822 243063 347196 -86676 -388532
22985 -388532 -231999 -532807 -220094 -1311 -110061 141057 -90970 -113650 253568 -6999 -51356
22974 -51356 -111254 274846 155452 26268 155362 -288849 111037 18282 -53358 -293767
22964 -293767 -255021 92889 -168403 47627 -296299 -267021 218863 273574 -288351 -30065 -370536
22953 -370536 -80903 -33599 -159019 -36865 121718 80166 307044 74081 174921 -87221 13466
22941 183564 -123151 35850 -194925 211582 -247453 -138658 -197307 103668 4805 -122131
22930 -253196 -42395 -126888 -21756 -43182 -186419 101416 18576 -7762 -215400 -21126 -22352
22919 -22352 7258 51699 -312352 241515 169200 -225021 -116422 -146911 252971 262739 -362102
22907 -2641 180908 -46653 -157076 -92043 43183 -15186 10606 275464 -33736 -179684 -215929
22896 -215929 96347 37102 30638 -11655 -42549 87400 -120379 -181857 36659 22135 108726
22885 108726 76007 100254 -100169 138057 -50108 -195859 261889 48727 155732 44260
22874 36907 -111933 -153695 -20417 -269041 -282593 -12638 21680 -168744 79996 176517 -160636
22862 127216 36396 187692 37184 215783 237318 202506 -70905 40015 128263 -52202 9500
22850 -103497 -167389 150153 11602 101469 -103920 284267 451114 141234 -209831 177610
22839 -10019 45907 -25554 68974 -69178 -70877 128063 -35187 126133 15132 95754 54219
22828 54219 159392 -120455 23801 -130702 -49350 2981 -97860 37876 90994 -147423 -4929
22816 156629 -164419 -126104 -145924 28035 64625 108371 235585 37447 -245988 267234 155932
22805 155932 -154281 -48790 -56806 -4394 -276755 -469901 -452383 -60425 300836 -91085 37000
22793 -110935 -180845 94108 349195 24579 -170948 80363 172653 -270990 -268290 -1218 47761
22781 -116048 -10103 31319 -33663 -217733 182654 58685 -358280 -162541 11865 -30641 -434519
22770 -434519 -107807 182740 136039 -129749 20549 84184 -53053 -43711 -2513 258196 129516
22759 129516 -448598 5559 13490 165022 91977 -36702 -78915 -226773 205986 35318 -4307
22747 -4279 -5856 -34095 -296106 -28547 -277314 92605 80751 -174336 -121139 -163962 -198325
22736 -198325 -79019 -288297 50258 217436 102218 17509 46647 -250454 -8097 88083 -257842
22724 112378 -356971 -35146 -258876 -250840 193413 218676 8591 -149920 210666 -88681 -421951
22713 -421951 298509 -87925 -68142 180083 -177055 25475 181752 -210610 163430 -218038
22702 -140986 13725 -58995 207202 -366597 111262 127994 -354484 -32749 -218639 -6863 -68499
22691 -68499 20473 -37553 -101914 -172270 -168954 -78184 -61972 276561 -93619 19065 337683
22680 337683 -81646 -172798 -62186 -88133 -9885 145504 -192228 -57783 14454 258138 312753
22669 312753 45091 -120201 -19812 -146366 -97227 1329 76830 -88392 -8881 -112605 139178
22657 256081 -387347 73802 17607 -40570 -39720 -162783 26979 -88243 167725 -115004 -157044
22646 -157044 -52768 8399 151257 -77245 -106211 116865 -3807 53910 -144843 25381 26767
22635 26767 -28622 94240 65178 -234299 -271281 38378 9805 -286718 -160802 -29736 -215646
22624 -215646 -100930 -171652 -140842 226347 -249121 81447 137360 60722 134149 -186199 -172326
22613 -172326 -36865 -156307 -152478 -123089 310724 -273333 197390 -36255 48601 130522 -202079
22601 75654 -125277 -208292 49134 135955 -208559 59166 -107576 250715 -5101 -233702 -7987
22589 -188222 -181822 218732 -176539 255270 -34521 1752 -152292 -91447 70537 -826 41052
22577 129413 -154807 262021 -68223 -304272 -145038 -179083 -129313 93611 157466 42555 90333
22566 90333 -136820 -107696 -293681 198329 -32851 -189930 -70369 323752 236325 -219284
22555 136476 -54198 -261752 13299 -148668 92201 227907 16546 -465638 144780 -262870
22544 -152773 44312 -183787 -154627 28376 -75503 -151601 -214256 -16558 -59535 156032 -193033
22532 69430 18054 60120 -166116 -34860 289063 166048 -32567 120099 -29986 213768 -137149
22520 -281234 -366743 110180 79919 157766 -278986 -374068 -346817 -5300 131150 -151810 13560
22508 42638 -51711 -133059 -6782 106766 -71166 -124704 69737 -361457 -181673 -209054 -33456
22496 -80573 197662 12746 -205389 -90815 -206971 -185570 -1839 -168902 259245 -212998 162351
22484 -135422 -203657 -352764 -91248 105583 -135594 -115380 54801 149964 -189780 -211172 118024
22472 221402 83353 24903 27165 -78826 -235114 -150455 36034 173046 210078 9164 -65474
22460 291812 145636 102428 -97761 -68828 -161833 -21337 119880 221518 187684 -62113 160321
22448 236142 -50095 32476 42121 239538 115206 -76530 12324 -68645 -156631 -330119 -31000
22436 -84678 249233 149533 -206580 80878 -34547 37534 -30820 341597 -206909 68271 -147126
22424 74181 -121726 200319 23499 4187 -129303 -220901 -207439 53849 -173050 132293 149882
22413 149882 -75782 -297776 -93380 45310 153437 -80070 6855 -155573 -285123 25094 64135
22402 64135 39447 -44805 -336757 -91448 244778 -118153 308950 -43888 59488 98036 -171627
22390 -140737 177324 -105959 400558 -201736 890 302398 -303262 146116 36167 -190391
22379 32942 98565 134720 -207634 49295 276851 105225 -297709 59990 -150688 348601
22368 -97599 157299 -2690 68801 -118441 -211692 -306275 75248 -245816 -277177 -5905 113115
22356 99552 -173083 -26967 3983 145009 28223 -118257 51532 138004 -170560 183921 69555
22344 -160417 213262 166391 -5418 -78376 -39255 -45194 -64633 -50172 26317 -215669 -160818
22333 -160818 -188686 -31567 32870 181246 -103981 253147 -399169 129806 -228319 -183259
22323 -183259 -63182 -107666 118708 -183710 -17854 -58718 -207264 69032 -174096 28602 -293596
22311 -121513 101323 -80669 -215976 142032 45879 136746 -251901 75643 86241 -14608 99984
22299 -127509 -54710 -150454 -192003 -280415 77207 -168060 290750 -234186 -30399 -282801 -76549
22287 -170247 -57905 19802 -419955 -276065 -115527 64407 -552 21076 8170 65261 93781
22276 93781 -146530 -75173 -121028 7046 -214910 -232430 22294 -225121 126048 66682 -65160
22264 67436 -149180 27027 -132631 -236297 -426426 182734 -6304 -159985 -327120 -203618
22254 -203618 -22745 -67491 -333562 -83511 -173991 79272 -131400 -346796 -181349 -128280 6367
22242 -28575 -99239 -121277 61902 79226 -140840 304533 -255670 189677 -38855 -54723 134484
22230 -54835 -338823 196236 -76329 -247045 -197176 140702 179815 -89239 -96928 -30837 -53415
22219 -53415 131842 95826 232695 171206 -185908 -199378 -130393 -277659 -83860 104540 -234719
22207 215270 51710 -202048 -27027 -141078 300238 44154 214104 30090 88850 -226790
22196 149446 -1248 -80240 -108461 -13432 198652 -1405 -177541 -261757 -141625 104374 -48281
22184 -7108 -248610 -178138 38481 -17558 -142912 -259896 -77739 39516 43632 -116579 3170
22172 107223 326966 -65470 -303467 -143553 -318596 82516 189534 -146453 -150921 -162780
22162 -162780 238994 -95594 -42476 -197135 164794 -73419 -20081 -72516 151045 106587 170602
22151 170602 -34498 25395 -372029 -287788 27281 -114177 -137045 90632 -45423 266258 21400
22139 -194956 96079 8388 205576 249975 -39081 199702 -100270 -207846 -102311 -61165 -114083
22128 -114083 26796 -23563 -48311 -408481 -224150 122447 149142 -162958 -124383 196679
22117 172065 -115651 2363 238276 -113166 48835 428073 5992 236585 -234111 -242117 4839
22105 -232125 173468 433564 -69683 -229661 71121 -148145 -36440 193733 -59967 170289
22094 309928 191826 -59554 -176740 7089 51537 -49967 -44088 137901 87047 -259273 -129627
22082 -61883 4462 -112300 -46762 2169 -98438 -176907 203816 -32383 142323 -232690 -123094
22071 -123094 112772 -125021 -53330 97723 -22779 43588 59153 -99743 -233511 -87080 -58528
22060 -58528 131370 -176291 -502124 -300181 20435 -251154 94465 212799 -252834 -110981
22049 63756 105413 -59065 -169348 227327 7297 -129243 -36297 177646 99561 212128 162008
22038 162008 -404594 -91902 -248548 -186792 -339859 -23042 258316 -67983 -245647 -186291
22028 -186291 -198981 35529 -36818 28260 -126597 -23502 -132431 -89416 -28315 -87182 74016
22016 -93969 -89776 -27356 -281553 -58085 207083 -31771 -142612 -26034 -36777 -154423 199919
22004 -58249 60842 20506 89767 201634 167737 -270693 -119029 -11992 223855 227939 -310569
21992 320878 73130 -88050 17625 -77730 -113561 -94250 -68638 -2573 -390543 -54555 236821
21980 569 -8720 -210113 48489 -71096 -146500 -144359 -248669 -86367 19530 136387 -7173 -151550
21968 -151550 -49583 34288 -45999 -62001 -142222 -107438 16362 -61016 -155165 -240172 -25347
21956 -15532 -287469 97744 -124597 69954 31014 89874 315896 5063 -35305 135936 -4381
21944 -234810 -72773 -97198 25294 180939 274327 -111645 85079 26551 -269029 -32831 -71087
21933 -71087 -184370 177792 -34233 -182195 -264063 -81704 -67218 84860 236015 -112813 -252028
21922 -252028 -53925 -24242 -85387 -226185 -250862 15716 -147107 -460155 -125871 -48514 -43834
21911 -43834 -142245 -268376 4749 72300 255601 -163703 -236120 75228 -155120 248467 -115109
21899 86336 -352313 -122874 180038 -238099 16328 -67601 20091 99437 -218006 344420
21888 150950 124779 40173 45375 -46133 205445 31281 -163373 23211 -329977 203252 -12902
21876 232562 73781 -414878 -55090 104137 -205332 -310873 127497 249045 -270066 133273
21865 -158501 -50738 -164130 156278 179806 -53932 185867 296538 -112392 -256300 -306405
21855 -306405 87596 -148167 -252493 -104809 -125094 7796 -268063 99232 46168 236720 -312330
21843 211759 154995 -85417 90153 -150723 -295700 -91807 13113 -56709 -289265 -168001 -291051
21832 -291051 124175 99105 -167512 31990 -94203 68002 61175 -149886 -19266 -70280 -204268
21821 -204268 267557 -114030 -175823 -439749 53598 149805 36763 -401735 -131611 -27522
21810 286775 108770 -72765 155144 -152443 -219480 -36089 161449 -205341 -255178 -234738
21800 -234738 -359313 -157701 -71561 -202904 95732 -188087 185594 -166133 -58360 -73159
21790 -73159 -226742 -231404 -119486 49278 -98841 -18466 107732 139862 45238 61753 3183
21778 -44813 -180936 246272 205209 -265502 -18840 119551 -252107 -334795 -154341 -9779 -343857
21767 -343857 -326606 197178 84333 -137893 157840 436568 15400 12184 117290 115527 51540
21755 -6482 77070 -139922 -214883 -133296 -401134 167111 -343235 -106928 -1741 -76996 -214948
21744 -214948 52177 -4859 -433010 88236 70579 71507 139957 -88939 -265382 -219769 21702 -46189
21731 62744 -122063 76304 -11309 122998 -26620 -129699 7735 -184876 137740 -64250 159588
21719 -242488 142170 139981 -7984 48420 270826 -474563 -150851 -185142 7920 165357 -154599
21707 -246325 20182 -67037 8468 -6644 -124673 -391162 -159278 -228055 -241790 -34928 -9861
21695 79809 37889 -23737 151911 361700 -194463 121317 -231988 107196 54254 87401
21685 87401 106791 116287 -125763 -44332 183376 390503 -187639 -197480 119592 88146 258962
21674 258962 -71090 -121758 6813 6783 115446 -96257 -189175 -85027 159203 77822 -55881 -9772
21661 281875 14691 -61565 -103956 -69003 -308283 -146713 -194655 -227726 -75962 -84771 -44059
21650 -44059 -311696 -69079 -219018 -148425 -113569 -76946 297704 276555 -73722 -400335 197161
21638 -286293 -271038 -29310 -155026 -18033 79354 -115858 -4117 122912 -271450 13824 -210251
21626 -228652 -419952 -11135 -209277 -266967 31967 58206 74818 54569 -322772 -79792 101670
21614 165690 -71397 185883 -64082 -42925 8893 -417475 120680 -405825 6516 22242 9122
21602 -292626 -48400 335202 69061 74934 -96718 -136594 -55424 -34201 -79555 -11070 38744
21590 165795 -172784 -94560 35209 -318285 235978 240471 -74429 -64940 -128056 -222461 -134446
21579 -134446 -202062 -74997 -140679 -119151 124514 131918 -42600 -239240 -102974 22591 -11593
21567 225309 -159028 84915 55915 142965 40351 -187761 -160122 -66848 -199968 -204978 11743
21555 -40372 56092 119820 -273531 232373 -128245 -23956 -395546 89518 -110259 -147236 -65240
21543 -130573 -134424 -14068 19537 14726 211753 -206183 -80895 127378 135149 -79229 -84808 212841
21530 -1318 -251824 -4468 162198 -93303 -30174 15552 -326208 -67213 -77845 -141971 -221197
21519 -221197 -251568 203202 225039 87116 226586 -118491 69503 -127431 -49761 173744
21508 -387435 117595 -111485 -71026 -407233 27685 235781 206424 -337237 12697 -382605
21497 -54934 43037 -82408 142636 99361 -118350 67630 150826 222668 12533 -17282 -45697
21486 -45697 -94366 -311815 -67424 37329 107296 198827 -78068 205455 -221191 -349170 -368882
21475 -368882 2345 9974 -216912 83340 -179451 -210452 -107268 54014 74535 143750 203224
21464 203224 -271260 -232829 -4819 21045 72259 -181084 -365547 -83117 383297 -274612 -135324
21452 159920 41403 68025 -43146 88278 -240278 -128012 43235 -141647 116320 147733 345105
21441 345105 179156 -30107 158709 215226 154618 154077 260200 556223 232218 467281 519218
21430 519218 556513 197780 144034 106079 -221432 57778 -561002 -18828 141978 8740 241846
21419 241846 142350 192095 -120410 -95746 180548 -202243 10421 -179471 -352875 5583 -419392
21407 53535 146257 77512 -239106 -108319 -138970 80571 -95258 -240229 -177228 79654 -47091
21395 73002 435269 -92662 -190618 -144042 -221122 30798 -187304 220443 197714 188672 -23869
21383 -308925 113969 -50081 -88641 -146149 -4052 43966 46380 42829 -231662 -69881 84291 -9613
21370 34783 5202 -35508 -205298 118872 -193166 91134 -69327 -76026 155436 208994 -160774
21358 -534160 -103886 -119008 -493133 155774 -320454 -27366 22699 -218221 -277906 -35723
21347 -18530 -82028 -261636 23365 -208042 -68378 -94164 -14645 227870 -100390 55701 72250
21336 72250 -387043 160210 -20491 -236902 160967 -140348 -115234 -74894 -515386 -42640
21325 -13760 40283 34825 -74115 202115 -260917 -99928 70008 192452 -108288 -66169 317301
21313 151799 270060 27349 -11826 -128292 45971 48890 202440 215163 -335766 77024 -158029
21301 -210268 104634 -237177 142509 179859 18669 -210723 126035 -10717 -401969 -291977
21291 -291977 -82407 -138224 201258 -233168 -93428 62082 -236750 70913 -334752 -21141 249297
21279 -285384 42589 -146418 59036 19535 183771 163087 161252 33698 -193570 -108751 -99597
21268 -99597 -120111 -116079 277629 256869 51204 -169288 189169 -77609 1258 -329108 126383
21256 -178783 -95230 -71937 64913 -46823 -260640 7911 -193628 249858 -502229 58512 435
21244 49643 -147761 106047 -230184 -55874 95912 -204745 -232677 61750 173039 -67608 178883
21232 -261759 154590 -404827 -57386 -100199 -206653 -145504 -134219 118651 -46054 94961 -134632
21220 -175602 58031 -199837 187607 11608 -73532 -57476 -288125 120491 -66573 -300881
21210 -300881 223720 -200095 -372357 242459 37785 -121295 -93286 53178 27577 -185072
21199 -137304 78616 -109043 196934 -95820 -182120 -67291 222798 116209 176809 -23456 -50649
21188 -50649 98851 -47385 -248972 72639 -235738 214875 107633 -222937 -346296 -90870
21177 -70249 -73340 -168581 172124 216456 -288866 151804 -89469 1174 -162451 -172173 -188358
21166 -188358 -106866 158941 -44342 233243 239964 -42285 57620 33507 263636 -264533 88764
21154 102254 -374169 111681 147774 -109872 36004 341358 -214277 -162753 -357716 136914
21143 -33564 -440883 16003 19972 -54639 -168679 -149497 283478 -57059 -51862 -91713 -6873 -213439
21131 -213439 81919 9603 -21477 -303452 -96843 -243034 110863 -274788 14476 -160133 -42870
21119 -376542 -190519 -90033 147868 -163757 153854 23180 27263 31358 -382923 264113 -31338
21107 -57364 -247735 332722 58155 -137624 46211 -301525 -58377 -37 -221667 22702 44163
21096 44163 -257380 -240177 -68676 -64906 -230537 -8151 35915 219798 126055 -79948 121878
21084 -79827 8909 288911 -313098 79818 -19110 -288650 -134913 164238 201236 113338 -365551
21072 19831 -64626 34105 50602 -354507 -46620 -345717 -146125 214989 -158658 -48709 56252
21060 -136826 253184 245715 -282582 -36032 -77974 158753 -57263 -178620 173326 -128108
21049 270747 -141028 -67021 195660 -204157 -167497 -66212 -131892 87514 -94446 -375004 -148969
21037 -324900 263672 -7046 -94162 -29967 117347 -150589 67309 243945 27403 -18489 -322333
21026 -322333 -197501 -335370 71759 -312244 -163498 146180 143013 62059 255108 -168465
21015 25186 -401161 80338 222260 58971 -168383 -23082 34776 25194 -148952 48745 86210
21004 86210 -9589 -169038 -269732 45797 -128717 -373155 -298702 113463 -288716 125959
20993 149325 53152 170101 115698 81089 -128895 -258969 275269 -113364 152377 38808
20982 -111861 -24772 -100581 -34845 -263628 -317524 171696 -36891 48200 -424556 -10160 235998
20970 151761 -116417 -8274 15187 87800 -7965 -68086 104351 -102132 -102648 83226 -264642
20958 49285 -209337 -241810 46305 -22217 -106659 -252749 83733 -368396 -216588 13914 -528389
20946 146700 -203311 80366 112172 9291 -287004 146465 -13586 -126482 32762 78588 188065
20935 188065 184162 -73207 -10743 -49414 -116774 -106861 70830 -236381 -222476 -69963 -203295
20924 -203295 -290349 289438 -79775 -54570 134245 197895 -75956 -17623 -10119 76088 70975
20913 70975 -86055 133748 -91891 51163 -117474 -125967 -666411 -9576 76857 -128440 46566
20901 -225545 -181801 5228 116680 -45521 -206427 -77169 -155868 190778 80620 -87593 228452
20889 -252145 -167176 252094 112799 -436117 -317091 -229442 113392 -61238 54879 -95888
20878 -436380 101441 -79482 -63139 -8290 279956 -73683 -465269 -234752 302439 53888 -172791
20866 -73907 16694 -241152 19289 -40355 -222705 -274625 -74491 52338 128163 132178 -50591
20854 -153202 -5296 -206520 -102419 -158163 19376 -140711 114083 -160270 152088 -9511 108041
20842 237691 155804 35696 -176180 60924 -189296 -210627 -34672 17599 -222037 -119607 -114016
20831 -114016 124438 284011 -421470 -82163 -77841 12222 -288069 -126983 -224728 -96975 222201
20819 96422 -296191 -302737 -198680 20049 -89856 222651 -279288 -246278 181045 199537 -213231
20807 -74273 -212013 -260381 -74147 -202181 35628 -81791 -109543 229748 10075 -127975 -183263
20796 -183263 -495961 113642 826 -245734 -121624 78951 185381 -194954 68649 135254 80703
20785 80703 3060 -117299 -150584 -255487 -217200 -185562 -8331 -49531 -115794 -242820 -356622
20774 -356622 -272154 -299042 179748 120126 -159715 28206 41874 -78257 218047 -261681 -1198
20762 133321 -110098 -107117 85331 55473 37682 -324493 126738 244128 184115 -107068 -138402
20751 -138402 -124781 -336063 -340026 194622 55097 -360345 -30726 -102353 321540 -243216 100560
20739 -2529 -34599 52942 -91138 -17441 78179 -43527 26776 144538 -52867 -189935 -612402
20728 -612402 289302 1657 -27356 13610 150034 -59783 104009 -191037 -324055 -322655 62379
20716 6794 41667 -55115 -96238 18544 -323388 63013 -221978 -4466 -33616 -32353 -199537 43097
20703 -211065 -211843 -67790 -221864 -82367 -129714 -211464 -176278 -3136 260804 -154781 -26679
20691 -188436 255265 14511 240170 7389 -270117 -24823 -104356 -295229 45439 460383 -193522
20679 -127726 81860 258272 104631 -134966 118118 -405232 89168 -102359 -230499 320537
20668 -132345 -141340 -94210 -52609 64257 8312 -65185 -163747 -157732 88792 58305 56417 73430
20656 73430 65174 -201714 -109553 -131986 -14894 166030 326833 295486 -180715 -36317 60992
20644 -383377 -255865 -209202 73325 -75442 -214825 73793 -428545 7851 205751 52338 8472
20632 34925 -304624 -151259 -24023 -90863 -13995 154773 -1250 -67788 -3154 -9328 -114503
20621 -114503 -9724 -138998 234731 -195608 -45103 21971 -9776 145098 -113773 -321059 -176860
20610 -176860 5299 48077 175995 63911 -17157 29406 262633 203167 196335 -141863 100856
20598 -82316 20305 -44560 -118884 -34457 -16010 -2748 16594 -203922 -1712 -222260 -131644 15343
20585 105335 -22110 72907 124929 205673 -54508 275107 -981 -139856 -170572 -286960 -284447
20574 -284447 79017 -138233 -104272 -17253 -110027 -93503 238592 -14325 -126085 -252187 -60708
20562 -356944 -121003 -125113 -23654 59669 484283 -136334 23309 26697 -12244 -146176 95712
20550 -255493 173775 -291259 -389822 7244 -112281 -330703 -4172 -363692 -195650 62572 -181589
20538 -279162 3542 14671 -244429 230020 -234259 -294907 260817 -25743 -120916 196677 -194852
20526 254985 108909 22863 -19562 -164726 -81954 290589 -215524 -129126 -244146 149200
20515 -226197 33019 -22839 -301408 -15409 95772 -22561 -108924 88622 -228753 -281264 28322
20503 -263797 -394552 18489 -75706 161573 515122 111825 -233118 -271002 -191038 -65053
20492 -155350 -148696 -7596 -13734 -154904 -130582 -174026 266100 -262418 -309872 -122 -159357 -29422
20479 -20288 -248970 -277929 115224 -337529 -61696 -169159 -223799 127198 -212638 -147580
20469 -147580 184356 -211058 -158779 -25059 -82690 -26589 121440 -315706 -11818 -102127 181361
20457 56365 203278 -352236 41666 250078 -54652 225288 165408 -71149 -160000 96635 -129240
20445 -322342 -113247 -317885 240992 -131213 91513 -239176 -53757 11339 24053 -259431
20434 -151286 -95272 -119018 -257924 -34616 237549 -211436 334994 -40714 102057 283959
20424 283959 -209633 -71300 174013 35498 97837 74747 -75414 -119366 -29469 -128049 -97387
20413 -97387 114251 -41229 -8494 -234539 -41672 -54654 -114755 229274 -418110 22319 -337584
20401 -210464 -64396 -320459 -8505 -100686 232246 259476 -234207 -136634 -129054 -305491 87342
20389 14234 -183061 -43683 -178325 -26621 81400 -78604 102577 -424478 13925 -324945 14464
20377 -242488 -27950 -444824 238227 -258757 -248568 15329 -27587 -86363 9280 -172102 -83361
20365 -53638 -50864 252572 231672 -228757 -112342 -46746 55789 12895 -365456 119577 135131
20354 135131 -158241 -115332 -326824 -85242 565057 -347090 -46511 -243670 18408 -191098
20343 -178087 297723 -362267 -22553 -19267 -361727 -250807 -211925 -126376 -56553 114911 76176
20332 76176 147591 -23298 -246163 -151717 -127336 67640 145127 -69367 -12012 -4473 -352077
20321 -352077 138667 -124158 125013 38831 -249056 107278 -274371 15079 -5754 80646
20310 89649 -7961 -37161 -58056 -167113 -24739 -23899 -133065 -253783 395836 48542 -68560
20298 62694 -18727 -512132 69807 20670 -43771 -447386 -279005 157216 -112282 -14794 104748
20286 -52088 -269671 -129844 -525102 80146 -123802 -159151 -21822 -124344 -117347 -187136 -128206
20275 -128206 25120 86000 -205377 -77933 -5553 80808 134196 -5166 -77853 -295454 263785
20263 -132869 80688 -162457 -210902 190847 -80578 -5354 201973 252470 -11871 -471369 81170
20251 -28028 54440 -16797 -73829 -123217 285517 98630 -106135 66898 40880 -416354 -123829
20239 -192893 35242 -185319 -236554 -29519 210529 -148275 -282865 -28688 -31431 164263 -8538
20227 54927 145936 -82472 -101101 -255444 -116476 -70999 -185423 -164801 -289489 -61990 -199035
20216 -199035 -529788 13933 -14154 -295558 -80218 965 -301265 33359 -521708 -360183 -35414
20204 197262 10214 277224 335 -85195 -295694 80720 -172614 -118964 15115 64939 -160424
20192 -280427 10418 -182873 -109558 -221534 -25662 -137650 -127919 -246915 -165477 94964 -445145
20180 -259271 245994 -36905 -255123 -231393 -198479 -126049 -245230 -239523 15861 -60779 -83639
20169 -83639 79386 -182438 -49014 -105734 -319883 131929 -248232 -120278 -94687 215434
20158 371047 -83860 -116870 73106 142124 -110018 -265687 159812 211160 113568 61860 -129556
20146 83773 -4611 121772 20975 136626 -163740 -288530 38515 373970 -105536 -53371 -43335
20135 -43335 -26746 90563 166925 43614 45905 355973 -129361 233632 -80260 140412 74784
20124 74784 -104910 26762 348139 -158176 -91140 -192485 -196699 179623 27014 112939 -289666
20112 -153594 106250 267200 -210779 -59477 -2723 -365933 96018 54866 62310 39103 -458241
20100 -121137 -108268 -84943 -135 -80982 376009 -168034 -268418 102276 -21947 172757 -415235
20088 -82469 -79795 -69620 -78212 -200139 -140003 -173323 -154957 -306679 -143203 307232 36709
20076 -245155 4956 -438448 -47470 -222033 -93446 -60426 -59837 -221423 114951 -232781 -224044
20065 -224044 40791 -431837 -75865 57254 130314 -74156 -65889 -111104 2181 -133592 261094
20053 260200 -57423 -93370 -32166 -70638 44341 22835 -398780 165615 -304684 63011 -48552
20041 249926 -55655 -116670 -44102 -20435 -368004 -16132 -439443 -206607 -259949 -288408 28110
20029 156447 203224 52275 204580 -104448 -79729 -219686 122238 -1079 -258754 106034
20018 127069 -179538 97905 157954 52459 -90476 87723 53368 85279 93618 -105329 81939
20006 -171213 -384551 -97052 -49015 -243638 397729 -165550 -319638 35996 4262 -159807
19995 -87327 -59319 307873 -185250 192433 -248866 -66205 313577 -49017 -30986 223837
19984 -239904 151068 175889 -23275 5448 -129271 -244201 -425371 -96558 -52577 198848 165717
19973 165717 -95167 19304 -22648 94072 -30576 -48060 -128642 -157036 67503 -90279 -130607
19962 -130607 -84139 56552 43737 -55513 -164850 -136117 -49992 103981 147697 262722 139985
19951 139985 -194798 -113539 39859 148614 26079 127469 -63516 9573 124975 85195 143791
19940 143791 44169 36528 146524 106332 -384667 202329 -200771 81371 -9696 69070 -279062
19928 197139 58920 -241645 -130358 -103675 -228813 57437 -71476 -222424 37390 11510 182709
19917 182709 164028 -38063 -38895 -142170 -149539 31475 -185869 -82193 -43660 35515 132451 101264
19905 101264 -44784 87481 149636 157965 -34607 -130386 -325598 44731 -19881 -50941 -245244
19894 -245244 194120 -101412 -127840 -163042 40700 -113876 282038 -85448 203520 -14030
19883 -230526 -148536 -37548 -85874 148432 -394741 51486 -99784 245031 110899 19241 4682
19871 129429 -248773 -242478 -10073 12484 58805 -330654 473 79448 3105 88152 -135129 18481
19858 91543 210718 -8116 -247061 -71173 -67778 93890 -6922 199566 -111543 139470 -110752
19846 -59017 58211 135948 -22741 -263506 143791 -45966 -25695 -42880 -76899 -77453 295821
19834 -239946 -275159 -42324 295646 -432709 131488 46239 -93279 42126 -159573 41944 -153596
19822 -157905 -43398 -147542 -162107 -34798 -213912 -46119 -11378 -504093 -213298 -117752 113760
19810 -438485 -168381 -33662 164428 -112096 152595 -124653 -301222 -277426 -380434 -81233
19799 -203413 127002 217711 206751 -313628 220167 -105939 -87840 -116344 65664 -86714 1467
19787 -71101 142197 -228858 -25086 78431 -271149 164587 -27385 -178689 223339 -1614 -492
19775 64431 -334847 -174273 -126601 -213447 210380 -52071 -315343 72696 -142231 25442 -200978
19763 -147672 55997 3973 -290172 42635 96177 -75408 -246825 -93466 116195 -227767 165349
19751 283046 -64914 -107994 -77361 3892 163897 -145838 -158405 -27847 -358798 9554 -14773
19739 32132 6371 86484 -156926 129061 -178101 -77725 304360 -99705 208963 -13238 340670
19727 201426 236719 -179372 -14895 86915 -45625 -132762 129966 204887 -353840 136943 30306
19715 -207844 83660 -109876 80426 -133570 80103 189624 -182868 -162948 -218971 -143708 4133
19703 -159936 -200844 -243872 62858 -103950 101888 -102483 238439 142739 60614 120405 31723
19691 -3750 -177490 -417128 41737 91441 -150259 -23513 -114442 -58341 -162187 237906 -108571
19679 -203282 -56068 -292684 -204659 -36654 117942 -407504 128220 245764 -263363 -1884
19668 -117364 -89464 -45051 41566 -40511 113432 109354 -18237 11527 -103365 202474 -19930
19656 65429 57492 -105108 181603 -165923 -45627 -17407 337141 -166208 -310429 167728
19645 -241551 -141446 -15092 -91952 294496 228981 -92434 -105641 -186409 -47172 -208065 3055
19633 71906 168952 -163509 131402 -69506 -173985 383065 87962 39047 115091 -244866 10115
19621 33039 25381 -233425 36818 68052 178185 -251091 -170661 -25772 -12513 -322581 -96218
19609 151068 59495 -151750 -61109 299466 -74136 -98113 -228051 272343 -123617 -264131
19599 -264131 -358450 -4329 -214677 -601704 95799 194825 -15089 -11326 171933 136192 -297187
19587 -133889 -3142 -177539 -312743 -8986 -230474 80798 -3857 -73550 -44551 -80752 -284991
19576 -284991 115926 217447 -17133 291336 -1012 -89884 -109953 8916 -386441 -101943 113813
19564 158871 13305 17423 -19491 -115733 -265242 -79914 122103 -296013 -179889 64112 -115756
19552 115611 -114495 -66354 145039 -10342 -73284 286216 56374 -224730 -151685 -15628 -129897
19541 -129897 45048 316603 -202977 234913 -43958 -188050 -187984 92813 90269 -229257 41819
19529 -174521 74865 32018 -236452 198116 197984 201184 10041 -193480 -351222 -95287 27197
19517 -377341 -295090 -91518 -84225 94536 62237 -294938 -249101 -250363 215337 -13522 70338
19505 -95794 -394780 -18024 -191331 38478 -279039 160957 -233751 -3918 -272941 -149740
19495 -149740 71118 -167773 52772 -75386 155538 -166804 36034 -75876 -168012 63756 -256215
19483 -95584 -303286 -44335 -241269 -184713 123847 -265024 -87316 -166339 16914 2905 -208070
19471 -242899 -84422 101841 -374549 -58496 -282440 145793 -226209 7100 -4131 207862 -155726
19459 73155 164517 -24201 -30344 -475325 -29338 21730 263965 -156608 -129647 -31464 -205447
19448 -205447 -20117 -5498 63818 -156039 -121075 -67731 -316212 -150422 172055 1556 135951
19437 135951 -27405 109790 27402 -53731 -44071 110917 -195510 -249220 179065 90911 44759
19425 41140 117882 -15028 -179230 -146290 154820 -20161 117100 -56979 -234272 -215462 42066
19413 -278191 -29492 -142129 -120715 21958 -79854 22067 223402 -71334 -62328 -220163 -118958
19402 -118958 98208 -34224 -134565 11202 -46393 -111753 -153249 43742 99442 -13883 -103409
19391 -103409 148210 34137 -24244 56743 -39977 5186 -268154 -26467 -64251 256388 -182164
19379 37382 -228506 173532 -81207 -50654 133429 17300 100633 -91011 -134787 21272 178374
19368 178374 44309 -173672 -25710 -82589 -40925 -76139 -39713 -8040 -17452 102074 144873
19357 144873 -209571 -117814 -99132 -227430 -209997 -231123 265244 -173466 -341810 -195215
19347 -195215 -25855 -146885 47218 -26638 -498850 215346 -78016 -100856 -268849 272344
19336 -44230 -211852 -179842 -410488 22131 -102434 337358 -92026 -204660 -518727 -155681
19325 -204073 -280182 37870 -187690 89092 -88350 -60038 9210 131007 70017 -145399 93086
19313 -124266 -64022 82887 107107 -91877 -279404 -220764 92385 -293312 -220863 126263 -326058
19301 20588 180947 83604 -117048 -255817 -257091 -170305 8631 70089 -22110 -208983 -101371
19289 -169836 -385475 -276679 -83079 -63411 -333446 -6035 111143 -28411 107 125157 -133202
19277 72492 -209617 -357183 -108442 145240 -301308 203031 -169970 9517 -334621 -110787
19266 72464 204422 -92729 184638 14151 23321 263786 -131110 263351 -397256 -97237 12599
19254 -68767 178141 94036 -102394 -57278 -120658 66571 -123047 -163180 53023 -49422 -174927
19243 -174927 196175 -24047 233645 -392550 -305941 1375 -209710 -53319 -62393 251563 101453
19231 -36610 -74805 -121675 87992 16082 -248126 72420 -192304 -239823 -145546 17706 -92344
19219 -61136 -199248 -371684 -156670 318701 -112479 -185887 10735 93787 -156562 84557
19208 -376948 -92097 -4474 -50708 237263 155393 -123622 66862 -76161 -34417 -215080 181458
19196 -109425 -4574 -88170 -436073 -245566 46781 304829 -119265 -297584 47665 -50723 -66967
19185 -66967 177980 -409261 36436 -53702 47508 -226023 -353665 -198927 -376562 -168163
19174 -314409 -74577 -92890 212081 69347 24857 -115308 -187061 -80081 -88478 -115227 -261753
19163 -261753 -105828 146816 58112 207042 196424 -121527 -63053 -11378 -62682 -193734
19153 -193734 -75525 -3837 -217496 -185695 84337 254995 93748 -105106 -15320 872 84985
19142 84985 -168605 -128637 -351801 -244438 -107160 -3420 -405263 -270065 38674 -267115
19131 -380211 79883 -216940 -46180 -93191 13974 -190490 59682 8942 -312532 23076 -46108
19119 168883 -256457 -174026 210246 170593 -335618 -154390 -210096 -175355 -103851 49923 -164192
19107 -102947 -176413 249924 -144991 113470 -261219 -12624 125355 -11052 184599 -92172
19096 296724 -8739 -62047 -124598 -76657 -231213 -263998 11862 -15687 -148124 -132415 249766
19084 165708 -6094 86991 35549 -52654 -253759 -114564 356831 -13016 70639 -268482 -47703
19072 -61247 50211 -58689 126299 -53506 100193 -112669 -68058 -44016 72688 -96598 165211
19060 -82243 76920 122160 70509 -125164 -84343 -83262 -268433 21616 7574 58158 301341
19049 301341 171472 -81397 -92930 -136653 -192136 -173934 85509 -63950 -82502 -124103 -112752
19038 -112752 -436643 70002 -144554 45707 -66341 74575 -130211 -82584 -109160 -232871 104634
19026 -301339 -59120 -146477 329105 37977 -15607 -291497 -34059 94847 -166035 -160585 122103
19014 -59089 163751 106481 -116369 61411 -113646 101847 -26308 -345097 93357 93829 258492
19003 258492 -489716 2786 7373 -302903 -2952 -148559 29605 -160013 90730 -94249 -29361
18991 -250712 -286543 127419 178788 66775 92936 -20377 -42265 -81657 -291776 74833 -299857
18979 90775 171322 -147550 6058 -156925 180875 70069 -104537 -283790 -354932 -12216 -92494
18968 -92494 -60557 5415 -384547 72073 206891 -71828 101774 142411 65962 71402 166696
18957 166696 -272861 -107648 -235073 64039 134942 -40925 135447 -69779 -125398 69250 -198087
18945 -166493 1782 -82912 -130660 129641 -258681 119746 -23716 -20399 116561 -131374 -421085
18934 -421085 -211353 23212 -263034 -48791 -244748 -102283 -77195 -158404 6042 32948 -151351
18922 -256907 -91225 -233073 5630 361867 149217 125976 4233 3081 178176 -22790 560 35526
18910 35526 -24390 -182203 -264628 474387 -68137 287009 213107 -1722 -15916 -112916 300836
18898 -92991 95503 158896 22441 144698 -57902 -189284 -236598 101877 110813 380291 -179083
18886 -278249 71007 -160134 -316675 79906 -400652 -28836 -48508 55843 -80916 -116948 -276066
18875 -276066 -289331 -108965 63256 75239 -40651 195046 -65470 169064 208148 61077 -121880
18863 -43630 155760 154468 -511234 -148924 1181 -10858 -32448 127014 131679 -257731 -157254
18852 -157254 -335895 15192 12340 -369994 -358886 128058 -99915 -52270 -28694 -4048 21733
18840 224623 -95177 -166997 168996 -117626 39946 -314882 -490233 -357615 214378 -383269
18829 330401 -397166 -233463 29986 -54378 -66751 115553 -81234 -94668 -66199 211694 -137151
18817 139781 219696 -83602 -268936 -154083 -381325 121297 -3331 -379518 -164548 172619
18806 -38688 103143 178324 38179 -403452 -31647 93820 160408 -67239 -261114 -137277 51144
18794 -45597 108136 -13624 -110001 -85264 -42838 175326 -30727 -158711 112362 198718 5169
18782 187063 -416649 -445041 82396 -113526 243778 73409 -426591 -238570 -215042 -241211
18772 -241211 4744 26748 -6470 2940 -51799 -150186 -237241 136 -205482 170273 6157 -12734
18759 8651 -43103 102892 -96634 -87675 133203 67942 -65500 -275612 -227558 -114050 -186547
18748 -186547 -238217 141038 50875 87945 -175816 -272072 -290308 -125548 -33888 -164955 -248661
18737 -248661 252567 -383820 154716 -104076 16683 -237143 213491 -83469 -135720 133333
18726 -194024 131085 -88505 147217 134945 -89286 -126326 -43543 -49060 90489 49391 49164 -78340
18713 -267395 -136767 -100822 -18774 -179882 85524 -251537 -39884 -194672 -172284 455636
18702 -105859 64707 70607 -132781 273290 6603 -83492 -123112 12622 -125614 -86548 -21682
18690 -71325 -52943 298783 -531651 48817 -54798 -45901 -306603 -212947 -324641 13208 -58270
18678 -223070 -16860 -82477 144052 -493186 -11439 24327 126377 -65923 225073 78530 272889
18667 272889 -208165 -52756 162794 -62390 -152869 -52098 -135510 -367973 -97204 -51204 -439948
18656 -439948 50707 -58084 -91779 183098 -2371 189732 -122858 3366 138511 -564859 -159594
18644 -349062 -266541 -117930 -305997 -171735 -233123 -177199 202078 84193 24934 -313404
18633 -114341 317711 122770 -50841 28668 -214875 -51402 -142175 -88274 -89309 240983 -41097
18621 24728 -68897 100016 218188 -206691 -125605 -52181 -209397 293976 -66285 -155802 -171069
18610 -171069 -309962 -334141 -245004 23297 -165750 289491 -123433 37254 50648 152198
18600 152198 227776 -63733 203761 -48556 33747 246133 -103743 74855 -299381 201219
18589 -210547 -175142 135908 -166619 -393076 -98479 -273964 -28724 152509 -104704 -172669
18579 -172669 39552 68723 -15841 6105 7840 -356589 -2707 -88737 -123042 422913 -122054
18567 111755 226522 -208740 138627 41928 -400318 64635 212196 -115853 -57694 -168068
18557 -168068 -175419 -83699 -37784 -101811 -193552 -194897 -30133 -159638 -95884 -140786 129736
18545 48618 -146536 105395 -100382 -274820 127714 57205 -247955 -60750 -178581 28443
18534 -20627 441129 -140896 -383159 197661 -134829 -70508 -265539 -13316 -181464 -169728
18524 -169728 -86213 28607 -305462 78616 166379 -231029 -59655 123527 -162816 -7542 175493
18512 39680 -316423 -283993 -40998 -87192 -286919 64385 103586 154010 -71567 -44586 -90352
18501 -90352 -231707 45310 451170 76525 -207106 -34300 -62245 -47467 60788 18399 222478
18490 222478 -469659 -158455 -13886 -197226 109099 148411 171854 94030 130979 81316 -295841
18478 -44743 -13467 169831 98012 -303722 23484 -156852 208836 -47035 -158978 -49282 -372676
18467 -372676 -239580 -76171 -14285 -275551 -73472 -69605 -101379 -123666 56830 42132 -20156
18455 16178 -116552 66494 -26095 -207083 185500 -58629 23764 -197369 -118856 -300026 -106763
18443 -386209 -78014 14916 -122266 -15555 54707 -212425 -191602 -84465 10217 157054 260366
18432 260366 -469731 -191837 -109171 -194043 -35730 -133539 54137 -144024 -133942 293674 186610
18421 186610 -45995 -4275 -257237 50657 -168951 -126187 257670 -41981 -164550 -146868 100990
18409 -108031 -111713 -188564 -43908 -171642 -75161 -30436 -89609 63074 187232 234221 81661
18397 -68435 14186 -133291 -163997 -124852 -147809 -27063 247418 -48138 -174048 -144908 -125105
18386 -125105 -287674 212465 -307900 -212638 14370 -210444 -5597 43606 20016 129591 -180185
18374 -34581 21876 -231967 -67693 62458 -141936 -291275 -54649 145697 60740 -191601 132212
18362 -246237 -113099 -233915 91694 70309 -154960 -92102 -105512 -9895 264405 -333506 -442446
18351 -442446 -78609 -48595 200631 19123 -218683 73615 139086 -21938 97720 -55313 -161393
18340 -161393 -122069 -254256 131980 105745 -217960 -87891 -350610 11893 -72867 -28683 -46537
18329 -46537 51323 115998 77296 176332 -150533 -194169 -8417 31290 -38258 -241575 -361308
18318 -361308 92736 -155885 166311 -8945 -14280 38269 -71541 -114697 -193515 69460 169741
18307 169741 112671 166583 175939 181803 -39162 224668 -64661 237361 5477 67224 112068 11252
18294 73358 92086 -299142 -223676 -26769 20623 -20440 85830 14041 -267817 -70567 -27060
18282 -79184 56501 -29772 -50364 -275627 580 129612 189480 48983 257767 -310192 -129177
18270 45808 7445 3103 -224072 -13990 -369632 227122 138806 -78751 65658 -60832 27621
18258 -26559 -519232 205340 -310277 -366367 -225788 30780 74748 -62320 -41757 336028 -56543
18246 -143497 160865 84499 55100 -15757 -199 -261379 -112170 69162 -321820 192192 108917
18235 108917 -58339 90307 156123 18677 59907 120985 132327 -91865 -26367 68149 -70599
18223 -59463 198532 234970 -197729 -171096 -7361 275703 -190841 -329398 -101212 98514 85163
18212 85163 -95409 -162761 -49112 44120 100269 -97862 -278396 47972 -38475 -282737 -93316
18200 -140040 194245 45709 -124020 -149748 -464751 23545 -224609 -379862 -76362 -199858
18190 -199858 52863 285734 56297 303748 11152 137826 -300411 106837 35498 -161360
18179 100783 -375302 -12665 -11525 299677 -269968 -29098 21931 72515 -110397 -34359 -423964
18168 -423964 -92606 -160990 203759 77075 45412 412302 338415 238283 -54175 41848 -205076
18156 242964 -176500 -11597 9146 -79348 -22672 -31134 -32978 -161105 439793 -136138 72946
18144 -170754 -443461 52962 50361 -334948 -38551 158717 -163414 -131537 -181995 -25080 -83270
18133 -83270 -84910 -95829 75224 -34133 -184467 -71897 -47079 -55559 54055 -265172 66864 87050
18121 87050 120040 -114676 278215 212601 282341 -198120 76534 -89158 3662 44727 509915
18110 509915 391193 105156 1335 -69088 -294209 -88667 119176 84004 -236772 186904
18099 -304986 142374 25790 105266 -94050 -303246 -23002 177 -98398 -269598 136940 26745
18087 -212162 -100573 -380705 102624 -159275 20702 -288247 30978 -45588 -94128 -319743
18077 -319743 -172659 -100083 -361863 -53204 60758 -126485 225 287728 -16059 -187589 89717
18065 -19840 -371730 -254861 16303 -263868 431 -9442 -78608 172193 -163536 -135372 148360
18053 -164072 -84365 296490 -20101 -189791 5454 -18281 -111327 -165890 146441 -100759 -168530
18042 -168530 -47921 42342 -117008 53857 -118116 -55727 53553 -156327 -160459 -222815 7677
18030 106320 82489 -431335 190046 -340611 110581 -44551 -395173 66870 -158244 -83831
18020 -83831 -170558 81611 400882 -44412 52401 -111066 -359538 -35868 -558038 374731 153111
18008 76038 73435 -134971 -160620 130140 -63159 179232 -287032 -138304 258179 -229596
17997 -268102 -37815 11547 79646 -4652 56350 -312446 -278564 -190227 87008 203261 -20773
17985 15290 17336 -20573 -128705 -6896 -63815 -24341 -124421 -83509 -227870 -305415 -180380
17974 -180380 254970 64097 57385 -6850 -283831 -49552 -40804 -72826 -255914 -338779 -42466
17962 -84685 216458 248139 -14727 -114565 -191429 -363667 -222994 -255431 -168089 321720 -284091
17950 -398322 143173 -168591 -38135 -119684 72080 178877 169959 78732 -24280 131665 51687
17938 179475 262682 -336455 434326 -114097 -181583 -448090 330011 -121849 56531 324529
17928 324529 159352 -37268 75960 -72088 370984 -49718 -120361 174266 12323 -145155 -62397
17916 80118 -172388 19169 19923 127349 47200 75123 -258780 -135347 237148 185167 -38330
17904 451158 -121641 -15222 -26003 -116731 -197912 246049 185383 43068 82924 -175512 -106798
17893 -106798 221526 57923 -41443 77073 110760 80316 -143847 153898 -225639 84583 -343656
17881 312102 -137625 -189910 -129973 262711 99370 169469 86878 -214747 133033 -231562
17870 100258 406026 -155563 -3618 93347 -91517 -108520 176222 -254161 -127474 -138718 132329
17858 103164 142922 -55446 7204 45554 41404 -92452 -67824 13722 -269802 -173138 -569095
17847 -569095 -99149 9576 324496 294190 222088 210162 116431 -160331 -353147 14705 119899
17836 119899 -57458 -278411 -41210 -281149 -283678 24830 -352386 120913 238217 308892 154327
17824 -220934 -72793 -83834 633184 -65189 42588 -116864 -272540 143196 2973 236710 -37322
17812 -226993 259709 -191582 -102067 -48511 -177402 -163277 198652 8283 -113593 376557
17801 284690 41 -118148 -234732 3627 -21172 64566 -92027 -30460 88876 131335 -208139 97703
17788 -253854 -76554 -188749 77772 -96761 -139287 11174 95603 -113876 -223481 109174 14456
17776 158784 74062 -384076 -48231 170077 88828 -262697 -103909 -81347 -275266 -364795
17766 -364795 -116063 72955 -32148 257123 30804 434471 157047 36854 123359 16548 -74162
17754 -43962 221885 57748 -137595 -184633 -243274 215683 -36260 -10145 -231756 202746 263350
17743 263350 -11714 -212177 61210 -59646 225049 182974 -161179 3974 -124259 -233914 -141190
17732 -141190 -16031 85347 30066 -103001 -466744 -71561 -187705 235396 -93816 62054 31117
17721 31117 209811 -85805 106904 239484 -151204 138842 -59469 -200601 22572 -77873
17710 4686 -266465 113 2193 83104 71289 -48611 -98851 -139727 330225 137030 -67372 -118306
17698 -118306 111894 311590 -99847 125103 -174005 -48428 177419 180416 -47569 -158634
17688 -158634 -157910 109907 131586 53101 -66197 -130175 115986 -121980 -82563 443785 29511
17676 158936 -11826 -176182 -175835 147909 182138 -28604 19862 -134056 138939 -371307 243814
17664 -141214 308879 130548 -34056 -13977 -174279 237724 -19095 -30610 -105775 82486 61790
17653 61790 22253 -155875 152309 164222 -47974 63466 262508 -109450 -262366 -299331 -66712
17641 -267222 317933 103239 -354452 229397 35783 -16036 -57326 -174605 305151 -37885
17630 16760 91787 -8114 289705 -16731 -204652 115855 98504 81947 475773 174215 81491
17618 210760 -70930 -84108 220099 -168946 -64670 131556 -41206 -245213 21916 223711
17608 223711 73231 31911 46165 241860 196018 106761 200699 -51893 -127386 -344818 155506
17596 61484 259882 -190946 -90675 119857 -277820 -10654 -169655 -128514 -43740 60277 134309
17585 134309 285908 265360 -113446 51679 322665 52292 147103 127497 -206641 -46839 -52997
17574 -52997 230686 -190284 218073 -335039 -14990 137828 -139995 11107 16584 -21828 -163202
17563 -163202 124049 -135396 142799 -23105 112398 171175 98106 102962 -143352 50450 -178743
17551 279526 -187821 226909 -55282 318954 189038 458974 171537 -77511 252703 138765
17541 138765 -258114 -2458 -301533 14437 -4829 118487 338568 -72504 -101357 263008 -37567
17529 79393 -52055 -69734 -167220 104765 287548 82487 31225 206395 347051 200419 584325
17518 584325 -40382 334528 237185 191361 -68136 268317 53243 91806 -176015 -155188 114705
17506 -220776 -96829 357277 26811 -208376 -40114 164508 227892 -152832 -40369 -49948 74237
17494 -64005 228276 147551 68062 117943 458923 221707 26530 73616 -8134 123077 -5247
17482 43040 -62763 169674 175865 112513 318238 348647 -9626 287713 113309 264058 157391
17471 157391 176162 273865 97580 197593 255998 126663 87927 291030 -252956 23025 -14845
17459 -87211 324190 93168 157798 96073 199999 195228 283823 195013 206156 257691 -144621
17447 50453 249270 310651 437376 -192621 394559 305492 71033 -146139 45961 266415
17437 266415 474238 -282195 163735 315341 216103 345457 34209 285414 -182665 35810
17426 179085 458899 235744 137772 390799 366690 23549 -160980 -78593 16177 -265690
17415 343813 187271 589583 319948 225482 422299 -159374 92668 195330 420594 331374
17405 331374 108754 256220 257316 330312 -4630 492127 369716 158434 231667 91870 131198
17394 131198 403833 206034 193259 157003 167815 49980 349376 -239407 147215 200855
17384 200855 -237220 313187 109627 47005 -41823 -35206 26207 189960 -83249 -221679 132319
17372 211347 135900 61336 250966 -8778 224901 -304460 147397 52837 252540 179100 1904
17360 -182597 31414 120215 253602 278395 43559 39193 380168 -8772 3730 27939 -231493
17348 -192385 21860 362430 394409 73308 59296 217141 117467 -175469 -92532 -17244 300117
17336 26044 -79743 125664 50021 -102507 165302 118369 279939 205962 153732 206668 74243
17324 289971 361527 46775 -51823 116370 167653 29635 188161 49172 171732 -23369 68859
17312 514767 34542 294574 254752 383041 233248 133542 58169 181858 121565 -57304 336589
17300 43210 65737 116403 182282 307147 173676 38792 -18095 64527 8346 -138645 308554
17288 -98717 21856 36863 340564 168326 241039 74539 169326 260059 381793 -22674 245610
17276 124651 323877 23297 190989 68435 304034 90714 81956 446549 -101086 379183
17265 180922 103194 402024 -99428 169371 219674 326282 52664 249860 259576 123055 7830
17253 153666 14349 168502 -216766 50469 531946 70669 146261 267019 216754 473757
17243 473757 174395 392752 184208 219461 278087 224056 424284 406135 277260 246231
17233 246231 247434 20381 301862 231697 58250 115246 111173 458418 94563 226719 -50486
17221 292015 543228 306130 333719 479375 192220 476572 459132 447878 -56448 321605
17210 44699 280631 243575 156330 237958 278395 206812 196871 332626 482822 43625 207163
17199 207163 550322 188841 142264 244874 -21541 243860 266166 288363 132408 255133
17189 255133 134817 165054 179978 321570 143634 233532 444581 203723 120928 146905
17179 146905 12264 11335 69395 334028 460587 3510 140841 581545 244701 453630 -33830
17167 181691 42584 137635 559288 143763 298651 557139 512964 369675 361263 228901
17157 228901 -8328 146768 181229 445228 99648 277979 501950 372644 342446 164977
17146 31772 508761 636427 71662 370424 455778 539854 270100 77315 356559 -102496
17135 276540 573027 287185 311401 328985 204959 315355 124368 513426 -14286 208346
17124 434735 290968 310625 550196 503109 290679 133283 354266 474472 278407 124976
17113 112084 135260 342304 196318 265343 302447 190577 280783 569675 333169 447138
17103 447138 630407 541554 218214 301501 520291 364021 705680 316185 502419 465785
17093 465785 416237 226880 218109 573325 497955 458026 604083 109970 712912 377023
17083 377023 141652 624614 377221 608050 706237 217669 376905 666849 554013 600494
17073 600494 120235 778276 587845 412095 242249 245310 404961 89229 185147 394845
17063 394845 692981 500281 460791 709452 588064 348576 452109 798706 349502 645094
17053 645094 516006 395472 626198 532436 598137 524208 695287 733953 687987 445347
17043 445347 392617 520853 877889 513393 496884 544007 503702 560520 931979 780745
17033 780745 531207 463171 721630 587366 520888 514335 699716 711489 885806 527989
17023 527989 849328 565883 1091613 475802 841857 820842 894184 483484 354242 638565
17013 638565 672604 582960 614018 678460 627276 781821 770247 748356 799131 610054 781903
17002 781903 951757 743197 920433 657054 656617 1092943 599146 921550 758053 805651
16992 805651 704358 687733 727350 936666 960621 789334 936739 772835 1163103 906765
16982 906765 1076318 765646 827126 984444 843172 757920 1144426 751182 1127789 693321
16972 693321 1015632 905231 1214438 958549 859052 871431 1044702 982092 1257692 1022866
16962 1022866 990859 1186938 1177766 946738 1181464 1152310 1164160 717003 948926 1028837
16952 1028837 1219923 1332992 1358790 859350 1032380 1212184 1203811 1110581 1248694 1152357
16942 1152357 1060013 1137107 1259315 1298546 1134113 1246969 1163922 1299159 1286573 1294658 1302751
16931 1302751 1415354 1149902 1019258 1108281 1286401 1441085 1514254 1317282 1427692 1387866
16921 1387866 1529290 1687424 1478867 1638409 1545333 1672645 1336410 1379551 1339452 1630837
16911 1630837 1513428 1530482 1333413 2008772 1656724 1859784 1633233 1659401 1623884 1668217
16901 1668217 1940558 1653977 2091513 1873970 1857477 1944971 1919495 2078721 1986387 2049556
16891 2049556 2059578 1982389 2205720 2188658 2127930 2343370 2556359 2306254 2237183 2218263
16881 2218263 2228270 2219725 2371877 2176834 2540291 2448347 2385148 2714565 2487503 2318891
16871 2318891 2802728 2719028 2604169 2768212 2844386 3012256 2834757 2952899 2894879 2806095
16861 2806095 3107516 3046145 2929270 3086001 3257721 3156821 3357324 3348041 3400046 3667279
16851 3667279 3337244 3536272 3726626 3888171 3688206 3931143 4024709 3992899 3678006 3904245
16841 3904245 4174267 4256191 4212316 4344752 4445126 4374289 4722185 4309471 4954456 4895709
16831 4895709 4595709 4630772 4926472 5091572 5065675 5083431 5432283 5825554 5547192 5712446
16821 5712446 5911119 6156112 6111449 6282537 6161252 6383816 6495667 7057732 6540768 6848571
16811 6848571 7232914 7394687 7647846 7779233 7783255 7902926 8294159 8452323 8652339 8243934
16801 8243934 8882902 8762546 9237996 9569563 9875036 10142214 9959490 10566639 10599107 11064180
16791 11064180 11187679 11642606 11770097 12193933 12479912 12870459 13320163 13469892 13862233
16782 13862233 14572172 14685540 15209943 15628944 16311346 16913883 16903403 17409377 18176924
16773 18176924 19051158 19611868 20322095 20785647 21304789 22293309 22900875 23978397 24843724
16764 24843724 25507786 26977063 27739486 28719555 30070404 31604363 32677254 33981518
16756 33981518 35439309 36888839 38826562 40394817 42317079 44337815 46415557 48470943
16748 48470943 50935262 53373972 56304389 58872818 61701574 64624522 68618098 72300825
16740 72300825 75719508 80024035 84338365 88939576 93961455 99052613 104356472 110229793
16732 110229793 115529664 121737037 128009243 133766284 140165303 146147156 152363909 157433653
16724 157433653 162846613 167288408 170607636 173876441 175829408 176950170 176762370 175811988
16716 175811988 173579234 170832398 166802707 162229505 157359946 151362560 145588046 139297610
16708 139297610 132756465 126881163 120286135 114002635 108014034 102183356 96803582 91741748
16700 91741748 86642895 81599042 77556527 73323698 69507367 65582904 62293497 59231998
16692 59231998 56254452 53460980 50626136 47967983 45741490 43604503 41505261 39755693
16684 39755693 37924194 36136002 34921180 33243346 31671519 30274008 29073600 27600968
16676 27600968 26708419 26042393 24789702 23495801 22892388 21978239 21195389 20211652 19890178
16667 19890178 19157788 18440379 17814501 16933928 16419361 15971249 15761539 15328066 14481518
16658 14481518 14171620 13891852 13407535 13208400 12644414 12491287 12214820 11724672 11335526
16649 11335526 10697154 10662739 10354497 10009063 9543623 9668574 9303554 8683534 8761738 8456739
16639 8456739 8438985 7998358 8073710 7913500 7757267 7501570 7365018 7192923 6856291 6479786
16629 6479786 6697689 6187486 6312223 6177839 5767169 6123080 5909091 5531800 5553798 5246868
16619 5246868 5508310 5358982 5019596 5125771 4817335 4688077 4932082 4477776 4350867
16610 4350867 4315864 4160646 4299218 4400356 3891262 4207002 3732881 3786777 3975866 4148100
16600 4148100 3700255 3597921 3824171 3794331 3654111 3368654 3591268 3421124 3286136 3150725
16590 3150725 3430829 3380165 3228913 3233838 3062291 3120091 2802823 2926065 2894281 2916673
16580 2916673 2742061 2920730 2886847 2619006 2670478 2644987 2378653 2193914 2463504 2509315
16570 2509315 2455088 2075373 2446435 2426108 2527415 2488919 2318916 2425878 2207219 2134419
16560 2134419 2041990 2234883 2266798 2254910 2085566 1936573 1757094 1930187 1999095 1846079
16550 1846079 2052888 1787643 2018062 1785164 1768933 1766144 1999610 1644373 1775122 1545523
16540 1545523 1499103 1732920 1705248 1631030 1649994 1375418 1547023 1492140 1379218 1679548
16530 1679548 1463150 1721255 1695420 1526630 1306352 1392064 1241387 1229583 1201845 1335499
16520 1335499 1396557 1191140 1394748 1344336 1123162 889605 1391273 1216829 1229068 1098839
16510 1098839 1426945 595536 922701 1042403 1027564 1233896 966044 1090637 959972 1145564
16500 1145564 965396 1241575 1069510 1161844 853551 805560 1104211 1074929 910826 747575
16490 747575 1328608 786121 749925 847034 995840 945680 1241781 909082 1066235 861154
16480 861154 857776 807979 871425 751242 618228 822293 948369 741167 777349 742256 580241
16469 580241 848893 910795 932202 600141 771483 746724 744891 803084 836436 581674 1105404
16458 1105404 460843 983384 603102 599704 707193 658488 541602 559080 496040 880690
16448 880690 613872 739016 453015 956683 445523 339198 573262 291656 806066 517771
16438 517771 533818 544873 693356 633534 855816 961942 363852 538446 592089 364039
16428 364039 44346 634799 642462 604792 627555 469885 753349 384410 707514 578541
16418 578541 536716 424949 499394 672264 766000 656458 332591 623740 224467 515257
16408 515257 715759 484956 748789 434666 407499 604166 528667 369354 146743 620141
16398 620141 451747 730314 380923 176025 727909 475223 461489 344903 292211 453703
16388 453703 621834 553325 423836 520088 321723 428287 312581 31100 215491 292956
16378 292956 178718 90673 374191 618808 422007 436466 740716 464576 414234 389103
16368 389103 7562 735263 398786 331413 660355 420441 443375 171825 -191406 244880
16357 764778 611371 399794 245045 277312 652469 577361 445555 572649 179857 383001
16347 383001 447491 438914 282048 -21677 328071 607529 83852 487953 112147 211097 -43458
16335 134900 35615 201443 85009 543630 566767 -46341 593682 137753 357014 158094
16324 120118 197244 112960 -90792 211750 340166 95823 528304 136573 434757 50457
16313 -151559 18799 -15323 78085 175849 156503 363047 -141179 84478 413773 235147 162665
16302 162665 -23851 78133 187736 142210 20900 315397 301197 81918 252126 649267 219620
16290 53359 452841 472086 242287 152526 337122 153908 543811 -241394 374319 487171
16280 487171 211673 115791 410761 96308 170998 158347 142308 104044 -13808 55760 12219
16268 233124 240454 -108960 313108 24769 78771 -90282 247204 198111 429175 52659 198064
16257 198064 380326 -16914 500816 276860 200293 308371 96096 70443 70094 271639 13700
16245 624147 388788 -176409 302267 -190251 -74571 376517 -31168 153781 286262 150704
16235 150704 149634 119109 50759 133784 150617 103691 293146 82904 435220 409935 42679
16223 229637 149186 156399 115168 55588 -93915 304142 100129 -66553 138205 168602 -82917
16211 -167757 222095 -17704 114058 201119 68586 250564 178992 218052 22524 70088 116047
16200 116047 74631 118600 191252 5103 -6967 194388 57205 90399 -29821 81984 475106
16189 475106 391219 140320 -194517 344129 95034 178525 133276 558379 249111 -15963
16178 142110 392164 69615 141096 468364 389526 128073 83583 68431 -23688 91988 361971
16167 361971 142712 295234 239230 72059 69843 -133465 22492 -13071 -74502 387850 44936
16155 59283 147626 91925 -164695 46332 -62093 103590 37211 -164455 422643 -296281 -124919
16143 -38062 333018 -137582 -197677 13502 268694 162050 37067 171617 95005 -124060
16132 230170 -6760 -51050 -22810 -92496 202428 -2584 189887 -36505 31203 -119051 -173618
16121 -173618 63656 -382026 45500 -42752 21875 -258655 -162428 48505 81642 -37627 -202950
16110 -202950 73341 -126775 246195 91243 -24830 -195046 -198148 347100 167210 264405 283277
16099 283277 114172 -54428 -209367 407672 -57287 43522 38701 52780 132202 177045 98838
16088 98838 68760 15129 128209 -143815 -91350 -301856 250331 -79398 204758 -39502 -61040
16077 -61040 167573 12051 26077 50623 18724 91936 80445 -397460 131885 -31355 66455
16065 -88578 98174 135712 -32822 -66811 -16385 69457 257094 -232617 41344 103664 210308
16054 210308 -121650 -159938 -43218 166434 -81117 -185778 -19281 54472 -104653 -254682
16044 -254682 67023 -79129 152572 30582 -167020 35450 37505 -6420 136802 -118948 -142529
16033 -142529 -1871 -94543 180376 230675 18210 162192 -246597 299355 412869 43383 -24893
16021 103568 -142745 2611 181021 -262494 -25478 116682 -196514 -251917 -97507 48544 76763
16010 76763 -166965 -259286 -35477 -12517 -64772 -291588 117272 -72830 -69954 -5559 -268132
15999 -268132 -167269 -71414 22827 38110 124040 126531 -64593 88362 -257410 -139584 198951
15987 104132 -41625 129158 -111468 10680 75621 244240 350832 517163 594579 452861
15977 452861 331122 196254 296237 126598 -49936 300552 -75796 49872 -54948 -101321 -148222
15966 -148222 -23195 -299111 48409 -210964 118920 -201313 -249445 149523 -131546 -274754
15956 -274754 430433 86836 -20378 -245923 169160 -5344 20758 -183029 -69510 -215683 169011
15944 -138600 -199838 -83436 -139955 -231378 -57360 -366257 -198541 8261 -128845 3032 22505
15933 22505 -426441 -127732 200069 -67542 -159409 -236282 167228 -321406 -214209 -351068
15923 -351068 293490 120671 106102 124523 22550 -16392 -135345 193075 -276626 181385
15912 -185956 -178813 157566 82392 17175 208631 166816 -118793 -55262 122404 -55918 -82044
15901 -82044 -206628 40159 -75729 223818 -141101 -223514 -215895 37435 17281 223845 39030
15889 -215987 -107530 264316 47554 -14986 132765 -86488 -14634 7652 -244765 -345837 -197193
15878 -197193 371 69743 121641 22005 -174903 145302 -152313 73538 287449 33699 343926
15867 343926 164999 -264708 -46648 -95881 -482226 198420 -170719 -1875 29183 13109 -257510
15855 76914 452165 -161358 -149638 -96860 121924 292480 85728 82864 120941 -78921 187255
15843 -234573 386599 -71154 71120 293397 -102711 -69274 -424044 61225 -12566 267572
15832 50738 106855 55781 -38449 -77496 -278897 -163096 -181950 -195469 -206903 -13492 -99076
15821 -99076 4421 -224269 100427 -129161 -156571 -42893 175635 140330 -265336 -122536 -345
15809 -461287 105047 -15021 8893 39077 -104007 -71821 241708 45988 17920 -65945 235155
15797 -166859 50636 -194909 -171836 -126234 156964 -43413 -210795 17419 -157741 72446 -259492
15785 193622 161763 372173 -197571 -22958 -138875 170504 -300232 -255487 32156 -95659
15774 -34150 -151171 -151705 360912 172102 159657 -127253 -176027 -2237 74142 -154 -31327 177554
15761 -202771 65588 90796 -566701 2779 105463 -236741 162528 -48750 63357 -481420 -111017
15749 -2402 -222938 82425 -22976 140949 -203648 48057 37942 139940 -81167 60112 -72315
15737 -201526 -37010 -210884 -232726 -30299 -13467 -190217 74832 62418 290778 -341865 -181736
15726 -181736 -78066 -143976 -235573 79702 308811 -143105 48851 -50487 23961 27724 -223739
15714 -84779 8897 7943 69782 -222545 -71203 -179381 122751 -102837 -201653 -44788 -50037 344022
15701 -203034 166889 234689 130207 -81567 -206441 -34237 322296 -51735 -273568 112771
15690 -109333 -189619 -296920 102082 -213325 -139246 -71386 -425795 -83005 -6805 -149781 -7998
15678 383361 31075 -201260 321170 -192645 -137134 339792 -33119 -289675 -34872 20427
15667 -167615 33582 -46644 143038 65511 -77647 -79383 70992 242992 -66220 -365980 302847
15655 -3349 36286 94386 -319337 -157412 -239532 -212795 -124857 -140770 -153660 -317907 -38874
15643 -217750 -16849 35859 -160315 117420 -79499 440523 -42921 -108375 -286862 28548 -35078
15631 -279648 91887 -182175 -224145 40637 -278621 214652 -166244 -64023 86419 84888 291098
15620 291098 -262423 -138014 1966 -243195 -94533 -139477 -133272 -25954 117944 -154516 89331
15608 19533 22601 -75199 100612 254583 3794 173032 368916 73416 -16797 -76331 45135
15596 -392596 -215068 79358 -73140 274310 23679 -381350 6471 353259 -32591 172661 112126
15585 112126 3962 41383 226283 -13552 140735 293028 -62459 163774 -253531 268072
15574 -168364 -143639 -61518 -45277 144479 172079 215872 -203503 72362 90457 -99566 -148975
15563 -148975 -96671 -6537 12966 421835 183854 -22672 79199 223331 -52820 24765 -207183
15551 60784 -173949 -82466 -299645 171595 99625 -133684 10076 -8658 -365817 -66433 -84521
15540 -84521 366696 111922 236675 140589 148242 24158 -158983 -340733 98978 -12176 100158
15528 65373 -23758 -102415 -151587 -30545 -3348 -118974 -166657 223935 11252 33119 -182004
15516 98397 -174676 295180 -223329 112317 -163270 -43220 56456 70287 95687 45870 149896
15505 149896 116367 89882 21963 -115823 -157469 -26064 -349032 -19117 83115 -131219 29965
15493 222027 103902 31559 24524 33766 87332 15442 138950 62768 121437 33892 -171659
15481 -230862 -11305 389456 -26561 17769 247081 -111045 -87328 -312254 63492 210735
15471 210735 154906 -218911 28816 -59777 68547 97936 61277 81134 -169055 -19268 -135065
15460 -135065 -184480 -96785 -64428 -129133 181177 169198 -138567 221642 -161209 240469
15449 89226 -86138 -153706 -107945 -363916 76440 -268275 -289742 -56214 203238 193322 -70729
15437 141557 94497 191891 125804 91579 -209982 149340 296269 -47211 -232165 -59247 60877
15425 -309921 -178917 -55970 149955 -392107 70164 -208122 -8442 -143216 148029 160927
15415 160927 -197928 226510 -99979 -136973 -117546 207946 61810 384216 79890 115274 10053
15403 -84170 -274768 -212974 44089 -98333 54302 42699 -147680 33792 170897 -46215 189605
15391 31311 250134 93116 -120144 29860 144548 223314 -259081 128396 145049 -151083
15380 -61537 24044 7889 -131781 -97530 -297157 218264 4067 -85244 117794 -432875 230984
15368 -354315 -72492 18744 -225394 43590 -44724 -107804 172071 -152809 44086 -51410 128210
15356 114046 -51755 182792 -115863 228044 -21934 -393162 -98488 222148 68476 -129427
15345 78681 -158178 99250 -69643 -66978 41003 -48298 243357 139621 -77208 200450 -47491
15333 -215686 41907 -267660 -23190 52243 73850 9517 -131464 211595 201748 94835 350528
15322 350528 216853 171655 -73746 81944 -193573 -60040 -351144 -87767 -82701 -212815 -292599
15311 -292599 -292939 14738 131786 132047 -3765 -211776 121379 166108 204414 309055 39744 139588
15299 139588 -215408 202923 92000 403518 42601 95594 -44813 292901 27224 44849 -193359
15287 56329 87398 93481 -69608 114959 -31511 319230 500446 39528 331756 184122 -18959
15275 -12304 -161799 -237320 -181621 -275457 171496 34173 -9956 207614 441068 -156532 -47037
15263 121995 -35680 150964 -115728 71899 301978 194824 269115 299386 207789 155851 90817
15252 90817 611799 33948 200302 459420 -94194 358108 493206 921435 2630235 1586351
15242 1586351 1802065 2108483 760175 230548 124731 410046 68532 178016 135846 257801
15232 257801 -82823 -24824 -78719 -75303 273728 142906 -38811 23059 -42472 -30009 49656
15220 196278 129603 -232904 109832 -56877 170035 325013 108967 -154176 4060 257352
15210 257352 222806 -434788 -128501 202 17880 127783 -98393 178042 -151761 186144 -113419
15198 341724 12177 35895 -65190 93363 211738 -194223 192828 161606 -171384 -40560 69324
15186 -108982 68685 90921 70376 179636 118846 -67169 14475 40911 33624 29032 -78719 41693
15173 -71485 -288757 216225 157173 184165 65313 226163 100079 215191 41298 -80374 260757
15161 69491 148760 178614 89227 228502 55502 213115 186793 120851 146907 36132 91664
15150 91664 -63665 185399 156409 -40521 133354 172744 133002 201195 -56189 -176934 110089
15138 23766 7461 125216 240699 305807 -114450 148294 141623 125783 43315 157865 390090
15127 390090 129130 -468591 93180 -45828 8482 205898 4647 339593 39674 203411 -7892
15115 176855 3288 115940 197768 -185708 -11479 258823 234205 -227393 264787 445074
15105 445074 149077 146142 -85423 103435 171964 101694 -122496 225741 125251 171806 310639
15094 310639 215409 601851 292874 195905 240049 324809 128229 297298 40843 360151
15084 360151 263180 -52191 66937 452248 -44882 321446 203367 117086 60789 194422 154749
15073 154749 113706 121867 242638 238348 -22468 353806 -165857 372667 157856 -68416 -32733
15061 128274 138783 -79602 345788 -63612 183391 -19361 127116 243127 39923 65547 44132
15050 44132 49359 134546 580804 256235 127992 -135541 23269 384526 262357 158564
15040 158564 156033 254402 219975 434959 -155034 262248 375345 292123 313805 29436 487760
15029 487760 259230 208559 41006 -66744 34978 443657 70795 252592 -68405 214480 46017
15017 -14403 -159678 140275 14655 329943 -50501 244173 204622 154989 79140 196592 340492
15006 340492 93156 209092 250957 181964 210871 31089 358879 233733 285078 328720 210198
14995 210198 145590 257319 133208 -15551 195696 65948 214893 -16874 337987 56221
14984 114353 98917 273430 287718 223118 -25379 122681 71443 99478 343678 344759 424056
14973 424056 498419 166278 184320 281642 169125 403693 26066 251104 190656 516648
14963 516648 111964 -207661 168248 387661 421845 281199 52323 188901 253642 116884
14952 256099 204733 106951 231273 170931 348651 232009 66395 417222 253074 407420
14942 407420 477318 194854 494320 194747 234234 131910 9615 29875 152157 359609
14932 359609 294378 355562 230824 591785 209147 38869 293925 -60514 308942 40424
14921 344376 410099 299208 262573 243622 393437 261476 539233 169303 137393 219053
14911 219053 -54167 181767 178012 436831 239945 248395 371722 52312 358192 433210 526773
14900 526773 590033 314886 313787 123655 -27598 393588 601006 353206 330949 155294
14889 220813 416190 136009 326071 206695 470403 145524 798107 657449 328670 37267
14878 406442 550836 478453 531475 141410 294789 90189 181786 351991 349393 568931 222267
14866 343170 603775 317702 351555 498990 180254 286253 193211 242027 455830 390368
14856 390368 231320 360205 648076 527566 66324 68829 311980 252245 307049 375157 280366
14845 280366 193989 620120 -38915 200627 178552 444168 574477 831339 285261 493062
14835 493062 687731 549805 703148 244056 258128 210566 407447 541966 504055 407977
14825 407977 421783 535513 464852 649302 565172 263339 370161 717020 820197 254966
14814 528881 337380 487497 303031 516454 633425 379778 621353 448927 356964 703690
14804 703690 542589 517247 517927 275567 525175 444036 348707 532892 560568 520320 587969
14793 587969 624949 356398 453311 619632 831187 493527 547083 600694 711980 622843
14783 622843 750294 635146 374122 805370 229246 601473 376631 554098 617061 395053
14773 395053 861610 760301 459053 691470 443822 433241 688245 805053 221977 770112
14763 770112 593574 532090 549935 517991 323376 375210 595935 740198 593455 361443
14753 361443 809615 734857 975525 563182 951657 723435 701005 564256 877090 652979
14743 652979 728885 1107736 628671 762320 899536 677453 665271 797477 635472 768376
14733 768376 1139547 821456 682444 588572 595105 565011 930258 549977 892571 393737
14722 706844 1042724 600373 1015322 816741 816350 662907 611972 761255 996412 1084290
14712 1084290 1103570 888937 1082850 907188 968722 719577 870373 794919 649485 793935
14702 793935 966239 578052 624326 959452 925502 727139 887174 829223 1335533 1173337
14692 1173337 1244704 748244 1151344 702580 847467 710169 887487 819638 1079590 907433
14682 907433 956367 1142563 904917 1225281 1046623 1137667 805164 785099 1145448 1333761
14672 1333761 870553 1017914 1129379 1105479 934274 1007039 662812 939890 922343 1406851
14662 1406851 1191150 752858 846369 1285094 1058302 953160 1310483 1296754 1008350 1053616
14652 1053616 843378 1029388 1069396 1041617 1329968 1308577 1115034 1036563 1123276 1041661
14642 1041661 1192133 1354363 1039415 1151752 1275292 941378 1396731 1449370 1528690 1395821
14632 1395821 1347134 1366608 1126758 979463 1170459 1216282 1343943 1059113 1574780 1438774
14622 1438774 1387253 1611493 1413390 1723134 1314126 1211641 1523284 1682972 1703741 1360731
14612 1360731 1433842 1442453 1303075 1602985 1750028 1341408 1668678 1685013 1485481 1541624
14602 1541624 1585138 1840595 1512857 1703524 1954196 1638734 1943882 1844435 1658803 1433041
14592 1433041 1843559 2058293 1710533 1962471 1804808 1728700 1686571 1857566 2006307 1798707
14582 1798707 1806506 1974828 1925971 1851287 1897261 2204372 2152752 2170768 1853350 2230014 2366691
14571 2366691 1993860 2591547 1987598 2367878 2481869 2715119 2782291 2460016 2655918 2617104
14561 2617104 2841014 2714681 2999395 2806938 2994079 3296601 3351382 3401635 3706158 3954627
14551 3954627 4543627 5391495 6976260 9941526 17913559 37956992 47714281 19897525
14542 8797027 5302638 5120818 7742144 4439851 2523095 2115110 2350099 2134237 2098850
14533 2098850 2061301 2212056 2235963 2081096 2245199 2327261 2298729 2324603 2331408 2227052 2554355
14522 2554355 2405958 2563125 2575635 2656955 2517321 2753418 2913885 2784387 2834033 2924387
14512 2924387 2799408 2756103 2908262 3100640 3176984 3203005 3166098 3041878 2904768 3122522
14502 3122522 3170676 3301431 3086015 3029080 3272474 3291430 3224784 3541541 3678941 3417758
14492 3417758 3266728 3325495 3358286 3401077 3444799 3493226 3458749 3772403 3823794 3755778 4117991
14481 4117991 3687393 3982606 3985917 4095901 3912130 3962899 4285050 4233822 4139705 4358859
14471 4358859 4650151 4444465 4354188 4488977 4217039 4449099 4934834 4816833 4728177 4829524
14461 4829524 4951575 4906753 4883881 5141030 5513164 5364368 4723129 5251727 5224259 5309640
14451 5309640 5436159 5680561 5521749 5530908 5922641 5892406 5786121 5719399 5750475 6048335
14441 6048335 6286134 6004413 6122706 6700602 6476891 6513658 6787376 6775433 6926020 7167205
14431 7167205 7253304 7101698 7075095 7226688 7636221 7298556 7583656 7572218 7738716 7869046
14421 7869046 7635034 8366648 8305476 8289063 8722617 8485840 8828288 8965134 8686553 9063690
14411 9063690 9156763 9501819 9712939 9784549 9514068 10215920 10081448 10479330 10394764 10733377
14401 10733377 11031005 10865009 11014050 11095622 11432867 11619443 12002675 12169710 12200690 12678796
14391 12678796 12690219 13052841 13198588 13744732 13720131 13740448 14068279 14294517 14690112 14728024
14381 14728024 15125349 15630525 15670449 15988209 16453184 16540482 17259533 17311653 17529255 18164334
14371 18164334 18223322 18665710 18935147 18979794 19907659 20442828 20820183 21072688 21257954 22049803
14361 22049803 22405772 23030198 23445989 23925627 24635158 24914597 25253606 26002038 26602771
14352 26602771 27132023 27601084 28174935 29392113 30028978 30890401 31463901 32223732 33369448
14343 33369448 33799344 34858207 35740598 36263537 37732793 38478106 39784720 41058462 42026717
14334 42026717 43071244 44566653 45630772 46940396 48289968 49974234 51536628 53494353
14326 53494353 54910044 56527112 58192654 60268052 62137459 64470175 66698588 68941544
14318 68941544 71475123 74122402 76719794 79642530 82314425 85639960 88856442 92271978
14310 92271978 96179262 99851093 103811792 108262599 112648943 117473294 122247442 127675743
14302 127675743 133471547 139140082 145449199 151801476 159048940 166021219 173838692 182299281
14294 182299281 190472234 199810143 209260079 219109283 229866236 240604426 251901962
14287 251901962 264214116 276339790 289399055 302604290 315994631 329697342 343363996
14280 343363996 357559624 371013443 384473023 397442332 409315106 420457382 430134254
14273 430134254 437714102 442192997 443653255 444265345 443691854 440943671 437540945 432482088
14265 432482088 426407993 418288548 407992597 395943175 382290093 368177113 354048981
14258 354048981 339061972 324350976 309857625 295735443 281778469 268168534 255188361
14251 255188361 243469900 232859827 221577945 210794316 200511363 190954231 182085850
14244 182085850 173514864 165584320 157618945 150460194 143457370 137273808 131500216 126163908
14236 126163908 120215511 115411831 110451299 105821532 101694053 97987360 94324274 90231401
14228 90231401 87157925 83629499 80198286 77300533 74645294 71933685 69288874 66716468
14220 66716468 64915701 63000079 60421505 58669341 56496271 54827840 53310821 51974182
14212 51974182 50089454 48659554 46838245 45618855 44855335 43908387 42501200 41157564
14204 41157564 39926017 38925601 37793561 36641268 36258294 35161003 33793268 33178516
14196 33178516 32123445 31327137 30799295 29942281 29081970 28507947 27649586 27339108 26543090
14187 26543090 25900340 25362305 24930073 23920317 23624418 23103742 22616910 22071434 21781730
14178 21781730 21261665 20721399 20353736 19996187 19535742 19054264 18705757 18339009 18109980
14169 18109980 17835672 17477509 17035495 16811236 16320403 16209089 15194411 15384746 15055177
14160 15055177 14815195 14429313 14360594 14143352 14299472 13636906 13557075 13359567 12944904 12629672
14150 12629672 12774075 12291751 12238596 11997521 11719873 11754334 11627880 12024651 11015781
14141 11015781 11085114 11173194 10955278 10549390 10348957 10202705 9922146 9711667 9856982 9567711
14131 9567711 9858524 9350311 9394029 9284743 9076033 8839237 8915898 8486138 8450818 8410594
14121 8410594 8205887 8336925 7886489 8153134 8062602 8089545 7575115 7721448 7908395 7241239
14111 7241239 7388108 7038895 7283525 7186475 7118243 6795826 6874915 6643267 6622315 6766001
14101 6766001 6390104 6709235 6285304 6355816 6095770 6529647 6107755 6021526 6165449 5738370
14091 5738370 5708136 5844552 5676842 5354947 5373368 5418667 5136363 5412737 5255583 5148288
14081 5148288 5552432 5033454 5080424 5002631 5288267 4799909 4740876 4668977 4827706 4679197
14071 4679197 4649742 4779592 4712465 4461609 4333461 4609489 4571466 4258720 4390849 4368003
14061 4368003 4360945 4077405 4472146 4111493 4035583 4134664 3974629 3689608 3884575 4045240
14051 4045240 3633723 3462466 3673651 3661250 3689225 3579466 3578927 3308783 3207238 3552592
14041 3552592 3379580 3456319 3725219 3486691 3669393 3318026 3142937 3227851 3342693 3261719
14031 3261719 3459698 3262002 3205878 3202633 3444654 3245297 3099210 2957916 3208112 2626474
14021 2626474 3039585 2899754 3243467 2764453 2793513 2981317 2766765 2456683 2280941 2678913
14011 2678913 2804434 2385042 2489609 2586351 2705431 2293618 2434816 2389111 2619848 2566866
14001 2566866 2320677 2212955 2265449 2242992 2315709 2181531 2261777 2366786 2503283 2308487
13991 2308487 2450397 2704258 3226871 5202703 10629030 29199599 50707809 27512079
13983 27512079 13916415 8867271 6308889 4794823 3929501 3706179 3663748 3226202 3167947
13974 3167947 3231010 2954609 2705206 2555720 2759915 2539364 2380382 2486375 2659810 2338291
13964 2338291 2479604 2174344 2359849 2251639 2058958 2092090 2184957 2144319 2599521 2261972
13954 2261972 2185889 2217895 1998793 1942524 2235871 2176799 2021337 1908122 2216288 2048015
13944 2048015 1724351 1909951 2197035 1933958 1891150 1884378 1775660 1789544 1919863 1938434
13934 1938434 1546295 1734425 1694885 1779826 1618137 1373409 1715512 1770246 1460473 1670720
13924 1670720 1695878 1513621 1476831 1847963 1236453 1409176 1625151 1757071 1806366 1591803
13914 1591803 1715806 1700361 1378627 1880653 1563603 1940874 1440655 1270074 1599075 1586414
13904 1586414 1558351 1442493 1619962 1480054 1896078 1515221 1539450 1537304 1475228 1230658
13894 1230658 1694555 1481384 1597293 1484522 1290274 1426544 1145367 1305088 1305060 1465394
13884 1465394 1076752 1441628 1215797 1411062 1118646 1410861 1301972 1298909 1009568 1336954
13874 1336954 1180090 1372192 1190283 1335921 1329660 1032273 990339 1308698 1492778 1316769
13864 1316769 1418261 1045613 1461795 1261561 1057544 1287955 1346731 1499729 832369 918283
13854 918283 992587 993801 931281 974737 1132304 1195406 1029245 1148728 1150267 1021430 1196712
13843 1196712 815382 990433 1626719 1328481 1130119 1014636 950792 1011220 820677 1101475
13833 1101475 1054699 1154505 927855 1139584 913050 714343 704408 1068025 1120705 874407
13823 874407 740939 802668 1003940 682555 1020623 1049093 893625 1050043 1191621 961572
13813 961572 1139822 1077621 823282 1075843 757694 956748 878631 972415 953090 1059339
13803 1059339 780514 719791 996435 861238 641380 869113 1009658 568478 642269 808200
13793 808200 799739 818754 753924 947246 880346 678771 723244 829833 762420 867162 796192
13782 796192 766946 432788 614980 696126 835184 531502 743145 976871 484014 680921
13772 680921 673997 589663 982499 707330 979215 1164846 624687 620985 802621 1074714
13762 1074714 674206 1032140 556487 896894 688219 729019 787646 669506 610753 898756
13752 898756 702990 741718 772786 464670 808108 565463 554483 846962 897639 805134
13742 805134 712986 716788 610885 563575 376405 722856 636135 743829 507687 584427 691736
13731 691736 991303 699311 504646 580758 628653 797677 809598 317743 677780 728417
13721 728417 526312 618796 798258 696215 256648 447885 813871 664562 492356 472430
13711 472430 754125 492855 679326 519491 498874 642207 492495 557819 286156 578423
13701 578423 571015 521508 420457 603705 643781 346684 620738 749905 592540 723034
13691 723034 650273 704770 476454 492402 776440 525465 291191 591340 361226 444215
13681 444215 454301 774087 368774 630776 568665 405768 914238 585481 662908 388380
13671 388380 631419 677579 729490 553379 379483 592371 270106 437579 625479 347670
13661 347670 359024 492690 332705 540583 685081 550112 646385 482928 187621 923539
13651 923539 591672 357777 141532 311930 532903 469048 474940 470027 433933 650983 399967
13640 399967 200188 519620 569971 929836 458226 547338 245361 269822 437229 510220
13630 510220 377606 273333 343150 380301 704603 538232 558159 247409 424480 531738
13620 531738 209154 337059 414076 324797 695173 269331 588939 429666 541709 608334
13610 608334 231480 551872 311435 531231 347621 432716 208157 508230 130027 716393
13600 716393 182632 154843 371742 498307 112321 350139 99063 651716 301016 221391
13590 221391 677050 462033 602188 549900 431836 180038 270759 537308 299825 335815
13580 335815 328452 -8825 387822 666505 448681 287377 840355 313382 328844 144531
13569 397226 505625 584525 288990 388847 384060 749509 414819 368380 408454 486553 528483
13558 528483 475637 240981 469605 332327 568407 345949 63307 421559 384211 392553
13548 392553 285349 141086 661161 180958 165444 475896 166509 564187 264310 432574
13538 432574 159192 519685 300687 369706 238725 426041 -137924 63567 545331 304669
13528 304669 258624 224598 204088 416664 370096 -28290 333453 272987 323171 258674 105040
13516 327362 326296 311603 417202 289376 256390 451961 501905 216216 305250 510985 442380
13505 442380 318008 423676 410133 401667 275495 227084 275729 -24714 324953 196327 219860
13494 219860 368327 474628 369581 598735 76479 154881 358059 245034 306975 503851
13484 503851 304048 384239 544328 519707 205990 373993 305622 465632 333576 280952
13474 280952 184504 420119 363761 370674 63605 556568 366767 253388 280785 383742 -108325
13462 108935 489813 33450 462249 356800 420591 258597 105896 315082 -10379 86673
13451 378009 234975 223128 20260 140991 220542 -43953 356319 441377 18780 182740 364933
13440 364933 48371 428637 266133 290082 460840 303655 582478 -36396 390083 216251
13430 216251 198025 231101 399421 329041 300755 18126 83037 107386 -58179 640609 180058
13418 340720 269244 459829 277357 453138 451000 270096 247221 291384 136438 267262
13408 267262 408414 -51251 191664 359039 132441 69162 94460 169611 50344 -79388 -112825
13397 -112825 334126 102059 501304 184187 228370 189631 300095 495966 136893 326587
13387 326587 179947 227747 191552 65009 261383 251877 79974 417242 335091 310599 -99260
13375 1232 384353 558915 -91080 366115 195414 359115 476141 83748 261269 310059
13365 310059 486841 354929 395483 319087 -34670 310861 125800 523874 133860 554099
13355 554099 300011 203340 295997 460781 168654 357815 220219 402060 99485 317984
13345 317984 281091 113653 477832 426397 208298 582273 302067 307832 148942 194424
13335 194424 238372 285710 14974 397725 400625 620915 408477 118854 354963 698740
13325 698740 135475 82408 250031 444229 38089 75101 422576 301822 312294 390140
13315 390140 430398 424930 328701 44961 110594 364892 18697 19130 187633 20637 106299 145876
13303 145876 169787 309997 261443 -214503 -158640 270993 159242 6929 187606 -76624 202799
13291 62587 -35509 -55641 48898 54666 -153788 37830 35162 137014 131943 199491 227907 238277
13279 238277 74791 68500 -38097 173090 -117256 268772 4673 8413 72422 -164489 -2159
13267 86990 -105271 260868 16520 203143 159786 105250 264729 26956 163032 98740 180608
13256 180608 -24734 268758 84929 -25694 429431 216418 105471 424872 255229 -172810
13245 191168 -44088 133719 673817 164057 111764 167910 184592 308454 -361210 -192099
13235 -192099 -45523 276314 199634 -64381 -111343 357597 64041 215153 70323 159722 -131697
13223 -182528 126453 114247 179911 266521 129299 29897 180638 177712 137508 144712 131804
13212 131804 59937 206684 219023 -121347 26456 289947 204422 186609 -115215 58816 -56603
13200 175187 15703 154249 138362 -202106 99467 126397 79406 177074 247358 285895 191198
13189 191198 -25645 -127272 96068 161840 45010 34599 161845 209491 -32188 283796 282416
13178 282416 55943 -43390 190853 95457 393169 -81849 -110465 108983 307621 199574
13168 199574 452156 110480 -42256 -182228 56378 294531 211131 271745 209642 378836
13158 378836 -119791 -145492 122447 -1900 656037 -384363 -48318 280112 -302717 175177
13147 211013 84538 120688 -78937 149271 -5071 -71759 82103 188220 344588 -180969 236884
13135 -58583 -50696 22005 -264307 304599 466634 269515 96802 210481 -59286 -27756 196241
13123 166922 88142 -99225 116018 192838 246937 173395 -152738 -101939 121620 163388 329594
13112 329594 -97701 164825 211587 -186617 -55722 161844 289615 44744 11314 -15429 91225
13100 319955 246211 -130935 -60341 258105 161301 147693 97804 92110 72083 218390 -13453
13088 -244312 183078 404605 -49429 -69958 -11141 121156 28165 -79064 275039 169542
13078 169542 -133316 182876 115165 294560 281498 375527 -345333 27643 387555 447828
13068 447828 130806 -174228 265702 54300 -273146 77337 38237 352122 -85349 184995
13057 -4395 -28863 243916 182608 260844 -132906 -222318 325410 141845 112891 -2437 28117
13045 155664 174195 -99952 380935 -50892 203080 -106581 76724 58591 179493 -220892
13034 8153 -27813 -42492 165254 385765 324381 168908 408486 68523 185623 185710 -69175
13022 300305 212467 -105417 254527 385392 -190864 17903 -27445 336949 -135021 -148971
13012 -148971 667484 52707 215859 157484 376837 155580 199179 436263 57821 166361
13002 166361 128030 -165804 351463 -151852 -23215 130294 263556 264826 76005 387945
12992 387945 7335 214684 27285 -89148 7042 -8110 220126 137299 56602 -78956 442915
12980 167705 181019 153081 171732 -70499 238446 198703 -218858 -63250 169246 57742 266757
12969 266757 49084 5271 -93528 -15702 334703 86357 -112987 43749 -178473 220060 -59533
12957 -128332 200228 47692 21370 -101056 182011 -25105 -243143 62869 -172572 445480
12946 86887 57704 -200075 -21241 38446 -106378 80687 -122543 -134553 -187845 -52901 408866
12934 188746 226683 267504 10972 -28510 34226 266307 -59718 363852 118495 228339 315854
12923 315854 -273923 18356 -5696 -176501 207722 -10078 -221873 -131727 287052 321683 80024
12911 -305274 85136 -237016 -159464 232116 11463 -147429 86799 294907 12884 193096
12901 193096 -201784 -57693 -50256 8703 308594 -15211 -138502 34019 -103477 357963 48766
12889 235347 -69917 132394 233707 -83793 -64126 -176634 93204 275703 -111120 -57187
12879 -57187 9825 -2831 417522 125957 52222 87855 19776 -215470 -83734 96254 52129
12868 52129 144935 -46156 -11767 23198 -26523 -15649 -21858 417304 151069 -144523 -328438
12857 -328438 -147952 346576 160946 45053 45256 20229 -15187 150670 28638 209855 142167
12846 142167 -64398 182137 8275 142350 86678 26973 124940 -65522 -38069 48326 -283888
12834 27149 35440 232173 255086 -225179 -7838 87257 -14029 53426 210873 -41219 167827
12822 -44940 96596 6943 -123829 343840 -234325 190405 144893 -29838 138545 -146954 -173087
12811 -173087 -97327 -212547 133127 -110861 128317 -142776 -153953 204683 67844 104855
12801 104855 -129651 -234025 62369 18345 225266 -401582 72778 -178937 10707 17350 -118123
12789 -217588 -102235 -141213 -52172 60440 274606 21027 -4326 -74906 -31446 108289 200382
12778 200382 -16858 -150316 -52145 53097 -101506 -330597 173730 112483 -205396 64247
12767 233113 52729 -15702 233413 -22294 -68317 462483 9323 255301 -148709 -131092 101927
12755 53807 206456 -109659 214174 341239 -110275 -32193 88858 96619 -8402 5915 -191848
12743 21775 -98166 -35691 179969 44024 79423 -73758 206510 134410 244980 89522 84837
12732 84837 -165139 -49385 332654 -189191 100791 49022 111293 141910 -154183 -16241 -108358
12721 -108358 -159241 298037 -158219 92589 54406 -333650 244786 -20340 -295467 -92268
12710 112217 373468 73600 -116363 -50464 119015 209180 13651 -50464 13356 388561 -26055
12698 71188 -113648 130833 -151389 -304199 145609 -97702 280855 377707 51272 71947
12688 71947 184760 -56110 65495 228185 -220251 101880 22406 148555 73263 201028
12678 201028 23786 66290 139333 149284 98258 123991 -67504 -223581 288564 -277073 70439
12666 192145 125335 6334 400740 90159 70530 343910 -61757 397039 51216 -6962 250783
12654 202385 126037 23962 98237 163804 207222 -168486 93717 106581 119646 -14079 -125179
12643 -125179 -90999 204743 234844 174795 93291 -96434 169272 148329 -148465 129358 323968
12632 323968 2445 339682 -78434 197316 229249 98855 147180 326190 10039 -133376 245061
12620 61745 172131 268174 367394 70357 337363 249819 1586 -54860 -273855 29363 48861
12609 48861 -114799 -45037 -190919 264059 -212062 -190846 402783 -183748 154016 6182
12598 413573 80271 362896 267897 -173432 59412 209106 364 -173007 128956 260991 246651
12587 246651 163341 337995 2849 239673 63119 200292 -86547 77264 253761 101495 -234141
12575 -152748 237651 516554 -229280 -138648 -164738 -29349 50723 -29720 -163178 -24341 184311
12563 42905 170895 -95080 -68426 -15932 5957 -105230 -81269 76204 -287947 279103 90197
12551 -112690 302059 59188 133905 40336 211875 264899 207005 130491 -72497 103975 -227017
12539 711 -10590 -244495 -175922 -230096 273919 151812 -279783 299571 -41398 1992 138006
12528 138006 -171631 248471 131298 256708 -2003 50228 -283618 -61723 179986 114195
12518 114195 -31121 -83375 154822 396705 340966 192911 280445 -167007 68320 -7286 139012
12506 50376 -206484 -180342 54787 312305 51113 -113901 130202 -17752 -140271 -62293 -85623
12495 -85623 -9201 -11561 -46930 -53470 -13794 79659 74077 76443 -117551 226029 128998 12112
12482 44845 -193459 94598 281285 66219 -102434 493246 -108294 199622 -77990 120563
12471 4813 -168947 204102 14428 -95604 47674 115045 74891 49766 179463 280372 34549
12459 177147 -122617 -84781 209797 -155937 -17974 329042 -84830 -75194 -415581 -357147 182767
12447 -24864 43844 184662 14000 12598 -186765 -27253 -160450 -188147 -25077 313389 -152849
12435 -217585 -40934 22275 61145 -76088 -212904 318284 32121 -435295 18825 86312 241793
12424 241793 -185527 -65714 113772 221732 -36993 92806 -183207 -104989 162120 36647
12413 -8459 363748 -163169 16227 -214764 -6932 -103026 -31415 111407 -49535 -146698 195062
12401 22427 -98529 203090 -477052 -69709 -136488 34313 47556 47132 -49064 -59291 -88659 -277055
12389 -277055 431499 -70818 -262333 248369 -307539 4284 -228544 -376871 271987 -118039
12378 11228 -326794 65612 61217 -19138 45805 -255403 -2296 -171071 -206060 23816 -31642
12366 -196601 151940 152986 163794 45994 -76049 256209 -153384 130859 339082 168826
12355 -89626 367280 281855 46054 -211813 35892 -44501 -112876 108748 112751 -5204 -106778
12344 -106778 261708 150897 20367 88669 86085 61847 109955 142037 27025 -142373 235850
12332 -176855 -38528 162099 199766 193867 150863 35651 -75635 -7183 -104748 426 438515 -88227
12319 71522 182845 192426 14643 229638 112500 7276 -83795 117622 96306 24358 -69977
12307 152779 58212 224689 50613 -25392 -48633 183214 -176315 -317576 -161018 28443
12296 -15230 -145241 179472 35522 54590 23154 -33718 253739 -160039 154347 77687 -122220
12284 7585 246739 -46092 -41205 -34445 10409 -13001 323062 27109 71873 66726 162548 417841
12272 417841 152882 169773 -36718 35451 -253485 243418 -183372 -47182 213617 -149900
12261 308733 290540 -56785 14956 -44258 62173 102475 170152 62130 106730 358281 89649
12249 -63991 -22181 122199 161062 90970 -74461 39079 186020 287350 -128947 -68816 229670
12237 -355 -23540 75624 -57526 132710 218990 37554 65702 -57608 -156106 94583 -12399 287442
12224 5988 368149 -45296 225348 -9109 235233 -12269 153529 387287 -141892 119430 48343
12212 273484 275005 -32358 335419 -42242 212858 -113754 91356 28094 28473 344776 242611
12201 242611 29422 403478 234862 159733 213695 156624 389536 90176 38586 176240 -32283
12189 138036 267695 116978 238129 177426 350001 -111174 102936 -68412 277685 83206
12178 -177363 -178353 181236 155954 107451 263672 228195 12634 118960 551996 163916 135162
12167 135162 543312 64258 -15051 126825 214105 116954 123513 119044 315804 329369 -124445
12155 152438 -102711 130268 -116062 111094 219351 246994 -88597 395103 394305 96127 35430
12143 389821 69317 31080 120174 263216 -69826 164234 52398 -135355 402804 -289725
12132 -89752 59219 -91710 -19943 -80339 5738 78621 -181421 -148911 -49295 46576 -146290
12120 202668 205636 -61629 76020 -186296 54809 24741 21783 159725 -171965 172337 42946
12108 16815 -48398 -184617 407944 -178543 54374 -30608 -98384 -4180 -152676 136943 -92575
12096 61249 51519 145882 252502 -153033 -98614 -82324 90104 33884 -255273 -48307 -222413
12085 -222413 34300 -169280 63364 -222869 -292292 115275 -206003 82238 166033 -41191 -194947
12074 -194947 340263 120592 53749 -28040 -77800 7473 113581 -96687 138845 -15722 387347
12062 1917607 591100 42484 25144 192788 -279269 161172 157070 -64468 -39746 -221274
12052 -221274 141921 148966 -324338 181081 69269 -34042 -435525 -263358 207428 4669 105334
12041 105334 50229 68294 -104439 47145 121388 57491 -91739 212749 -89056 141052 -75454
12029 34263 82012 -92446 -73799 161764 21249 -178607 39569 66495 281383 -120339 -219312
12018 -219312 21482 -172693 -3664 -97402 142705 29612 -104538 -177471 58410 10229 -198631
12006 382932 -351582 81277 103257 95542 118436 74358 -249868 -199399 -99352 -104055 -3480 -10752
11994 -10752 -242020 -177370 -173956 -123587 113034 -89184 32693 174594 137229 -192732 -96160
11982 -158006 15522 56877 35683 80709 28364 -107034 178489 -19081 -122661 204626 116991
11971 116991 -138868 -201444 -279811 117195 -252253 -131607 78617 -74471 -78509 -106592 -227497
11960 -227497 -22303 186138 -29396 167779 100453 -131826 -110655 -296132 -50641 121087
11949 -45293 -88352 150834 -118398 -175673 -180933 -147049 -123638 -154432 -198408 -145497 10071
11937 365917 32147 -16062 -11542 22186 384712 218506 1721 191033 4649 -52306 257711
11925 -115851 -147028 -103814 258883 -142067 -172158 5454 110977 245918 78613 -20525 -79432
11914 -79432 35128 -147843 117941 -133979 -197172 289630 -143306 210724 -19371 313102
11903 49734 159303 -71929 -102040 -16729 -93678 -109159 -29892 -204153 -136257 -65542 -286990
11892 -286990 -361147 -13761 4515 107993 44394 -235735 -69874 -111702 94253 -210346 235931
11880 126531 5291 -194926 -161264 -174890 87830 364558 318443 -286653 -30469 -38983 113492
11868 77863 19138 201722 -192674 251918 59726 8446 -155178 -171819 -177084 -4517 -172293
11857 -172293 55292 169205 -117888 -66248 -106801 -149955 -41332 57178 -102600 -98791 -31688
11845 -228870 -174261 -72635 147757 -31425 -69316 81043 -186728 -65490 398235 175824 -132794
11833 176954 -120517 74881 -277313 142077 -254859 -114452 -113064 -38977 -216366 159918
11822 213378 362801 412296 -34034 19109 -209967 362490 210261 -156498 147770 316425
11812 316425 -55735 -195194 99722 -137911 -83562 -135244 -27914 200091 95683 -20328 -106054
11801 -106054 301874 225740 69777 -261536 -238585 -231823 -278584 122935 105924 -39428 -261877
11790 -261877 -180584 5424 84941 -98385 161998 -165712 43635 -29741 158453 43867 243079
11779 243079 128215 120789 -169992 31758 62266 -64301 -200277 -237466 -77839 -202586 -217842
11768 -217842 148947 -66940 -10612 48467 -231979 200481 263625 -163192 -313844 2913 -210490
11756 -55091 -276425 51683 -38870 11091 307702 43104 -102804 318385 61020 -307673 -64368
11744 104590 11350 97539 74997 -122156 -56566 85228 127478 -62580 -283617 -25407 -187708
11733 -187708 179735 167359 -60879 -102704 103682 57611 -221897 -37012 -363224 117699
11722 23236 -31803 37824 -20870 143341 -45473 157578 129561 -56902 -317913 -31834 -215086
11711 -215086 -218773 58944 221345 188221 127499 -300814 136295 36100 6087 -192599 -318486
11700 -318486 209497 -161473 -165033 -228762 19426 -78519 50191 -8368 -148133 -244005 -81136
11688 -152691 -397656 102420 -52086 -192325 -73156 -266128 -25633 -151620 119724 -237214
11677 7885 121786 181972 -7698 -104065 177307 123662 164236 -370933 -269753 -11660 -271675
11666 -271675 -112780 107428 112593 -160800 62755 142911 -48209 -87979 13787 48990 246505
11655 246505 -31826 -85414 -142994 229935 -74723 363029 121712 -82630 -104693 326642 83553
11643 39526 161968 -58670 -65371 -223785 277677 60860 65810 -104284 -54688 133665 40815
11631 3000 -232460 133911 74320 -308676 -127209 394935 27764 72230 107710 -84991 101669
11619 55398 -174837 -274042 37734 76850 -359713 61259 241321 329621 225545 232947 234173
11608 234173 -27022 -98877 -138666 -107175 100714 9130 49958 48626 -294160 20640 191428
11597 191428 -4077 -85847 102069 131790 -277854 -43761 107401 -167741 29142 -223761 190104
11585 -163054 -64382 -69447 -240719 41647 -19486 -34420 -143096 -239587 -228612 27965 -11310
11573 -307220 -31594 304106 -206371 173081 -244615 -39978 65115 -93768 582239 -160329
11562 73373 182018 169190 131744 125073 -124590 92978 -82360 -142854 12239 118636 94914
11551 94914 35272 -93233 -215360 117138 -279007 83005 53049 159647 63571 -10638 -367019
11540 -367019 -31733 -99002 -50630 40858 -126850 -141055 213439 259200 115763 -26045 114371
11528 86164 71286 59385 -17088 160832 344179 17505 13242 34870 -22504 -195771 -25934
11516 -164654 -354217 78793 -10732 67402 195444 76190 -72637 -169487 117691 -20348 -54268
11505 -54268 -7388 404481 102963 262771 300898 328705 -57991 218260 384593 441488 -34715
11493 70989 203916 309332 -409328 312728 181618 -21139 -63289 42220 270051 191254
11483 191254 45233 -150719 -169035 -30541 326568 184461 60969 92727 139020 390204 133842
11471 89096 274048 190861 9896 214188 -41739 144265 -72948 97881 27711 69400 110188
11460 110188 -11173 -148374 -53755 -15561 35105 147788 -196215 -187189 39932 -28243 -83724
11449 -83724 282291 250702 -236571 176680 190495 18665 112180 -168576 84725 186820 22114
11437 117812 28526 -121085 225678 187696 -188538 -107274 55452 -191079 -8601 -100543 51425
11425 -64253 185318 -184269 178489 35682 27138 386924 83125 -136492 27888 391970 -98681
11413 -319192 395459 -248832 -80683 87061 -176078 -176297 -142361 94277 -218359 35911 295238
11402 295238 103197 28511 -14184 -180508 35108 239885 -126546 298676 -77260 84579
11391 180820 -97567 100585 32894 150295 -171794 228078 81831 201243 254336 -34673
11380 214138 158919 141858 64660 41195 137783 99193 183934 44529 -17078 243574 272418
11369 272418 109286 60299 -37519 -273420 -204987 -364779 352548 32858 -418233 -328439
11359 -328439 -304139 -167095 -249422 23578 -32522 130908 -451943 44045 338618 8564 11358
11348 11358 -61584 228142 -60521 -52856 120704 -222462 227045 55000 429496 83626 47844
11337 47844 115354 -115023 8462 -274178 -321345 67037 163342 -327344 -189493 -179264 68836
11325 -189153 37545 -153240 -147865 30881 -297034 85265 -52293 271398 -44736 189542 -5411
11313 36399 -28063 240047 -165546 34553 -850 -218481 94896 16560 -132731 189815 335727
11302 335727 97543 18669 -224067 -106656 -188616 51479 -180900 -91788 -12068 -365764 -183081
11291 -183081 -10014 -122444 -120012 -44685 87275 -202609 -110387 51109 203097 36785 -181475
11279 63037 -110046 290459 367930 -327575 -367102 8576 26058 -204477 215087 -156034 16778
11267 34560 65433 98765 131232 -365306 234541 30085 -17735 -134835 149426 -323638 -202752
11256 -202752 123023 -32951 20921 -144885 41390 239944 -406769 11159 -82410 -70810 238193
11244 -203642 14956 -221551 -148506 -6326 27641 -130102 138709 -33080 103583 -208548 -112733
11233 -112733 -106328 -259060 -32911 87953 177361 322565 81279 78539 -5504 206029 129855
11222 129855 318562 -130047 127183 20548 -154096 -27259 -136324 -27443 -136137 97206
11211 -111246 -98939 -51590 39814 -62969 -324193 45268 -65837 93960 23858 -334137 145138
11199 34618 31115 -172488 23127 -32974 87452 -90490 -470413 -166168 -36703 -480266 -257962
11188 -257962 183544 -111866 143381 -172007 -248838 -382965 -18857 11947 45599 16196
11177 -26302 -156661 -236999 -176141 225772 241080 112468 -201485 -157191 -138869 12396 -347081
11165 -155453 150436 -250090 39043 -56931 247165 206127 -269641 58975 17264 -259924
11154 -196066 -124617 -252311 233433 9310 -54565 -121205 -64217 -57782 -107297 66769 -111388
11142 -109119 -43350 110023 -117102 -275126 -140842 97088 50308 -20090 50383 213717
11132 213717 31101 -218740 73258 75524 -614 -383646 105144 19649 13484 -13609 -62665 197694
11119 138395 288895 -48417 36731 137962 -138147 36929 188380 -133023 117233 -254829
11108 7227 187908 -111027 155600 278446 376333 46772 58284 40118 256824 137876 361310
11097 361310 322996 -109971 112206 275147 79877 285308 33293 399774 341348 -50175
11086 630483 81260 -151310 318675 -69595 24028 228054 140091 249335 189248 -52420 170646
11074 179136 147269 184952 311460 88698 96930 166983 132150 237582 393812 184233 260659
11063 260659 450946 417954 309774 426224 594573 472517 540321 232321 521632 578071
11053 578071 503869 669633 160241 673813 448945 494742 568460 680125 388417 441837
11043 441837 767131 835648 695246 593012 422379 608739 739198 397877 759872 745212
11033 745212 678513 950683 737996 478900 839524 531419 734922 494332 455604 495253
11023 495253 562164 321198 456827 603254 655968 738735 258080 573662 459734 679070
11013 679070 418623 815543 541903 443162 776552 390040 570778 718232 745724 505206
11003 505206 722791 782712 611691 564849 533672 663839 620580 758050 630414 574137
10993 574137 227084 576498 569304 740157 436556 907086 731497 890480 625779 909031
10983 909031 888936 941682 933423 1288213 1024935 1307405 1298943 1433422 1743047 2176466 2306169
10972 2306169 2352725 2559690 2731972 2742991 2281092 2567126 2338592 2020963 1660067 1369534
10962 1369534 1403645 1101040 1364533 1382331 1210946 972864 1094510 1159152 1106898 1059826
10952 1059826 898165 581480 748465 419399 520743 34419 484195 232381 96191 202525
10942 202525 -105451 100250 219746 -155290 286814 174407 69524 453347 206586 8217
10931 396290 -17838 107420 -84 284988 76382 32628 -60119 97158 103970 -52609 -8681 -71899
10919 -71899 24977 208020 -103367 41272 -16911 -65288 250347 49788 168149 314847 -8780
10907 -114220 11872 -86878 -108572 294321 -36609 123597 134003 32617 89285 72502 205081
10896 205081 -392481 125431 -22662 -7275 -244538 -185201 -275317 -217878 -198916 179293 20318
10884 59345 -64911 260454 1178 99315 -150743 -2008 289743 -149092 364003 -336971 247796
10872 -96614 386726 292155 92185 30575 231425 94061 -280723 -158985 -8857 62713 11907
10860 25598 66963 205781 279201 -282640 -6342 -51487 134184 183872 -197217 -108573 -159471
10849 -159471 -386677 357558 -39877 -109272 -102227 -242085 -207284 -293918 35760 298322 -187169
10837 96692 -115209 14428 179613 101175 44530 -226140 191827 -204518 151725 -171704
10826 235628 84341 -211658 -140772 -204142 -214880 -385745 -8692 274852 -88753 142003 -381598
10814 -270474 -31679 -302531 26986 119597 -30038 -297041 227488 -106023 366240 -60304
10803 -74064 -210413 -123136 -186048 32189 -98112 80781 -105560 219769 291996 -46132 -184769
10792 -184769 38622 -121770 -80671 -11412 -78276 -225227 57001 -81127 -377367 94609 7900
10780 -185063 196468 -61740 -109538 18278 -75293 -205706 -302256 -358091 101262 -276073 -50270
10768 221641 -244973 147240 -8107 -72788 -40241 -200764 -82784 130770 53176 -84391 88410
10756 -177999 -13880 -177655 -116765 211239 76867 -91518 72442 -182448 24241 120789 -123353
10744 -257721 61962 55390 184469 -338660 9944 -233797 -230974 -41137 12021 107972 251566
10733 251566 84904 53718 -90193 -46556 -14544 141874 -113263 -153785 -105452 -87934 95421
10721 49702 -50479 42824 181331 -15330 -94706 -101447 -225141 160208 -176475 -121701 -92332
10710 -92332 20518 -149072 -147179 -319045 -67115 -16595 199476 -51148 -9457 -33205 74959
10698 -172746 -168407 251663 320270 209772 -164355 -101482 -213311 89117 331383 -508164
10687 -106668 51663 333143 -114642 -236491 25394 -245373 -97342 251846 -176420 -392402
10677 -392402 -1222 -198181 117442 284286 71658 43649 12607 -47488 40518 120652 154279
10666 154279 -229017 -191311 47909 -413922 -72860 -203050 36032 226473 -161046 -190553
10656 -190553 -119986 -127609 218433 -84274 85046 -32734 49667 218152 79523 5605 -186814
10644 -253769 -83543 184651 186087 -55751 121260 147808 198416 238517 -313439 -171838 -44474
10632 -397605 -119848 -55352 -14219 243876 95526 48216 -138470 143003 -160397 120108
10621 -132421 26661 101213 33005 84333 -293462 -102681 -106139 -342943 -213623 65023 -74445
10609 45430 -176509 327475 -739 -85052 21373 -66221 -25306 -196366 43258 -303704 30558
10597 249453 -76300 -217781 110750 40529 -110094 -162181 -420844 -41140 192067 135634
10587 135634 -434396 289884 -77143 -131415 -252789 -73080 383987 11741 -3656 -240334 -154185
10576 -154185 -30148 -144850 -86121 168159 -32906 -141916 100915 48329 66177 -190123
10565 4173 10736 26786 308511 22823 140209 118101 75631 46965 -189563 -165714 73164
10553 -211727 -83177 -103891 191050 -125422 -196271 -311926 -259444 5056 -79464 -34788 451350
10541 20731 -603685 188891 -142515 -235089 -273221 60585 -272461 106388 37144 -128952
10530 -233170 -95467 -65736 -453178 3999 120969 -262343 226591 -169581 -113545 194874
10519 11647 201574 233892 -75454 -274227 -233832 12566 -58932 50065 -145738 141120 -226378
10507 -77568 -118333 -150556 -344407 18258 83813 -173272 227154 -79906 334286 -110319 94717
10495 -253300 11227 3754 91737 31610 -78265 -420325 -8291 1238 -267987 132102 152579
10484 152579 27507 223259 -40086 87412 308078 -249313 263529 128497 -51187 3145 84077
10473 84077 -237434 142508 -356548 -82285 -127224 -35889 -34132 -213377 -5835 -135985 32150
10461 73510 116983 -28036 -230128 -184385 70340 -101200 43974 -12459 -129561 13862 113083
10450 113083 141781 -18647 105884 52627 100281 -26804 318976 109595 79768 -291814 148260
10438 -390330 55997 388779 -58179 182799 -172711 94184 -131014 -6015 174068 -239564
10427 122389 61699 36595 -93315 -147867 71116 -62199 290642 2163 -98896 -42417 -7220 -289447
10415 -289447 -280361 -126565 262507 -37094 -132031 -377392 -64795 69984 -163553 -14288 151479
10403 -116580 -85201 -116614 74344 -246279 -23397 81722 -48325 -142291 35898 -119530 64891
10391 151259 34858 330586 137679 145260 182272 269241 56664 150736 -21389 121603 168616
10380 168616 -218939 151590 -148072 229410 298016 286205 270618 264418 354289 115677 240256
10369 240256 115241 103430 593628 264533 391844 139229 722308 82649 236912 70037
10358 337629 100858 46616 298286 285959 417081 503537 427287 839217 663042 619321
10348 619321 124897 124246 383972 113639 -148064 547696 151254 201589 -164668 317744
10337 93684 189965 160752 64391 -105393 -174172 228766 162075 262615 7318 78124 250703
10326 250703 19339 112256 63629 211366 163731 242363 94031 125027 330892 -978 334722
10314 -427238 -177361 22185 142038 94910 -35625 5833 97612 11174 148802 124360 87917
10303 87917 -96551 56946 74295 105010 -3592 -227697 166497 -96357 -177097 171457 -53861
10291 -19279 36549 -179348 -139610 -353115 -61448 114130 -108710 -32950 48692 -238105 -43920
10279 91401 4148 -147227 146786 404280 54692 -42588 -235821 203159 82709 10595 9676
10268 9676 -145838 -20483 -79899 -309911 236350 -83687 37285 -286496 6095 267634 -164448
10256 76608 112179 79247 154494 -48017 134363 412958 11400 -109829 -7647 -30595 217445
10244 -158105 98382 20360 -143298 99682 -237666 -48352 -65680 -235210 -292311 254682 222604
10233 222604 220342 -181580 -52686 -53777 56544 -506562 -397977 -62281 -61920 -75178 -104209 213488
10220 258189 82997 -4514 -32372 -42794 -23624 -49319 297691 -59587 -214346 49153 -150080
10208 -213661 -156732 16372 -63194 62539 -284859 -1105 -353404 -188461 186452 -3445 -234202
10197 -234202 -202504 -271187 -5986 170758 96612 -418744 -194207 -260564 -186218 -75257 1705
10185 -61360 -39665 -321699 39937 141084 -569339 -238247 -153499 7448 -134033 52352 176017
10174 176017 265431 -28252 123219 -45573 247274 -227265 -323582 -28992 -437370 163688
10163 -120244 -22540 64084 -391777 -107923 10556 -280981 -99404 25188 46055 -211606 -70263
10151 -9653 -124437 -373697 -27332 199878 167043 -89674 -180103 -54710 29937 -229835 67402
10139 22928 -34853 -277414 206685 -131973 -121900 -77037 -415269 -168395 -270208 40007
10128 -13616 166070 86933 -540399 -35088 -129738 112577 107648 -391377 -41265 98700 168097
10117 168097 -178326 -51067 -155428 -101523 -86200 102870 -221098 -189165 109821 280143
10107 280143 -308937 62333 -223475 -202064 -55984 220001 173276 122091 -285925 -4970 -457970
10096 -457970 -55846 -415943 6593 -51638 -98805 -21329 123297 -9923 -248478 156122 159767
10085 159767 138727 -141496 45828 -95574 -27762 203260 153505 -22564 -223895 67423 -152518
10073 -82255 -307344 -28505 -114977 -63181 -90653 -28894 -16330 36640 -219831 -42495 -64658
10062 -64658 -211503 78084 -332174 -205641 -135529 154982 179858 5994 111100 -270398 -19961
10050 174387 27035 75886 114150 32977 -146276 13750 128460 34200 45198 -93677 63991
10038 147796 -126535 89713 276628 17553 -48768 -281965 -230447 -208536 -110193 -109447 47495
10026 53620 -244375 -74538 -5533 -299384 51066 74541 -332486 -208188 -58731 -117374 -200209
10015 -200209 -116256 -3974 -78416 23053 -70170 229562 129146 -15064 -306991 94743 -22869
10003 113590 189839 -112186 -253656 -154864 -268423 -182531 170534 -116230 -375078 -374174 234510
9991 35902 -231478 35759 -126490 32740 -62469 -17811 421744 41704 -152735 253397 148406
9980 148406 -87488 -3075 -406174 -296443 -34575 78035 -156601 103180 -344224 -218053 -103563
9968 138649 -147921 13275 -83576 -154759 -258005 -323959 67888 -56889 110855 -62329 -37700
9957 -37700 -348408 194754 -93455 146201 -153042 106403 -102976 92873 -109037 -148828
9947 -148828 87016 197441 -116645 91379 -218996 -295050 56630 105961 27687 8462 -32285
9935 193538 -144507 103370 -299839 -21223 -7412 -57954 154179 -205442 -108493 -157825 -213898
9924 -213898 -137907 -20199 -57027 72608 -23028 4625 52453 -110447 6129 -54270 15998 -210059
9911 110944 -35603 -60459 -44427 -302916 -115994 127969 160648 -28978 -164726 -161014 -117717
9900 -117717 -267109 -102038 -132371 -6427 -61896 37619 -61414 -12954 82044 442546 -20827
9888 -115024 -74851 99440 -149746 -109745 95503 13479 183168 -127235 -125712 224667 83032
9876 121645 208813 151352 19391 -198258 139163 -3887 36642 -260269 -161501 -15982 21754
9864 2048 189812 3478 -156474 -36815 59381 -158610 -147800 97001 -190300 183206 -132435
9852 7284 -90194 112807 -63964 12854 42013 -292906 -19701 -143849 -181393 -139388 -178730
9841 -178730 -62037 -167198 90784 -68383 -447615 -24932 92430 160066 133837 74822 -271390
9829 110528 -283219 -177214 87575 -297368 -74415 -62283 -334424 -134859 -467268 -433399
9819 -433399 -59865 -275315 74734 -221655 -145416 -91355 141395 -98658 -351512 236644 -46370
9807 32860 85958 76385 50564 -226920 52724 46851 62185 -3269 -111205 -246964 180757 -11635
9794 188569 33076 -239346 -140852 -55892 -208609 -118366 -5936 -80920 74236 -255577 16998
9782 -148607 118635 89591 3723 129187 -4360 -191335 55817 -48243 -431187 286572 42621
9770 -11499 -338306 -159201 85087 2539 -182402 -77812 192639 170454 9168 -54679 -362654
9759 -362654 -42786 -272212 -19340 306059 228352 168180 -58731 -79186 102593 -250389 -186512
9748 -186512 -12853 -104261 -155610 -81316 -133793 -229453 -333819 26950 85568 -243885 -72092
9736 108225 -296888 -15838 -68353 104975 116190 -263719 83547 -37456 -270275 484177 -62900
9724 -113787 -218574 -264731 -186388 -211747 -287330 5253 -117163 -298613 187988 -67237 9036
9712 52191 -138796 -255126 224517 -37643 182149 4464 80124 -272796 173261 -319375 -24771
9700 230354 67695 -33307 -46839 -117566 40638 -102373 -61254 -157240 -252782 -66021 -116595
9689 -116595 70588 -225706 -42084 254091 35606 -23092 97342 34521 241380 388620 -6528
9677 -136306 -207811 -21121 99570 -142251 -132094 -47225 16502 237539 -142392 -287058 -150012
9666 -150012 -75494 -40567 -281277 -176178 124658 -185957 277137 -116181 -206394 -112139
9656 -112139 27383 -162852 -259110 75349 12285 -12084 36157 -292973 -54073 58978 -406241
9644 -94389 -48946 189150 -288278 -167312 -170302 319004 -616384 -143953 -113627 121459 -124262
9632 17364 189693 -132338 -7705 259539 -203267 167890 210762 140920 -412064 67902 -371294
9620 -168456 -337764 -118525 -160966 -73496 -408280 181315 -8029 63377 206621 28048 -134552
9608 -181934 68827 -125931 -69038 -82671 -300307 99162 -157568 -85305 64920 -199314 -219135
9597 -219135 -207578 -155226 -148462 158389 -33871 173489 -132249 -119577 103760 -24853 -144530
9586 -144530 -125340 -81143 303678 -34732 -48908 17584 77603 -152081 -219034 -161834 -236229
9575 -236229 -124184 -313885 210130 158423 -214149 -82642 -116488 195534 -185752 55705
9564 -134109 303781 -344975 68082 167175 -31239 -214044 280219 -370943 -179173 -38768
9553 -131309 2902 -184682 -136214 -3520 -373668 -260869 -212125 145717 -164214 -276444 86226
9541 -70431 36259 -832 138332 -274816 -405061 109081 264407 258199 -61891 -370314 -113471
9529 -272643 -195206 11928 -38859 -60101 -385952 70475 116549 -42421 -156234 -118633 363715
9517 -113770 -255044 70183 264931 1608 -59005 145134 -48587 -152563 14862 28237 -142790
9505 -60929 -72003 -70784 641 -4014 -146100 51772 334096 -234935 325178 62075 3881 58636
9493 58636 -5612 -96935 46959 -197684 -92825 198240 -200934 64018 -3865 168660 69568
9481 157138 -246302 -76814 8859 -164766 -137290 -32594 111605 102647 241631 -71608 -228157
9470 -228157 54469 125335 -46592 -117370 -26345 75136 -184368 31573 -35321 -255736 -413450
9459 -413450 -97227 -202279 -34307 -140110 280747 202240 268858 11035 -51616 -27580 -208
9447 -86535 -166377 115719 -77254 -448170 91215 -220808 -161007 -78820 41209 -249543 99368
9435 -44616 27302 74704 153816 -374501 -57336 37211 -72011 -163374 -52442 70682 -102408
9423 -11576 -11831 112311 -197596 46017 -68980 -34527 -69110 -139626 128392 -12873 -501946
9412 -501946 -287184 217728 -235691 -59058 -108832 -92007 -54239 72888 -146931 -307391 -78305
9400 221262 128316 -301580 -38051 158977 150022 -335355 146544 -429827 328715 231467 -50554
9388 -268169 26554 -271674 -231074 -50459 17146 -172164 27098 22057 212134 -369716 14063
9376 -264016 -197234 -23873 210671 76908 6164 18545 -149467 -47870 -51492 94786 -1649 10467
9363 -317905 339 46457 66184 64573 48749 -186315 -155998 -448272 737 -52714 -269482 288273
9350 -49989 19266 -156867 104068 88883 -57328 -485762 -101020 179021 -79328 -165514 160995
9338 52428 -148802 -61944 -169677 190737 41585 128644 -129281 -103388 148398 147390 -6450
9326 -30259 -211136 -154820 435999 -40632 44986 -220254 405064 -86127 40951 -178085 223332
9314 -261591 -54124 178730 25614 -14615 -262403 -86141 133567 39616 -140422 -59186 3012
9302 21869 -113445 -151341 280192 201742 36137 13253 -94131 -107181 -211404 -234148 -77172
9290 189338 -213439 -249412 70993 -182308 -113413 -129232 -255043 -248298 19362 -214173 35322
9278 88892 -458118 199028 -72757 -404553 -42934 -118985 -70904 287231 247601 -406884 60288
9266 94096 221180 -94902 10383 -113726 -146951 -77551 333506 -216647 -146708 36677 -17725
9254 -7827 -118324 73311 -210600 -150944 -143929 -237155 20522 22177 -415266 -395701 159579 -138918
9241 132529 -520068 -316759 -210100 -283778 -236841 -82675 -29913 144085 -13333 -99026 178460
9229 165536 -273860 128613 -96518 -153831 189735 -102065 177603 -80014 218452 92554
9218 336832 -189551 139568 81096 6085 142259 80101 14824 -70810 -55760 -232108 -54950
9206 -56945 71031 -78087 77145 158825 79399 -479948 -53409 -47302 178660 107507 -303678
9194 -296858 37840 48591 -80668 -359663 145328 -284158 -53601 320260 -44278 97049 -25623
9182 -160744 51136 -314782 22128 99258 -3827 -112677 -157130 31767 -373003 -25521 -220539
9171 -220539 189084 -395485 37533 -75057 -52141 -51468 -35495 -192944 154612 68509 94651
9160 94651 -134747 179520 -54021 -22162 -14196 -3160 -25628 -137717 101420 34827 -64078
9148 -139901 -26497 6331 142262 -64507 -23583 -443801 106789 62744 1405 38670 -237313
9136 -254957 -350963 -78248 -46585 -195173 -203509 -30808 -116063 -333721 -77959 83159 147459
9125 147459 -74881 34474 -196244 -15155 125866 -29158 -340055 -275743 -159543 58605 114846
9114 114846 -67317 408255 -293803 38577 147941 -403782 353 156114 217678 239488 -5987
9102 183308 -256190 -289109 -189667 -42770 41480 -230254 -216001 -251802 -94033 -72561 -126902
9091 -126902 -143550 -24581 -155161 -312605 26779 404029 180261 273157 -342506 134543
9080 -288361 108118 -248578 8396 25174 170301 83563 -176453 -286011 -156144 -30462 -34419
9069 -34419 199349 2651 -16111 -163361 -88820 28868 -209690 -60644 -174075 -286029 20168
9057 32546 71855 103367 291786 -152258 -45807 77072 133617 -113197 -2118 277985 297283
9046 297283 -248054 -369423 -101452 82367 -163771 143284 215238 -104248 -77968 -277551
9036 -277551 56706 -99113 -46212 -57818 -306839 -166953 58012 87765 -156855 -62200 -225756
9025 -225756 177698 -26867 -121371 31446 -174483 -293930 143397 -35706 -91358 15426 -222534
9013 -52197 -69045 244392 2260 -368700 -2097 -43216 72834 -99859 -41189 -142172 223577
9001 71303 -116449 -5924 -174842 -267497 -85165 84456 64873 -218334 -167161 -32858 223312
8989 85161 -17940 -298051 224457 -164783 34961 -273908 55654 -122427 -109130 146228 -118763
8977 -33260 -81037 128742 34200 37448 -70493 -262873 -46326 120959 -162509 52997 -39085
8965 186076 163092 38042 -404792 -2009 -361407 -227704 303880 99632 27774 -108935 -6546
8953 -183417 -116957 -192858 -130089 -48829 60905 -320339 -101060 125919 52023 -196181 137199
8941 -69703 8290 -159251 212868 21623 212343 165992 -21973 1090580 195584 3054 330009
8930 330009 336799 297975 -120227 97635 588449 769103 1070755 1918881 6230758 26927235
8920 26927235 9714252 2605824 895124 478565 500183 68569 -49595 -81174 107721 -139760
8909 -257039 184297 487897 282485 -114547 -334142 -65411 -160261 -25555 -351504 -190897
8899 -190897 -80435 78270 -91248 175641 71778 -93789 -129495 -301789 34085 -4919 -71238
8888 -71238 102858 -358438 98950 -67604 -37906 285591 -278960 -216283 -142983 12656 -180293
8876 -40082 144502 -214609 -51145 -23249 -59391 -25717 -62536 -219396 -146760 -11573 -130301
8865 -130301 146711 130334 -61908 124388 -2474 -195152 -115509 50089 -432312 -158124 -26462
8853 -121960 -332017 -431624 72398 -246289 -275857 -273889 14142 184762 -547754 5958 -50316
8841 120909 81416 -285619 -42421 219454 45161 -169313 102126 118402 108209 -199728 153818
8829 14909 -13179 -103937 -247951 230375 -92010 368007 -155876 -141508 61822 7144 91845
8818 91845 -259390 95599 346445 -311480 23372 -72348 -206158 -296851 -128597 -206643 91126
8806 109495 36118 111830 -116076 -85065 -307303 -181901 49781 58512 446201 -58284 -253170
8795 -253170 67562 -260391 28427 -108612 -214627 125680 -49889 -73544 -56255 -61849 94585
8783 19268 -83276 59884 -98501 -13575 -238038 -32159 -96851 154931 -39293 17232 -30301
8771 -164288 298311 -164930 -159856 -281142 71947 26701 208348 -133050 -171162 -33237 -148499
8760 -148499 178835 -175180 -31993 192929 -24447 -91045 252824 156752 372533 -22151 -113310
8749 -113310 239133 5897 133026 -179537 -146069 -217784 -189577 -277176 130165 -91994 -85109
8738 -85109 -110770 -168459 -72907 100691 -68735 -297190 -278515 113889 -137059 223728 144168
8727 144168 185312 78371 -169676 -74660 -135472 179466 88532 -6859 34986 -73894 -225383
8716 -225383 -54870 -64356 -2744 102542 1231 -143417 51120 -403373 -56694 72996 -246936
8704 -183314 -81470 -110635 -174314 -231847 67377 102515 57505 -167785 -355484 23857 -159632
8692 137666 -148865 20691 233256 -101373 -98739 125767 30946 -207002 -36137 65687 -33376
8680 -12882 -211479 -93186 -184341 -14527 -233618 -8332 183230 13235 36014 -69118 -320172
8669 -320172 -45625 257000 -283953 287730 -4325 -258406 -406156 207164 -301103 -24190
8658 -262106 -62855 -47833 -21708 -180499 134664 190640 -149294 125176 -238716 164126
8647 -25123 -43508 -207879 56321 -100440 -167675 -31522 55501 -235073 -89342 -514489 -236423
8635 63419 21869 -175484 44904 90490 163148 27486 -206191 -6258 -271216 149419 -140899
8623 -51502 262754 -134067 66904 -147996 -14174 332599 -215276 141440 -28261 -192358
8613 -192358 -77111 118733 -81229 287563 190783 -13578 -56576 231292 -75773 -153195 276160
8601 156949 -75643 114624 212260 -131797 -300126 -51626 -176585 -97787 -222787 -148621 -97787
8590 -97787 151390 -48855 29622 -304192 -275173 284095 -115771 102931 -44236 -249304 10707
8578 -317451 -45554 43235 -210396 57167 -226755 -114463 256109 -623293 14428 36447 321698
8567 321698 87373 132725 -212376 136327 200496 -202586 133257 -33439 -182 282493 -155481
8555 -561569 78105 -198040 -153721 109090 -85960 -143924 -124010 58821 109608 51847 -129017
8543 147949 16011 -322258 -19814 157996 -16768 124194 -267055 -158580 -71526 -495682
8533 -495682 53685 283069 103150 -327111 -76487 -110440 82565 101145 -1062 -111581 -246146
8522 -246146 -251187 -212810 -407936 71619 117616 136574 153779 25682 -95677 -194845 294201
8510 -97641 -252027 -126189 273303 -184791 -164164 -344324 37005 211104 -50418 -178804
8500 -178804 -157866 -88760 292626 -107274 -139367 -39369 -33359 91932 172047 -458490 -243019
8489 -243019 51669 -224154 46795 149996 -3302 55953 -28222 -238534 69022 -139530 129064
8477 51049 -77160 106548 23883 19707 -93400 133902 59014 -32227 291619 -28432 311376
8465 62007 -152784 145050 -16232 -37064 -137708 49392 -178713 -41423 -158301 48905 -316733
8453 -357360 543130 12120 -155472 166181 27745 196199 -32065 42196 6301 -35569 -11242
8441 -260508 -219232 79118 2487 -189504 220967 -7056 -405121 -22675 -28127 -177507 -369351
8430 -369351 -176165 -212961 133830 -133378 -32717 -77431 -173264 -449547 -12858 -64149 -465787
8419 -465787 -123973 -29198 10889 -97661 -200415 43032 10207 -88490 -150499 279389 -89258
8407 -13476 -42323 31508 -69120 339739 -90905 28986 -85805 -162852 -59211 27974 -26824 -90660
8395 -90660 -6359 -77525 -160352 68800 -112813 266075 256348 -245580 -143603 -344962 -172090
8383 -198617 -89452 5738 -105857 -135649 1920 -148234 254789 -36248 -54950 -203621 41963
8371 -421626 235180 -460041 -81909 -144301 -114028 -178495 29939 -333010 -61103 -109424 -339496
8360 -339496 -79187 26627 -172873 51443 41922 -164997 423341 64716 -91409 -90147 5550 -220637
8347 -125811 11190 9045 -137980 100042 28424 232827 -71916 -287976 -63360 -113543 -250398
8336 -250398 22944 340492 -278613 53076 -279287 35537 389379 -15483 176076 219 -185939
8324 -178857 -274696 -66880 -108588 6358 257989 279603 19987 -5561 -369808 -155679 -277442
8313 -277442 18034 -115818 -6240 45840 60050 224440 -199483 187551 -40888 -20714 53728
8301 84387 -18430 -208761 -85693 -155991 179801 -172993 -165479 -96491 -54916 121767 -188996
8289 -20343 24998 -251603 69188 -45427 112873 76676 86761 -37593 -50230 20098 -152951
8277 124808 323206 260372 -15601 117995 16080 -190770 -84796 401188 -234770 -57016 -210747
8266 -210747 -221181 -175057 33015 -28583 -32022 30473 -242315 249982 -36275 12582 -32949
8254 -12460 121234 -39617 -24059 68268 -160101 -115284 -150814 -172951 -178374 -6558 159320 -72236
8241 -160333 -308487 29890 -176199 75015 -48335 77614 -263777 -109637 -91730 -106330 40749
8229 -73163 -12035 51032 136630 -28632 26059 -284647 -112200 -92622 160196 -141985 -244911
8218 -244911 -72161 99390 -250232 -463146 188138 59141 200718 -5272 35882 5918 344209
8207 344209 102148 -54053 -209091 -72239 -282014 -291445 124298 -60832 45520 118711 -137077
8195 -104788 148166 87427 15912 80827 -3200 -145637 -318135 -35059 -74262 129523 73837
8184 73837 53849 -11979 7844 211971 -118004 98745 -288543 -23023 12782 155992 -401413
8172 138738 98795 -236852 -23589 -5641 23638 -156098 -65591 -167273 255647 2628 -124882
8160 -122832 -133456 -117001 -118630 10787 151152 27000 -49532 -263621 -71185 -172977 312369
8148 -262323 245145 -188653 309512 -289560 -55700 9766 312665 -132176 193169 74363
8137 231698 -162707 -29562 27719 109582 -6510 107279 -180540 141278 22771 26058 142259
8126 142259 -68878 -26168 -103452 10922 -137083 45943 306384 -126025 -202244 -46961 27839
8114 -18832 13951 92867 -47491 -59682 -2428 35166 60946 215893 -111745 -139967 -236446 -64609
8101 143982 -74487 -156621 -153246 -304036 -122859 -182926 -430 -213051 18792 -386852 247166
8089 -7927 -10395 -68381 -155691 29189 70627 -255316 -254576 28543 -44988 -74563 -126953 82763
8076 -71075 -154337 75088 -40769 -306840 -262767 -287908 167066 -204322 93019 -223560 -139858
8065 -139858 -193050 64035 459 -5986 -88759 -54144 143032 17862 58983 74300 -89016 -128326
8053 -128326 -156507 64037 73464 -195650 -70432 17503 -49258 343983 170802 -443206 131414
8041 -345535 24317 -11550 -280348 141664 3298 174579 -283163 -359739 98025 19969 -259921
8029 -47344 -110619 173768 222892 108442 -61481 51632 -59258 190885 -162914 -105745 -253023
8018 -253023 145570 -185642 -311006 -60557 278455 287242 -44248 -102112 -160163 -213415 69489
8006 259075 -494334 -20626 406840 -23685 218476 -216972 -83934 -188442 -170212 167889
7995 -200154 -240238 27771 -43262 -303198 14307 -214808 -24394 35692 113921 -244471 3034
7983 -177603 -139465 -40479 175633 -128757 143838 -115335 -68135 14787 76061 -51912 141403
7971 173732 25311 308315 -58340 -15930 -464267 237362 119133 198292 -393741 186087
7960 -164808 30217 -101960 144209 205666 -227160 -195778 -163014 -92380 165006 -112532 -91992
7949 -91992 -281087 -250002 42316 -239988 -91922 -338252 -388041 -349220 163190 -118023 254024
7937 -38561 -242372 -106010 221827 -86439 117263 -110423 -183815 100206 -80143 -175497 -188508
7926 -188508 -230299 -1146 39106 163785 -70770 -239356 45303 -25596 690 75949 -15028 -60222
7914 -60222 -46473 -153375 -43240 119234 153166 9285 -2962 40276 -266392 -313128 78804 -107265
7901 -206846 -151821 10011 93623 345011 -130302 -111202 -403967 303307 -175995 41337 158166
7890 158166 -195605 -37503 -36857 190562 -210870 7769 26765 36175 152491 -249714 -252180 63925
7877 -335938 495203 6608 -192243 -243837 -219123 -274030 -86347 -163209 7155 -237840 352633
7865 65412 220306 -252256 -20631 -183353 -137231 33240 184396 221397 4024 -130151 204227
7853 -162309 -183265 239556 -212110 -91624 78339 367211 74783 -168456 137764 204451 -96119
7841 2725 -307270 19982 133383 78690 140291 -116241 -215161 15734 263384 -85316 -279797
7830 -279797 -8017 -179330 -127379 22552 -105657 -367283 -346992 -400423 -231956 -216111 -76629
7818 254847 -118541 -6815 303592 -124795 -127276 -299112 57246 -152865 -151193 -350290 -40748
7806 -121767 193471 -3234 -68620 118678 17482 -359011 48649 27164 -58738 75004 7927
7794 6338 86909 205111 -59565 207077 -80907 -300252 -30323 88627 193157 67487 -173674
7782 -112559 -43988 177123 -101009 -87226 87754 205176 -253330 25565 73378 187957 57023
7770 -172739 -514958 -240381 -85314 11256 136425 -152154 18674 -253319 -131596 123368
7759 -50688 -82933 -25488 127766 -84405 -217358 -182813 203894 -240893 -20551 -84587 -156164
7748 -156164 -68525 -77845 -199890 -130288 66794 -244082 -325002 -353887 -193409 415817 322826
7737 322826 -32357 -344816 -14629 -119506 73898 230466 62979 -60652 -197853 162750 -124612
7725 -197639 -80360 71284 29064 -161682 -364312 179103 5215 -280776 -116558 -84125 177144
7713 182315 -73738 215402 69762 -64985 -157672 152124 -249430 -176753 -63577 -248986 -23362
7701 -9131 -128031 79922 227100 -169759 242671 114339 -126141 114892 -201592 -218858
7691 -218858 293378 85875 83495 -71942 93957 -237766 70913 -251615 41391 -21667 -99920
7680 -99920 -207602 -341730 -120759 59048 -268830 -39105 -68756 -22947 152535 93304 149755
7669 149755 -344305 -122801 231565 106628 -109820 111670 71103 11427 -85046 -210961
7659 -210961 -67934 -512640 104516 -312362 -34670 36793 119453 -177989 74678 14893 13886
7648 13886 -40970 -52971 -161056 -138352 -252760 -63843 -177017 182814 107442 -39208 -37155
7637 -37155 157957 -222084 124957 71648 -103281 -166857 -164280 111803 -138601 -132358 -128869
7626 -128869 16556 -103532 -27076 194255 101572 -132335 -42520 389494 -104053 42035 -139327
7614 227205 131826 49946 -13147 -344304 -313696 -148618 76359 63781 -35963 -261777 31969
7602 -198180 16591 -108587 285348 -60806 -3839 -409 54942 -249254 271585 -104190 237500
7590 -84190 -187786 79454 -399500 -139964 -61795 -70177 -47933 2763 -117942 -48684 67332
7578 -195755 -75006 -58327 101818 -87909 -41132 -465954 240247 46915 -133646 -7109 20862
7566 -140146 72512 -313682 182155 -71145 216163 -44351 -286041 -185524 207184 -364524
7555 34105 -208795 44982 -126420 -92204 180601 -71416 -191111 -177079 -192629 73914 189332
7544 189332 -45208 -146663 191800 118477 -132896 69159 22321 -98378 -30561 -207643 40670
7532 -245131 1100 -150680 119133 -539 99328 -169026 141034 -31695 101950 -26121 247486
7520 13486 -273134 -269774 -129832 173073 -26236 85149 -157860 -78332 -65970 -417447 -186048
7508 -15146 39234 154678 94301 182949 69667 90779 -384670 -36768 172821 -239699 -275438
7497 -275438 -111458 89567 -51383 -36944 127235 173926 -222131 264739 190574 -13621 -467111
7486 -467111 293336 372834 83791 -73770 -104172 199864 90363 291466 50679 -199550 -238983
7475 -238983 258945 -35427 240232 106161 -418858 -135290 -12854 -109655 13368 308532
7465 308532 -94316 -9188 -71617 -35719 45477 -94644 59886 -127785 6332 180673 -224583
7453 361221 -144329 147126 217162 53090 -120028 122118 -44322 115923 241646 46797
7442 -263212 -95067 32946 -55265 87093 181979 -32033 272752 224019 55085 -134615 -52176
7430 -86433 49394 -200 -261032 -127160 -160163 -262736 -405317 -304894 -249281 -45284 -35983
7419 -35983 111804 95259 -12846 -97051 -137637 -233496 -319946 -279278 -119442 203355 -71433
7407 -127579 -51950 181894 250386 -32806 16392 -46757 97110 -10833 -66485 -245999 42744
7395 93577 241267 38552 103552 -91359 -322018 68870 -281187 -51852 -31851 -155640 -90836
7384 -90836 178694 231911 -122604 113994 344157 98870 -156761 -112568 -120929 -239845 -232302
7373 -232302 323476 47465 149978 -45223 131162 26814 -219134 -29200 141847 -41258 224669
7361 -140283 113685 242793 216206 -176621 114219 76664 388122 -458515 206046 -104058
7350 -340911 -6910 -232857 -284579 -102542 64461 -90238 -72956 -159825 209981 -59235 42369
7338 31664 -45346 8719 247818 -87106 -51910 -148470 196033 -37537 9789 106204 -227578 -205108
7326 -205108 -203373 -29628 110501 42234 79278 188918 165924 192451 -57869 -344760 -188575
7315 -188575 123101 -30799 18363 141255 236971 -212429 -76999 57279 19121 371906 36590
7303 -47668 -206307 -186359 48967 36921 -257192 140456 231600 -42044 -183899 143675 -171974
7291 121846 -27134 -31945 41440 -32528 208991 -35697 -15097 -36119 -172369 55077 98362
7280 98362 188450 175230 -69082 -24837 -232026 -299898 -118616 -223610 -184768 -48331 481741
7268 195210 56265 -268594 -342385 -37013 -198118 3095 -64546 155699 -105538 -4202 -128068
7257 -128068 106061 82087 55744 -121997 -339505 -282881 148956 -260395 -201751 -346846
7247 -346846 -136402 3491 271962 158167 47208 139608 95764 -13013 -52119 27012 -226029
7235 83662 3541 -231408 34813 31875 -76525 54226 131637 -76809 143967 -4577 -108552 -38813
7222 -53080 -5585 258992 -269747 -297195 -230307 124250 -53242 56306 -8888 80993 -53317 -122491
7210 -122491 -191125 239621 -144150 -9137 96320 -74728 183326 128158 11161 -369775 -53931
7198 -214529 -181401 -299698 261149 37528 -260974 -211488 -51278 -124327 -141856 107086 -170740
7186 -22261 -32372 -57250 -142009 263084 45558 109139 20676 -242036 247660 -102455 108298
7174 90952 -8295 -197153 -69111 35157 85301 185079 215834 -119339 -13486 -64816 -166275
7163 -166275 -19654 -43849 193537 -128226 71167 142080 -149944 255759 123991 -324883
7152 -62461 -133775 331159 -18384 -111048 208030 -15856 -154652 -62931 7052 -94668 -265262
7141 -265262 207186 58701 -146171 20907 -150804 -361816 -43711 33959 53511 194539 -156414
7129 104511 328650 -361858 134363 -92216 -232475 -176087 -217059 -231096 -201655 -13924 -26310
7118 -26310 138764 220744 650 101711 -77935 -197288 -360828 -125399 -376748 -301376 173408
7106 -337000 -88095 -50609 56052 74615 -180617 -110578 48834 144383 -321743 -287409 80239
7094 56082 -31204 -270026 18455 12655 -154496 -115894 -159340 232134 82107 -21598 -37355
7083 -37355 -136911 124740 -212420 -176075 139904 40288 118100 228863 61588 -52998 23918
7071 -334965 -827 -226004 246995 -67947 360422 126832 35675 92054 -134960 -214075 -60738
7059 -227544 -16711 -283718 41143 101430 151929 145525 68722 -13766 -63446 2924 -41620 -86823
7047 -86823 -370857 -247761 17869 -113346 261715 444875 181037 -223550 -137107 -288566
7037 -288566 158150 -243116 -172092 -83079 114650 133307 -52310 -222355 190100 197481 -126329
7025 -30882 237309 10089 -19835 -266503 114804 -164554 32936 -181553 -102444 -23628 17860
7013 -223932 155410 115656 82962 -257411 30198 -21395 -26425 89937 -1412 -232181 -358889
7002 -358889 106930 42304 70231 -400036 116738 -43332 -135735 153267 -165199 -312209
6992 -312209 -1888 -134238 228047 -133074 6621 96188 205928 -156550 175645 177164 -102436
6980 -126960 -132921 42096 -99886 246157 -65104 135993 -68898 -41755 43872 -181848 257945
6968 42604 -269065 -232906 -163266 92236 -86925 26913 -65001 -13465 -119925 200376 -43959
6956 152862 -272151 45634 140102 49493 -219080 -9707 152990 -287453 53258 38884 -153061
6944 3723 -81756 -78095 30152 108566 195531 -55002 -140846 -76514 -28698 238565 29063 -94728
6931 -13885 321942 60316 21447 267719 155549 104947 165254 -36393 149309 -165547 -501056
6920 -501056 151802 -102832 -239457 51428 -61029 202043 -21222 139625 130151 -145865 135671
6908 86268 139999 -232410 -30600 181671 119142 -117693 -171055 -124734 -412744 -50100 77774
6896 91044 78711 -4043 464209 38184 63056 446141 25489 -115422 173451 175771 115339
6885 115339 48051 65406 -42539 172133 -18009 109584 99578 88248 -407402 -231968 -31444
6873 354084 95147 -128293 22166 -170219 -5671 59774 23135 -10324 176069 -95551 -336289
6862 -336289 -177849 -326851 -36971 -45977 88487 -12744 -52609 -173651 2215 34275 -136692
6850 152194 141458 -232040 17136 -49480 130384 -86849 37851 -14094 -162065 -276012 -15743
6838 -115425 83958 -240424 -89608 59672 90785 -53444 -120074 -23215 -211729 24761 608 -26545
6825 123363 40562 -186523 -139819 -34861 -232400 20709 95834 1048 -129110 -192450 -69855
6813 229028 -22513 -20020 -222047 8742 -160964 -269197 65159 160106 234929 139904 67098
6801 124059 148950 -129924 -48888 -126489 -159899 -27076 -112847 16582 -59363 166888 286668
6790 286668 -240069 146919 131060 -57438 429392 164572 32745 -324441 -210501 -46724
6779 -39551 144711 -205676 -103842 86900 -171153 33683 -123959 -73541 338864 -133119
6768 -53299 -66796 -223430 -97296 -308565 195916 361575 191342 93133 -15075 -142808 130778
6756 63538 -371011 163219 105919 214138 -49458 -76084 134065 -365552 -265760 -81905 -8631
6744 6677 -67371 205024 -78008 -392888 -141001 -170966 92350 -33438 86076 126220 338627
6733 338627 8991 -77208 4806 43590 73320 255838 -327469 -72716 170158 -78000 197660
6721 37724 -77050 51238 -300157 -94683 -33106 -187335 -57483 -28730 95576 6487 -27056 142074
6708 -71625 -137050 11129 -127924 13013 11123 -78470 258 47416 -324982 -329368 -115360 -130747
6696 -130747 -27721 -279802 15873 -314015 -96232 26476 -233181 40732 -304653 -142003 31546
6684 -194989 74100 -16380 -156117 -448257 -496023 150627 -46684 216770 5624 96261 -211103
6672 -9404 -110171 -41589 33327 -3150 45929 -29253 -140354 -221833 -326676 327512 -296835
6660 41693 -44875 -195352 -345677 -32593 -53441 -31349 -57510 -34388 239323 -313817 101905
6648 -187658 143095 -42835 255819 -60786 12089 -151861 -35573 109040 20209 -119928 -126896
6637 -126896 150428 142328 361370 1392 67801 4549 73167 -97341 46654 -72948 135292 -42667
6624 -140301 -75287 -11729 -7763 182409 -55889 318695 123900 99489 -324124 -322973 18276
6612 102743 -185438 -96091 -231392 -162260 -66348 -171541 -15858 -164850 -63808 403318 68088
6600 107495 155275 49418 -62617 -211056 18585 183811 -260619 164266 -324136 -48162 121039
6588 79305 471526 141434 62848 -199933 -6533 -144878 -280278 -129694 -5756 265197 26140
6576 -21760 -49631 -51978 -73812 -48576 -83236 -155697 30209 -76612 -29185 -152550 109166 -75393
6563 -99879 -71495 -134438 -128000 23420 -30236 66236 69513 312282 -16419 -95509 -14322 -232144
6551 -232144 -43227 49194 -145142 -293501 -67533 -149778 218178 -307796 341858 -284312
6540 104740 -46544 205418 55065 87104 -90809 -87159 148784 -398467 -155495 159611 76539
6528 -125952 -30114 -130317 26044 -169892 -3143 -116197 -311514 -133503 -97216 98094 42902
6516 183032 171362 -63301 -183617 39244 205877 70798 137233 -406470 -242269 33072 -45071
6504 185425 38301 103503 94399 -42759 -175219 3075 207812 70873 112744 194905 16539 -109267
6491 110565 306927 -73622 -207589 -50817 69357 -48905 47362 -15281 -221239 111405 -3022
6479 216859 -57959 -335079 1201 2380 21374 164591 -58743 -149106 34640 90686 -107516
6467 -40507 -77809 206057 11772 181131 365657 236850 261499 13047 225586 -131155 -213043
6456 -213043 -40840 -47803 -19214 -125204 66995 -2629 32801 -342310 153271 207454 -83741
6444 -194277 -50521 -113560 164308 103794 -73179 -14548 -63727 -53336 91527 86151 12833 30941
6432 30941 67167 308966 13833 154883 -85398 -50768 30202 -118304 -164308 -165700 -80999
6420 -144831 56471 -114307 -415225 -48428 -71737 -23148 288811 132049 -59613 -23791 -32602
6409 -32602 -26864 -192109 29518 115654 304282 -18479 134144 96530 -21202 503997 -51147
6397 233533 -285247 -11966 99284 -170652 -87187 -271530 -4915 -15128 -279138 65210 -12194
6385 103364 35812 -3057 -78961 -205732 -369107 -107217 183272 119804 -6918 -180186 82106
6373 -38030 -10534 -119043 -31575 -210802 -135320 -13056 -198477 -57413 -216459 -205122 -141694
6362 -141694 -293462 -26160 -164172 -156625 19114 8800 -42100 -41575 -133884 -20363 -59466 355739
6349 -27708 -261880 110445 -31529 14785 136810 -107413 -15961 -219034 -217177 -275046 168637
6337 -91674 -259245 -31170 -202972 87870 2332 266077 199913 -37510 -12629 -620748 43670
6325 -9388 64423 -184854 129730 258816 47446 138035 -144190 164847 -97885 86206 262905
6314 262905 -72490 -261689 232082 -23494 176063 190376 119149 143044 48547 -129524 -172079
6303 -172079 -36704 -180713 304780 308770 -102282 281368 362286 104540 34238 -145008 -284501
6292 -284501 151886 -112784 -157680 303604 -251630 283131 138495 -103025 -95481 -139670
6282 -139670 91206 27924 -469713 309710 10795 -123643 100940 -12158 20587 -116803 -84899
6271 -84899 -2201 183267 -38110 -114591 -62909 -35065 71459 -100068 91943 294822 -202817
6259 -30249 271930 -433827 82138 -25080 228565 92262 -8179 -88139 -153881 -37223 45096
6247 -105635 207850 82012 199022 -75560 -384740 -218235 1651 -11585 -102404 51944 33935
6236 33935 -175062 77487 -127144 -101110 185304 75040 -150866 457751 -14928 189998 127177
6225 127177 51021 -127586 -211188 158716 140640 13240 74060 -102033 112035 56376 -1117
6213 -183915 -21803 -30774 -218562 -28952 -285210 -404059 240255 224473 -318462 -115005 244145
6201 -99954 119590 51849 107050 513840 291627 323521 -80370 260436 241740 -247601 140290
6189 -109909 305451 110530 -265073 -26262 -88293 83807 -318182 -187024 -13791 -134130
6179 -134130 139086 -65428 155838 -191412 -175523 -135510 91637 81637 129888 45013 -89721
6167 239624 -12149 306046 -74590 -26539 201256 -3392 -47534 -208250 -100673 119531 207934
6156 207934 -99622 -125273 233858 -177553 -37171 23973 31608 -79572 6979 171459 -24703
6144 152975 75272 136122 -159776 -80570 -107956 140623 13340 -202139 -305395 -154176 -222289
6133 -222289 -69862 -138997 40961 2321 -122523 79035 -362066 138007 -82044 -989 -137744
6122 -137744 3129 216765 -221915 -101411 -256612 89077 388602 80347 225648 38879 -153915
6110 -238227 -87062 163396 -201197 93261 -10877 -123282 -22018 45146 -8718 139012 101581
6099 101581 130570 40267 412350 -203611 -70174 34813 -97371 -220511 -63168 -265139 -294346
6088 -294346 -113838 114502 171454 -173234 -255211 -212197 -264750 -473565 53741 121534 -37884
6076 -217316 343730 74274 11962 32878 154847 87139 62977 129108 -78663 72705 -453984
6064 27819 -102127 -209615 18917 168410 157716 31196 -197975 57809 109320 100423 66758
6053 66758 -206460 71410 -225916 -31637 -70236 -262227 13149 -157744 87099 -206292 197020
6041 -133497 219456 -81892 -329962 -143147 -268687 189135 -240584 13494 -314608 106477
6030 103570 -19703 -250365 131640 -398276 -110309 -59663 -63117 130640 -161730 -181817 67352
6018 -74691 -63088 148824 162905 -182247 40166 246784 -265026 -57315 668 331799 105172
6006 71196 20480 59591 124283 215573 254688 -81533 -83388 -100841 24946 -17975 61141 -16086
5993 -57381 117864 31750 25532 -66148 188306 -390835 -126156 -271024 139184 116566 -136727
5981 -44885 107017 248890 -225500 -55641 -7621 -66280 -147387 -286592 -210901 81173 -285614
5969 51789 41120 162708 217146 56834 -24424 -69387 -36198 83086 153543 60677 246391
5958 246391 69757 -25764 -104054 178343 -80314 1519 -76480 -12274 9962 -10712 -88891 -268781
5946 -268781 45429 380958 -199038 172318 -242048 -126676 -118559 -83306 123014 -90219 -82733
5935 -82733 -196128 -28090 303008 -495 -178605 -109646 127963 439796 -42930 585 18154 189918
5923 189918 -82075 -77004 -120422 -122165 -104725 -52803 117864 -89301 477048 131691 261066
5912 261066 249872 168173 -114149 -64333 -10667 -197734 81348 -22951 -104273 164178 45860
5900 -90340 42135 208418 -169886 -106088 -178786 -58328 -45920 215644 118040 -124135 -201763
5889 -201763 11948 105414 -68068 82169 -111994 -70563 264894 84903 -6813 -117175 321096
5877 115393 -132473 51963 51552 -16416 62198 -236785 -95686 218057 178708 324150 -28882
5865 36462 106781 289559 25480 47709 -51468 71259 18241 -7344 898 45360 382969 -26810
5852 135738 -131465 8144 94654 63004 137417 -14580 -68721 215020 6145 -13131 256017
5840 49445 -32346 14884 -157078 -62511 -171237 -43093 -89815 36313 -43461 -134453 -207366
5829 -207366 145063 94287 -230063 155715 -216205 -70220 -54206 -511667 -138636 346485
5818 67140 -31503 146854 4714 -305613 -159140 427566 -176740 -115580 -112638 -94026 166513
5806 66469 96549 191096 -193724 93982 228294 124156 173490 -252977 131008 -200465 -4663
5794 196516 -306181 -145379 -208135 -189906 10190 -149173 133941 125272 -314277 -102142 -273176
5783 -273176 -90081 68652 114841 116928 -14447 25871 -67709 -7217 -226177 -80087 -119979 -169402
5771 -169402 -5165 379740 -167895 24650 80915 180650 46912 -74000 220642 -159059 -107722
5760 -107722 -262890 155885 146419 86215 103476 -192713 138289 -182273 -251888 35804 -54860
5748 54846 -141168 255822 -337377 134401 115682 -64199 -31195 -115099 13090 40522 140246
5737 140246 -32456 -144354 194233 109511 35790 259471 -78301 3668 -65136 188564 -59969
5725 -122508 355551 -18303 -73509 154941 58904 166714 177833 -119399 4923 -308602 100404
5713 149964 -74799 235889 121080 237777 156135 -4205 163188 159840 221813 64482 55300
5702 55300 -165404 -85384 -34807 -197525 171681 -69083 -223047 59822 10237 177387 -59582
5690 71252 169771 248029 33981 76938 153119 14284 184954 -59918 -206078 -186567 -306044
5679 -306044 -46250 51019 129311 -24078 21012 -37520 61245 -193452 -71887 -214614 88353
5667 131003 128940 -167784 123684 -188295 -67422 16591 439496 -87308 -170971 -3495 -270327
5656 -270327 59450 -96563 6808 -164183 154485 -14066 12479 -12859 17076 -91130 188056
5644 319197 41718 135516 -442211 -185606 -4238 72372 -55167 259983 -77235 -58975 -336038
5633 -336038 -113664 110225 -172518 116598 -214698 -9777 -22466 -270881 -31494 -111002 -134630
5622 -134630 89104 -356701 8725 130730 -77809 44968 -432181 -97710 -74640 -256269 -187814
5611 -187814 -279624 279779 -10500 -64159 -165079 36250 -30196 -27770 45597 73772 263672
5600 263672 -249447 -4774 152884 272682 -78914 -176237 65888 83709 -330048 -154695 52393
5588 -4772 -238535 -136504 -178584 40747 -57276 295442 -139097 -42758 -127522 52605 -218806
5576 -159843 347394 -39733 -279410 -312103 -244440 125756 -19836 37672 -51879 47453 102803
5565 102803 -247895 263577 -2995 25350 52588 40681 31770 102197 -41710 -35800 -36019 170855
5552 -148975 -303289 -89586 -14303 -111041 182448 152776 -174683 87793 -85728 -102126 113681
5540 131550 -63718 -68614 301451 189669 56981 75500 57181 -207235 69903 12965 -25211
5528 248750 13076 -132788 -267690 -209205 240919 94441 14915 24096 -42554 189625 12910
5516 -62722 418888 154514 143266 -26758 141121 -121272 -240011 -175500 -118097 309792 97473
5504 33967 -309283 -274397 -77400 -74002 170655 310409 -211150 -80813 -297867 -53254 87833
5492 138375 189869 30277 81810 -152006 173334 -244896 38381 -35909 -150239 -116310 7798
5480 -46680 96334 206321 -153892 63856 199370 -114129 -214669 51012 55594 -142507 -335630
5469 -335630 -134693 122335 116096 124859 181835 -14334 193367 281251 179711 103462 -322621
5457 -90172 -85721 150437 279620 -211903 -173846 13762 398409 -9786 101250 160396 218848
5446 218848 64922 -234237 8485 -132725 -138450 -394106 92246 -272002 -92029 -176815 133140
5434 223723 427820 363051 -174583 102029 -328984 152025 193944 -134062 -11990 113639
5423 -287262 62654 -269625 218566 -172198 221469 -82462 210858 -130183 191638 62758
5412 -10551 85205 -125992 10662 -448979 -222206 123807 109518 494750 -149123 203520
5401 98776 -367471 -28794 133878 -109835 -228837 -103987 46000 259530 87515 -459377
5390 315451 -352516 -96778 20030 182685 -16607 103458 69927 -140708 -233929 276012 -136576
5378 -354843 113674 200472 -5290 -55467 138830 115790 -185280 88224 243359 -101708 98555
5366 -51950 271383 150300 -29794 187462 -128993 -74514 251694 -192002 -38400 -42573 14270
5354 -107770 -202673 90923 85530 224286 101323 185194 60136 -94197 -104879 36049 14875
5342 -369433 -171447 348269 -207035 72504 -388746 384208 24033 88538 437989 -176208
5331 -158358 -312360 216403 227274 -66269 -97382 64151 -125769 -312945 39451 -221726 -60648
5319 14595 137029 316316 165717 170541 -212756 25755 154372 -103618 -122138 -167042 -63248
5307 45057 -62990 301748 -275701 255648 45258 -35798 82000 57984 149149 400540 -43987
5295 -44915 121767 263048 -61824 74386 -356365 -68115 -123763 -144341 -57367 -68975 156638
5283 -30278 107530 -157292 117524 144591 -10084 2388 42681 -172399 -304502 -318220 111053
5271 -212026 229101 76607 -142297 63246 -154412 287115 -200362 -80992 -215527 -29408
5260 -124137 -429 -140803 146884 -92042 151218 327693 -128954 153702 17550 -77873 56844
5248 300405 -31890 88917 -45711 236774 10116 21339 17086 293840 15322 161188 142094
5237 142094 159883 266349 -61177 17015 159347 -60091 156288 35796 275628 43870 56602
5226 56602 -218276 -31260 165220 -126496 43549 210370 -91456 -22761 355177 46004 -119490
5214 259144 204759 -114520 46284 -26056 262323 -302307 87879 -175815 -226455 -66476 107299
5202 -175888 -118250 107644 62334 261322 134737 -239444 137256 124819 123181 -196590 -16084
5190 -136611 -274485 -223029 -117565 190179 -83331 90063 -185443 -173996 4814 24840 -11506
5178 -213578 132365 55351 55877 -21442 -114637 -149967 -1608 119815 42835 193713 147193 87209
5166 87209 237377 45230 -61784 -32309 -74201 97603 7794 -408126 438177 -173639 -21013
5154 -54835 -304558 -28831 181280 250112 143185 -91040 -183168 55002 221281 -19105 35114
5142 171742 4575 -158054 283516 200440 146870 100669 -179075 -138668 229435 12702 -51628
5130 -366670 262313 64293 121295 256876 -375303 166466 97906 -85064 24741 155934 -224571
5118 19994 -37275 81997 -10813 286039 99634 -96943 -5401 107656 -29333 -184571 45170
5106 -283178 227834 56194 -206897 8109 -12364 61759 -151040 360750 -87140 132989 251313
5095 251313 35985 167509 -170095 247010 53320 105571 -411225 -354436 -435927 64932 62337
5084 62337 -4720 -264374 -86277 5506 -143047 303360 -95371 92469 95622 -54887 -95292 94855
5071 127390 -18638 -434853 109987 92361 -228696 -26228 -56716 -27023 -150343 83900 71367
5060 71367 -179991 -40078 81395 -102382 90889 112676 -87164 -51337 175352 -149805 137058
5048 -204354 112237 -33765 5184 -32178 67716 -198272 -148741 65696 52788 265035 -135036
5036 44859 132637 -142073 -2536 89185 -25278 -81874 -192613 162320 -37616 75968 9037 -140967
5023 19294 51682 -273789 -138643 443295 -77153 -71816 96464 -249080 363618 -407639 143972
5011 292679 1682 374229 153677 -60477 -196859 -223557 -77712 -183443 364728 -134833 167670
4999 -163632 -61017 44458 14421 150905 -242669 86595 125055 192509 7523 111569 -70928
4987 -300423 162332 -194228 -82486 -215710 -67580 -212415 287850 -32995 -22800 -203538
4977 -203538 3098 -9525 -160305 -140123 -232481 47044 51956 -166301 -89619 -103882 96217 -81794
4964 -50784 128873 152170 -53840 -64039 -88191 -64248 324080 182835 55171 -153336 -134324
4953 -134324 126287 -85450 -60926 -108707 -14984 79356 -216588 75814 302014 -64941 -64673
4942 -64673 48240 -250760 193254 -146449 49795 92139 -5072 -140278 351406 207152 102720
4930 -290740 -187325 117091 -148901 -197605 8912 -239818 357617 -53955 -190610 -22789 16120
4918 39243 -368849 83763 -103144 -371745 136276 39589 22137 225664 68474 286926 -55098
4906 125415 23096 96882 -410949 74235 -109742 -144018 144077 115669 113004 73099 -374831
4894 28486 55349 -134336 52358 -74039 -46182 14056 -178194 -89567 54626 114922 111614 63399
4882 63399 12964 21609 384152 128655 -130554 -138631 -33116 59977 104855 -738 310869 -260792
4869 -22581 -160249 236501 -204719 75995 -35899 -115254 -35333 243103 296435 -4060 107503
4857 191255 124859 -16483 408300 -55477 -85495 220312 176177 77180 349517 146434 3338
4845 107067 96025 186925 160178 -209688 -197858 148517 -179904 333230 -179185 -333461
4835 -333461 225136 -242061 190919 47346 -147397 146958 252604 -56957 20668 -138573
4824 -95420 314385 262538 46156 -160996 45872 114275 161703 -19072 43518 -105785 -79072
4813 -79072 -14443 195490 131965 220060 -178353 26673 -199834 199191 -11638 112591 363928
4802 363928 -26935 -42456 42022 -35766 53933 -168527 54089 -117391 200170 45972 64283
4791 64283 -206787 -369331 -38355 307184 -306364 -228700 -27441 175094 -196970 166333
4780 77518 58784 -21618 -188195 166146 26544 176893 131175 87587 -147831 -102462 -83810
4769 -83810 -242970 11146 95606 10188 181132 -357435 271783 -239129 -16281 27489 -130221
4757 127047 -293726 45329 67863 -137292 -8489 -175204 29024 -187270 -118990 -91974 161085
4745 -108457 90383 90436 -6664 -126874 18931 -14621 11973 -188941 160968 92150 139190 -222202
4732 -94892 -245201 118944 -59249 55242 226592 -56476 -305573 -213560 -108051 -90941 -104036
4721 -104036 -251891 377693 -46282 -52501 -87861 109057 -159459 25731 119952 -106850 83697
4709 -58771 -149522 87294 -186673 268187 258664 -27897 31842 41543 198187 -262974 -32229
4697 179708 -118382 -345522 -330300 71595 39056 400568 121408 -188740 18598 198268
4687 198268 -45782 -568004 -157888 -5090 -229549 118207 35230 -19661 74152 214570 -22154
4675 375683 -236853 -109582 139294 97125 251111 121464 -47272 -144693 56279 290147
4665 290147 -288959 237713 -138446 -42260 116842 -11950 -326782 27375 4716 191358 -112215
4653 -448495 36280 -33439 -6022 -15198 -122992 109018 172654 366644 265050 -151745 296608
4641 -401951 -247193 35344 451270 -78944 -67744 171144 -273097 -40065 -224783 25084 -61392
4629 110572 -37057 206806 -190722 178763 -440975 167471 -26185 128095 -195089 -143632
4619 -143632 272776 72602 -171655 341266 -56698 -64435 15821 494325 -285444 -189934 330881
4607 -33270 222391 174307 229395 -46397 -515322 406628 84242 -263586 22513 -18988 93313
4595 7639 209706 145839 -262194 -232401 130257 -45281 -727 132540 -52984 15711 -8291 -206149
4583 -206149 -66761 137462 -75616 114013 1146 -197988 72288 -30977 -118969 111302 98366
4572 98366 364249 -31673 -35822 -129566 -350208 -42425 232775 -27625 -40055 108100 -7742
4560 146128 -22195 -12366 -267272 -235272 11596 -237664 33664 125012 -122328 193893 135478
4549 135478 95011 183410 316178 -10803 -118805 -46192 -106541 69309 -335183 -170585 -25006
4537 18082 -154366 -89926 117955 -371535 -180128 12237 -14880 -183947 -58596 -64468 88837
4525 21955 125967 12341 174140 79356 -7704 186256 -200122 -8753 204085 62738 195328
4514 195328 164867 -240193 179074 -50107 -150882 -207541 -38023 385291 -60003 105881 -179078
4502 44540 -52590 -17895 -11406 -74977 97444 -163587 83814 6702 -90714 -127697 167225 31970
$$ [...]
##END NTUPLES=NMR SPECTRUM
##END=
