##TITLE=AC1259_UGARH11076_6534370_Ws4MSD9MfT
##JCAMPDX= 6.0         $$ Bruker NMR JCAMP-DX V2.0
##DATA TYPE= NMR SPECTRUM
##DATA CLASS= NTUPLES
##ORIGIN= BRUKER
##OWNER= Administrator
$$ 1.72 TOPSPIN		Version 2.1
$$ 2013-07-18 14:10:16.322 -0700  Administrator@X
$$ Compression mode = diff/dup
##.OBSERVE FREQUENCY= 400.02188249412
##.OBSERVE NUCLEUS= ^1H
##.ACQUISITION MODE= SIMULTANEOUS (DQD)
##.ACQUISITION SCHEME= undefined
##.AVERAGES= 64
##.DIGITISER RES= 22
##SPECTROMETER/DATA SYSTEM= spect
##.PULSE SEQUENCE= noesygpps1d.comp
##.SOLVENT NAME= COFFEE_meoh
##.SHIFT REFERENCE= INTERNAL, COFFEE_meoh, 1, 14.96134
##AUDIT TRAIL= $$ (NUMBER, WHEN, WHO, WHERE, PROCESS, VERSION, WHAT)
$$ ##TITLE= Audit trail, TOPSPIN		Version 2.1
$$ ##JCAMPDX= 5.01
$$ ##ORIGIN= Bruker BioSpin GmbH
$$ ##OWNER= Administrator
$$ $$ E:\/data/COFFEE/nmr/AC1259_UGARH11076_6534370_Ws4MSD9MfT/12/pdata/1/auditp.txt
$$ ##AUDIT TRAIL=  $$ (NUMBER, WHEN, WHO, WHERE, PROCESS, VERSION, WHAT)
(   1,<2013-07-18 14:10:11.478 -0700>,<Administrator>,<X>,<go>,<TOPSPIN 2.1>,
      <created by zg
	started at 2013-07-18 13:58:41.462 -0700,
	POWCHK enabled, PULCHK disabled,
       configuration hash MD5:
       C8 4E 4E 5D D3 5C D8 9E 9F 52 82 E0 59 8A DE 15
       data hash MD5: 64K
       5C A9 53 BF DE 3C EB B6 20 53 67 13 DB 8D 84 CF>)
(   2,<2013-07-18 14:10:14.369 -0700>,<Administrator>,<X>,<proc1d>,<TOPSPIN 2.1>,
      <Start of raw data processing
       efp LB = 0.3 FT_mod = 6 PKNL = 1 PHC0 = 0 PHC1 = 0 SI = 128K 
       data hash MD5: 128K
       61 70 B4 16 C7 B6 D9 FD E0 2C 1D B0 83 A0 38 F7>)
(   3,<2013-07-18 14:10:15.322 -0700>,<Administrator>,<X>,<proc1d>,<TOPSPIN 2.1>,
      <pk PHC0 = -79.45862 PHC1 = 0 
       data hash MD5: 128K
       BE A4 79 37 16 AD 6D C4 A5 4B A9 9D D2 9F EE 9C>)
(   4,<2013-07-18 14:10:15.744 -0700>,<Administrator>,<X>,<proc1d>,<TOPSPIN 2.1>,
      <abs ABSG = 1 
       data hash MD5: 128K
       42 9C E9 CB 4C A1 00 F4 98 18 16 DB 3F 7C FB 4F>)
(   5,<2013-07-18 14:10:15.869 -0700>,<Administrator>,<X>,<proc1d>,<TOPSPIN 2.1>,
      <abs ABSG = 2 
       data hash MD5: 128K
       73 12 FB 00 F3 71 44 13 CE 72 8C 98 75 51 D6 84>)
(   6,<2013-07-18 14:10:15.947 -0700>,<Administrator>,<X>,<proc1d>,<TOPSPIN 2.1>,
      <abs ABSG = 3 
       data hash MD5: 128K
       98 34 0F 9D 05 2F AE 36 34 5A 62 DA 91 CF C9 83>)
(   7,<2013-07-18 14:10:16.041 -0700>,<Administrator>,<X>,<proc1d>,<TOPSPIN 2.1>,
      <abs ABSG = 4 
       data hash MD5: 128K
       9C F5 A5 E8 C4 93 33 AC 01 DF E8 D2 5C 6C D5 5C>)
(   8,<2013-07-18 14:10:16.103 -0700>,<Administrator>,<X>,<proc1d>,<TOPSPIN 2.1>,
      <abs ABSG = 5 
       data hash MD5: 128K
       C2 03 99 67 2E 3B E2 B5 FB B8 9B EE AF 65 BA A5>)
$$ ##END=
$$ 
$$ $$ hash MD5
$$ $$ 07 B4 A8 56 3B B3 B3 4D F0 29 64 00 72 A3 AA 5E
##$RELAX= 
##$RELAX= 
##$RELAX= 
##$RELAX= 
##$RELAX= 
##$RELAX= 
##$RELAX= 
##$RELAX= 
$$ Bruker specific parameters
$$ --------------------------
##$DU= <E:\>
##$EXPNO= 12
$$ [...]
##$TP07= 0
##$TPNAME0= <>
##$TPNAME1= <>
##$TPNAME2= <>
##$TPNAME3= <>
##$TPNAME4= <>
##$TPNAME5= <>
##$TPNAME6= <>
##$TPNAME7= <>
##$TPOAL= (0..7)
0.5 0.5 0.5 0.5 0.5 0.5 0.5 0.5
##$TPOFFS= (0..7)
0 0 0 0 0 0 0 0
##$TUNHIN= 0
##$TUNHOUT= 0
##$TUNXOUT= 0
##$USERA1= <user>
##$USERA2= <user>
##$USERA3= <user>
##$USERA4= <user>
##$USERA5= <user>
##$V9= 5
##$VALIST= <valist>
##$VCLIST= <CCCCCCCCCCCCCCC>
##$VD= 0
##$VDLIST= <DDDDDDDDDDDDDDD>
##$VPLIST= <PPPPPPPPPPPPPPP>
##$VTLIST= <TTTTTTTTTTTTTTT>
##$WBST= 1024
##$WBSW= 4
##$XGAIN= (0..3)
0 0 0 0
##$XL= 0
##$YL= 0
##$YMAX_a= 5859978
##$YMIN_a= -13223622
##$ZGOPTNS= <>
##$ZL1= 120
##$ZL2= 120
##$ZL3= 120
##$ZL4= 120
##$ABSF1= 14.96134
##$ABSF2= -5.596842
##$ABSG= 5
##$ABSL= 3
##$ALPHA= 0
##$AQORDER= 0
##$ASSFAC= 0
##$ASSFACI= 0
##$ASSFACX= 0
##$ASSWID= 0
##$AUNMP= <proc_prof1d_extract.lims>
##$AXLEFT= 0
##$AXNAME= <>
##$AXNUC= <1H>
##$AXRIGHT= 0
##$AXTYPE= 0
##$AXUNIT= <>
##$AZFE= 0.1
##$AZFW= 0.1
##$BCFW= 0
##$BC_mod= 0
##$BYTORDP= 0
##$COROFFS= 0
##$CY= 15
##$DATMOD= 1
##$DC= 0
##$DFILT= <>
##$DTYPP= 0
##$F1P= 0
##$F2P= 0
##$FCOR= 0.5
##$FTSIZE= 131072
##$FT_mod= 6
##$GAMMA= 0
##$GB= 0
##$INTBC= 1
##$INTSCL= 1
##$ISEN= 128
##$LB= 0.3
##$LEV0= 0
##$LPBIN= 0
##$MAXI= 10000
##$MC2= 0
##$MEAN= 0
##$ME_mod= 0
##$MI= 0
##$NCOEF= 0
##$NC_proc= -2
##$NLEV= 6
##$NOISF1= 0
##$NOISF2= 0
##$NSP= 0
##$NTH_PI= 0
##$NZP= 0
##$OFFSET= 14.96134
##$PC= 1
##$PHC0= -79.45862
##$PHC1= 0
##$PH_mod= 1
##$PKNL= yes
##$PPARMOD= 0
##$PPDIAG= 0
##$PPIPTYP= 0
##$PPMPNUM= 2147483647
##$PPRESOL= 1
##$PSCAL= 4
##$PSIGN= 0
##$PYNMP= <proc.py>
##$REVERSE= no
##$SF= 400.020009500957
##$SI= 131072
##$SIGF1= 0
##$SIGF2= 0
##$SINO= 400
##$SIOLD= 131072
##$SPECTYP= <>
##$SREGLST= <1H.CDCl3>
##$SSB= 0
##$STSI= 131072
##$STSR= 0
##$SW_p= 8223.68421052631
##$SYMM= 0
##$S_DEV= 0
##$TDeff= 65536
##$TDoff= 0
##$TI= <>
##$TILT= no
##$TM1= 0
##$TM2= 0
##$TOPLEV= 0
##$USERP1= <user>
##$USERP2= <user>
##$USERP3= <user>
##$USERP4= <user>
##$USERP5= <user>
##$WDW= 1
##$XDIM= 131072
##$YMAX_p= 437861493
##$YMIN_p= -11604
##$CURPLOT= <Network HP LaserJet P1505>
##$CURPRIN= <$Network HP LaserJet P1505>
##$DFORMAT= <normdp>
##$LAYOUT= <+/1D_H.xwp>
##$LFORMAT= <normlp>
##$PFORMAT= <normpl>
##$SURQMSG= 1
$$ End of Bruker specific parameters
$$ ---------------------------------
##NTUPLES= NMR SPECTRUM
##VAR_NAME=  FREQUENCY,     SPECTRUM/REAL,   SPECTRUM/IMAG
##SYMBOL=    X,             R,               I
##VAR_TYPE=  INDEPENDENT,   DEPENDENT,       DEPENDENT
##VAR_FORM=  AFFN,          ASDF,            ASDF
##VAR_DIM=   131072,        131072,          131072
##UNITS=     HZ,            ARBITRARY UNITS, ARBITRARY UNITS
##FACTOR=    0.0627417313425164, 1,          1
##FIRST=     8223.62146879497, 2544,         -59311
##LAST=      0,             3661,            -59681
##MIN=       0,             -11604,          0
##MAX=       8223.62146879497, 437861493,    0
$$ Real data points
##PAGE= N=1
##DATA TABLE= (X++(R..R)), XYDATA
$$ [...]
63887G98554m1063l5799l1480k8186k5467k2940k0728j9013j7620j6297j4941
$$ 798554 757491 721692 690212 662026 636559 613619 592891 573878 556258 539961 525020
63876E25020j3356j1326r249q023p828p604o379m585l287k560j529J55J844L013
$$ 525020 511664 500338 491089 483066 475238 467634 461255 456670 453383 450823 449294 449449 451293 454306
63862D54306M033N512P495R637J1686J3544J5197J6876J8893K1151K3217K5065
$$ 454306 458339 463851 471346 480983 492669 506213 521410 538286 557179 578330 601547 626612
63850F26612K7302L0305L3492L5865L7016L7179L6539L5051L2866L0492K8345
$$ 626612 653914 684219 717711 753576 790592 827771 864310 899361 932227 962719 991064
63839I91064K6313K3880K0604J6465J1909P440L142j300o016j0571j4447j7768
$$ 991064 1017377 1041257 1061861 1078326 1090235 1097675 1100817 1099517 1093501 1082930 1068483 1050715
63827A050715k1182k5025k8917l2165l4356l5478l5761l5595l5386l5254l4852
$$ 1050715 1029533 1004508 975591 943426 909070 873592 837831 802236 766850 731596 696744
63816F96744l3703l1769k9590k7768k6328k4745k2641k0322j8424j7110j5882
$$ 696744 663041 631272 601682 573914 547586 522841 500200 479878 461454 444344 428462
63805D28462j4260j2380j0773r712r023q430p840p352p074o939o655o008n277
$$ 428462 414202 401822 391049 381337 372314 363884 356044 348692 341618 334679 328024 322016 316739
63792C16739n041n417n817n728n389n269n174m534l429k621k482k537k330k040
$$ 316739 311698 306281 300464 294736 289347 284078 278904 274370 270941 268320 265838 263301 260971 258931
63778B58931j953j870j597j526k056k706k487j225R2M51m1m76l10J0k44j038j462
$$ 258931 256978 255108 253511 251985 249929 247223 244736 243511 243603 244054 244013 243537 243227 243237 242993 241955 240493
63761B40493q89J11M36j09o70o97o28q82j041o75l03n25p33J19J676K358J529
$$ 240493 239604 239715 240151 240042 239372 238675 238047 237165 236124 235449 235146 234621 233888 234007 235683 238041 239570
63744B39570K68l44n21p66o93K12J444K115K211K264K237J798J332J545K207K393
$$ 239570 239838 239494 238973 238207 237514 237726 239170 241285 243496 245760 247997 249795 251127 252672 254879 257272
63728B57272K034K102L019L953M114L832L749L810L700L692M196M914N166M779
$$ 257272 259306 261408 264427 268380 272494 276326 280075 283885 287585 291277 295473 300387 305553 310332
63714C10332M036L039J787O97L32N20M46l88j662k771l349l292k748k142j853
$$ 310332 314368 317407 319194 319891 320223 320743 321189 320801 319139 316368 313019 309727 306979 304837 302984
63699C02984j749j408p91k57O4M13Q41J038R21Q88J187J527J565J325Q45n3j185
$$ 302984 301235 299827 299036 298779 298843 299256 300097 301135 302056 302944 304131 305658 307223 308548 309393 309340 308155
63682C08155j673q62O65J649J620J236J243J720K360K931L234L154K954L134L739
$$ 308155 306482 305620 306285 307934 309554 310790 312033 313753 316113 319044 322278 325432 328386 331520 335259
63667C35259M238M262M095M062L931L310K394J743J431R37j24j614l244m846o071
$$ 335259 339497 343759 347854 351916 355847 359157 361551 363294 364725 365662 365538 363924 360680 355834 349763
63652C49763o356n565m431l929m262m776m834m402l748k995k201j565j188p61
$$ 349763 343407 337842 333411 329482 325220 320444 315610 311208 307460 304465 302264 300699 299511 298750
63638B98750P6J117J696J582J387J763K515K925K822K823L402M240M722M777M834
$$ 298750 298826 299943 301639 303221 304608 306371 308886 311811 314633 317456 320858 325098 329820 334597 339431
63623C39431N167N692O341P207Q229R085R549R870J0604J2133J4285J6403J7826
$$ 339431 344598 350290 356631 363838 372067 381152 390701 400571 411175 423308 437593 453996 471822
63610D71822J8562J9408K1223K3979K6759K8685K9635K9923K9659K8640K6601
$$ 471822 490384 509792 531015 554994 581753 610438 640073 669996 699655 728295 754896
63599G54896K3303J8581J2680O447Q36l704p129r319j0201j0291j0504j1224j2019
$$ 754896 778199 796780 809460 815907 816743 813039 805910 796591 786390 776099 765595 754371 742352
63586G42352j2495j2974j3980j5409j6630j7197j7067j6332j5113j3635j2012
$$ 742352 729857 716883 702903 687494 670864 653667 636600 620268 605155 591520 579508
63575E79508j0104p927n971m673l659k088K22K521M072M849N200N328N406N683
$$ 579508 569404 561477 555506 550833 547174 545086 545308 547829 551901 556750 561950 567278 572684 578367
63561E78367O104O253N984N750N879O014N709N293N550O788Q762J1296J4310J7375
$$ 578367 584471 590724 596708 602458 608337 614351 620060 625353 630903 637691 646453 657749 672059 689434
63547F89434J9908K1988K4371K7632L1705L6156M0182M2242M0505L4191K4195
$$ 689434 709342 731330 755701 783333 815038 851194 891376 933618 974123 1008314 1032509
63536A032509J2244J06j0320j7202j9981j9986j9090j8065j6742j5252j4198j3805
$$ 1032509 1044753 1044859 1034539 1017337 997356 977370 958280 940215 923473 908221 894023 880218
63524H80218j3906j4689j6609j9422k2133k4105k5458k6196k5788k4132k2084
$$ 880218 866312 851623 835014 815592 793459 769354 743896 717700 691912 667780 645696
63513F45696k0433j8859j6645j4022j2011j1089j0670r865q352o505n062m557
$$ 645696 625263 606404 589759 575737 563726 552637 541967 532102 523750 517245 512183 507626
63501E07626m731m710m024l230k997l045k664k035k084l031m034m460m630m874
$$ 507626 502895 498185 494161 490931 487934 484889 482225 480190 478106 475075 471041 466581 461951 457077
63487D57077m733l791k613k036j933j503n00N45J255J773K261K717L315M194M821
$$ 457077 452344 448553 445940 443904 441971 440468 439968 440513 441768 443541 445802 448519 451834 456028 460849
63472D60849M295K621J006M53N24L3j434l240m647n436n714n676n659n945o331
$$ 460849 465144 467765 468771 469224 469748 469781 468347 465107 460460 455024 449310 443634 437975 432030 425699
63457D25699o299n706m997m543m149l415k372j372n56K51J137J979K720L467M245
$$ 425699 419400 413694 408697 404154 400005 396590 394218 392846 392290 392541 393678 395657 398377 401844 406089
63442D06089M910N425O003O825P785Q705R624J0737J2155J4072J6968K1309K6836
$$ 406089 410999 416424 422427 429252 437037 445742 455366 466103 478258 492330 509298 530607 557443
63429E57443L2341L6181L7059L4500K8977K1729J4238P712L002P34J151L798P780
$$ 557443 589784 625965 663024 697524 726501 748230 762468 770180 773182 773916 775067 778865 786645
63416G86645J2416J7369K2203K6300K9367L1480L2309L0822K6244J9102J0887
$$ 786645 799061 816430 838633 864933 894300 925780 958089 988911 1015155 1034257 1045144
63405A045144K987l726q706j1873j3808j5160j5971j6013j5667j5760j6603j7941
$$ 1045144 1048131 1044405 1035699 1023826 1010018 994858 978887 962874 947207 931447 914844 896903
63393H96903j9816k2593k5825k7943k7647k5234k2101j9388j7451j6147j5023
$$ 896903 877087 854494 828669 800726 773079 747845 725744 706356 688905 672758 657735
63382F57735j3495j1330q912o737m887l186j634k83J031K449L781M736N314N747
$$ 657735 644240 632910 623998 617261 612374 609188 607554 607271 608302 610751 614532 619268 624582 630329
63368F30329O261P029Q093R101R626R972J1099J3346J5737J7212J8021J9220K1182
$$ 630329 636590 643619 651712 660813 670439 680411 691510 704856 720593 737805 755826 775046 796228
63355G96228K3430K5626K7771K9544L0331L0013K8944K7026K3567J8237J1532
$$ 796228 819658 845284 873055 902599 932930 962943 991887 1018913 1042480 1060717 1072249
63344A072249M204l030r164j3171j5037j5845j6504j6968j7039j7134j7811j9056
$$ 1072249 1076453 1073423 1064259 1051088 1036051 1020206 1003702 986734 969695 952561 934750 915694
63332I15694k0598k2386k4184k5249k5072k4099k3108k2146k0713j8677j6366
$$ 915694 895096 872710 848526 823277 798205 774106 750998 728852 708139 689462 673096
63321F73096j3817j0699o999l248J01L134O018Q253Q520N489q84q721j5265j8859
$$ 673096 659279 648580 641581 638333 638434 641568 647586 655839 664359 669848 668964 660243 644978 626119
63307F26119j9746j8993j7239j4927j2859j1658j0914r761q268p430p717q417
$$ 626119 606373 587380 570141 555214 542355 530697 519783 510022 501754 494324 486607 478190
63295D78190q555p909o828n746n128n386o337p104o913n862m669l915l723l929
$$ 478190 469635 461726 454898 449152 444024 438638 432301 425197 418284 412422 407753 403838 400115 396186
63281C96186m221m270l912l191k192j050j62K1l83o31k51K65P1r15j939k435k628
$$ 396186 391965 387695 383783 380592 378400 377350 377188 377209 376826 376195 375944 376209 376280 375365 373426 370991 368363
63264C68363k993l466l553l049k282j678j319j106j112j514k168k535k164j165
$$ 368363 365370 361904 358351 355302 353020 351342 350023 348917 347805 346291 344123 341588 339424 338259
63250C38259r3N03M10j95q30r85n57J1K24P7k1J72N16Q38J173J471J330L45j168
$$ 338259 338166 338669 339079 338884 338054 337069 336512 336523 336747 336824 336803 336975 337491 338329 339502 340973 342303 342648 341480
63231C41480k114j578J15J589J834J224Q56J154J633J904K160K485K427J803J292
$$ 341480 339366 337788 337903 339492 341326 342550 343406 344560 346193 348097 350257 352742 355169 356972 358264
63216C58264J557K200K379K205K556L612M501M559M154L923L960M143M563N120
$$ 358264 359821 362021 364400 366605 369161 372773 377274 381833 385987 389910 393870 398013 402576 407696
63202D07696N199M407L268K690K868L185L063K490J887J753K284L117L642L841
$$ 407696 412895 417302 420570 423260 426128 429313 432376 434866 436753 438506 440790 443907 447549 451390
63188D51390M473O079Q145R734J0623J1297J2073J2880J3824J5140J6520J7195
$$ 451390 455863 461942 470087 479821 490444 501741 513814 526694 540518 555658 572178 589373
63176E89373J6926J6342J5989J5585J4720J3738J3297J3335J3130J2369J1511
$$ 589373 606299 622641 638630 654215 668935 682673 695970 709305 722435 734804 746315
63165G46315J0890J0081Q581O699N174M026K373m08l835o998r742j2646j5892
$$ 746315 757205 767286 775867 782566 787740 791766 794139 793731 789896 782898 773156 760510 744618
63152G44618j8766k0457k0943k0787k0419j9874j9064j7953j6551j5028j3694
$$ 744618 725852 705395 684452 663665 643246 623372 604308 586355 569804 554776 541082
63141E41082j2643j1503r842p770n822m356l383k899k921l082k693j484m8Q15
$$ 541082 528439 516936 507094 499324 493502 489146 485763 482864 479943 476861 474168 472684 472636 473451
63127D73451R80R57J166J594K162K997M117N092N341M790M073L948M596N518O129
$$ 473451 474431 475388 476554 478148 480310 483307 487424 492516 497857 502647 506720 510668 515264 520782 526911
63112E26911O320O397O601O738O372N325M004L139L103L506L559K928K053J566
$$ 526911 533231 539628 546229 552967 559339 564664 568668 571807 574910 578416 581975 584903 586956 588522
63098E88522J522J487J286J379K228L491M192L834L126L261M555O095O878O865
$$ 588522 590044 591531 592817 594196 596424 599915 604107 607941 611067 614328 618883 624978 631856 638721
63084F38721O645O374N681M482L235K230J188j49j513k636l881n738p937r604
$$ 638721 645366 651740 657421 661903 665138 667368 668556 668407 666894 664258 660377 654639 646702 637098
63070F37098j0255j0136r644q970q387q274q562q521p541n925m562l936l620k824
$$ 637098 626843 616707 607063 598093 589706 581432 572870 564349 556808 550883 546321 542385 538765 535941
63056E35941j279N02J815K514L027L661M244M621N158O270P631Q370Q156P571
$$ 535941 534662 535164 536979 539493 542520 546181 550425 555046 560204 566474 574105 582475 590631 598202
63042E98202P346P601Q086Q656R235R475Q922P483N671M370M217N008N707N439
$$ 598202 605548 613149 621235 629891 639126 648601 657523 665006 670677 675047 679264 684272 689979 695418
63028F95418M378L342K585J638L63o17r77j385k562m093n014n159n214n578n944
$$ 695418 699796 703138 705723 707361 707724 707107 706130 704745 702183 698090 693076 687917 682703 677125 671181
63013F71181o034n937n551m412k451l60J164K260L698N939Q727J1428J3653J5539
$$ 671181 665147 659210 653659 649247 646796 646436 647600 649860 653558 659497 668224 679652 693305 708844
62999G08844J7503J9740K2045K4204K6282K8244K9589K9808K9089K8097K7155
$$ 708844 726347 746087 768132 792336 818618 846862 876451 906259 935348 963445 990600
62988I90600K6123K5020K4119K3425K2680K1994K1794K1807K0892J8321J4661
$$ 990600 1016723 1041743 1065862 1089287 1111967 1133961 1155755 1177562 1198454 1216775 1231436
62977A231436J0878P076K681k577q470j4740k0970k6340l0229l3046l5723l8357
$$ 1231436 1242314 1249390 1252071 1249494 1241024 1226284 1205314 1178974 1148745 1115699 1079976 1041619
62965A041619l9947l9667l7845l5570l3722l2502l1459k9845k7320k4449k2148
$$ 1041619 1001672 962005 924160 888590 854868 822366 790907 761062 733742 709293 687145
62954F87145k0628j9319j7887j6746j6301j6251j6043j5603j5152j4607j3698
$$ 687145 666517 647198 629311 612565 596264 580013 563970 548367 533215 518608 504910
62943E04910j2532j1480j0542r349p938p046p219p954q131p276n982m956m116
$$ 504910 492378 480898 470356 461007 453069 446023 438804 430850 422719 415443 409461 404505 400389
62930D00389l073k099j911k458k707k044j224j325k280l089l239l021k664k064
$$ 400389 397316 395217 393306 390848 388141 386097 384873 383548 381268 378179 374940 371919 369255 367191
62916C67191j377j051j031p82l09l47j085j625j237m37p2K6N30J321J670J497
$$ 367191 365814 364763 363732 362950 362641 362294 361209 359584 358347 357910 357838 357864 358394 359715 361385 362882
62900C62882J465J828K112K030J957K236K722L204L740M302M636M742N027N697
$$ 362882 364347 366175 368287 370317 372274 374510 377232 380436 384176 388478 393114 397856 402883 408580
62886D08580O394O749O903P156P378P153O268M841L133J539N01O8l17j303k887
$$ 408580 414974 421723 428626 435782 443160 450313 456581 461422 464555 466094 466595 466663 466346 465043 462156
62871D62156m386n184n353n549o335p569q486q483p858p539q005q627q305o692
$$ 462156 457770 452586 447233 441684 435349 427780 419294 410811 402953 395414 387409 378782 370477 363785
62857C63785m620l251k925k910k337j228m56o79j628k494k788k571k101j559j027
$$ 363785 359165 355914 352989 350079 347742 346514 346058 345379 343751 341257 338469 335898 333797 332238 331211
62842C31211m30L61J156J395P82j88p65q54r46j230j382j215r91q96p17k41L80
$$ 331211 330781 331142 332298 333693 334475 334287 333522 332668 331722 330492 329110 327895 326904 326008 325291 325050 325430
62825C25430R00J245J362J161P74N45O05O99N77K48j65n06n36j83J34k2l43j28
$$ 325430 326330 327575 328937 330098 330872 331417 332022 332721 333298 333546 333381 332875 332339 332156 332290 332268 331925 331797
62807C31797N98J031Q75P89J169J334O27l69n59J90J110J672J879J678R77J49
$$ 331797 332395 333426 334301 335090 336259 337593 338220 337851 337292 337482 338592 340264 342143 343821 344798 344947
62791C44947k44k76n30j074j247o01M64J272J631J826K142K606L074L442L802
$$ 344947 344703 344427 343897 342823 341576 340975 341439 342711 344342 346168 348310 350916 353990 357432 361234
62776C61234M251M585M382L657L098L350M283N237N648N243M060K678K013K296
$$ 361234 365485 370070 374452 378109 381207 384557 388840 394077 399725 404968 409028 411706 413719 416015
62762D16015K628K107J039L51K39R5l96r73j483k047k579k848l004l339l652l581
$$ 416015 418643 420750 421789 422140 422379 422474 422078 421105 419622 417575 414996 412148 409144 405805 402153 398572
62746C98572l472l973m847n116m524l849l551l163k347j598j351j280r97p39p80
$$ 398572 395100 391127 386280 381164 376640 372791 369240 366077 363730 362132 360781 359501 358504 357765 356985
62731C56985q83q34q85j128j055l63M38Q26J058J581K188K506K777L396M055M144
$$ 356985 356102 355268 354383 353255 352200 351837 352275 353101 354159 355740 357928 360434 363211 366607 370662 374806
62715C74806L755L571L890M436N002N696O643P859R311J0750J1776J2427J3299
$$ 374806 378561 382132 386022 390458 395460 401156 407799 415658 424969 435719 447495 459922 473221
62702D73221J4661J5992J6938J8211K0688K3996K6897K8927L0750L2963L5414
$$ 473221 487882 503874 520812 539023 559711 583707 610604 639531 670281 703244 738658
62691G38658L7809M0280M3038M5923M8465N0055N0067M8260M4960M0533L4840
$$ 738658 776467 816747 859785 905708 954173 1004228 1054295 1102555 1147515 1188048 1222888
62680A222888K7671J9430J0824K068o942j5821k3802l0628l6603m1732m5560m7917
$$ 1222888 1250559 1269989 1280813 1282881 1275939 1260118 1236316 1205688 1169085 1127353 1081793 1033876
62668A033876m9136m9381m8484m6575m4242m1780l8920l5535l2067k8982k6303
$$ 1033876 984740 935359 886875 840300 796058 754278 715358 679823 647756 618774 592471
62657E92471k3898k1736j9664j7425j5180j3430j2235j1004r400p888p037o833
$$ 592471 568573 546837 527173 509748 494568 481138 468903 457899 448499 440611 433574 426741
62645D26741o948p207p375o951n741m325l462l206k920k079p56M86J061Q51L55
$$ 426741 419793 412586 405211 398260 392519 388194 384732 381526 378606 376527 375771 376257 377318 378169 378524
62630C78524Q8q5o67j675k641l421m181m557l788k119j065j589k761l087k459
$$ 378524 378612 378527 377860 376185 373544 370123 365942 361385 357597 355478 354413 352824 350063 346976 344517
62615C44517j867j712j541j160r31r40q48o32o78j009j193j106j087j150q25q2
$$ 344517 342650 340938 339397 338237 337306 336366 335518 334886 334208 333199 332006 330900 329813 328663 327838 327756
62599C27756L25j33r27j135n19M07J056J131O50J04K69J401K715L078K253J142
$$ 327756 328081 327948 327021 325886 325367 325774 326830 327961 328611 328715 328984 330385 333100 336178 338431 339573
62583C39573P51J234J963K355K353K222K017J516O23l28r27j153j333j610j784
$$ 339573 340324 341558 343521 345876 348229 350451 352468 353984 354607 354279 353352 352199 350866 349256 347472
62568C47472j703j566j631j840j906j727j501j486j718k027k161j908j154M2J329
$$ 347472 345769 344203 342572 340732 338826 337099 335598 334112 332394 330367 328206 326298 325144 325186 326515
62553C26515K181K314J993J725J627J342O97J20Q9L84L52j36l74K87J620K758
$$ 326515 328696 331010 333003 334728 336355 337697 338394 338514 338603 338987 339339 339203 338829 339116 340736 343494
62537C43494L126K870K487K250K151K154K371K824L220L141K530J822J567K041
$$ 343494 346620 349490 351977 354227 356378 358532 360903 363727 366947 370088 372618 374440 376007 378048
62523C78048L154M575N828O545O754O843P140P747Q790J0498J2802J5175J7124
$$ 378048 381202 385777 391605 398150 404904 411747 418887 426634 435424 445922 458724 473899 491023
62510D91023J8661K0061K1459K2961K4817K7006K8892K9824K9936K9804K9447
$$ 491023 509684 529745 551204 574165 598982 625988 654880 684704 714640 744444 773891
62499G73891K8215K5692K2163J8116J3821R538N632K278n98k905m306m648m126
$$ 773891 802106 827798 849961 868077 881898 891436 897068 899346 898748 895843 891537 886889 882763
62486H82763k901r88J379L791O165Q802J1692J4355J6354J7457J7040J4288R480
$$ 882763 879862 878874 880253 884044 890209 899011 910703 925058 941412 958869 975909 990197 999677
62473I99677M353L62k854o647j1507j6936k2602k8415l3610l6942l8128l8198
$$ 999677 1004030 1004392 1001538 994891 983384 966448 943846 915431 881821 844879 806751 768553
62461G68553l8097l7747l6775l5312l3491l0922k7361k3411j9944j7075j4354
$$ 768553 730456 692709 655934 620622 587131 556209 528848 505437 485493 468418 454064
62450D54064j1648r274p438o133n385n071m595l438k080j646k439l378l241k060
$$ 454064 442416 433142 425704 419571 414186 409115 404520 401082 399002 397356 394917 391539 388298 386238
62436C86238q87m80o62q77r28j011j234j302q65p8L51o8r87j614j665j481j319
$$ 386238 385351 384871 384209 383332 382404 381393 380159 378857 377992 377914 378265 378197 377210 375596 373931 372450 371131
62419C71131j080q37r83j489j653j092m70n01o70O6J465J996Q72q34j610j285
$$ 371131 370051 369214 368231 366742 365089 363997 363527 363026 362356 362422 363887 365883 366755 365921 364311 363026
62403C63026p23l79P1Q76J723K137J936J355R92J444K660L841M320M300M426M911
$$ 363026 362303 361924 361995 362871 364594 366731 368667 370022 371014 372458 375118 378959 383279 387579 392005 396916
62387C96916N563O275O936P157O769O426O958Q171R055R244R453J0282J1304J1670
$$ 396916 402479 408754 415690 422847 429616 436042 443000 451171 460226 469470 478923 489205 500509 512179
62373E12179J1068R831Q615Q187Q975J0531J1917J2804J3642J4695J5727J6887
$$ 512179 523247 533078 541693 549880 558855 569386 581303 594107 607749 622444 638171 655058
62361F55058J8955K2145K5568K8566L1810L6201M1408M6411N0904N5014N8149
$$ 655058 674013 696158 721726 750292 782102 818303 859711 906122 957026 1012040 1070189
62350A070189N9400N8908N7502N5001N0086M2149L2237K1820J1624K064o222j2961
$$ 1070189 1129589 1188497 1245999 1301000 1351086 1393235 1425472 1447292 1458916 1460980 1454758 1441797
62338A441797j8684k3987k8831l2960l6430l9267m1161m2004m2216m2059m1124
$$ 1441797 1423113 1399126 1370295 1337335 1300905 1261638 1220477 1178473 1136257 1094198 1053074
62327A053074l9082l6509l4325l2762l1445l0159k8977k7861k6713k5608k4555
$$ 1053074 1013992 977483 943158 910396 878951 848792 819815 791954 765241 739633 715078
62316G15078k3241k1588k0184j9532j9041j7586j5040j2484j0849r963r159q224
$$ 715078 691837 670249 650065 630533 611492 593906 578866 566382 555533 545570 536411 528187
62304E28187p369o652n853m787l510k274j302n71J98J154K115K865L523M220M637
$$ 528187 520818 514166 508313 503526 500016 497742 496440 495869 496067 497221 499336 502201 505724 509944 514581
62289E14581M352L585L100L207L407L192K761K642K909L118K870K202J550J497
$$ 514581 518933 522518 525618 528825 532232 535424 538185 540827 543736 546854 549724 551926 553476 554973
62275E54973K317L603M547M747M631M884N654O624P606Q808J0470J2553J4817
$$ 554973 557290 560893 565440 570187 574818 579702 585356 591980 599586 608394 618864 631417 646234
62262F46234J7051J9193K1417K4118K7657L1950L6427M0563M4445M8679N3500
$$ 646234 663285 682478 703895 728013 755670 787620 824047 864610 909055 957734 1011234
62251A011234N8164O1401O2488O1579N8897N4020M6349L6008K4003J1597j19j0319
$$ 1011234 1069398 1130799 1193287 1254866 1313763 1367783 1414132 1450140 1474143 1485740 1485621 1475302
62239A475302j8752k6037l3025l9674m4957m8159m9808n0940n1826n1857n0558
$$ 1475302 1456550 1430513 1397488 1357814 1312857 1264698 1214890 1163950 1112124 1060267 1009709
62228A009709m8158m5140m1736l8060l4443l1264k8505k5701k2544j9381j6925
$$ 1009709 961551 916411 874675 836615 802172 770908 742403 716702 694158 674777 657852
62217F57852j5461j4607j3855j3027j2022j0561q591o736n747n633n776n777n608
$$ 657852 642391 627784 613929 600902 588880 578319 569728 562992 557245 551612 545836 540059 534451
62204E34451n040l757k150j200j230j446j102l95K49J018K190L434M419N569P290
$$ 534451 529411 525654 523504 522304 521074 519628 518526 518131 518380 519398 521588 525022 529441 535010 542300
62189E42300Q927R525R396R773J0972J2027J2337J2514J3196J3969J4132J3771
$$ 542300 551227 560752 570148 579921 590893 602920 615257 627771 640967 654936 669068 682839
62177F82839J3459J3345J3139J2656J1907J1031J0516J1050J2788J5113J7619
$$ 682839 696298 709643 722782 735438 747345 758376 768892 779942 792730 807843 825462
62166H25462K0831K5424L1098L6851M2072M6710N0618N3375N4675N4234N1408
$$ 825462 846293 871717 902815 939666 981738 1028448 1079066 1132441 1187116 1241350 1292758
62155A292758M5672L7542K8415J9272J0136R45p654j4875k0711k5796l0557l4895
$$ 1292758 1338430 1375972 1404387 1423659 1433795 1434740 1427086 1412211 1391500 1365704 1335147 1300252
62143A300252l8630m1744m4174m5530m5336m3493m0527l7284l4284l1394k8239
$$ 1300252 1261622 1219878 1175704 1130174 1084838 1041345 1000818 963534 929250 897856 869617
62132H69617k4870k1788j9332j7271j5163j2929j0878r331q370p849p444o697
$$ 869617 844747 822959 803627 786356 771193 758264 747386 738055 729685 721836 714392 707695
62120G07695n390l843k658k021j442l85R85J977K316K589L559N221O799P682Q105
$$ 707695 702305 698462 695804 693783 692341 691956 692941 694918 697234 699823 703382 708603 715402 723084 731189
62105G31189Q832J0323J2434J4685J6568J7497J6755J3884R304M357N13j506j754
$$ 731189 740021 750344 762778 777463 794031 811528 828283 842167 851471 855828 856341 854835 853081
62092H53081m50K143N167P041O513L705j56l788o285o930n426k402R90M169P327
$$ 853081 852631 854774 859941 866982 873495 877200 877044 873256 866971 860041 854615 852213 853203 857372 864699
62077H64699J0501J3262J5519J7819K0416K2725K4234K5258K6201K6769K6748
$$ 864699 875200 888462 903981 921800 942216 964941 989175 1014433 1040634 1067403 1094151
62066A094151K6836K7647K8451K8169K7401K7986L0388L2804L3275L1578K8510
$$ 1094151 1120987 1148634 1177085 1205254 1232655 1260641 1291029 1323833 1357108 1388686 1417196
62055A417196K4419J9262J3338P122Q01n374j0765j5016j8640k2318k5972k9133
$$ 1417196 1441615 1460877 1474215 1481337 1482138 1476764 1465999 1450983 1432343 1410025 1384053 1354920
62043A354920l1807l4297l6476l7931l8620l8745l8207l6885l5282l4160l3503
$$ 1354920 1323113 1288816 1252340 1214409 1175789 1137044 1098837 1061952 1026670 992510 959007
62032I59007l2478l0472k7649k4482k1392j8818j7027j5684j4128j2271j0684
$$ 959007 926529 896057 868408 843926 822534 803716 786689 771005 756877 744606 733922
62021G33922r747r277r093r355r988j0414j0263r962j0082j0490j0550r971r004
$$ 733922 724175 714898 705805 696450 686462 676048 665785 655823 645741 635251 624701 614730 605726
62008F05726p959o897n779m620l487k426j341Q6K090M305N865O334O234O335O582
$$ 605726 597767 590870 585091 580471 576984 574558 573217 573303 575393 579698 585563 591897 598131 604466 611048
61993F11048O186M711K648Q17n14j725l243n024o601p575q006q291q709r217r641
$$ 611048 617234 621945 624593 625410 624896 623171 619928 614904 608303 600728 592722 584431 575722 566505 556864
61978E56864r860r720r029p855o629n746n234m982n049n456n812n616m823l744
$$ 556864 547004 537284 528255 520400 513771 508025 502791 497809 492760 487304 481492 475876 471053 467309
61964D67309k529j212k88m80j649k495k011p71j37l88l90P89K670M147M837N132
$$ 467309 464780 463568 463280 462800 461151 458656 456645 455874 455737 455349 454959 455748 458418 462565 467402 472534
61948D72534N307N295N265N799P328R703J2394J4801J6365J6908J7143J8377K1227
$$ 472534 477841 483136 488401 494200 501528 511231 523625 538426 554791 571699 588842 607219 628446
61935F28446K4704K7074K7583K7018K6550K6432K6063K4985K3404K1767K0072
$$ 628446 653150 680224 707807 734825 761375 787807 813870 838855 862259 884026 904098
61924I04098J7917J5036J1583P832L837l79m460p799j0037j1260j1734j1635j0964
$$ 904098 922015 937051 948634 956466 960303 959924 955464 947665 937628 926368 914634 902999 892035
61911H92035r457o566j971L721R209J3660J7330K0714K3511K4854K4301K2120
$$ 892035 882578 876012 874041 877762 886971 900631 917961 938675 962186 987040 1011341 1033461
61899A033461J8660J4070Q639K964k382p135j1280j4948j8315k1324k3597k4839
$$ 1033461 1052121 1066191 1074830 1077794 1075412 1068277 1056997 1042049 1023734 1002410 978813 953974
61887I53974k5232k5073k4221k2406k0018j8005j6925j6579j6552j6617j6514
$$ 953974 928742 903669 879448 857042 837024 819019 802094 785515 768963 752346 735832
61876G35832j5983j5273j4988j5200j5143j4172j2502j0646q643o380m215k636
$$ 735832 719849 704576 689588 674388 659245 645073 632571 621925 613282 606902 602687 600051
61864F00051j455M1K197M656O906Q796J0549J2557J5071J7907K0552K2807K5112
$$ 600051 598596 598637 600834 605490 612396 621192 631741 644298 659369 677276 697828 720635 745747
61851G45747K7959L1201L4296L7095L9949M3044M5945M7847M8128M6777M4390
$$ 745747 773706 804907 839203 876298 916247 959291 1005236 1053083 1101211 1147988 1192378
61840A192378M1572L8123L3052K5725J6831P890n3o871j2672j7100j9511j9610
$$ 1192378 1233950 1272073 1305125 1330850 1347681 1355571 1355518 1348647 1335975 1318875 1299364 1279754
61828A279754j7852j5115j1863p644j872M865J0805J4656J6604J7256J6293J2964
$$ 1279754 1261902 1246787 1234924 1227280 1225408 1230273 1241078 1255734 1272338 1289594 1305887 1318851
61816A318851P517J099n617j2764k0292k7485l3663l8634m2341m4711m5948m6238
$$ 1318851 1326368 1327467 1321850 1309086 1288794 1261309 1227646 1189012 1146671 1101960 1056012 1009774
61804A009774m5133m2133l8011l4546l2501l0764k8100k4803k1955j9794j7828
$$ 1009774 964641 922508 884497 849951 817450 786686 758586 733783 711828 692034 674206
61793F74206j6006j4721j3881j2922j1675j0445r283p960o676n973n785n256l914
$$ 674206 658200 643479 629598 616676 605001 594556 585273 577313 570637 564664 558879 553623 549709
61780E49709k405j731k037k569k544j768n49O70J615K303K944L670M380M884N122
$$ 549709 547304 545573 543536 540967 538423 536655 536106 536776 538391 540694 543638 547308 551688 556572 561694
61765E61694N276N638O354P164P567P356O930O918P534Q427R081R175Q640P601
$$ 561694 566970 572608 578962 586126 593693 601049 607979 614897 622431 630858 639939 649114 657754 665355
61751F65355O270M773L023R00j420l444m712n149n105n095n371n733n777n377
$$ 665355 671625 676398 679421 680321 678901 675457 670745 665596 660491 655396 650025 644292 638515 633138
61737F33138m822m411m084l499k451j087J75Q21O49O5j09N86J767K618K659K053
$$ 633138 628316 623905 619821 616322 613871 612784 612959 613780 614429 614494 614385 614971 616738 619356 622015 624068
61721F24068J350J087J485K272K896K995K560J701N66m49r20j041j547k651l608
$$ 624068 625418 626505 627990 630262 633158 636153 638713 640414 640980 640531 639611 638570 637023 634372 630764
61706F30764l915m256n425o786p002o115n624o269p010o769n948n452n157m466
$$ 630764 626849 622593 617168 610382 603380 597265 591641 585372 578362 571593 565645 560193 555036 550570
61692E50570l675l535l818l510k405j349q75o67n56r82j970k612k232j305n89
$$ 550570 546895 543360 539542 536032 533627 532278 531403 530736 530180 529198 527228 524616 522384 521079 520490
61677E20490qP44J192O21o11j345j155o58l07J56Q01J022M78j79j79K94M80J35
$$ 520490 520482 521226 522418 523039 522428 521083 519928 519270 518963 519119 519920 520942 521420 521241 521062 521356 521836 521971
61659E21971l33n66n58l74r3J22K88O95J357J650J126M31O97K059L501M226M451
$$ 521971 521638 521072 520514 520140 520047 520169 520457 521152 522509 524159 525285 525716 526413 528472 531973 536199 540650
61642E40650M672M877M900M853M777M286L147J866J155R79O03n19k166l633m329
$$ 540650 545322 550199 555099 559952 564729 569015 572162 574028 575183 576162 576765 576246 574080 570447 566118
61627E66118m270m057m260m675m560l661k560j759j036j20N36L82k83p15q82j378
$$ 566118 561848 557791 553531 548856 544296 540635 538075 536316 535280 535160 535696 536078 535795 535080 534198 532820
61611E32820k281k979l215l499m228n030n412n528n877o615p469q076q139p568
$$ 532820 530539 527560 524345 520846 516618 511588 506176 500648 494771 488156 480687 472611 464472 456904
61597D56904o684n982n533n003m420m423n247o037n742m516l562l599m108m159
$$ 456904 450220 444238 438705 433702 429282 424859 419612 413575 407833 403317 399755 396156 392048 387889
61583C87889l516k668k119j966k077k318k623k883k900k527j872j298j093j181
$$ 387889 384373 381705 379586 377620 375543 373225 370602 367719 364819 362292 360420 359122 358029 356848
61569C56848j236j032o14k27j88o75j458j945j692q67LN61O94K59p38j700j699
$$ 356848 355612 354580 353966 353739 353551 352876 351418 349473 347781 346914 346917 347478 348172 348431 347693 345993 344294
61552C44294n52P51J161P93O25J125J779K001J882J790J764J661J643J906K161
$$ 344294 343742 344493 345654 346447 347072 348197 349976 351977 353859 355649 357413 359074 360717 362623 364784
61537C64784J839Q93k3k47L09J308K395L277L711L576K916J861O24m28j052j441
$$ 364784 366623 367516 367493 367246 367555 368863 371258 374535 378246 381822 384738 386599 387223 386795 385743 384302
61521C84302j952k450k303j278m9M65M0q28j553j772j382o65k20l59o83o65m76
$$ 384302 382350 379900 377597 376319 376270 376735 376775 375947 374394 372622 371240 370575 370355 369996 369313 368648 368172
61504C68172p29j432j820j371n31o6j04j35K27Q66J460J835J963J794J250M31
$$ 368172 367443 366011 364191 362820 362289 362223 362119 361984 362211 363077 364537 366372 368335 370129 371379 371810
61488C71810k95n95n39n12o57p03m83l62p06j146r52j25M73L15o7R1O34P66K34
$$ 371810 371515 370920 370381 369869 369212 368509 368026 367664 366958 365812 364860 364735 365208 365523 365456 365547 366181 366947 367181
61469C67181l87o12o60r24j235j156p46n54p80r42o05j22k05r16j514j356n53
$$ 367181 366794 366182 365522 364598 363363 362207 361461 360907 360127 359185 358580 358458 358253 357337 355823 354467 353914
61452C53914L29Q83J034R14Q07R46J133R20L47J56Q71J985K545K323J941J948
$$ 353914 354243 355126 356160 357074 357881 358827 359960 360880 361227 361383 362254 364239 366784 369107 371048 372996
61436C72996K330K914L680M551N250N534N319M605L599K842K807L282L541L196
$$ 372996 375326 378240 381920 386471 391721 397255 402574 407179 410778 413620 416427 419709 423250 426446
61422D26446K560K136K132K505L041L330L132K816K954L324K976J517k55j420
$$ 426446 429006 431142 433274 435779 438820 442150 445282 448098 451052 454376 457352 458869 458614 457194
61408D57194k022k580l064l035k571k270k370k562k673k922l335l455k998k367
$$ 457194 455172 452592 449528 446493 443922 441652 439282 436720 434047 431125 427790 424335 421337 418970
61394D18970k140k245k132j622j148j045j005m98M59J304J611J482J250J142J269
$$ 418970 416830 414585 412453 410831 409683 408638 407633 407135 407594 408898 410509 411991 413241 414383 415652
61379D15652J565J684J319Q50J148K417L727M161L960L911M069L921L563L643
$$ 415652 417217 418901 420220 421070 422218 424635 428362 432523 436483 440394 444463 448384 451947 455590
61365D55590M178M388L975L561L548L402K630J712J392J651K042K511L229L993
$$ 455590 459768 464156 468131 471692 475240 478642 481272 482984 484376 486027 488069 490580 493809 497802
61351D97802M460M762N240N887O536P367Q601J0007J1263J2553J4123J5435J5549
$$ 497802 502262 507024 512264 518151 524687 532054 540655 550662 561925 574478 588601 604036 619585
61338F19585J4290J2376J0345Q031N236K279m08k769m912o769q173r046r342r032
$$ 619585 633875 646251 656596 664627 669863 672142 671734 668965 664053 657284 649111 640065 630723 621691
61324F21691q278p392o562n794n114m608m182l576k712j816j214j098j473k126
$$ 621691 613413 606021 599459 593665 588551 583943 579761 576185 573473 571657 570443 569345 567872 565746
61310E65746k638k695k376j909j278k54J125K525L758M958O259P595Q913J0287
$$ 565746 563108 560413 558037 556128 554850 554596 555721 558246 562004 566962 573221 580816 589729 600016
61296F00016J1628J2488J2416J1312R287O379K695j217m501o621p726q258q422
$$ 600016 611644 624132 636548 647860 657147 663526 666221 665004 660503 653882 646156 637898 629476
61283F29476q143p382o164m417k174j7J226J516J840K982M385M930M533M256M875
$$ 629476 621333 613951 607787 603370 601196 601179 602405 603921 605761 608743 613128 618058 622591 626847 631722
61268F31722O185P794R662J1551J2771J3001J2786J2671J2531J2170J2008J2456
$$ 631722 637907 645701 655363 666914 679685 692686 705472 718143 730674 742844 754852 767308
61256G67308J3250J4066J5241J7026J8606J8922J8161J7303J6217J3427Q060J090
$$ 767308 780558 794624 809865 826891 845497 864419 882580 899883 916100 929527 937587 938677
61244I38677n718j1369j5704j8692k0357k1016k0985k0200j8598j6644j5092j4098
$$ 938677 932959 921590 905886 887194 866837 845821 824836 804636 786038 769394 754302 740204
61232G40204j2968j0925q038n207l261k256j812j807k291k795k482j223J22R33
$$ 740204 727236 716311 708273 703066 699805 697549 695737 693930 691639 688844 686362 685139 685261 686194
61218F86194J656K810L778L563K274Q76l84k053l961m845m025k500j657j556j247
$$ 686194 687850 690660 694438 698001 700275 701151 700767 698714 694753 689908 685883 683383 681726 680170 678923
61203F78923k58R67J889K423K665K690K728L165M192N659P376R382J1772J4356
$$ 678923 678665 679632 681521 683944 686609 689299 692027 695192 699384 705043 712419 721801 733573 747929
61189G47929J6769J8907K1069K3408K5466K6567K6566K5720K3843K0342J5354
$$ 747929 764698 783605 804674 828082 853548 880115 906681 932401 956244 976586 991940
61178I91940J0206O226L613J885Q56M29q1j393l266m919o281p957j0005j1769
$$ 991940 1002146 1008372 1011985 1013870 1014726 1015155 1015074 1013681 1010415 1005496 999215 991258 981253 969484
61164I69484j3033j4351j5956j7207j7593j7579j7896j8480j8626j7875j6365
$$ 969484 956451 942100 926144 908937 891344 873765 855869 837389 818763 800888 784523
61153G84523j4552j2898j1632j0591r456q160o837n445l780j830L21K817N724
$$ 784523 769971 757073 745441 734850 725394 717234 710397 704952 701172 699342 699663 702480 708204
61140G08204Q442R972R876Q417N778J814l148p887j1105j2355j2060j0896r325
$$ 708204 716646 726618 736494 744911 750689 752503 749355 741468 730363 718008 705948 695052 685727
61127F85727p365m750j562J482L710N342P056Q998J0845J2597J4505J6274J7314
$$ 685727 678362 673612 672050 673532 677242 682584 689640 698638 709483 722080 736585 752859 770173
61114G70173J7769J8433J9472K0291K0664K1022K1331K0831J9317J7652J6455
$$ 770173 787942 806375 825847 846138 866802 887824 909155 929986 949303 966955 983410
61103I83410J5277J3631J1933J0709R731Q629P592O697N280K824j95l167o397
$$ 983410 998687 1012318 1024251 1034960 1044691 1053320 1060912 1067609 1072889 1075713 1075518 1072351 1065954
61090A065954j0486j5099j9225k2247k4040k4502k3814k2772k2090k1517k0373
$$ 1065954 1055468 1040369 1021144 998897 974857 950355 926541 903769 881679 860162 839789
61079H39789j8634j6881j5442j4245j3219j2209j0769q720o674n360m589l514
$$ 839789 821155 804274 788832 774587 761368 749159 738390 729670 722996 717636 713047 709533
61067G09533j795K4J225J585J390J160J212J380J369J475K355L934N211N547N479
$$ 709533 707738 707762 708987 710572 711962 713122 714334 715714 717083 718558 720913 724847 730058 735605 741084
61052G41084N820O586P405Q317R545J1000J2651J4797J7338J9365K0242K0559
$$ 741084 746904 753490 760895 769212 778757 789757 802408 817205 834543 853908 874150 894709
61040H94709K1270K2391K3324K3955K4610K5239K5481K5258K4746K4069K3486
$$ 894709 915979 938370 961694 985649 1010259 1035498 1060979 1086237 1110983 1135052 1158538
61029A158538K3376K3554K3290K2553K2394K3362K4517K4952K5356K6813K8875
$$ 1158538 1181914 1205468 1228758 1251311 1273705 1297067 1321584 1346536 1371892 1398705 1427580
61018A427580L0335L1356L3339L6902M1404M6354N1865N7583O2401O5495O7105
$$ 1427580 1457915 1489271 1522610 1559512 1600916 1647270 1699135 1756718 1819119 1884614 1951719
61007A951719O8374P1057P6958Q6774R9749J14927J32041J50466J68515J85148
$$ 1951719 2020093 2091150 2168108 2254882 2354631 2469558 2601599 2752065 2920580 3105728
60997C105728K01756K21272K46598K80976L28390L91685M71625N69758O90875
$$ 3105728 3307484 3528756 3775354 4056330 4384720 4776405 5248030 5817788 6508663
60988F508663Q40846J024445J248407J524119J863040K270208K739767L236677
$$ 6508663 7349509 8373954 9622361 11146480 13009520 15279728 18019495 21256172
60980B1256172L656177L806102L482188K625464J429406K67982n17432p87408
$$ 21256172 24912349 28718451 32200639 34826103 36255509 36523491 36006059 35218651
60972C5218651o02594j17671M77180R37990R88668M56903n78255j795537k818601
$$ 35218651 34616057 34498386 34975566 35913556 36902224 37359127 36780872 34985335 32166734
60963C2166734l421017l588469l436990l103937k695924k284803j911895j591275
$$ 32166734 28745717 25157248 21720258 18616321 15920397 13635594 11723699 10132424
60955A0132424j320695j094668r08196p54378o25917n19322m34080l68279l17807
$$ 10132424 8811729 7717061 6808865 6054487 5428570 4909248 4475168 4106889 3789082
60946C789082k78869k48535k23525k01174j81215j64384j49774j35520j21387
$$ 3789082 3510213 3261678 3038153 2836979 2655764 2491380 2341606 2206086 2084699
60937B084699j08458r6890q6245p7546p2510p0820p0266o9569o8928o7770o4407
$$ 2084699 1976241 1879351 1793106 1715560 1643050 1572230 1501964 1432395 1363467 1295697 1231290
60926A231290n8503n1872m6084m0864l5579l0635k6555k2982j9592j6899j5342
$$ 1231290 1172787 1120915 1074831 1033967 998388 967753 941198 918216 898624 881725 866383
60915H66383j4377j3276j2059j0989r860q420o958n875n180m801m905n467n968
$$ 866383 852006 838730 826671 815682 805822 797402 790444 784569 779389 774588 769683 764216 758248
60902G58248n942n604n631o589q546j0913j2588j2811j1953j1087j0753j0639
$$ 758248 752306 746702 741071 734482 725936 715023 702435 689624 677671 666584 655831 645192
60890F45192j0373j0070r936j0013j0351j0869j0923r718p347m874l125j920q06
$$ 645192 634819 624749 614813 604800 594449 583580 572657 562939 555592 550718 547593 545673 544867
60877E44867O0K07l03q72j102j162j312j317n26J301L432M741M890M552M394M297
$$ 544867 544927 545134 544831 543959 542857 541695 540383 539066 538540 539841 543273 548014 552904 557456 561850 566147
60861E66147L920L447L329L585L964M401M788M656L724K535J895J911K128K352
$$ 566147 570067 573514 576843 580428 584392 588793 593581 598237 601961 604496 606391 608302 610430 612782
60847F12782K683K998L067L002K856K085J96k248m105n066n722o389o839p177
$$ 612782 615465 618463 621530 624532 627388 629473 629669 627421 623316 618250 612528 606139 599300 592123
60833E92123p915q939r337q674p589o803o286n772n369n129m682l820k928k331
$$ 592123 584208 575269 565932 557258 549669 542866 536580 530808 525439 520310 515628 511808 508880 506549
60819E06549j699o13O56J524J972K469L111L418L112K734L211M838O881Q293Q799
$$ 506549 504850 504237 504893 506417 508389 510858 513969 517387 520499 523233 526444 531282 538163 546456 555255
60804E55255R033R647J0620J1572J2392J3283J4460J6113J8272K0499K2098K2968
$$ 555255 564288 573935 584555 596127 608519 621802 636262 652375 670647 691146 713244 736212
60792G36212K3770K4870K5790K6209K6690K7513K7611K5848K2911K0425J8438
$$ 736212 759982 784852 810642 836851 863541 891054 918665 944513 967424 987849 1006287
60781A006287J5356J0488N140O79l096o962j0864j4311j7276j9780k1329k1691
$$ 1006287 1021643 1032131 1037271 1037950 1034854 1027892 1017028 1002717 985441 965661 944332 922641
60769I22641k1705k2409k3634k4243k3615k2326k1319k0885k0500j9525j8030
$$ 922641 900936 878527 854893 830650 807035 784709 763390 742505 722005 702480 684450
60758F84450j6812j6417j6324j5574j4062j2555j1501j0546r352q147p232o565
$$ 684450 667638 651221 634897 619323 605261 592706 581205 570659 561307 553160 545928 539363
60746E39363o074n701m990l478j740j124k009l198l558l447l794m558m952m648
$$ 539363 533289 527588 522598 519120 517380 516256 514247 511049 507491 504044 500250 495692 490740 486092
60732D86092l942l048k017j079m01K77J233K229K824K939K672J984J022L55K59
$$ 486092 482150 479102 477085 476006 475605 475882 477115 479344 482168 485107 487779 489763 490785 491140 491399
60717D91399J05q90k587m093m848n011m979n037n282n513n385m955m772n046n275
$$ 491399 491504 490614 488027 483934 479086 474075 469096 464059 458777 453264 447879 442924 438152 433106 427831
60702D27831n045m699m620m459l802l020k636k331j493m88k26o62q33m33k27o69
$$ 427831 422786 418087 413467 409008 405206 402186 399550 397219 395726 395238 395012 394350 393517 393084 392857 392188
60686C92188j104q15q5M01N29O89J072J582K130K636K971L189L620M439N353N902
$$ 392188 391084 390269 390184 390585 391114 391803 392875 394457 396587 399223 402194 405383 409003 413442 418795 424697
60670D24697N927N629N305N157N185N120M579L382J667j87j635k078j320Q6J276
$$ 424697 430624 436253 441558 446715 451900 457020 461599 464981 466648 466461 464826 462748 461428 461514 462790
60655D62790J906K332K948L690M342M884N404N798N893N690N292M702L831K711
$$ 462790 464696 467028 469976 473666 478008 482892 488296 494094 499987 505677 510969 515671 519502 522213
60641E22213J528M13o77j865l129m249n081n773o513p112p069o248n167m427m028
$$ 522213 523741 524154 523477 521612 518483 514234 509153 503380 496867 489755 482686 476438 471271 466844 462816
60626D62816l525k724j847j142o09k52k59p73j552k055j909j308q36p95q15l76
$$ 462816 459291 456567 454720 453578 452969 452717 452458 451685 450133 448078 446169 444861 444025 443230 442415 442039
60610D42039M20R76J078J111J296J289R24P71J345K147K224J526J010J311J964
$$ 442039 442459 443435 444513 445624 446920 448209 449133 449904 451249 453396 455620 457146 458156 459467 461431
60595D61431K155J803J558J965K842L435L142K181J444J555K242K801K944K853
$$ 461431 463586 465389 466947 468912 471754 475189 478331 480512 481956 483511 485753 488554 491498 494351
60581D94351K654K376K167K097J892J437J418K589M394N252M659M118N322Q017
$$ 494351 497005 499381 501548 503645 505537 506974 508392 510981 515375 520627 525286 529404 534726 542743
60567E42743J0506J1866J2724J4014J5906J8193K0952K4329K8081L1765L5059
$$ 542743 553249 565115 577839 591853 607759 625952 646904 671233 699314 731079 766138
60556G66138L7571L8488L6880L2332K5127J5975N892l861j2164j8469k2628k4372
$$ 766138 803709 842197 879077 911409 936536 952511 958403 954542 942378 923909 901281 876909
60544H76909k3348j9870j5108j0225n498o12M530R665J4749K0174K6326L3233
$$ 876909 853561 833691 818583 808358 802860 802248 806778 816443 831192 851366 877692 910925
60532I10925M0730M8673N6762O4210O9595P1120O7388N8403M5710L1230J6034
$$ 910925 951655 1000328 1057090 1121300 1190895 1262015 1329403 1387806 1433516 1464746 1480780
60521A480780O73j3598k4748l1445l4037l3886l2318l0402k8998k8325k7801k6821
$$ 1480780 1481453 1467855 1443107 1411662 1377625 1343739 1311421 1281019 1252021 1223696 1195895 1169074
60509A169074k5332k3210j9738j4551q737m026q62J922N427R585J3925J8494K3511
$$ 1169074 1143742 1120532 1100794 1086243 1077506 1073480 1072618 1074540 1079967 1089552 1103477 1121971 1145482
60496A145482K8891L4847M2498N3006O6143Q0409R4508J08077J20907J32076J40268
$$ 1145482 1174373 1209220 1251718 1304724 1370867 1451276 1545784 1653861 1774768 1906844 2047112
60485B047112J44386J43483J36622J23704J06443Q7878P0447N4779M0306K6434
$$ 2047112 2191498 2334981 2471603 2595307 2701750 2789628 2860075 2914854 2955160 2981594
60475B981594J2589k506k0643m2831o8244r4489j18727j38609j52588j59836j60263
$$ 2981594 2994183 2991677 2971034 2928203 2859959 2765470 2646743 2508134 2355546 2195710 2035447
60464B035447j54804j45411j34162j22002j08776r4789q1669p0968o2293n3940
$$ 2035447 1880643 1735232 1601070 1479068 1370292 1275503 1193834 1122866 1060573 1006633
60454A006633m5349l7832l2573k8968k5627k2244j9591j8174j7657j7430j6983
$$ 1006633 961284 923452 890879 861911 836284 814040 794449 776275 758618 741188 724205
60443G24205j5924j4266j2693j1900j1696j1191r873q033o180m526l111k019j269
$$ 724205 708281 694015 681322 669422 657726 646535 636662 628629 622449 617923 614812 612793 611524
60430F11524p85n54n89p41p93p62r26j493k442l623m773n472n397m615l481k279
$$ 611524 610739 610185 609596 608855 608062 607300 606374 604881 602439 598816 594043 588571 583174 578559 575078 572799
60414E72799j170m09k70o46j005q65l25ll83j226j729j415p43n30q37q81j53Q62
$$ 572799 571629 571220 570950 570304 569299 568434 568109 568106 567723 566497 564768 563353 562610 562080 561243 560362 560209 561071
60396E61071J312J002M68L43R38K129L342L837L443K741K317K112J844J664J940
$$ 561071 562383 563385 563853 564196 565134 567263 570605 574442 577885 580626 582943 585055 586899 588563 590503
60381E90503K581L127L263K948K189J212O28Q95J708K351K519K371K010J466J109
$$ 590503 593084 596211 599474 602422 604611 605823 606451 607346 609054 611405 613924 616295 618305 619771 620880
60366F20880J442K387L304L818M162M668N306N894O309O340N646M181K433J088
$$ 620880 622322 624709 628013 631831 635993 640661 645967 651861 658170 664510 670156 674337 676770 677858
60352F77858M99N84J167K340M392P281J0349J2912J5140J7887K1516K5458K9032
$$ 677858 678357 678941 680108 682448 686840 694121 704470 717382 732522 750409 771925 797383 826415
60339H26415L1975L3759L3124K9167K2447J4342N627l471j2214j9325k4058k6534
$$ 826415 858390 892149 925273 954440 976887 991229 996856 993385 981171 961846 937788 911254
60327I11254k7109k6123k4189k1953j9509j6675j3826j1646j0065q262n829l229
$$ 911254 884145 858022 833833 811880 792371 775696 761870 750224 740159 731897 726068 722839
60315G22839r84P93J969K261J889J650K053K893L893N076O355P433Q490J0409
$$ 722839 721855 722648 724617 726878 728767 730417 732470 735363 739256 744332 750687 758120 766610 777019
60301G77019J3928J8970K5084L2097M0025M8522N6409O1518O1496N5753M6453
$$ 777019 790947 809917 835001 867098 907123 955645 1012054 1073572 1135068 1190821 1237274
60290A237274L6492K6285J3748k135j8982l2973m2219m7401m9992n1010n1018
$$ 1237274 1273766 1300051 1313799 1311664 1292682 1259709 1217490 1170089 1120097 1069087 1018069
60279A018069n0152m8116m4775m0638l6315l1833k7117k2717j9353j6960j4885
$$ 1018069 967917 919801 875026 834388 798073 766240 739123 716406 697053 680093 665208
60268F65208j2942j1498j0560r540q067o493n280m295l039j488l72m59j534k397
$$ 665208 652266 640768 630208 620668 612601 606108 600828 596533 593494 592006 591634 591175 589641 587244
60254E87244k090j027m25p72j417j685j678j650j407p81j69Rj06k72p13j553k118
$$ 587244 585154 584127 583702 582930 581513 579828 578150 576500 575093 574312 574143 574152 574046 573774 573061 571508 569390
60237E69390j562j11J112J419J174J071J384K001K804L762M846N895O581O676
$$ 569390 567828 567717 568829 570248 571422 572493 573877 575878 578682 582444 587290 593185 599766 606442
60223F06442O460O487O761O549N365L652K124Q80k51r67q59k61R6J88P01J839
$$ 606442 612902 619389 626150 632699 638064 641716 643840 644720 644469 643502 642643 642382 642478 642666 643367 645206
60207F45206K895L185K818K259J721J254R83Q75O27R7l83m40k10j60m55q54j082
$$ 645206 648101 651286 654104 656363 658084 659338 660321 661196 661823 661920 661537 661097 660887 660727 660272 659418 658336
60190F58336j130j075r28p26o42q56j368k037k728l169k850j447N12J834J896
$$ 658336 657206 656131 655203 654477 653835 652979 651611 649574 646846 643677 640827 639380 639892 641726 643622
60175F43622J338J166J439J457J037Q47J440K571L666M428M814M974N331O187
$$ 643622 644960 646126 647565 649022 650059 650906 652346 654917 658583 663011 667825 672799 678130 684317
60161F84317P120P362O857O208N469L952J601n30j843l192n337p284p455n967
$$ 684317 691437 698799 705656 711864 717333 721285 722886 722356 720513 717321 711984 704700 697245 691278
60147F91278m352l185j406J766N396P916Q872R124R740J1123J2825J3953J3885
$$ 691278 686926 683741 682335 684101 689497 697413 706285 715409 725149 736272 749097 763050 776935
60134G76935J2742J1053R138P104N208L672K248N11j362k738l502m365n932p876
$$ 776935 789677 800730 809868 816972 822180 825852 828100 828611 827249 824511 821009 816644 810712 802836
60120H02836r261r416q393o781n250m107l200k334j602j213j108j051r12n79J78
$$ 802836 793575 784159 775766 768985 763735 759628 756428 754094 752492 751279 750171 749120 748208 747629 747807
60105G47807J466K979M245N102N698O270P096Q309R502R920R493R092R174Q735
$$ 747807 749273 752252 756497 761599 767297 773567 780663 788972 798474 808394 817887 826979 836153 844888
60091H44888O500K823o19k809m120n103n685n832n968o243o158n374m323l607
$$ 844888 851388 854211 853592 850783 846663 841560 835875 830043 824075 817832 811674 806300 801977 798370
60077G98370l328l361l746m434n164n935p071q455r213q780p750p107o985o805
$$ 798370 795042 791681 787935 783501 778337 772402 765331 756876 747663 738883 731133 724026 717041 710236
60063G10236o355o019n966n810n260m688m710n450o390o931o891o532o156n889
$$ 710236 703881 697862 691896 686086 680826 676138 671428 665978 659588 652657 645766 639234 633078 627189
60049F27189n758n743n681n231m228k954j836j019l69K42R34J812K651K795J879
$$ 627189 621431 615688 610007 604776 600548 597594 595758 594739 594370 594612 595546 597358 600009 602804 604683
60034F04683N29k23j62k8m26j127j569j544j225r12j027j906l392m863n769n988
$$ 604683 605212 604989 604827 604799 604373 603246 601677 600133 598908 597996 596969 595063 591671 586808 581039 575051
60018E75051n696n209m920m888m562l437j985j282j635k184k080j373m59O09J809
$$ 575051 569355 564146 559226 554338 549776 546339 544354 543072 541437 539253 537173 535800 535341 535950 537759
60003E37759K738L131L435M287N668O982P765Q016P992Q057Q450Q957R044Q538
$$ 537759 540497 543628 547063 551350 557018 564000 571765 579781 587773 595830 604280 613237 622281 630819
59989F30819P799P013N775L802J592r6j079j554j480p53J45M39j8o06q34q84j199
$$ 630819 638618 645631 651406 655208 656800 656704 655625 654071 652591 651838 651983 652422 652404 651798 650964 650080 648881
59972F48881j869k554k804k449j824j555j888k376k439k097j795j649j339p06
$$ 648881 647012 644458 641654 639205 637381 635826 633938 631562 629123 627026 625231 623582 622243 621537
59958F21537m0L53N37P65J113J457J671J755J833J983K101K006J752J612J600
$$ 621537 621497 621850 622387 623152 624265 625722 627393 629148 630981 632964 635065 637071 638823 640435 642035
59943F42035J295M40n27r36p68o76j092j801k424k858l053k785j983j077n81m85
$$ 642035 643330 643770 643243 642307 641539 640863 639771 637970 635546 632688 629635 626850 624867 623790 623209 622724
59927F22724l53O6O52J296K027K642K628J818Q20M10O40R28J005J220J793K333
$$ 622724 622371 622437 623089 624385 626412 629054 631682 633500 634320 634730 635370 636298 637303 638523 640316 642649
59911F42649K378J998J498Q63L4n76m68J55N52M00M6k01m56p34o84j48L35O3r41
$$ 642649 645027 647025 648523 649386 649420 648844 648376 648531 649083 649483 649529 649328 648872 648138 647454 647306 647641 647704 646763
59892F46763j874j904r48K47P98O69P74J831L337M162M106M151N037O292O986
$$ 646763 644889 642985 642037 642284 643082 643751 644525 646356 649693 653855 657961 662112 667149 673441 680427
59877F80427O856O262N506M730M153L847L527K917K092J130k61k296m511o130
$$ 680427 687283 693545 699051 703781 707934 711781 715308 718225 720317 721447 721186 718890 714379 708249
59863G08249o852o926o588n911n153m800n045n511n533m743l430k406k268k761
$$ 708249 701397 694471 687883 681972 676819 672019 666974 661463 655930 651187 647757 645351 643083 640322
59849F40322l042k718k200j898j537o71N24J517K214L007M154N576P133Q737J0332
$$ 640322 637280 634562 632362 630464 628927 628256 628780 630297 632511 635518 639672 645248 652381 661118 671450
59834F71450J2106J4547J7808K1075K2953K2431J9310J4103Q022K745n30j854
$$ 671450 683556 698103 715911 736986 759939 782370 801680 815783 823805 826550 826020 824166
59822H24166j936j173J75J080Q7l276q054j2928j7094k0009k1211k0775j9410
$$ 824166 822230 821057 821232 822312 822399 819123 811069 798141 781047 761038 739827 719052 699642
59809F99642j7686j5633j3400j1613j0622r952q970p723o590n555m434l468l036
$$ 699642 681956 666323 652923 641310 630688 620736 611766 604043 597453 591898 587464 583996 580960
59796E80960k990k915k899l344m112m545m413m216m280m252l727k961k477k325
$$ 580960 577970 575055 572156 568812 564700 560155 555742 551526 547246 542994 539267 536306 533829 531504
59782E31504k214k114k273k609k623k071j432j410k002k399j928r45m45p83j145
$$ 531504 529290 527176 524903 522294 519671 517600 516168 514758 512756 510357 508429 507484 507039 506256 505111
59767E05111n64P75J804J936J622J427J225O64j8k26K22J076K187L423M235M060
$$ 505111 504547 505322 507126 509062 510684 512111 513336 514000 513982 513756 513978 515054 517241 520664 524899 528959
59751E28959L312L188M127N080M733L108J367M10J95L06M53M21K9o19j140j345
$$ 528959 532271 535459 539586 544666 549399 552507 553874 554284 554479 554785 555238 555659 555688 555069 553929 552584
59735E52584j391j478j557j472j183p53k50J78L17kp24j482j704j078l3N38K61
$$ 552584 551193 549715 548158 546686 545503 544750 544500 544678 544995 544993 544269 542787 541083 540005 539972 540510 540771
59718E40771k93m68m09o36r75p03K77J204J591J931K870M186N067N108M637M223
$$ 540771 540478 540010 539601 538965 537990 537287 537564 538768 540359 542290 545160 549346 554413 559521 564158 568381
59702E68381M257M843N756O532O822O647O229N708N138M643M347M250M219M033
$$ 568381 572638 577481 583237 589769 596591 603238 609467 615175 620313 624956 629303 633553 637772 641805
59688F41805L492K593J627Q99M02l5l67m89o39j164j826j968j529j349k055l129
$$ 641805 645297 647890 649517 650416 650818 650783 650416 649927 649288 648124 646298 644330 642801 641452 639397 636268
59672F36268l559l102k442k294k774l492l960l904l420k771k002r66K07J101J641
$$ 636268 632709 629607 627165 624871 622097 618605 614645 610741 607321 604550 602548 601582 601789 602890 604531
59657F04531K303L405M564N236N407N325M897L975K965K510K586K477J733O63
$$ 604531 606834 610239 614803 620039 625446 630771 635668 639643 642608 645118 647704 650181 651914 652577
59643F52577k97j321l003n498q077r662r826r131q314p353n790l837k452k046
$$ 652577 652280 650959 647956 642458 634381 624719 614893 605762 597448 590095 584305 580468 578016 575970
59629E75970j869j134j34L46J94k08q44j892k913l154k676k319k432k440j915
$$ 575970 574101 572967 572833 573179 573373 573165 572321 570429 567516 564362 561686 559367 556935 554495 552580
59614E52580j351j433k126k812l040k767k186j632j355j184o99R7O05M03j95o37
$$ 552580 551229 549796 547670 544858 541818 539051 536865 535233 533878 532694 531995 532092 532697 533100 532905 532268
59598E32268q90j244j598j454p39j14k05p96j152j042j007j435j805j330k04M03
$$ 532268 531378 530134 528536 527082 526343 526229 526024 525228 524076 523034 522027 520592 518787 517457 517253 517656
59582E17656k58j568k381k353k077k124k474k832l022l032k940k807k592k150
$$ 517656 517398 515830 513449 511096 509019 506895 504421 501589 498567 495535 492595 489788 487196 485046
59568D85046j488q38l44P5L63K41k30l78K43J046J064L14k17P5P32J061J105J358
$$ 485046 483558 482720 482376 482451 482814 483055 482825 482447 482690 483736 484800 485114 484897 484972 485704 486765 487870 489228
59550D89228K026K826L375L541L500L555L798M048M215M537N213O063O976Q411
$$ 489228 491254 494080 497455 500996 504496 508051 511849 515897 520112 524649 529862 535925 542901 551312
59536E51312J0841J3907J6877J9785K3047K5648K4846J8734Q709j292p907j0321
$$ 551312 562153 576060 592937 612722 635769 661417 686263 704997 713706 712414 704507 694186
59524F94186r704p649n191k644P7K850M990N681M783K936Q44j297l604n995q088
$$ 694186 684482 676833 671642 668998 669075 671925 676915 682596 687379 690315 691159 689862 686258 680263 672175
59509F72175r497j0179j0492j0930j1617j2044j1472r810p907o758o464o226n405
$$ 672175 662678 652499 642007 631077 619460 607416 595944 586134 578227 571469 565005 558779 553374
59496E53374m281l548l305k966k091r25n6K24N3k42l66k08J28M70P99J137J334
$$ 553374 549093 545545 542240 539274 537183 536258 536202 536426 536479 536237 535871 535663 535791 536261 537060 538197 539531
59479E39531J234J024J035J195J137R27J151K039L008L424L346L136K791K112
$$ 539531 540765 541789 542824 544019 545156 546083 547234 549273 552281 555705 559051 562187 564978 567090
59465E67090J223M57l1j16L60J132J418R62P95K123M693P019Q177Q644R280J0240
$$ 567090 568313 568770 568739 568623 568983 570115 571533 572495 573290 575413 580106 587125 595302 603946 613226 623466
59449F23466J1043J1201J0581R448Q288P237N834L705J267q25k707n034p773r993
$$ 623466 634509 645710 656291 665739 674027 681264 687098 690803 692070 691245 688538 683504 675731 665738
59435F65738j0937j0637r472p850o467n981o158n962m841l311k049j020J38J500
$$ 665738 654801 644164 634692 626842 620375 614394 608236 602274 597433 594122 592073 591053 591191 592691
59421E92691L026M791O674Q365R967J1993J4403J6259J6923J6990J7549J8976
$$ 592691 595717 600508 607182 615547 625514 637507 651910 668169 685092 702082 719631 738607
59409G38607K0984K3124K4332K2450J5595M382p848j7358k2301k2932k0402j5848
$$ 738607 759591 782715 807047 829497 845092 849474 841626 824268 801967 779035 758633 742785
59397G42785j0133l870K317P199Q759N236l117j3442k1862k5965k5795k2847j8688
$$ 742785 732652 728782 731099 738298 747057 752293 749176 735734 713872 687907 662112 639265 620577
59384F20577j4608j1613r883q517o550m154k185p98O69K395L623L776L336L132
$$ 620577 605969 594356 584473 575956 569406 565252 563067 562269 562938 565333 568956 572732 576068 579200
59370E79200L314L531L678L921M293M688N146N816O764P905Q978R554R331Q538
$$ 579200 582514 586045 589723 593644 597937 602625 607771 613587 620351 628256 637234 646788 656119 664657
59356F64657P750P318P315P926R333J1162J2647J3541J4330J5398J6570J7652
$$ 664657 672407 679725 687040 694966 704299 715461 728108 741649 755979 771377 787947 805599
59344H05599J8738J9711K0171K0217K0520K1069K0630J8209J4515J1081Q354N477
$$ 805599 824337 844048 864219 884436 904956 926025 946655 964864 979379 990460 998814 1004291
59332A004291J771k431o391r693j2233j4035j5280j6170j6724j6849j6626j6192
$$ 1004291 1006062 1003631 997240 987547 975314 961279 945999 929829 913105 896256 879630 863438
59320H63438j5502j4442j3146j1972j1201j0803j0379r345p523n636m721m882
$$ 863438 847936 833494 820348 808376 797175 786372 775993 766648 759125 753489 748768 743886
59308G43886n086m474l377k645k506k552k417j897p82Q31K307L094L356L590L886
$$ 743886 738800 734326 730949 728304 725798 723246 720829 718932 718150 718981 721288 724382 727738 731328 735214
59293G35214M082M289M730N358O162P539R750J2213J4102J5507J7347K0241K3977
$$ 735214 739296 743585 748315 753673 759835 767374 777124 789337 803439 818946 836293 856534 880511
59280H80511K7676K9705K7716K0107P962n062j5163k0568k1604j9665j6389j3013
$$ 880511 908187 937892 965608 985715 993677 988615 973452 952884 931280 911615 895226 882213
59268H82213r881o713l575j146O6K80j09j098k773m824o754q364r773j1156j2647
$$ 882213 872332 865619 862044 860898 860964 861244 861135 860037 857264 852440 845686 837322 827549 816393 803746
59253H03746j4164j5222j5225j4216j2920j1822j0656r196p988p629p660o982
$$ 803746 789582 774360 759135 744919 731999 720177 709521 700325 692337 684708 677048 670066
59241F70066n300l418j930m93J262K845L595L860M530N635O172N511M202K983
$$ 670066 664766 661348 659418 658925 660187 663032 666627 670487 675017 680652 686824 692335 696537 699520
59227F99520J709j83k485m225m770m485m331n077o758q535r221q364o714n309
$$ 699520 701229 701046 698561 694336 689566 685081 680750 675673 668915 660380 651159 642795 636081 630772
59213F30772m306l142j630k16P87J527K090K304K193K086K090K026J985K341L071
$$ 630772 626466 623324 621694 621478 622265 623792 625882 628186 630379 632465 634555 636581 638566 640907 643978
59198F43978L686M069M674N674O548O866O864O822O655O441O663P367P782P418
$$ 643978 647664 651733 656407 662081 668629 675495 682359 689181 695836 702277 708940 716307 724089 731507
59184G31507O875O817O780N946M627L877L848L562K379Q34k08n25m55l35l19l52
$$ 731507 738382 745199 751979 757925 762552 766429 770277 773839 776218 777052 776844 776319 775864 775529 775210 774858
59168G74858k21K67J086K104L260M445N432O139O658O896O509N485M306L147J479
$$ 774858 774637 774904 775990 778094 781354 785799 791231 797370 804028 810924 817433 822918 827224 830371 831850
59153H31850j012l598n274o015o575p313p951q285q393q224p665o932o358n837
$$ 831850 830838 827240 821966 815951 809376 802063 794112 785827 777434 769210 761545 754613 748255 742418
59139G42418n050m056l149k286j334o42o46r68p13L08J376J912K019J927J605
$$ 742418 737368 733312 730163 727877 726543 725901 725255 724287 723574 723882 725258 727170 729189 731116 732721
59124G32721J232J422K589M373N903O543O467O641P976J0170J1793J1996J1595
$$ 732721 733953 735375 737964 742337 748240 754783 761250 767891 775867 786037 797830 809826 821421
59111H21421J1738J2062J1302R426P759O894N870L908J719L04n70j717l004l562
$$ 821421 833159 845221 856523 865949 873708 880602 886472 890380 892099 892403 891833 890116 887112 883550
59097H83550l254l015l698n196o798p869q131p636o743n913n353m855m076l030
$$ 883550 880296 877281 873583 868387 861589 853720 845589 837953 831210 825297 819944 815089 811013 807983
59083H07983k319k752m587p157r394j0649j0993j0958j1105j1617j2030j1583
$$ 807983 805664 802912 798325 791168 781774 771125 760132 749174 738069 726452 714422 702839
59071G02839j0102q296o926n934m854l768l301l683m346m504l836k674j783j745
$$ 702839 692737 684441 677515 671581 666727 662959 659658 655975 651629 647125 643289 640615 638832 637087
59057F37087k274k394j691r94j285k291k905k750k444k386k181j494o64j56P7
$$ 637087 634813 632419 630728 629734 628449 626158 623253 620503 618059 615673 613492 611998 611334 611178 611255
59042F11255L73R40J815K882L793M200M116L711K913J730Q23J022K182L166L197
$$ 611255 611628 612568 614383 617265 621058 625258 629374 633085 635998 637728 638551 639573 641755 644921 648118
59027F48118K714K697L636N404P612R811J1615J2875J3626J3850J3521J2756J1584
$$ 648118 650832 653529 657165 662569 670181 679992 691607 704482 718108 731958 745479 758235 769819
59014G69819R673O719L002o94l633n282n312m020k433j413q42j53P21J623K883
$$ 769819 779492 786211 789213 788519 784886 779604 774292 770272 767839 766426 765584 765431 766152 767775 770658
58999G70658M740O396O711N764M651L822K786J454N19J70l69j584l015m245n555
$$ 770658 775398 781794 788505 794269 798920 802742 805528 806982 807501 807671 807302 805718 802703 798458 792903
58984G92903p083q334r049r658j0310j0345r412q238p526o821n337l228j284K54
$$ 792903 785820 777486 768437 758779 748469 738124 728712 720474 712948 706127 700790 697562 696278 696532
58970F96532J685L071M210N188O348P733R089J0263J1262J1988J2230J1844J0853
$$ 696532 698217 701288 705498 710686 717034 724767 733856 744119 755381 767369 779599 791443 802296
58957H02296R475P938O001K962j264n386p988r386j1141j3602j5211j4767j3124
$$ 802296 811771 819709 825710 828672 827408 822022 814034 804648 793507 779905 764694 749927 736803
58944G36803j1888j1365j0774r672q233o506m462k483j124n08m11p02j291j986
$$ 736803 724915 713550 702776 693104 684871 678365 673903 671420 670296 669788 669377 668675 667384 665398
58930F65398k747l677m502m614m074l876m736o107o899o678n736m512l474k930
$$ 665398 662651 658974 654472 649858 645784 641908 637172 631065 624166 617488 611752 607240 603766 600836
58916F00836k547j620k62M59J12l03J38Q88J032R61J705L159M266M753N480P036
$$ 600836 598289 596669 596407 596866 596978 596675 596813 597701 598733 599694 601399 604558 608824 613577 619057 626093
58900F26093R030J0845J2258J3235J3833J4305J4755J4798J4208J3681J4233J5939
$$ 626093 635123 645968 658226 671461 685294 699599 714354 729152 743360 757041 771274 787213
58888G87213J8024K0012K1972K3700K4594K4489K3754K2395J9874J6144J2093
$$ 787213 805237 825249 847221 870921 895515 920004 943758 966153 986027 1002171 1014264
58877A014264Q509N167J435k629o334r223j1406j3096j4255j4770j4654j3967
$$ 1014264 1022773 1027940 1029375 1026746 1020412 1011189 999783 986687 972432 957662 943008 929041
58865I29041j2753j1275j0199j0157j1044j2083j2776j3440j4483j5506j5800
$$ 929041 916288 905013 894814 884657 873613 861530 848754 835314 820831 805325 789525
58854G89525j5464j5295j5573j5678j5056j3803j2104r905p554n990n754o291
$$ 789525 774061 758766 743193 727515 712459 698656 686552 676647 669093 663103 657349 651058
58842F51058o740o949p198p402p215o623n968n486n165m830m211l195k197j853
$$ 651058 644318 637369 630171 622769 615554 608931 602963 597477 592312 587482 583271 580076 577879 576026
58828E76026k179k497k300j743j095m23O2m4o39j018q02l13K02R33J737J835R04
$$ 576026 573847 571350 569050 567307 566212 565789 565851 565807 565168 564150 563348 563035 563237 564170 565907 567742 568646
58811E68646k48o80l73K04Q58J477J702J467J274J406J488J281J228J592J881
$$ 568646 568398 567718 567345 567549 568407 569884 571586 573053 574327 575733 577221 578502 579730 581322 583203
58796E83203J733J574J752J836J524J374J758J915J140J42J32J167K454L740N260
$$ 583203 584936 586510 588262 590098 591622 592996 594754 596669 597809 597951 598083 599250 601704 605444 610704
58781F10704O703P394P322P089P073P381Q099Q836Q558O792M446K492N56k109
$$ 610704 617407 624801 632123 639212 646285 653666 661765 670601 679159 685951 690397 692889 693445 691336
58767F91336m942o697p271p546p793p587p056o842o865o404n357m315l426k315
$$ 691336 686394 679697 672426 664880 657087 649500 642444 635602 628737 622333 616976 612661 609235 606920
58753F06920j036qR03K091L137L231K653K643L721N283O837Q467R956J0739J0987
$$ 606920 605884 605876 606779 608870 612007 615238 617891 620534 624255 629538 636375 644842 654798 665537 676524
58738F76524J1587J2782J3761J3918J3567J3199J2922J2900J3279J3535J2815
$$ 676524 688111 700893 714654 728572 742139 755338 768260 781160 794439 807974 820789
58727H20789J1239R903R265Q542P073N372M275L844L670L793M597O089P713Q806
$$ 820789 832028 841931 851196 859738 866811 872183 876458 880302 883972 887765 892362 898451 906164 914970
58713I14970R125Q983Q755Q166O409L266m40l925p350j1012j4361j6785j8791
$$ 914970 924095 933078 941833 949999 956408 959674 959234 955309 947959 936947 922586 905801 887010
58700H87010k1247k3783k5169k5107k4507k4064k3591k2767k1519j9700j7312
$$ 887010 865763 841980 816811 791704 767197 743133 719542 696775 675256 655556 638244
58689F38244j4929j3041j1235r009o955n966n661m996m126m119m867n052m204
$$ 638244 623315 610274 599039 590030 583075 577109 571448 566452 562326 558207 553340 548288 544084
58676E44084l170k278q27J156K382K310K213L282M983O230P074Q174R532J0753
$$ 544084 540914 538636 537809 538965 541347 543657 545870 549152 554135 560365 567439 575613 585145 595898
58662E95898J1877J3010J3595J2883J0776P734M254Q81j810l686n096o260p016
$$ 595898 607775 620785 634380 647263 658039 665773 670027 670908 669098 665412 660316 654056 647040
58649F47040p320p376p220o789o385o389o478o035n291n037n115m382k459m51
$$ 647040 639720 632344 625124 618335 611950 605561 599083 593048 587757 582720 577605 573223 570764 570313
58635E70313N66P65P96P95O96P01Q17O45P0m30n26m60m02j45L41P26R65J407K117
$$ 570313 570879 571644 572440 573235 573931 574632 575449 576094 576164 575734 575208 574748 574346 574201 574542 575268 576233 577640 579757
58616E79757K846L850N737Q213R990J0227R308P874O070M119K606J687P59n65
$$ 579757 582603 586453 592190 600403 610393 620620 629928 637802 643872 647991 650597 652284 653043 652478
58602F52478j885k760l284l554l345k701k181k153k364k402k016q98J038L113
$$ 652478 650593 647833 644549 640995 637650 634949 632768 630615 628251 625849 623833 622935 623973 627086
58588F27086M469N206O181P704R392J1186J3269J4959J5035J3519J1847J0918
$$ 627086 631555 636761 642942 650646 660038 671224 684493 699452 714487 728006 739853 750771
58576G50771J0139Q792P142N706M575L967M444N961P669R150J0981J3649J6755
$$ 750771 760910 769702 776844 782550 787125 791092 795536 801497 809166 818316 829297 842946 859701
58563H59701J9666K2128K4005K5188K5957K6544K6378K4715K1889J8778J5231
$$ 859701 879367 901495 925500 950688 976645 1003189 1029567 1054282 1076171 1094949 1110180
58552A110180J0499N054L80l184o651j0281j3075j4705j6053j7356j7745j7241
$$ 1110180 1120679 1125733 1126113 1122929 1116278 1105997 1092922 1078217 1062164 1044808 1027063 1009822
58540A009822j7317j8592j9722j9550j8732j8337j8375j8539j8840j8691j7057
$$ 1009822 992505 973913 954191 934641 915909 897572 879197 860658 841818 823127 806070
58529H06070j4282j2069j0839r014n915l267k458k364j468k79J53M33J555K846
$$ 806070 791788 779719 768880 759866 753951 750684 748226 745862 744394 744115 744268 744701 746256 749102
58515G49102L119K773K854L076K529J563J169J232R05J29o31j412k313k747k369
$$ 749102 752221 754994 757848 760924 763453 765016 766185 767417 768322 768451 767820 766408 764095 761348 758979
58500G58979j921k087k427k498k888l922m576m040l161k890k528j036R95K374
$$ 758979 757058 754971 752544 750046 747158 743236 738660 734620 731459 728569 726041 725005 726000 728374
58486G28374L296M649O196P161P831R004J0569J1959J3252J4516J5024J4542J4233
$$ 728374 731670 736319 742515 749676 757507 766511 777080 789039 802291 816807 831831 846373 860606
58473H60606J4695J4266J1138O204J870j192m073p161r694j1461j2911j3742j3023
$$ 860606 875301 889567 900705 906909 908779 907587 903514 896353 886659 875198 862287 848545 835522
58460H35522j0747p936n287k882q95O22K210M160N723O211O187O459O680O080
$$ 835522 824775 816839 811552 808670 807775 808397 810607 814767 820490 826701 832888 839347 846027 852107
58446H52107M748K984L70l117o034p022o648o282n977m950l290j638P2K036L535
$$ 852107 856855 859839 860209 857092 851058 844036 837388 831106 825129 820179 816889 815251 815323 817359 820894
58431H20894L913L874M406N234N657N962O594P055P105P872J0018J1995J1914
$$ 820894 824807 828681 833087 838321 843978 849940 856534 863589 870694 878566 888584 900579 912493
58418I12493J0083P977N887L566J944J952K577K308J668K062K971K567N23j929
$$ 912493 922576 930553 936440 940006 941950 943902 946479 948787 950455 952517 955488 958055 958578 956649
58404I56649m190o399p990q196p528o912n981m070j977q00Q1J718L379L785L506
$$ 956649 952459 946060 938070 929874 922346 915434 909453 905383 903406 902606 902687 904405 907784 911569 915075
58389I15075L737L742K163K8m19P36J476J281J404K123K520K807M063N721N948
$$ 915075 918812 922554 924717 924745 924326 925062 926538 927819 929223 931346 933866 936673 940736 946457 952405
58374I52405M635L558L639M289N340P201R150R816R414R349R829R974R921J0571
$$ 952405 957040 960598 964237 968526 973866 981067 990217 1000033 1009447 1018796 1028625 1038599 1048520 1059091
58360A059091J1654J2273J2903J4434J5764J5047J2824J1322J0926J0101Q530
$$ 1059091 1070745 1083018 1095921 1110355 1126119 1141166 1153990 1165312 1176238 1186339 1194869
58349A194869P462P147O626O048O563P896Q609Q658R222J0197J0383R934J0099
$$ 1194869 1202331 1209478 1216104 1222152 1228715 1236611 1245220 1253878 1263100 1273297 1283680 1293614 1303713
58336A303713J0889J1451J2277J4326J6516J6933J6024J5735J6013J5239J3515
$$ 1303713 1314602 1326053 1338330 1352656 1369172 1386105 1402129 1417864 1433877 1449116 1462631
58325A462631J2320J1425R478P212O610P213O828N552N546O980P884P937Q701
$$ 1462631 1474951 1486376 1495854 1503066 1509676 1516889 1523717 1529269 1534815 1541795 1549679 1557616 1566317
58312A566317J0170J0807J0974J2522J4952J5878J5384J5989J8094J9450J9495
$$ 1566317 1576487 1587294 1598268 1610790 1625742 1641620 1657004 1672993 1691087 1710537 1730032
58301A730032K0079K1492K1795K0716K0351K1368K2260K2767K4179K5938K5972
$$ 1730032 1750111 1771603 1793398 1814114 1834465 1855833 1878093 1900860 1925039 1950977 1976949
58290A976949K4818K5294K7643K9118K8909K9269L1073L2544L3043L4143L6229
$$ 1976949 2001767 2027061 2054704 2083822 2112731 2142000 2173073 2205617 2238660 2272803 2309032
58279B309032L7929L9409M2307M6182M9120N1813N6813O3714O9430P2934P5093
$$ 2309032 2346961 2386370 2428677 2474859 2523979 2575792 2632605 2696319 2765749 2838683 2913776
58268B913776P4567O9234O1321N5497N2331M9337M7757N1395N8885O4359O6267
$$ 2913776 2988343 3057577 3118898 3174395 3226726 3276063 3323820 3375215 3434100 3498459 3564726
58257C564726O8441P1779P2545P0047O8416O9216O9641O9539P2629P9037Q4261
$$ 3564726 3633167 3704946 3777491 3847538 3915954 3985170 4054811 4124350 4196979 4276016 4360277
58246D360277Q7298R2185R9728J05819J09852J16423J26476J35232J41226J48718
$$ 4360277 4447575 4539760 4639488 4745307 4855159 4971582 5098058 5233290 5374516 5523234
58236E523234J58818J67259J73609J83230J97121K09451K18348K29384K45056
$$ 5523234 5682052 5849311 6022920 6206150 6403271 6612722 6831070 7060454 7305510
58227G305510K60931K75647K94213L17617L39984L60061L84402M15271M46953
$$ 7305510 7566441 7842088 8136301 8453918 8793902 9153963 9538365 9953636 10400589
58218A0400589M78038N15063N59724O05621O52218P08345P77117Q52044R32917
$$ 10400589 10878627 11393690 11953414 12559035 13211253 13919598 14696715 15548759 16481676
58209A6481676J029876J146531J276309J421610J598584J816932K074869K380988
$$ 16481676 17511552 18658083 19934392 21356002 22954586 24771518 26846387 29227375
58201B9227375K759835L229037L795059M479942N327358O376394P661276R245495
$$ 29227375 31987210 35216247 39011306 43491248 48818606 55195000 62856276 72101771
58193G2101771J1219816J3655586J6599721K0122114K4305763K9142484L4409522
$$ 72101771 83321587 96977173 113576894 133699008 158004771 187147255 221556777
58186B21556777L9494896M3088145M3049338L7115872K4478968P014084j1232454
$$ 221556777 261051673 304139818 347189156 384305028 408783996 415798080 404565626
58179D04565626k6150212l5523330l9395493l9098947l6188184l1959291k7349308
$$ 404565626 378415414 342892084 303496591 264397644 228209460 196250169 168900861
58172A68900861k2910312j8869070j5285849j2160686r431884o989250m744267
$$ 168900861 145990549 127121479 111835630 99674944 90243060 83253810 78509543
58165G8509543k663692p75514P46188J506807J078256n87574k950027n167863
$$ 78509543 75845851 75070337 75816525 77323332 78401588 77814014 74863987 69696124
58157F9696124o618794p158280o986185o389214n602187m785794m031679l375056
$$ 69696124 63077330 55919050 48932865 42543651 36941464 32155670 28123991 24748935
58149B4748935k821666k367201j998633j697321j449626j247585j080439r36054
$$ 24748935 21927269 19560068 17561435 15864114 14414488 13166903 12086464 11150410
58141A1150410q10350p05872o21863n53530m98586m56394m23008l94220l70416
$$ 11150410 10340060 9634188 9012325 8458795 7960209 7503815 7080807 6686587 6316171
58132F316171l51797l32837l08388k81186k56395k33034k07717j82527j61732
$$ 6316171 5964374 5631537 5323149 5041963 4785568 4552534 4344817 4162290 4000558
58123D000558j44561j28470j16000j11345j12995j16091j18996j21757j21655
$$ 4000558 3855997 3727527 3611527 3500182 3387187 3271096 3152100 3030343 2908688
58114B908688j16550j09475j03990r8169q8997p9207p3493p1055o8131o5282o5747
$$ 2908688 2792138 2682663 2578673 2480504 2391507 2312300 2238807 2167752 2099621 2034339 1968592
58103A968592o8798p0866p1499p2512p2715o8989o1477n2862m3838l3807k4743
$$ 1968592 1899794 1828928 1757429 1684917 1612202 1543213 1481736 1428874 1385036 1351229 1326486
58092A326486j9623j8039j7208j6196j5537j4331j1578q895q341r035r298j0203
$$ 1326486 1306863 1288824 1271616 1255420 1239883 1225552 1213974 1205079 1196738 1187703 1178405 1168202
58080A168202j3423j7433j9633k0531k2125k3762k3390k1462j9961j8858j7024
$$ 1168202 1154779 1137346 1117713 1097182 1075057 1051295 1027905 1006443 986482 967624 950600
58069I50600j5303j5201j5766j5083j3692j3321j3475j2454j0651r646r123p723
$$ 950600 935297 920096 904330 889247 875555 862234 848759 836305 825654 816008 806885 799162
58057G99162n923n247n621o131p168r189j0561r523p141n682n261m646m083m580
$$ 799162 793239 787992 782371 776240 769072 759883 749322 739799 732658 726976 721715 717069 712986 708406
58043G08406n599n978o078o613o774n876n349o520p950p630o286n771n818n258
$$ 708406 702807 696829 690751 684138 677364 671488 666139 659619 651669 644039 637753 631982 626164 620906
58029F20906m985o496q774r644r189q918q598p023m912m027m166l923l580m329
$$ 620906 615921 609425 600651 591007 581818 572900 564302 557279 552367 548340 544174 540251 536671 532342
58015E32342n412n001l395k503k638k507j929j872k209j945j266j058r14M8J074
$$ 532342 526930 521929 518534 516031 513393 510886 508957 507085 504876 502931 501665 500607 499693 499741 500815
58000E00815Q18o8K33J859L421M304M661M058K505J796L284N264N220L668K908
$$ 500815 501633 501565 501798 503657 507078 511382 516043 520101 522606 524402 527686 532950 538170 541838 544746
57985E44746K934J851l18j607j723k419m150n351n352n160n118m421l314l119
$$ 544746 547680 549531 549213 547606 545883 543464 539314 533963 528611 523451 518333 513912 510598 507479
57971E07479l721l480k072j009r31p92j36J69l8K93J322J815J417J344K221L036
$$ 507479 503758 500278 498206 497197 496266 495474 495338 495507 495469 495762 497084 498899 500316 501660 503881 506917
57955E06917K949K425J977J396P49O23Q71N73l71j019r64p49n37J21J066J490
$$ 506917 509866 512291 514268 515664 516413 517036 517907 518480 518109 517090 516126 515377 514840 514961 516027 517517
57939E17517J290J078Q98L81P6J005K833M110M451M872N900O820O977O474N508
$$ 517517 518807 519885 520783 521164 521240 522245 525078 529188 533639 538511 544411 551231 558208 564682 570190
57924E70190M314L696M225N173N500N483N832N869M463K250Q06jj589l818n016
$$ 570190 574504 578200 582425 587598 593098 598581 604413 610282 614745 616995 617801 617800 616211 612393 607377
57909F07377m878m907n654n884m993m062l943m301n102o885q979r564q341p128
$$ 607377 602499 597592 591938 586054 581061 576999 573056 568755 563653 556768 547789 538225 529884 522756
57895E22756p030o913n705m253l728l762l387k583j888j535j687k453l080k435
$$ 522756 515726 508813 503108 498855 495127 491365 487978 485395 483507 481972 480285 477832 474752 472317
57881D72317p43M97P21R43J753K376K343K412K937K952J832M14m87j296k421l192
$$ 472317 471574 472071 472792 473735 475488 477864 480207 482619 485556 488508 490340 490754 490267 488971 486550 483358
57865D83358l127k995l470l880l444k707k614k962k932k366j574n56P07J768K341
$$ 483358 480231 477236 473766 469886 466442 463735 461121 458159 455227 452861 451287 450731 451438 453206 455547
57850D55547K865L775M871N876O995Q374R658J0577J1244J1604J1372J0846J0829
$$ 455547 458412 462187 467058 472934 479929 488303 497961 508538 519782 531386 542758 553604 564433
57837E64433J1269J0938R078O489M462L371K772K113Q98j071l202m544n014n375
$$ 564433 575702 586640 595718 602207 606669 610040 612812 614925 615823 614752 611550 607006 601992 596617
57823E96617n854n818n030m143l545k803j733r26p16o61m33k45OQ50K035K383
$$ 596617 590763 584945 579915 575772 572227 569424 567691 566765 566049 565388 564955 564710 564716 565566 567601 569984
57807E69984J469K87l48r08j926k901l235l325l742m229m337m348m730n359n875
$$ 569984 571453 571740 571392 570484 568558 565657 562422 559097 555355 551126 546789 542441 537711 532352 526477
57792E26477o201o142n228l494j705l64P64J771K222K074K023K426K829K979L339
$$ 526477 520276 514134 508906 505412 503707 503343 504107 505878 508100 510174 512197 514623 517452 520431 523770
57777E23770M090M727N089N704O557O780O218N938O486O914O500O059O460P057
$$ 523770 527860 532587 537676 543380 549937 556717 562935 568873 575359 582273 588773 594832 601292 608349
57763F08349O827O033N460M947L959K843K128J275n46k911m570n119n231n535
$$ 608349 615176 621209 626669 631616 635575 638418 640546 641821 641275 638364 633794 628675 623444 617909
57749F17909o125o758o811n687l885k932l396l847k839r88J65M17O14P28Rj236
$$ 617909 611784 605026 598215 592528 588643 585711 582315 578468 575629 574641 574806 575223 575837 576565 576574 575338
57733E75338j671q90RJ22j53oO77J499K193K734L211L692M009L845L264K866L003
$$ 575338 573667 572777 572786 572908 572755 572749 573426 574925 577118 579852 583063 586755 590764 594609 597873 600739 603742
57716F03742L258L112K627K049J304M47PJ78K73k00o10k04M51K40p78j497j464
$$ 603742 607000 610112 612739 614788 616092 616539 616546 616724 616997 616797 616187 615983 616434 616674 615896 614399 612935
57699F12935j264j226q98m9P46Q73M52Jj64L4N78J321K002K453K635K635K715
$$ 612935 611671 610445 609547 609498 610244 611117 611569 611570 611406 611440 612018 613339 615341 617794 620429 623064 625779
57682F25779L170L899M407M529M848O064Q205J0716J3209J5838J9147K3650K9389
$$ 625779 628949 632848 637255 641784 646632 652696 660901 671617 684826 700664 719811 743461 772850
57669G72850L5970M3331N2292O3598P6560Q9241R9514J04540R9487P9369M3993
$$ 772850 808820 852151 904443 968041 1044601 1133842 1233356 1337896 1437383 1516752 1560745
57658A560745M16m0673p0952q7230r0661q5205p5835o6002n6353m6424l6869k8993
$$ 1560745 1561161 1520488 1449536 1362306 1271645 1186440 1110605 1044603 988250 941826 904957 875964
57646H75964k2932j7823j3463j0377q439o764n058l821l213k723k050j318m14
$$ 875964 853032 835209 821746 811369 802930 796166 791108 787287 784074 781351 779301 777983 777569
57633G77569R29K321L028L153L567M463N001M582L650K944K711K890L340L582
$$ 777569 778498 780819 783847 787000 790567 795030 800031 804613 808263 811207 813918 816808 820148 823730
57619H23730K993J639L96j3L13Q79J456K045K597L004L158K961K509K177K254
$$ 823730 826723 828362 828758 828745 829058 829937 831393 833438 836035 839039 842197 845158 847667 849844 852098
57604H52098K591K829K905L048L441M105M880N271M778L682K957K995K947K024
$$ 852098 854689 857518 860423 863471 866912 871017 875897 881168 885946 889628 892585 895580 898527 900551
57590I00551Q53O61J513K274K203J676J346J410J765K242K524K355J870J342P52
$$ 900551 901404 902065 903578 905852 908055 909731 911077 912487 914252 916494 919018 921373 923243 924585 925337
57575I25337Oo42q51o88l67K32J196K103K511K660K985L273L061K668K885L765
$$ 925337 925343 924701 923850 923162 922795 923027 924223 926326 928837 931497 934482 937755 940816 943484 946369 950134
57559I50134M509M584M250L980L946M185M654N139N507N926O442O656O343O007
$$ 950134 954643 959227 963477 967457 971403 975588 980242 985381 990888 996814 1003256 1009912 1016255 1022262
57545A022262O106O251N889N439N700O469O900P013P720R182J0344J0390R699
$$ 1022262 1028368 1034619 1040508 1045947 1051647 1058116 1065016 1072029 1079749 1088931 1099275 1109665 1119364
57532A119364Q988Q339P516O612N933N690N904O301O325N838N668O660Q276R001
$$ 1119364 1128352 1136691 1144207 1150819 1156752 1162442 1168346 1174647 1180972 1186810 1192478 1199138 1207414 1216415
57518A216415Q316P389P508Q634R863J0585J0764J0547J0166R906R888R960R883
$$ 1216415 1224731 1232120 1239628 1248262 1258125 1268710 1279474 1290021 1300187 1310093 1319981 1329941 1339824
57505A339824R455Q534P366O642O788P318P433P101O884O866O566N935N583N837
$$ 1339824 1349279 1357813 1365179 1371821 1378609 1385927 1393360 1400461 1407345 1414211 1420777 1426712 1432295 1438132
57491A438132O295O626P096Q040R213J0049J0187R653Q851Q426Q738R431R852
$$ 1438132 1444427 1451053 1458149 1466189 1475402 1485451 1495638 1505291 1514142 1522568 1531306 1540737 1550589
57478A550589R833R697R598R425R216R145R100Q792Q259P805P587P635Q077Q868
$$ 1550589 1560422 1570119 1579717 1589142 1598358 1607503 1616603 1625395 1633654 1641459 1649046 1656681 1664758 1673626
57464A673626R541R835J0226J1198J2257J2530J2032J1566J1551J1794J2227J2925
$$ 1673626 1683167 1693002 1703228 1714426 1726683 1739213 1751245 1762811 1774362 1786156 1798383 1811308
57452A811308J3521J3571J3389J3614J4109J4195J3879J3774J3943J3920J3793
$$ 1811308 1824829 1838400 1851789 1865403 1879512 1893707 1907586 1921360 1935303 1949223 1963016
57441A963016J4117J4682J4692J4220J4169J4660J4776J4257J4005J4439J4711
$$ 1963016 1977133 1991815 2006507 2020727 2034896 2049556 2064332 2078589 2092594 2107033 2121744
57430B121744J4238J3782J4228J5268J6102J6492J6409J5638J4492J4091J5030
$$ 2121744 2135982 2149764 2163992 2179260 2195362 2211854 2228263 2243901 2258393 2272484 2287514
57419B287514J6469J7255J7247J6927J6435J5808J5415J5360J5102J4379J3953
$$ 2287514 2303983 2321238 2338485 2355412 2371847 2387655 2403070 2418430 2433532 2447911 2461864
57408B461864J4650J6147J7462J8184J8503J8470J8034J7430J6966J6683J6606
$$ 2461864 2476514 2492661 2510123 2528307 2546810 2565280 2583314 2600744 2617710 2634393 2650999
57397B650999J6970J7720J8310J8438J8547J9112J9984K0828K1620K2232K2177
$$ 2650999 2667969 2685689 2703999 2722437 2740984 2760096 2780080 2800908 2822528 2844760 2866937
57386B866937K1373K0613K0667K1446K2428K3321K3816K3507K2722K2646K3819
$$ 2866937 2888310 2908923 2929590 2951036 2973464 2996785 3020601 3044108 3066830 3089476 3113295
57375C113295K5180K5406K4613K3865K3675K3871K4409K5172K5475K4843K3987
$$ 3113295 3138475 3163881 3188494 3212359 3236034 3259905 3284314 3309486 3334961 3359804 3383791
57364C383791K3957K4570K4768K4381K4315K4954K5560K5570K5467K5842K6400
$$ 3383791 3407748 3432318 3457086 3481467 3505782 3530736 3556296 3581866 3607333 3633175 3659575
57353C659575K6539K6382K6605K7360K7950K7662K6698K6000K6222K7001K7479
$$ 3659575 3686114 3712496 3739101 3766461 3794411 3822073 3848771 3874771 3900993 3927994 3955473
57342C955473K7292K6752K6250K6021K6363K7399K8486K8721K8231K8137K8885
$$ 3955473 3982765 4009517 4035767 4061788 4088151 4115550 4144036 4172757 4200988 4229125 4258010
57331D258010K9452K8883K7736K7190K7356K7462K7270K7247K7567K7921K8231
$$ 4258010 4287462 4316345 4344081 4371271 4398627 4426089 4453359 4480606 4508173 4536094 4564325
57320D564325K8738K9320K9521K9344K9372K9903L0476L0447K9778K9057K8945
$$ 4564325 4593063 4622383 4651904 4681248 4710620 4740523 4770999 4801446 4831224 4860281 4889226
57309D889226K9596L0482L0940L0927L1004L1468L1865L1659L0955L0268K9969
$$ 4889226 4918822 4949304 4980244 5011171 5042175 5073643 5105508 5137167 5168122 5198390 5228359
57298E228359L0180L0854L1573L1743L1335L1021L1279L1782L2113L2399L2805
$$ 5228359 5258539 5289393 5320966 5352709 5384044 5415065 5446344 5478126 5510239 5542638 5575443
57287E575443L2921L2374L1604L1396L1890L2622L3146L3164L2459L1286L0423
$$ 5575443 5608364 5640738 5672342 5703738 5735628 5768250 5801396 5834560 5867019 5898305 5928728
57276E928728L0308L0547L0706L0960L1324L0955K9252K7104K5990K6125K6431
$$ 5928728 5959036 5989583 6020289 6051249 6082573 6113528 6142780 6169884 6195874 6221999 6248430
57265F248430K6159K5539K4950K4466K4203K4323K4618K4755K4831K5088K5266
$$ 6248430 6274589 6300128 6325078 6349544 6373747 6398070 6422688 6447443 6472274 6497362 6522628
57254F522628K4983K4468K4141K3684K2536K1098K0411K0567K0640K0260K0208
$$ 6522628 6547611 6572079 6596220 6619904 6642440 6663538 6683949 6704516 6725156 6745416 6765624
57243F765624K1123K2610K4007K5188K6143K6582K6506K6494K6912K7342K7307
$$ 6765624 6786747 6809357 6833364 6858552 6884695 6911277 6937783 6964277 6991189 7018531 7045838
57232G045838K7043K7074K7461K7964K8548K9257K9835K9938K9550K8794K7543
$$ 7045838 7072881 7099955 7127416 7155380 7183928 7213185 7243020 7272958 7302508 7331302 7358845
57221G358845K5597K3260K1244J9907J8704J6653J3330R425O094L769J829m58
$$ 7358845 7384442 7407702 7428946 7448853 7467557 7484210 7497540 7506965 7513059 7516828 7518657 7518199
57209G518199l012n236p019q882j1138j3322j4637j4750j4006j3072j2441j2211
$$ 7518199 7515187 7509951 7502932 7494050 7482912 7469590 7454953 7440203 7426197 7413125 7400684 7388473
57197G388473j2202j2205j2075j1747j1288j0906j0622j0063q945p675o952o816
$$ 7388473 7376271 7364066 7351991 7340244 7328956 7318050 7307428 7297365 7288420 7280745 7273793 7266977
57185G266977o700o451o553p116p464p155o620o291n819m893m027l733l464k330
$$ 7266977 7260277 7253826 7247273 7240157 7232693 7225538 7218918 7212627 7206808 7201915 7197888 7194155 7190691 7188361
57171G188361m61J188K018J971R92p10k187k690k930m349p143j0015j2078j3926
$$ 7188361 7187900 7189088 7191106 7193077 7194069 7193359 7191172 7188482 7185552 7181203 7174060 7164045 7151967 7138041
57157G138041j6459j9498k2162k4087k5727k7666k9958l2113l3721l5135l7292
$$ 7138041 7121582 7102084 7079922 7055835 7030108 7002442 6972484 6940371 6906650 6871515 6834223
57146F834223m0605m4325m7329m9163m9933m9672m8423m6525m4095m0571l5617
$$ 6834223 6793618 6749293 6701964 6652801 6602868 6553196 6504773 6458248 6414153 6373582 6337965
57135F337965l0162k5574k2020j8597j5124j2697j2243j3472j5598j8310k1508
$$ 6337965 6307803 6282229 6260209 6241612 6226488 6213791 6201548 6188076 6172478 6154168 6132660
57124F132660k4605k6681k7001k5081k0472j2862k355J0492K4877M0108N5801
$$ 6132660 6108055 6081374 6054373 6029292 6008820 5995958 5993603 6004095 6028972 6069080 6124881
57113F124881P1624Q6880J00782J13469J26529J42319J63092J90856K27465K74214
$$ 6124881 6196505 6283385 6384167 6497636 6624165 6766484 6929576 7120432 7347897 7622111
57103G622111L31680M00520M82454N80571O99210Q43694J019374J230334J479234
$$ 7622111 7953791 8354311 8836765 9417336 10116546 10960240 11979614 13209948 14689182
57094A4689182J768340K100104K476459K897847L362011L861907M384516M912748
$$ 14689182 16457522 18557626 21034085 23931932 27293943 31155850 35540366 40453114
57086D0453114N428014N909220O330490O662939O876001O927589O749314O253629
$$ 40453114 45881128 51790348 58120838 64783777 71659778 78587367 85336681 91590310
57078I1590310N376366M126307K597290R32847p23532k258350l594604m688730
$$ 91590310 96966676 101092983 103690273 104623120 103899588 101641238 98046634 93357904
57070I3357904n525072o107457o451154o579521o523197o317116n996267n593715
$$ 93357904 87832832 81725375 75274221 68694700 62171503 55854387 49858120 44264405
57062D4264405n140114m662220m181323l713765l272200k865409k497827k170485
$$ 44264405 39124291 34462071 30280748 26566983 23294783 20429374 17931547 15761062
57054A5761062j882190j629674j408305j214244j045551r00681p76956o71349
$$ 15761062 13878872 12249198 10840893 9626649 8581098 7680417 6903461 6232112
57046F232112n81635n05794m41321l86149l39391l00168k66665k37277k11813
$$ 6232112 5650477 5144683 4703362 4317213 3977822 3677654 3410989 3173712 2961899
57037B961899j90443j72257j55857j40725j27043j14812j03912r4348q5844p7889
$$ 2961899 2771456 2599199 2443342 2302617 2175574 2060762 1956850 1862502 1776658 1698769
57027A698769p0624o4685n9715n4364m8261m2514l7498l1789k4247j5465n974
$$ 1698769 1628145 1563460 1503745 1449381 1401120 1358606 1321108 1289319 1265072 1249607 1243633
57016A243633N256J9236L5641N4592P7954J07377J42827J83934K28186K63354
$$ 1243633 1248889 1268125 1303766 1358358 1436312 1543689 1686516 1870450 2098636 2361990
57006B361990K65285K12188J05519k5538j42498k20484k55805k58236k40662k13667
$$ 2361990 2627275 2839463 2944982 2919444 2776946 2556462 2300657 2042421 1801759 1588092
56996A588092j84187j55978j30906j09837r2574p8038o5306n4074m3977l4348
$$ 1588092 1403905 1247927 1117021 1007184 914610 836572 771266 717192 673215 638867
56986F38867k5020j6608r460l139K548O514O953K794n348j5131k3495k8473l0316
$$ 638867 613847 597239 587779 584640 587188 593702 600655 603449 598101 582970 559475 531002 500686
56973E00686l0431k9434k6971k3146j8943j5083j1466q012n078k705l24K360N048
$$ 500686 470255 440821 413850 390704 371761 356678 345212 337200 332122 329417 329093 331453 336501
56960C36501P807J1501J6587K2173K6749K9218K8600K3583J3578J83j3246k3750
$$ 336501 344308 355809 372396 394569 421318 450536 479136 502719 516297 516480 503234 479484
56948D79484l0232l2961l2418k9138k4278j9469j5715j2642r324n580k043R80
$$ 479484 449252 416291 383873 354735 330457 310988 295273 282631 273307 267727 265684 266664
56936B66664M040P807J2369J7536K3204K9130L4716L9039M0477L6462K5042P504
$$ 266664 270704 278511 290880 308416 331620 360750 395466 434505 474982 511444 536486 543990
56924E43990j1419k6898l7009m2142m2851l9736l4564k9631k5876k2640j9197
$$ 543990 532571 505673 468664 426522 383671 343935 309371 279740 253864 231224 212027
56913B12027j5672j2542j0194q861q228p349n680l883k843k353j658p50j08M38
$$ 212027 196355 183813 173619 164758 156530 149181 143501 139618 136775 134422 132764 132014 131906 132344
56899A32344J351K289K612K669L341M587N772P203R797J3342J6617J9350K2508
$$ 132344 133695 135984 138596 141265 144606 149193 154965 162168 171965 185307 201924 221274 243782
56886B43782K6388K9892L1942L2143K9645K3142J2845J292q713j5961k0233k1212
$$ 243782 270170 300062 332004 364147 393792 416934 429779 431071 422358 406397 386164 364952
56874C64952j9185j5750j2633j0093p268l574Q62N669J0461J5031J9779K5539
$$ 364952 345767 330017 317384 307291 300023 296449 297311 302980 313441 328472 348251 373790
56862C73790L2590M0366M8394N6694O4447O8770O5645N2503L0185L129k2354m1011
$$ 373790 406380 446746 495140 551834 616281 685051 750696 803199 833384 836513 814159 773148
56850G73148n0898n3243n0435m4594l7425l0025k2440j4212n659K251R451J7205
$$ 773148 722250 669007 618572 573978 536553 506528 484088 469876 464217 466468 475919 493124
56838D93124K6532L7199M8764O1594P6037R1086J04256J11760J08498Q9632N4476
$$ 493124 519656 556855 605619 667213 743250 834336 938592 1050352 1158850 1248482 1302958
56827A302958R143l5787p0973r2270j00561r9242r1934q1376o9326n7002m5314
$$ 1302958 1312101 1276314 1205341 1113071 1012510 913268 821334 739958 670632 613630 568316
56816E68316l4583k4403j4152l628O912J7179K7238L7676M9253O1968P4075Q2123
$$ 568316 533733 509330 495178 491550 498462 515641 542879 580555 629808 691776 765851 847974
56804H47974Q2007P0410M6438J3195k2336n2278p1759q0298q0141p4227o5468
$$ 847974 929981 1000391 1046829 1060024 1037688 985410 913651 833353 753212 678985 613517
56793F13517n6283m7850m0066l2551k5238j8021j0691l503K903Q493J4086K0322
$$ 613517 557234 509384 469318 436767 411529 393508 382817 379314 382217 390710 404796 425118
56781D25118K6996L3455L8661M0479L6028K3865N753j4091l1299m3052m8658m9248
$$ 425118 452114 485569 524230 564709 600737 624602 630355 616264 584965 541913 493255 444007
56769D44007m6700m2449l7360l2317k8089k4540k0945j7239j4144j1877r801p686
$$ 444007 397307 354858 317498 285181 257092 232552 211607 194368 180224 168347 158546 150860
56757A50860o198n654n349m793m534m935n099m075k448j668k122k831k839k161
$$ 150860 144662 139008 133659 128866 124332 119397 114298 110223 107775 106107 103985 101154 98315 96154
56743I6154j434j168j277j210p14m24j079k142k182q45N68R29O12L73N7o77j245
$$ 96154 94720 93552 92275 91065 90351 89927 88848 86706 84524 83679 84247 85176 85788 86161 86218 85541 84296
56726H4296r08m6L94K35n9l21o23o39n7P05J060J189J601K060J902J214Q26J131
$$ 84296 83388 83342 83736 83971 83912 83591 82968 82329 82272 82977 84037 85226 86827 88887 90789 92003 92829 93960
56708I3960J675J875J606J051N09K45J72j24p08j050q42n64p14r43o53k9K74J20
$$ 93960 95635 97510 99116 100167 100676 100921 101093 100969 100261 99211 98369 97805 97091 96148 95495 95466 95740 95860
56690I5860q6j31o1J69M91M49k15r16r16l53O5J64L47P32J011J076J113J107Q95
$$ 95860 95774 95643 95582 95751 96242 96691 96476 95560 94644 94291 94356 94520 94867 95599 96610 97686 98799 99906 100801
56671A00801O62P97J257J530J333Q51L66K3j16j14k29n51p58n43m7M40R56J603
$$ 100801 101463 102260 103517 105047 106380 107231 107597 107620 107504 107390 107161 106610 105852 105309 105262 105702 106658 108261
56653A08261K173K415K465K497K229J354L02r7L58J035J312J250J317J825K707
$$ 108261 110434 112849 115314 117811 120040 121394 121696 121599 121957 122992 124304 125554 126871 128696 131403
56638A31403L606M157M211L801K975J870Q46J77l54j106j882k127j812j453j199
$$ 131403 135009 139166 143377 147178 150153 152023 152869 153046 152692 151586 149704 147577 145765 144312 143113
56623A43113o64J27N09K72J39O14J081P44j72q16r08q51j033j477j973k173j904
$$ 143113 142449 142576 143085 143357 143496 144110 145191 145935 145763 144947 144039 143188 142155 140678 138705 136532 134628
56606A34628j553j624j832j355k24M51O5n68m86P4L28J64p5l64p57r27o34k31
$$ 134628 133075 131451 129619 128264 128040 128491 128556 127988 127502 127576 127904 128068 127993 127629 126872 125945 125311 125080
56588A25080n1J65O70J167J383J581J880J786J065L88M43R70J339J398J225P98
$$ 125080 125029 125194 125864 127031 128414 129995 131875 133661 134726 135114 135557 136527 137866 139264 140489 141287
56572A41287M47P77J509J447L81j75Q82K497L024K529K186K347K741L768N967
$$ 141287 141734 142511 144020 145467 145848 145673 146555 149052 152076 154605 156791 159138 161879 165647 171614
56557A71614Q535R941R745Q653P111N209L556K870K838K627K333K665L416L527
$$ 171614 180149 190090 199835 208488 215599 220808 224364 227234 230072 232699 235032 237697 241113 244640
56543B44640K674J608R99Q48R80J140Q28j12r50r96o77p94j220j388j563k385
$$ 244640 247314 248922 249921 250769 251749 252889 253717 253605 252655 251659 250982 250188 248968 247580 246017 243632
56527B43632l563m207m199m096l950l440k857k843l343l868m406n085n398m881
$$ 243632 240069 235862 231663 227567 223617 220177 217320 214477 211134 207266 202860 197775 192377 187496
56513A87496m081l690l261k159j078j163k059k428k010j621j450r72l17j19k49
$$ 187496 183415 179725 176464 174305 173227 172064 170005 167577 165567 163946 162496 161524 161207 161088 160839
56498A60839j53j23o90j156m97O40P56l6l09M6k29j185j318j64R19J080J111J594
$$ 160839 160686 160563 159873 158717 158220 158860 159616 159580 159271 159317 159088 157903 156585 156421 157340 158420 159531 161125
56480A61125J820J336Q58Q45P02J73jN07R19P54O16R47J330J521J839K101J636
$$ 161125 162945 164281 165139 165984 166686 166859 166858 167365 168284 169038 169654 170601 171931 173452 175291 177392 179028
56463A79028P55P19J685K274J782J235J506J986J966J832J964J809R73M9m93j023
$$ 179028 179783 180502 182187 184461 186243 187478 188984 190970 192936 194768 196732 198541 199514 199563 199070 198047
56447A98047j597j374o2J273J707J664J853K122K153K171K199J732Q80O77J534
$$ 198047 196450 195076 195014 196287 197994 199658 201511 203633 205786 207957 210156 211888 212768 213445 214979
56432B14979K482K671K475K393K097J357P42N48J64p04j305j073n03j07L42Q21
$$ 214979 217461 220132 222607 225000 227097 228454 229196 229744 229908 229204 227899 226826 226323 226216 226558 227379
56416B27379O02l20p23k4O07K5j158j751j731j706j623j188p81q26r81q97r76
$$ 227379 227981 227661 226938 226914 227521 227546 226388 224637 222906 221200 219577 218389 217608 216782 215801 214904 213928
56399B13928j523j873j312j59Q01J286J284P41Pj60L14O55N75P20J293J507J011
$$ 213928 212405 210532 209220 209061 209862 211148 212432 213173 213180 213020 213334 213989 214564 215284 216577 218084 219095
56382B19095O26R32J395J594K006K766L055K556K266K786L203K653J702J133O75
$$ 219095 219721 220653 222048 223642 225648 228414 231469 234025 236291 239077 242280 244933 246635 247768 248443
56367B48443M8l3Q55J730J658J186J142J129M70m00p87r26j205j205o66l07m96
$$ 248443 248491 248458 249313 251043 252701 253887 255029 256158 256628 256228 255441 254515 253310 252105 251439 251132 250636
56350B50636l23P57J607J148K37K50Q86R98O96Q63J357J308P06K51J02M6L34J132
$$ 250636 250313 251070 252677 253825 254062 254312 255198 256196 256892 257755 259112 260420 261126 261377 261479 261525 261859 262991
56332B62991J794J743J457J572J760J581J435J655J637J056Q21J550K257J950
$$ 262991 264785 266528 267985 269557 271317 272898 274333 275988 277625 278681 279502 281052 283309 285259
56318B85259J370J643K300K317K045K304K516J664L58P0P98J280J117R18Q03M30
$$ 285259 286629 288272 290572 292889 294934 297238 299754 301418 301776 301846 302644 303924 305041 305959 306762 307192
56302C07192J30N45J373J841J993K214K123J276L79L34O92N22J62N41J390J729
$$ 307192 307322 307867 309240 311081 313074 315288 317411 318687 319066 319400 320092 320614 320776 321317 322707 324436
56286C24436J563J562J559J006L81N36J113J215J112J689K647K919K477K098J763
$$ 324436 325999 327561 329120 330126 330507 331043 332156 333371 334483 336172 338819 341738 344215 346313 348076
56271C48076R36N2Q5R22J693K292L014L228K156O81N08J760L013L539L813M008
$$ 348076 349012 349064 349149 350071 351764 354056 357070 360298 362454 363135 363643 365403 368416 371955 375768 379776
56255C79776L765L411L736M572N126N595O848Q597R578R596R829J0886J2019J2492
$$ 379776 383541 386952 390688 395260 400386 405981 412829 421426 431004 440600 450429 461315 473334 485826
56241D85826J2453J2236J1936J1848J2334J3168J3800J4131J4209J3623J2119
$$ 485826 498279 510515 522451 534299 546633 559801 573601 587732 601941 615564 627683
56230F27683J0427R348Q491O886M443J796o90k858m322n095n915o965p248o329
$$ 627683 638110 647458 655949 662835 667278 669074 668384 665526 661204 656109 650194 643229 635981 629652
56216F29652n522o001o909o826o010n484n056m094l287l647m584m829m469m255
$$ 629652 624130 618129 611220 604394 598384 592900 587844 583750 580463 576816 572232 567403 562934 558679
56202E58679l831k628j577j796k351j594L1P54M30M19J034J459J754K689L821
$$ 558679 554848 552220 550643 548847 546496 544902 544933 545687 546117 546536 547570 549029 550783 553472 557293
56187E57293L978L411L454M214M630M416M088L517K440J817K556L488K865J233
$$ 557293 561271 564682 568136 572350 576980 581396 585484 589001 591441 593258 595814 599302 602167 603400
56173F03400N06P88O17p3J20J378K373K595K703K783K424K335L529N238N789N231
$$ 603400 603906 604694 605311 605238 605358 606736 609109 611704 614407 617190 619614 621949 625478 630716 636505 641736
56157F41736M925N115N225N882Q025J0523J1353J0762J0629J1204J1335J1389
$$ 641736 646661 651776 657001 662883 670908 681431 692784 703546 714175 725379 736714 748103
56145G48103J2814J5027J5903J5423J5853J8196K1248K4279K7730L1212L3739
$$ 748103 760917 775944 791847 807270 823123 841319 862567 886846 914576 945788 979527
56134I79527L6269M1272M9444N9364P0445Q3660R9344J16683J35111J53562J68682
$$ 979527 1015796 1057068 1106512 1165876 1236321 1319981 1419325 1536008 1671119 1824681 1993363
56123A993363J76491J75612J66550J49216J24691R8500P7839O5354N8759N5653
$$ 1993363 2169854 2345466 2512016 2661232 2785923 2884423 2962262 3027616 3086375 3142028
56113C142028N4440N1165M0808K3064L127j3943k6216l2712l3262l1755l5111
$$ 3142028 3196468 3247633 3288441 3311505 3314632 3300689 3274473 3241761 3208499 3176744 3141633
56102C141633m7211o6676r0739j17033j40906j55965j59555j54491j44202j29709
$$ 3141633 3094422 3027746 2937007 2819974 2679068 2523103 2363548 2209057 2064855 1935146
56092A935146j12315r5167q0225o6892n4910m5347l7791l0135k2303j6658j3653
$$ 1935146 1822831 1727664 1647439 1580547 1525637 1480290 1442499 1412364 1390061 1373403 1359750
56081A359750j0725o595k980r84N46K102K681K887M901Q371J0291J0009J0313
$$ 1359750 1349025 1342430 1339450 1338466 1339012 1341114 1343795 1346682 1351583 1359954 1370245 1380254 1390567
56068A390567J2509J4670J5898J7825K0625K1931K1217K0968K2072K2461K1549
$$ 1390567 1403076 1417746 1433644 1451469 1472094 1494025 1515242 1536210 1558282 1580743 1602292
56057A602292K1463K2471K1990J9660J8544J9623K0053J8721J8439K0588K2624
$$ 1602292 1623755 1646226 1668216 1687876 1706420 1726043 1746096 1764817 1783256 1803844 1826468
56046A826468K3024K3771K5790K6924K6712K8024L1619L4187L4229L4786L7867
$$ 1826468 1849492 1873263 1899053 1925977 1952689 1980713 2012332 2046519 2080748 2115534 2153401
56035B153401M1328M3817M7536N3415N8589O1303O3186O4317O1527N4175M6319
$$ 2153401 2194729 2238546 2286082 2339497 2398086 2459389 2522575 2586892 2648419 2702594 2748913
56024B748913M0737L6308L3291L4907M1115M7129N0806N5185O1323O5677O7375
$$ 2748913 2789650 2825958 2859249 2894156 2935271 2982400 3033206 3088391 3149714 3215391 3282766
56013C282766P0678P6930Q1568Q2656Q4840R0892R7043J00692J05041J11863J17592
$$ 3282766 3353444 3430374 3511942 3594598 3679438 3770330 3867373 3968065 4073106 4184969 4302561
56002D302561J20974J26468J35626J43445J47833J53912J64180J73570J79557
$$ 4302561 4423535 4550003 4685629 4829074 4976907 5130819 5294999 5468569 5648126
55993E648126J87575K00724K13729K23262K34400K50580K67162K81366K98206
$$ 5648126 5835701 6036425 6250154 6473416 6707816 6958396 7225558 7506924 7805130
55984G805130L19910L40480L57762L79452M09773M42218M73114N09496N55277
$$ 7805130 8125040 8465520 8823282 9202734 9612507 10054725 10527839 11037335 11592612
55975A1592612O03362O50580P06155P75632Q51655R31081J025143J141397J272998
$$ 11592612 12195974 12846554 13552709 14328341 15179996 16111077 17136220 18277617 19550615
55966A9550615J418366J593329J810610K067331K367717K737194L198452L757367
$$ 19550615 20968981 22562310 24372920 26440251 28807968 31545162 34743614 38500981
55958C8500981M430667N262790O298217P568566R129856J1077892J3499871J6448111
$$ 38500981 42931648 48194438 54492655 62061221 71191077 82268969 95768840 112216951
55950A12216951J9987863K4215513K9166606L4686589M0279422M4811261M6242758
$$ 112216951 132204814 156420327 185586933 220273522 260552944 305364205 351606963
55943C51606963M2062348L0763518J3428664o189389k3514405l5455971m1367515
$$ 351606963 393669311 424432829 437861493 431672104 408157699 372701728 331334213
55936C31334213m2357529m0084578l6037085l1338312k6713539k2515202j8855864
$$ 331334213 288976684 248892106 212855021 181516709 154803170 132287968 113432104
55929A13432104j5755844j3187941j1072871r319373p869769o683764n706384
$$ 113432104 97676260 84488319 73415448 64096075 56226306 49542542 43836158
55922D3836158m884682m194882l624610l146264k731818k375682k079329j828360
$$ 43836158 38951476 34756594 31131984 27985720 25253902 22878220 20798891 18970531
55914A8970531j605232j409915j248101j111590r88353q79970p92058p18183o48932
$$ 18970531 17365299 15955384 14707283 13595693 12607340 11727370 10935312 10217129 9568197
55905I568197n86773n37253m94903m51829m11274l79514l52682l24141k96894
$$ 9568197 8981424 8444171 7949268 7497439 7086165 6706651 6353969 6029828 5732934
55896E732934k76542k59432k39366k19177k04596j93076j79066j64274j52840
$$ 5732934 5456392 5196960 4957594 4738417 4533821 4340745 4161679 3997405 3844565
55887C844565j42312j28807j15304j05852r7149q4524p0690o0006m9645l4829
$$ 3844565 3702253 3573446 3458142 3352290 3255141 3170617 3099927 3039921 2990276 2955447
55877B955447j7688k652J1864K9046M5538N5452N8099N4600M1744J7105j3752
$$ 2955447 2937759 2935107 2946971 2976017 3021555 3077007 3135106 3189706 3231450 3248555 3234803
55866C234803m2610o7740r1467j13074j30776j46384j60879j69059j65423j52146
$$ 3234803 3192193 3124453 3032986 2919912 2789136 2642752 2481873 2312814 2147391 1995245
55856A995245j35208j16580r6333p8238o6114n7822m9416m2189l9371l9145l7430
$$ 1995245 1860037 1743457 1647124 1568886 1502772 1444950 1395534 1353345 1313974 1274829 1237399
55845A237399l4734l3890l3745l1305k7708k6020k5445k3378k0874k0397k0461
$$ 1237399 1202665 1168775 1135030 1103725 1076017 1049997 1024552 1001174 980300 959903 939442
55834I39442j8152j4799j3669j4115j3397j2132j2612j3669j2606j0379r822j0494
$$ 939442 921290 906491 892822 878707 865310 853178 840566 826897 814291 803912 794090 783596
55822G83596j0267j0053j1911j4329j4397j2990j2895j3546j2518j0584j0232
$$ 783596 773329 763276 751365 737036 722639 709649 696754 683208 670690 660106 649874
55811F49874j0629r033n904l943l205j685M93J871L261O236R332J0148R780J0749
$$ 649874 639245 630212 624308 620365 617160 615475 615968 617839 621100 627336 636668 646816 656596 667345
55797F67345J1971J0365O189K220j248n956j1331j5017j7032j9084k0616j9737
$$ 667345 679316 689681 695870 698090 696842 690886 679555 664538 647506 628422 607806 588069
55785E88069j7216j5342j3659j0037n221k140j388j494k728o391j0920j3010j2238
$$ 588069 570853 555511 541852 531815 526594 524454 523066 521572 518844 512453 501533 488523 476285
55772D76285j0745q990n897k447p64k2K398N813O561L448j023m854q127j0394
$$ 476285 465540 456550 450653 448206 447442 447420 449818 455631 462192 465640 464617 459763 451636 441242
55758D41242j0550r542r571j0350r719p916p484q715r064p551o121n994o110n919
$$ 441242 430692 421150 411579 401229 391510 383594 376110 367395 358331 350780 344659 338665 332555 326636
55744C26636o410p616q049p390p004p173o503m568k625j293k6R19N17o88q20M69
$$ 326636 320226 312610 304561 297171 290167 282994 276491 271923 269298 268005 267979 268898 269415 268727 267907 268376
55728B68376J573J474N62r14k848m079l633k783l408m785m727l350k667k940k553
$$ 268376 269949 271423 271985 271071 268223 264144 260511 257728 254320 249535 244808 241458 238791 235851 233298
55713B33298j398j041j491r98O60J790J944K453L517L742K963K530K416R98j803
$$ 233298 231900 230859 229368 228370 229030 230820 232764 235217 238734 242476 245439 247969 250385 251383 249580
55698B49580m059n063o107p467p571o006m537m215m043l335k904l008k582j394
$$ 249580 245521 240458 234351 226884 219313 213307 208770 204555 200512 197177 194273 191265 188683 187289
55684A87289o07m46L57J966K672J723P05J055K149K780K749K151Q02r39k239l081
$$ 187289 186682 186236 186593 188559 191231 192954 193659 194714 196863 199643 202392 204543 205345 204406 202167 199086
55668A99086m019m626l993k665k020j853p94R36J719J506J996L529M558M623N149
$$ 199086 195067 190441 186448 183783 181763 179910 179116 180052 181771 183277 185273 188802 193360 197983 203132
55653B03132O651P774P895Q009Q237P061M063R71j107l096n597p480q071q454
$$ 203132 209783 217557 225452 233461 241698 248759 252822 253793 252686 249590 243993 236513 228442 219988
55639B19988r292r443q165o684o251o334o020n466m830l510j635o49j171j814
$$ 219988 210696 201253 193088 186404 180153 173819 167799 162333 157503 153993 152358 151709 150538 148724
55625A48724j322l26J08J46K21j53j368k692l299l282k891j963p90k76n32n85
$$ 148724 147402 147076 147184 147330 147551 147398 146030 143338 140039 136757 133866 131903 131113 130837 130305 129720
55609A29720m7J96m29j272j672j779j683j101l47k35o35n83p4q0n68l42O94J095
$$ 129720 129673 129869 129440 128168 126496 124717 123034 121933 121586 121351 120716 120133 120059 119979 119411 119069 119763 120858
55591A20858K46o76q27q72j283j306n51J18J31Q7L55M07J98N61J471J685Q02l4
$$ 120858 121104 120428 119601 118729 117446 116140 115589 115707 115838 115925 116280 116687 116885 117446 118917 120602 121404 121370
55573A21370j76m04j057j147k32O39P65Q42J259J195L43k86k53n41j511j913j074
$$ 121370 121194 120790 119733 118586 118354 118993 119758 120600 121859 123054 123397 123111 122858 122317 120806 118893 117819
55556A17819k02k99o20m23m48j251j865j502j016j269j593j254q66r68p58K83
$$ 117819 117617 117318 116698 116275 115827 114576 112711 111209 110193 108924 107331 106077 105211 104243 103485 103768
55540A03768J018M65m48m34J67M36M86N94R4j255k108j338Q6O24L90L61N10K55
$$ 103768 104786 105251 104803 104369 104536 104972 105458 106052 106146 104891 102783 101445 101531 102155 102545 102906 103416 103671
55522A03671j58l09o43j496k055j649j114j394j843j339j65O46R51J077P57j28
$$ 103671 103513 103204 102561 101065 99010 97361 96247 94853 93010 91671 91506 92152 93103 94180 94937 94809
55506I4809o23j3P59M14o44j093o85j61J35K83Q9m65p20l64j13m05m63K34P56
$$ 94809 94186 94173 94932 95346 94702 93609 92924 92763 92898 93181 93270 92805 92085 91721 91608 91203 90740 90974 91730
55487I1730L22j60L19Q66R2j402j803p99K89O69O88O27L54P1J14J99j04n05n26
$$ 91730 92052 91892 92211 93077 93169 91767 89964 89165 89454 90123 90811 91438 91792 91863 91977 92176 92072 91567 91041
55468I1041l81l73j21N51P69j26j234j297n77j69j51J50O21N91K02J62M06K87
$$ 91041 90660 90287 90166 90717 91486 91360 90126 88829 88252 88083 87932 88082 88703 89294 89496 89658 90064 90351
55450I0351j45k80j06j46l94l61L7M47O42M62l01j273j457n75L52M78K35R8m33
$$ 90351 90206 89926 89820 89674 89280 88919 88956 89403 90045 90507 90206 88933 87476 86901 87253 87731 87966 88064 87631
55431H7631j523j906o40J113J701J397J510J924J489L13l01K3L75K53M2o3k14
$$ 87631 86108 84202 83562 84675 86376 87773 89283 91207 92696 93009 92708 92731 93106 93359 93401 93338 93124
55414I3124j23N85J446J751J769K089K294J712R63J106J645J163k41j029p15m77
$$ 93124 93001 93586 95032 96783 98552 100641 102935 104647 105610 106716 108361 109524 109283 108254 107539 107062
55398A07062r94j460j255j059j528k084j823q47lJ53k35n57k64M44P02J07n55
$$ 107062 106068 104608 103353 102294 100766 98682 96859 96012 96009 96162 95927 95370 95106 95550 96252 96359 95804
55381I5804m24J61L21J9k57o41j496k240j911p55M1J25J99N03M43q8k62L11Q77
$$ 95804 95380 95541 95862 95881 95624 94983 93487 91247 89336 88581 88622 88747 88946 89449 89892 89804 89542 89853 90730
55362I0730O39j67p14n71mL51K3p42j133p93l09k64l62j03K56K70K48P04J285
$$ 90730 91369 91202 90488 89917 89913 90264 90287 89545 88412 87619 87310 87046 86684 86581 86837 87107 87355 88059 89344
55343H9344J283Q82Q47J247J443J138N59j71r72j364j020m04j63j44J61O53R08
$$ 89344 90627 91509 92356 93603 95046 96184 96743 96572 95600 94236 93216 92812 92649 92505 92666 93319 94227
55326I4227R50R09N19j99m49J30N72O4n45j27O84N10l70n24J57M18o7l23o7j25
$$ 94227 95177 96086 96605 96406 95957 96087 96659 96723 96178 96051 96735 97245 96875 96351 96508 96926 96859 96536 96469 96344
55306I6344o10n23L43P87J44o66p72o17q04q48j11Q81J060K94m61l48N34J307
$$ 96344 95734 95211 95554 96341 96485 95819 95047 94430 93626 92778 92667 93548 94608 94902 94441 94093 94627 95934
55288I5934J227N42K05N85R08M27m82j013j089r31k25J172K230J841N14k16J19
$$ 95934 97161 97703 97908 98493 99401 99828 99346 98333 97244 96313 96088 97260 99490 101331 101845 101629 101748
55271A01748O74Q50P60L94l42q44m40L09L01l21m09K20O16M72M99Q61Q03J02n10
$$ 101748 102422 103272 104032 104426 104084 103240 102800 103109 103410 103089 102680 102900 103516 103988 104487 105348 106151 106253 105743
55252A05743o50o90o17O0J002J095K16m38k80j13n13p86l23K63J59m23q03q06
$$ 105743 105093 104403 103786 103846 104848 105943 106159 105721 105441 105328 104815 104029 103706 103969 104128 103705 102902 102096
55234A02096o16l32j54k62l31Q8N49J25j044j662j092j70J64k7k45k96l3O72J340
$$ 102096 101480 101148 100994 100732 100401 100489 101038 101163 100119 98457 97365 97195 97359 97332 97087 96791 96758 97430 98770
55215I8770J195L76r2K57Q37J181J507J892J954J591J039J26j370k586k222o16
$$ 98770 99965 100341 100249 100506 101343 102524 104031 105923 107877 109468 110507 110633 109263 106677 104455 103839
55199A03839M57L33J95O81O23p91k253k163j043n75j114j553j201m69J08N22R36
$$ 103839 104296 104629 104824 105505 106128 105337 103084 100921 99878 99303 98189 96636 95435 94966 95074 95596 96532
55182I6532J310J464J233P94P20J247J580P88o57j234m71M89O94N78P72R23M83
$$ 96532 97842 99306 100539 101333 102053 103300 104880 105668 105011 103777 103306 103795 104489 105067 105839 106762 107245
55165A07245k32n27k59L06Q97J080M90m10o02O8N82K80k98n12n75p35n24L79J271
$$ 107245 107013 106486 106227 106533 107430 108510 109000 108590 107988 108056 108638 108918 108620 108108 107533 106798 106274 106653 107924
55146A07924J256M08m64p46l76K28L19m70j421j462o31P9K89M90O86K13p89j163
$$ 107924 109180 109588 109124 108378 108002 108230 108549 108079 106658 105196 104565 104644 104933 105423 106109 106322 105533 104370
55128A04370o00k40p94j381j059j84N06R89J300J030L05J09P31J137P32M24Q46
$$ 104370 103770 103530 102736 101355 100296 100112 100618 101607 102907 103937 104242 104351 105082 106219 106951 107375 108221
55111A08221J000o2j414j661j035o29m22K69J067J009K79KM51Q27O57K84J9j50
$$ 108221 109221 109159 107745 106084 105049 104420 103998 104267 105334 106343 106622 106624 107075 107902 108559 108843 108862 108712
55093A08712j45J04K96J54n4L0L00N76R32J144O25m09p26J13P46p8j519j927j218
$$ 108712 108567 108671 108967 109121 109067 109097 109397 109973 110905 112049 112674 112265 111539 111652 112398 112320 110801 108874 107656
55074A07656n28k07K03M62j93j418j851j054m8K90J97J91K44J51j5j21j27M3L55
$$ 107656 107128 106921 107124 107586 107393 105975 104124 103070 103022 103312 103509 103700 103944 104095 104080 103959 103832 103875 104230
55055A04230M79J89k33m36n25o33m11L83J222J393R47M39J27J7K69P93J002O52
$$ 104230 104709 104898 104665 104229 103704 103071 102660 103043 104265 105658 106605 107044 107171 107188 107457 108250 109252 109904
55037A09904M78J119J963J958J149M51K50J96J45K34K33k52r57j235j066j060
$$ 109904 110382 111501 113464 115422 116571 117022 117272 117468 117613 117847 118080 117828 116871 115636 114570 113510
55021A13510j506k073k348k131j380l94K57M86Q96J698K118J585Q33P89R63K37
$$ 113510 112004 109931 107583 105452 104072 103678 103935 104421 105317 107015 109133 110718 111551 112340 113303 113540
55005A13540j185j891j237o0O41P04M44J57J40N01Q78Q97P52Q29R68Q18N88P42
$$ 113540 112355 110464 109227 109167 109808 110512 110956 111113 111253 111754 112632 113529 114281 115110 116078 116896 117484 118226
54987A18226J150J302J085O92R6o22q84l77J95N4l26Q7J139J602R33j18o99p02
$$ 118226 119376 120678 121763 122455 122551 121929 121045 120668 120863 120917 120591 120678 121817 123419 124352 124234 123535 122833
54969A22833l69J01M61N63O31P88O20j54q74o65L03J079J227J042P93N81O86J111
$$ 122833 122464 122565 123026 123589 124220 125008 125628 125474 124600 123935 124238 125317 126544 127586 128379 128960 129646 130757
54951A30757J193N73J38Q17J862J680K55p26k80P15J064P26K48k26p21r52o06
$$ 130757 131950 132523 132661 133478 135340 137020 137275 136549 136269 136984 138048 138774 139022 138796 138075 137123 136517
54934A36517K68J351K226K510K282K140K324K243J579J289K401M291N443N759
$$ 136517 136785 138136 140362 142872 145154 147294 149618 151861 153440 154729 157130 161421 166864 172623
54920A72623O570Q327R859J0212R824R304Q233O033L072J84k338m649o705q223
$$ 172623 179193 187520 197379 207591 217415 226719 234952 240985 244057 244241 241903 237254 230549 222326
54906B22326r001r047q690q429q340p781o354m784m081m026l510k207r11k43q5
$$ 222326 213325 204278 195588 187159 178819 171038 164684 159900 155819 151793 148283 146076 145165 144922 144837
54891A44837k87p77r29mJ545K367K101J805K248K944L422M170N573O953P553P733
$$ 144837 144550 143773 142844 142840 144385 146752 148853 150658 152906 155850 159272 163442 169015 175968 183521 191254
54875A91254Q333R334R940R562Q178N941L027l27l777o792q721r305r024q469
$$ 191254 199587 208921 218861 228423 236601 242542 245569 245242 241465 234673 225952 216647 207623 199154
54861A99154p626o414n497n593o115n720m222k818k294k186k027k146k709l077
$$ 199154 191528 185114 179617 174024 167909 162189 157967 155149 152855 150669 148642 146496 143787 140710
54847A40710k731j986j295o87l36o49j349j446p10j69n73j279j391j039p30l44
$$ 140710 137979 135993 134698 134011 133675 133026 131677 130231 129521 129352 128779 127500 126109 125070 124340 123996
54831A23996K90O19J76m31l05M51J028J112R44O14J39j24O4K13k92j134j416r03
$$ 123996 124286 124905 125081 124650 124345 124796 125824 126936 127880 128494 128633 128509 128573 128786 128494 127360 125944 125041
54813A25041k69j53m69p11n49p1L04L15K45N46J021R79L68R9P77J781K119J693
$$ 125041 124772 124619 124150 123439 122890 122819 123123 123438 123683 124229 125250 126229 126597 126696 127473 129254 131373 133066
54795A33066J073M86k31r35j194r49n94m01l33l38m08l70QO32J106J221J229J517
$$ 133066 134139 134625 134394 133459 132265 131316 130722 130321 129988 129650 129242 128872 128880 129512 130618 131839 133068 134585
54777A34585K119K654K753K540K488K801L227L580M042M703N328N979P286R382
$$ 134585 136704 139358 142111 144651 147139 149940 153167 156747 160789 165492 170820 176799 184085 193467
54763A93467J1117J1332J0469R774R117P062L180j060m181o197p679q511q471
$$ 193467 204584 215916 226385 236159 245276 252338 255518 254458 250277 244080 236401 227890 219419
54750B19419q053p830p589o914o041n394m846m103l317k660j812n42O55J183J214
$$ 219419 211366 203536 195947 189033 182992 177598 172752 168649 165332 162672 160860 160318 160973 162156 163370
54735A63370J290J442J405J385J808K563L117L320L517L872M160M259M489N227
$$ 163370 164660 166102 167507 168892 170700 173263 176380 179700 183217 187089 191249 195508 199997 205224
54721B05224O444P650Q271Q116P400O260M450J863r18l152m822o399p878q799
$$ 205224 211668 219318 227589 235705 243105 249365 253815 255678 254760 251608 246786 240387 232509 223710
54707B23710r126r201q832p440n347l893l792m277m288l677k813j894j217j313
$$ 223710 214584 205383 196551 189111 183764 179871 176079 171802 167514 163837 161024 159130 157913 156600
54693A56600k128k762k616k136j851j488o82J83O01P92J157J425J116L44m93j296
$$ 156600 154472 151710 149094 146958 145107 143619 142937 143120 143721 144513 145670 147095 148211 148555 148062 146766
54677A46766j949j966j238n63o47j061r47l43J7j03k92k95k17q2J67L53K86Q1
$$ 146766 144817 142851 141613 141050 140403 139342 138395 138052 138069 137966 137674 137379 137162 137080 137247 137600 137886 137967
54659A37967j47n94j305j763j468o23K22Q44J214J141N43j82n75n81l92j36J2
$$ 137967 137820 137226 135921 134158 132690 132067 132289 133133 134347 135488 136031 135849 135274 134693 134301 134165 134177
54642A34177QL13J371K478K225N08r48p49M48J226J304J256J223J064J020J091
$$ 134177 134185 134498 135869 138347 140572 141080 140132 139383 139831 141057 142361 143617 144840 145904 146924 148015
54626A48015N53q23j841j445m37k07n07j44O67N27o66j343o53M28P87O25N95O55
$$ 148015 148568 147745 145904 144459 144022 143815 143308 143164 143831 144358 143692 142349 141696 142124 142911 143536 144131 144786
54608A44786M70J47L7K77Q15J373J361N12m96p16j74L55N61O91O07j12j040j143
$$ 144786 145256 145403 145440 145717 146532 147905 149266 149778 149282 148566 148392 148747 149308 149999 150606 150494 149454 148311
54590A48311l10M32M61K69L55N08O12J064J808J975J132J24j03J94J27m54q99
$$ 148311 148001 148433 148894 149163 149518 150026 150638 151702 153510 155485 156617 156741 156638 156832 156959 156505 155606
54573A55606p40j72L16L74N2k23j40jl06q51q57j19O20P13L78J37O4L6J92P52
$$ 155606 154866 154694 155010 155384 155436 155213 155073 155072 154766 153915 153058 152939 153559 154272 154650 154787 154851 154887 155079 155831
54553A55831J596K342K606K121J041J45J64P74R19K69k56J79J212J972K181K082
$$ 155831 157427 159769 162375 164496 165537 165682 165846 166620 167539 167808 167552 167731 168943 170915 173096 175178
54537A75178J729J119O34P01J155J478J552J625J646J233M06j22K70J230J666
$$ 175178 176907 178026 178660 179361 180516 181994 183546 185171 186817 188050 188456 188334 188604 189834 191500
54522A91500R37l85j149r30m31m59r23j161r59o73n29l89j94j02j11n3l3l52q79
$$ 191500 192437 192052 190903 189973 189542 189083 188160 186999 186040 185367 184838 184449 184255 184153 184042 183989 183956 183604 182725
54503A82725j063p12k47N5M32R40R75J27r65j263o67l5O3k3J96N72P01O72R27
$$ 182725 181662 180950 180703 180758 181190 182130 183105 183232 182267 181004 180337 180302 180365 180342 180538 181110 181811 182483 183410
54484A83410J444J636J195O38O17R94J072O30J74J23L09M97Q66J597K380K769
$$ 183410 184854 186490 187685 188323 188940 189934 191006 191636 191810 191933 192242 192739 193605 195202 197582 200351
54468B00351K771K712K689K551K231J748J124N14K26L35N23N84P01R16P93R7o39
$$ 200351 203122 205834 208523 211074 213305 215053 216177 216691 216917 217252 217775 218359 219060 219976 220769 220866 220227
54451B20227q19o52o78q33p22n26p60j283j457j263j328j764j861j199l16J09
$$ 220227 219408 218756 218078 217245 216523 215997 215237 213954 212497 211234 209906 208142 206281 205082 204766 204875
54435B04875N7j35l42n17n18m10n62j067j444j283p80l24J25Q05J479J523P25
$$ 204875 204932 204797 204455 203938 203420 203010 202448 201381 199937 198654 197874 197550 197675 198480 199959 201482 202207
54418B02207l67j010j052r27r55r36n52JJ86j31n14n88m11r6L82Q32Q47N05N01
$$ 202207 201840 200830 199778 198851 197896 196960 196408 196409 196595 196464 195950 195362 194951 194855 195237 196069 196916 197421 197922
54399A97922J111J601J237M03pJ60L95N08O92Q47O40J70j83l99o79p98m12K03
$$ 197922 199033 200634 201871 202274 202267 202427 202822 203330 204022 204869 205509 205679 205496 205097 204418 203620 203208 203411
54381B03411M21K33J67L63M90N66R48J487J491P37j76o38o62n75o03p78q01j67
$$ 203411 203832 204065 204232 204595 205085 205651 206599 208086 209577 210314 210138 209500 208838 208263 207660 206882 206081 205914
54363B05914J061J924J650P78L31K61k21j018j196o71n09j278k240k635k583k374
$$ 205914 206975 208899 210549 211327 211658 211919 211698 210680 209484 208813 208304 207026 204786 202151 199568 197194
54347A97194j864j208j094j633j929j413q04r66j594j797j390q61n05l06l09m78
$$ 197194 195330 194122 193028 191395 189466 188053 187249 186283 184689 182892 181502 180641 180136 179830 179521 179043
54331A79043n20l24k20m66p85q06m96O5Q46J492J411O38P9L64R82J032L92l34
$$ 179043 178523 178199 177979 177513 176728 175922 175426 175491 176337 177829 179240 179878 179957 180321 181303 182335 182727 182393
54313A82393o65n43j36K59L79L23L85M27j3q12j122n64J28J42k90l94j3L37K95
$$ 182393 181728 181185 181049 181308 181687 182010 182395 182822 182809 181997 180875 180311 180439 180581 180291 179897 179884 180221 180516
54294A80516m0m48p96j052j327j746k132k099j567q06K7Q83J356R33j53r69j089
$$ 180516 180476 180028 179232 178180 176853 175107 172975 170876 169309 168503 168530 169413 170769 171702 171549 170580 169491
54277A69491r75j010r37o11m29n59m90M9M89L25j6J04N75Q80Q73O56J76m39p08
$$ 169491 168516 167506 166569 165958 165529 164970 164480 164529 165018 165343 165327 165431 166006 166886 167759 168415 168591 168152 167444
54258A67444n13l56m32r2J046K201K415J859J377J252J226J212J219J012O04N74
$$ 167444 166931 166575 166143 166051 167097 169298 171713 173572 174949 176201 177427 178639 179858 180870 181474 182048
54242A82048J096J298M96n59p48m14p85j853k273j474n37o39j611k436k412j485
$$ 182048 183144 184442 184938 184379 183631 183217 182432 180579 178306 176832 176295 175656 174045 171609 169197 167712
54226A67712j02Q75P31k86j104j008l10K35K75l8l97n68n13m21m34m38l48l87
$$ 167712 167610 168485 169216 168930 167826 166818 166508 166743 167018 166980 166583 166015 165502 165081 164647 164209 163861 163474
54208A63474p51j137j035m29J71L79K75J52K19M25M59O2m60m32K33P10L32m43
$$ 163474 162723 161586 160551 160122 160293 160672 160947 161099 161318 161743 162202 162264 161804 161372 161605 162315 162647 162204
54190A62204o81k47J91K20K4j52l10m49m86l84o4O63J628K101J581N40j51l13
$$ 162204 161523 161276 161467 161687 161711 161559 161249 160800 160314 159930 159866 160529 162157 164258 165839 166379 166228 165915
54172A65915l90n88p14p00n92j52Q07J709J704Q43R0p3j85p42j317j216n85k40
$$ 165915 165525 164937 164223 163523 162931 162779 163586 165295 166999 167842 167932 167859 167674 166932 165615 164399 163814 163574
54154A63574o06j241j410r06k36j0k41l80r4L05M04L21N02R81J354J362J194J156
$$ 163574 162968 161727 160317 159411 159175 159165 158924 158544 158450 158755 159159 159480 159982 160963 162317 163679 164873 166029
54136A66029J281J265P34k47r76p44J85P63M91Q9L68J036J193O46j8l74n06n10
$$ 166029 167310 168575 169309 169062 168086 167342 167527 168290 168781 168870 169238 170274 171467 172113 172095 171721 171215 170705
54118A70705l44j49j33j41J88P95J175R71L58k02l62r5K68L51J78P4O3j69n42
$$ 170705 170361 170212 170079 169938 170126 170921 172096 173067 173425 173223 172861 172766 173034 173385 173563 173637 173700 173531 172989
54099A72989m62K27P87N58j66o87q17o31k7P94J084O02K68Q68J687J516N48K6
$$ 172989 172527 172754 173541 174099 173933 173246 172429 171798 171771 172565 173649 174251 174519 175387 177074 178590 179138 179164
54081A79164K63L78n6m36l30j44k06j99J56N92Q44R95J074R69Q90J212J756J876
$$ 179164 179427 179805 179749 179313 178983 178839 178633 178434 178590 179182 180026 181021 182095 183064 183954 185166 186922 188798
54063A88798J436J022J068J429J860K184J944P99n89r43k0R45Q17p6o28l33M38
$$ 188798 190234 191256 192324 193753 195613 197797 199741 200540 199951 199008 198988 199933 200750 200674 200046 199713 200151
54046B00151J132J520J852K635L947M990M891L926L242L379L779L957M284N241
$$ 200151 201283 202803 204655 207290 211237 216227 221118 225044 228286 231665 235444 239401 243685 248926
54032B48926O639P923Q720Q837Q396Q155Q937J0409J1250J0923J0450J0900J1877
$$ 248926 255565 263488 272208 281045 289441 297596 306533 316942 328192 339115 349565 360465 372342
54019C72342J2297J1996J1720J1910J2226J2145J1216Q975N206M39m256q024j0611
$$ 372342 384639 396635 408355 420265 432491 444636 455852 464827 470033 470472 466216 458192 447581
54006D47581j2156j2909j3074j2718j1878j0827j0046r744r657r382q763p865
$$ 447581 435425 422516 409442 396724 384846 374019 363973 354229 344572 335190 326427 318562
53994C18562o785n667m667l881l416l459l955m393m281l832l691l937l895l073
$$ 318562 311777 306110 301443 297562 294146 290687 286732 282339 278058 274226 270535 266598 262703 259630
53980B59630j836j005j094k010l102l559l050k052j238p49m76o32j334j891j482
$$ 259630 257794 256789 255695 253685 250583 247024 243974 241922 240684 239935 239459 238827 237493 235602 234120
53965B34120m42J24K3J79R57J499J190O83P27R75P93M65O51J201J426J226J117
$$ 234120 233678 233802 233825 234004 234961 236460 237650 238333 239060 240035 240828 241293 241944 243145 244571 245797 246914
53948B46914J298J440J356J303J582K199K909L329L224K853K756L166L913M928
$$ 246914 248212 249652 251008 252311 253893 256092 259001 262330 265554 268407 271163 274329 278242 283170
53934B83170O239P421P779P377P077P169O796N334L558K641K661K966L388M076
$$ 283170 289409 296830 304609 311986 319063 326232 333028 338362 341920 344561 347222 350188 353576 357652
53920C57652M620M419L868L985M952N882O249O581P479Q716R735J0415J0927J1238
$$ 357652 362272 366691 370559 374544 379496 385378 391627 398208 405687 414403 424138 434553 445480 456718
53906D56718J1215J0980J0833J0880J0932J0655R705P871N274K426J1j471j990
$$ 456718 467933 478913 489746 500626 511558 522213 531918 539789 545063 547489 547500 546029 544039
53893E44039j991j992k154k347k620l341m651o076o974p259p438p967q776r390
$$ 544039 542048 540056 537902 535555 532935 529594 524943 518867 511893 504634 497196 489229 480453 471063
53879D71063r406q875q266p932p677p018n874m676l794l226k945l190m107n361
$$ 471063 461657 452782 444516 436584 428907 421889 416015 411339 407545 404319 401374 398184 394077 388716
53865C88716o405o931o962o706o481o501o492n701l667q64J610L071L892N060
$$ 388716 382311 375380 368418 361712 355231 348730 342238 336537 332870 332006 333616 336687 340579 345639
53851C45639P052R073R589P715L965n47n136r399j2534j3685j2971j1451r897
$$ 345639 352691 361764 371353 379068 383033 382486 377350 367951 355417 341732 328761 317310 307413
53838C07413q318o753n665n223m909m306l720l539l569l427l201l144l090k685
$$ 307413 299095 292342 286677 281454 276545 272239 268519 264980 261411 257984 254783 251639 248549 245864
53824B45864j961j233o09oM67N34J60l07m11lN73P68M93K93O09J156J446J659
$$ 245864 243903 242670 242061 242055 242522 243056 243216 242909 242498 242495 243068 243836 244329 244622 245231 246387 247833 249492
53806B49492K215K793K633J837J399J794K488L070L886N125O258O890P385Q121
$$ 249492 251707 254500 257133 258970 260369 262163 264651 267721 271607 276732 282990 289880 297265 305386
53792C05386Q816R104R043Q641P684O430N631N376M841L703K758K458J990P27
$$ 305386 314202 323306 332349 340990 348674 355104 360735 366111 370952 374655 377413 379871 381861 382588
53778C82588n29q96r39j541k182j920j396k138m138n842o462o720p155p194o444
$$ 382588 382059 381163 380224 378683 376501 374581 373185 371047 366909 361067 354605 347885 340730 333536 327092
53763C27092n587n368n567n495m900m010l189k849l138l599l598l135k790k825
$$ 327092 321505 316137 310570 305075 300175 296165 292976 290127 286989 283390 279792 276657 273867 271042
53749B71042k977k999k909k663k288k150k546l044k991k503k233k269k078j551
$$ 271042 268065 265066 262157 259494 257206 255056 252510 249466 246475 243972 241739 239470 237392 235841
53735B35841j220j302j356j019m02L46J136J486Q53m36j265j090n05k06j20J42
$$ 235841 234621 233319 231963 230944 230542 230888 232024 233510 234363 233927 232662 231572 231067 230861 230741 230883
53719B30883O03J072J416J383O70m80j197q62J91J090J257P37J19J28R02J660
$$ 230883 231486 232558 233974 235357 236027 235547 234350 233488 233679 234769 236026 236763 236882 237010 237912 239572
53703B39572J563Q54N71J089J718J843J721J858K219K487K589K597K419J982J413
$$ 239572 241135 241989 242560 243649 245367 247210 248931 250789 253008 255495 258084 260681 263100 265082 266495
53688B66495Q38K85k03o15j100j617j645q35J27J35p92j419j014k89k57q79j433
$$ 266495 267333 267618 267415 266800 265700 264083 262438 261603 261730 261865 261073 259654 258640 258351 258094 257215 255782
53671B55782j524j205n63K01O28M75K7l78p37j005p91P1J010J335J041N92J98
$$ 255782 254258 253053 252490 252691 253319 253794 253821 253443 252706 251701 250910 250981 251991 253326 254367 254959 255157
53654B55157k05n41o29n26l82j55K02M03R4o25j292j615j666j606j465j105l69
$$ 255157 254952 254411 253782 253256 252874 252719 252921 253324 253418 252793 251501 249886 248220 246614 245149 244044 243675
53637B43675O58J427J328M35m20n32l0M65N70K50l30p76m86P16K185K964K710
$$ 243675 244333 245760 247088 247523 247103 246571 246541 247006 247576 247826 247496 246720 246234 246950 249135 252099 254809
53620B54809J840R53M32M65R89J682K255K771L407L983M069L548K830K339K074
$$ 254809 256649 257602 258034 258499 259488 261170 263425 266196 269603 273586 277655 281203 284033 286372 288446
53605B88446J762J308R31R26J399K159K771K741J902O88p4M3O11Q88P66P47R35
$$ 288446 290208 291516 292447 293373 294772 296931 299702 302443 304345 305033 304959 305002 305613 306501 307267 308014 308949
53588C08949O93l25j337j335n28j21o42j280j101k95K56J45k36l67j53J28J37
$$ 308949 309642 309317 307980 306645 306117 305996 305354 304074 302973 302678 302934 303079 302843 302476 302323 302451 302588
53571C02588k86j014j768k276k302j654m58O46R40M09j63l7P32J506J810J718
$$ 302588 302302 301288 299520 297244 294942 293288 292830 293476 294416 294825 294662 294625 295357 296863 298673 300391
53555C00391J628J793K154K514K782K913K779K376K130K513L325L767L477K953
$$ 300391 302019 303812 305966 308480 311262 314175 316954 319330 321460 323973 327298 331065 334542 337495
53541C37495K646K268J488P55O78J024J183J282J935L094M083M706N322N823N590
$$ 337495 340141 342409 343897 344652 345330 346354 347537 348819 350754 353848 357931 362637 367959 373782 379372
53526C79372M675M071M504N736P339R236J1093J2129J2130J1909J2205J2743J2973
$$ 379372 384047 388118 392622 398358 405697 414933 426026 438155 450285 462194 474399 487142 500115
53513E00115J3056J3518J4407J5454J6598J7780J8672J9160J9689K0497K1000
$$ 500115 513171 526689 541096 556550 573148 590928 609600 628760 648449 668946 689946
53502F89946K0611J9760J9337J9418J9284J8577J7729J7241J7230J7628J8269
$$ 689946 710557 730317 749654 769072 788356 806933 824662 841903 859133 876761 895030
53491H95030J8791J8943J9012J9443K0004J9895J8804J7374J6386J5844J5179
$$ 895030 913821 932764 951776 971219 991223 1011118 1029922 1047296 1063682 1079526 1094705
53480A094705J4130J3075J2497J2368J2181J1561J0678J0009R791R812R603Q655
$$ 1094705 1108835 1121910 1134407 1146775 1158956 1170517 1181195 1191204 1200995 1210807 1220410 1229065
53468A229065O700M141J944O69l39k168m861p410r323j1274j3815j6291j7732
$$ 1229065 1235765 1239906 1241850 1242519 1242180 1240012 1235151 1227741 1218418 1207144 1193329 1177038 1159306
53455A159306j8210j8467j8711j8659j8503j8854j9713k0376k0509k0555k0767
$$ 1159306 1141096 1122629 1103918 1085259 1066756 1047902 1028189 1007813 987304 966749 945982
53444I45982k0573j9458j7945j7100j7169j7299j6668j5420j4233j3326j2329
$$ 945982 925409 905951 888006 870906 853737 836438 819770 804350 790117 776791 764462
53433G64462j1013r627q356o921n146l476k379j478O9K299M360N797P211R203
$$ 764462 753449 743822 735466 728545 723399 719923 717544 716066 716135 718434 722794 728591 735802 745005
53419G45005J1331J2671J3050J3165J3694J4762J6193J7818J9488K1052K2383
$$ 745005 756336 769007 782057 795222 808916 823678 839871 857689 877177 898229 920612
53408I20612K3380K4083K4847K6131K7957K9819L1295L2486L3755L5251L6908
$$ 920612 943992 968075 992922 1019053 1047010 1076829 1108124 1140610 1174365 1209616 1246524
53397A246524L8561M0023M1306M2818M4904M7070M8244M8103M7574M7648M8187
$$ 1246524 1285085 1325108 1366414 1409232 1454136 1501206 1549450 1597553 1645127 1692775 1740962
53386A740962M8385M7946M7196M6382M5431M4206M2497M0001L6782L3517L0749
$$ 1740962 1789347 1837293 1884489 1930871 1976302 2020508 2063005 2103006 2139788 2173305 2204054
53375B204054K8190K5324K2446K0339J8949J7200J4302J0672P203M092P65l364
$$ 2204054 2232244 2257568 2280014 2300353 2319302 2336502 2350804 2361476 2368679 2372771 2373536 2370172
53363B370172q385j4077k0290k6980l3936m0519m5913m9696n2081n3536n4327
$$ 2370172 2361787 2347710 2327420 2300440 2266504 2225985 2180072 2130376 2078295 2024759 1970432
53352A970432n4545n4319n3816n3101n2193n1072m9643m7847m5977m4600m3974
$$ 1970432 1915887 1861568 1807752 1754651 1702458 1651386 1601743 1553896 1507919 1463319 1419345
53341A419345m3766m3502m3081m2662m2276m1742m0765l9011l6401l3503l1250
$$ 1419345 1375579 1332077 1288996 1246334 1204058 1162316 1121551 1082540 1046139 1012636 981386
53330I81386k9905k8635k6386k3019j9336j6230j4134j2939j2142j1155r762q163
$$ 981386 951481 922846 896460 873441 854105 837875 823741 810802 798660 787505 777743 769580
53318G69580o572n044l805l182k965k330q34R53K295L287M473N798O652O822O916
$$ 769580 763008 757964 754159 750977 748012 745682 744848 745801 748096 751383 755856 761654 768306 775128 782044
53303G82044P723R490J1742J3607J4555J4965J5684J6922J8086J8921K0071K1943
$$ 782044 789767 799257 810999 824606 839161 854126 869810 886732 904818 923739 943810 965753
53291I65753K3723K4412K4328K4648K5669K6488K6376K5555K4424K2856K0626
$$ 965753 989476 1013888 1038216 1062864 1088533 1115021 1141397 1166952 1191376 1214232 1234858
53280A234858J8101J6080J5031J4603J3805J1905R265O972N493M139K261K68j175
$$ 1234858 1252959 1269039 1284070 1298673 1312478 1324383 1333648 1340620 1346113 1350252 1352513 1352781 1351606
53267A351606k412m336o962r418j1266j2971j4984j7214j9437k1581k3453k4891
$$ 1351606 1349194 1344858 1337896 1328478 1317212 1304241 1289257 1272043 1252606 1231025 1207572 1182681
53255A182681k6234k7949k9801l1024l1409l1478l1538l1261l0357k8964k7247
$$ 1182681 1156447 1128498 1098697 1067673 1036264 1004786 973248 941987 911630 882666 855419
53244H55419k5301k3597k2758k2697k2658k2333k2207k2587k3066k3248k3228
$$ 855419 830118 806521 783763 761066 738408 716075 693868 671281 648215 624967 601739
53233F01739k2958k1987k0300j8660j7514j6276j4370j2391j1346j1137j0706
$$ 601739 578781 556794 536494 517834 500320 484044 469674 457283 445937 434800 424094
53222D24094r518q049o899o072n397n045n317o098o767o722o022n402n432n772
$$ 424094 414576 406527 399628 393556 388159 383114 377797 371699 364932 358210 352188 346786 341354 335582
53208C35582n589m732l910l623l545l257k929k791k584k211k336l450m705m728
$$ 335582 329993 325261 321351 317728 314183 310926 307997 305206 302622 300411 298075 294625 289920 285192
53194B85192l503k398k205k201j629j032j366k365k812k189j232q41j145j816
$$ 285192 281689 279291 277086 274885 273256 272224 270858 268493 265681 263492 262260 261419 260274 258458
53180B58458k579l103k993k259j487j070o49K41J236J465P64o8l07o3J33L9l37
$$ 258458 255879 252776 249783 247524 246037 244967 244318 244559 245795 247260 248024 247956 247649 247586 247719 247758 247421
53163B47421j022j937k673k758k114j072j14L57K68n9k35l16o42j124j197o70
$$ 247421 246399 244462 241789 239031 236917 235845 235731 236088 236356 236297 236062 235746 235104 233980 232783 232113
53147B32113r2L9p9m5P6L8q5k12o02j283j566q57L18R12P29L98J68l70j258j815
$$ 232113 232021 232060 231981 231936 232012 232050 231965 231753 231151 229868 228302 227445 227763 228675 229404 229802 229970 229600 228342 226527
53127B26527j567q95l67k2L22N62M80J65n2R3O45J382J809J533P68K35M31J137
$$ 226527 224960 224065 223698 223676 223998 224560 225040 225205 225153 225246 225891 227273 229082 230615 231383 231618 232049 233186
53109B33186J634J329J91j137j779j446p23l64n07q01j007j065r48q88j300k016
$$ 233186 234820 236149 236340 235203 233424 231978 231255 230891 230384 229583 228576 227511 226563 225675 224375 222359
53093B22359k035q46M67M90m99r56m15n7o69j421j329p87p17r99q23j23L31J43
$$ 222359 220324 219478 219945 220435 219936 218980 218565 218508 217839 216418 215089 214302 213585 212586 211763 211640 211971 212114
53075B12114j62R4R23J652J559N59n60q23j04P33Q40K33m73q02p10m54l66n69
$$ 212114 211952 212046 212969 214621 216180 216739 216179 215356 215252 215985 216825 217058 216585 215783 215073 214619 214253 213684
53057B13684q25q58p47o13k22N41R81L23r21j357o87j67n79r35m2J548K253J512
$$ 213684 212859 212001 211254 210641 210419 210960 211941 212264 211343 209986 209299 209132 208553 207618 207576 209124 211377 212889
53039B12889J15j088j763j683q21J45L71o0l12j18r6o16j186j248r49p28o28m86
$$ 212889 213004 211916 210153 208470 207649 207794 208165 208105 207793 207675 207579 206963 205777 204529 203580 202852 202224 201738
53021B01738l82n25q37j020q77m22K47Q75J052N78j45l65J73Q66Q43l7j047j462
$$ 201738 201356 200831 199994 198974 198097 197675 197922 198797 199849 200427 200282 199917 200090 200956 201799 201762 200715 199253
53003A99253j303j067q99m40N28J571J904J182r8r75r39m95n93j452k242k148
$$ 199253 197950 196883 195984 195544 196072 197643 199547 200729 200631 199656 198717 198222 197629 196177 193935 191787
52987A91787j314l94L73J052J343Q77O6j90K62O34M81L51Q34J570J756J244O44
$$ 191787 190473 190079 190452 191504 192847 193724 193790 193600 193862 194496 194977 195328 196162 197732 199488 200732 201376
52970B01376N68J024J418J104J40n49j98P57J195P94K60J08J17J21M28R58R01
$$ 201376 201944 202968 204386 205490 205630 205081 204883 205640 206835 207629 207889 207997 208114 208235 208663 209621 210522
52953B10522j42j378j875j725j533j369j031q13j144j733j888j547j203j047q09
$$ 210522 210380 209002 207127 205402 203869 202500 201469 200656 199512 197779 195891 194344 193141 192094 191285
52938A91285m32j85j38q3pj64n82r12q58n17k12j63k55j27M16R92R57K75l21k09
$$ 191285 190853 190668 190530 190447 190440 190276 189694 188782 187924 187407 187195 187032 186777 186650 187066 188058 189015 189290 188969 188760
52918A88760M06R32J077Q67L67l06q85j207j257r11r3P45R33O02O33J262J551
$$ 188760 189166 190098 191175 192042 192409 192103 191218 190011 188754 187843 187750 188495 189428 190030 190663 191925 193476
52901A93476Q16k06m22J10N39O37P97J067J120J043J283J818K165K147J976J636
$$ 193476 194292 194086 193664 193774 194313 194950 195747 196814 197934 198977 200260 202078 204243 206390 208366 210002
52885B10002Q70j68q97j044r53j063j381j560j266o48l71q62j450j028K71R44
$$ 210002 210872 210704 209807 208763 207810 206747 205366 203806 202540 201892 201521 200659 199209 198181 198452 199396
52869A99396K00q18p48M0L26J38M99J508K203K221K205K475K555K263K124K378
$$ 199396 199596 198778 198030 198070 198396 198534 199033 200541 202744 204965 207170 209645 212200 214463 216587 218965
52853B18965K553K404K289K320J911O44j085k635l718m215m062l519l025k570
$$ 218965 221518 223922 226211 228531 230442 231086 230001 227366 223648 219433 215371 211852 208827 206257
52839B06257j850j010o28q45j218j462j610j448o80K77N52J09j84J01M89P21J228
$$ 206257 204407 203397 202769 201924 200706 199244 197634 196186 195506 195783 196335 196444 196260 196361 196850 197571 198799
52822A98799K054K391J787Q61K41l02r73j192o23m7k34n84l9J148J760J493J343
$$ 198799 200853 203244 205031 205892 206133 205831 204858 203666 203043 202996 202762 202178 202139 203287 205047 206540 207883
52805B07883K076L267M024L870K752Q40j330k972l673l706l592l537l346k750
$$ 207883 209959 213226 217250 221120 223872 224712 223382 220410 216737 213031 209439 205902 202556 199806
52791A99806j744p32k68n79j368k124k507k444k093j728j450r23K51J805K865
$$ 199806 198062 197330 197062 196483 195115 192991 190484 188040 185947 184219 182769 181846 182097 183902 186767
52776A86767K874K096J018j95j345j753q98P19J871J837J011K20j54k90m04l94
$$ 186767 189641 191737 192755 192560 191215 189462 188564 189283 191154 192991 194002 194222 194068 193778 193374 192980
52760A92980r0L18L44j50o48n56R3P67J179J437J619J572J179N26j57m96j66N29
$$ 192980 192890 193208 193552 193402 192754 192198 192291 193058 194237 195674 197293 198865 200044 200570 200413 199917 199751 200280
52742B00280O57j23p10J05J762K427J483J55m63p06j068j035k06N25K02n45l65
$$ 200280 200937 200814 200104 200209 201971 204398 205881 206036 205573 204867 203799 202764 202558 203083 203285 202740 202375
52725B02375P15J395J111P23J090J909K302J814O48n63j134r28o14q70j484j704
$$ 202375 203090 204485 205596 206319 207409 209318 211620 213434 214082 213519 212385 211457 210843 209973 208489 206785
52709B06785j368r96r41j068j283j640j870j494n86J58K93O5j72m31p59r14o69
$$ 206785 205417 204421 203480 202412 201129 199489 197619 196125 195539 195697 195990 196055 195883 195452 194693 193779 193110
52692A93110j27M37Q02P57L10r6K7M66M97l8m30j35M70P89R15J260J623J343L13
$$ 193110 192983 193420 194222 194979 195289 195193 195220 195686 196183 196145 195715 195580 196050 196839 197754 199014 200637 201980 202293
52673B02293o92q88l05L93O10L52J46N44J510K271J969N32j125j865j267P5J133
$$ 202293 201601 200713 200408 200801 201411 201763 201909 202453 203963 206234 208203 208735 207610 205745 204478 204553 205686
52656B05686J270O32j26m29j30N50J284J889K411K995L543L655L039J938Q50j45
$$ 205686 206956 207588 207462 207033 206903 207453 208737 210626 213037 216032 219575 223230 226269 228207 229057 228912
52640B28912j401k948m088m133l242k207j529j113q09o94p15n22K5M66K85l54
$$ 228912 227511 224563 220475 216342 213100 210893 209364 208251 207442 206748 206033 205511 205536 206002 206287 205933
52624B05933p69o09j51K33N12P63Q85P93O57P09Q48P54L38j31l56l40k92l21l14
$$ 205933 205164 204555 204404 204637 205149 205912 206797 207590 208247 208956 209804 210558 210896 210765 210409 210069 209777 209456 209142
52605B09142j34J31J77j09m02k53K85O17L38k21l87L0N44O25L05L8Q6K03km34
$$ 209142 209008 209139 209316 209207 208805 208552 208837 209454 209792 209571 209184 209214 209758 210383 210688 210726 210812 211015 211013 210579
52585B10579m79J86J013J188P26M39P75J257J349J303J594J981J813J044L56K11
$$ 210579 210100 210286 211299 212487 213213 213652 214427 215684 217033 218336 219930 221911 223724 224768 225124 225335
52569B25335L33J93l99j188j636j221L1J321J762J284N48L1l35o59p68o20n68
$$ 225335 225668 225861 225462 224274 222638 221417 221448 222769 224531 225815 226363 226394 226059 225400 224632 224012 223444
52552B23444r54j640k103j881r32K44R01P22R8m36q01j015o61N43J802J785L31
$$ 223444 222490 220850 218747 216866 215934 216178 217079 217801 217899 217463 216662 215647 214986 215529 217331 219116 219447
52535B19447j234j665j058k30L93P57P34L68J18L09O11O25O00R69J464J361O09
$$ 219447 218213 216548 215490 215260 215653 216410 217144 217512 217630 217939 218550 219175 219775 220744 222208 223569 224178
52518B24178O7M72J555K345K099R33k65n56K43J452K309K691K859K791K190J104
$$ 224178 224245 224717 226272 228617 230716 231649 231384 230828 231071 232523 234832 237523 240382 243173 245363 246467
52502B46467O1n44q91j309j648j421o00P7j36j080j845j824j321r06o63l07K07
$$ 246467 246528 245984 245093 243784 242136 240715 240115 240192 240056 238976 237131 235307 233986 233080 232417 232110 232317
52485B32317O27Q14Q32O99M04M8k87o16p62k53J000K238K628K267J828J516J084
$$ 232317 232944 233758 234590 235289 235693 235741 235454 234838 234076 233823 234823 237061 239689 241956 243784 245300 246384
52468B46384O73O91R24P89M50P35J713K456K482K384K528K275J165j04p35j056
$$ 246384 247057 247748 248672 249461 249911 250646 252359 254815 257297 259681 262209 264484 265649 265545 264810 263754
52452B63754j767k647k982k731k401k145j882j897k383k669j934n21L51K10k17
$$ 263754 261987 259340 256358 253627 251226 249081 247199 245302 242919 240250 238316 237795 238146 238356 238139
52437B38139k19J0m0l86o11m23P6M80M70K13J85M07K75n07j304j374r63q81j253
$$ 238139 237920 237930 237890 237504 236893 236470 236546 237026 237496 237709 237894 238301 238576 238069 236765 235391 234428 233547 232294
52418B32294j353o60N33J540J898J589J047Q25R95J121J045J242J953K631K867
$$ 232294 230941 230281 230814 232354 234252 235841 236888 237713 238708 239829 240874 242116 244069 246700 249567
52403B49567L272M489N829O008N034M244M451N113N399N000L717J321j667m028
$$ 249567 252839 257328 263157 269165 274199 278443 282894 288007 293406 298406 302123 303444 301777 297749
52389B97749n156n686o300o653o027m479k749j395n12k6K31M89P22N93J4m87l13
$$ 297749 292593 286907 280607 273954 267927 263448 260699 259304 258792 258766 258997 259486 260208 260801 260815 260328 260015
52372B60015M65J212J507J520J696K168K538K272J379N22L05O07Q74Q42N82L3
$$ 260015 260480 261692 263199 264719 266415 268583 271121 273393 274772 275294 275599 276206 277080 277922 278504 278537
52356B78537q89j808k057j477n59J93O08N74M9n50n67N2O66Q85J045J472J816
$$ 278537 277648 275840 273783 272306 271747 271940 272548 273122 273171 272621 272054 272106 272772 273657 274702 276174 277990
52339B77990J570Q43K36J33N03J103J614J746J519J350J708K741M221N646O426
$$ 277990 279560 280403 280639 280772 281275 282378 283992 285738 287257 288607 290315 293056 297277 302923 309349
52324C09349O315N755N478N665N841N613N062M367L528K687K245K418K978L637
$$ 309349 315664 321419 326897 332562 338403 344016 349078 353445 356973 359660 361905 364323 367301 370938
52310C70938M306M781M653L925L306L485M313N084N397N355N167M903M641M496
$$ 370938 375244 380025 384678 388603 391909 395394 399707 404791 410188 415543 420710 425613 430254 434750
52296D34750M554M819N179N284M727L481K018Q15m3o91j142j344j389j398j342
$$ 434750 439304 444123 449302 454586 459313 462794 464812 465627 465584 464893 463751 462407 461018 459620 458278
52281D58278j124p12r1P00J443J835J906J941J925J439M95pP78K398L435L168
$$ 458278 457154 456442 456351 457051 458494 460329 462235 464176 466101 467540 468035 468028 468806 471204 474639 477807
52265D77807K378K323L307M592N436N731N602M936L673K303J658K070L091M156
$$ 477807 480185 482508 485815 490407 495843 501574 507176 512112 515785 518088 519746 521816 524907 529063
52251E29063N165O200O987P073O425N439M395L234J935Q04K55M57J188J878K010
$$ 529063 534228 540428 547415 554488 560913 566352 570747 573981 575916 576720 576975 577432 578620 580498 582508
52236E82508J685J643K353L311L642L294L066L454M129M647N059N415N341M657
$$ 582508 584193 585836 588189 591500 595142 598436 601502 604956 609085 613732 618791 624206 629547 634204
52222F34204M006M202N069N593N267M735M838N475N877N741N520N600N775N841
$$ 634204 638210 642412 647481 653074 658341 663076 667914 673389 679266 685007 690527 696127 701902 707743
52208G07743O097O734P162O738N938N862O640P314P460P758Q408Q328O848N157
$$ 707743 713840 720574 727736 734474 740412 746274 752914 760228 767688 775446 783854 792182 799030 804187
52194H04187M789N400N553N092N120N831O092N445M886N102N280M347K394J83
$$ 804187 808976 814376 819929 825021 830141 835972 842064 847509 852395 857497 862777 867124 869518 869701
52180H69701j818l316l977l981m047m323m091l115k348k504k857k423j561j337
$$ 869701 867883 864567 860590 856609 852562 848239 844148 841033 838685 836181 833324 830901 829340 828003
52166H28003j786j986j549r94p35o08m13j58K64R57J643J938J967K098K243J981
$$ 828003 826217 824231 822682 821688 820953 820345 819932 819774 820038 820995 822638 824576 826543 828641 830884 832865
52150H32865J312O98M04M05Q54K018L656M967N315M660L339J831O58jo41j934
$$ 832865 834177 834875 835279 835684 836538 838556 842212 847179 852494 857154 860493 862324 862982 862981 862340 860406
52134H60406l766n185n423m681l804l358l125k345n43J793L556M257M641N711
$$ 860406 856640 851455 846032 841351 837547 834189 831064 828719 828176 829969 833525 837782 842423 848134
52120H48134P453Q900R373R073Q488P693O481M838L073J581M51o47k082l698m907
$$ 848134 855587 864487 873860 882933 891421 899114 905595 910433 913506 915087 915538 914891 912809 909111 904204
52105I04204n401n444n259m576l199j562k28R56K542M440N840O147N574M727L987
$$ 904204 898803 893359 888100 883524 880325 878763 878535 879491 882033 886473 892313 898460 904034 908761 912748
52090I12748L310K318O23j613l576m607m969n359n775n456m000j975k76P24J237
$$ 912748 916058 918376 918999 917386 913810 909203 904234 898875 893100 887644 883644 881669 881393 882117 883354
$$ [...]
##END NTUPLES=NMR SPECTRUM
##END=
