
##TITLE=AC1259_UGARH11076_6642258_PZneZf6MWy
##JCAMPDX= 6.0         $$ Bruker NMR JCAMP-DX V2.0
##DATA TYPE= NMR SPECTRUM
##DATA CLASS= NTUPLES
##ORIGIN= BRUKER
##OWNER= Administrator
$$ 1.72 TOPSPIN		Version 2.1
$$ 2012-08-08 17:30:17.843 -0500  Administrator@TOPSPIN
$$ Compression mode = diff/dup
##.OBSERVE FREQUENCY= 400.02188249412
##.OBSERVE NUCLEUS= ^1H
##.ACQUISITION MODE= SIMULTANEOUS (DQD)
##.ACQUISITION SCHEME= undefined
##.AVERAGES= 8
##.DIGITISER RES= 22
##SPECTROMETER/DATA SYSTEM= spect
##.PULSE SEQUENCE= zg30
##.SOLVENT NAME= COFFEE_meoh
##.SHIFT REFERENCE= INTERNAL, COFFEE_meoh, 1, 14.98509
##AUDIT TRAIL= $$ (NUMBER, WHEN, WHO, WHERE, PROCESS, VERSION, WHAT)
$$ ##TITLE= Audit trail, TOPSPIN		Version 2.1
$$ ##JCAMPDX= 5.01
$$ ##ORIGIN= Bruker BioSpin GmbH
$$ ##OWNER= Administrator
$$ $$ C:\Bruker\TOPSPIN/data/COFFEE/nmr/AC1259_UGARH11076_6642258_PZneZf6MWy/10/pdata/1/auditp.txt
$$ ##AUDIT TRAIL=  $$ (NUMBER, WHEN, WHO, WHERE, PROCESS, VERSION, WHAT)
(   1,<2012-08-08 17:30:10.796 -0500>,<Administrator>,<TOPSPIN>,<go>,<TOPSPIN 2.1>,
      <created by zg
	started at 2012-08-08 17:29:04.296 -0500,
	POWCHK enabled, PULCHK disabled,
       configuration hash MD5:
       6B 1B 68 BB D9 2E 58 E2 7F 35 AD 54 07 DF 0E 41
       data hash MD5: 64K
       66 FF 0E 2C CC EB B5 D2 AB 8D EA 35 86 A4 F0 D3>)
(   2,<2012-08-08 17:30:13.718 -0500>,<Administrator>,<TOPSPIN>,<proc1d>,<TOPSPIN 2.1>,
      <Start of raw data processing
       efp LB = 0 FT_mod = 6 PKNL = 1 PHC0 = 0 PHC1 = 0 SI = 32K 
       data hash MD5: 32K
       41 24 D9 2D C0 CD DF 00 15 D9 7D 07 B0 FC B1 CA>)
(   3,<2012-08-08 17:30:14.031 -0500>,<Administrator>,<TOPSPIN>,<proc1d>,<TOPSPIN 2.1>,
      <pk PHC0 = 176.0504 PHC1 = 0 
       data hash MD5: 32K
       D3 0A 3F 21 6C 5A CD FC 7C 58 36 7E BE B5 89 7B>)
(   4,<2012-08-08 17:30:14.109 -0500>,<Administrator>,<TOPSPIN>,<proc1d>,<TOPSPIN 2.1>,
      <abs ABSG = 1 
       data hash MD5: 32K
       F1 CB 1A A2 84 A4 FB E7 F5 93 0A CD D0 A1 59 1E>)
(   5,<2012-08-08 17:30:14.140 -0500>,<Administrator>,<TOPSPIN>,<proc1d>,<TOPSPIN 2.1>,
      <abs ABSG = 2 
       data hash MD5: 32K
       FC 96 DE 98 25 97 AC 25 E1 3F A0 C4 EA 63 84 49>)
(   6,<2012-08-08 17:30:14.156 -0500>,<Administrator>,<TOPSPIN>,<proc1d>,<TOPSPIN 2.1>,
      <abs ABSG = 3 
       data hash MD5: 32K
       D5 F3 C2 18 34 BF A3 F8 78 C7 BE AF 19 EA 74 A8>)
(   7,<2012-08-08 17:30:14.187 -0500>,<Administrator>,<TOPSPIN>,<proc1d>,<TOPSPIN 2.1>,
      <abs ABSG = 4 
       data hash MD5: 32K
       38 03 68 D3 E4 E9 44 58 52 61 59 F4 AC 4E 38 9D>)
(   8,<2012-08-08 17:30:14.218 -0500>,<Administrator>,<TOPSPIN>,<proc1d>,<TOPSPIN 2.1>,
      <abs ABSG = 5 
       data hash MD5: 32K
       AD C4 40 8C 35 B4 3B 28 F2 DD 09 6A 7F 88 41 9E>)
$$ ##END=
$$ 
$$ $$ hash MD5
$$ $$ 6B 12 8D 55 38 A0 4D 89 E8 69 02 3A A1 B0 EC A1
##$RELAX= 
##$RELAX= 
##$RELAX= 
##$RELAX= 
##$RELAX= 
##$RELAX= 
##$RELAX= 
$$ Bruker specific parameters
$$ --------------------------
$$ [...]
##$TP= (0..7)
150 150 150 150 150 150 150 150
##$TP07= 0
##$TPNAME0= <>
##$TPNAME1= <>
##$TPNAME2= <>
##$TPNAME3= <>
##$TPNAME4= <>
##$TPNAME5= <>
##$TPNAME6= <>
##$TPNAME7= <>
##$TPOAL= (0..7)
0.5 0.5 0.5 0.5 0.5 0.5 0.5 0.5
##$TPOFFS= (0..7)
0 0 0 0 0 0 0 0
##$TUNHIN= 0
##$TUNHOUT= 0
##$TUNXOUT= 0
##$USERA1= <user>
##$USERA2= <user>
##$USERA3= <user>
##$USERA4= <user>
##$USERA5= <user>
##$V9= 5
##$VALIST= <valist>
##$VCLIST= <CCCCCCCCCCCCCCC>
##$VD= 0
##$VDLIST= <DDDDDDDDDDDDDDD>
##$VPLIST= <PPPPPPPPPPPPPPP>
##$VTLIST= <TTTTTTTTTTTTTTT>
##$WBST= 1024
##$WBSW= 4
##$XGAIN= (0..3)
0 0 0 0
##$XL= 0
##$YL= 0
##$YMAX_a= 437439
##$YMIN_a= -571879
##$ZGOPTNS= <>
##$ZL1= 120
##$ZL2= 120
##$ZL3= 120
##$ZL4= 120
##$ABSF1= 14.98509
##$ABSF2= -5.573092
##$ABSG= 5
##$ABSL= 3
##$ALPHA= 0
##$AQORDER= 0
##$ASSFAC= 0
##$ASSFACI= 0
##$ASSFACX= 0
##$ASSWID= 0
##$AUNMP= <proc_prof1d_extract_pilot.lims>
##$AXLEFT= 0
##$AXNAME= <>
##$AXNUC= <1H>
##$AXRIGHT= 0
##$AXTYPE= 0
##$AXUNIT= <>
##$AZFE= 0.1
##$AZFW= 0.1
##$BCFW= 0
##$BC_mod= 0
##$BYTORDP= 0
##$COROFFS= 0
##$CY= 15
##$DATMOD= 1
##$DC= 0
##$DFILT= <>
##$DTYPP= 0
##$F1P= 0
##$F2P= 0
##$FCOR= 0.5
##$FTSIZE= 32768
##$FT_mod= 6
##$GAMMA= 0
##$GB= 0
##$INTBC= 1
##$INTSCL= 1
##$ISEN= 128
##$LB= 0
##$LEV0= 0
##$LPBIN= 0
##$MAXI= 10000
##$MC2= 0
##$MEAN= 0
##$ME_mod= 0
##$MI= 0
##$NCOEF= 0
##$NC_proc= -8
##$NLEV= 6
##$NOISF1= 0
##$NOISF2= 0
##$NSP= 0
##$NTH_PI= 0
##$NZP= 0
##$OFFSET= 14.98509
##$PC= 1
##$PHC0= 176.0504
##$PHC1= 0
##$PH_mod= 1
##$PKNL= yes
##$PPARMOD= 0
##$PPDIAG= 0
##$PPIPTYP= 0
##$PPMPNUM= 2147483647
##$PPRESOL= 1
##$PSCAL= 4
##$PSIGN= 0
##$PYNMP= <proc.py>
##$REVERSE= no
##$SF= 400.02
##$SI= 32768
##$SIGF1= 0
##$SIGF2= 0
##$SINO= 400
##$SIOLD= 32768
##$SPECTYP= <>
##$SREGLST= <1H.CDCl3>
##$SSB= 0
##$STSI= 32768
##$STSR= 0
##$SW_p= 8223.68421052631
##$SYMM= 0
##$S_DEV= 0
##$TDeff= 65536
##$TDoff= 0
##$TI= <>
##$TILT= no
##$TM1= 0
##$TM2= 0
##$TOPLEV= 0
##$USERP1= <user>
##$USERP2= <user>
##$USERP3= <user>
##$USERP4= <user>
##$USERP5= <user>
##$WDW= 1
##$XDIM= 32768
##$YMAX_p= 419286156
##$YMIN_p= -720294
##$CURPLOT= <Network HP LaserJet P1505>
##$CURPRIN= <$Network HP LaserJet P1505>
##$DFORMAT= <normdp>
##$LAYOUT= <+/1D_H.xwp>
##$LFORMAT= <normlp>
##$PFORMAT= <normpl>
##$SURQMSG= 1
$$ End of Bruker specific parameters
$$ ---------------------------------
##NTUPLES= NMR SPECTRUM
##VAR_NAME=  FREQUENCY,     SPECTRUM/REAL,   SPECTRUM/IMAG
##SYMBOL=    X,             R,               I
##VAR_TYPE=  INDEPENDENT,   DEPENDENT,       DEPENDENT
##VAR_FORM=  AFFN,          ASDF,            ASDF
##VAR_DIM=   32768,         32768,           32768
##UNITS=     HZ,            ARBITRARY UNITS, ARBITRARY UNITS
##FACTOR=    0.250966925370066, 1,           1
##FIRST=     8223.43324360094, 14618,        20876
##LAST=      0,             81850,           -167893
##MIN=       0,             -720294,         0
##MAX=       8223.43324360094, 419286156,    0
$$ Real data points
##PAGE= N=1
##DATA TABLE= (X++(R..R)), XYDATA
$$ [...]
19501G6859g7498E2230J38473G6540a12522C3764K8169d79795f2441E5709A9565
19489a08086C52192A04438c10927B6142f5849b1500J0615r9449K0944j69856M2566
19478b16680A55901b00030K1429n9054o8540J46041A30417c73971e2161c174j90254
19467a93428I5112J888c79162J9380a52966d8921a6098A09855J05102a63354A97677
19455a38060k36833a27448r3912e4141k73487A79975b10866p3221G8211a55350
19444c12092a07464A11026d8600j14625Q0201A09502c59516J45509A6589g3458
19433b76427a01288p2359m5826A24687R7192J42196A53280e77172B09634A2766
19422a06938b4036q4636A0699d11659K05195k88368a62586A02693L1705n8625
$$ plain form
19501 76859 -77498 52230 190703 76540 -112522 33764 61933 -479795 -62441 55709 19565
19489 -108086 352192 104438 -310927 26142 -65849 -21500 -10885 -110334 -89390 -259246 -216680
19478 -216680 155901 -200030 -178601 -237655 -306195 -160154 130417 -373971 -52161 -3174 -193428
19467 -193428 95112 97000 -379162 -359782 -152966 -48921 -16098 109855 214957 -163354 197677
19455 -138060 -374893 -127448 -221360 -54141 -327628 179975 -210866 -284087 78211 -155350
19444 -312092 -107464 111026 -48600 -163225 -83024 109502 -359516 -214007 16589 -73458
19433 -276427 -101288 -173647 -219473 124687 221879 364075 153280 -577172 209634 12766
19422 -106938 -24036 -108672 10699 -411659 -206464 -494832 -162586 102693 134398 75773
19412G5773f9195B13184a04665j08999I809O252J95888e4586A59659a18304C5915
19400b24369i4369C8010M318a21753G1882j7717b86996L4264a26177b4390j06767
19389a31157A05679a91502B11039a72960k5628j51984Q0878b1021k32905b642
19378a49249M9698n4001D7617a12278j37551R2274A48857e4534B5212b18647B15574
19366c3178j31148C6475P1708a26795A2435O1583b8153C9263c07297h004J378
19355f626j99502m2800B2619d7701o3315B80374a87782A45704o7830K0794a21813
19343B6113b19585m8458c4896I5982b42760H1799c11325n4747C1104a45767I9352
19331a37492j65428C04041A28209d7861j86246H2506c55134C07582i0775D7064
$$ plain form
19412 75773 -69195 213184 -104665 -213664 9809 16061 211949 -54586 159659 -118304 35915
19400 -224369 -94369 38010 42328 -121753 71882 54165 -286996 -252732 -126177 -24390 -131157
19389 -131157 105679 -191502 211039 -172960 -198588 -350572 -269694 -21021 -253926 -2642
19378 -149249 -99551 -153552 47617 -112278 -249829 -157555 148857 -54534 25212 -218647 215574
19366 -33178 -164326 36475 108183 -126795 12435 74018 -28153 39263 -307297 -8004 -6626
19355 -6626 -206128 -248928 22619 -47701 -111016 280374 -187782 145704 77874 98668 -121813
19343 26113 -219585 -268043 -34896 95982 -242760 81799 -311325 -366072 31104 -145767 99352
19331 -137492 -302920 304041 128209 -47861 -234107 82506 -355134 307582 -90775 47064
19320a53314e8790m2556A02302a74374A2791J31408J85679a05982n5529l66399
19310e27910b5854I6806a35985p9286G3936k767a34028m2920k9039A4243a79196
19298B77455b33870P8602D3901e02705A7064N1107a08362c4620k87233E6031J06808
19287A62839B5272o948a71684j4590j97333a22914l68472A77631b61081f9468
19276f334j03874B42575q3556a5967l76615J84750d4666l77453H0643e3274A41117
19264C85222a99475j64546J62324f4339o8231K2618C3134J09201f0786b4626Q079
19253a6547C56506a71460J0856A7418Q2550d11913a18764A04524N7952f4398k74690
19242c39088J36869B84597b92040B8743O1443K9913b38684C8878e83005c9897
$$ plain form
19320 -153314 -58790 -101346 102302 -174374 12791 144199 329878 -105982 -161511 -527910
19310 -527910 -25854 96806 -135985 -215271 73936 71169 -134028 -176948 -205987 14243 -179196
19298 277455 -233870 -155268 43901 -502705 17064 68171 -108362 -34620 -321853 56031 162839
19287 162839 25272 18324 -171684 -186274 -383607 -122914 -491386 177631 -261081 -69468
19276 -6334 -110208 242575 159019 -15967 -392582 -207832 -44666 -422119 80643 -53274 141117
19264 385222 -199475 -364021 -201697 -64339 -132570 -109952 33134 142335 -60786 -24626 -16547
19253 -16547 356506 -171460 -160604 17418 99968 -411913 -118764 104524 162476 -64398 -339088
19242 -339088 -202219 284597 -292040 28743 90186 120099 -238684 38878 -583005 -39897
19231C9422A4359a34634j77924G6125D721h5407L1840B2720J8688i5691A37235
19219f7617l77233g0889A50730a52237R11A04980j1188a70045K8822B4688K0973
19208D5661b1291j03517k50485F5140c8191j11864a7888l71093g0615A57193b21079
19196b51880B5693N145b57037A30059a6399l2551C37345F9115a88106h1858l22177
19185d04035F6218b9120j67450A29702B3108K45682b10018O0157A85336G6938
19174a37897N2934B3884b19291A15210e7277a3589j27592o0420P5006J447j2808
19163a37956j8130K1888B7363a4580B4367a9273k9320k85704a50745F9605a68650
19151I368K33023a94816C8556a47892B20767b01089A8627L70437A25925g723D3030
$$ plain form
19231 39422 14359 -134634 -312558 76125 4721 -85407 -53567 22720 41408 -95691 137235
19219 -67617 -444850 -70889 150730 -152237 -151326 104980 93792 -170045 -141223 24688 45661
19208 45661 -21291 -124808 -375293 65140 -38191 -150055 -17888 -388981 -70615 157193 -221079
19196 -251880 25693 30838 -257037 130059 -16399 -48950 337345 69115 -188106 -81858 -404035
19185 -404035 66218 -29120 -196570 129702 23108 268790 -210018 -149861 185336 76938
19174 -137897 -84963 23884 -219291 115210 -57277 -13589 -141181 -201601 -126595 -125148 -137956
19163 -137956 -156086 -134198 27363 -14580 24367 -19273 -48593 -334297 -150745 69605 -168650
19151 9368 242391 -194816 38556 -147892 220767 -201089 18627 389064 125925 -7723 43030
19139b121j26474b7178A85381l7541K14238d7232o1079B87608b86257d6305J3897
19128c2408l05605B60971b63244K6041C1540f3722q4744e987D25411d626l05358
19117c09984J0188P6141a10070A44397f9602A96670d739k92499a04966l89858
19107d94824B61508f8846f831B24905b7848k45058O4258B68024r3925a79533r0402
19096b69935e0423l6621j83096A06404c7920E8484b85050a3593p4957J2858B03521
19084c07122F5986b47173j31228a19467L6520j6259B32019G633a97151r8975A12995
19072b98847d483k910A89455B2584J82305H8244b70504A45527a52415A18331E5119
19060B03967a48397J4750d8335E4339K4467b06728m53179B46133k8337b15117
$$ plain form
19139 -2121 -128595 -27178 185381 147840 362078 -47232 -108311 287608 -286257 -46305 -32408
19128 -32408 -338013 260971 -263244 -237203 31540 -63722 -148466 -5987 425411 -4626 -309984
19117 -309984 -299796 -223655 -110070 144397 -69602 196670 -4739 -297238 -104966 -494824
19107 -494824 261508 -68846 -6831 224905 -27848 -272906 -208648 268024 174099 -179533 -269935
19096 -269935 -50423 -87044 -270140 106404 -37920 58484 -285050 -13593 -88550 -75692 203521
19084 -307122 65986 -247173 -378401 -119467 -82947 -99206 232019 7633 -197151 -296126 112995
19072 -298847 -4483 -7393 189455 22584 204889 88244 -270504 145527 -152415 118331 55119
19060 203967 -148397 -133647 -48335 54339 78806 -206728 -659907 246133 217796 -215117
19049B90019a34643E146e2863k17480J19976O040A30044i8456B72483A16706a76177
19037b31684B17436K7566j00187c0916a1680A56101d8119A0429M7094i1657D8030
19025b88104c8024k70318a7331k32315h0377N614l7142M5975j03392E17778b59543
19013A14620L8432c31375I3052g1172f565l5927A49038a33293I5840A9702a64286
19001a27163A72700J0600q1368B6123Q9023d3653j11950H398J55241R7219a0148
18989a41832j87495e2869m135B6437c17582C9818A6195a00960b7296A57156D6264
18977b76542a9359j1057j13172q9658O8236m6364P1754G7072J09140p5179b64266
18965B29606a14182e6344B30075l2192c43552C7149K45925q2433H2504J08439
$$ plain form
19049 290019 -134643 5146 -52863 -270343 -150367 -144327 130044 -98456 272483 116706 -176177
19037 -231684 217436 245002 144815 -30916 -11680 156101 -48119 10429 57523 -91657 48030
19025 -288104 -38024 -308342 -17331 -249646 -80377 -74763 -111905 -65930 -169322 517778 -259543
19013 114620 153052 -331375 93052 -71172 -6565 -42492 149038 -133293 95840 19702 -164286
19001 -127163 172700 183300 101932 26123 115146 -43653 -155603 8398 163639 260858 -10148
18989 -141832 -329327 -52869 -57004 26437 -317582 39818 16195 -100960 -27296 157156 46264
18977 -276542 -19359 -30416 -143588 -233246 -165010 -211374 -139620 77072 186212 111033 -264266
18965 229606 -114182 -56344 230075 197883 -343552 37149 283074 200641 82504 190943
18955A90943F5263k7520r860J48190C8156N2299J0127f8816B92616I5902K77317
18944C73219a20553a5264q361n9978A57671a74118k91590c3136j09580b9517j34439
18933a63956k1282j96308B5114d7368a6001A02552a53543A2309J9546a98612C89422
18921a69168L6820M2261A27377b95236F6217K5962K81953a55547B21140b60094
18910i2604j20350n5936J03200r9714A14954b1132A93272K68a04773e0091j45561
18899a95652E0904M8216B6367L87360D5034J64386J40408E085Q3227N1803b31942
18887A64078G3809e782A13733C6031o156a9081l21552J61597M017C14712c91103
18875D0646d62241K07864B5670c65194A58511B6980a96273h3422l25759A16538
$$ plain form
18955 190943 65263 37743 27883 176073 38156 90455 100582 -68816 292616 95902 373219
18944 373219 -120553 -15264 -23625 -83603 157671 -174118 -465708 -33136 -142716 -29517 -163956
18933 -163956 -185238 -381546 25114 -47368 -16001 102552 -153543 12309 31855 -198612 389422
18921 -169168 -132348 -90087 127377 -295236 66217 92179 374132 -155547 221140 -260094
18910 -92604 -212954 -268890 -165690 -265404 114954 -21132 193272 193540 -104773 -50091 -195652
18899 -195652 50904 99120 26367 413727 45034 209420 349828 5085 88312 140115 -231942
18887 164078 73809 -5782 113733 36031 29875 -19081 -340633 -179036 -175019 314712 -391103
18875 40646 -462241 -254377 25670 -365194 158511 26980 -196273 -83422 -409181 116538
18864D9498h4426M1842A24168a8064p7891k71331M9995a05838j48103B45860k0220
18853B25640D2412h7968o2225L2902N6982k741k87595A08779J53941d9848G7241
18841H7672a2928I9855a064n1123H7656J590K44070b42351g151A82735H3267b55304
18828f286m3142P886j1009A8479J9429M6543c09139a37348E2537A4254a71507
18816A53021B9310c1994n8883p4284C90375g630p3135n1270h468B39993p3897
18805A66096c3954A57031J19469b14009J00517j42256L0232f8841n117l54902
18795d28860c2468k23445j14997A59613c08082G0706b28103D9000L18719A7919
18784a72550f1049k55990J33823O2094l23428g8318C3307a91406F4385f06719
$$ plain form
18864 49498 -84426 -42584 124168 -18064 -95955 -367286 -317291 -105838 -253941 245860 225640
18853 225640 42412 -87968 -150193 -117291 -60309 -63050 -350645 108779 262720 -49848 77241
18841 87672 -12928 99855 -1064 -52187 87656 89246 333316 -242351 -7151 182735 83267 -255304
18828 -6286 -49428 -41542 -52551 18479 37908 84451 -309139 -137348 52537 14254 -171507
18816 153021 29310 -31994 -90877 -165161 390375 -7630 -80765 -132035 -8468 239993 166096
18805 166096 -33954 157031 276500 -214009 -113492 -255748 -225516 -68841 -73958 -428860
18795 -428860 -32468 -255913 -370910 159613 -308082 70706 -228103 49000 367719 17919
18784 -172550 -61049 -317039 -183216 -121122 -444550 -78318 33307 -191406 64385 -606719
18773B1480I227a70420C07776a81812j01544A240Q696a6099j25584I5930l4750
18762F1180C187f9017j75117g4788l638J0742j26928a4667q998H8706B1685J60431
18750A82116b14799p6614c8581j02058j48470e0108A17868E6726g3818n8744l9184
18739a71746e1857B16741j08181b29115J00819q519c9705j5350A19004k3816J41306
18728B36494k2807g4206q8928p426E142K3578h9804D3179a795j12304b5348e347
18715a68754r4244c8259H013K5446J15357a00081l31872A28863E1376a31427A14555
18703G8049B0065K14574J2335D861a48578A51292L6999a52755j48800h06G8407
18691A26430d0200j44456P7245G5255a26450j61421H595k273a58752O4596o25
$$ plain form
18773 21480 9227 -170420 307776 -181812 -283356 1240 9936 -16099 -141683 95930 61180
18762 61180 3187 -69017 -244134 -74788 -78426 -67684 -194612 -14667 -23665 88706 21685 182116
18750 182116 -214799 -291413 -38581 -140639 -289109 -50108 117868 56726 -73818 -132562 -171746
18739 -171746 -51857 216741 108560 -229115 -128296 -136815 -39705 -55055 119004 95188 236494
18728 236494 213687 -74206 -163134 -170560 5142 28720 -89804 43179 -1795 -114099 -25348 -5347
18715 -168754 -262998 -38259 8013 33459 148816 -100081 -431953 128863 51376 -131427 114555
18703 78049 20065 234639 246974 4861 -148578 151292 188291 -152755 -301555 -806 78407
18691 126430 -40200 -184656 -107411 75255 -126450 -287871 8595 6322 -158752 -94156 -94781
18680i4781C3568e0714j56418l4903O5823H9100b42645N5302N9754k53279i9915
18668c27904B00300B2136h6639m644j87055e5588k78389Q2228d3365G9022i1038
18656d10667A59963a37192A44936b94629C75245B882c2718m69691a13244m6071
18646a59315c2786l14927E5306c20832c221m59977J62792A85971a92104N5326
18636a36778m2376M6715O2289D3428J92988G2704c75946a29909j82754B28101
18625f6342m6792A8025b20166k7720J11798A16535a81281j60321b4335j45270
18615a69605g0370p750a8677q3062G2624J25781a9529j35939E148a22934H9799
18603A71785c66922i153n5667K7877k7347B05583b23782e3079b79l2777j55716
$$ plain form
18680 -94781 33568 -50714 -207132 -242035 -176212 89100 -242645 -187343 -127589 -380868 -99915
18668 -327904 200300 22136 -86639 -91283 -278338 -55588 -333977 -251749 -43365 79022 -91038
18656 -410667 159963 -137192 144936 -294629 375245 2882 -32718 -502409 -113244 -159315
18646 -159315 -32786 -347713 55306 -320832 -3221 -463198 -300406 185971 -192104 -136778
18636 -136778 -179154 -132439 -70150 43428 236416 72704 -375946 -129909 -312663 228101
18625 -66342 -113134 18025 -220166 -247886 -136088 116535 -181281 -341602 -24335 -169605
18615 -169605 -70370 -78120 -18677 -101739 72624 198405 -19529 -155468 5148 -122934 89799
18603 171785 -366922 -9153 -64820 -36943 -64290 205583 -223782 -53079 -279 -33056 -188772
18592a88772B48115c73766g9226c3290A30865b13246B92344H6916K0008Q3519
18582A90443a63573M2833e3336D5888b93185A63831a18538q4207i3994n3207N2154
18571i5047M3528K3984A0953K8420b3584l6972j10433l1658P1514M017B29296
18559D1410J76904e4977G7004C735a15082B9255a41543B50288p6837g9018k46065
18548c25083f1814k09728B72835F0175f8201j49858A01404h1927A33683b69429
18537h723k21694A57071B6799M0891p441b45370a03995A20708J32666m3039Q238
18526B18573C9222c1622B5977g6232A92535J11101a81497A71819i0479n5662a4346
18514b2770C52356c4198j15196J6937A07396b9991G9171A8060J01280c75146h1626
$$ plain form
18592 -188772 248115 -373766 -79226 -33290 130865 -213246 292344 86916 106924 190443
18582 190443 -163573 -120740 -53336 45888 -293185 163831 -118538 -202745 -93994 -147201 -95047
18571 -95047 -51519 -27535 10953 39373 -23584 -60556 -170989 -202647 -131133 -127116 229296
18559 41410 218314 -54977 77004 3735 -115082 29255 -141543 250288 173451 -79018 -325083
18548 -325083 -61814 -271542 272835 60175 -68201 -218059 101404 -81927 133683 -269429
18537 -8723 -230417 157071 26799 67690 60249 -245370 -103995 120708 253374 210335 218573
18526 218573 39222 -31622 25977 -76232 192535 303636 -181497 171819 -90479 -146141 -14346
18514 -22770 352356 -34198 -149394 -132457 107396 -29991 79171 18060 119340 -375146 -81626
18502H6895b43160a04201a4595A753M4604c88013M0570M9761i6296B2641c85979
18490b67517P1560H5218a17706j6523c6693j36658N9342A13221g6674A20491c3934
18478B50840b27722f6633n5346k82460A23729F1273a47536G9192c7198r7021M6591
18467h7628p719b8303j37324L4350k95173b03477B13888G0292a14554A2447N4957
18456F7404J53005B0951J8612c17496a25988n0898Q1372A04916d7825K0722k57655
18445b84758b1887j67673k9687h64C08061j04468B0253a81267A32305M5934b22827
18433b99253D1699b04913d2217k34402D0571b05008P5798j25329a19268k31752
18423c51020J27394c0274j16881M8985l77645q2920a09103j50089B5395b60708
$$ plain form
18502 86895 -243160 -104201 -14595 1753 46357 -388013 -347443 -297682 -96296 22641 -385979
18490 -267517 -195957 85218 -117706 -134229 -36693 -173351 -114009 113221 -76674 120491 -33934
18478 250840 -227722 -66633 -121979 -404439 123729 61273 -147536 79192 -37198 -134219 -87628
18467 -87628 -95347 -28303 -165627 -131277 -426450 -203477 213888 70292 -114554 12447 67404
18456 67404 220409 20951 39563 -317496 -125988 -176886 -95514 104916 -47825 -27103 -284758
18445 -284758 -21887 -189560 -219247 -864 308061 203593 20253 -181267 132305 178239 -222827
18433 -299253 41699 -204913 -42217 -276619 40571 -205008 -129210 -254539 -119268 -351020
18423 -351020 -223626 -30274 -147155 -98170 -475815 -558735 -109103 -259192 25395 -260708
18412b82566a9136k3423n26B57508J64029a10985B43896a75176C36692A07172
18401G7296J87811A00614a64695C0961L66001A76285p0558a58722A06808b68723
18390C10162c7880G6864b91080D8567a46660j92305D9471J499L7795f5927a9654
18378b70007a04324j4895j85891a00136o834A46993K8281b33163A51535b37316
18367E9118a03028j24409A85856E4024J94056C4852O7348a24516C2885N782a74535
18355b16052e1093A45448c45210A20445d2061B32517G9015i7189d7363G1342a0996
18343a63297c1981A16445b29228D2933b2974n8485m9496n2885B4550a8695k78017
18332b96712c1232I8519a19395B40522b5088l4323F0192b98589J9330i9026A58057
$$ plain form
18412 -282566 -19136 -42559 -43085 257508 421537 -110985 243896 -175176 336692 107172
18401 77296 265107 100614 -164695 30961 396962 176285 105727 -158722 106808 -268723
18390 310162 -37880 76864 -291080 48567 -146660 -338965 49471 50970 88765 -65927 -19654
18378 -270007 -104324 -119219 -305110 -100136 -106970 146993 175274 -233163 151535 -237316
18367 59118 -103028 -227437 185856 54024 248080 34852 102200 -124516 32885 38667 -174535
18355 -216052 -51093 145448 -345210 120445 -42061 232517 79015 -97189 -47363 71342 -10996
18343 -163297 -31981 116445 -229228 42933 -22974 -81459 -130955 -183840 24550 -18695 -296712
18332 -296712 -31232 98519 -119395 240522 -25088 -59411 60192 -298589 -279259 -99026 158057
18320f0027K8802k38409h8987C50502F5416b72481D3582a93996C6335h4759B06090
18308g2797G9775l6179A3863K01012f9022n8914C386d6065q9951o2253A41242
18296b06352C2170c82403a52669h952q8936o5920C79092A71319G7638b95841a4856
18284a33231j51791A00113g5627K0846A87577b61170O8622A23665c6986a2538
18273a40183p8031Q5358e5696F8523P2386a23421H5648b4925l19457B12663b95273
18261A1782b22988b0876D4788f7066H4009a93856C1192h2116A50590j5436c44090
18249b34754A9286d2111j90551B38886a28413j310j4673A49673C7473b5474I3617
18237a30541m4305l1146A19571a74105A8784b90055g7162m89195D6363a47207
$$ plain form
18320 -60027 -31225 -269634 -88987 350502 65416 -272481 43582 -193996 36335 -84759 206090
18308 -72797 79775 43596 13863 214875 -69022 -127936 3386 -46065 -136016 -198269 141242
18296 -206352 32170 -382403 -152669 -8952 -97888 -163808 379092 171319 77638 -295841 -14856
18284 -133231 -285022 100113 -75627 -54781 187577 -261170 -192548 123665 -36986 -12538
18273 -140183 -218214 -132856 -55696 68523 140909 -123421 85648 -24925 -344382 212663 -295273
18261 11782 -222988 -20876 44788 -67066 84009 -193856 31192 -82116 150590 135154 -344090
18249 -234754 19286 -42111 -232662 238886 -128413 -129723 -144396 149673 37473 -25474 93617
18237 -130541 -174846 -205992 119571 -174105 18784 -290055 -77162 -566357 46363 -147207
18226b37517d648j00051B27786e3120o2398o9403B48716b20233r4063P8124h5344
18214a82408b7431k0158j06739O1539N414E8270K65768a81792L1319A48221L6784
18203A85005b22526J04788q0402k09652a77641N6112L009K9935l15341a26802
18192a14214e4421D0891g7332A33380A1172i8481k8096B65869p8171c9095l916
18181d3011j95864A97127a29085B3292Q2731a5480A42156J4790F7670k4200b62240
18169a07062j8361G3834b53627P911B9460J64506l268b5201B2456K42138G6178
18157b98133a24615j10186A407d3866A04892Q4915c8530j36773B58818a18865
18146A80427A3688J40854F4213c63596A20847N3879F6649j8933K92522a20412
$$ plain form
18226 -237517 -4648 -104699 227786 -53120 -115518 -184921 248716 -220233 -314296 -236172 -85344
18214 -182408 -27431 -47589 -154328 -92789 -87375 58270 324038 -181792 -150473 148221 185005
18203 185005 -222526 -117738 -198140 -407792 -177641 -121529 -118520 -88585 -403926 -126802
18192 -114214 -54421 40891 -77332 133380 11172 -98481 -126577 265869 187698 -39095 -43011
18181 -43011 -238875 197127 -129085 23292 106023 -15480 142156 156946 67670 43470 -262240
18169 -107062 -125423 73834 -253627 -245716 29460 193966 190698 -25201 22456 264594 76178
18157 -298133 -124615 -234801 1407 -43866 104892 189807 -38530 -175303 258818 -118865
18146 180427 13688 154542 64213 -363596 120847 174726 66649 47716 340238 -120412
18135b61448J1659a15425M1125E7229L10267E4689a32586c5826l0361c0596k3950
18124e4546o5647k24952a8252l123k26k75828A2103g9866K8998m7837F9739a05924
18111a55169o5078C43582D5590j4790e8254B51503f6616C6469J68782i9372B8560
18099c1225k09138A97632g6638b495j97156J4006e9611j23192C1822J8115g247
18087A26680F0135J18339a9553k38156a02630b0008o5073j74868F0860c71903
18076A83492a65780a4876A21968J0306a49541d9468B09L53715A21488a49121k77278
18065d26399d5846j7076l76054g3606A26127h4522E2172g576B27335a51447e7146
18053D1709K54866b04144e8127B58764f950C5057i0398A38840b91665J39233j99307
$$ plain form
18135 -261448 -249789 -115425 -74300 57229 367496 54689 -132586 -35826 -66187 -30596 -54546
18124 -54546 -120193 -345145 -18252 -21375 -21601 -297429 12103 -79866 -50868 -98705 69739 -105924
18111 -155169 -220247 343582 45590 30800 -58254 251503 -66616 36469 205251 -99372 28560
18099 -31225 -240363 197632 -76638 -2495 -199651 -185645 -59611 -182803 31822 49937 -7247
18087 126680 60135 178474 -19553 -257709 -102630 -20008 -85081 -259949 60860 -371903
18076 183492 -165780 -14876 121968 132274 -149541 -49468 209 353924 121488 -149121 -426399
18065 -426399 -45846 -62922 -438976 -73606 126127 -84522 52172 -7576 227335 -151447 -57146
18053 41709 296575 -204144 -58127 258764 -6950 35057 -90398 138840 -291665 -152432 -351739
18042c51739a5434p0059N665A48576c8432A9701g2708A9856O2812i7878m9209
18031a47087B7506J22376A6970c693j42725C84851j54095J37960j42973n7168
18021A68575P3027d902A35712o0760L8146C5617c34701d3005o9984q4875i4264
18009A33594c3044A87916A5769L41354c60321D9645a45043l2682A27761a96071
17998A21063e5730A3219e6891j59704B71157o8010l5875J76972b89338a28405
17987a47628N9764L1052C08703c10921A24454c8854A65716a95516B11708M5449
17977B57157E1279a44909a0380j9812J025C9655b00888I5591B814J45003K396
17966A50213b54088B19988l0868a84581M4753m9056K1222k76370A27787a14644
$$ plain form
18042 -351739 -15434 -85493 -79828 148576 -38432 19701 -72708 19856 82668 -97878 -147087
18031 -147087 27506 149882 16970 -3693 -146418 384851 230756 368716 225743 168575
18021 168575 241602 -4902 135712 74952 113098 35617 -334701 -43005 -112989 -197864 -94264
18009 133594 -33044 187916 15769 357123 -360321 49645 -145043 -177725 127761 -196071
17998 121063 -55730 13219 -56891 -216595 271157 203147 167272 344244 -289338 -128405
17987 -147628 -87864 -56812 308703 -310921 124454 -38854 165716 -195516 211708 257157
17977 257157 51279 -144909 -10380 -30192 -29167 39655 -200888 95591 2814 147817 150213
17966 150213 -254088 219988 189120 -184581 -139828 -188884 -167662 -444032 127787 -114644
17955A29823H184N637K21519a36251o0885e1186M811A28331K9856n4953b54794
17943C2794b32801B33620J75788a32975a6431m704B19892I4876a74149M4708k04843
17932c34284a1254E4579d8391j5862j07163c5267r7187O0764A09572a8160p8649
17921i6809C26032E1905a13470j59668R9453O0108M9024b5545B58242l8351e9715
17909A34324C1399N4348a0095j01911a5430k13896p4222B25907a07219A19245
17898B00362f5119k56232a50301O2893j0305L7317C7117J32723B9414M0448a15344
17886C20259A17921a14838F3912R6654a63400I4063L3609a66088R880d7932n4289
17875a02221k3220C18986a65571e6234A60604c09779A54557a68747A2524M6446
$$ plain form
17955 129823 8184 13821 235340 -136251 -197136 -51186 -46375 128331 158187 103234 -254794
17943 32794 -232801 233620 409408 -132975 -16431 -21135 219892 94876 -174149 -129441 -334284
17932 -334284 -11254 54579 -48391 -64253 -171416 -35267 -132454 -71690 109572 -18160 -96809
17921 -96809 326032 51905 -113470 -273138 -173685 -113577 -64553 -25545 258242 219891 -59715
17909 134324 31399 85747 -10095 -112006 -15430 -229326 -303548 225907 -107219 119245
17898 200362 -65119 -321351 -150301 -87408 -97713 -60396 37117 169840 29414 69862 -115344
17886 320259 117921 -114838 63912 160566 -163400 94063 127672 -166088 -156208 -47932 -102221
17875 -102221 -125441 318986 -165571 -56234 160604 -309779 154557 -168747 12524 58970
17865E8970a8990C82096B056L3027J66788J10775d22272D52317d3852A79162H7172
17853A64505b83462g776I8981L5494M8595q8779J7519K5540A8518a56864A96629
17841A5207J10856M9436a31633D6863K42899A12970d3132B86437c7918A09062
17830a09242C50216a6018o9511D9457a15553G9490Q0461i4821p5560C6528M1439
17819G7967J31839r5923a95917L9599g56j63812l5621B22699a01842H7266N7997
17808A45263R0780b2307B47741F7167b7005j94648R7545A07760a58520I4235K30642
17797C24877A48724a73093B73991e9447p9611I0313B2020h8286H3645a21598n3992
17786a75590B73157a700C55057b25445i6744B3156a0710B11951c5495m7168H262
$$ plain form
17865 58970 -18990 382096 2056 35083 201871 312646 -422272 452317 -43852 179162 87172
17853 164505 -283462 -7776 98981 134475 183070 94291 111810 137350 18518 -156864 196629
17841 15207 126063 175499 -131633 46863 289762 112970 -43132 286437 -37918 109062
17830 -109242 350216 -16018 -85529 49457 -115553 79490 159951 -94821 -170381 36528 77967
17819 77967 209806 113883 -195917 -156318 -756 -164568 -200189 222699 -101842 87266 145263
17808 145263 236043 -22307 247741 67167 -27005 -221653 -124108 107760 -158520 94235 324877
17797 324877 148724 -173093 273991 -59447 -139058 90313 22020 -88286 83645 -121598 -175590
17786 -175590 273157 -1700 355057 -225445 -96744 23156 -10710 211951 -35495 -82663 8262
17774F7932a02422A06320Q6028A0311k335f9846B5599J10666c4119f88n6390r7867
17762a54945D7737a81025b9919A42907c6477C32990a05913j21331c7410d348l0662
17751c5010C08571A10000a01746B5690L45047Q152A9870e8496B1823a27349F3440
17739A22439K88827A09000a73276C84789a94557I4803J56018I2710c49165G4678
17728h7707A49093p1044j3208a76680a0897j50565B07939b6344F8756N7514J75914
17717C02184D848K19204p2043E4478J60335a22840A51196a60121A2304N4259K46478
17706C13041K2379j20843r4571A7075a44059F7816J63646a3984A1338i9526E6843
17694A75291k4668j0271O426p010J2012K5560n6235n8137k2450b89240I3028a75786
$$ plain form
17774 67932 -102422 106320 192348 10311 7976 -69846 25599 136265 -34119 -688 -57078 -154945
17762 -154945 47737 -181025 -29919 142907 -36477 332990 -105913 -227244 -37410 -4348 -35010
17751 -35010 308571 110000 -101746 25690 370737 378889 19870 -58496 21823 -127349 63440
17739 122439 411266 109000 -173276 384789 -194557 94803 250821 92710 -349165 74678
17728 -87707 149093 78049 64841 -176680 -10897 -161462 207939 -26344 68756 126270 302184
17717 302184 4848 224052 152009 54478 214813 -122840 151196 -160121 12304 66563 313041
17706 313041 335420 214577 120006 17075 -144059 67816 231462 -13984 11338 -99526 56843
17694 175291 150623 140352 146778 139768 151780 177340 121105 62968 40518 -289240 93028 -175786
17681G931J18340d5926G3911J80036A13573a9312k03054A88485B90d5248C6195
17669A57860C7435a45105i502l06413B30684l1071c3271a1B04433D6383A4436
17657a99865h145A45214b69642C31677c4092B77609D1678K7190J43823p2182a22601
17645A26324a17221I8801a88662F6629M0701L4556a43195f6584B67160a66762
17634c2770j29347F1912d1389E18464b23920A29323J24205h3833b1580I9956d5735
17622B12215M4176a93412P3142a031E9412k637L6476J14249b7037E6164L00979
17611C57143B0903J38854A2873K7820Q6108K62782P36n7069C2093K44932C1605
17599A4874J3349a14123C4213J3061J81386a51084B854J79036e2194H3837b21066
$$ plain form
17681 7931 126271 -45926 73911 253947 113573 -19312 -222366 188485 290 -45248 36195
17669 157860 37435 -145105 -9502 -315915 230684 199613 -33271 -11 204433 46383 14436
17657 -199865 -8145 145214 -269642 331677 -34092 277609 41678 68868 212691 140509 -122601
17645 126324 -117221 98801 -188662 66629 107330 141886 -143195 -66584 267160 -166762
17634 -32770 -162117 61912 -41389 518464 -223920 129323 253528 -83833 -21580 99956 -45735
17622 212215 256391 -193412 -120270 -1031 59412 56775 93251 207500 -27037 56164 357143
17611 357143 20903 159757 12873 40693 126801 389583 390319 333250 32093 277025 31605
17599 14874 28223 -114123 34213 47274 228660 -151084 2854 181890 -52194 83837 -221066
17587A06480D0273J66728E9039O2707A1618J17147a73700A28597n3405j5163J253
17576F1282N0750N9032b64136b2493B8140J809O3243d2723A57245k099a15418
17564B00444a63620C41882A69168F1155b54B85783E711J26930K9982p7388B5262
17552b5053C11425j7820A29933b3658B63137f952q5839a5600B47988n5795n4191
17541A38002A5657J59889K5921a47581B79389k5096K4549D0269M7071J08414j0
17530A95744J07366D9680K01008D8806J97799O5347p9614N10131j19197j17660
17520E05612A85038K01673j39144b038D84025k4417p9509A66847K10678j64856
17510B12669J23885A12143L89794j37853o6637J83181p5127A50832I074L76163
$$ plain form
17587 106480 40273 207001 59039 121746 11618 128765 -173700 128597 75192 60029 61282
17576 61282 112032 171064 -264136 -22493 28140 29949 93192 -42723 157245 155146 -115418
17564 200444 -163620 341882 169168 61155 -254 285783 5711 132641 162623 85235 25262
17552 -25053 311425 293605 129933 -23658 263137 -6952 -92791 -15600 247988 192193 138002
17541 138002 15657 175546 201467 -147581 279389 254293 278842 40269 87340 195754 195744
17530 195744 303110 49680 250688 48806 246605 311952 232338 742469 623272 505612
17520 505612 185038 386711 247567 -2038 484025 459608 380099 166847 377525 212669
17510 212669 336554 112143 501937 364084 297447 480628 405501 150832 9074 385237
17500C85237j0798j7602j56156J06684H9023K7606g2422A13593K7394p0153N1736
17489A22570N21307A94050J92537j83386o0126L64234E7226b13391C86497N4365
17479D40862A48359L43533k29809q9679K43580A12190K78404D0283J24822L82928
17469E48033D8515J81028J54240D2615L03961j41058J68703j67000c2811k4925
17459e7736A63954D7238O9457j8041J87522L311a6021D91005j78446d0349A00094
17447D98823j02286j64156m2023K34920j44381A22470K69648o3756a9752A68066
17436B25688Q6003K91951k41747L5468A08749L56045l7898j67131J89744k2613
17426D26896j88258J24488j79485L0002J97072J16854n7020A66844k307J76543
$$ plain form
17500 385237 374439 356837 200681 307365 89023 116629 -72422 113593 140987 70834 122570
17489 122570 643877 194050 386587 203201 143075 507309 57226 -213391 386497 440862
17479 440862 148359 491892 262083 172404 415984 112190 390594 40283 165105 548033
17469 548033 48515 229543 383783 42615 346576 205518 374221 207221 -32811 -57736
17459 -57736 163954 47238 116695 98654 286176 289487 -16021 491005 312559 -40349 100094
17447 498823 396537 232381 190358 425278 280897 122470 392118 328362 -19752 168066
17436 225688 311691 603642 361895 397363 108749 464794 426896 259765 449509 426896
17426 426896 238638 363126 183641 213643 410715 527569 470549 166844 164537 341080
17416C41080k612j9982J25191p0059M3239n3807k1488k585G3173K03000n2523
17405B23650a3264B69408O7709J11632E6649j6288a19074A19544L06246A78421
17394C11507J74080d0274D26375G0396b88880g1909B30629J28348L8863A19667
17383H1088K83974A04611J11572o0446a92091D29684A31858a85385D14039J34999
17373E49038A90860K08826j38837F7929M15841k01021h8810D64666k11287j2571
17363B40808c0533q2622C42648A10195l3560J05697P2933F0135m789R4661P0555
17352B20562e8066B99588b4446k2300C00030M0204i2254A59055K57590G0846N2545
17341A23391A9379J17619k9499K02297P2782K2393j16558K14984M9273K855B62968
$$ plain form
17416 341080 338468 318486 443677 373618 416857 363050 341562 338977 73173 276173 223650
17405 223650 -13264 269408 337117 448749 56649 40361 -119074 119544 425790 178421
17394 311507 485587 -40274 426375 70396 -288880 -71909 230629 358977 397840 119667
17383 81088 365062 104611 216183 155737 -192091 429684 131858 -185385 414039 549038
17373 549038 190860 399686 260849 67929 483770 282749 -88810 464666 253379 240808
17363 240808 -30533 -113155 342648 110195 76635 182332 255265 60135 55346 150007 220562
17352 220562 -58066 299588 -24446 -46746 300030 340234 -92254 159055 416645 70846 123391
17341 123391 19379 136998 107499 309796 382578 404971 288413 503397 552670 555525 262968
17329A70575J70292D4219L81026A31772N7834h8189F44302B86755D8051L69154
17319D17205j79575Q7368Q6734A74389Q0531K25455j39099n1911J07508j27376
17309B69497j13253p1980J61392J74042H2654K10633r1179J89430A38943M62544
17299F01487I9734N4163K25628j88939m7496j05L3685K62717A09289M42180B63742
17287A27071B8331K48288C9328K67443N1c3790F4130J91687J71377m3224A29493
17275D16432k05484J65581j40331K81O0291K995m2635M21130A29207m4394L72686
17264D57499A59736L3131K51153H6340K73775j70931A4834K97499K44503q0048
17254D76788r7572J6431L6687g4788I8750K32101j7829J13660j60987j24427o4092
$$ plain form
17329 170575 340867 44219 425245 131772 189606 -88189 644302 286755 48051 417205
17319 417205 237630 324998 411732 174389 254920 480375 341276 289365 396873 269497
17309 269497 156244 84264 245656 419698 82654 293287 202108 391538 138943 601487
17299 601487 99734 153897 379525 190586 143090 142985 176670 439387 109289 551469 263742
17287 127071 28331 276619 39328 306771 306822 -33790 64130 255817 427194 383970 129493
17275 416432 210948 376529 236198 236479 296770 299765 257130 678260 129207 84813 457499
17264 457499 159736 192867 444020 86340 360115 189184 14834 312333 556836 476788
17254 476788 379216 395647 432334 -74788 98750 330851 313022 426682 265695 141268 77176
17243G7176J47612L1444J77225j08802L26379A11381J19717O2555k4615F1698
17232C53124Q4885G2400M447J99528J24767j98936J20485j01809M6270l4628M07
17221B32931J78863j59358p5324J32494J14563g5741D78860A09577K58492A78567
17210B94194j13170P1546K17080K9111m0328A82118p2929J95657J28354L2447
17200D65647J2410A98527p9592K05375M50571B01700J35591K59746M0675A99149
17189B53620R1632J63587j24583j47900J26555K43009k00849o8146K03567j92333
17179C48159N6612p1261k494j3548j9955R2468j08738J76724j26337j43830K61482
17168D49282A51506L19106J19255j78656j76350J78372j03688K49787A59480M66406
$$ plain form
17243 77176 224788 256232 433457 324655 651034 111381 231098 293653 269038 61698
17232 353124 438009 72400 76847 276375 401142 202206 322691 220882 267152 232524 232931
17221 232931 411794 252436 177112 309606 424169 -75741 478860 109577 368069 178567
17210 294194 181024 252570 469650 498761 458433 182118 109189 304846 433200 465647
17200 465647 478057 198527 118935 324310 774881 201700 337291 597037 637712 199149
17189 253620 345252 508839 384256 236356 362911 605920 405071 336925 540492 348159
17179 348159 404771 333510 331016 317468 297513 389981 281243 457967 331630 187800 449282
17168 449282 151506 470612 589867 411211 234861 413233 309545 559332 159480 625886
17158F25886l06637J43999j53025A32260M78943j60421M34400C01573J33130o2290
17148C72413K85714j31488L48967C80662K50875r824P9200k37386a00028E68711
17137D17350K55104j46566l832J20609j57333j4335J32180k37099p1012L12910
17127F07976j81224L86395C88954K75669j65922M18076k54776j2172n1808j17155
17117D80866J17190k77976M15693k58894n6825J67077j35749j390m019J23523
17107E69496j23321K72219j50382n3119J31299j24429K16162k16965P2271M6388
17097F39619n8199k59665J86208J1810K12770J37202j43144k19032J46759n2390
17087F01938j24963Q0884A27853N08710K52688k21997p7703l9843J75535k66673
$$ plain form
17158 625886 319249 463248 310223 132260 611203 450782 885182 301573 434703 372413
17148 372413 658127 526639 875606 380662 631537 621713 700913 463527 -100028 568711
17137 417350 672454 525888 522056 642665 485332 470997 603177 366078 295066 607976
17127 607976 426752 813147 388954 664623 498701 916777 662001 649829 598021 480866
17117 480866 598056 320080 735773 476879 420054 587131 451382 449992 445973 569496
17107 569496 446175 718394 568012 514893 646192 521763 737925 520960 593231 639619
17097 639619 581420 321755 507963 519773 732543 869745 726601 507569 654328 601938
17087 601938 476975 557859 127853 636563 889251 667254 589551 549708 725243 458570
17077D58570K19862o7412K72500D14017M08075m5951J8433j36033L81917m50359
17067E90099J98783J41937k75557K88477l25305k6055J43689j31401J29029J37354
17057H71050J38434j31629k15669j66955K65233j5J79878k67749Q3080J41016
17047H96674k3890k72096N2694K73197j31347n3548M05200j97658j71035j44115
17037F34076K68165k17572k93547N17589J01402m01345J82824K48901k79360L7762
17027G98895L70477n32374L09602n9620L91211l36620j2424O8501N2700K89812
17017A340160l11340j05435k8664n5261K03467k08413K93581J96195l80532j67296
17007G76462M60417o9941j02301m7619O8369J42383J35111l27437n2406J37216
$$ plain form
17077 458570 678432 611020 883520 414017 822092 776141 794574 658541 1040458 590099
17067 590099 788882 930819 655262 943739 618434 592379 736068 604667 733696 871050
17057 871050 1009484 877855 662186 495231 760464 760449 940327 672578 755658 896674
17047 896674 872784 600688 653382 926579 795232 741684 1146884 949226 778191 634076
17037 634076 902241 684669 391122 908711 1010113 608768 791592 1040493 761133 798895
17027 798895 1169372 636998 946600 886980 1278191 941571 929147 997648 1050348 1340160
17017 1340160 1028820 923385 894721 839460 1042927 834514 1128095 1324290 943758 776462
17007 776462 1236879 1166938 1064637 1017018 1085387 1227770 1362881 1035444 983038 1120254
16997A120254Q8510K00192m11389K84836j62966k09554m0961K15212M77849k30777
16987A331206O8978j19781M2572J54441n84462M41138O9284J6194l33647L08474
16977A394397q5005K25406o1404J07273m1010k57257J47987j00135K37837o7813
16967A500276K13651o1967k42206k5498K08034m87748L50890K46338j25415j77900
16957A398455J55362R0367J94522k38267K06693p8399K37610j40267q6424k30445
16947A509207K38762k286q7382J98334j19668k2964K45229M2191Q8267k5031l90033
16936A674626M01604j70288k23464K21244K50360p1241k32506J57071P2717k65538
16926A814585M39168R8030k98628M50629l12938j47076N53167n90401J00827M22145
$$ plain form
16997 1120254 1208764 1408956 997567 1282403 1119437 909883 868922 1084134 1561983 1331206
16987 1331206 1400184 1280403 1322975 1477416 892954 1334092 1403376 1419570 1085923 1394397
16977 1394397 1309392 1534798 1473394 1580667 1539657 1282400 1430387 1330252 1568089 1500276
16967 1500276 1713927 1651960 1409754 1384256 1592290 1104542 1455432 1701770 1576355 1398455
16957 1398455 1553817 1644184 1838706 1600439 1807132 1728733 1966343 1826076 1739652 1509207
16947 1509207 1747969 1745683 1658301 1856635 1736967 1714003 1959232 2001423 2089690 2064659 1674626
16936 1674626 2076230 1905942 1682478 1903722 2154082 2082841 1850335 2007406 2080123 1814585
16926 1814585 2253753 2351783 2053155 2503784 2190846 2043770 2596937 2006536 2107363 2529508
16916B529508k9894k73896M15795k49754K40433j63696k4539j55394M50066M0065
16906B778694j65083K9286L2531r8402J50081k5134J96591o7598K32424j46783
16896B916607R6172j89879L42256j41896K21415k10007J05732J3637L00085j8556
16886C435566r0203J62366k69766J09029K20488o1705k8753K05606k05964J85811
16876C662475O180j10859O29483k85782K52153k80327K46225j37769j41609R0552
16866C930722L83668P7534J0944P3092O2107P8818j5504r9816K01514p3746K05251
16855D834584k92138P76590k67430j53761J23916L677J92174J80493n856R7566
16845E489815j18606Q7103M27392j62449L23513j42165M46015K68588k78922l413
$$ plain form
16916 2529508 2499614 2225718 2641513 2391759 2632192 2468496 2443957 2288563 2738629 2778694
16906 2778694 2613611 2642897 2675428 2577026 2727107 2701973 2898564 2830966 3063390 2916607
16896 2916607 3012779 2822900 3165156 3023260 3244675 3034668 3140400 3154037 3454122 3435566
16886 3435566 3345363 3507729 3237963 3346992 3567480 3505775 3477022 3682628 3476664 3662475
16876 3662475 3668655 3557796 4187279 3901497 4153650 3873323 4119548 3981779 3840170 3930722
16866 3930722 4314390 4391924 4402868 4475960 4538067 4616885 4601381 4501565 4703079 4629333 4834584
16855 4834584 4542446 5319036 5051606 4897845 5021761 5025438 5217612 5398105 5392249 5489815
16845 5489815 5371209 5458312 5885704 5723255 6046768 5904603 6350618 6619206 6340284 6336871
16835F336871J7865L50544j9565O7025L47399J92344k03762K70149J36027J99374
16825G694271K18253J7068J0405J30195K57811J12906K19634k18449M14647L23864
16815I180605M00147Q1953q5299K06143K55897N3328N97076J2685J2990L14969
16805A1030494J17890P9713N97125N6371P11827r9394N46286p3204L36449K09108
16795A3512665M32269P7004L7674R00375M3162O87645J90186M90346M03111j02785
16785A6671652R18019J80223L76710J027368k32446R16559M72845N61558L34372
16776B1226860N13015Q98460M83568L50431J220937K89817R86289O24026Q62212
16767B7455615N37196J137606J126343L93824P47150J401439O29335J106906J372200
$$ plain form
16835 6336871 6354736 6705280 6685715 6752740 7100139 7292483 7088721 7358870 7494897 7694271
16825 7694271 7912524 7929592 7939997 8070192 8328003 8440909 8660543 8442094 8856741 9180605
16815 9180605 9580752 9662705 9577406 9783549 10039446 10092774 10689850 10702535 10715525 11030494
16805 11030494 11148384 11228097 11825222 11881593 12593420 12494026 13040312 12967108 13303557 13512665
16795 13512665 13944934 14021938 14059612 14959987 15003149 15690794 15880980 16371326 16774437 16671652
16785 16671652 17589671 17769894 18146604 19173972 18941526 19858085 20330930 20892488 21226860
16776 21226860 21739875 22638335 23121903 23472334 24693271 24983088 25969377 26593403 27455615
16767 27455615 27992811 29130417 30256760 30650584 31397734 32799173 33428508 34535414 35907614
16758C5907614J095134R84850J321908J297576J301619J717887J415794J354071
16750D6396453J626882J654568J365275K044848J671745K044682J959036J579893
16742F0343382K220209K296381K169820K183744K123565K354166K530989J924873
16734G8147129K855803K232544K244813K729102K253746K016665K275547K227660
16726I6983009J661058J834082J487877J706828J154561Q37577Q75833M58162
16718A06998987O7947O7057l28562l46481j118562q40113j203985j245428j851625
16709A00199235j738150j643408k410108k390558k324082k198678k425425k113142
16701H2955684k830208k423021k467437k635592k381462j898117k573587k293811
$$ plain form
16758 35907614 37002748 37987598 39309506 40607082 41908701 43626588 45042382 46396453
16750 46396453 48023335 49677903 51043178 53088026 54759771 56804453 58763489 60343382
16742 60343382 62563591 64859972 67029792 69213536 71337101 73691267 76222256 78147129
16734 78147129 81002932 83235476 85480289 88209391 90463137 92479802 94755349 96983009
16726 96983009 98644067 100478149 101966026 103672854 104827415 105664992 106540825 106998987
16718 106998987 107066934 107133991 106805429 106458948 105340386 104500273 103296288 102050860 100199235
16709 100199235 98461085 96817677 94407569 92017011 89692929 87494251 85068826 82955684
16701 82955684 80125476 77702455 75235018 72599426 70217964 68319847 65746260 63452449
16693F3452449k391314k189776j979490j833223k312275j917050j560525k017288
16685D7251508j528349j427878j673093j392049j444359j420771j447559j182685
16677C5734765j451537j157896p43548j515745q16361p94383j021462p61021q77859
16668B6594953q79019j120384m29576j194137j45864p57896p38020m99596q49494
16659A9980967m83980q03387k32644l77589p58466l28754m43218k36539m60650
16650A5855740p42098k15739r8710o01521l99986k79779n11359j40004m09540
16641A2457004k09497n52299L25187m43270o61412l5082o8503m08951j56976j75420
16631A0070781j18974k49134l22892j99702j41096l66498O6526k25429m02119
$$ plain form
16693 63452449 61061135 58871359 56891869 55058646 52746371 50829321 49268796 47251508
16685 47251508 45723159 44295281 42622188 41230139 39785780 38365009 36917450 35734765
16677 35734765 34283228 33125332 32381784 30866039 30049678 29255295 28233833 27472812 26594953
16668 26594953 25715934 24595550 24165974 22971837 22825973 22068077 21330057 20830461 19980967
16659 19980967 19496987 18693600 18460956 18083367 17324901 16996147 16552929 16316390 15855740
16650 15855740 15113642 14897903 14799193 14197672 13797686 13517907 13006548 12866544 12457004
16641 12457004 12247507 11695208 12020395 11577125 10915713 10880631 10812128 10403177 10246201 10070781
16631 10070781 9951807 9702673 9379781 9180079 9038983 8672485 8739011 8513582 8111463
16622H111463K5956k32325q3902N0839j55864p4168l95551J61086m45922q113
16612F953499k23413k25041L8885K41541n11640k41068K67321k30146k5718j54009
16602E890211k5946m12289K24343l20524j7233j89182j25936j07252j84225L19455
16592E051422j86074m5011j93747l3105j58123J03491j28871k78584L22170j26131
16582D327437k79936j72303j29226J60792P4834l26496J62139K26247m12042j51120
16572C480326j05422R4389k23070M10872n98506L95150j93938n4493o7577j46665
16562B991066J12408j60693K77120k99474M15775k99102p4631J58281k34485J05113
16552B991378k13971J361k03558N5557J61420k49691M9947J33003k47698q9442
$$ plain form
16622 8111463 8137419 7905094 7821192 7872031 7716167 7641999 7246448 7407534 6961612 6953499
16612 6953499 6730086 6505045 6543930 6785471 6273831 6032763 6300084 6069938 6044220 5890211
16602 5890211 5864265 5451976 5676319 5355795 5338562 5149380 5023444 4916192 4731967 5051422
16592 5051422 4865348 4820337 4626590 4593485 4435362 4538853 4409982 4131398 4453568 4327437
16582 4327437 4047501 3875198 3745972 3906764 3981598 3655102 3817241 4043488 3631446 3480326
16572 3480326 3374904 3469293 3246223 3657095 3058589 3453739 3259801 3205308 3137731 2991066
16562 2991066 3103474 2942781 3219901 2920427 3336202 3037100 2962469 3120750 2886265 2991378
16552 2991378 2777407 2778768 2575210 2630767 2792187 2542496 2592443 2725446 2477748 2388306
16542B388306O64332p17536l1778J5354j81579L14191j44494J10035m60328J84142
16532B140645k88126J33891M98912j97064l40316j54076J72076J44808k55701
16523A855049K26514j64827M1057r1180J55677l54035J79558r2156K01687j67220
16513A790124K34283P8152k73984j38671J45138K597o1792j67000J29644j5164
16503A723327k09752K31512k38677L73145k62083k67238J85603k04567M27829
16494A759099n82649M16012j27698k10004j116J95096r3590k7264K2329j68425
16484A181790J04355k73345M08273o1685j28179j42239L30297k68573N37183j40452
16474A547425p14963M27058j59795J77999Q5349j80689L1178l09730L67098l6606
$$ plain form
16542 2388306 3052638 2335102 2303324 2318678 2137099 2451290 2306796 2416831 1956503 2140645
16532 2140645 1852519 1986410 2485322 2288258 1947942 1793866 1965942 2110750 1855049
16523 1855049 2081563 1916736 1957793 1866613 2022290 1668255 1847813 1755657 1957344 1790124
16513 1790124 2024407 2102559 1828575 1689904 1835042 1837639 1775847 1608847 1738491 1723327
16503 1723327 1513575 1745087 1506410 1879555 1617472 1350234 1535837 1331270 1759099
16494 1759099 1176450 1592462 1464764 1254760 1253644 1448740 1355150 1327886 1350215 1181790
16484 1181790 1286145 1012800 1421073 1359388 1231209 1088970 1419267 1150694 1687877 1547425
16474 1547425 832462 1259520 1099725 1277724 1363073 1182384 1213562 903832 1270930 1234324
16464A234324j21668j19414p4854j9452J31675Q3738k6134r8072J07282k25428
16454H71997J81576Q1218m6621p8222k11416l0881K86845o6205j5586j08408j5786
16443H48511O9452J43798k97451m2087n2925M60374m74253M53999n2228J596n25222
16432E33564L02169j11402J25148J73156m49965L47213R8365J40677m41267J98642
16422I16300k21358n7588L10583k90503k22888M24691j20157j28514J02326m4226
16412F68666P7138j97383O8763J24729k80421J13408P6656p1913J26028N13834
16402A219505n86560k54282M25703m5058B99294M31561j72541L85079R6824m06701
16392F33516k71177L97600l50690M01702r7282J1692k66147L36315l54088K79403
$$ plain form
16464 1234324 1112656 993242 918388 898936 1030611 1114349 1088215 990143 1097425 871997
16454 871997 1053573 1134791 1088170 1009948 798532 767651 1054496 988291 972705 864297 848511
16443 848511 917963 1061761 764310 722223 669298 1129672 655419 1109418 1057190 1058786 533564
16432 533564 835733 724331 849479 1022635 572670 919883 1018248 1158925 717658 916300
16422 916300 694942 637354 947937 657434 434546 859237 739080 610566 712892 668666
16412 668666 745804 548421 617184 741913 461492 574900 651556 579643 705671 1219505
16402 1219505 632945 378663 804366 759308 299294 730855 558314 943393 1040217 633516
16392 633516 362339 759939 409249 810951 713669 725361 459214 795529 441441 720844
16382G20844j14554J23887j15086J6947J50669k45244K45384C80532J78508Q0908
16372F39948R2629k58543M6842l6371J68108j55845k12441L25498k71826J41556
16362D79555J92265r121k75325M84643C48699P8396K29659k97801J15037j0240
16352D63750O6517p3600A84774Q3107Q9817A69740K98054J62006j0568B84269
16341C29285l2715M09859B24791M10077m4849J21200o8553p4387J05453G3089
16330B88821P270L53333D2103L25132O3187j23810L72733B36928J50294j59161
16320B28061O4043J63175l0374Q9646L8275j81182P9570j4177A89816J75638N9871
16309D25325m1549l3248m3801j02604K87304B36943J9149K85668j72913k180R1315
$$ plain form
16382 720844 606290 730177 615091 632038 782707 537463 782847 380532 559040 639948
16372 639948 732577 474034 520876 484505 652613 496768 284327 609825 337999 479555
16362 479555 671820 662699 387374 872017 348699 427095 656754 358953 473990 463750
16352 463750 530267 456667 184774 267881 357698 169740 467794 629800 619232 284269
16341 329285 296570 706429 224791 634868 590019 711219 642666 568279 673732 73089
16330 288821 296091 649424 42103 367235 430422 306612 679345 236928 387222 228061
16320 228061 292104 455279 424905 514551 552826 371644 451214 437037 189816 365454 425325
16309 425325 383776 350528 306727 204123 491427 236943 256092 541760 368847 366667 457982
16298D57982J290j06655H8252L01880j75759M58095j39655a8285C61881j748k9416
16287C30717Q8520A02437J29721K86858j89968K58996A67635K26151A90880K46673
16277D37553A90874e2441D11879J41162r6622j74860q8678M55629B69479a5689
16266C32522H6345L23329h5341C58852A63801o5129K3594L5861L86812p0188k09790
16255B64961k3536J70922j61658K1491J63382A63862L86655I8099K50598l1226
16245C17471B22J71585L39860I3278K4441J01114H9516J47036j3221o0682J45548
16234C08197b3169A62914j4249L68322D8021k3852O9021K98178p8442K76362k90726
16223B98562e0093F7908K19278O5151P7904d5263C4451K87639m632H6861N80840
$$ plain form
16298 457982 459272 352617 88252 390132 214373 672468 532813 -18285 361881 360133 330717
16287 330717 419237 102437 232158 519016 329048 588044 167635 393786 190880 437553
16277 437553 190874 -52441 411879 553041 456419 281559 192881 648510 269479 -15689
16266 332522 86345 409674 -85341 358852 163801 98672 122266 158127 544939 474751 264961
16255 264961 241425 412347 250689 272180 435562 163862 550517 98099 348697 317471
16245 317471 222 171807 511667 93278 117719 218833 89516 236552 223331 162649 308197
16234 308197 -23169 162914 148665 516987 48021 24169 93190 391368 312926 589288 298562
16223 298562 -50093 67908 287186 352337 430241 -45263 34451 322090 317458 86861 667701
16212F67701B63648E744J03570J49183J30337A04600N0068J01481C6136K90438
16202C26574A47253R322C2027Q8506R8351J2431b3470k5705A01834m2110J83955
16191B43679m2194b00964D57048j46509k9860n2668K09504a43930a8401l7919
16181e6320A12229r696J5514J68428B3945K77207c25632F6592P7280M10165g9325
16169A32915L18728j3792C4879J93773P7658E5296M0266J11730d6137H9413K17971
16158C07384k3745m2894h307D0745K9812K33617a66530C05981C2223N486N2898
16147I0607L92140a00226b6796A59358c5056B27076k4710g2435A59033k7233E1186
16135g808r1482H2549C7182a85109f574B30516H537N0563J83566c8866F4821P5700
$$ plain form
16212 667701 263648 5744 109314 258497 388834 104600 154668 256149 36136 326574
16202 326574 147253 156575 32027 120533 218884 231315 -23470 -49175 101834 59724 243679
16191 243679 201485 -200964 457048 310539 280679 228011 437515 -143930 -18401 -56320
16181 -56320 112229 102533 118047 286475 23945 301152 -325632 66592 143872 554037 -79325
16169 132915 451643 437851 34879 228652 306310 55296 95562 207292 -46137 89413 307384
16158 307384 283639 240745 -8307 40745 70557 304174 -166530 305981 32223 37709 90607
16147 90607 482747 -100226 -26796 159358 -35056 227076 202366 -72435 159033 131800 51186
16135 -7808 -99290 82549 37182 -185109 -6574 230516 8537 59100 242666 -38866 64821 140521
16123A40521J6322M0328d25701D4027K08649F437Q362i3617A57471l2940Q7156
16112B11687G0477e6064m6829K3148C12974d6699A15289h9587G3628K10638a46223
16100h5961c9405A13854e0256C22136n2711C4822c6395H1305l361q28K07140P5931
16088C60187c15j30238A61308F658d08096i1531o1545A58031m5242k7528K835
16077H8096K9446J36430c2435C09674D6373e2410r5499B89689j06310F4194g5837
16065A70782L8369b7372k74692k0971A78562b54711A45967a23371A70798k2749
16055A48049a72116J7524d8321A71323N9143a24827k64029D6004a68148I5975
16044b89905a8828A95234e3459F7066k3249b75622a28703e0599A7935b03493k0557
$$ plain form
16123 140521 156843 197171 -425701 44027 252676 6437 14799 -93617 157471 124531 211687
16112 211687 70477 -56064 -102893 -79745 312974 -46699 115289 -89587 73628 284266 -146223
16100 -85961 -39405 113854 -50256 322136 269425 34822 -36395 81305 77944 77116 284256 360187
16088 360187 -315 -130553 161308 6658 -408096 -91531 -153076 158031 112789 85261 88096
16077 88096 117542 253972 -32435 309674 46373 -52410 -147909 289689 183379 64194 -75837
16065 170782 209151 -27372 -302064 -323035 178562 -254711 145967 -123371 170798 148049
16055 148049 -172116 -154592 -48321 171323 230466 -124827 -388856 46004 -168148 95975
16044 -289905 -18828 195234 -53459 67066 43817 -275622 -128703 -50599 17935 -203493 -224050
16033b24050A2360L95050A80355a62504C08580A25696O349f9144B115J03855a36917
16021B53851E9976a11276A26099b1531a766I8535j1327I491J02808h2294n325
16010h7619B13255j05765L8180B6361L20841H4303l0367a59921c0628o72o2429
15999i3729n9924B82554a5299B12733c4107B07652m5472b31727i9534B09859F4927
15987C0846P4919Q8788c43551g167p2131B89054a91409C35555F7128M68143j25600
15976D09671L491j6286L6436Q0548r1749j65923q1424a4583I6955p377a6168j01265
15964a17433B31450a92996e1801l72624C4725P4745d09913d4097B6736M121d0703
15952I3409O9546L425A288a15137k58678C3218h8507B7485J90750F0057Q0583
$$ plain form
16033 -224050 12360 407410 180355 -162504 308580 125696 132045 -69144 2115 105970 -136917
16021 253851 59976 -111276 126099 -21531 -1766 98535 87208 9491 112299 -82294 -87619
16010 -87619 213255 107490 145670 26361 347202 84303 53936 -159921 -30628 -31300 -93729
15999 -93729 -153653 282554 -15299 212733 -34107 207652 162180 -231727 -99534 209859 64927
15987 30846 105765 194553 -343551 -7167 -79298 289054 -191409 335555 67128 535271 409671
15976 409671 413162 396876 433312 513860 422111 256188 174764 -14583 96955 89578 -16168 -117433
15964 -117433 231450 -192996 -51801 -424425 34725 109470 -409913 -44097 26736 30857 -40703
15952 93409 162955 166380 1288 -115137 -373815 33218 -88507 27485 218235 60057 140640
15941A40640l0298A7683K93040D4362b72581Q8386Q9316E8955M03533A03682L3252
15930A36934e2293o7225B80750I0436R05K28351A06374L24530F4383J1369d5080
15918a47586b2927A10980K05324E4616B2415O689e1830G4301K25431i031A00154
15906a56872P5173J2089j96348G9460M4509J5571K6069k1626c3500A53606b32252
15894A98716E9191a29186A4215b41428g5265G155b0475k93503b0733k8243I3398
15882f1061G2621b37806B5480c08165e9791k2672A19000a00413j21121C5636a81463
15870d9926j29428B3103J93102n8794D822a12126D5576R2214b7140j07746k2449
15859a57335A58219P7394a24108b5416l02892h9046A25657a69280H10J66049f9388
$$ plain form
15941 140640 110342 17683 310723 44362 -272581 -184195 -94879 58955 462488 103682 136934
15930 136934 -52293 -119518 280750 90436 91341 319692 106374 430904 64383 75752 -45080
15918 -147586 -22927 110980 316304 54616 22415 29104 -51830 74301 299732 -9031 100154
15906 -156872 -81699 -69610 -265958 79460 123969 139540 165609 143983 -33500 153606 -232252
15894 198716 59191 -129186 14215 -241428 -75265 7155 -20475 -313978 -20733 -48976 93398
15882 -61061 72621 -237806 25480 -308165 -59791 -82463 119000 -100413 -221534 35636 -181463
15870 -49926 -179354 23103 216205 157411 4822 -112126 45576 137790 -27140 -134886 -157335
15859 -157335 158219 235613 -124108 -25416 -328308 -89046 125657 -169280 810 166859 -69388
15847E1107c16514J27122P8548F063J25104a47939A97076c26074a06383N959e0108
15835f7710r8223C34539P9712A84376b13917H222N0099J87282a3576C89368A83907
15823B2788b91459F2483K39730h5294F5328M2278R935b38762A3041a93884I1285
15811A12314i233m498r1112F1293a81143D14238a04128k32880E5023b36008i8278
15799B54385G0514a49819k3006o3018E8875J67916F1899K00186i8709D990J43745
15788A48735d4932q3585H8124c0534j85856B11082O1477H3067B7225a46199k07415
15777c53614J76761G9038L03255D2408a29961D0204O4042b404A4937L22874b13119
15765D5211a11384k35427A3537M973a68501j23327d5263A02085g0195k75714a1858
$$ plain form
15847 51107 -316514 -189392 -110844 6063 131167 -147939 197076 -326074 -106383 -100424 -50108
15835 -67710 -165933 334539 414251 184376 -213917 8222 58321 245603 -13576 389368 183907
15823 22788 -291459 62483 302213 -85294 65328 107606 117541 -238762 13041 -193884 91285
15811 112314 -9233 -13731 -104843 61293 -181143 414238 -104128 -337008 55023 -236008 -98278
15799 254385 70514 -149819 -172825 -235843 58875 226791 61899 262085 -98709 4990 148735
15788 148735 -44932 -128517 88124 -30534 -216390 211082 272559 83067 27225 -146199 -353614
15777 -353614 -176853 79038 382293 42408 -129961 40204 104246 -2404 14937 337811 -213119
15765 45211 -111384 -346811 13537 18510 -168501 -291828 -45263 102085 -70195 -345909 -11858
15753a41324A1598e6496r5564A35455b23142a3509j33193M038b3695p9658A21201
15741B20328f3053j44432g0258p2252j94730i5376F5392a25904B02767f8712j6117
15730h4829L0599k8312A45182c99480J72810a6485r9221A09554c17517B8266K32090
15719B60356b2441B55200i5595A38583C7858J69390b2080j23330e81k01611E7332
15707A31397d39628D7691a51493r3258l75939A81144J51713H7495C3938a54457
15696G8886l948a4672j0141j20183A94576b6214A4380F582f8573A01505h026m73847
15684d81873a15182r211H7822Q4490b81729J02010H7075f2315j85883b2373p7229
15673i9602F3132N7022b63952d5470j24020A0482c47753g9568r7910k3612g0136
$$ plain form
15753 -141324 11598 -56496 -152060 135455 -223142 -13509 -146702 -142664 -23695 -103353 121201
15741 220328 -63053 -207485 -70258 -142510 -337240 -95376 65392 -125904 202767 -68712 -84829
15730 -84829 -54230 -82542 145182 -399480 -226670 -16485 -115706 109554 -317517 28266 260356
15719 260356 -22441 255200 -95595 138583 37858 207248 -22080 -145410 -581 -202192 57332
15707 131397 -439628 47691 -151493 -244751 -620690 181144 332857 87495 33938 -154457
15696 78886 74938 -14672 -24813 -144996 194576 -26214 14380 6582 -68573 101505 -8026 -481873
15684 -481873 -115182 -124393 87822 172312 -281729 -179719 87075 -62315 -248198 -22373 -99602
15673 -99602 63132 120154 -263952 -45470 -169490 10482 -347753 -79568 -177478 -201090 -70136
15661b74920B31313b52333G1074a21557B2132d2441A50214d9333K3516j93862
15651b19679f4985j31130g8611B08177a54158J5912m7581N3051C6539Q1422R4372
15640B12333q9092b331o1253j62274L9255o8127D6326b36265j63310a84042j90191
15629c74233Q5083a04744a3782I1765e5160j05743E9214L25581H9672J9001k0277
15618H8396l2733a6126F2369g3175j55142B36611C1874c72508g2455J2391A50399
15606A46272L9529b06010B55822D5617N1212b78893l1209h5413A52066n4086K43589
15595C41569B1179e09786A47218k1050P204N7967l719F0633J6273h5314K6150
15584e9164A13699K417N6589o1500m7475a65747M0631A6054a69315D3230i2189
$$ plain form
15661 -274920 231313 -252333 71074 -121557 22132 -42441 150214 -49333 -25817 -219679
15651 -219679 -64985 -196115 -78611 208177 -154158 -138246 -185827 -132776 36539 117961 212333
15640 212333 123241 -2331 -63584 -225858 -186603 -254730 46326 -236265 -399575 -184042 -374233
15629 -374233 -289150 -104744 -13782 91765 -55160 -160903 59214 384795 89672 108673 88396
15618 88396 55663 -16126 62369 -73175 -228317 236611 31874 -372508 -72455 -60064 150399
15606 146272 185801 -206010 255822 45617 96829 -278893 -310102 -85413 152066 97980 341569
15595 341569 21179 -509786 147218 126168 133372 191339 187620 60633 76906 -85314 -59164
15584 -59164 113699 116116 172705 111205 63730 -165747 -125116 16054 -169315 43230 -92189
15572H2071M8093J36635C0400K58744A15785h9620F4134b4793B63708b595B57170
15560A728b28664b8A56773J15678b57232i6970b6241A40208d03891i8910p7546
15549a76456M7557C8297K18717j01572L4618R9859K22575B6368g8377C57519j62905
15538A94614K52745A12536j2759K10857q922c99952B48496A14652D8574J64536
15528B13110e6555l3210A10068a87945A39938P1038C6069M51572b66746R0257
15518a76489B45830J68004i4677f863B34414f0619n0978E1475N8928L78642g05331
15506b21662A76156I044a47549B71929H6076a98646B1810a63081B29749i116j20081
15495a29197R746P966k1057d6018F4643J33482b29863n2699A79754b23711C96707
$$ plain form
15572 82071 130164 266799 30400 289144 115785 -89620 64134 -24793 263708 -2595 257170
15560 1728 -228664 -28 156773 272451 -257232 -96970 -26241 140208 -403891 -98910 -176456
15549 -176456 -128899 38297 257014 155442 190060 289919 512494 26368 -78377 357519 194614
15538 194614 447359 112536 99777 310634 301712 -399952 248496 114652 48574 213110
15528 213110 -56555 -89765 110068 -187945 139938 210976 36069 487641 -266746 -176489
15518 -176489 245830 413834 -94677 -6863 234414 -60619 -111597 51475 110403 489045 -705331
15506 -221662 176156 9044 -147549 271929 86076 -198646 21810 -163081 229749 -9116 -129197
15495 -129197 -119451 -111485 -132542 -46018 64643 198125 -229863 -282562 179754 -223711 396707
15483d5665A53093F9763O2977l3154b6296B03744g6193A69966j2536M60491k45033
15472C72888G2555J81846n1252E1611J05830h3188B24043G3590L1869b58779B51004
15460a19075k18813p4403K05140i9990K1672C94162I3398m1466J85165g308j65759
15449a73067C84807c06242C3610i5083A22819C8790R3042F0431P4758J56334K29699
15438E21222J68462b18554A76259J73965d3646C59535c6366B82227g7169E5521
15427C16110E8899b41937D07922b5638A35119J850c68702A83738D4178a41504
15416a23008A3557b35555D6629g4112H6466B2083g652r3298l31489a0444I341
15404a69624A47813N1843O7202m7737B767K99959I659d36747a88808L239O0547
$$ plain form
15483 -45665 153093 69763 132740 99586 -26296 203744 -76193 169966 157430 617921 372888
15472 372888 72555 254401 203149 51611 157441 -83188 224043 73590 105459 -258779 251004
15460 -119075 -337888 -412291 -207151 -99990 -78318 394162 93398 51932 237097 -7308 -173067
15449 -173067 384807 -306242 33610 -95083 122819 38790 131832 60431 135189 291523 521222
15438 521222 689684 -218554 176259 350224 -43646 359535 -36366 282227 -77169 55521
15427 316110 58899 -241937 407922 -25638 135119 136969 -368702 183738 44178 -141504
15416 -123008 13557 -235555 46629 -74112 86466 22083 -7652 -100950 -432439 -10444 9341
15404 -169624 147813 199656 266858 219121 2767 302726 9659 -436747 -188808 -185569 -125022
15393a25022j00573D30234j73909a57228e8697A237a53329A92801K09212A09496
15382g6995I8078j0128j8514J75265H3200K22636a4208I7042l6847a85833j51989
15371c37822H8504M3118O6931H7160a3610G627P6233J9161J10703j02422A0451
15359B5253J47023J31500g7936C00460a94319A44592i8589C9409J38590J59805
15349C37804I4873l0131J10372a65552A83737i3439B26656q0055a06167C7709
15338b52809I16P0045A0192J4289g6153C5808K05547K7413a56643A33620b62567
15326F2212e05857A40610J20230h5879m0947A80363H980d4933A09538r638L91489
15315D91389A24239L90369A55604a22415B80100A32761l0663K46293C6690a01698
$$ plain form
15393 -125022 -225595 430234 256325 -157228 -58697 1237 -153329 192801 402013 109496
15382 -76995 98078 87950 69436 244701 83200 305836 -14208 97042 60195 -185833 -337822
15371 -337822 88504 131622 198553 87160 -13610 7627 83860 103021 213724 111302 10451
15359 25253 172276 303776 -77936 300460 -194319 144592 -98589 39409 177999 337804
15349 337804 94873 64742 175114 -165552 183737 -93439 226656 146601 -106167 37709
15338 -252809 916 70961 10192 24481 -76153 35808 241355 268768 -156643 133620 -262567
15326 62212 -505857 140610 260840 -85879 -126826 180363 8980 -44933 109538 99900 491389
15315 491389 124239 514608 155604 -122415 280100 132761 102098 348391 36690 -101698
15304d8671K3548A76917m5538i8923A86155e0716D27K01529K03649a22432d9565
15292A14163k358J0471p631c75132G3537K37941j14120k8703i8947B18140a60833
15280A03725b44919G0975R361J5522J36037p120i8679m1988B26424J88959C2465
15268A48261o7937j1843b8576B99369m7964i1572c325o7459n4126j56307a31222
15256E15074g1254j34455P2740a8973B12693h077A30416h2415q1732p135F0327
15244B05326k452G2806B3805e0381A89130J81272F552J40943J91089n263K41942
15233E75263N6095O58311M60403M59347J60123j71344n46175m61836l49457k70942
15223E69788R0349n9907A58483J33701p0303A04708M4229O977m5320K3482h2207
$$ plain form
15304 -48671 -25123 176917 131379 -98923 186155 -50716 427 201956 405605 -122432 -49565
15292 114163 111805 122276 114645 -375132 73537 311478 197358 168655 -98947 218140 -160833
15280 103725 -244919 70975 80336 95858 231895 224775 -98679 -140667 226424 415383 32465
15268 148261 80324 68481 -28576 299369 251405 -91572 -3325 -70784 -124910 -281217 -131222
15256 515074 -71254 -205709 -132969 -18973 212693 -8077 130416 -82415 -164147 -171282 60327
15244 205326 202874 72806 23805 -50381 189130 370402 6552 147495 338584 333321 575263
15233 575263 631358 1289669 1750072 2209419 2369542 2198198 1652023 1190187 840730 569788
15223 569788 660137 600230 158483 292184 221881 104708 148937 155914 110594 134076 -82207
15211A46029b5312J0180j57407r4899A20146A7932b79064d9431j8204n1851q8010
15200b07496b6917j45881O2668H7983J19285a27676C84029e4526i064E9656P7671
15189A37327b27980D9487K55718A44995m7839A4654K330J17318b22207O2746M440
15178a55021E9849g0432B2913Q3662f0193l8479B4312m456J86431L99747A15507
15166A22491J37707a0611C58016A66895j6294F6800b26496B19021J6306f3863
15155g474p1261C24395a83552A56415k5959k3675m4016q793K08545H9505a06502
15143A07123c6978l25080A24610K00250a926B16866n6970d1056j40774B50776
15132b3413k448E00738A30291E2736a08008B46277a5051m043A52204P8104L40642
$$ plain form
15211 146029 -25312 -15132 -172539 -267438 120146 17932 -279064 -49431 -67635 -119486 -207496
15200 -207496 -26917 -172798 -110130 87983 207268 -127676 384029 -54526 -9064 59656 137327
15189 137327 -227980 49487 305205 144995 97156 14654 16984 134302 -222207 -159461 -155021
15178 -155021 59849 -70432 22913 106575 -60193 -98672 24312 19856 206287 606034 115507
15166 122491 260198 -10611 358016 166895 150601 66800 -226496 219021 235327 -63863
15155 -7474 -78735 324395 -183552 156415 130456 106781 62765 53972 262517 89505 -106502
15143 107123 -36978 -362058 124610 324860 -1926 216866 159896 -41056 -181830 250776
15132 -23413 -25861 500738 130291 52736 -108008 246277 -15051 -19094 152204 230308 570950
15121E70950A72801J4480J32069j36602H6530J36110J33309A62830J25474r6266
15111A92038q878N4063N7173J82001P0703K57348p223A57963J36678M5244q7828
15100B52057Q7805A23231n4583L83466A06670E0765d5472F9080g22q1747E7647
15088A60178o3626c51923D0015i7116e589C92304r0813j29780R3964K6878J5844
15077C08397r3124n523M0837Q5411j27788a18383C4812c26C7167a70058A35876
15065c261B72249M8237A871L07018j12402a26507B97624C5114J60794H5193N6941
15054A42134J9725l2796K7592m8305c9217A35658L08867K33922A88009A7541a64395
15042a702D99861P9487E4580L50569M1583A05499b2663E14478J4137k16107E5256
$$ plain form
15121 570950 172801 187281 319350 182748 86530 222640 355949 162830 288304 192038
15111 192038 183160 237223 294396 476397 547100 804448 797225 157963 294641 339885 252057
15100 252057 339862 123231 68648 452114 106670 50765 -45472 69080 -722 -82469 57647
15088 160178 96552 -351923 40015 -97116 -5589 392304 301491 171711 265675 292553 308397
15077 308397 215273 209750 250587 335998 208210 -118383 34812 -326 37167 -170058 135876
15065 -3261 272249 320486 1871 308889 196487 -126507 297624 35114 195908 85193 142134
15054 142134 161859 129063 156655 108350 -39217 135658 444525 678447 188009 17541 -164395
15042 -1702 499861 579348 54580 405149 446732 105499 -22663 514478 528615 312508 55256
15030E08736o6583j32153j50480p4336K94104A49279N2241E5006P5639J9537K14757
15019C64939E9988M89991A95829L81674r8758j79580A26889M13285j15563R598
15009D34209q6183C3788L09596J14338n1251K1070j91908p0264K66980j92055
14999B40294J14512E4747K25897K12600A7624M69747j16010A44004C916L2170
14989C6086b1626A21123J81202j5778P0911J53695o9184j42470O6575J38774A70455
14977E85217E0485K68682K37887J99227l63404J56480B37028C9646M40095A38139
14966C83486B9688Q70575B95354j1493J82817A84494j4859J97277A41407J06333
14956B47740j5173I5360D6132L38408p4680K9182A46200k9814J81230G9573l6397
$$ plain form
15030 508736 442153 310000 159520 85184 379288 149279 201520 55006 130645 150182 364939
15019 364939 59988 549979 195829 577503 478745 299165 126889 540174 424611 434209
15009 434209 348026 33788 343384 457722 406471 427541 235633 165369 432349 240294
14999 240294 354806 54747 280644 493244 17624 487371 371361 144004 3916 36086
14989 36086 -21626 121123 302325 286547 357458 511153 441969 299499 366074 504848 170455
14977 585217 50485 319167 557054 756281 392877 549357 237028 39646 479741 138139
14966 383486 29688 900263 295354 283861 466678 184494 169635 366912 141407 247740
14956 247740 232567 95360 46132 384540 309860 339042 146200 116386 297616 79573 43176
14945D3176L41257A36021Q9292H2181L64950A47235K34236O823j19285J87762
14935D56771j25036r6789L71540k87860J62425J52526j70865j13346K88097q5655
14925E51808K88151j91101l7000K87712C68745L29651O5333J54062p3396k57325
14915E87070P15531F03987J99231k16142J25341B68726M01439j47679B30812K71451
14905E02263k35259J92679k10989K71769j72114A34647M28758k15019K89679l3499
14895F04566B14115G2054K70580q2330j26302L58840B45225Q9558J95278j00351
14885D29710M981K99250r758k7092L5048K27224l43719A75129K50350N8395j25517
14874C58357K26127k06018n7364Q9908N98276D35870A70434N53219j02109B18469
$$ plain form
14945 43176 384433 136021 225313 82181 447131 147235 381471 388294 269009 456771
14935 456771 331735 234946 606486 318626 481051 633577 462712 349366 637463 551808
14925 551808 839959 648858 611858 899570 368745 698396 763729 917791 844395 587070
14915 587070 1302601 603987 803218 587076 712417 268726 670165 522486 230812 502263
14905 502263 267004 459683 248694 520463 348349 134647 563405 348386 638065 604566
14895 604566 214115 72054 342634 260304 134002 492842 245225 334783 530061 429710
14885 429710 434691 733941 724183 697091 732139 959363 615644 175129 425479 483874 358357
14874 358357 584484 378466 321102 411010 1009286 435870 170434 723653 621544 218469
14863F35257j27437N6508j36383q1099Q206P3286j74843o0108M21650M0131B00522
14851G74327C24514K27213j33072n5021M4345J17962o0987r0611o8920K51860
14841E57283L66019k14702K10485j10001M8408k92602K01852M8017Q7806l80633
14831E21932j73624O0422L05017O3166k06137p6911L00712l23939A07337K62113
14821C69450M61881k89947k2069q5096K42361j97139q0207K64436l12855J64319
14811E15134j15518L34387k33611q7883r9536L64373l8376J29124J67301k05873
14801G29522l60251K27005p4192K04109j02637K03640p8366C09881N87588j1635
14791H85834l54306p2762J91494k17867N5092N8964J7027L82922C79936O2944
$$ plain form
14863 635257 507820 564328 427945 346846 355052 428338 253495 193387 615037 655168 200522
14851 774327 324514 551727 418655 363634 407979 525941 464954 374343 305423 557283
14841 557283 923302 708600 919085 809084 857492 564890 766742 814759 902565 521932
14831 521932 348308 408730 713747 776913 570776 493865 794577 470638 107337 369450
14821 369450 831331 541384 519315 434219 676580 479441 399234 663670 350815 515134
14811 515134 399616 734003 500392 412509 312973 677346 638970 768094 935395 729522
14801 729522 369271 596276 522084 726193 623556 827196 748830 309881 897469 885834
14791 885834 531528 458766 650260 432393 487485 546449 563476 946398 379936 442880
14781D42880j10524N12389j61757j02194J04111J72172l70768L21061C96910J33364
14771E30274N3604L0214L7884k55528M99682D46066P7235B46387L26776O4801
14761F37964R6082C56917J07L96602r8499j03751O0052k33631M45386k44641k16750
14750C61792Q8494K53893j95060j19505K82136K38120q1770J55145C56516N39257
14740H95773D42012M16609j41969j92626J82653r2926J55595k23776M21332k77587
14730F89317j03712K60081J89997j080K6849j42159Q2185k66825M33021m16219
14720G51455J4620J00038k463J26682l35422L1806q781L60836l12973k1158L33372
14709A038012l28966L4202K58364k11286k4531K03920r1687k601n1684N81139
$$ plain form
14781 442880 332356 844745 682988 580794 684905 857077 486309 807370 396910 530274
14771 530274 583878 614092 651976 396448 896130 446066 523301 246387 573163 637964
14761 637964 734046 356917 357024 753626 655127 551376 611428 377797 823183 578542 361792
14750 361792 450286 704179 509119 389614 671750 909870 828100 983245 356516 895773
14740 895773 442012 858621 716652 524026 706679 613753 769348 545572 966904 689317
14730 689317 585605 845686 1035683 1034603 1061452 919293 1001478 734653 1167674 751455
14720 751455 766075 866113 863650 990332 654910 686716 677935 1038771 725798 704640 1038012
14709 1038012 709046 743248 1001612 790326 765795 969715 878028 875427 823743 1404882
14699A404882q5414j33900k02010r7549p8553R7612k84717L79436J78843n08635
14689F69995O3212j04785K57538K46292j81475j65608r2719L63835P4354j32850
14679I97789O767Q9981j76365P2028N6381m58365j5806M98131m40202N43144k29592
14668I43891l42539J83788K60126O2435m2838j18815Q2078M10090m59887K65237
14658A243566j72165p7150J14922N8100j91221K02289j49656O4569J59331j51201
14648A101384j04644m8897K41713r2387r4641n4348K39778J06309l46868J75321
14638A122720L63521n1176m90474J68803l8400N51456n63119k2197J33116Q8576
14628A262826o1580L04249k03895p0610L1510J12558n6774J97838J0970j87411
$$ plain form
14699 1404882 1319468 1185568 983558 886009 807456 905068 620351 999787 1178630 669995
14689 669995 733207 628422 885960 1132252 950777 785169 692450 1056285 1130639 997789
14679 997789 1004556 1094537 918172 990200 1046581 588216 572410 1070541 630339 1173483 943891
14668 943891 601352 785140 1045266 1107701 1064863 946048 1028126 1438216 978329 1243566
14658 1243566 1071401 994251 1109173 1167273 976052 1178341 1028685 1093254 1252585 1101384
14648 1101384 996740 947843 1189556 1097169 1002528 948180 1187958 1294267 947399 1122720
14638 1122720 1486241 1435065 944591 1113394 1074994 1626450 1063331 1041134 1174250 1262826
14628 1262826 1201246 1505495 1301600 1230990 1262500 1375058 1318284 1516122 1527092 1339681
14618A339681L12280o6331P4974n39424r1977O26993l17675p295J56089L244J30720
14607A621279j57794J06280l00825L78289k11120k4155N5653j12879N19042j36543
14597A737227j75954K01448j43807M3704j4037K55250k53793J22080k7113j83711
14587A561294N64842k49203r9784J2252j30963J34717L54417j72467k28019J79758
14577A926844J0901k75558O41460n4681k6367k8011R6091O8245J71949l82010
14567B148863M44812o3516l54820Q9904K25306K02955l09164O54806l67292Q8835
14557B760689J4993L66721K1834M08200o4861L85860Q30874R60077J791298L270289
14547A0745974O700133Q076627k153444o286939o967292k869020l88684O6064
$$ plain form
14618 1339681 1651961 1585630 1660604 1121180 1029203 1656196 1338521 1331226 1487315 1490559 1621279
14607 1621279 1463485 1569765 1268940 1647229 1436109 1411954 1467607 1354728 1873770 1737227
14597 1737227 1561273 1762721 1618914 1662618 1648581 1903831 1650038 1772118 1745005 1561294
14587 1561294 2126136 1876933 1777149 1789401 1658438 1793155 2147572 1975105 1747086 1926844
14577 1926844 1937745 1662187 2303647 2248966 2222599 2194588 2290679 2358924 2530873 2148863
14567 2148863 2593675 2530159 2175339 2265243 2490549 2693504 2384340 3039146 2671854 2760689
14557 2760689 2775682 3142403 3164237 3572437 3507576 3893436 4724310 5684387 7475685 10745974
14547 10745974 17446107 25522734 23369290 17082351 10115059 7246039 6857355 6923419
14539F923419o15299j387610o03864p72082q02518k14104R3645j81593J0467J15798
14529B566259J45430R34732J338911M09861l27022j403832m65765k40560K10692
14520C168706P5838j93236j10744l01265K44358k91519O7912l74308L28295K87088
14510B901125m71628J38917J45504j59993P07163k34464r9578J61362j1163K58372
14500C335617n87049L14132M3141L13490j71334J07631K7093K5604N1856r0683
14490C369498O85K55074j07730k19606P11970m88792K55832K22437k23470L85082
14480D160980j99439J84916k05282L31332m53366M78386l8202l1694P1092J96940
14470D495663j01286J23152r0088J26992Q497N5002L6757K21783j04862k30408
$$ plain form
14539 6923419 6308120 4920510 4316646 3544564 2742046 2527942 2621587 2439994 2450461 2566259
14529 2566259 2711689 3646421 4985332 5395193 5068171 3664339 3198574 2958014 3168706
14520 3168706 3244544 3051308 2940564 2639299 2883657 2592138 2660050 2285742 2614037 2901125
14510 2901125 2429497 2568414 2713918 2553925 3261088 3026624 2927046 3088408 3077245 3335617
14500 3335617 2748568 3062700 3105841 3419331 3247997 3355628 3382721 3408325 3460181 3369498
14490 3369498 3370183 3625257 3517527 3297921 4009891 3521099 3776931 3999368 3775898 4160980
14480 4160980 3961541 4146457 3941175 4272507 3819141 4297527 4259325 4227631 4298723 4495663
14470 4495663 4394377 4517529 4427441 4554433 4562930 4617932 4654689 4876472 4771610 4541202
14460D541202K76615K73725k1838J69967O3100L26721k51863P28k11539J54239
14450E321057Q1591K13536j35564m1522L92378j74226K03769j31349N09993J64786
14440F404449Q6652l13005M18446j81370M25263q4764n6585j31186M34579K71922
14430G274401j69226L09632j79989p2201N37221K08842k96676K46773O39686n03000
14420G995463M55699L8859Q9477L51724o9658l8722K66748K06095l70452P08632
14410I633865j35724N02449J105L4448J29044J21211j19893L98649L05150p3075
14400A0797229J67628M08172J08673J66793J02646R554M98760J88132J03409K36665
14390A2787661L28604R7248J08374K65749M32428K08803N83653k2632M04964j7758
$$ plain form
14460 4541202 4817817 5091542 5069704 5239671 5302771 5629492 5377629 5378357 5166818 5321057
14450 5321057 5402648 5616184 5480620 5439098 5831476 5657250 5861019 5729670 6239663 6404449
14440 6404449 6491101 6178096 6596542 6415172 6840435 6755671 6699086 6567900 7002479 7274401
14430 7274401 7105175 7414807 7234818 7162617 7699838 7908680 7612004 7858777 8498463 7995463
14420 7995463 8451162 8490021 8579498 8931222 8861564 8822842 9089590 9295685 8925233 9633865
14410 9633865 9498141 10000590 10001695 10036143 10165187 10286398 10166505 10565154 10870304 10797229
14400 10797229 10964857 11373029 11481702 11648495 11751141 11760695 12259455 12447587 12550996 12787661
14390 12787661 13116265 13213513 13321887 13587636 14020064 14228867 14812520 14789888 15194852 15177094
14380A5177094N32121J63451J94211N13546J39985M81623N5030L65143K51107
14371A7873311M66222M30788N0414N12784N43308N03126k3301R54590m8870K48117
14361B1510489J028714J37279M12375R88413J82285L32659N79425N55539O18161
14352B6345339N16055M84953Q71890O70766P88790O94726P81010P74318M98260
14343C2426107P45298Q95454R29901O86131J094282J083210R61772J138327N56926
14334D0517408J154083J592168J039362J004266K047558P13570J448446J744435
14326E1261296J720906J434426J904521J426752K122933J986145J995483K019795
14318F5872257K101795K416559K305559K853322K200948K692322K750199L484606
$$ plain form
14380 15177094 15709215 15872666 16066877 16580423 16720408 17202031 17257061 17622204 17873311
14371 17873311 18339533 18770321 18820735 19333519 19876827 20379953 20356652 21311242 21262372 21510489
14361 21510489 22539203 22676482 23088857 24077270 24259555 24592214 25171639 25727178 26345339
14352 26345339 26861394 27346347 28218237 28889003 29677793 30372519 31153529 31927847 32426107
14343 32426107 33171405 34066859 34996760 35682891 36777173 37860383 38822155 39960482 40517408
14334 40517408 41671491 43263659 44303021 45307287 47354845 48068415 49516861 51261296
14326 51261296 52982202 54416628 56321149 57747901 59870834 61856979 63852462 65872257
14318 65872257 67974052 70390611 72696170 75549492 77750440 80442762 83192961 86677567
14310H6677567K933431L610389L613221L591070M078952L977653M536131M547668
14302A17566082N239048N108243N799353N679483O203226O577097O711076P413840
14294A66297448P878920Q238072Q510186Q786688R879761J0478427J0676985J1234156
14286B41980643J1942012J2569492J3279357J3551788J4267249J4529912J4808316
14279C36928769J4953402J5254810J4149435J2943842R048414O085800N602126
14272D14966598L405447R14111l5556j6756283o502851n265307j5146924j5255725
14264C60323510o054601p36070J95373j115739m8438l116957j3171769j6369661
14256C19905648j6641245j6191169j5530756j4890619j3776038j3354526j2559859
$$ plain form
14310 86677567 89610998 93221387 96834608 100425678 104504630 108482283 113018414 117566082
14302 117566082 122805130 127913373 133712726 139392209 145595435 152172532 158883608 166297448
14294 166297448 174176368 182414440 190924626 199711314 209591075 220069502 230746487 241980643
14286 241980643 253922655 266492147 279771504 293323292 307590541 322120453 336928769
14279 336928769 351882171 367136981 381286416 394230258 403278672 409364472 414966598
14272 414966598 418372045 419286156 419250600 402494317 395991466 390726159 375579235 360323510
14264 360323510 354268909 353532839 353728212 352612473 352564035 349447078 336275309 319905648
14256 319905648 303264403 287073234 271542478 256651859 242875821 229521295 216961436
14249B16961436j1297189j1098191j0507155r616589q929124q173455q310353
14242A49029380p444616o664040o849179n141115m646765m451647n271483n468791
14234A03091744m845499l989655l294918m174048l297737l456384l183290l222386
14226G3627827k717527k797980k290660k759706k218810k080070k269266j723902
14218E4769906j811932j831965j805200j216404j773749j268833j434696j358295
14210D2268832j303330j288517o51036j087306j124315j382468j007480p82015
14202C3642365q10796p54796r08183j136856l58442j040044o22649n55969q03003
14193B6651627n45635p53685m64478j050885j45432o10205o22346n03401l96364
$$ plain form
14249 216961436 205664247 194566056 184058901 174442312 165513188 157339733 149029380
14242 149029380 141584764 134920724 128071545 122930430 118283665 113832018 108560535 103091744
14234 103091744 98246245 94256590 90961672 86787624 83489887 80033503 76850213 73627827
14226 73627827 70910300 68112320 65821660 63061954 60843144 58763074 56493808 54769906
14218 54769906 52957974 51126009 49320809 48104405 46330656 45061823 43627127 42268832
14210 42268832 40965502 39676985 39025949 37938643 36814328 35431860 34424380 33642365
14202 33642365 32831569 32076773 31168590 30031734 29673292 28633248 28010599 27454630 26651627
14193 26651627 26105992 25352307 24887829 23836944 23691512 23081307 22458961 21955560 21559196
14184B1559196n69938n52990n05000l24572k27617q56104j13277o66231j17368
14175A7626099l55819m00619q5138o55690l62965R9716p47996r7282j44288l85360
14165A4490658M868o75320j00195j99014m92928j54603j13876l08985l75075k45735
14155A1829795N0752j52117j70948J30800o07502j71769m24335J65297m04813
14146A0245160N0881o9829r25911L24789j14136j14290L5700l15814q3115l97546
14136H635889O7132J10965l04573K12909l26558l87852N8842L13792n19662j92768
14126G668116K25094n08531J02825j17035J02306n7087n98577N7748J01297l19291
14116F656865J88698j4398m84000K46294l83666J89288J3745k45685q7883j18300
$$ plain form
14184 21559196 20989258 20436268 19931268 19606696 19379079 18522975 18409698 17743467 17626099
14175 17626099 17270280 16869661 16784523 16128833 15765868 15865584 15117588 15020306 14876018 14490658
14165 14490658 14495526 13820206 13720011 13520997 13028069 12873466 12759590 12450605 12075530 11829795
14155 11829795 11880547 11728430 11557482 11688282 11080780 10909011 10484676 10649973 10245160
14146 10245160 10296041 10226212 9300301 9625090 9510954 9396664 9432364 9116550 9033435 8635889
14136 8635889 8703021 8813986 8509413 8722322 8395764 8007912 8066754 8380546 7860884 7668116
14126 7668116 7893210 7384679 7487504 7370469 7472775 7415688 6817111 6874859 6976156 6656865
14116 6656865 6845563 6831165 6347165 6593459 6209793 6399081 6412826 6167141 6079258 5960958
14106E960958Q694l35635N5939j8814K6757p2508r4717m27101N38630l86099q5434
14095E170670J05520n42970J95491r63J34749k85406Q3042k54757N32525m52033
14085D685868n3270j90789Q3307m2714q2464m8500j14043Q8393M5652k00746K8517
14074D199211K4837K943m21867K05629Q1150n14739M36817k64857L24779m51401
14064C622502J27506K005m6321k65087j20355L03158r9931R6608k09942j28822
14054C281321j2652N27259m99037J21008m34391J61500R1650m85639P47037k03794
14044C294262J41963o20065N96036k01543k80650n8354Q1980j92147N47487n88481
14034B720488J30934J14824j73777j39725J93636j78730j83209L71373K35716
$$ plain form
14106 5960958 5969652 5634017 5689956 5671142 5697899 5625391 5530674 5103573 5642203 5256104 5170670
14095 5170670 5276190 4733220 4928711 4927748 5062497 4777091 4860133 4605376 5137901 4685868
14085 4685868 4632598 4441809 4525116 4482402 4399938 4351438 4237395 4325788 4371440 4170694 4199211
14074 4199211 4224048 4226991 3805124 4010753 4091903 3577164 4013981 3749124 4073903 3622502
14064 3622502 3750008 3752013 3705692 3440605 3320250 3623408 3523477 3620085 3410143 3281321
14054 3281321 3268669 3795928 3296891 3417899 2983508 3145008 3236658 2751019 3498056 3294262
14044 3294262 3436225 2816160 3412196 3210653 2930003 2871649 2953629 2761482 3308969 2720488
14034 2720488 2851422 2966246 2792469 2652744 2846380 2667650 2484441 2855814 3091530
14025C091530J92049k94245k73605Q5571l31412J12909k16165K28133j95198J38341
14015B537908K4654j87496l8862k5274n10094P16028k14516q6295P2932K6191
14005B315176j9936m12375K53965j4961j18302P3029o5091J27057n436j06403
13995B026723K46454l80724J51158M12670N14422N17506O85184K135734O302692
13986A2611819R817087O45231l158429o716751l966978j214974j9036j90484j468762
13977F338723p48829j090434j021042n91838l15593n7831R8118m66116K93008
13968B438166l55346J86411j04880r0482J28656p6373j67797J13707q0833J22712
13958B113941l49165J56447j93998L07149k27953Q0317j86610J3350J16902j49327
$$ plain form
14025 3091530 3283579 2989334 2715729 2801300 2469888 2582797 2366632 2594765 2399567 2537908
14015 2537908 2562562 2375066 2336204 2310930 1800836 2516864 2302348 2216053 2288985 2315176
14005 2315176 2295240 1882865 2136830 2121869 2003567 2076596 2011505 2138562 2133126 2026723
13995 2026723 2273177 1892453 2043611 2456281 2970703 3488209 4173393 6309127 12611819
13986 12611819 22428906 23074137 19915708 13198957 9231979 8017005 7997969 7807485 6338723
13977 6338723 5589894 4499460 3478418 2886580 2570987 2513156 2611274 2145158 2438166
13968 2438166 2082820 2269231 2164351 2073869 2202525 2126152 1958355 2072062 1991229 2113941
13958 2113941 1764776 1921223 1727225 2034374 1806421 1886738 1700128 1713478 1830380 1681053
13948A681053J2259K66918n16716k8858J97713M6581k00593J25221Q855k9669
13938A562764K18781j99525K09P5234Q8574r7432j30042J6677L726Q113l83557
13927A163522j61115M27433Q1697n7461j90870J30617J03838j68062O1005M4735
13917A435339o9299r8284p1339J36175k71675J59543L28866k54822q274O5641
13907A351871M0226n9854k79942L10685k92513J40002L6196K46051p13224N66939
13897A346437k17313j88834k7454M97312l05186M4133k12358n0825j7714J26581
13887I94779J99866k88844N8399n8909L72521m84626M47582k77723P21954o15561
13877A069438P7522q0399J82882l22742N03899o66046J26879r6428J52987j64310
$$ plain form
13948 1681053 1693312 1960230 1443514 1414656 1612369 1658950 1458357 1583578 1592433 1562764
13938 1562764 1781545 1582020 1582229 1657463 1746037 1648605 1518563 1535240 1538966 1547079 1163522
13927 1163522 1002407 1429840 1511537 1454076 1263206 1393823 1497661 1329599 1390604 1435339
13917 1435339 1366040 1267756 1196417 1332592 1060917 1220460 1549326 1294504 1286230 1351871
13907 1351871 1392097 1332243 1052301 1362986 1070473 1210475 1246671 1492722 779498 1346437
13897 1346437 1129124 940290 912836 1410148 1104962 1149095 936737 885912 868198 994779
13887 994779 1194645 905801 964200 905291 1277812 793186 1240768 963045 1684999 1069438
13877 1069438 1146960 1066561 1249443 926701 1430600 764554 891433 795005 947992 783682
13867G83682K94660l67418M20999j17151O610j26434L2987j3682N9849M7142k24189
13856G97055J67521J96638j46394J96317k87463r1744J24948j04206j23959R4718
13846H23431Q4866j06360j29673L74966k85857J6809M2995j27574L41404k45869
13836G89138O2929j55408J73585Q6876l3637l72712M84200C85456J46514K15566
13826G47536j0884J05505n8893o1924L36137k68860J49910k19963P6673k6760
13816G68477J76304j97316j82454J96595j35056p3883L59298l65180r1529M13608
13806H68864N0617k86096J30618P6262k08418l10205N31564L3930n7809k31152
13796E98175K04457j49854K45217r2321R3419l72356K50894C02493M61878J13813
$$ plain form
13867 783682 1078342 710924 1131923 1014772 1021382 894948 927935 914253 974102 1021244 797055
13856 797055 964576 1161214 1014820 1211137 923674 831930 956878 852672 728713 823431
13846 823431 908297 801937 672264 1047230 761373 778182 821177 693603 1035007 789138
13836 789138 852067 696659 870244 957120 923483 550771 1034971 385456 531970 747536
13826 747536 736652 842157 783264 721340 1057477 788617 938527 718564 795237 768477
13816 768477 944781 747465 565011 761606 626550 552667 911965 546785 455256 868864
13806 868864 919481 633385 764003 840265 631847 321642 853206 887136 829327 598175
13796 598175 802632 652778 897995 805674 899093 526737 777631 302493 764371 878184
13786H78184j16869j93231K06896m8210o1471j80568K03176j05100q5931J73172
13776F70048q3894j11990O6139A88872M95209k22629K58383k24240K39446n4341
13766F80700K74888m69374K90651j76419k2968J78303j89119K4689j90914L44626
13756G45063n0159B51901L48616q0909k9903K25480l08676J58951q8964J25114
13746F01610j0115o5960r2627K37125k613B99201K9151M53606j53136j80864K08460
13735F56418j13287J58978k59541L36919k18467B43134J23407J57059R9061j44114
13725D78547N7179k0475J90529k02048K4137r4173K06776k12078J86701N2643
13715F67738r9817j43873j89438K79138j6579j08040A28111O06284j31953k80306
$$ plain form
13786 878184 761315 568084 774980 726770 665299 484731 687907 582807 496876 670048
13776 670048 586154 474164 540303 188872 684081 461452 719835 495595 735041 680700
13766 680700 955588 486214 776865 600446 577478 755781 566662 591351 400437 745063
13756 745063 694904 251901 600517 519608 489705 715185 406509 565460 476496 601610
13746 601610 591495 525535 432908 670033 667420 299201 328352 781958 628822 447958 656418
13735 656418 543131 702109 442568 779487 561020 243134 366541 523600 622661 478547
13725 478547 535726 515251 705780 503732 527869 433696 640472 428394 615095 667738
13715 667738 567921 424048 234610 513748 497169 389129 128111 734395 602442 322136
13705C22136p0982j4486K47375J47036j83964J83530m9129j79370j6734Q1768
13695D67180R3240k75380K40079M9992k03689j53893K42824j03947K43111m6229
13685E53288A99872K81977o3084L963r4945K15854j40593L66935C11404K14312
13675E25716J37736j44681O1295j68890j78656N4239M7805n5680K72760r0709
13665D60935j49006K79179j11623l1137K04160C20738j52795K78327a41366D60613
13654F06099j63435J89551j82062M4369B39126K95153J88079B65660J30203j06958
13644B88905I8294M20528j73548n198K26919A98843R6762J98749B20188L48097
13634E68285h2838C55334K3023m0743K5015l317q636A48163L58083j95154L15893
$$ plain form
13705 322136 251154 236668 484043 631079 447115 630645 581516 402146 385412 467180
13695 467180 560420 285040 525119 575111 371422 217529 460353 356406 599517 553288
13685 553288 199872 481849 418765 422728 327783 543637 403044 769979 311404 525716
13675 525716 663452 518771 580066 411176 232520 286759 334564 278884 551644 460935
13665 460935 311929 591108 479485 448348 652508 320738 167943 446270 -141366 460613
13654 606099 442664 632215 450153 494522 239126 534279 722358 265660 395863 288905
13644 288905 98294 518822 345274 340076 566995 198843 295605 494354 220188 568285
13634 568285 -82838 355334 378357 337614 362629 359312 350676 148163 506246 311092 626985
13623F26985j66242j94362L15811j84060J34026j64394j41776L72439j44335A50459
13612A10652J621K34937F6176J52804L26028B69887H8433J86688N3629J54515
13602D83265m6092A34085N25969H0134K52053n5905M4637M04825A69200J73447
13592C42647J73607j02665A90981O5064m8766L35883B52215q5678J39718A28833
13581C01458m1658I4884K36358J29028j64533p5988q6350K81544j43863r6037
13571A75043M4977n449K07140A40263K63691O9882j59793A30800J90371b48504
13560B89336J35288A9376J56129J41233J3100n177k398l8013K96858A39088k6502
13549A12586L08597r0486J0849H8851K34416j13250L8829L8305K37382k23953
$$ plain form
13623 626985 460743 266381 582192 398132 532158 367764 225988 598427 454092 150459
13612 110652 112273 347210 66176 218980 545008 269887 88433 275121 328750 483265
13602 483265 437173 134085 660054 80134 332187 276282 320919 725744 169200 342647
13592 342647 516254 413589 190981 256045 207279 543162 252215 166537 306255 128833
13581 301458 259800 94884 331242 460270 295737 219749 133399 414943 271080 175043
13571 175043 220020 214571 421711 140263 403954 473836 314043 130800 321171 -248504
13560 289336 424624 19376 175505 316738 329838 324661 322263 284250 581108 139088 112586
13549 112586 421183 330697 341546 88851 323267 210017 248846 287151 524533 300580
13539C00580A02229K69118j37850j3203J37275a02643E65751A74826O5343I5001
13528C01200F0871L02330l2936k259K37515A23732J94529J09087e8710e235D35278
13516A89422i653B0085M75000A67127M2527n1381n7602K50085l9070j02835b6844
13504B37142C6745J16848K6360m6758r75h4232B18888h4116C0054J29973M3952
13493B03979n6374b2132D16253A56443n4850k046m3169k3894L33197j05763e2163
13481B43908g0546a3121A951K43200J42682n8414j31377J0637B9738J92550p8918
13470A43370M8711H1613L18321j81882j07459a41085B01429J3622j5472A0567
13459g7037D2580A9844J90192a6249C92768A29489K26331I6570m799j5277L66039
$$ plain form
13539 300580 102229 371347 233497 220294 357569 -102643 565751 174826 240169 95001
13528 301200 60871 363201 330265 328006 565521 123732 318261 427348 -58710 -5235 435278
13516 189422 -9653 20085 495085 167127 209654 158273 100671 350756 311686 208851 -26844
13504 237142 36745 153593 179953 133195 132220 -84232 218888 -84116 30054 160027 203979
13493 203979 147605 -22132 416253 156443 101593 99547 56378 32484 365681 259918 -52163
13481 243908 -70546 -13121 1951 245151 387833 329419 198042 208679 29738 222288 143370
13470 143370 192081 81613 399934 218052 110593 -141085 201429 215051 199579 10567
13459 -77037 42580 19844 210036 -16249 392768 129489 355820 96570 91771 76494 442533
13448D42533j67637K3353a8946A62208L7142r9051b82630H9532j651A1277K7597
13437C8874e0791A96786J46643j45422n7543h2194B55894g0782A20990A1945K39207
13426B51152j8842M0142B4097P6674d7732B20993K2890K43000k13151L09860B22227
13414D7602J59643F7576L5748L42450M1535k18402h6991L9723A71311J01040m6363
13403B25988b239A78367K48651A25541E5888M70539B41183D5912K23258J34719
13393D03889j4662j47156q4329j9728a64471B46243c2123j53709B25811a15331
13382B45729q2573e9235B41951E5808c3349o0978A94492K36504D3170K97368d6156
13370A61662M1627m4285c6101B95922K2169j47390p2346J00329r4187P6571R4355
$$ plain form
13448 442533 274896 298249 -18946 162208 199350 100299 -282630 89532 87881 11277 38874
13437 38874 -50791 196786 343429 198007 140464 -82194 255894 -70782 120990 11945 251152
13426 251152 232310 272452 24097 100771 -47732 220993 243883 486883 273732 583592 222227
13414 47602 207245 67576 103324 445774 487309 268907 -86991 -47268 171311 272351 225988
13403 225988 -2239 178367 427018 125541 55888 526427 241183 45912 269170 403889
13393 403889 389227 242071 157742 138014 -164471 246243 -32123 -185832 225811 -115331
13382 245729 163156 -59235 241951 55808 -33349 -94327 194492 430996 43170 340538 -46156
13370 161662 203289 159004 -36101 295922 318091 170701 98355 198684 104497 181068 275423
13359B75423M0486O8136j12466q6488l9078J23402Q3241j19015p6638O8235G5730
13347A38910K01665j30210J54043r2695K3092J80163j87943l0676a77445l2293
13337b09738B69857j2166J82924m9913F7011P5043b15333B43132E3380a17452
13326A05034N35K24440a2789C36022p1770L9802J0878b2695A86557B8082e6794
13314F1920L60131B01015C6779J36118o3617n2851K04702o1975P672r5603O0255
13303A71480J55623J14730j49418a09921C6791a4772E90281b7615G6204A2297
13292D6413a0539r793p1201L9424A75161H4145M333Q5190C6602J11663n251J20203
13280B63217R0792j01597D4255c73808B52515e4023c957A12356K3327D2269P865
$$ plain form
13359 275423 315909 384045 271579 185091 146013 269415 352656 233641 157003 225238 75730
13347 138910 340575 210365 364408 271713 294805 474968 287025 256349 -177445 -209738
13337 -209738 269857 257691 440615 390702 67011 142054 -215333 243132 53380 -117452
13326 105034 105569 330009 -12789 336022 264252 304054 314932 -22695 186557 28082 -56794
13314 61920 422051 201015 36779 172897 109280 56429 261131 199156 206828 111225 171480
13303 171480 327103 441833 292415 -109921 36791 -14772 590281 -27615 76204 12297
13292 46413 -10539 -20332 -91533 -52109 175161 84145 88478 173668 36602 148265 143014 263217
13280 263217 354009 252412 44255 -373808 252515 -54023 -3957 112356 135683 42269 50134
13269E0134J46019a96476C19397d4949E754J15682b0258A27743j8767b33649A94353
13257h7112a4607E3028O2179a06154A41494L6247i813D64858a19898q3602A3060
13245c08145a15248D72621b1581j12592d2209I667J21385E3452L50938o0273F5525
13233A29506a57745A3537l456P3547p121f0937o6639E63779I8289j0238J48661
13222B36712A0434P6302b67093R4505A75646D9363K92597j46166O7798j25712
13212A37880O0807b18587B35870A15110c35446I4662N43720A13359r763J43265
13202B46861C4537c9191B31236D0943h4301H6701b61228A61266A9153J39700J08891
13191B67744Q1077D1903K1018a67339F6894J00380b29350O4111H1247k1718L02565
$$ plain form
13269 50134 196153 -196476 319397 -44949 5754 121436 -20258 127743 108976 -233649 194353
13257 -87112 -14607 53028 115207 -106154 141494 177741 -9813 464858 -119898 -203500 13060
13245 -308145 -115248 472621 -21581 -134173 -42209 9667 131052 53452 404390 344117 65525
13233 129506 -157745 13537 10081 83628 76507 -60937 -127576 563779 98289 88051 236712
13222 236712 10434 86736 -267093 -172588 175646 49363 341960 195794 263592 137880
13212 137880 198687 -218587 235870 115110 -335446 94662 638382 113359 103596 246861
13202 246861 34537 -39191 231236 40943 -84301 86701 -261228 161266 19153 158853 267744
13191 267744 348821 41903 62921 -167339 66894 167274 -229350 -165239 81247 59529 362094
13180C62094I5771K18831H3512C7028J9169K1973a02751I6318d0134k24867B21358
13168E8381K94756d5768C89903A28437h4963G0187b40217O5089p6637e7598B0766
13156e4730E7336J3782a52131A80135p0417b6341B66751F3074c36507i0557E3990
13144a59324C21998c2900A82656B0213b13073c8618D6424a1178A3269K18677r7820
13133A34126B5014d0138j00340B0947M3778a27347D14550A97306D7291i8079A44691
13121e55j00185E5699f4196k0802n8418A43499R4187A01967A9728a34744J6342
13110a18402A40748K0656L4598J16744d0279A58243d7913j75662A50601l2328
13100A18273D1385J32207i849A00650b25855A78305i2218p4A285a66240A58517
$$ plain form
13180 362094 95771 314602 83512 37028 56197 78170 -102751 96318 -40134 -265001 221358
13168 58381 353137 -45768 389903 128437 -84963 70187 -240217 -175128 -251765 -57598 20766
13156 -54730 57336 71118 -152131 180135 109718 -26341 266751 63074 -336507 -90557 53990
13144 -159324 321998 -32900 182656 20213 -213073 -38618 46424 -11178 13269 231946 134126
13133 134126 25014 -40138 -140478 20947 64725 -127347 414550 197306 47291 -98079 144691
13121 -555 -100740 55699 -64196 -84998 -143416 143499 237686 101967 19728 -134744 -118402
13110 -118402 140748 161404 196002 312746 -40279 158243 -47913 -223575 150601 118273
13100 118273 41385 173592 -9849 100650 -225855 178305 -92218 -92292 1285 -166240 158517
13088C74067G7391J41338g0942k20916a23474m3955E0114K3552c0677K895k08703
13077b36485A33992C7876c21733A57499l7642J52503a03752I4735j3981R1195
13067A71949i189q7309M3304l78740B32301p7704a68533C60951G6573P6351j1718
13056A41206d1313I8582J30257f4656H6273e7128k47474c9560a5626A14488a43215
13044A27136m8509a42804k196D8536O3446h281D649K12816F997K52550a4412G3092
13031A81135o795M5917b5223B02629q1748D2584K78490j42443G4900g3372I5670
13019g7019l0048A42763j8806R521o4666c4134r4293d7319A0079J63037B3342
13007A08741a79136d0229a8337D3683j2568a05222b4833H9508B5392J95887I976
$$ plain form
13088 374067 77391 218729 -70942 -291858 -123474 -167429 50114 73666 -30677 -27782 -236485
13077 -236485 133992 37876 -321733 157499 119857 272360 -103752 94735 80754 171949
13067 171949 -9189 -96498 -53194 -431934 232301 154597 -168533 360951 76573 152924 141206
13056 141206 -41313 98582 228839 -64656 86273 -57128 -304602 -39560 -15626 114488 -143215
13044 127136 78627 -142804 -145000 48536 111982 -8281 4649 217465 6997 259547 -14412 73092
13031 181135 174340 220257 -25223 202629 120881 42584 321074 178631 74900 -73372 95670
13019 -77019 -107067 142763 123957 133478 68812 -34134 -128427 -47319 10079 173116 23342
13007 108741 -179136 -40229 -18337 43683 31115 -105222 -24833 89508 25392 221279 9976
12995H8190K29408L5102b19684A52517J55059P4205a51961g4979B49252p9515
12985A69737c15956f2938a0150k16304A28322b50243Q9102A28003M23a42363B60074
12973D3476b30252M2515A66163m4088b754A17272J21000E0991K7717L08910a13684
12961A27138i9755A32083a02339C30580k2316B4224a99087Q9287f763n2799k57763
12950c17325I6782A0820J02586A471J49970L1408g7693A48656Q4555J85771A58134
12938D101J31104K02753D9445a449j09498e3300j3590b1137A75294b4966p3463
12927i8429n1999A11540L25147h243m3036A51449n8260i1231k34302A95394n21
12916A94873B6283c5526A28226c07905B58269a5002p5414A14617D1987L3197a73813
$$ plain form
12995 88190 317598 352700 -219684 152517 307576 381781 -151961 -74979 249252 169737
12985 169737 -315956 -62938 -10150 -226454 128322 -250243 -161141 128003 128426 -142363 260074
12973 43476 -230252 -187737 166163 122075 -2754 117272 238272 50991 78708 387618 -113684
12961 127138 -99755 132083 -102339 330580 308264 24224 -199087 -109800 -6763 -59562 -317325
12950 -317325 96782 10820 113406 1471 151441 182849 -77693 148656 233211 418982 158134
12938 4101 135205 337958 49445 -1449 -110947 -53300 -66890 -21137 175294 -24966 -98429
12927 -98429 -150428 111540 436687 -8243 -51279 151449 93189 -91231 -325533 195394 194873
12916 194873 26283 -35526 128226 -307905 258269 -15002 -90416 114617 41987 75184 -173813
12904A49883f4305j46076I4763a57434O9522E4005J47562q2362a90221A79247
12893a65538G6572L79718a58361B52007a29952k53497B3763M5593d1932C6445
12882D8660A4793i6774A41060m8032D6177g6902B8967J18876k753b30497I7188
12870A7814J70477A5365f8252H4320a54083j84890D8942d9231l98014G9552m560
12859G4992c28816R1199G9181K41336a19541j1510B45843a2721A18408c34296
12848A02447g5041A87286a41018j70113a4891B43265m3791c3434m80414A36643
12837f9532j49169j17157B02437o2907b04438R6408b4672A66251k5934c2826A0909
12825B5530g9814I0488b613G2279b04535A97994r4167j8519O9038m6473c03070
$$ plain form
12904 149883 -64305 -210381 94763 -157434 -87912 54005 201567 119205 -190221 179247
12893 -165538 76572 456290 -158361 252007 -129952 -383449 23763 69356 -41932 36445
12882 48660 14793 -96774 141060 93028 46177 -76902 28967 147843 145090 -230497 97188
12870 17814 188291 15365 -68252 84320 -154083 -338973 48942 -49231 -447245 79552 74992
12859 74992 -328816 -237617 79181 320517 -119541 -131051 245843 -12721 118408 -334296
12848 102447 -75041 187286 -141018 -311131 -14891 243265 199474 -33434 -513848 136643
12837 -69532 -218701 -335858 202437 139530 -204438 -108030 -24672 166251 140317 -32826 10909
12825 25530 -79814 90488 -2613 72279 -204535 197994 103827 85308 154346 107873 -303070
12813G8329a66862B24549b37381b4741o5258k15133j14021f4201A22752b24417
12802i4577j73437E5954a32934I5822a27991B2971c243A31062E1391c2630j31655
12791a64285C07597A4853J70920j2879F5909l1759K2510A5073h4186D7126b00335
12779F6882R3182a64195o6089m4504A45768a95351M059Q4877a1827A74363d1559
12767c9073A30010L0752a32672a1226j50275k7196d6613a9449j81062E3898J5583
12756F9481e7455F3026j8545J9120M3766b9241H3971J50055l3559d17995c6761
12744b30153A1879c83376j35800G7363d0922A2664J65339c46238J68171H0799
12733A81728A455a20912d5134D193b02331F5248c5730E3457N4309c35501A08389
$$ plain form
12813 78329 -166862 224549 -237381 -24741 -89999 -305132 -419153 -64201 122752 -224417
12802 -94577 -268014 55954 -132934 95822 -127991 22971 -3243 131062 51391 -32630 -164285
12791 -164285 307597 14853 185773 172894 65909 34150 56660 15073 -84186 47126 -200335
12779 66882 160064 -164195 -230284 -274788 145768 -195351 -191292 -106415 -11827 174363 -41559
12767 -39073 130010 160762 -132672 -11226 -161501 -188697 -46613 -19449 -200511 53898 69481
12756 69481 -57455 63026 44481 63601 107367 -29241 83971 234026 200467 -417995 -36761
12744 -230153 11879 -383376 -519176 77363 -40922 12664 178003 -346238 -178067 80799
12733 181728 1455 -120912 -45134 4193 -202331 65248 -35730 53457 107766 -335501 108389
12721A40634a10293l8498K8040B48083h9084A35653j6044D4606a63250d5974A85648
12709c42755G4758b08175K6044A9735b08138D6038e7560I8689R94R0199p490d99009
12696d00706i4901L6167B155J56378K32712a17070B31239b92450a18094C83M0818
12685D1201d0778A4733P9198J19048A9865a07668L0364A8203M1926b5903D3936
12673h1477q3653D77927A39050d3608R566C29560p7935a16192A86659k0648a61646
12661b37383A0370L39271b6198B4998g9037B34398j11536M5173J77888j42799
12651B03124a19586A83709D8430k3537J13648b71310g3290q3579A37525D6930
12640f3671E11914a80490B55001q3900a52813B17726I8891J83794h4705k21390
$$ plain form
12721 140634 -110293 -148791 -120751 248083 -89084 135653 119609 44606 -163250 -45974 185648
12709 -342755 74758 -208175 -182131 19735 -208138 46038 -57560 98689 99683 189882 182392 -499009
12696 -400706 -94901 -58734 2155 158533 391245 -117070 231239 -292450 -118094 383 41201
12685 41201 -40778 14733 93931 212979 19865 -107668 -77304 18203 60129 -25903 43936
12673 -81477 -165130 477927 139050 -43608 -34042 329560 251625 -116192 186659 166011 -161646
12661 -237383 10370 349641 -26198 24998 -79037 234398 122862 168035 345923 203124
12651 203124 -119586 183709 48430 24893 138541 -271310 -73290 -156869 137525 46930
12640 -63671 511914 -180490 255001 171101 -152813 217726 98891 282685 -84705 -306095
12630c06095B17635A2625J30959B2695J75784m5003L67870A11294c3574r0700
12620a24274p0511f5955m2618C72463b19191I5643c8251B34454j04579b65809
12609h9097r2614g5569n7085A31224B5475O9387B4365f0556G9937M2553a67959
12597C61822A1624L6641b22870J01595B62616B1269K77134A01830K442c48841
12586A41572B4156a02280J9426p6424a4005l4634A25637i941L986j3502j11742
12575a31199B48451F6560d34870J32056J37985E2445J8550a75620C95451G3997
12564A31603d6725A81747C9581N8535c1062l24305a36934A44916d4209B82489
12553b7254B68528a79342L9460r3018i229E3167c0129A35822c27634a52058A87076
$$ plain form
12630 -306095 217635 12625 143584 22695 198479 153476 521346 111294 -33574 -124274
12620 -124274 -194785 -65955 -108573 372463 -219191 95643 -38251 234454 129875 -265809
12609 -89097 -181711 -75569 -132654 131224 25475 94862 24365 -60556 79937 122490 -167959
12597 361822 11624 48265 -222870 -121275 262616 21269 298403 101830 104272 -348841
12586 141572 24156 -102280 -82854 -159278 -14005 -48639 125637 -9941 -5955 -19457 -131199
12575 -131199 248451 66560 -434870 -302814 -164829 52445 70995 -175620 395451 73997
12564 131603 -46725 181747 39581 98116 -31062 -355367 -136934 144916 -44209 282489
12553 -27254 268528 -179342 -139882 -232900 -9229 53167 -30129 135822 -327634 -152058 187076
12541B35688C1360a62064H1817c1792a4170A53369K85135A71600P35F4030L1597
12530I5627c43844A21123D5255G677a27922A38186K1686e9549j07532j14530B97890
12518B88377A3156b8607k94396g3148a6114j69796d7269j0235j02646H687e7833
12506I6240K64001G1736O8167J22869A20077R2288G6774f969B98740d3868A18706
12494B80268a56359c3946k29198a1364A23461b43261e2544A94211b32215E3780
12483c1394E0607a22974j30102D2896J81565r4648k0827J34790J39523F6106c53443
12471g2235B17873k732c25573A35665C5431a78745E1762b74696C9733K70359b39754
12459D8405c732n657B31271L5160f6520r1271d7304A61348J80993a76821d8028
$$ plain form
12541 235688 31360 -162064 81817 -31792 -14170 153369 438504 171600 172335 64030 95627
12530 95627 -343844 121123 45255 7677 -127922 138186 159872 -59549 -167081 -281611 297890
12518 288377 13156 -28607 -323003 -73148 -16114 -185910 -47269 -57504 -160150 8687 -57833
12506 96240 360241 71736 139903 262772 120077 212365 76774 -6969 298740 -43868 118706
12494 280268 -156359 -33946 -263144 -11364 123461 -243261 -52544 194211 -232215 53780
12483 -31394 50607 -122974 -253076 42896 224461 129813 108986 243776 383299 66106 -353443
12471 -72235 217873 215141 -325573 135665 35431 -178745 51762 -274696 39733 310092 -239754
12459 48405 -3732 -9389 231271 266431 -66520 -157791 -47304 161348 342341 -176821 -48028
12447G4950A8207M26641F338h9213B67143a40004j59337J36225k7478l9257b8271
12435C9193a96665k3185A23505J91267a09785A55801M3479F3489J44972a456j13748
12424a15204n4216B50865d9848F3595c47823A16113J07973o3088A2148a88272
12413a25783I2850d58539C4591a5954B50192b28377I7183K68530h5337a3454B99111
12401a90979E4010O5697M3319B0220i650l273C00661e2342I3564e5403b0088G4078
12388a03078H4916b5274J2354k70880J15653O9794C3741g4470k39959A7433J93700
12377B11133p3021A6294b0191r8906B71097a02688F2736e9360A36123J80954b78231
12365F246J85189C3416Q2944m6021L13225A00231b83A03245j1598C8021J08451
$$ plain form
12447 74950 18207 444848 6338 -89213 267143 -140004 -299341 -163116 -190594 -229851 -28271
12435 39193 -196665 -219850 123505 314772 -109785 155801 199280 63489 208461 -1456 -115204
12424 -115204 -169420 250865 -49848 63595 -347823 116113 224086 160998 12148 -188272
12413 -125783 92850 -458539 34591 -15954 250192 -228377 97183 365713 -85337 -13454 299111
12401 -190979 54010 119707 163026 20220 -9650 -12923 300661 -52342 93564 -55403 -20088 74078
12388 -103078 84916 -25274 -12920 -283800 -168147 -98353 33741 -74470 -314429 17433 211133
12377 211133 138112 16294 -20191 -119097 271097 -102688 62736 -59360 136123 317077 -278231
12365 6246 191435 33416 116360 70339 383564 100231 -283 103245 91647 38021 146472
12354A46472B516b38983F7667L1842J4038J75600a38874n0407B92179G2999b00376
12342E4339K1673C6399c5168A8273J14552d6914A42199K25385q3080j11300M6122
12331B19326f9886A56895M4014L08429A70733J13534E0014k781R0513F5636e5252
12319C9526J14410O1361L871j4310H624N27374A65578N9760g2428D38006A23957
12307A86378b07012N8468I779K6306e2259a2905n4975B58072a98468h58A49836
12295A83200a23231B33429O8419b8971B91171j35812J25404B5385J5092J19099
12285A59576R9492a14516B15988Q0370i1886k0860A36469C0154c8274I589L84650
12274C94239i5075b662H4417J71302q773K09193b37144D36439a09220A8486b52028
$$ plain form
12354 146472 2516 -238983 67667 99509 113547 289147 -138874 -189281 292179 72999 -200376
12342 54339 76012 36399 -35168 18273 132825 -46914 142199 367584 284504 173204 219326
12331 219326 -69886 156895 200909 509338 170733 284267 50014 47233 137746 65636 -55252
12319 39526 153936 215297 219168 204858 8624 535998 165578 225338 -72428 438006 123957
12307 186378 -207012 -148544 9779 36085 -52259 -12905 -67880 258072 -198468 -858 149836
12295 183200 -123231 233429 301848 -28971 291171 155359 280763 25385 40477 159576
12285 159576 259068 -114516 215988 296358 -91886 -112746 136469 30154 -38274 9589 394239
12274 394239 -95075 -2662 84417 255719 246946 456139 -237144 436439 -109220 18486 -252028
12262A47650f1988j10290B08593r5303g1169j13447B43346p2897G8938b90515
12251d57686D846K23727a14164l9774c7996p4012A58599C4252h4846A42908B4834
12239B3195J972e3848D1124a25125L8854A27062K05626j02477h0448A38085J34278
12228B72363H3585K55054j46405c67127C32963H8535b0547B49279K66781B33238
12217A64137J05913j594a58833G2976L51636A81481J5040J5555k0826l5260K51099
12206D07089L2482k09292a21443N9804a0360k01301B48334R9888j40243J87591
12196C95570A21356K75290E6446K00045J45560j32111j7473L66484a4202A36919
12185I946M42022p4470A74602p3339J79973i429j3101B20893o7150K84597A19805
$$ plain form
12262 147650 -61988 -172278 208593 113290 -71169 -184616 243346 170449 78938 -290515
12251 -457686 4846 228573 -114164 -153938 -37996 -112008 158599 34252 -84846 142908 24834
12239 23195 25167 -53848 41124 -125125 -86271 127062 332688 230211 -80448 138085 272363
12228 272363 83585 338639 192234 -367127 332963 88535 -20547 249279 516060 233238
12217 164137 270050 268456 -158833 72976 424612 181481 196521 212076 191250 155990 407089
12206 407089 439571 230279 -121443 -61639 -10360 -211661 248334 348222 207979 395570
12196 395570 121356 396646 56446 256491 402051 269940 252467 618951 -14202 136919
12185 9946 451968 377498 174602 101263 281236 -9429 -22530 220893 153743 438340 119805
12173I1083J2541e0977A84368k364a68324B47368A20120E4110O953L18264A23008
12161B88958A44068K42459J197A13423J22802F3532Q7029a86114C06684j33564
12151A73120b65615A12440M33862B08554I1757K33825J93472c5479G9242J2302
12141I1544f3315B46035q9067J16854E9593L46535n8134M0385j76184E9965L21806
12130C81771j49934K86885g9268b7451B32016M5730P43p3992a67104H9321A5451
12118C79064A46994m2042i6636B56785A01533k2803i0834B7861i3508C4227L54631
12107C88858A32252b4331I7441B1860M5951E803a1217k6894A79664A7826R547
12096B7373O0239h2152B03992o7587B1649a75320A13356d8891B9386J51835b35923
$$ plain form
12173 91083 103624 -50977 184368 182004 -168324 247368 120120 54110 61063 379327 123008
12161 288958 144068 386527 387724 113423 236225 63532 150561 -186114 306684 173120
12151 173120 -265615 112440 546302 208554 91757 325582 519054 -35479 79242 91544
12141 91544 -63315 246035 156968 273822 59593 406128 347994 388379 212195 59965 381771
12130 381771 231837 518722 -79268 -27451 232016 277746 278489 204497 -167104 89321 15451
12118 379064 146994 104952 -96636 256785 101533 78730 -90834 27861 -93508 34227 388858
12107 388858 132252 -24331 97441 21860 67811 5803 -11217 -38111 179664 17826 27373
12096 27373 87612 -82152 203992 136405 21649 -175320 113356 -48891 29386 181221 -235923
12084B53408I5341L8829Q7927a39221c7598l1412C40471j29605D2884M5962M7833
12073A36679D9749L42392j20060A08811C077a19697A17152P1468E0109q454a79332
12061B01640a2657k61935e6126A73686N8639G6574J70068b373B88310d5700L828
12050d1872l42780d0879D1599I629a39938H9675K21007j30756c09207A6778a4238
12038D12167A3972b06567j54901I4900J16030p3945c5394a6677E6779b66372d680
12026b13864b0582q5066q4556A59426a88662B03816e1957l23526c58k41177g0769
12014g6308A63153R320a85325j76304a10407j98032B5392e7133b1807K12C21930
12002A4153J0093a0699m9395B21204o8731Q8814a98609D5927J77689e2488r0952
$$ plain form
12084 253408 95341 134170 222097 -139221 -37598 -69010 340471 210866 42884 88846 136679
12073 136679 49749 392141 272081 108811 3077 -119697 117152 188620 50109 41655 -179332
12061 201640 -12657 -274592 -56126 173686 232325 76574 246642 -2373 288310 -45700 -41872
12050 -41872 -384652 -40879 41599 9629 -139938 89675 310682 179926 -309207 16778 -14238
12038 412167 13972 -206567 -361468 94900 210930 136985 -35394 -16677 56779 -266372 -4680
12026 -213864 -20582 -105648 -190204 159426 -188662 203816 -51957 -375483 -358 -241535 -70769
12014 -76308 163153 172473 -185325 -361629 -110407 -308439 25392 -57133 -21807 -21595 321930
12002 14153 24246 -10699 -60094 221204 152473 241287 -198609 45927 223616 -52488 -143440
11991a43440j12036E4260K07004d1231j38850A0354g4856B39467i0335C1660a03378
11979a78894d0326n5978F7742p665J21126J23389c04379J49377B1379a27562a5455
11967b0334C67980a60949A21663b2976m6183j1884k7013k09250A77006a21152
11956A75092a0175D2194j2653J12076c80862J10254A17736k0863M8048j223c4397
11944E117a15387J7310A61102d07604c266l12594a5868k51022d4763m9864B5853
11932H285g2741m56753K55739B49632a60271a8365r9222H7458c0645F081L2117
11921C8198f644j25624Q909J0984L7206A45134a29143A2488a47572m7096j2875
11910b07543L1589o5254a9168j7303A09946J85976q8509C1386o10a19015j5248
$$ plain form
11991 -143440 -255476 54260 261264 -41231 -180081 10354 -74856 239467 -90335 31660 -103378
11979 -178894 -40326 -96304 67742 60077 181203 304592 -304379 -155002 21379 -127562 -15455
11967 -20334 367980 -160949 121663 -22976 -69159 -81043 -108056 -317306 177006 -121152
11956 175092 -10175 42194 29541 141617 -380862 -270608 117736 96873 144921 143698 -34397
11944 5117 -115387 -98077 161102 -407604 -3266 -315860 -15868 -266890 -44763 -94627 25853
11932 8285 -72741 -529494 -273755 249632 -160271 -18365 -117587 87458 -30645 6081 38198
11921 38198 -6644 -132268 -123359 -112375 -75169 145134 -129143 12488 -147572 -194668 -207543
11910 -207543 -175954 -241208 -19168 -36471 109946 295922 207413 31386 30776 -119015 -134263
11899a34263A05336i469B2365J78593J01204a19341a7938B23086c8879k43769
11889b82648B6557J1648a39852Q636N4762B96159j19656i9683B6788K58211a35811
11877A84777d0880q2220p4302Q8500L0394l177A89340E2156M1329a42770A21971
11865c53607a56865j04028g7560L6239H051a94577K5096M63h2425j68835e140
11853d22987A57940a41837e4143l35932a01587p6902c7971E8478h8802j05432
11843a94234C3494J64219a98903H5798b27858F9925K1242N1831b75450A48921
11832E6482a45583j79173a21550K3070A96102F041J20947g2232B74472j28439
11822A46033a12020j17328A51051A3761a55012K5769A02342d75680b05242k409
$$ plain form
11899 -134263 105336 -9469 22365 200958 302162 -119341 -17938 223086 -38879 -282648
11889 -282648 26557 38205 -139852 -131216 -76454 296159 176503 -99683 26788 284999 -135811
11877 184777 -40880 -123100 -197402 -108902 -78508 -81685 189340 52156 93485 -142770 121971
11865 -353607 -156865 -260893 -77560 -41321 8051 -194577 -169481 -169018 -82425 -251260 -5140
11853 -422987 157940 -141837 -54143 -390075 -101587 -178489 -37971 58478 -88802 -194234
11843 -194234 33494 197713 -198903 85798 -227858 69925 91167 142998 -275450 148921
11832 56482 -145583 -324756 -121550 -98480 196102 6041 126988 -72232 274472 146033
11822 146033 -112020 -229348 151051 13761 -155012 -129243 102342 -475680 -205242 -207651
11812b07651A17101b0586l02486F6204c6662j82421M9131N1180F8281Q6531a73592
11800a00175H2970J9535B0664O5994D1987J06856a81277j12381c6031B71509f7841
11788A24557b33309n9618A6167a00389F9453l365a61376r4625M3558E3960K47
11777E4207J2997K9557a28618n0563F5258j5206N9981M0124b36742a11843B66293
11765B01624B3424m534f2168j92186j02831A41895N1069p8192d66849M3893A41624
11753B15805L4833D8038N9961i0959B15982a78758p2890b3486p2596F371h9135
11741a02981M6175j46128b735H6108b79176P4590P3915A10179b8624n0272j53421
11730b32317N1608A86659g3047B17050M5472b67740d3081j98332B97984a89007
$$ plain form
11812 -207651 117101 -20586 -323072 66204 -36662 -219083 -169952 -118772 68281 154812 -173592
11800 -100175 82970 102505 20664 86658 41987 148843 -181277 -293658 -36031 271509 -67841
11788 124557 -233309 -292927 16167 -100389 69453 66088 -161376 -256001 -212443 53960 54207
11777 54207 67204 96761 -128618 -179181 65258 50052 110033 150157 -236742 -111843 266293
11765 201624 23424 18890 -62168 -254354 -357185 141895 192964 114772 -466849 -422956 141624
11753 215805 250638 48038 107999 -90959 215982 -178758 -251648 -23486 -96082 6371 -89135
11741 -102981 -56806 -202934 -2735 86108 -279176 -204586 -130671 110179 -28624 -78896 -232317
11730 -232317 -180709 186659 -73047 217050 262522 -267740 -43081 -241413 297984 -189007
11719A9781J0272i4062j15951A99563a50986M8614c3254D3809P0682c3774j98530
11708b32304A55989B2810J56137C5476a32644j55766d8424E9389M1283q856M2811
11697A34627P3182a38130k07874e0732C5033d22792a90559N6544c0720F5492a21891
11685b23001h8561A10424J9746a29354k8743H680a50541d5938j01481A81664a41050
11673a49669N1873J5522B77666b10664A13951a33919K9025p4293B60221a56612
11662C27663a60129B57026f7165b1672j40027A2969b46913D978b02633g212A41352
11650d5752A18029D6991a13593o803j55209A49656D1904a9022A5265J1957L3191
11639F0413C20L11668b99725d046A80710a20397m3714C02717a56009d5467q2807
$$ plain form
11719 19781 30053 -94062 -210013 199563 -150986 -102372 -33254 43809 114491 -33774 -232304
11708 -232304 155989 22810 178947 35476 -132644 -288410 -48424 59389 100672 91816 134627
11697 134627 207809 -138130 -346004 -50732 35033 -422792 -190559 -134015 -30720 65492 -121891
11685 -223001 -88561 110424 130170 -129354 -158097 8680 -150541 -45938 -147419 181664 -141050
11673 -149669 -97796 -82274 277666 -210664 113951 -133919 -104894 -179187 260221 -156612
11662 327663 -160129 257026 -67165 -21672 -161699 12969 -246913 4978 -202633 -7212 141352
11650 -45752 118029 46991 -113593 -120396 -275605 149656 41904 -19022 15265 27222 60413
11639 60413 320 311988 -299725 -4046 180710 -120397 -164111 302717 -156009 -45467 -128274
11628a28274C6006a66787e6420l1041C47992a27786A18541a95417H5583d1863
11617a17746h366j78930C15818a79377C9277e8172B23900a02412B15131a41149
11606c0680n4092L6066B8856a50880G0398d2701j32428A21183Q8371N067D24K73091
11594B73515A15723E7219b26843a02946A31201b17380m1063a27464E5618c15629
11583A80550A1011b37441D6598q691d13585d6085l7100C15902d7098q5917h315
11571H8461g408A90633F8404j7311a52471E6548k6469b6768F6383d0676o7906
11560a08582k42026A2338K88385a73824D8709J20336h0212B43602b008j50482
11550a52490A31780a27165P738a9272k51306a25359j43387A17497m7444a34727
$$ plain form
11628 -128274 36006 -166787 -56420 -87461 347992 -127786 118541 -195417 85583 -41863
11617 -117746 -8366 -187296 315818 -179377 39277 -58172 223900 -102412 215131 -141149
11606 -30680 -84772 -48706 28856 -150880 70398 -42701 -175129 121183 209554 214621 424 273515
11594 273515 115723 57219 -226843 -102946 131201 -217380 -258443 -127464 55618 -315629
11583 180550 11011 -237441 46598 37907 -413585 -46085 -83185 315902 -47098 -133015 -8315
11571 88461 -7408 190633 68404 51093 -152471 56548 30079 -26768 66383 -40676 -108582
11560 -108582 -350608 12338 300723 -173824 48709 169045 -80212 243602 -2008 -152490
11550 -152490 131780 -127165 -119427 -19272 -270578 -125359 -268746 117497 70053 -134727
11539C13742j04637a89473d2B44603B1319J55179c24846I4581h6161o189j51465
11528b43815B69728j17021B638Q724L05954B3799c467C69124h4722A72431a63416
11516i4867D9380B502J37945e4326K1971C58033a42093q5346M5381B90820R0486
11505C81306D4059M1128A2697b57600H3725j0576L03168j67942d5542j32932H9294
11493A3928J28701J97485a20389A07169D0286L0952J17463h1616B74422j18065
11483A56357d1368j45545C20150A28356K10802b5791A37420J07126R3810b5040
11472A90779k3306a46322B01227O296d9386B40065g678H3093K95369c21346A62396
11460F8544J67722d5613B85622m3892G0799R3001G1351a64308H1984i1041b3383
$$ plain form
11539 313742 209105 -189473 -42 244603 21319 176498 -324846 94581 -86161 -92350 -243815
11528 -243815 269728 152707 2638 11362 317316 23799 -3467 369124 -84722 172431 -163416
11516 -94867 49380 2502 140447 -54326 -32355 358033 -142093 -227439 -182058 290820 381306
11505 381306 44059 85187 12697 -257600 83725 73149 376317 208375 -45542 -178474 89294
11493 13928 142629 340114 -120389 107169 40286 71238 188701 -81616 274422 156357
11483 156357 -41368 -186913 320150 128356 339158 -25791 137420 244546 338356 -25040
11472 190779 167473 -146322 201227 207523 -49386 240065 -7678 83093 378462 -321346 162396
11460 68544 236266 -45613 285622 241730 70799 163800 71351 -164308 81984 -91041 -23383
11448a77831E9552c3993p502q4327B43207b27991I2433b93966a38577A10477J5300
11437A25777a47284B42305i878j21891A79667A9927Q5667d9123B28995p7644L18381
11426D69732d9645B75419a18979d667k31010A22385e90j35107k47482h1421B4523
11414A79356J65o6488b22061A54896A5343a77986e3049j04326n5661A58176h1600
11402a13319C68779c24920K136J0157A52452i9749A65591K8101e6162m40906I0754
11390A02434b1174r3652F7236b04196A06525m0423d6956C2131d6323B12684a53185
11378B51080I0606j363a4j20580A08838n0371a20551B50281C0765M13402a23046
11366A93573A2282K40731a74217I2173k7780g1394j35676I2688k6644J74314f9932
$$ plain form
11448 -177831 59552 -33993 -41495 -125822 243207 -227991 92433 -293966 -138577 110477 125777
11437 125777 -147284 242305 -9878 -131769 179667 19927 105594 -49123 228995 151351 469732
11426 469732 -49645 275419 -118979 -4667 -235677 122385 -590 -135697 -383179 -81421 24523
11414 179356 179521 113033 -222061 154896 15343 -177986 -53049 -157375 -213036 158176 -81600
11402 -113319 368779 -324920 -322784 -312627 152452 -99749 165591 193692 -56162 -497068 90754
11390 102434 -21174 -114826 67236 -204196 106525 66102 -46956 32131 -46323 212684 -153185
11378 251080 90606 89243 -14 -120594 108838 58467 -120551 250281 30765 444167 -123046
11366 193573 12282 253013 -174217 92173 64393 -71394 -207070 92688 66044 240358 -69932
11354B3795J43874c46941J71403h989j53084a6413m3821A23518b80747A61104
11343i2136n6490F1938K31113I0457l8342j5627P44g9056E2591l643c30166h924
11330a99233K2939j20569R3479A91750J3346L5262d96524B09052j01888q389B4217
11318i6920j28925e2386p9468D9256b42278o50A31048e0450q8252j9188l381A69019
11305i1496L7560B90143a47466K1431N200j21772f7017O543p9955N8287k22232
11294c04374F6805a53593a4310l39735F6082I755P3364a8314l48476F5905P7213
11283A43118b60837A09998B0131b14757A9861J00247b25904e2413j92878b3521
11272f9004j7677p781H8616d1623r389k48073B4689e1257A93195h1675j16034
$$ plain form
11354 23795 167669 -346941 -175538 -8989 -162073 -16413 -60234 123518 -280747 161104
11343 -92136 -148626 61938 293051 90457 52115 36488 37232 -79056 52591 48948 -330166 -8924
11330 -199233 -176294 -296863 -203384 191750 205096 240358 -496524 209052 107164 98775 24217
11318 -96920 -225845 -52386 -131854 49256 -242278 -242928 131048 -50450 -138702 -157890 -161271 169019
11305 -91496 -53936 290143 -147466 -126035 -120835 -242607 -67017 -60474 -140429 -82142 -304374
11294 -304374 66805 -153593 -14310 -354045 66082 9755 83119 -18314 -366790 65905 143118
11283 143118 -260837 109998 20131 -214757 19861 120108 -225904 -52413 -245291 -23521
11272 -69004 -86681 -94462 88616 -41623 -51012 -299085 24689 -51257 193195 -81675 -197709
11261a97709k10199h162H6453b62952j91784A61457B6377a50563L6316B80799
11250h2642m4874l07707a47341j15657f1867J3319C6556g6795B9992J87019c95326
11238a23877A06777c79087b1184A97756n9832D18h407C2608O5796d23143a41755
11226d656A95216l3919J8769b27327H8542g3087G9975N6257J15629D4189d7218
11214B28048h4183j1182B39129a31741F2450P7136f9165B67196C7132d00436G4759
11202A29382G265l353c564B39965a56822A72798q4634a30197k1871f2102j38465
11191b00567A56620A8742a9069o6390L7343D2819J02058E3569a2537j93404b5907
11179a23521k3507p4921L2115m5592B8712c24467J56649M8856m2709A83256I0789
$$ plain form
11261 -197709 -407908 -8162 86453 -262952 -454736 161457 26377 -150563 -114247 280799
11250 -82642 -127516 -435223 -147341 -262998 -61867 -48548 36556 -76795 29992 217011 -395326
11238 -123877 106777 -379087 -21184 197756 137924 418 -8407 32608 98404 -423143 -141755
11226 -4656 195216 161297 180066 -227327 88542 -73087 79975 136232 251861 44189 -47218
11214 228048 -84183 -95365 239129 -131741 62450 139586 -69165 267196 37132 -400436 74759
11202 129382 7265 3912 -3564 239965 -156822 172798 88164 -130197 -152068 -62102 -200567
11191 -200567 156620 18742 -19069 -85459 -48116 42819 144877 53569 -12537 -205941 -25907
11179 -123521 -147028 -221949 -189834 -235426 28712 -324467 -167818 -118962 -161671 183256 90789
11167B8492c06467A30339b9765A6340a06853k9148A32126H620f8019b4547q2935
11156a07482L2884A50680J23587M8009c38418E6032a30596G6700f7389B50403
11145C0918I030a71272A62934e45399h6743F232b98294h0826B0752b81312B03249
11133B5733a14641B64273D9243J03703D8907P1196d15580J70563B29700c3383
11122e6654D2285N4119e0311B41816j06307a33080l17585A04676R1131b3101G6589
11110b02419G4126i9643k2275B77312a43235e2760B86527a26066D6199K98551
11100C44750a5405A0249K75366M9611A66010p2729P0231m1015J52173q9852q3696
11089A01122D3910d5710A17263L10862A98357C6981Q7938L8063N2394H4254e3086
$$ plain form
11167 28492 -306467 130339 -29765 16340 -106853 -136001 132126 8620 -68019 -24547 -107482
11156 -107482 -74598 150680 274267 322276 -338418 56032 -130596 76700 -67389 250403
11145 30918 9030 -171272 162934 -545399 -86743 6232 -298294 -80826 20752 -281312 203249
11133 25733 -114641 264273 49243 152946 48907 120103 -415580 -245017 229700 -33383
11122 -56654 42285 96404 -50311 241816 135509 -133080 -450665 104676 195807 -23101 76589
11110 -202419 74126 -99643 -121918 277312 -143235 -52760 286527 -126066 46199 344750
11100 344750 -15405 10249 285615 335226 166010 93281 163512 122497 274670 184818 101122
11089 101122 43910 -45710 117263 428125 198357 36981 124919 162982 215376 84254 -53086
11077C40941j01547o7425K12305A15822a1801D24191A92469P3812m370J90117
11067D52028J83305j97074B8522M56537k07433j34952K6103N13569j29954j42645
11057D09747l7758L75688j08672p1544n0980k06250K51576j00582J87080k77784
11047C70521m8852J27875J59614j16490L18201O2672K6325k08305j82049K70806
11037G80318o1135Q52n9672K34355J01847O6509l13661j33610Q0831j99382L53176
11026H50428k50563K26540P4163j88188j26442J41234J9134M96916l26107m7415
11016H69700r4652k16428B62463J50836N5258p2474Q5528j21059N7040R9819j79687
11005C37724J71274p3193J57725L6980N802O9704k1371r4135K3433L78468l56395
$$ plain form
11077 340941 239394 171969 384274 115822 -11801 424191 192469 266281 261911 452028
11067 452028 635333 438259 28522 485059 277626 142674 168777 682346 552392 409747
11057 409747 371989 747677 639005 567461 516481 310231 561807 461225 648305 370521
11047 370521 321669 449544 609158 492668 810869 873541 899866 691561 509512 780318
11037 780318 719183 720035 660363 894718 996565 1063074 749413 615803 696634 497252 850428
11026 850428 599865 826405 900568 712380 585938 727172 746306 1243222 917115 869700
11016 869700 775048 558620 262463 413299 468557 396083 481611 360552 417592 517411 337724
11005 337724 508998 435805 593530 630510 636312 706016 684645 590510 613943 992411 636016
10994F36016K80371l36343J4542J89921j47041L8248k9171p264K05169l94242
10984D50206J56461K70946o0660k94441L13767M49290k29472J19075k77767K08451
10974A105856J74268K71243l5639M23955L6123J27167j50680P12317l12227K83727
10964B636110l96111K47525O9780r7007o73311k0303k76866n5602K50510l42346
10954A342379l35691N9494K6851q4396R6369K7367l53884k74651K3583k53204
10944B74217K10623Q2314j54677j58538K48767o9174A0310a57322A47554L19217
10934D66771j85040E1022d37455B54852a0838A93981c47912a07409A23664q98
10924A22766L9884n1567K30104e0094b3877j90541A44360a76350I1966I508f4882
$$ plain form
10994 636016 916387 580044 594586 784507 637466 675714 646543 639279 844448 450206
10984 450206 606667 877613 816953 522512 836279 1285569 1056097 1175172 897405 1105856
10974 1105856 1280124 1551367 1515728 1939683 1975806 2102973 1952293 2664610 2352383 2636110
10964 2636110 2239999 2487524 2557304 2460297 1786986 1766683 1489817 1434215 1684725 1342379
10954 1342379 1006688 1066182 1093033 1008637 1105006 1132373 778489 503838 527421 274217
10944 274217 484840 567154 412477 253939 502706 433532 10310 -157322 147554 466771
10934 466771 281731 51022 -437455 254852 -10838 193981 -347912 -107409 123664 122766
10924 122766 162650 111083 341187 -50094 -23877 -214418 144360 -176350 91966 9508 -64882
10912I1286M6565b27852J09971B82682r7262i2027A87928a79918G9946J96274
10902B76220b9738H7511J24923E5675g1094A98173h8486C17596C6789Q1867h8886
10890G2998J19239n3461a70269J3542F1342a22256k6039p0570E5957a28859j28901
10879b57760J09943G0859J95372a82902J4185f8834m0309k61381a26068m6199
10869a72267J1194L2460J724A1641J27475e6140L9j85910K8445f9783j54695A7695
10856a20417l23192I0251a01381G5917a49707K7921l1478d5046j54605j0664A04967
10844a46036j55360B8611g404A98650l9379a94825L8890F0004r170b26237j38489
10833c64726a9067l1047j52084B04567m4708e3740A08972c25009a01869b8701
$$ plain form
10912 91286 137851 -227852 -117881 282682 185420 -92027 187928 -179918 79946 276220
10902 276220 -29738 87511 212434 55675 -71094 198173 -88486 317596 36789 118656 -88886
10890 72998 192237 138776 -170269 -156727 61342 -122256 -148295 -218865 55957 -128859 -257760
10879 -257760 -147817 70859 266231 -182902 -168717 -68834 -109143 -370524 -126068 -172267
10869 -172267 -161073 -128613 -126889 11641 139116 -56140 -56101 -242011 -213566 -69783 -224478 17695
10856 -120417 -443609 90251 -101381 75917 -149707 -121786 -153264 -45046 -199651 -210315 104967
10844 -146036 -301396 28611 -7404 198650 159271 -194825 -155935 60004 50834 -226237 -364726
10833 -364726 -19067 -50114 -202198 204567 159859 -53740 108972 -325009 -101869 -28701
10822f488q7776k13595l9097I7884c27068a25193J0947B7471a5124A1977b4459
10810c14998Q7825G4258P3047j6293c28777B19482H2791b4119A11374a14631E9902
10798I5186h9516B3020J37585I449a10868I6542d6914p4524C8132g0443n0482
10787a20925N6993B59414a2934A03165i4656d2521J8675j94623a9757G9270B6281
10775c3709p0518G0585f2392A87987a04045j83547A1324a40377A28264L11d81234
10763B40977a34n4339A47442b76252A74738D8782m337h6777l33285D58135E2141
10751d61080b0264A11557m6202J04515G8742a49825B96547b05141A85120a56083
10740a43732d7531B07607c97120h1467m6642C09798D7223b1090j08227c4458n3122
$$ plain form
10822 -6488 -94264 -307859 -346956 97884 -327068 -125193 -114246 27471 -15124 11977 -24459
10810 -314998 -227173 74258 147305 131012 -328777 219482 82791 -24119 111374 -114631 59902
10798 95186 -89516 23020 160605 9449 -110868 96542 -46914 -121438 38132 -70443 -120925
10787 -120925 -63932 259414 -12934 103165 -94656 -42521 -23846 -218469 -19757 79270 26281
10775 -33709 -104227 70585 -62392 187987 -104045 -287592 11324 -140377 128264 128575 -481234
10763 240977 -134 -54473 147442 -276252 174738 48782 44445 -86777 -420062 458135 52141
10751 -461080 -20264 111557 65355 169870 78742 -149825 296547 -205141 185120 -156083
10740 -143732 -47531 207607 -397120 -81467 -128109 309798 47223 -21090 -129317 -34458 -87580
10729h7580p4336k64656g8617j87224a05549C1661b59047R8973N5549F6473b16743
10717B47411e1771A53425i1127k99381a61237M6776j58250a02844l06277a12864
10706a96799A41522C2767J01475A700a65731B0362J92947h051k5898n0842J379
10695h3412d1255m1636A3492j024f8292n778A04489d1507B40798f3853k87666
10684c51519J59288h1471j67828l5586D4027M0623J11682r0063N0482j1593f0755
10672a50108g4393j74521C39176a32453l2854F0605L50957j06417d8376j14036
10662a62412E3579c20273a40374N6863b3466A76267j5660B2386f2364k4457K6773
10651f0048l19230a386o6288A732b97509i6374a5027j17279D9140g0773l14613
$$ plain form
10729 -87580 -161916 -426572 -78617 -265841 -105549 31661 -259047 -160074 -104525 66473 -216743
10717 247411 -51771 153425 -91127 -390508 -161237 -114461 -272711 -102844 -409121 -112864
10706 -196799 141522 32767 134242 1700 -165731 20362 213309 -8051 -33949 -84791 -83412
10695 -83412 -41255 -82891 13492 12468 -68292 -74070 104489 -41507 240798 -63853 -351519
10684 -351519 -192231 -81471 -249299 -284885 44027 84650 196332 106269 156751 145158 -60755
10672 -150108 -74393 -248914 339176 -132453 -165307 60605 411562 305145 -48376 -162412
10662 -162412 53579 -320273 -140374 -83511 -23466 176267 160607 22386 -62364 -86821 -60048
10651 -60048 -379278 -1386 -67674 1732 -297509 -96374 -15027 -132306 49140 -70773 -385386
10640c85386J61333B84809a18709a3767m1053j83392A91288g8914p5147q1071
10630b35132a9259m28132b09710I8431J85517c51087B03481a89562k04284e63
10619e4955n8475J3311m18698k2342A98996G4771O2368a17392j70941p5070a52962
10607i3562j58103g5104G4699k2962i5743r8061R6326A48836e222j44383D3534
10595B84266D0489a13746N3663j15400F306e52801B43828G5819e56054f5985A0651
10583a31179E2797c2867p0920A21156c94371Q1337b7313B3912Q0886d4152j0462
10572e4614C51852b37808B526h1786A55207l4067a38274j0534r3082N0201R099
10561a82590I4194m2155a34884C58891a5924N246F8727J12137l9846p0253J3115
$$ plain form
10640 -385386 -224053 284809 -118709 -13767 -54820 -238212 191288 -78914 -154061 -235132
10630 -235132 -19259 -447391 -209710 98431 283948 -351087 203481 -189562 -393846 -563
10619 -54955 -113430 -100119 -518817 -541159 198996 74771 137139 -117392 -288333 -363403 -152962
10607 -93562 -251665 -75104 74699 51737 -95743 -193804 -97478 148836 -5222 -149605 43534
10595 284266 40489 -113746 -60083 -175483 6306 -552801 243828 75819 -556054 -65985 10651
10583 -131179 52797 -32867 -103787 121156 -394371 -313034 -27313 23912 104798 -44152 -54614
10572 -54614 351852 -237808 2526 -81786 155207 121140 -138274 -148808 -241890 -191689 -182590
10561 -182590 94194 52039 -134884 358891 -15924 -10678 68727 180864 141018 70765 83880
10550H3880f7457m3882A0861a32224b0785B02623b40471o0751J02458A37246K26656
10539C63902i818J471q5951B3274R611A0098J44787f5004D9343c4732j20206A5140
10526b31221b4057l1867l6506B22106a49515r4662b2534k19370B32252i2820J6546
10515g6274j23965J9813b6018F4147a95911p6772B36137b70671Q09f6978G569
10503C9676g1214A40450a44454b544j29661G287c9668m2897A06774r240P7356
10492A74890a18608d1072A0344L23185c63365C8986f4096J8275J5596j87208M9662
10481a67771j92661a04510L4917C2064f689B5967a54595j78881a32295p412a4022
10469a35570H6163J65426c3483j19670K6041B8327K25001n7989a24944G3950d4529
$$ plain form
10550 83880 -67457 -111339 10861 -132224 -20785 202623 -240471 -301222 -198764 137246 363902
10539 363902 -9818 -8347 -94298 23274 32885 10098 154885 -65004 49343 -34732 -154938 15140
10526 -231221 -24057 -55924 -92430 222106 -149515 -244177 -22534 -241904 232252 -92820 -76274
10515 -76274 -200239 -180426 -26018 64147 -195911 -272683 236137 -270671 -269862 -66978 7569
10503 39676 -71214 140450 -144454 -2544 -132205 7287 -39668 -82565 106774 97534 174890
10492 174890 -118608 -41072 10344 333529 -363365 38986 -64096 -45821 -30225 -217433 -167771
10481 -167771 -360432 -104510 -69593 32064 -6689 25967 -154595 -333476 -132295 -139707 -14022
10469 -135570 86163 251589 -33483 -153153 -127112 28327 253328 195339 -124944 73950 -44529
10457G1836Q6775o2973a67192B7701d72144a77913F2939c16797d0673k37610C223
10445d9453b783k6495l65650B2105a52752l4956d6705r1154A86099c9199E369
10433H2843J12256F5457b56470P0101j34818a01984A72313b32638E4606g8730
10422e8718a2884j00995A07380C3325b31232G0539J25835C7025b0023j58724j81315
10411c60062i3366A54485b30279A23883P6528H1617k5837c1650l6614l9125G9573
10399g7670j17656r289A4552J61634a53803C38296c13541f0066C28352n2676o13
10388B75063h5998B38034a9497l98570c6401C31730a16022A03366K80908A2108
10377A66702J91205j14680j09048J61567f4448k7133C46053d0311j093D86966
$$ plain form
10457 71836 158611 95638 -167192 27701 -472144 -177913 62939 -316797 -40673 -278283 3223
10445 -49453 -2783 -29278 -394928 22105 -152752 -187708 -46705 -137859 186099 -39199 5369
10433 82843 195099 65457 -256470 -186369 -321187 -101984 172313 -232638 54606 -78730
10422 -58718 -12884 -113879 107380 33325 -231232 70539 196374 37025 -20023 -178747 -360062
10411 -360062 -93366 154485 -230279 123883 200411 81617 55780 -31650 -68264 -107389 79573
10399 -77670 -195326 -204615 14552 176186 -153803 338296 -313541 -60066 328352 275676 275063
10388 275063 -85998 238034 -19497 -418067 -36401 331730 -116022 103366 384274 12108
10377 166702 357907 243227 134179 295746 -64448 -91581 346053 -40311 -41404 486966
10366b1188D56094q9565J55336B27324l6189K37409A22523J32025m914c196H2695
10354A65287j8644m53K96610A19801J21190K57179q5323K05825k43936p961A55067
10342C56752b83216B87216J13453J1503j52630j21894L45424i6986M8234B78578
10331B1580J64817P8788F3038h6097A97083K6093j07743d065A68388k0281l6898
10320A11209b20734A85663B6441K11199b34748A39741a7395m5892j52111A38549
10309C06089d4185q0356k63607O7274J21761F93J20907b78029G5892b6186j58564
10298a84750A83733B5718K08585j12280n1863J1699K70271c47127E7573J09547
10288A67120L333C9489a39804d5541J3682B80502h3532m2153M1380H9060a88159
$$ plain form
10366 -21188 456094 366529 521865 227324 191135 428544 122523 254548 249634 -3196 82695
10354 165287 146643 146190 442800 119801 240991 498170 412847 618672 374736 366775 155067
10342 356752 -283216 287216 400669 412172 259542 137648 483072 -96986 -48752 278578
10331 21580 186397 265185 63038 -86097 197083 223176 115433 -4065 168388 148107 111209
10320 111209 -220734 185663 26441 237640 -234748 139741 -17395 -63287 -215398 138549
10309 306089 -44185 -124541 -388148 -320874 -199113 693 121600 -278029 75892 -26186 -184750
10298 -184750 183733 25718 234303 122023 70160 81859 352130 -347127 57573 167120
10288 167120 170453 39489 -139804 -45541 -31859 280502 -83532 -125685 -84305 89060 -188159
10276b77039O6797I8500d6999B10375a3790j07199k0673B13066E8734J5391a02510
10264D1509i7912A108g6234B06099q2053B8284a50242C39352B6964d3696B23625
10252E5576K25032K2454J0447A5901n463K3457b63119a5753k02758A23119a57485
10240b07669E233c350E0183c1074F0279a08719o3839A91016d0132o0789A7863
10228b61246i9170a8730k58278J26130j8075g4003l13083Q0601O276b66q9397
10217h9663A16988J83946a08191A08696c03804B03831B7621b42925f0478m5164
10207a05642j27492e2632B01933a06625A05612f6303k87728L7619i9915K4043
10197g5872B06375m8252O4040D7535a11604l9890k96959b05830Q4985a7149l17240
$$ plain form
10276 -277039 -210242 98500 -46999 210375 -13790 -120989 -141662 213066 58734 74125 -102510
10264 41509 -97912 1108 -76234 206099 124046 28284 -150242 339352 26964 -43696 223625
10252 55576 280608 303062 313509 15901 10438 33895 -263119 -15753 -218511 123119 -157485
10240 -207669 5233 -3350 50183 -31074 60279 -108719 -172558 191016 -40132 -100921 17863
10228 -261246 -99170 -18730 -277008 -150878 -168953 -74003 -387086 -306485 -300209 -266 -89663
10217 -89663 116988 300934 -108191 108696 -303804 203831 27621 -242925 -60478 -105642
10207 -105642 -233134 -52632 201933 -106625 105612 -66303 -354031 -316412 -99915 -75872
10197 -75872 206375 158123 222163 47535 -111604 -151494 -448453 -205830 -120845 -17149 -334389
10186c34389a2683j31037I546R6548c93586J08509a02487j58316C46771F7609
10175f646J123A64723d04157d013k46463E067c7225j32914A06356M5371b93758
10163b19167e490p5147b2752q7347I9860a53769k7307B17116q5222C4156a26514
10151A64319k8825C4063K56236k9486r4502g8370B76086A29415f1110A58018c1661
10139B67064b29778N7390l4354j78907J3205a978j89231A40057c62667a17943
10128A9032b73237R3454B9112J5983b93981J23239A24636a32439B50484B9636
10117b13291b5882B06214b97761a48545n0996m9420A24733D3640d32412e5706
10106h5842o2953A12932c04151A3810K3173K6197a84021A081g8826n15E146c05034
$$ plain form
10186 -334389 -12683 -143720 9546 106094 -393586 -285077 -102487 -260803 346771 67609
10175 -6646 -5523 164723 -404157 -4013 -250476 5067 -37225 -170139 106356 151727 -293758
10163 -219167 -5490 -80637 -22752 -110099 99860 -153769 -181076 217116 131894 34156 -126514
10151 164319 135494 34063 290299 260813 166311 -78370 276086 129415 -61110 158018 -31661
10139 267064 -229778 -172388 -206742 -385649 -372444 -1978 -191209 140057 -362667 -117943
10128 19032 -273237 -179783 29112 45095 -293981 -170742 124636 -132439 250484 29636
10117 -213291 -25882 206214 -297761 -148545 -199541 -248961 124733 43640 -432412 -55706
10106 -85842 -148795 112932 -304151 13810 36983 63180 -184021 1081 -78826 -79341 5146 -305034
10093b44413A20682b46331j70404e2844j03316f5208C59377A50608b4734k35903
10083b60637J14364j7626k00992A23613B1860J17728a44854d6844A29676a24225
10072A56813c85175H0467d5703m43013a95438K0739q6527J15868H7872d644A42348
10060A69181a66605l1397A43030j1415c32859J4175G2950A3311a37478A7366J00443
10049A17809c8792J8858k41457E186g7570j2147P075A75627J44717a46701f7048
10037b9747p7429K0141A46302Q1289m2746b25600I77f5882k08382a08070k07890
10026c15960L67j75143f9676B7473h3636a2780A34993c5754j10201p3533A85377
10014a02394E928J1615J70120I1531C494h1883H6150J35994d59604b1556A9594
$$ plain form
10093 -244413 120682 -246331 -416735 -52844 -156160 -65208 359377 150608 -24734 -260637
10083 -260637 -146273 -163899 -364891 123613 21860 139588 -144854 -46844 129676 -124225
10072 156813 -385175 80467 -45703 -488716 -195438 -174699 -261226 -145358 87872 -4644 142348
10060 169181 -166605 -198002 143030 131615 -332859 -318684 72950 13311 -137478 17366 117809
10049 117809 -38792 -19934 -261391 5186 -77570 -89717 -82642 175627 320344 -146701 -67048
10037 -29747 -107176 -87035 146302 227591 184845 -225600 977 -65882 -274264 -108070 -315960
10026 -315960 -315593 -490736 -69676 27473 -83636 -12780 134993 -35754 -145955 -219488 185377
10014 -102394 5928 17543 187663 91531 3494 -81883 86150 222144 -459604 -21556 19594
10002D225K9813c00069f0343n9390j15842A2503i3960j18617B42379a9661r7404
9991a17065j36413A11680f5493G1091a96728j7119c6390l3467l94702a66645l5545
9980b02190f5575b0565j60927B8177b48690M961J19797L6292l81587a71245a2313
9968b07220O8307B30993a91163o8591J8215d150A07764b86340J42584A80446q1452
9957I8994b983m48816b15590p6308A53920a49518j7594A0367K57425e88902a20649
9945a7748A56462J10791a7555A94212f0193j19956A33907a56781K8711G4899k6548
9934D8351b22587B77975c7381k17407k83077a69965h607C51443D7422J35968l7068
9923A46322c36096e9427A36034M0691a34278M9220I7130A1963b55724h7150B87024
$$ plain form
10002 4225 34038 -300069 -60343 -119733 -235575 12503 -93960 -212577 242379 -19661 -117065
9991 -117065 -253478 111680 -65493 71091 -196728 -213847 -36390 -69857 -464559 -166645 -202190
9980 -202190 -65575 -20565 -181492 28177 -248690 -243729 -123932 -87640 -469227 -171245 -12313
9968 -207220 -138913 230993 -191163 -259754 -241539 -4150 107764 -286340 -143756 180446 98994
9957 98994 -2983 -451799 -215590 -291898 153920 -149518 -167112 10367 267792 -588902 -120649
9945 -17748 156462 267253 -17555 194212 -60193 -180149 133907 -156781 -128070 74899 48351
9934 48351 -222587 277975 -37381 -254788 -537865 -169965 -8607 351443 47422 183390 146322
9923 146322 -336096 -59427 136034 176725 -134278 -85058 97130 11963 -255724 -87150 287024
9911e9752E6140F939c48029b9229Q598D2314d8102j07382j87330b6134j48058
9900a74192B2378b39230a4770q6547B4014b60906A45710l0188j2164k5710b40632
9888c7657e343j37800D8136b5475j64902D6730e6378m8086M4951j86283e529j12781
9876a18310k87405A8287d45718i2991L1173A10102a94193k0944g8981k26950a31365
9864b1744l7056I1247c5863k00939N9423A0804J55149c20730D4771Q5561K2792
9853A53124e1179j00600C88241a48734A20060m3291Q5059m5596c4380k84797F0956
9841h8613G8666K82539b7787B09357O6260a35447A3258f5173C01348E6673b06808
9829b78956l1689A51663b8728C521b8193k75321a11785A79959F1963a68431k73342
$$ plain form
9911 -59752 56140 6939 -348029 -29229 -20631 42314 -48102 -155484 -342814 -26134 -174192
9900 -174192 22378 -239230 -14770 -101317 24014 -260906 145710 115522 103358 77648 -240632
9888 -37657 -5343 -143143 48136 -25475 -190377 46730 -56378 -104464 -59513 -245796 -5529 -118310
9876 -118310 -405715 18287 -445718 -92991 -61818 110102 -194193 -215137 -78981 -305931 -131365
9864 -21744 -58800 91247 -35863 -236802 -177379 10804 165953 -320730 44771 130332 153124
9853 153124 -51179 -151779 388241 -148734 120060 76769 161828 116232 -34380 -319177 60956
9841 -88613 78666 361205 -27787 209357 275617 -135447 13258 -65173 301348 56673 -206808
9829 -278956 -310645 151663 -28728 3521 -28193 -303514 -111785 179959 61963 -168431 -441773
9818d41773J44557P0934a12369j82457f1462D3561b51613Q5683N7572A05696b5632
9806h034j37821N9959j01666P6777l12916a53229L1637J9137I6600J80007d40085
9794a75794B0763c32634c9333n7115j89063K1067E5737a55296G351a35521j55935
9783b91456b7661j26159r5415A66803F9859J18249J538a28027l9465K9282B18965
9771a23819e7212r548k44212B19808J08641I3869f1251K9020k37767A68687F5300
9759A05679C0472h6904k06989h3148n2411m3134P2344H8508e3010o4255p7891
9748a95156P3740k55977a80867N8320N3779k0497F4282b34942n1701H5521L1545
9737A17066i1074G9146i7197k87892B1839K50275E7102b51918h0556m3613A51560
$$ plain form
9818 -441773 -297216 -226282 -112369 -294826 -61462 43561 -251613 -165930 -108358 105696 -25632
9806 -8034 -145855 -85896 -187562 -110785 -423701 -153229 -121592 -102455 96600 276607 -440085
9794 -175794 20763 -332634 -39333 -96448 -285511 -264444 55737 -155296 7351 -135521 -291456
9783 -291456 -27661 -153820 -249235 166803 69859 188108 189646 -128027 -167492 -138210 218965
9771 -123819 -57212 -66760 -310972 219808 328449 93869 -61251 -32231 -269998 168687 65300
9759 105679 30472 -86904 -293893 -83148 -135559 -178693 -106349 88508 -53010 -117265 -195156
9748 -195156 -121416 -377393 -180867 -122547 -68768 -89265 64282 -234942 -286643 85521 117066
9737 117066 -91074 79146 -97197 -385089 21839 272114 57102 -251918 -80556 -124169 151560
9725A37057a34662p7624B2072f0052A03319g6924k34192a44531l0295A69365e7839
9713B85953G051e5054j82163d9760C5032E981M0474a36118D6895M9867c5105B41369
9700a71911A7583a26866C06809e3752A0387M0789c04458b9473I7030a24128c3368
9688c77133i9779A29907a30761A99268h6553n6567B29032d8049I3530e0151e617
9676b99505J09985m1810a1634A7729N4196P1051c68229P2185D1407a14670p0308
9665a84978O442a7214E4544g4873k91653a53113M4829j45433j20043J43210A34294
9653b3229j60820K0479G9050b78050A7437e8768K1595j50748e0431B89723M1616
9642C31339a41654e283E467K10429a6517q8301j77878j69782h0298A05777a35237
$$ plain form
9725 137057 -134662 -212286 22072 -60052 103319 -76924 -311116 -144531 -174826 169365 -57839
9713 285953 7051 -55054 -237217 -49760 35032 5981 46455 -136118 46895 96762 -35105 241369
9700 -171911 17583 -126866 306809 -53752 10387 51176 -304458 -29473 97030 -124128 -33368
9688 -377133 -99779 129907 -130761 199268 -86553 -143120 229032 -48049 93530 -50151 -5617
9676 -299505 -189520 -231330 -11634 17729 71925 142976 -368229 -296044 41407 -114670 -184978
9665 -184978 -178536 -17214 54544 -74873 -366526 -153113 -108284 -253717 -373760 -230550 134294
9653 -23229 -184049 -163570 79050 -278050 17437 -58768 -37173 -187921 -50431 289723 331339
9642 331339 -141654 -5283 5467 215896 -16517 -104818 -282696 -452478 -80298 105777 -135237
9630h2001B04713c3989G080J5569i0813k81947J44448M8357m55298A34284C2511
9618a80483n469C3923b15597a3246D0976a10326H3348c3945j69979F1151a26160
9606a75507e9158J4817j83562C33109H866b80904B33730b83003J01807l0600B1745
9594a59582g4645A01169J82476h5924j67269A0409a07854A1525b46028i1049I4302
9582b32350n2849a34984j67739I1219h7709k15210I4057c11395a45287r0017P7830
9571a57474P881B79587b73393D6522b23843o5818D22922a16478A51003a7369q1383
9560i8752C96553F1852b65460k37935G5736R7918b00300A5439a44504A21320D5399
9548A16338g9240F5409J42116n2563a70719e3143k31587R2944O1671j33186A86724
$$ plain form
9630 -82001 204713 -33989 7080 22649 -90813 -372760 -228312 -179955 -635253 134284 32511
9618 -180483 -185952 33923 -215597 -13246 40976 -110326 83348 -33945 -203924 61151 -126160
9606 -175507 -59158 -44341 -227903 333109 8866 -280904 233730 -283003 -181196 -211796 21745
9594 -159582 -74645 101169 283645 -85924 -253193 10409 -107854 11525 -246028 -91049 94302
9582 -232350 -285199 -134984 -302723 91219 -87709 -302919 94057 -311395 -145287 -235304 -157474
9571 -157474 -149593 279587 -273393 46522 -223843 -289661 422922 -116478 151003 -17369 -98752
9560 -98752 396553 61852 -265460 -503395 75736 173654 -200300 15439 -144504 121320 45399
9548 116338 -79240 65409 207525 154962 -170719 -53143 -284730 -191786 -130115 -263301 186724
9536h0626H6496a6664m312r7092I2079a40626K5654N737j50078M3329a01175k51263
9524c52438A39364i5167j949j76722f1325F3926H21M07871c0154j76964A2088
9512A59963a95317C3448a56654H3883b88357a19477G1282k3673i8957n4141j13210
9501b66308N8734d4957j91940B43837j21518O180k3331A9643a06718j29441H8295
9489h2834k55947A18780a02343r5413N4957A70641D587L0040a92091R5105A98554
9477c03493B54967a4878j07547j3290F6241l1943J38542c42974a44686A90634
9466b19036g0337K1888D3711K66359A346b95569h419M19j75833A42603a18181
9454g310l50207A7832b71563r9579H8241a49766c7066p304d256j52751g910A14013
$$ plain form
9536 -80626 86496 -16664 -20976 -118068 92079 -140626 -114972 -109235 -259313 -215984 -101175 -352438
9524 -352438 139364 -95167 -97116 -273838 -61325 63926 821 408692 -30154 -207118 12088
9512 159963 -195317 33448 -156654 83883 -288357 -119477 71282 47609 -98957 -153098 -266308
9501 -266308 -207574 -44957 -236897 243837 122319 128499 105168 19643 -106718 -236159 88295
9489 -82834 -338781 118780 -102343 -197756 -142799 170641 4587 34627 -192091 -96986 198554
9477 -303493 254967 -14878 -122425 -135715 66241 34298 172840 -342974 -144686 190634
9466 -219036 -70337 -48449 43711 310070 1346 -295569 -8419 -8000 -183833 142603 -118181
9454 -7310 -357517 17832 -271563 -371142 88241 -149766 -37066 -44370 -4256 -157007 -7910 114013
9441A28925a30400P29K0613E0004K55223e4484A74098d4471p001A1732b32968
9429a24566k31553d5516A05238J21387j1889I7344b64569n8801A90234a12809
9418c67884R2001a13628I433a67501I6638a23488F259c49355f8508q4024j32818
9407b85350i653k11140B8620d22905E2434a07526j58315Q3588P5561j84449a43542
9395C09737j53227a42977G0099B6613I653b13658M4302j4257A20626e9127k24968
9384b84095a11301p0498A25043a00724q0469h8506l12572C7280a45179G5361K03605
9373B78966r2561A4021J17462a57491j98589J28173A64022i3986I8187a99682
9362C4895f4584p3860b7231B82704c7546r9541N459b1976C9079h7271B13899B8701
$$ plain form
9441 128925 -130400 -129671 -109058 50004 305227 -54484 174098 -44471 -51472 11732 -232968
9429 -124566 -356119 -45516 105238 226625 214736 97344 -264569 -323370 190234 -112809
9418 -367884 -275883 -113628 9433 -167501 96638 -123488 6259 -349355 -68508 -152532 -285350
9407 -285350 -9653 -220793 28620 -422905 52434 -107526 -265841 -182253 -106692 -291141 -143542
9395 309737 156510 -142977 70099 26613 9653 -213658 -169356 -183613 120626 -59127 -284095
9384 -284095 -111301 -181799 125043 -100724 -181193 -88506 -401078 37280 -145179 75361 278966
9373 278966 186405 14021 131483 -157491 -356080 -227907 164022 -93986 98187 -199682
9362 34895 -64584 -138444 -27231 282704 -37546 -137087 -131628 -21976 39079 -87271 213899 28701
9349d6732J9732r6862q3994J01652J9676C10280a63828d8026B03161Q00o6384
9338A37577a68696j04745q9631A42388b53593D2114c9974A65268a04538G8874
9327I4162a850k06167k6932J15497b9822h239H8547N6711b12847E4624a13757
9315B98553i7300B3098a3560l5261F6664J45741b90636a4703j16361a4909I5062
9303a83769H4763d4764k01934M4857k40677a8141A66889c3146k61308i8913j36872
9292b35785O4726a9277A03635K74806m8395E4689c11526A12660a30388C7473a50933
9280d5260m477j77725b1415r7765j05073o1028k7622i0547j71674d1124q5375
9269a26499H3852R3351b28867L3134G0935K19069d07317O9996B657d8256p0357
$$ plain form
9349 -46732 -27000 -123862 -207856 -106204 -86528 310280 -163828 -48026 203161 203961 137577
9338 137577 -168696 -273441 -363072 142388 -253593 42114 -39974 165268 -104538 78874
9327 94162 -1850 -208017 -234949 -119452 -29822 -8239 88547 145258 -212847 54624 -113757
9315 298553 -97300 23098 -13560 -48821 66664 212405 -290636 -14703 -131064 -14909 95062
9303 -183769 84763 -44764 -246698 -201841 -442518 -18141 166889 -33146 -294454 -98913 -235785
9292 -235785 -171059 -19277 103635 378441 330046 54689 -311526 112660 -130388 37473 -150933
9280 -45260 -49737 -227462 -21415 -119180 -224253 -285281 -312903 -90547 -262221 -41124 -126499
9269 -126499 83852 177203 -228867 -195733 70935 290004 -407317 -337321 2657 -48256 -118613
9258a18613D8926L5460b22661O0385H43b8950B8224b69381A30347n4689a11960
9246h4460l479m7757e2829k27064b7084r2626b7076j28395f2898l8937A37520
9234b91090D2044a32067A09304a61305l1453H7308C2354c39368B03841a15521
9223A26890b13636d733D7775B0856K11879C8900c9682j69501E2474a422j41565
9212a42987f8856j74849A0841a33835j16981j23206A09578a95095k9751m035F1097
9200i080A44739o1779k9476g764A64236a09646A931L0735O6365b0239l8418j27277
9188a85934A61943E7492h1808G0446G995d9632k17171b2630j62333j75237j26240
9177d86440J09010I6984b06330C04654h8278A11898P2942a08788M1726j63631
$$ plain form
9258 -118613 48926 84386 -222661 -162276 843 -28950 28224 -269381 130347 75658 -111960
9246 -84460 -87939 -135696 -52829 -279893 -27084 -119710 -27076 -155471 -62898 -101835 137520
9234 -291090 42044 -132067 109304 -161305 -192758 87308 32354 -339368 203841 -115521
9223 126890 -213636 -4733 47775 20856 232735 38900 -39682 -209183 52474 -1422 -142987
9212 -142987 -68856 -243705 10841 -133835 -250816 -374022 109578 -195095 -224846 -228881 61097
9200 -9080 144739 82960 53484 -7764 164236 -109646 1931 32666 99031 -20239 -58657 -185934
9188 -185934 161943 57492 -81808 70446 7995 -49632 -266803 -22630 -184963 -360200 -486440
9177 -486440 -377430 96984 -206330 304654 -88278 111898 184840 -108788 -67062 -230693
9167b30693b4942A61422C2858d9011A6057b44908d6046J2430k41130A088J3787
9156A4875b3394m48521D646b22081m9754F6354C808a6445B05402b24437o659b0891
9143b20957i4411o0377b6121D3562f8836O672j6456i567B48687G2720i8458A40318
9130b4926j0386j48090A64181h9286k09055A4930Q5113d5880F8721a85280L2116
9119a53164H513J34998F274R2498b64936h7098i160r1563H5785h9661m6385L8013
9107i8033j76872A10565M2020Q5439a36105N8970j54020B05616b08127c6644Q698
9096b7946A05698C4302a92191A47555K55295A5176K06909f4728m01089a59590
9085b30479L1467A21687a68154g4452b2620A08628L1235b67831J26058j02131
$$ plain form
9167 -230693 -24942 161422 32858 -49011 16057 -244908 -46046 -33616 -274746 1088 14875
9156 14875 -23394 -471915 4646 -222081 -271835 66354 3808 -16445 205402 -224437 -231096 -20891
9143 -220957 -94411 -154788 -26121 43562 -68836 -62164 -78620 -9567 248687 72720 -98458 140318
9130 -24926 -35312 -183402 164181 -89286 -298341 14930 100043 -45880 68721 -185280 -153164
9119 -153164 8513 143511 6274 98772 -264936 -87098 -9160 -100723 85785 -89661 -136046 -98033
9107 -98033 -274905 110565 152585 238024 -136105 -77135 -231155 205616 -208127 -36644 -27946
9096 -27946 105698 34302 -192191 147555 402850 15176 222085 -64728 -465817 -159590
9085 -230479 -199012 121687 -168154 -74452 -22620 108628 139863 -267831 -141773 -243904
9075b43904B42656H3439i6848A68435b53935d1631A59658G3962J10568a64429
9064I1596a45920m7924b2043k12945a05534F0894b87868a31801H4417a99738o5862
9053b65600D03870b19152C16906a22301j16082B1747J77824f9911k75596h0827
9042e1660q8564j33936j50066a51101j32395P7063f040j17364A80854a6462l36996
9031c53458c171p9924L7341j78435B2049a03251K6084c0847A83725c492G2626
9019a29120B2046d1690A21642p398K76242I3497a51192n9029R1980K8086b3048
9007c8242j22128F4074J35534B7479b05452e8744C69795e851k36856j19228I9860
8995A5176f4081I0545k4427K0859d44647b21255A01716c71462J62989n4810a1441
$$ plain form
9075 -243904 242656 83439 -96848 168435 -253935 -41631 159658 73962 184530 -164429
9064 91596 -145920 -193844 -22043 -234988 -105534 60894 -287868 -131801 84417 -199738 -265600
9053 -265600 403870 -219152 316906 -122301 -238383 21747 199571 -69911 -345507 -80827
9042 -51660 -140224 -274160 -424226 -151101 -283496 -206433 -6040 -123404 180854 -16462 -353458
9031 -353458 -3171 -83095 -45754 -224189 22049 -103251 -77167 -30847 183725 -3492 72626
9019 -129120 22046 -41690 121642 114244 390486 93497 -151192 -210221 -118241 -90155 -23048
9007 -38242 -160370 64074 199608 27479 -205452 -58744 369795 -5851 -242707 -361935 99860
8995 15176 -64081 90545 66118 86977 -444647 -221255 101716 -371462 -208473 -263283 -11441
8983a21828o2129E6619a03113I9276d47158B0545O2338N7157j5727K41339a48668
8971d23784B75540b64099A81623a6768A49315b71023a26406E3693K5813O639c18132
8959A52430b80024G8566J62556H1948k5495a06125e3039l4563j08030j5661A13044
8947G0705j6010c00909G8788a6037l2881F0956a51977B8320a00511j4239J2828
8936a01922b2701n8413C1686b63909h109B51080G6833l8072L36951a55904C69035
8924B2443O7200L34586A43356M18573J123034O24073j54528p70367n16037C50778
8913D51002L37031l52454m3442r9779D1587J0065L9417b02580d8003a9625j36620
8902a56245k5110o4032A6118b61584A01143c20566h6021R352q7964J5812f6870
$$ plain form
8983 -121828 -183957 56619 -103113 99276 -447158 20545 82883 140040 124313 365652 -148668
8971 -423784 275540 -264099 181623 -16768 149315 -271023 -126406 53693 79506 86145 -318132
8959 152430 -280024 78566 241122 81948 56453 -106125 -53039 -87602 -195632 -211293 113044
8947 70705 54695 -300909 78788 -16037 -48918 60956 -151977 28320 -100511 -114750 -101922
8936 -101922 -22701 -81114 31686 -263909 -8109 251080 76833 38761 375712 -155904 369035
8924 22443 89643 424229 143356 561929 1684963 2309036 2154508 1384141 868104 350778
8913 451002 788033 435579 392137 292358 41587 51652 91069 -202580 -48003 -19625 -156245
8902 -156245 -181355 -245387 16118 -261584 101143 -320566 -86021 -76669 -164633 -148821 -66870
8890B77853b4045k16142E02396F6476a95671B5368f3010C09312a88921I1216c3448
8878a65915r710g7866H6736j4847b86412a1390j59850A77720e0310j445l4082
8867h5837k25501g2546C0719d09219D07346i3176A70401c7464k53787C97040b32212
$$ plain form
8890 277853 -24045 -240187 502396 66476 -195671 25368 -63010 309312 -188921 91216 -33448
8878 -165915 -175625 -77866 86736 71889 -286412 -11390 -171240 177720 -50310 -51755 -85837
8867 -85837 -311338 -72546 30719 -409219 407346 -93176 170401 -37464 -291251 397040 -232212
$$ [...]
##END NTUPLES=NMR SPECTRUM
##END=
