
##TITLE=AC1259_UGARH11076_6642258_PZneZf6MWy
##JCAMPDX= 6.0         $$ Bruker NMR JCAMP-DX V2.0
##DATA TYPE= NMR SPECTRUM
##DATA CLASS= NTUPLES
##ORIGIN= BRUKER
##OWNER= Administrator
$$ 1.72 TOPSPIN		Version 2.1
$$ 2012-08-08 17:43:20.828 -0500  Administrator@TOPSPIN
$$ Compression mode = diff/dup
##.OBSERVE FREQUENCY= 400.02188249412
##.OBSERVE NUCLEUS= ^1H
##.ACQUISITION MODE= SIMULTANEOUS (DQD)
##.ACQUISITION SCHEME= undefined
##.AVERAGES= 64
##.DIGITISER RES= 22
##SPECTROMETER/DATA SYSTEM= spect
##.PULSE SEQUENCE= noesygpps1d.comp
##.SOLVENT NAME= COFFEE_meoh
##.SHIFT REFERENCE= INTERNAL, COFFEE_meoh, 1, 14.96264
##AUDIT TRAIL= $$ (NUMBER, WHEN, WHO, WHERE, PROCESS, VERSION, WHAT)
$$ ##TITLE= Audit trail, TOPSPIN		Version 2.1
$$ ##JCAMPDX= 5.01
$$ ##ORIGIN= Bruker BioSpin GmbH
$$ ##OWNER= Administrator
$$ $$ C:\Bruker\TOPSPIN/data/COFFEE/nmr/AC1259_UGARH11076_6642258_PZneZf6MWy/12/pdata/1/auditp.txt
$$ ##AUDIT TRAIL=  $$ (NUMBER, WHEN, WHO, WHERE, PROCESS, VERSION, WHAT)
(   1,<2012-08-08 17:43:15.609 -0500>,<Administrator>,<TOPSPIN>,<go>,<TOPSPIN 2.1>,
      <created by zg
	started at 2012-08-08 17:31:45.296 -0500,
	POWCHK enabled, PULCHK disabled,
       configuration hash MD5:
       6B 1B 68 BB D9 2E 58 E2 7F 35 AD 54 07 DF 0E 41
       data hash MD5: 64K
       08 37 2A 2A 0B F5 48 D6 9D 4E 69 BB 2C CB 6F 29>)
(   2,<2012-08-08 17:43:18.531 -0500>,<Administrator>,<TOPSPIN>,<proc1d>,<TOPSPIN 2.1>,
      <Start of raw data processing
       efp LB = 0.3 FT_mod = 6 PKNL = 1 PHC0 = 0 PHC1 = 0 SI = 128K 
       data hash MD5: 128K
       F0 3F CB 7C 97 42 D3 10 C3 34 76 CE D4 4C 4B E4>)
(   3,<2012-08-08 17:43:19.875 -0500>,<Administrator>,<TOPSPIN>,<proc1d>,<TOPSPIN 2.1>,
      <pk PHC0 = -0.2911377 PHC1 = 0 
       data hash MD5: 128K
       C7 85 D1 17 E5 5D ED 89 FE 39 4C D8 68 3C C7 B7>)
(   4,<2012-08-08 17:43:20.500 -0500>,<Administrator>,<TOPSPIN>,<proc1d>,<TOPSPIN 2.1>,
      <abs ABSG = 1 
       data hash MD5: 128K
       2A 51 A5 09 60 4D BA 84 92 C7 EC 38 49 97 02 BF>)
(   5,<2012-08-08 17:43:20.578 -0500>,<Administrator>,<TOPSPIN>,<proc1d>,<TOPSPIN 2.1>,
      <abs ABSG = 2 
       data hash MD5: 128K
       7A 8D A6 5B 1F 97 84 87 DC 60 EB 1B 2C 67 9B 9F>)
(   6,<2012-08-08 17:43:20.640 -0500>,<Administrator>,<TOPSPIN>,<proc1d>,<TOPSPIN 2.1>,
      <abs ABSG = 3 
       data hash MD5: 128K
       14 21 C1 73 EF 71 FC 10 98 66 40 F2 14 C9 55 90>)
(   7,<2012-08-08 17:43:20.687 -0500>,<Administrator>,<TOPSPIN>,<proc1d>,<TOPSPIN 2.1>,
      <abs ABSG = 4 
       data hash MD5: 128K
       A5 3E 2A 0F 74 90 9B D1 73 24 E1 38 45 46 3F 7F>)
(   8,<2012-08-08 17:43:20.750 -0500>,<Administrator>,<TOPSPIN>,<proc1d>,<TOPSPIN 2.1>,
      <abs ABSG = 5 
       data hash MD5: 128K
       D0 7D D0 D0 E9 04 CE AB 30 3A 6A 61 6A 1E 2F FA>)
$$ ##END=
$$ 
$$ $$ hash MD5
$$ $$ 79 51 17 B8 52 51 E3 C5 DD 69 80 44 A7 3C F8 FB
##$RELAX= 
##$RELAX= 
##$RELAX= 
##$RELAX= 
##$RELAX= 
##$RELAX= 
##$RELAX= 
##$RELAX= 
$$ Bruker specific parameters
$$ [...]
##$TP07= 0
##$TPNAME0= <>
##$TPNAME1= <>
##$TPNAME2= <>
##$TPNAME3= <>
##$TPNAME4= <>
##$TPNAME5= <>
##$TPNAME6= <>
##$TPNAME7= <>
##$TPOAL= (0..7)
0.5 0.5 0.5 0.5 0.5 0.5 0.5 0.5
##$TPOFFS= (0..7)
0 0 0 0 0 0 0 0
##$TUNHIN= 0
##$TUNHOUT= 0
##$TUNXOUT= 0
##$USERA1= <user>
##$USERA2= <user>
##$USERA3= <user>
##$USERA4= <user>
##$USERA5= <user>
##$V9= 5
##$VALIST= <valist>
##$VCLIST= <CCCCCCCCCCCCCCC>
##$VD= 0
##$VDLIST= <DDDDDDDDDDDDDDD>
##$VPLIST= <PPPPPPPPPPPPPPP>
##$VTLIST= <TTTTTTTTTTTTTTT>
##$WBST= 1024
##$WBSW= 4
##$XGAIN= (0..3)
0 0 0 0
##$XL= 0
##$YL= 0
##$YMAX_a= 16897295
##$YMIN_a= -9704531
##$ZGOPTNS= <>
##$ZL1= 120
##$ZL2= 120
##$ZL3= 120
##$ZL4= 120
##$ABSF1= 14.96264
##$ABSF2= -5.595542
##$ABSG= 5
##$ABSL= 3
##$ALPHA= 0
##$AQORDER= 0
##$ASSFAC= 0
##$ASSFACI= 0
##$ASSFACX= 0
##$ASSWID= 0
##$AUNMP= <proc_prof1d_extract.lims>
##$AXLEFT= 0
##$AXNAME= <>
##$AXNUC= <1H>
##$AXRIGHT= 0
##$AXTYPE= 0
##$AXUNIT= <>
##$AZFE= 0.1
##$AZFW= 0.1
##$BCFW= 0
##$BC_mod= 0
##$BYTORDP= 0
##$COROFFS= 0
##$CY= 15
##$DATMOD= 1
##$DC= 0
##$DFILT= <>
##$DTYPP= 0
##$F1P= 0
##$F2P= 0
##$FCOR= 0.5
##$FTSIZE= 131072
##$FT_mod= 6
##$GAMMA= 0
##$GB= 0
##$INTBC= 1
##$INTSCL= 1
##$ISEN= 128
##$LB= 0.3
##$LEV0= 0
##$LPBIN= 0
##$MAXI= 10000
##$MC2= 0
##$MEAN= 0
##$ME_mod= 0
##$MI= 0
##$NCOEF= 0
##$NC_proc= -3
##$NLEV= 6
##$NOISF1= 0
##$NOISF2= 0
##$NSP= 0
##$NTH_PI= 0
##$NZP= 0
##$OFFSET= 14.96264
##$PC= 1
##$PHC0= -0.2911377
##$PHC1= 0
##$PH_mod= 1
##$PKNL= yes
##$PPARMOD= 0
##$PPDIAG= 0
##$PPIPTYP= 0
##$PPMPNUM= 2147483647
##$PPRESOL= 1
##$PSCAL= 4
##$PSIGN= 0
##$PYNMP= <proc.py>
##$REVERSE= no
##$SF= 400.020008981867
##$SI= 131072
##$SIGF1= 0
##$SIGF2= 0
##$SINO= 400
##$SIOLD= 131072
##$SPECTYP= <>
##$SREGLST= <1H.CDCl3>
##$SSB= 0
##$STSI= 131072
##$STSR= 0
##$SW_p= 8223.68421052631
##$SYMM= 0
##$S_DEV= 0
##$TDeff= 65536
##$TDoff= 0
##$TI= <>
##$TILT= no
##$TM1= 0
##$TM2= 0
##$TOPLEV= 0
##$USERP1= <user>
##$USERP2= <user>
##$USERP3= <user>
##$USERP4= <user>
##$USERP5= <user>
##$WDW= 1
##$XDIM= 131072
##$YMAX_p= 494587561
##$YMIN_p= -24824
##$CURPLOT= <Network HP LaserJet P1505>
##$CURPRIN= <$Network HP LaserJet P1505>
##$DFORMAT= <normdp>
##$LAYOUT= <+/1D_H.xwp>
##$LFORMAT= <normlp>
##$PFORMAT= <normpl>
##$SURQMSG= 1
$$ End of Bruker specific parameters
$$ ---------------------------------
##NTUPLES= NMR SPECTRUM
##VAR_NAME=  FREQUENCY,     SPECTRUM/REAL,   SPECTRUM/IMAG
##SYMBOL=    X,             R,               I
##VAR_TYPE=  INDEPENDENT,   DEPENDENT,       DEPENDENT
##VAR_FORM=  AFFN,          ASDF,            ASDF
##VAR_DIM=   131072,        131072,          131072
##UNITS=     HZ,            ARBITRARY UNITS, ARBITRARY UNITS
##FACTOR=    0.0627417313425164, 1,          1
##FIRST=     8223.62146879497, -1053,        -106443
##LAST=      0,             -570,            -107401
##MIN=       0,             -24824,          0
##MAX=       8223.62146879497, 494587561,    0
$$ Real data points
##PAGE= N=1
##DATA TABLE= (X++(R..R)), XYDATA
$$ [...]
60659A144468Q860P768O311M677L147K012J388J121R23N07l77j660k721k929k511
60644A170984k292k442k253j483j042j729l066m088m596m832m608l711k650k073
60630A130119j804j447j474k557m089m570l443j521L93K248M047N503O597P560
60616A135562Q206Q087P484P227P443P407O924O886P937R484J0502J0679J0293
60603A244121R598Q828Q323Q213Q303Q397Q366P975P323P398R205J2210J4617
60590A362877J5555J6018J7193J8826J9865J9849J8879J6942J4066J0625O869
60579A537564K671j694n192p242q670j0624j3034j4971j6009j6314j5748j4024
60567A416713j1626r526p872n930l481j532j187k327l728m236l725l057l061l346
$$ y = [1144468, 1153328, 1161096, 1167407, 1172084, 1175231, 1177243, 1178631, 1179752, 1180675, 1181182, 1180805, 1179145, 1176424, 1173495, 1170984, 1168692, 1166250, 1163997, 1162514, 1161472, 1159743, 1156677, 1152589, 1147993, 1143161, 1138553, 1134842, 1132192, 1130119, 1128315, 1126868, 1125394, 1122837, 1118748, 1114178, 1110735, 1109214, 1109607, 1111855, 1115902, 1121405, 1128002, 1135562, 1143768, 1151855, 1159339, 1166566, 1174009, 1181416, 1188340, 1195226, 1203163, 1212647, 1223149, 1233828, 1244121, 1253719, 1262547, 1270870, 1279083, 1287386, 1295783, 1304149, 1312124, 1319447, 1326845, 1336050, 1348260, 1362877, 1378432, 1394450, 1411643, 1430469, 1450334, 1470183, 1489062, 1506004, 1520070, 1530695, 1537564, 1540235, 1538541, 1533349, 1526107, 1517437, 1506813, 1493779, 1478808, 1462799, 1446485, 1430737, 1416713, 1405087, 1395561, 1387689, 1381759, 1378278, 1376746, 1375559, 1373232, 1369504, 1365268, 1361543, 1358486, 1355425, 1352079]
60553A352079k411N07L986N590M582K699J895K142K110J496J546L064M928N352
60539A389565M315L730N109P921J0666J2662J4065J4916J5414J6719K0096K5176
60527A540354L0297L4639L8712M2599M5478M7548N0730N6079O1949O6426P0561
60516B085372P7248Q7344R8930J10330J21963J34824J48790J63116J77185J89863
60506C394965J99151K03509K02942J98032J88450J73213J52177J26546R8016O7919
60496E004920L7336P676j9234m1945o0316p5098q6335r2721r3291q9103q2183
60485D409706p2994o0430m4438k7161j0832M271J9058L3982M9112O4574P9507
60474D444355R1280R7462R8306R5869R0870Q2071O8936N3207L7024K1060N603
$$ y = [1352079, 1349668, 1350175, 1354161, 1359751, 1364333, 1367032, 1368927, 1371069, 1373179, 1374675, 1376221, 1379285, 1384213, 1389565, 1393880, 1397610, 1402719, 1410640, 1421306, 1433968, 1448033, 1462949, 1478363, 1495082, 1515178, 1540354, 1570651, 1605290, 1644002, 1686601, 1732079, 1779627, 1830357, 1886436, 1948385, 2014811, 2085372, 2162620, 2249964, 2348894, 2459224, 2581187, 2716011, 2864801, 3027917, 3205102, 3394965, 3594116, 3797625, 4000567, 4198599, 4387049, 4560262, 4712439, 4838985, 4937001, 5004920, 5042256, 5049932, 5030698, 4988753, 4928437, 4853339, 4767004, 4674283, 4580992, 4491889, 4409706, 4336712, 4276282, 4231844, 4204683, 4193851, 4198122, 4217180, 4251162, 4300274, 4364848, 4444355, 4535635, 4633097, 4731403, 4827272, 4918142, 5000213, 5069149, 5122356, 5159380, 5180440, 5186043]
60463E186043p738j7047k2203k4297k3050j6497l562J4403L5419N9051Q5833J15433
60451E381788J46655J78892K12440K47633K84862L25356L70801M21876M78235
60442H048538N40075O08476O83471P62765Q42799R19673R87566J037350J058875
60433A5489588J045072R93245R03143P75866O15206M28619K25959J7894j84527
60424B0310065l70644n32328o65296p67663q37810q74607q79306q56233q11606
60415A3714572p52286o85051o15570n47505m83208m25382l77022l39416l11219
60406I177913k90369k76271k69074k67408k68291k69484k70855k72918k74984
60397F718259k75553k74002k71079k67919k65048k61996k57418k49996k39899
$$ y = [5186043, 5178305, 5161258, 5139055, 5114758, 5091708, 5075211, 5071649, 5086052, 5121471, 5180522, 5266355, 5381788, 5528443, 5707335, 5919775, 6167408, 6452270, 6777626, 7148427, 7570303, 8048538, 8588613, 9197089, 9880560, 10643325, 11486124, 12405797, 13393363, 14430713, 15489588, 16534660, 17527905, 18431048, 19206914, 19822120, 20250739, 20476698, 20494592, 20310065, 19939421, 19407093, 18741797, 17974134, 17136324, 16261717, 15382411, 14526178, 13714572, 12962286, 12277235, 11661665, 11114160, 10630952, 10205570, 9828548, 9489132, 9177913, 8887544, 8611273, 8342199, 8074791, 7806500, 7537016, 7266161, 6993243, 6718259, 6442706, 6168704, 5897625, 5629706, 5364658, 5102662, 4845244, 4595248, 4355349]
60388D355349k28902k18187k06554j92023j74985j58267j43926j31508j19904
60379B781093j09257r9920r1051q1810p2961o5682n9448n2880m6274m1374l8564
60368B021872l6094l2635k8872k5793k2871j9162j5234j2675j1983j1979j1214
60357A793360r265o805m867l938l469k502j025j40l85n41J007L898N815N154K938
60342A779235J567K063L288L723L298K975L143L292L217L600N038P298J0108J3849
60328A845694J8557K2938K5504K6360K6532K5855K3089J8400J3953J1251R173
60317B067306N841J461k005l461l734m123m949n726o032n851n391m795m101l461
60303B020979l263l663m165m177l818l496k856j253P47J632J146Q64J800K785
$$ y = [4355349, 4126447, 3908260, 3701706, 3509683, 3334698, 3176431, 3032505, 2900997, 2781093, 2671836, 2571916, 2480865, 2399055, 2326094, 2260412, 2200964, 2148084, 2101810, 2060436, 2021872, 1985778, 1953143, 1924271, 1898478, 1875607, 1856445, 1841211, 1828536, 1816553, 1804574, 1793360, 1784095, 1777290, 1772423, 1768485, 1765016, 1762514, 1761489, 1761349, 1760964, 1760423, 1761430, 1765328, 1771143, 1776297, 1779235, 1780802, 1782865, 1786153, 1789876, 1793174, 1796149, 1799292, 1802584, 1805801, 1809401, 1814439, 1821737, 1831845, 1845694, 1864251, 1887189, 1912693, 1939053, 1965585, 1991440, 2014529, 2032929, 2046882, 2058133, 2067306, 2073147, 2074608, 2072603, 2069142, 2065408, 2061285, 2056336, 2050610, 2044578, 2038727, 2033336, 2028541, 2024440, 2020979, 2017716, 2014053, 2009888, 2005711, 2001893, 1998397, 1995541, 1994288, 1995035, 1996667, 1997813, 1998677, 2000477, 2003262]
60289B003262K267N53j172k931n515q686j1542j4230j7430k0445k1617k0823j9717
60276A861974j9207j8407j6608j4518j2748j0703q029n805n001m706l214r1L906
60263A746843Q085J1673J3246J2106J0036J0022J2928J6767J9610K1835K4889
60252A908040K9003L3178L6829M0328M4043M7768N1288N4980N9475O4849P0271
60241B440052P4428P6541P7053P7168P7438P7062P4912P1145O7075O3420N9366
60230C235660N3853M7093M0090L3054K5330J6864Q751K028l168o901q881r328
60218C434445r408r612q407l835L691J1641J8439K4879L2031L9214M5070M9718
60206C627866N4563O0301O6175P1097P4634P6728P7120P5471P1821O6710O0771
$$ y = [2003262, 2005529, 2006082, 2004910, 2001979, 1996464, 1987778, 1976236, 1962006, 1944576, 1924131, 1902514, 1881691, 1861974, 1842767, 1824360, 1807752, 1793234, 1780486, 1769783, 1761754, 1755949, 1750948, 1746242, 1743028, 1742937, 1746843, 1754928, 1766601, 1779847, 1791953, 1801989, 1812011, 1824939, 1841706, 1861316, 1883151, 1908040, 1937043, 1970221, 2007050, 2047378, 2091421, 2139189, 2190477, 2245457, 2304932, 2369781, 2440052, 2514480, 2591021, 2668074, 2745242, 2822680, 2899742, 2974654, 3045799, 3112874, 3176294, 3235660, 3289513, 3336606, 3376696, 3409750, 3435080, 3451944, 3460695, 3462723, 3459555, 3452654, 3443773, 3434445, 3425037, 3415425, 3407018, 3403183, 3406874, 3418515, 3436954, 3461833, 3493864, 3533078, 3578148, 3627866, 3682429, 3742730, 3808905, 3880002, 3954636, 4031364, 4108484, 4183955, 4255776, 4322486, 4383257]
60195D383257N4156M6434L7331K7482J7947Q945k86j0000j9053k6100l1090l4737
60183D454286l7058l7421l5860l3157k9538k4304j7211r248j453O298J4582K3017
60171D272933L0483L6593M2070M7534N2560N6230N8092N8287N7145N5203N3425
60160D820555N2737N3061N3230N2408N1347N1747N4314N8039O1790O6058P2404
60149E447690Q1225R0824R8941J04737J08818J11723J13183J12895J11378J09503
60139F490917J07504J05086J02581J01448J03125J07623J13669J20176J27065
60130G479194J34539J42138J48857J53948J57264J59004J59443J58668J56213
60121H849268J50953J41669J27797J09699Q8540O6014M3581K1411j521k5652m9532
$$ y = [4383257, 4437413, 4483847, 4521178, 4548660, 4566607, 4575552, 4575266, 4565266, 4546213, 4520113, 4489023, 4454286, 4417228, 4379807, 4343947, 4310790, 4281252, 4256948, 4239737, 4230489, 4229036, 4235334, 4249916, 4272933, 4303416, 4340009, 4382079, 4429613, 4482173, 4538403, 4596495, 4654782, 4711927, 4767130, 4820555, 4873292, 4926353, 4979583, 5031991, 5083338, 5135085, 5189399, 5247438, 5309228, 5375286, 5447690, 5528915, 5619739, 5718680, 5823417, 5932235, 6043958, 6157141, 6270036, 6381414, 6490917, 6598421, 6703507, 6806088, 6907536, 7010661, 7118284, 7231953, 7352129, 7479194, 7613733, 7755871, 7904728, 8058676, 8215940, 8374944, 8534387, 8693055, 8849268, 9000221, 9141890, 9269687, 9379386, 9467926, 9533940, 9577521, 9598932, 9597411, 9571759, 9522227]
60110I522227p1055q9614j05989j20188j30813j37045j39905j40646j38765j32891
60100H315316j23071j11037r8362q5417p2151n8807m5543l2223j9141p339K313
60089G664538R965J6260K1300K4561K5653K4570K1186J5114O474l592j3758k3977
60077G788294l5416m8466o1473p2319q0984q9247r7746j04759j08615j09829j09567
60066F869873j07228j01563r3654q6378q0536p3590o3257n0668l8662k8239j8261
60055F127837p774L172J4657K7069L9799N1282O0964P0248Q0633R1517J00722
60044F660126J07033J11250J14480J15988J13629J06319R5306Q2413O7698M9753
60034G623995K8154M539j8885m0867o0852p8221r2538j03842j12056j16774j18250
$$ y = [9522227, 9451172, 9361558, 9255569, 9135381, 9004568, 8867523, 8727618, 8586972, 8448207, 8315316, 8192245, 8081208, 7982846, 7897429, 7825278, 7766471, 7720928, 7688705, 7669564, 7662225, 7664538, 7674503, 7690763, 7712063, 7736624, 7762277, 7786847, 7808033, 7823147, 7829621, 7826029, 7812271, 7788294, 7752878, 7704412, 7642939, 7570620, 7489636, 7400389, 7302643, 7197884, 7089269, 6979440, 6869873, 6762645, 6661082, 6567428, 6481050, 6400514, 6326924, 6263667, 6212999, 6174337, 6146098, 6127837, 6120063, 6123235, 6137892, 6164961, 6204760, 6256042, 6317006, 6387254, 6467887, 6559404, 6660126, 6767159, 6878409, 6992889, 7108877, 7222506, 7328825, 7424131, 7506544, 7574242, 7623995, 7652149, 7656688, 7637803, 7596936, 7536084, 7457863, 7365325, 7261483, 7149427, 7032653, 6914403]
60023F914403j17773j16073j12059j04333r3539q2067p1530o1641n1436m0536
60013F063416k9190j7984p701J445J0462K0587L1536M1682M9917N6314O0810O2470
60001F343764O0703N6270N0373M3428L5305K6076J5826M119r577k4986m0842n5460
59989F504999o7434p6222q2238q6048q7511q6198q2509p7625p2058o5087n5913
59978E666156m4793l2794k1108j0720j852O622J6302K7251L7687M6145N3034N9256
59966E801186O4286O6783O6667O5519O4951O5290O5739O5229O3210O0048N6527
59955F505435N2905M8834M4282L9762L5438L0909K6347K2779K0709J9649J9926
59944F866975K3539L1722M2680N3692O4825P8670R6621J17495J39789J63085J86474
$$ y = [6914403, 6796630, 6680557, 6568498, 6464165, 6370626, 6288559, 6217029, 6155388, 6103952, 6063416, 6034226, 6016242, 6008541, 6009986, 6020448, 6041035, 6072571, 6114253, 6164170, 6220484, 6281294, 6343764, 6404467, 6460737, 6511110, 6554538, 6589843, 6615919, 6631745, 6635864, 6626287, 6601301, 6560459, 6504999, 6437565, 6361343, 6279105, 6193057, 6105546, 6019348, 5936839, 5859214, 5787156, 5722069, 5666156, 5621363, 5588569, 5567461, 5556741, 5554889, 5561511, 5577813, 5605064, 5642751, 5688896, 5741930, 5801186, 5865472, 5932255, 5998922, 6064441, 6129392, 6194682, 6260421, 6325650, 6388860, 6448908, 6505435, 6558340, 6607174, 6651456, 6691218, 6726656, 6757565, 6783912, 6806691, 6827400, 6847049, 6866975, 6890514, 6922236, 6964916, 7018608, 7083433, 7162103, 7258724, 7376219, 7516008, 7679093, 7865567]
59933G865567K07625K24600K37245K45536K47723K41577K26736K04465J75580
59924I876654J40133R9182N5497J2000k9828o9607j06718j39744j66954j86999
59914I483616j99434k04905k04704j99779j90219j76045j58422j39491j20793
59905G889824j02438q4260o7063n1797l7883k3640q492O405J9995L2408M3672
59894G616731N2729N8668O1712O1750N7124M6606L1702J5121k649k3214m6914
59883G929366p1690r5545j17997j38439j55159j67280j76085j82952j87110j86940
59873F450169j82598j75795j67556j57786j46826j35855j25485j15091j04107
59864E139070r3292q4157p7444p2506o8247o4569o2585o2926o4113o3498o0188
$$ y = [7865567, 8073192, 8297792, 8535037, 8780573, 9028296, 9269873, 9496609, 9701074, 9876654, 10016787, 10115969, 10171466, 10183466, 10153638, 10084031, 9977313, 9837569, 9670615, 9483616, 9284182, 9079277, 8874573, 8674794, 8484575, 8308530, 8150108, 8010617, 7889824, 7787386, 7703126, 7636063, 7584266, 7546383, 7522743, 7514251, 7520656, 7540651, 7573059, 7616731, 7669460, 7728128, 7789840, 7851590, 7908714, 7955320, 7987022, 8002143, 7999494, 7976280, 7929366, 7857676, 7762131, 7644134, 7505695, 7350536, 7183256, 7007171, 6824219, 6637109, 6450169, 6267571, 6091776, 5924220, 5766434, 5619608, 5483753, 5358268, 5243177, 5139070, 5045778, 4961621, 4884177, 4811671, 4743424, 4678855, 4616270, 4553344, 4489231, 4425733, 4365545]
59853D365545n6005n3028n1070m8562m5039m1327l7721l3534k8660k4276k1463
59842C924860k0221k0289k2059k5801l0651l5204l8869m2004m4923m7335m8775
59831C548729m9169m8925m8562m8084m6607m3106l7856l2614k8740k5550k1310
59820C118206j5636r858m910o9N687J1978J7541K1711K4650K6615K7970K9466
59808C253351L1305L2271L0952K7820K4846K2929K1111J8614J6223J4785J3793
59797C508000J2584J2024J3627J7697K3528L0844L9614M8805N6946O4179P2709
59786C900557Q4795J00811J19264J38055J55937J73402J91813K10992K28174K40208
59776E544008K46069K45676K37108K17383J86527J48804J08901O8343K6605j5708
$$ y = [4365545, 4309540, 4256512, 4205442, 4156880, 4111841, 4070514, 4032793, 3999259, 3970599, 3946323, 3924860, 3904639, 3884350, 3862291, 3836490, 3805839, 3770635, 3731766, 3689762, 3644839, 3597504, 3548729, 3499560, 3450635, 3402073, 3353989, 3307382, 3264276, 3226420, 3193806, 3165066, 3139516, 3118206, 3102570, 3092712, 3087802, 3087733, 3093420, 3105398, 3122939, 3144650, 3169300, 3195915, 3223885, 3253351, 3284656, 3316927, 3347879, 3375699, 3400545, 3423474, 3444585, 3463199, 3479422, 3494207, 3508000, 3520584, 3532608, 3546235, 3563932, 3587460, 3618304, 3657918, 3706723, 3763669, 3827848, 3900557, 3985352, 4086163, 4205427, 4343482, 4499419, 4672821, 4864634, 5075626, 5303800, 5544008, 5790077, 6035753, 6272861, 6490244, 6676771, 6825575, 6934476, 7002819, 7029424, 7013716]
59766G013716n6183r2093j21219j41954j53967j58474j56855j49296j35787j17976
59756E729912r8836q0464o3160m6751l1790j9040q392J107J0386J9722K8757L6883
59744E478334M3674M9381N5205O2874P3421Q6198R9480J12361J25685J40744J57668
59733F485025J75778J95078K16291K39577K64185K89419L14919L39854L62801
59724H882927L82807L99725M13151M21845M24726M21998M15170M06381L97439
59715A2566169L88815L79879L71010L64928L64485L69480L77508L87765M01460
59706A5971499M17911M32847M42184M45329M43001M33690M14725L85733L48833
59697A9735752L06204K59513K11138J63836J19386P9197M5679K0945M629m865
$$ y = [7013716, 6957533, 6865440, 6744221, 6602267, 6448300, 6289826, 6132971, 5983675, 5847888, 5729912, 5631076, 5550612, 5487452, 5440701, 5408911, 5389871, 5381479, 5382586, 5392972, 5412694, 5441451, 5478334, 5522008, 5571389, 5626594, 5689468, 5762889, 5849087, 5948567, 6060928, 6186613, 6327357, 6485025, 6660803, 6855881, 7072172, 7311749, 7575934, 7865353, 8180272, 8520126, 8882927, 9265734, 9665459, 10078610, 10500455, 10925181, 11347179, 11762349, 12168730, 12566169, 12954984, 13334863, 13705873, 14070801, 14435286, 14804766, 15182274, 15570039, 15971499, 16389410, 16822257, 17264441, 17709770, 18152771, 18586461, 19001186, 19386919, 19735752, 20041956, 20301469, 20512607, 20676443, 20795829, 20875026, 20920705, 20941650, 20946279, 20941414]
59687B0941414o994P77J9369M6847Q1276J22452J69728K20203K70777L20931L71916
59676B2558696M23747M73986N18857N54461N77245N84329N73560N43036M91093
59667B7299010M17437L24238K15820R7341k6124j49610k67879l75384m67000n39270
59657B6528579n90914o22165o34207o29809o13781n91757n68428n47369n31659
59648B1198490n23222n21610n24945n32325n44158n59853n76538n90742o00427
59639A6224670o04747o03027n95035n81706n64473n44100n20846m95579m70021
59630A1245136m45717m23094m01443l79805l58034l37212l18708l02591k87279
59621G991253k71005k53505k36185k20682k07366j95054j82316j69158j57176
$$ y = [20941414, 20934420, 20935197, 20954566, 21001413, 21082689, 21205141, 21374869, 21595072, 21865849, 22186780, 22558696, 22982443, 23456429, 23975286, 24529747, 25106992, 25691321, 26264881, 26807917, 27299010, 27716447, 28040685, 28256505, 28353846, 28327722, 28178112, 27910233, 27534849, 27067849, 26528579, 25937665, 25315500, 24681293, 24051484, 23437703, 22845946, 22277518, 21730149, 21198490, 20675268, 20153658, 19628713, 19096388, 18552230, 17992377, 17415839, 16825097, 16224670, 15619923, 15016896, 14421861, 13840155, 13275682, 12731582, 12210736, 11715157, 11245136, 10799419, 10376325, 9974882, 9595077, 9237043, 8899831, 8581123, 8278532, 7991253, 7720248, 7466743, 7230558, 7009876, 6802510, 6607456, 6425140, 6255982, 6098806]
59612F098806j47796j40694j34512j28838j24562j22283j21123j19578j17037
59603D942383j14016j11112j08146j04364r9426r4023q9248q5370q1590p7067
59593C978021p1599o5176n7798n0156m3620l8772l4649l0231k5872k2285j9123
59582C518740j5723j2410r626o609k710P20J853J479K266N013P972J0139J2702
59569C513806J6541K0720K4619K9331L5400M1215M5336M8930N4067O0977O8751
59558C959693P7433Q7395R7516J06204J13935J22866J34011J46263J58041J68542
59548E171899J77425J84644J90701J96018K00062K01986K01902K00568J97996
59539F923201J93356J86198J76935J66414J55702J45785J36460J26090J13651
$$ y = [6098806, 5951010, 5810316, 5675804, 5546966, 5422404, 5300121, 5178998, 5059420, 4942383, 4828367, 4717255, 4609109, 4504745, 4405319, 4311296, 4222048, 4136678, 4055088, 3978021, 3906422, 3841246, 3783448, 3733292, 3689672, 3650900, 3616251, 3586020, 3560148, 3537863, 3518740, 3503017, 3490607, 3480981, 3474372, 3471662, 3472382, 3474235, 3475714, 3477980, 3482993, 3490965, 3501104, 3513806, 3530347, 3551067, 3575686, 3605017, 3640417, 3681632, 3726968, 3775898, 3829965, 3890942, 3959693, 4037126, 4124521, 4222037, 4328241, 4442176, 4565042, 4699053, 4845316, 5003357, 5171899, 5349324, 5533968, 5724669, 5920687, 6120749, 6322735, 6524637, 6725205, 6923201, 7116557, 7302755, 7479690, 7646104, 7801806, 7947591, 8084051, 8210141, 8323792]
59530H323792J00587Q9473Q1242P5169P1095O9901P1783P5785Q1319Q8557R6750
59519I225453J03608J07003J06335J01622R2381P8019N8398L3509L553l0040o4717
59508I815124r8628j31549j63291j92149k15939k33887k46498k54032k56207k53272
59498G769672k46442k36993k25371k11455j95601j79314j64525j51865j39961
59489F018145j27274j14381j03208r3994q4649p3879o3317n5048m8239m0143k9895
59478E184118j9235r437N06J2100K5455L9867N4931P0045Q3970R6050J07006J17384
59466E762760J25936J30791J31582J29114J23325J13143R8371Q0150N9348L5888
59456F790408J0229j5836m0684o4043q5777j04566j18975j29217j36496j40995
$$ y = [8323792, 8424379, 8513852, 8595094, 8670263, 8741358, 8811259, 8883042, 8958827, 9040146, 9128703, 9225453, 9329061, 9436064, 9542399, 9644021, 9736402, 9814421, 9872819, 9906328, 9909881, 9879841, 9815124, 9716496, 9584947, 9421656, 9229507, 9013568, 8779681, 8533183, 8279151, 8022944, 7769672, 7523230, 7286237, 7060866, 6849411, 6653810, 6474496, 6309971, 6158106, 6018145, 5890871, 5776490, 5673282, 5579288, 5494639, 5420760, 5357443, 5302395, 5254156, 5214013, 5184118, 5164883, 5155446, 5155952, 5168052, 5193507, 5233374, 5288305, 5358350, 5442320, 5538370, 5645376, 5762760, 5888696, 6019487, 6151069, 6280183, 6403508, 6516651, 6615022, 6695172, 6754520, 6790408, 6800637, 6784801, 6744117, 6680074, 6594297, 6489731, 6370756, 6241539, 6105043, 5964048]
59446E964048j41756j38651j33316j27821j23081j18622j13296j06171r7418q8435
59436D775481q0722p4676o9811o5836o2696n9843n6431n2405m8561m5303m2061
59425D117136l8111l3482k8776k4578k1036j7620j3387p950j910M207J0865J8409
59413C963767K5783L1806L7344M4289N2206N8102O0391O1304O4252P0054P6981
59402D546279Q3344Q8830R4198J00918J10400J22273J33956J42865J48762J53438
59392E725263J59037J67321J79070J92944K06071K17342K29321K45337K65561
59383G587267K87671L10509L34861L60930L87237M12214M34997M54470M69264
59374A1039420M79018M83974M83121M74564M58284M36798M12420L85516L55948
$$ y = [5964048, 5822292, 5683641, 5550325, 5422504, 5299423, 5180801, 5067505, 4961334, 4863916, 4775481, 4694759, 4620083, 4550272, 4484436, 4421740, 4361897, 4305466, 4253061, 4204500, 4159197, 4117136, 4079025, 4045543, 4016767, 3992189, 3971153, 3953533, 3940146, 3932196, 3930286, 3934493, 3945358, 3963767, 3989550, 4021356, 4058700, 4102989, 4155195, 4213297, 4273688, 4334992, 4399244, 4469298, 4546279, 4629623, 4718453, 4812651, 4913569, 5023969, 5146242, 5280198, 5423063, 5571825, 5725263, 5884300, 6051621, 6230691, 6423635, 6629706, 6847048, 7076369, 7321706, 7587267, 7874938, 8185447, 8520308, 8881238, 9268475, 9680689, 10115686, 10570156, 11039420, 11518438, 12002412, 12485533, 12960097, 13418381, 13855179, 14267599, 14653115, 15009063]
59365A5009063L24429K91475K56892K21595J88217J58213J29509R8902O5954L2861
59355A6777110J200k9319n9156q7821j14705j39535j61866j81212j97855k12442
59345A5594399k24744k34056k40994k47597k55035k62333k67974k71826k74680
59336A3315160k76778k77657k76937k74434k69959k63781k56835k49614k41266
59327A0927899k30747k18561k06330j94813j83678j73236j64978j59711j56318
59318I239527j53184j50038j47624j46397j46403j47663j49577j50535j49426
59309G898680j47172j45682j45518j45751j45652j45106j43593j40450j36355
59300F603401j32870j30031j26032j19956j13197j07211j01396r4543q7015p9932
$$ y = [15009063, 15333492, 15624967, 15881859, 16103454, 16291671, 16449884, 16579393, 16678295, 16744249, 16777110, 16778310, 16748991, 16689835, 16602014, 16487309, 16347774, 16185908, 16004696, 15806841, 15594399, 15369655, 15135599, 14894605, 14647008, 14391973, 14129640, 13861666, 13589840, 13315160, 13038382, 12760725, 12483788, 12209354, 11939395, 11675614, 11418779, 11169165, 10927899, 10697152, 10478591, 10272261, 10077448, 9893770, 9720534, 9555556, 9395845, 9239527, 9086343, 8936305, 8788681, 8642284, 8495881, 8348218, 8198641, 8048106, 7898680, 7751508, 7605826, 7460308, 7314557, 7168905, 7023799, 6880206, 6739756, 6603401, 6470531, 6340500, 6214468, 6094512, 5981315, 5874104, 5772708, 5678165, 5591150, 5511218]
59290E511218p3064o5294n6642m8187m0188l1803k2601j2969k979P784J8951K9186
59278E213412L7819M5688N3620O0780O5385O6810O6232O4990O2747N7825M9324
59267E844632L8277K6257J3539l46j4632k7439l8070m7551n6158o1960o3070o0233
59255E553246n5685n0333m3537l5225k6594j8691j1354l656N243J5345K5384L3832
59243E387975M0960M8917N8827O9023P7580Q5490R5377J07891J21345J34579J48108
59232F376072J62627J78408J96246K17057K40157K63418K85182L04586L20331
59223H544084L31276L38231L42874L44399L39472L26133L05774K80406K49998
59214A1402647K13609J71336J24133P3334K1586k7424p1522j11125j46838j77530
$$ y = [5511218, 5438154, 5372860, 5316218, 5268031, 5227843, 5196040, 5173439, 5160470, 5157491, 5165275, 5184226, 5213412, 5251231, 5296919, 5350539, 5411319, 5476704, 5543514, 5609746, 5674736, 5737483, 5795308, 5844632, 5882909, 5909166, 5922705, 5922359, 5907727, 5880288, 5842218, 5794667, 5738509, 5676549, 5613479, 5553246, 5497561, 5447228, 5403691, 5368466, 5341872, 5323181, 5311827, 5308171, 5313414, 5328759, 5354143, 5387975, 5428935, 5477852, 5536679, 5605702, 5683282, 5768772, 5864149, 5972040, 6093385, 6227964, 6376072, 6538699, 6717107, 6913353, 7130410, 7370567, 7633985, 7919167, 8223753, 8544084, 8875360, 9213591, 9556465, 9900864, 10240336, 10566469, 10872243, 11152649, 11402647, 11616256, 11787592, 11911725, 11985059, 12006645, 11979221, 11907699, 11796574, 11649736, 11472206]
59204A1472206k01883k20160k32875k39190k38491k32601k24554k15717k05586
59195I461149j93926j81627j69785j59131j50255j43487j38679j35563j33730
59186H054966j31992j28813j24189j20035j17826j16695j14714j11068j06130
59177F983504j00463r4765q9670q4624p8054o9743o1740n5722n0850m5707m0846
59166F211320l7464l4881l1756k9012k8901l1541l4780l7583m1196m6568n2758
59155E804880n8656o4555p1137p8044q4135q8368r0299r0571r0943r2600r4550
59144D901022r4878r3358r1323q9053q5346q0119p5409p2707p0829o7671o2908
59133D017421n7681n2606m7457m2334l7601l2751k6471j8276r426j756M146R287
$$ y = [11472206, 11270323, 11050163, 10817288, 10578098, 10339607, 10107006, 9882452, 9666735, 9461149, 9267223, 9085596, 8915811, 8756680, 8606425, 8462938, 8324259, 8188696, 8054966, 7922974, 7794161, 7669972, 7549937, 7432111, 7315416, 7200702, 7089634, 6983504, 6883041, 6788276, 6698606, 6613982, 6535928, 6466185, 6404445, 6348723, 6297873, 6252166, 6211320, 6173856, 6138975, 6107219, 6078207, 6049306, 6017765, 5982985, 5945402, 5904206, 5857638, 5804880, 5746224, 5681669, 5610532, 5532488, 5448353, 5359985, 5269686, 5179115, 5088172, 4995572, 4901022, 4806144, 4712786, 4621463, 4532410, 4447064, 4366945, 4291536, 4218829, 4148000, 4080329, 4017421, 3959740, 3907134, 3859677, 3817343, 3779742, 3746991, 3720520, 3702244, 3692818, 3691062, 3695208, 3704495]
59121C704495J4884K1013K6920L2398L8152M4594N0959N6146N9949O3041O6188
59110D178739O9961P4617P9634Q3862Q6768Q9001R1170R2837R3469R3293R2116
59099E125467Q8167P9697O6980N1279L2634J0644j3035l5356n5226p4114r2865
59088E184272j09869j23050j31921j36994j38819j38396j36953j34325j29015
59079D004930j20840j12075j04886r8941r2740q6095p9923p4738p0755o8620o8453
59068C026864o8746o7682o5216o2668o0666n8690n6343n3833n1382m9101m7371
59057B385166m6373m5508m4018m1898l9401l6187l2085k8122k5426k3378k0336
59046B002434j6149j2331r482o226j542L269O185P195Q095J0042J2459J4340J5488
$$ y = [3704495, 3719379, 3740392, 3767312, 3799710, 3837862, 3882456, 3933415, 3989561, 4049510, 4112551, 4178739, 4248700, 4323317, 4402951, 4486813, 4573581, 4662582, 4753752, 4846589, 4940058, 5033351, 5125467, 5213634, 5293331, 5360311, 5411590, 5444224, 5454868, 5441833, 5406477, 5351251, 5277137, 5184272, 5074403, 4951353, 4819432, 4682438, 4543619, 4405223, 4268270, 4133945, 4004930, 3884090, 3772015, 3667129, 3568188, 3475448, 3389353, 3309430, 3234692, 3163937, 3095317, 3026864, 2958118, 2890436, 2825220, 2762552, 2701886, 2643196, 2586853, 2533020, 2481638, 2432537, 2385166, 2338793, 2293285, 2249267, 2207369, 2167968, 2131781, 2099696, 2071574, 2046148, 2022770, 2002434, 1986285, 1973954, 1964472, 1958246, 1956704, 1959973, 1966158, 1973353, 1981448, 1991490, 2003949, 2018289, 2033777]
59033B033777J6213J6695J7155J8115J9914K2107K3782K4404K4101K3270K2207
59022B261740K1062J9615J7200J3299Q555M625K679K349K538K715K902K922K642
59009B364843K802M459P394R949J0713R699P517M338L00l918p760j1568j5823
58996B382945j9995k2990k4635k5800k6980k7578k6798k4607k1452j7545j3034
58985B131531q626n442m037l684k799k49L591P064Q771R004R447J1263J3789J5575
58971B185198J6436J7613J9724K1546K1613K0330J9335J9049J8345J6758J5535
58960B391482J5705J6339J5951J4801J4482J5655J7554J9492K1683K4354K7106
58949B594604K9433L1219L2547L3702L5386L8293M2434M7338N2691N8163O3053
$$ y = [2033777, 2049990, 2066685, 2083840, 2101955, 2121869, 2143976, 2167758, 2192162, 2216263, 2239533, 2261740, 2282802, 2302417, 2319617, 2332916, 2341471, 2346096, 2348775, 2351124, 2353662, 2356377, 2359279, 2362201, 2364843, 2367645, 2372104, 2379498, 2389447, 2400160, 2409859, 2417376, 2421714, 2422014, 2418096, 2410336, 2398768, 2382945, 2362950, 2339960, 2315325, 2289525, 2262545, 2234967, 2208169, 2183562, 2162110, 2144565, 2131531, 2122905, 2117463, 2113426, 2109742, 2106943, 2106694, 2110285, 2117349, 2126120, 2135124, 2144571, 2155834, 2169623, 2185198, 2201634, 2219247, 2238971, 2260517, 2282130, 2302460, 2321795, 2340844, 2359189, 2375947, 2391482, 2407187, 2423526, 2439477, 2454278, 2468760, 2484415, 2501969, 2521461, 2543144, 2567498, 2594604, 2624037, 2655256, 2687803, 2721505, 2756891, 2795184, 2837618, 2884956, 2937647, 2995810, 3058863]
58938C058863O7063P1092P6133Q1652Q6463R1041R7186J05106J12744J18862J25292
58927D091497J34794J47795J62409J76872J90793K04653K19334K35806K54327
58918E818280K74160K94793L16876L41077L66563L91561M15157M37496M58264
58909I114227M75859M88075M93046M89523M76777M54395M21896L78935L26103
58900A3118836K65144J98149J27147N4826j5394q0951j41201j95901k43333k81207
58890A2806115l09028l28216l39920l44116l41039l32316l20132l06191k91978
58881I893179k79108k68631k60284k53020k46150k39725k34104k29393k25294
58872G657470k21346k17375k13558k09987k06455k02784j99007j94861j89700
$$ y = [3058863, 3125926, 3197018, 3273151, 3354803, 3441266, 3532307, 3629493, 3734599, 3847343, 3966205, 4091497, 4226291, 4374086, 4536495, 4713367, 4904160, 5108813, 5328147, 5563953, 5818280, 6092440, 6387233, 6704109, 7045186, 7411749, 7803310, 8218467, 8655963, 9114227, 9590086, 10078161, 10571207, 11060730, 11537507, 11991902, 12413798, 12792733, 13118836, 13383980, 13582129, 13709276, 13764102, 13748708, 13667757, 13526556, 13330655, 13087322, 12806115, 12497087, 12168871, 11828951, 11484835, 11143796, 10811480, 10491348, 10185157, 9893179, 9614071, 9345440, 9085156, 8832136, 8585986, 8346261, 8112157, 7882764, 7657470, 7436124, 7218749, 7005191, 6795204, 6588749, 6385965, 6186958, 5992097, 5802397]
58863E802397j83461j77227j71918j66746j60000j51288j41916j32827j23481
58854D393533j13293j03244r4849q7974q0713p1607o1364n1997m4645l8584l2262
58843C613001k4888j6849q902j449N505J2271J9432K7371L5593M3239N0620N9358
58831C814302P0245Q1741R1758J00496J10113J21657J33831J45214J56261J68366
58821D993984J82022J96971K13282K31095K49720K68343K87543L08978L33190
58812G265128L58513L82445M03520M21587M36993M49857M59414M63316M58088
58803A1098861M41277M13167L75727L30048K75722K12955J44182P2982K175o6189
58793A3300907j29845j86635k35685k77102l10452l34620l49370l55973l55929
$$ y = [5802397, 5618936, 5441709, 5269791, 5103045, 4943045, 4791757, 4649841, 4517014, 4393533, 4280240, 4176996, 4082147, 3994173, 3913460, 3841853, 3780489, 3728492, 3683847, 3645263, 3613001, 3588113, 3571264, 3562362, 3560913, 3566418, 3578689, 3598121, 3625492, 3661085, 3704324, 3754944, 3814302, 3884547, 3966288, 4058046, 4158542, 4268655, 4390312, 4524143, 4669357, 4825618, 4993984, 5176006, 5372977, 5586259, 5817354, 6067074, 6335417, 6622960, 6931938, 7265128, 7623641, 8006086, 8409606, 8831193, 9268186, 9718043, 10177457, 10640773, 11098861, 11540138, 11953305, 12329032, 12659080, 12934802, 13147757, 13291939, 13364921, 13367096, 13300907, 13171062, 12984427, 12748742, 12471640, 12161188, 11826568, 11477198, 11121225, 10765296]
58784A0765296l50089l39539l26269l12036k97373k82545k68765k57270k47718
58775H083692k38747k30078k22955k18333k15528k13017k09938k06511k03336
58766F125249k00595j97729j93806j88316j81421j73474j64674j55544j46978
58757D522712j39292j31591j22826j13093j03303r3927q4862p6110o7676n9135
58747C530897n0237m1674l4260k7754k1638j6748j4538j4759j5507j5863j6815
58736C261104j9077k1766k4218k7391l2036l6825l9999m2026m4789m8648n2095
58725B872234n4182n5616n7202n8680n9507n9567n8663n6378n3071n0030m7964
58714B261374m6130m3551m0482l7818l5631l3261l0522k8020k6156k4628k3095
$$ y = [10765296, 10415207, 10075668, 9749399, 9437363, 9139990, 8857445, 8588680, 8331410, 8083692, 7844945, 7614867, 7391912, 7173579, 6958051, 6745034, 6535096, 6328585, 6125249, 5924654, 5726925, 5533119, 5344803, 5163382, 4989908, 4825234, 4669690, 4522712, 4383420, 4251829, 4129003, 4015910, 3912607, 3818680, 3733818, 3657708, 3590032, 3530897, 3480660, 3438986, 3404726, 3376972, 3355334, 3338586, 3324048, 3309289, 3293782, 3277919, 3261104, 3242027, 3220261, 3196043, 3168652, 3136616, 3099791, 3059792, 3017766, 2972977, 2924329, 2872234, 2818052, 2762436, 2705234, 2646554, 2587047, 2527480, 2468817, 2412439, 2359368, 2309338, 2261374, 2215244, 2171693, 2131211, 2093393, 2057762, 2024501, 1993979, 1965959, 1939803, 1915175, 1892080]
58703A892080k1849k1458k2004k2947k3653k3906k3809k3277k1813j9079j5725
58692A652560j3202j2481j3200j4369j5581j6923j7888j7336j4924j1915r960
58681A494781r358r031p906n744k886nJ914K296K003K758N084P537Q625Q670Q768
58666A507506Q579O712L273L95m55m60j720m346o550p184o936p010p691q498q999
58651A466616r032q631p989p085n365k454P51K595K662K400L232M949O726Q763
58637A458138J1573J4296J5409J5106J5436J7630K0682K3167K5154K7467L0283
58626A674341L3509L7694M3172M9011N4151N9246O5938P4432Q3214R1314R9371
58615B365393J08074J16725J24175J30272J35581J40138J43083J43220J39611
$$ y = [1892080, 1870231, 1848773, 1826769, 1803822, 1780169, 1756263, 1732454, 1709177, 1687364, 1668285, 1652560, 1639358, 1626877, 1613677, 1599308, 1583727, 1566804, 1548916, 1531580, 1516656, 1504741, 1494781, 1485423, 1476392, 1468486, 1462742, 1459856, 1459851, 1461765, 1464061, 1466064, 1468822, 1473906, 1481443, 1490068, 1498738, 1507506, 1516085, 1522797, 1526070, 1526465, 1526010, 1525550, 1523830, 1519484, 1512934, 1505750, 1498814, 1491804, 1484113, 1475615, 1466616, 1457584, 1448953, 1440964, 1433879, 1428514, 1426060, 1426811, 1429406, 1432068, 1434468, 1437700, 1442649, 1449375, 1458138, 1469711, 1484007, 1499416, 1514522, 1529958, 1547588, 1568270, 1591437, 1616591, 1644058, 1674341, 1707850, 1745544, 1788716, 1837727, 1891878, 1951124, 2017062, 2091494, 2174708, 2266022, 2365393, 2473467, 2590192, 2714367, 2844639, 2980220, 3120358, 3263441, 3406661, 3546272]
58606C546272J32015J20980J07134R0432P0813M9571K8872R560r468k8863m6899
58595D070419o1013p0579p6907q0906q2053p9707p4427o7609o0529n3797m7195
58584C315697m0103l2631k6268k2671k1784k1933k1910k2107k3273k4995k6156
58573C031866k6404k6380k6529k6404k5272k3108k0790j9581k0464k3581k7971
58562B765382l2180l5594l9095m3835m9409n3973n6445n7726n9029n9803n8474
58551B219819n4839n0438m6537m3010l9450l6150l3401l0895k8396k6132k3928
58540A806643k1090j7853j5909j6448j8404j9774j9884j9280j8081j5996j3616
58529A610308j2124j1664j1247j0433r912j0177j0618j0415r464q159o879o040
$$ y = [3546272, 3678287, 3799267, 3906401, 3996833, 4067646, 4117217, 4146089, 4155649, 4146181, 4117318, 4070419, 4009406, 3938827, 3861920, 3781014, 3698961, 3619254, 3544827, 3477218, 3416689, 3362892, 3315697, 3275594, 3242963, 3216695, 3194024, 3172240, 3150307, 3128397, 3106290, 3083017, 3058022, 3031866, 3005462, 2979082, 2952553, 2926149, 2900877, 2877769, 2856979, 2837398, 2816934, 2793353, 2765382, 2733202, 2697608, 2658513, 2614678, 2565269, 2511296, 2454851, 2397125, 2338096, 2278293, 2219819, 2164980, 2114542, 2068005, 2024995, 1985545, 1949395, 1915994, 1885099, 1856703, 1830571, 1806643, 1785553, 1767700, 1751791, 1735343, 1716939, 1697165, 1677281, 1658001, 1639920, 1623924, 1610308, 1598184, 1586520, 1575273, 1564840, 1554928, 1544751, 1534133, 1523718, 1514254, 1506095, 1499216, 1493176]
58517A493176n892o004n494m034k083j8K228M402N627N402M467M120M891O215
58503A507003P393Q495J0242J3025J6171J8431J9381J9964K1439K4048K6929K8951
58491A721472K9372K8161K6134K4261K2411J9430J4929J0111N991J895k960p319
58479A893888r221r058r202j0495j1338j0797j0394j1431j2427j1131q006n610
58467A774778m936m373k532m33J00q78j440k26K038L664M059M123M745N581N731
58452A790001N121M606M745N183N419N689O729Q900J1781J4475J6235J7037J7593
58439A913514J8638K0139K1364K1679K1029J9661J7690J5022J1622P830M327J635
58427B094150k84j584j916r86L67P96N14J453M525Q000R871J0793J2944J6656
$$ y = [1493176, 1487284, 1481280, 1475786, 1471752, 1469669, 1469651, 1471879, 1476281, 1481908, 1487310, 1491777, 1495897, 1500788, 1507003, 1514396, 1522891, 1533133, 1546158, 1562329, 1580760, 1600141, 1620105, 1641544, 1665592, 1692521, 1721472, 1750844, 1779005, 1805139, 1829400, 1851811, 1871241, 1886170, 1896281, 1902272, 1904167, 1901207, 1893888, 1884667, 1875609, 1866407, 1855912, 1844574, 1833777, 1823383, 1811952, 1799525, 1788394, 1780388, 1774778, 1769842, 1765469, 1762937, 1762504, 1762604, 1761726, 1760286, 1760060, 1762098, 1765762, 1769821, 1773944, 1778689, 1784270, 1790001, 1795122, 1799728, 1804473, 1809656, 1815075, 1820764, 1827493, 1836393, 1848174, 1862649, 1878884, 1895921, 1913514, 1932152, 1952291, 1973655, 1995334, 2016363, 2036024, 2053714, 2068736, 2080358, 2088188, 2092515, 2094150, 2093866, 2092282, 2090366, 2089380, 2089747, 2090543, 2091057, 2092510, 2097035, 2105035, 2114906, 2125699, 2138643, 2155299]
58413B155299K0142K2317K3805K4972K4972K3575K2218K2114K2442K1456J8623
58402B401935J4755J0731P020M023J999Q16J41k54n37p34m16R89L315N550O939
58387B456272P762Q860J0674J2767J4023J3526J1848J1159J3161J6884J9495J9410
58375B615841J7837J7000J7686J8903J9404J9118J9218K0808K3469K5668K6816
58364B841768K8021L0021L1584L1336L0277L0530L2109L3061L2728L2636L3688
58353C187759L4573L3824L1912L0348K9894L0280L0521K9215K5787K1776J9429
58342C505318J8772J7754J5711J4647J6199J9116K1062K1573K2027K3746K6962
58331C722887L0729L3203L3221L2051L2297L4760L7891M0606M3424M6322M7966
$$ y = [2155299, 2175441, 2197758, 2221563, 2246535, 2271507, 2295082, 2317300, 2339414, 2361856, 2383312, 2401935, 2416690, 2427421, 2434441, 2438464, 2440463, 2441279, 2441420, 2441166, 2440629, 2439895, 2439479, 2440468, 2443783, 2449333, 2456272, 2464034, 2472894, 2483568, 2496335, 2510358, 2523884, 2535732, 2546891, 2560052, 2576936, 2596431, 2615841, 2633678, 2650678, 2668364, 2687267, 2706671, 2725789, 2745007, 2765815, 2789284, 2814952, 2841768, 2869789, 2899810, 2931394, 2962730, 2993007, 3023537, 3055646, 3088707, 3121435, 3154071, 3187759, 3222332, 3256156, 3288068, 3318416, 3348310, 3378590, 3409111, 3438326, 3464113, 3485889, 3505318, 3524090, 3541844, 3557555, 3572202, 3588401, 3607517, 3628579, 3650152, 3672179, 3695925, 3722887, 3753616, 3786819, 3820040, 3852091, 3884388, 3919148, 3957039, 3997645, 4041069, 4087391, 4135357]
58320D135357M8329M9532N2455N4706N4050N2002N1701N3650N5709N6077N4220
58309D717788N0058M4527M0131L8798L9626M0380M0454M0734M1540M2739M5012
58298E181787M8940N3310N6291N8001O0132O3288O6407O8537O9765P0685P2251
58287E869394P5657Q1014Q6606R0861R4493R9316J05440J11145J15143J17727
58277F846796J20037J23169J27312J30807J30977J27074J21439J16670J12869
58268G957150J09015J05447J03070J01297R9073R7118R7255J00010J04574J10354
58258H984363J16858J22929J28079J33870J42073J51970J61208J68731J75373
58249A0285454J82249J90012J98865K08011K16048K23140K31297K41202K50818
$$ y = [4135357, 4183686, 4233218, 4285673, 4340379, 4394429, 4446431, 4498132, 4551782, 4607491, 4663568, 4717788, 4767846, 4812373, 4852504, 4891302, 4930928, 4971308, 5011762, 5052496, 5094036, 5136775, 5181787, 5230727, 5284037, 5340328, 5398329, 5458461, 5521749, 5588156, 5656693, 5726458, 5797143, 5869394, 5945051, 6026065, 6112671, 6203532, 6298025, 6397341, 6502781, 6613926, 6729069, 6846796, 6966833, 7090002, 7217314, 7348121, 7479098, 7606172, 7727611, 7844281, 7957150, 8066165, 8171612, 8274682, 8375979, 8475052, 8572170, 8669425, 8769435, 8874009, 8984363, 9101221, 9224150, 9352229, 9486099, 9628172, 9780142, 9941350, 10110081, 10285454, 10467703, 10657715, 10856580, 11064591, 11280639, 11503779, 11735076, 11976278, 12227096]
58240A2227096K58858K67496K79240K93327L07872L23546L41906L61935L81701
58231A5042977M02110M25484M51614M78688N07166N39132N74618O12013O51629
58222A9685431O95628P45212Q00992Q65264R40658J027549J126192J240461J376225
58213B8503612J537428J727414J952729K221413K537993K902445L311079L754496
58205D8448609M219216M699605N208970N775600O432303P217526Q183917R397308
58197I9583054J0930161J2863767J5283093J8237156K1694121K5559590K9736476
58190B33887418L4068253L8071507M0685374M0488884L6530382K9200221K0238757
58183D73170796J1619741M205923k547141r564087j6895257k3507182k8182162
$$ y = [12227096, 12485954, 12753450, 13032690, 13326017, 13633889, 13957435, 14299341, 14661276, 15042977, 15445087, 15870571, 16322185, 16800873, 17308039, 17847171, 18421789, 19033802, 19685431, 20381059, 21126271, 21927263, 22792527, 23733185, 24760734, 25886926, 27127387, 28503612, 30041040, 31768454, 33721183, 35942596, 38480589, 41383034, 44694113, 48448609, 52667825, 57367430, 62576400, 68352000, 74784303, 82001829, 90185746, 99583054, 110513215, 123376982, 138660075, 156897231, 178591352, 204150942, 233887418, 267955671, 306027178, 346712552, 387201436, 423731818, 452932039, 473170796, 484790537, 488996460, 486449319, 476885232, 459989975, 436482793, 408300631]
58176D08300631l0453479l0696466k9566404k7537777k4885860k1854836j8711845
58169B24593964j5689349j2937365j0510557q381412o512407m961922l899504
58162A61701448l474176l662216m254715m980878n632783o105379o374542o463942
58154A20752817o420227o298507o155297o037153n962079n914038n863492n791371
58146G2310653n688974n542945n332785n043348m673963m238501l763464l282865
58138C4743808k825732k406093k026509j687239j387390j121826q84221o71857
58130B1732941m82703l10728j49674J036J40011K71986M07349N55931P26770R32587
58120B3825506J189368J512666J918039K420368L023419L711155M460827N265272
$$ y = [408300631, 377847152, 347150686, 317584282, 290046505, 265160645, 243305809, 224593964, 208904615, 195967250, 185456693, 177075281, 170562874, 165600952, 161701448, 158227272, 154565056, 150310341, 145329463, 139696680, 133591301, 127216759, 120752817, 114332590, 108034083, 101878786, 95841633, 89879554, 83965516, 78102024, 72310653, 66621679, 61078734, 55745949, 50702601, 46028638, 41790137, 38026673, 34743808, 31918076, 29511983, 27485474, 25798235, 24410845, 23289019, 22404798, 21732941, 21250238, 20939510, 20789836, 20790872, 20930883, 21202869, 21610218, 22166149, 22892919, 23825506, 25014874, 26527540, 28445579, 30865947, 33889366, 37600521, 42061348, 47326620]
58112D7326620O115232O919989P437320P337404O428994M874595L144077J672623
58104I1256854N24592n85382j926533l434258m765053n615844n939544n880711
58096F3634121n590831n143816m575398l932957l275771k655514k106569j641622
58088C4711643j253237r32172o89478n53097n38569o26664p70438r20275j043483
58079B7384230j128301j176513j194115j188043j168292j147044j131812j121290
58071A8128820j110401j097356j083168j066457j042316j005636r53518q85809
58063I884159q05976p20744o36831n58209m87065m25270l73139l28573k89439
58054E258913k55608k27210k02691j80452j60947j45252j32837j22436j13691
$$ y = [47326620, 53441852, 60361841, 67799161, 75136565, 81565559, 86440154, 89584231, 91256854, 91781446, 91196064, 89269531, 85835273, 81070220, 75454376, 69514832, 63634121, 58043290, 52899474, 48324076, 44391119, 41115348, 38459834, 36353265, 34711643, 33458406, 32526234, 31836756, 31283659, 30745090, 30118426, 29347988, 28427713, 27384230, 26255929, 25079416, 23885301, 22697258, 21528966, 20381922, 19250110, 18128820, 17018419, 15921063, 14837895, 13771438, 12729122, 11723486, 10769968, 9884159, 9078183, 8357439, 7720608, 7162399, 6675334, 6250064, 5876925, 5548352, 5258913, 5003305, 4776095, 4573404, 4392952, 4232005, 4086753, 3953916, 3831480, 3717789]
58045C717789j06375r9384r2049q5105p9079p3234o7328o2459n8730n4346m8737
58034B890963m4316m2957m2854m1310l8642l6635l4973l2250k9139k7298k6089
58023B494500k3531j9863j7107j5453j3098r693p139o443o178m695k000R16L088
58010B373304L738K983K350L203M817N628N943P401R929J1396J0631Q791P132
57997B457246N214K158j695n282q122j0433j2593j4768j6654j7564j7277j6457
57985B343773j5539j3872j1013q262p350p896p661n458k408k86K07o24j916k465
57971B259230j510M43K388M144N977P236O869N238M081M408N658O900P661P514
57957B326237O195M287K647J104r46k804k972j632q94j915l260k854k90L511P608
$$ y = [3717789, 3611414, 3512030, 3419981, 3334876, 3255797, 3182563, 3115235, 3052776, 2994046, 2939700, 2890963, 2846647, 2803690, 2760836, 2719526, 2680884, 2644249, 2609276, 2577026, 2547887, 2520589, 2494500, 2470969, 2451106, 2433999, 2418546, 2405448, 2395755, 2388616, 2382173, 2375995, 2371300, 2369300, 2370216, 2373304, 2377042, 2380025, 2382375, 2385578, 2390395, 2396023, 2401966, 2409367, 2419296, 2430692, 2441323, 2450114, 2457246, 2462460, 2464618, 2462923, 2457641, 2449519, 2439086, 2426493, 2411725, 2395071, 2377507, 2360230, 2343773, 2328234, 2314362, 2303349, 2295087, 2287737, 2279841, 2272180, 2266722, 2264314, 2264028, 2264235, 2263611, 2261695, 2259230, 2257720, 2258163, 2260551, 2264695, 2270672, 2277908, 2284777, 2290015, 2294096, 2298504, 2304162, 2311062, 2318723, 2326237, 2332432, 2336719, 2339366, 2340470, 2339524, 2336720, 2333748, 2332116, 2331222, 2329307, 2326047, 2323193, 2322903, 2326414, 2334022]
57942B334022J1127J3098J3284J2624J2178J2290J2970J4244J5539J5759J4535
57931B481670J2635J0815R260Q413Q930J0288J0888J0503J1199J4481J8719K0927
57919B628728K0392J8933J8086J7516J6155J3581J0188O908M802M050L392J288
57907B764019k320o035q650j0135j1043j1653j1793j1122r638q062p333p363o847
57894B652025m886k211j12J342L002N023O637P438P875Q437R212J0296J1729J2966
57880B728773J3259J2792J2640J3494J5174J7422K0100K2324K2564K0369J7274
57869B916185J5218J4581J4363J3739J2702J1541J0461R529Q514O976N039L683
57857C042531L726M934O794R511J3182J6394J7248J6043J5461J7387K0725K3270
$$ y = [2334022, 2345149, 2358247, 2371531, 2384155, 2396333, 2408623, 2421593, 2435837, 2451376, 2467135, 2481670, 2494305, 2505120, 2514380, 2522793, 2531723, 2542011, 2552899, 2563402, 2574601, 2589082, 2607801, 2628728, 2649120, 2668053, 2686139, 2703655, 2719810, 2733391, 2743579, 2750487, 2755289, 2759339, 2762731, 2764019, 2761699, 2755664, 2747014, 2736879, 2725836, 2714183, 2702390, 2691268, 2681630, 2673568, 2666235, 2658872, 2652025, 2647139, 2644928, 2644816, 2646158, 2649160, 2654183, 2660820, 2668258, 2676133, 2684570, 2693782, 2704078, 2715807, 2728773, 2742032, 2754824, 2767464, 2780958, 2796132, 2813554, 2833654, 2855978, 2878542, 2898911, 2916185, 2931403, 2945984, 2960347, 2974086, 2986788, 2998329, 3008790, 3018319, 3026833, 3033809, 3038848, 3042531, 3046257, 3051191, 3057985, 3067496, 3080678, 3097072, 3114320, 3130363, 3145824, 3163211, 3183936, 3207206]
57845C207206K4719K6408K8729L0428L0577K9813K9232K9064K8973K8731K7993
57834C521873K6066K2699J8689J5095J2249J0033Q654Q241P930O421L756J755
57822C663461K081M161N748N552M758N484Q111J0948J2651J3916J5969J8296J9273
57809C790409J8728J8154J8240J7990J6925J6314J6855J6883J4681J1492J0072
57798C966743J0870J1854J1826J1651J2015J2294J2247J2813J4219J5079J4569
57787D106180J4024J5029J7176J8972J9995K0735K1079K0376J8627J6549J4922
57776D303664J4586J6390K0075K3857K6179K7360K8610L0230L1911L4017L6964
57765D593843L9826M1160M0995M0542M0085L8789L6569L4533L3299L2329L1228
$$ y = [3207206, 3231925, 3258333, 3287062, 3317490, 3348067, 3377880, 3407112, 3436176, 3465149, 3493880, 3521873, 3547939, 3570638, 3589327, 3604422, 3616671, 3626704, 3635358, 3643599, 3651529, 3657950, 3661706, 3663461, 3665542, 3669703, 3675451, 3681003, 3685761, 3691245, 3699356, 3710304, 3722955, 3736871, 3752840, 3771136, 3790409, 3809137, 3827291, 3845531, 3863521, 3880446, 3896760, 3913615, 3930498, 3945179, 3956671, 3966743, 3977613, 3989467, 4001293, 4012944, 4024959, 4037253, 4049500, 4062313, 4076532, 4091611, 4106180, 4120204, 4135233, 4152409, 4171381, 4191376, 4212111, 4233190, 4253566, 4272193, 4288742, 4303664, 4318250, 4334640, 4354715, 4378572, 4404751, 4432111, 4460721, 4490951, 4522862, 4556879, 4593843, 4633669, 4674829, 4715824, 4756366, 4796451, 4835240, 4871809, 4906342, 4939641, 4971970, 5003198]
57754E003198L0196K8876K6316K2755J9968J8942J8431J6831J4416J2590J1844
57743E224363J1684J2090J3578J5938J8003J8902J8952J9071J9816K1045K2306
57732E415748K3473K5009K7373L0132L2086L2465L1750L1080L1197L1991L2881
57721E745185L3533L4414L6367L9178M1112M0852L9549L9615M1480M3092M3064
57710F177441M2604M3464M5506M7619M9782N2721N6296N9710O2773O5731O8557
57699F772204P1699P6617Q3771R0701R4157R3984R2900R2587R2258R1324R1056
57688G743258R2549R5090R8009J02432J09638J18835J28179J37139J46303J55505
57678H926937J63551J69337J72073J70955J65921J58270J49417J39527J28606
$$ y = [5003198, 5033394, 5062270, 5088586, 5111341, 5131309, 5150251, 5168682, 5185513, 5199929, 5212519, 5224363, 5236047, 5248137, 5261715, 5277653, 5295656, 5314558, 5333510, 5352581, 5372397, 5393442, 5415748, 5439221, 5464230, 5491603, 5521735, 5553821, 5586286, 5618036, 5649116, 5680313, 5712304, 5745185, 5778718, 5813132, 5849499, 5888677, 5929789, 5970641, 6010190, 6049805, 6091285, 6134377, 6177441, 6220045, 6263509, 6309015, 6356634, 6406416, 6459137, 6515433, 6575143, 6637916, 6703647, 6772204, 6843903, 6920520, 7004291, 7094992, 7189149, 7283133, 7376033, 7468620, 7560878, 7652202, 7743258, 7835807, 7930897, 8028906, 8131338, 8240976, 8359811, 8487990, 8625129, 8771432, 8926937, 9090488, 9259825, 9431898, 9602853, 9768774, 9927044, 10076461, 10215988, 10344594]
57669A0344594J18171J10090J04186R8863R3931R0493Q7605Q1201O7816M8183
57659A1245133K6098M778j4772l2961n0573o7895q3672r5264j00635r9816r3922
57648A0636499q3779p0539n6674m4536l4061k3275j1211Q80J1161J8868K4138
57637A0367471K7484K9890L2445L5281L7669L9635M2637M7980N5209O2748O9715
57626A0848164P6441Q3460R0811R8359J06349J15204J24580J32799J37873J39549
57616A1953589J39672J39552J37407J29942J16579J00515Q5005P0073N3985L6623
57606A2962942J9815N091p213j6898k3540k7295k8944k8868k6960k3613j9784
57595A2784733j5757j0857m805J334O055Q858J0526J2327J5050J8354K1045K2443
$$ y = [10344594, 10462765, 10572855, 10677041, 10775904, 10869835, 10960328, 11047933, 11129134, 11196950, 11245133, 11271231, 11276009, 11261237, 11228276, 11177703, 11109808, 11026136, 10930872, 10830237, 10730421, 10636499, 10552720, 10482181, 10425507, 10380971, 10346910, 10323635, 10312424, 10313304, 10324465, 10343333, 10367471, 10394955, 10424845, 10457290, 10492571, 10530240, 10569875, 10612512, 10660492, 10715701, 10778449, 10848164, 10924605, 11008065, 11098876, 11197235, 11303584, 11418788, 11543368, 11676167, 11814040, 11953589, 12093261, 12232813, 12370220, 12500162, 12616741, 12717256, 12802261, 12872334, 12926319, 12962942, 12982757, 12987848, 12980635, 12963737, 12940197, 12912902, 12883958, 12855090, 12828130, 12804517, 12784733, 12768976, 12758119, 12753314, 12754648, 12760703, 12769561, 12780087, 12792414, 12807464, 12825818, 12846863, 12869306]
57583A2869306K3433K5495K8660L1288L2069L1580L1463L2688L5036L7719M0029
57572A3218766M1668M2852M4008M5343M6901M8951N1684N4653N7115N9029O1003
57561A3771973O3153O4899O6104O7597P0046P3109P6173P9142Q1901Q3849Q4837
57550A4582783Q5921Q8269R1656R4992R7986J01256J04852J07812J09541J10893
57540A5575961J13304J17170J21450J24838J27128J29455J33123J38251J43728
57531A6724408J48530J52715J57056J62083J67810J73923J79838J84728J87910
57522A8239001J89168J88454J85544J80165J72255J61826J48929J34073J18349
57513A9717764J02741Q7653P3419O0939N1214M4396L9795L6817L5565L6606M0289
$$ y = [12869306, 12892739, 12918234, 12946894, 12978182, 13010251, 13041831, 13073294, 13105982, 13141018, 13178737, 13218766, 13260434, 13303286, 13347294, 13392637, 13439538, 13488489, 13540173, 13594826, 13651941, 13710970, 13771973, 13835126, 13900025, 13966129, 14033726, 14103772, 14176881, 14253054, 14332196, 14414097, 14497946, 14582783, 14668704, 14756973, 14848629, 14943621, 15041607, 15142863, 15247715, 15355527, 15465068, 15575961, 15689265, 15806435, 15927885, 16052723, 16179851, 16309306, 16442429, 16580680, 16724408, 16872938, 17025653, 17182709, 17344792, 17512602, 17686525, 17866363, 18051091, 18239001, 18428169, 18616623, 18802167, 18982332, 19154587, 19316413, 19465342, 19599415, 19717764, 19820505, 19908158, 19981577, 20042516, 20093730, 20138126, 20177921, 20214738, 20250303, 20286909, 20327198]
57502B0327198M6147N2812N8823O3783O8457P3661P9363Q4995R0060R4195R7290
57491B1136784R9937J03063J06711J09902J12176J14382J17238J20156J22594
57482B2142943J25536J30193J35806J40401J43459J46179J49192J51837J54043
57473B3419589J57115J61792J66925J71041J74216J77481J81337J85802J90970
57464B4986268J96482K01037K03598K04570K04630K02777J96908J86387J72910
57455B6755567J58533J43866J28839J14234J01473R1079Q2307P4522O8381O5142
57445B7783943O5132O7336P0493P3995P7629Q1042Q4016Q6990R0604R4647R7918
57434B8673745R9297R8790R7538R6950R7653R8999R9794R9793J00157J01957J04590
$$ y = [20327198, 20373345, 20426157, 20484980, 20548763, 20617220, 20690881, 20770244, 20855239, 20945299, 21039494, 21136784, 21236721, 21339784, 21446495, 21556397, 21668573, 21782955, 21900193, 22020349, 22142943, 22268479, 22398672, 22534478, 22674879, 22818338, 22964517, 23113709, 23265546, 23419589, 23576704, 23738496, 23905421, 24076462, 24250678, 24428159, 24609496, 24795298, 24986268, 25182750, 25383787, 25587385, 25791955, 25996585, 26199362, 26396270, 26582657, 26755567, 26914100, 27057966, 27186805, 27301039, 27402512, 27493591, 27575898, 27650420, 27718801, 27783943, 27849075, 27916411, 27986904, 28060899, 28138528, 28219570, 28303586, 28390576, 28481180, 28575827, 28673745, 28773042, 28871832, 28969370, 29066320, 29163973, 29262972, 29362766, 29462559, 29562716, 29664673, 29769263]
57423B9769263J06461J07086J07554J08896J11032J13629J16931J21071J25466
57414C0787389J29714J34351J39667J44354J46706J47098J47892J50522J53830
57405C2081523J55889J56399J56214J55404J53343J50502J48486J47740J46680
57396C3452180J44064J41163J40208J41384J42874J43591J44134J44885J44917
57387C4739400J43561J41739J40670J40201J39411J38197J37227J36873J37051
57378C5994330J37675J38582J39562J41016J43698J46998J48739J47977J46880
57369C7285457J48031J50571J51181J48577J44826J42069J40020J37360J33691
57360C8581783J29309J24548J20260J17577J16396J15312J13765J12814J12973
$$ y = [29769263, 29875724, 29982810, 30090364, 30199260, 30310292, 30423921, 30540852, 30661923, 30787389, 30917103, 31051454, 31191121, 31335475, 31482181, 31629279, 31777171, 31927693, 32081523, 32237412, 32393811, 32550025, 32705429, 32858772, 33009274, 33157760, 33305500, 33452180, 33596244, 33737407, 33877615, 34018999, 34161873, 34305464, 34449598, 34594483, 34739400, 34882961, 35024700, 35165370, 35305571, 35444982, 35583179, 35720406, 35857279, 35994330, 36132005, 36270587, 36410149, 36551165, 36694863, 36841861, 36990600, 37138577, 37285457, 37433488, 37584059, 37735240, 37883817, 38028643, 38170712, 38310732, 38448092, 38581783, 38711092, 38835640, 38955900, 39073477, 39189873, 39305185, 39418950, 39531764, 39644737]
57351C9644737J12936J11835J11317J13518J17729J20965J21663J21286J22197
57342D0698183J25082J28648J30895J30546J27856J24233J20822J17550J13784
57333D1817599J09449J05017J00813R6837R2873Q8499Q3584P9180P7091P7792
57323D2728734P9568Q0547Q0839Q1685Q3296Q5044Q7180R0515R4334R6461R6050
57312D3684253R4919R5177R6496R6699R4373Q9843Q4000P7339P0265O3497N7601
57301D4604462N2440M7431M2182L6614L0678K4383J8290J3614J1362J1305J2065
57290D4904826J2451J2661J4047J7704K3277K9237L4333L8511M2179M4840M5291
57279D5219357M3299M0336L8018L6334L3952K9774K3481J5165N339m824j4285
$$ y = [39644737, 39757673, 39869508, 39980825, 40094343, 40212072, 40333037, 40454700, 40575986, 40698183, 40823265, 40951913, 41082808, 41213354, 41341210, 41465443, 41586265, 41703815, 41817599, 41927048, 42032065, 42132878, 42229715, 42322588, 42411087, 42494671, 42573851, 42650942, 42728734, 42808302, 42888849, 42969688, 43051373, 43134669, 43219713, 43306893, 43397408, 43491742, 43588203, 43684253, 43779172, 43874349, 43970845, 44067544, 44161917, 44251760, 44335760, 44413099, 44483364, 44546861, 44604462, 44656902, 44704333, 44746515, 44783129, 44813807, 44838190, 44856480, 44870094, 44881456, 44892761, 44904826, 44917277, 44929938, 44943985, 44961689, 44984966, 45014203, 45048536, 45087047, 45129226, 45174066, 45219357, 45262656, 45302992, 45341010, 45377344, 45411296, 45441070, 45464551, 45479716, 45485055, 45480231, 45465946]
57268D5465946k3142l2273m2218n3022o4742p7070q8848r9093j08362j17940j27957
57257D4631279j37479j46216j54587j62213j68084j72457j76814j81496j85148
57248D3146785j87129j88645j90528j91587j90526j88230j86640j86267j86087
57239D1451146j85380j84483j84129j84740j85985j86716j85976j84199j82492
57230C9787046j80730j77894j74476j72575j72914j73936j74994j78280j85663
57221C8195584j95268k03324k08307k11393k13928k16493k19711k23829k27940
57212C6275391k31122k33872k36850k39093k39267k38086k37646k38691k40213
57203C4140551k41339k41848k41216k39035k36294k34664k34447k34522k34083
$$ y = [45465946, 45442804, 45410531, 45368313, 45315291, 45250549, 45173479, 45084631, 44985538, 44877176, 44759236, 44631279, 44493800, 44347584, 44192997, 44030784, 43862700, 43690243, 43513429, 43331933, 43146785, 42959656, 42771011, 42580483, 42388896, 42198370, 42010140, 41823500, 41637233, 41451146, 41265766, 41081283, 40897154, 40712414, 40526429, 40339713, 40153737, 39969538, 39787046, 39606316, 39428422, 39253946, 39081371, 38908457, 38734521, 38559527, 38381247, 38195584, 38000316, 37796992, 37588685, 37377292, 37163364, 36946871, 36727160, 36503331, 36275391, 36044269, 35810397, 35573547, 35334454, 35095187, 34857101, 34619455, 34380764, 34140551, 33899212, 33657364, 33416148, 33177113, 32940819, 32706155, 32471708, 32237186, 32003103]
57194C2003103k33110k31496k29343k27883k28445k30450k31608k30118k25554
57185B9935096k18051k08024j96513j84438j71692j58118j45007j34216j26020
57176B8393017j19201j13153j08777j07289j09072j13493j19382j26216j35297
57167B7341137j48595j65928j84921k04643k27096k53580k81936l09813l38473
57158B5226152l70257m03794m35000m61875m85002n03995n16923n23089n23275
57149B1002942n17221n03614m82664m56022m24475l88274l49332l10138k71027
57140A7300175k31694j95029j65880j45912j33204j27141j29943j42557j62569
57131A5866246j87231k15418k45502k74341k99683l21087l37362l45374l42341
$$ y = [32003103, 31769993, 31538497, 31309154, 31081271, 30852826, 30622376, 30390768, 30160650, 29935096, 29717045, 29509021, 29312508, 29128070, 28956378, 28798260, 28653253, 28519037, 28393017, 28273816, 28160663, 28051886, 27944597, 27835525, 27722032, 27602650, 27476434, 27341137, 27192542, 27026614, 26841693, 26637050, 26409954, 26156374, 25874438, 25564625, 25226152, 24855895, 24452101, 24017101, 23555226, 23070224, 22566229, 22049306, 21526217, 21002942, 20485721, 19982107, 19499443, 19043421, 18618946, 18230672, 17881340, 17571202, 17300175, 17068481, 16873452, 16707572, 16561660, 16428456, 16301315, 16171372, 16028815, 15866246, 15679015, 15463597, 15218095, 14943754, 14644071, 14322984, 13985622, 13640248, 13297907]
57122A3297907l27578l01927k67546k28149j87008j44897j02216o1940k7532Q67
57112A1649981K4816M3844N7601P0245Q7745J12253J44309J88772K51871L33402
57102A2964839M29196N40817O75509Q37482J028194J255137J530403J859117K237963
57093B3358657K663354L127798L608495M076452M519802M940873N332024N689683
57085E7317138O068310O575594P256821P989007Q545008Q788891Q779418Q652271
57077A19972458Q412257P865857O763043N009668K769986L92262j772728l525779
57069A45887024m846221n799373o423768o690739o544001n963379n005122l807899
57061A00806522k569231j497034p47933l75543l15786m25370n59330o39642o68464
$$ y = [13297907, 12970329, 12668402, 12400856, 12172707, 11985699, 11840802, 11738586, 11676646, 11649114, 11649981, 11674797, 11718641, 11776242, 11846487, 11934232, 12046485, 12190794, 12379566, 12631437, 12964839, 13394035, 13934852, 14610361, 15447843, 16476037, 17731174, 19261577, 21120694, 23358657, 26022011, 29149809, 32758304, 36834756, 41354558, 46295431, 51627455, 57317138, 63385448, 69961042, 77217863, 85206870, 93751878, 102540769, 111320187, 119972458, 128384715, 136250572, 143013615, 148023283, 150793269, 151185531, 149412803, 145887024, 141040803, 135241430, 128817662, 122126923, 115582922, 109619543, 104614421, 100806522, 98237291, 96740257, 95992324, 95616781, 95300995, 94875625, 94316295, 93676653, 93008189]
57052I3008189o89014p41699q49700j023717j264177j561797j903846k277837
57044H2696402k666243l046542l406211l752574m095749m420328m680707m825491
57036E1802557m823695m673491m398392m038961l640018l237438k853846k502825
57028B1633891k191648j920276j683578j477080j298645j145135j011734q95258
57020A0010537p94730p08161o32109n64975n07433m58876m16323l77524l42362
57011E208044l10570k80935k53463k29728k10167j93145j77398j63315j51313
57002C238010j40804j31140j21923j12406j02434r3617q7451q2556p6149o7975
56992B221555o0250n3844m7252l9610l2030k5377j9176j3290q538n050j819J779
$$ y = [93008189, 92319175, 91577476, 90727776, 89704059, 88439882, 86878085, 84974239, 82696402, 80030159, 76983617, 73577406, 69824832, 65729083, 61308755, 56628048, 51802557, 46978862, 42305371, 37906979, 33868018, 30228000, 26990562, 24136716, 21633891, 19442243, 17521967, 15838389, 14361309, 13062664, 11917529, 10905795, 10010537, 9215807, 8507646, 7875537, 7310562, 6803129, 6344253, 5927930, 5550406, 5208044, 4897474, 4616539, 4363076, 4133348, 3923181, 3730036, 3552638, 3389323, 3238010, 3097206, 2966066, 2844143, 2731737, 2629303, 2535686, 2448235, 2365679, 2289530, 2221555, 2161305, 2107461, 2060209, 2020599, 1988569, 1963192, 1944016, 1930726, 1922188, 1917138, 1915319, 1917098]
56980A917098N670J0206J5534K0336K3520K6824L3070M2151N1846O2550P7602
56969B286407R8402J22851J49868J82187K22972K72484L29548L93864M65569N44464
56959E068616O28358P06062P50777P30104O33231M87464L39287K15147J03772
56950I662818k2031j70504l20103m38940n09643n35854n30663n03871m59895m02972
56940E768342l39919k77607k20097j68756j23316q2225m4390j2625N878M897j4719
56929D495463m5096p7018j04794j26738j43346j55845j65326j72244j76715j79186
56919C149155j80277j80063j78150j74514j69601j63341j54700j42739j27957
56910A677813j12081r6716q2677p0595o1248n4539m8913m2895l7052l3081l0819
$$ y = [1917098, 1922768, 1932974, 1948508, 1968844, 1992364, 2019188, 2052258, 2094409, 2146255, 2208805, 2286407, 2384809, 2507660, 2657528, 2839715, 3062687, 3335171, 3664719, 4058583, 4524152, 5068616, 5696974, 6403036, 7153813, 7883917, 8517148, 9004612, 9343899, 9559046, 9662818, 9640787, 9470283, 9150180, 8711240, 8201597, 7665743, 7135080, 6631209, 6171314, 5768342, 5428423, 5150816, 4930719, 4761963, 4638647, 4556422, 4512032, 4499407, 4505285, 4510182, 4495463, 4450367, 4373349, 4268555, 4141817, 3998471, 3842626, 3677300, 3505056, 3328341, 3149155, 2968878, 2788815, 2610665, 2436151, 2266550, 2103209, 1948509, 1805770, 1677813, 1565732, 1469016, 1386339, 1315744, 1254496, 1199957, 1151044, 1108149, 1071097, 1038016, 1007197]
56899A007197k7793k2493j6612j2730j0872q991n962k283J752O576J1890J6304
56887I35983J8834J9493J8255J4776R558M089p08n229j0048j4931j9271k2628
56875I48173k4515k4452k2425j8710j3309o407R83P999J5297K4126L4234M4241
56863I65235N3816O3419P1513P4227O9078N7726M4068L0717J8145N891o537j9062
56851A428236l0326l8165m1442m0736l6899l0073k0662r984R88J2638K5776M0510
56839A259861N6650P4005R1633J07685J20453J28180J27584J15052R1213O2629
56829B234945L6381J3552r755l5418n9733p7384q6837r0603r1191q8432q0803
56818A664722o8345n3311l7915k2323n523J2352K9750M5514N9486P0880P7363
$$ y = [1007197, 979404, 956911, 940299, 927569, 916697, 907706, 901744, 899461, 901213, 907789, 919679, 935983, 954817, 974310, 992565, 1007341, 1016899, 1020988, 1020280, 1015051, 1005003, 990072, 970801, 948173, 923658, 899206, 876781, 858071, 844762, 838355, 839338, 847337, 862634, 886760, 920994, 965235, 1019051, 1082470, 1153983, 1228210, 1297288, 1355014, 1399082, 1429799, 1447944, 1453835, 1447298, 1428236, 1397910, 1359745, 1318303, 1277567, 1240668, 1210595, 1189933, 1179949, 1180937, 1193575, 1219351, 1259861, 1316511, 1390516, 1482149, 1589834, 1710287, 1838467, 1966051, 2081103, 2172316, 2234945, 2271326, 2284878, 2275123, 2239705, 2179972, 2102588, 2015751, 1925148, 1833957, 1745525, 1664722, 1596377, 1543066, 1505151, 1482828, 1477305, 1489657, 1519407, 1564921, 1624407, 1695287, 1772650]
56807A772650P6482O7464N1484L1356J1002o538k1605l7152n4443p0801q2419
56796A737480q8040q8707q5517p9392p1707o3062n2227l8294k3351j0792j228
56785A135163P874J8284K8507L5444L6851L2069K2061R610k096j1962k1328l1315
56773A259162m0935m8458n3565n7125n9530o0280n8920n5689n1235m6234m1184
56762F86007l6225l1219k6233k1848j8692j6691j5043j3157j1543j1441j3227
56751D70688j5448j6005j4377j2153j1164j1702j2860j3933j4804j5374j5442
56740C17426j5077j4566j3952j2921j1275r379p974p442p162o049m099k878l698
56727B00954n612o366n115l134j813j360j601k448l075k238j87J184R58M02O47
$$ y = [1772650, 1849132, 1916596, 1968080, 1999436, 2010438, 2003900, 1982295, 1945143, 1890700, 1819899, 1737480, 1649440, 1560733, 1475216, 1395824, 1324117, 1261055, 1208828, 1170534, 1147183, 1136391, 1135163, 1143037, 1161321, 1189828, 1225272, 1262123, 1294192, 1316253, 1325863, 1323767, 1311805, 1290477, 1259162, 1218227, 1169769, 1116204, 1059079, 999549, 939269, 880349, 824660, 773425, 727191, 686007, 649782, 618563, 592330, 570482, 551790, 535099, 520056, 506899, 495356, 483915, 470688, 455240, 439235, 424858, 412705, 401541, 389839, 376979, 363046, 348242, 332868, 317426, 302349, 287783, 273831, 260910, 249635, 240256, 232282, 224840, 217678, 211629, 207530, 204652, 200954, 195342, 188976, 183861, 180727, 178914, 177554, 175953, 173505, 170430, 168192, 168005, 169189, 170147, 170549, 171196]
56712A71196Q56R1o63k06M65m60k731m518n110n081m447k803j014o08j455j876
56696A41636j058L56J909L518M158K647J13n88J348L499L711K785K505K786K308
56681A71633Q55n74j252j219p63k83j75k88q3K53k00j510k380j961j141j119j683
56664A58110k001k228l044m114m373l673k983k926l116l036k698k170j198J61
56650A20711J056N81q44j392L96L681N764M894K282P49J631L758N322N716N310
56635A59615M394L094J847J263J477J942J973J450J023J350K080K083J057K35
56621A84883Q12K231L082L251L864N190O010N424M134L377L550M298N109N361
56607B40576M517K854J508J364K266L302L441K117lj041J79K345K994J695M79
$$ y = [171196, 172052, 172143, 171480, 171274, 171739, 171279, 168548, 164030, 158920, 153839, 149392, 146589, 145575, 144967, 143512, 141636, 140578, 140934, 142843, 146361, 150519, 153166, 153279, 152691, 154039, 157538, 161249, 164034, 166539, 169325, 171633, 172488, 171914, 170662, 169443, 168680, 168397, 168222, 167934, 167851, 168104, 167904, 166394, 164014, 162053, 160912, 159793, 158110, 156109, 153881, 150837, 146723, 142350, 138677, 135694, 132768, 129652, 126616, 123918, 121748, 120550, 120711, 121767, 122348, 121504, 120112, 120508, 124189, 129953, 134847, 137129, 137878, 139509, 143267, 148589, 154305, 159615, 164009, 167103, 168950, 170213, 171690, 173632, 175605, 177055, 178078, 179428, 181508, 183591, 184648, 184883, 185695, 187926, 191008, 194259, 198123, 203313, 209323, 214747, 218881, 222258, 225808, 230106, 235215, 240576, 245093, 247947, 249455, 250819, 253085, 256387, 259828, 261945, 261942, 260901, 261080, 263425, 266419, 268114, 268593]
56592B68593R10K312L374L862L859K872R12o98q77k55M8K98J510L541N105N379
56576C00745M643L565K762K814L856N223N936N507M140K660K333L792N921O813
56562C60710O221N814O489P012O248N277N717P166P951P647P194P118P311Q096
56548D55971R921J2116J3485J3939J4217J4225J3162J1274J0018J0174J1005J1391
56536F00898J0827R262O998M845L455K540J505N24J1m31j280j773j020j09j219
56521F35033m480p567q844r130r716j0465j0806j1010j1317j1068j0020r392j0305
56508E10913j1852j2130j0702q838p660p196p123p372p702p594o907o258o346
56495D03233o960o926n305k725j085j476k762k920j535%O44Q44J299J735J623
$$ y = [268593, 269503, 271815, 275189, 279051, 282910, 285782, 286694, 285996, 285119, 284864, 284912, 285210, 286720, 290261, 295366, 300745, 305388, 308953, 311715, 314529, 318385, 323608, 329544, 335051, 339191, 341851, 344184, 347976, 353897, 360710, 366931, 372745, 379234, 386246, 392494, 397771, 403488, 410654, 418605, 426252, 433446, 440564, 447875, 455971, 465892, 478008, 491493, 505432, 519649, 533874, 547036, 558310, 568328, 578502, 589507, 600898, 611725, 620987, 627985, 632830, 636285, 638825, 640330, 640854, 640865, 640434, 639154, 637381, 636361, 636252, 635033, 630553, 622986, 614142, 605012, 595296, 584831, 574025, 563015, 551698, 540630, 530610, 521218, 510913, 499061, 486931, 476229, 467391, 459731, 452535, 445412, 438040, 430338, 422744, 415837, 409579, 403233, 396273, 389347, 384042, 381317, 380232, 378756, 375994, 373074, 371539, 371539, 372183, 373027, 374326, 376061, 377684]
56480C77684J154P77M97L08O45J630K459K335J648J494K295L525M449M648M176
56465D09724L794M562O499Q059P638N435L148K208K982N212Q180J0522J1032R950
56451D98945Q693Q135P851P312O872P065P598P826P867Q410R516J0342J0241R601
56437F16274R168R054Q791Q199P558P069O607O251O419P090P378O403M386K441
56423G13088J368J119J148Q39k95k129l713m202l990m237n131n569m905m215n013
56408F74163p161q941r073p991p032o866p120p175o965o813o796o578n936n155
56394E74561m723m866n549o556p361p401o926p020q092q789p456m432j765n99
56380D93026r4Q12J809K039J551J031P90P07O33K53q46k196k305m20K015K847
$$ y = [377684, 378838, 379615, 380112, 380420, 381065, 382695, 385154, 387489, 389137, 390631, 392926, 396451, 400900, 405548, 409724, 413518, 418080, 424579, 432638, 440276, 445711, 448859, 451067, 454049, 459261, 467441, 477963, 488995, 498945, 507638, 515773, 523624, 530936, 537808, 544873, 552471, 560297, 568164, 576574, 586090, 596432, 606673, 616274, 625442, 634496, 643287, 651486, 659044, 666113, 672720, 678971, 685390, 692480, 699858, 706261, 710647, 713088, 714456, 715575, 716723, 717562, 717267, 715138, 711425, 707223, 703233, 698996, 693865, 688296, 683391, 679176, 674163, 667002, 658061, 648988, 640997, 633965, 627099, 619979, 612804, 605839, 599026, 592230, 585652, 579716, 574561, 569838, 564972, 559423, 552867, 545506, 538105, 531179, 524159, 516067, 507278, 499822, 495390, 493625, 493026, 492932, 493744, 495553, 497592, 499143, 500174, 500964, 501671, 502304, 502557, 501711, 499515, 497210, 496790, 498805, 501652]
56364E01652J938J312K382M171M692L494K049J850K671L005K083R34J031K160
56350E35424K543J322j6N28K757M506M437L547L493M316M642L754K538K137K443
56335E78371K647K846M026O164P537O788N058M776O608Q824R747R481Q910Q277
56321F70060P563P255P795Q808R621J0101J0396J0430J0243J0216J0388J0173
56309G83049R422R019R597J0361J0301R913J0419J1603J1853J0438Q496P316O676
56296I08463N545L763K320K092K778L254K876K164J910J877J181o6n48K96J151
56281I39056O15p14j053J88J953L135L531L453L399L887M575L972J268j766k179
56266I63320O33M177N893N674M991M907N742P543R732J0905J0054P886O320O672
$$ y = [501652, 503590, 504902, 507284, 511455, 516147, 519641, 521690, 523540, 526211, 529216, 531299, 532233, 533264, 535424, 537967, 539289, 539273, 539801, 542558, 547064, 551501, 555048, 558541, 562857, 567499, 571253, 573791, 575928, 578371, 581018, 583864, 587890, 594054, 601591, 608379, 613437, 618213, 624821, 633645, 643392, 652873, 661783, 670060, 677623, 684878, 692673, 701481, 711102, 721203, 731599, 742029, 752272, 762488, 772876, 783049, 792471, 801490, 811087, 821448, 831749, 841662, 852081, 863684, 875537, 885975, 894471, 901787, 908463, 914008, 917771, 920091, 922183, 924961, 928215, 931091, 933255, 935165, 937042, 938223, 938157, 937609, 937905, 939056, 939671, 938957, 937904, 938092, 940045, 943180, 946711, 950164, 953563, 957450, 962025, 965997, 967265, 965499, 963320, 963953, 968130, 974023, 979697, 984688, 989595, 995337, 1002880, 1012612, 1023517, 1033571, 1041457, 1047777, 1054449]
56252A054449Q705J1219J3206J4479J5372J5973J5917J5132J4352J4331J4945
56241A208080J5568J6088J6721J7134J6782J6083J6217J7558J9152J9935J9700
56230A399018J8844J8051J8317K0192K2594K3350K1497J8236J5372J3566J2501
56219A601538J1846J1362J0809J0279J0088R939Q873O530L722J319o65k329l090
56206A680221k495j169j77J82L23N16Q19J446K490L423L515K685J596J002J253
56191A695630K165L109L398K809J644L91k99M00K713N467O963O914O698P343Q262
56176A753607Q431P927P549P573P631P476P316P645Q900J0736J1672J0411P820
56163A864694O451P524R375R786Q758Q037Q653J0184J1837J3091J3516J3101J2763
$$ y = [1054449, 1063154, 1074373, 1087579, 1102058, 1117430, 1133403, 1149320, 1164452, 1178804, 1193135, 1208080, 1223648, 1239736, 1256457, 1273591, 1290373, 1306456, 1322673, 1340231, 1359383, 1379318, 1399018, 1417862, 1435913, 1454230, 1474422, 1497016, 1520366, 1541863, 1560099, 1575471, 1589037, 1601538, 1613384, 1624746, 1635555, 1645834, 1655922, 1665861, 1674734, 1681264, 1684986, 1686305, 1685640, 1683311, 1680221, 1677726, 1676557, 1676380, 1676562, 1676885, 1677401, 1678220, 1679666, 1682156, 1685579, 1689094, 1691779, 1693375, 1694377, 1695630, 1697795, 1700904, 1704302, 1707111, 1708755, 1709146, 1708847, 1709247, 1711960, 1717427, 1724390, 1731304, 1738002, 1745345, 1753607, 1762038, 1769965, 1777514, 1785087, 1792718, 1800194, 1807510, 1815155, 1824055, 1834791, 1846463, 1856874, 1864694, 1871145, 1878669, 1888044, 1897830, 1906588, 1914625, 1923278, 1933462, 1945299, 1958390, 1971906, 1985007, 1997770]
56150A997770J3643J5819J8271K0048K1014K1585K2125K2601K2767K2804K3657
56139B222104K6048K9330L2238L4771L8077M2288M6081M9020N2678N8296O4785
56128B695716P0479P5664Q1814Q9420R8351J09472J23858J40843J58825J77903
56118C822345J99794K25074K52127K79104L05118L28960L48041L59682L62939
56109F483184L58841L49583L37536L24063L08631K89546K65916K38657K09695
56100I165652J80723J52669J25800J00196P6089N3335L0423M919k4399n6473q9473
56089I719461j22299j53790j81859k05033k23967k39701k51007k55263k51650
56080G834892k41760k27452k10083j91629j74217j57999j41463j24532j09583
$$ y = [1997770, 2011413, 2027232, 2045503, 2065551, 2086565, 2108150, 2130275, 2152876, 2175643, 2198447, 2222104, 2248152, 2277482, 2309720, 2344491, 2382568, 2424856, 2470937, 2519957, 2572635, 2630931, 2695716, 2766195, 2841859, 2923673, 3013093, 3111444, 3220916, 3344774, 3485617, 3644442, 3822345, 4022139, 4247213, 4499340, 4778444, 5083562, 5412522, 5760563, 6120245, 6483184, 6842025, 7191608, 7529144, 7853207, 8161838, 8451384, 8717300, 8955957, 9165652, 9346375, 9499044, 9624844, 9725040, 9801129, 9854464, 9884887, 9889806, 9865407, 9808934, 9719461, 9597162, 9443372, 9261513, 9056480, 8832513, 8592812, 8341805, 8086542, 7834892, 7593132, 7365680, 7155597, 6963968, 6789751, 6631752, 6490289, 6365757, 6256174]
56071F256174r8516r0369q2986p5884p0238o6861o5249o4213o2665o0089n6714
56060E462390n3020m8999m4229l8680l2827k6939k0948j4990r365l929J844Q131
56048E178439J4507K0382K5333K9493L4046M0382M8063N4622N8679O2045O7072
56037E633063P2961P7019P9034Q1734Q6651R2079R5862R8127J00269J02923J05951
56026F625673J09185J12207J14471J16231J18391J21110J23669J26109J29653
56017G696699J35007J41357J47520J53083J58149J62947J67990J73726J80027
56008I116505J86769J94429K03058K11443K18829K26566K36159K46533K55710
55999A1096001K64552K75920K90335L05550L20591L37060L55846L75690L95946
$$ y = [6256174, 6157658, 6067289, 5984303, 5908419, 5838181, 5771320, 5706071, 5641858, 5579193, 5519104, 5462390, 5409370, 5360371, 5316142, 5277462, 5244635, 5217696, 5196748, 5181758, 5172393, 5168464, 5170308, 5178439, 5192946, 5213328, 5238661, 5268154, 5302200, 5342582, 5390645, 5445267, 5503946, 5565991, 5633063, 5706024, 5783043, 5862077, 5943811, 6030462, 6122541, 6218403, 6316530, 6416799, 6519722, 6625673, 6734858, 6847065, 6961536, 7077767, 7196158, 7317268, 7440937, 7567046, 7696699, 7831706, 7973063, 8120583, 8273666, 8431815, 8594762, 8762752, 8936478, 9116505, 9303274, 9497703, 9700761, 9912204, 10131033, 10357599, 10593758, 10840291, 11096001, 11360553, 11636473, 11926808, 12232358, 12552949, 12890009, 13245855, 13621545, 14017491]
55990A4017491M17992M42779M69486M97625N27947N60562N94718O31291O73014
55981A8832905P21473P76433Q38444R09136R88955J078285J181287J304579J451664
55972B8083161J623580J826003K070137K364133K708032L097947L528419L988847
55964D9290259M467315M966091N509933O135788O881656P791488Q923689J0348167
55956A04314386J2142727J4393968J7173963K0485432K4242228K8333722L2659930
55949B53746356L6947537M0407411M1674542L9423389L3380268K4804842J5773709
55942D86158054P740432O89075o311618j3770564k1039011k6822099l0240282
55935C96403987l1334634l0722401k9006570k6544041k3569175k0332669j7096084
$$ y = [14017491, 14435483, 14878262, 15347748, 15845373, 16373320, 16933882, 17528600, 18159891, 18832905, 19554378, 20330811, 21169255, 22078391, 23067346, 24145631, 25326918, 26631497, 28083161, 29706741, 31532744, 33602881, 35967014, 38675046, 41772993, 45301412, 49290259, 53757574, 58723665, 64233598, 70369386, 77251042, 85042530, 93966219, 104314386, 116457113, 130851081, 148025044, 168510476, 192752704, 221086426, 253746356, 290693893, 331101304, 372775846, 412199235, 445579503, 470384345, 486158054, 493898486, 494587561, 488275943, 474505379, 453466368, 426644269, 396403987, 365069353, 334346952, 305340382, 278796341, 255227166, 234894497, 217798413]
55928B17798413j4068409j1371303r035400p036782n383741m180397l569530l588421
55920A59564430m090853m817290n530936o095360o466849o655392o696391o636684
55912A12574675o527490o417346o338074o290688o250465o191406o102485n978211
55904F2478510n802535n552138n214907m800623m335893l853419l383657k948976
55896B6586362k561091k223096j933068j685807j474450j293304j138967j008265
55888A3268314q96980q01369p18943o46978n82472n24550m74425m31858l93970
55879G796769l58666l26624k98518k72950k48772k26854k07488j88468j67977
55870E500452j47361j28581j10806r2161p3448n7377m4979l5383k8658k6366k9213
$$ y = [217798413, 203730004, 192358701, 183323301, 176286519, 170902778, 166722381, 163152851, 159564430, 155473577, 150656287, 145125351, 139029991, 132563142, 125907750, 119211359, 112574675, 106047185, 99629839, 93291765, 87001077, 80750612, 74559206, 68456721, 62478510, 56675975, 51123837, 45908930, 41108307, 36772414, 32918995, 29535338, 26586362, 24025271, 21802175, 19869107, 18183300, 16708850, 15415546, 14276579, 13268314, 12371334, 11569965, 10851022, 10204044, 9621572, 9097022, 8622597, 8190739, 7796769, 7438103, 7111479, 6812961, 6540011, 6291239, 6064385, 5856897, 5668429, 5500452, 5353091, 5224510, 5113704, 5021543, 4948095, 4890718, 4845739, 4810356, 4781698, 4755332, 4726119]
55859D726119l6049m5390n6551o9027q1874r3868j03750j10611j14657j17029
55849C897313j18176j16997j12398j05013r6484q7587p8173o8554n9874n3042
55839C001015m8049m4449m1994m0765m0800m1705m2737m3549m4491m5737m6566
55828B520173m6396m6024m6543m7250m6119m2507l7858l3448k8946k3769j8285
55817B103028j2832p025j148K871L097l95n938j1988j7793k3274k8939l5180m0960
55804A923524m4156m3887m1683l9524l7677l5316l2271k9112k6115k3348k1210
55793A549225j9972j9147j8214j7569j7914j9007j9763j9466j8342j7150j6540
55782A346141j6489j6186j4909j3080j1592j0158p633m454l122n217r084j1809
$$ y = [4726119, 4690070, 4644680, 4588129, 4519102, 4437228, 4343360, 4239610, 4128999, 4014342, 3897313, 3779137, 3662140, 3549742, 3444729, 3348245, 3260658, 3182485, 3113931, 3054057, 3001015, 2952966, 2908517, 2866523, 2825758, 2784958, 2743253, 2700516, 2656967, 2612476, 2566739, 2520173, 2473777, 2427753, 2381210, 2333960, 2287841, 2245334, 2207476, 2174028, 2145082, 2121313, 2103028, 2090196, 2083171, 2082023, 2084894, 2087991, 2087596, 2081658, 2069670, 2051877, 2028603, 1999664, 1964484, 1923524, 1879368, 1835481, 1793798, 1754274, 1716597, 1681281, 1649010, 1619898, 1593783, 1570435, 1549225, 1529253, 1510106, 1491892, 1474323, 1456409, 1437402, 1417639, 1398173, 1379831, 1362681, 1346141, 1329652, 1313466, 1298557, 1285477, 1273885, 1263727, 1256094, 1251640, 1248518, 1243301, 1234217, 1222408]
55770A222408j2623j2980j4102j5927j8118k0462k2319k2984k2763k2634k2747
55759A014749k2304k1020j9764j9388j9778k0400k1089k1763k1886k0887j9015
55748G87455j7237j6113j5135j3499j1369r741q950q057o321m534l938m345m580
55735F63636m555n400p286q695q556p807p914q832r340q749p437o272o127p321
55721E59345r008r795r394q803q515p825o588o066o797p010m822j053J899L235
55707D78803M034M849N169N048N426O485P305P485P568P570O728N285M816N835
55693E62406O577N361L028J524J009J74j002r29P24J693j64l866o479o744o042
55678E57270n884o107o115o368p510q992r963j0804j2293j3686j3414j1570r933
$$ y = [1222408, 1209785, 1196805, 1182703, 1166776, 1148658, 1128196, 1105877, 1082893, 1060130, 1037496, 1014749, 992445, 971425, 951661, 932273, 912495, 892095, 871006, 849243, 827357, 806470, 787455, 770218, 754105, 738970, 725471, 714102, 704361, 695411, 687354, 681033, 676499, 672561, 668216, 663636, 659081, 653681, 646395, 637700, 629144, 621337, 613423, 604591, 595251, 586502, 579065, 572793, 566666, 559345, 550337, 540542, 531148, 522345, 513830, 506005, 499417, 493351, 486554, 479544, 474722, 473669, 475568, 478803, 482837, 487686, 492855, 497903, 503329, 509814, 517119, 524604, 532172, 539742, 546470, 551755, 556571, 562406, 568983, 574344, 577372, 578896, 579905, 580079, 579077, 578148, 578872, 580565, 580401, 576535, 570056, 563312, 557270, 551386, 545279, 539164, 532796, 525286, 516294, 506331, 495527, 483234, 469548, 456134, 444564, 434631]
55665D34631r243q339o669n737o725q248q061o109m211l374k979k295j378m70
55651C60793K83M05n97k362l869m597m937n435o199o893o932n820l863k207j766
55636C06004k248k683k537j996j596j864k808l543l111j897j210j198n94Q37J319
55621B80875k84k514l500l628m125m282k611J80J858J948J869K069J645Q34J137
55606B71471K389K424M52j621k353k765l782l981j943R45K270J942J728K188K261
55591B71625J449N30J76L48J046K357L686M095L539K819K451K469L268N462Q712
55576C14032J1676J3521J4869J6906K0041K3712K7199L0318L3519L7309M1536
55565E84638M5295M7690M8465M7682M5122M0444L3765K5688J6825P590j606j0286
$$ y = [434631, 425388, 417049, 410380, 404643, 397918, 389670, 381609, 375500, 371289, 367915, 364936, 362641, 361263, 360793, 361076, 361481, 360884, 358522, 354653, 350056, 345119, 339684, 333485, 326592, 319660, 313840, 309977, 307770, 306004, 303756, 301073, 298536, 296540, 294944, 293080, 290272, 286729, 283618, 281721, 280511, 279313, 278719, 279556, 280875, 280591, 278077, 274577, 270949, 266824, 262542, 259931, 260111, 261969, 263917, 265786, 267855, 269500, 270334, 271471, 273860, 276284, 276736, 275115, 272762, 269997, 266215, 262234, 260291, 261236, 263506, 265448, 267176, 269364, 271625, 273074, 273604, 273780, 274128, 275174, 277531, 281217, 285312, 288851, 291670, 294121, 296590, 299858, 305320, 314032, 325708, 339229, 354098, 371004, 391045, 414757, 441956, 472274, 505793, 543102, 584638, 629933, 677623, 726088, 773770, 818892, 859336, 893101, 918789, 935614, 943204, 941598, 931312]
55553I31312j8102k4961l0952l6118m0113m2104m1369l8130l3529k8704k4310
55542E72920k0878j9004j8714j9056j8843j7550j5334j2580r870q049p710q589
55530C96743r747j0397j0485j0619j1436j2822j3753j3215j1348r311q117q047
55518B67446q926j0189j0584q944n756l040k039j877j282p18j525l576n202n465
55504A98323n159n317n890o353o596o488n430l315j438j414l189n051n696n405
55490A31582m905m120k840j808j906k525k160p09K21k95j186j297j254k043k843
55475A01912k103k82M79n45j794j983j773k183k803k695j876r38k2Q61J206O58
55459H6119k79r09j229j518j685j619j635j975k469k999l456l005o93K578M232
$$ y = [931312, 913210, 888249, 857297, 821179, 781066, 738962, 697593, 659463, 625934, 597230, 572920, 552042, 533038, 514324, 495268, 476425, 458875, 443541, 430961, 421091, 413042, 405332, 396743, 386996, 376599, 366114, 355495, 344059, 331237, 317484, 304269, 292921, 283610, 275493, 267446, 258520, 248331, 237747, 228803, 223047, 220007, 217968, 216091, 214809, 214091, 212566, 208990, 203788, 198323, 193164, 187847, 181957, 175604, 169008, 162520, 157090, 153775, 152337, 150923, 147734, 142683, 136987, 131582, 126677, 122557, 119717, 117909, 116003, 113478, 111318, 110609, 110830, 110535, 109349, 108052, 106798, 104755, 101912, 99809, 99527, 100006, 99461, 97667, 95684, 93911, 91728, 88925, 86230, 84354, 83416, 83394, 84255, 85461, 86119, 85840, 84931, 83702, 82184, 80499, 78880, 77245, 75270, 72801, 69802, 66346, 63341, 62648, 65226, 69458]
55444F9458L276J904K309L382K676N37l55P99J821J077l09o44j68j11o37r49n64
55427H3502L94J475J791N65j472k176m67K089L101K370J831K792M327M646L295
55412A08063J481N31N79R02J202J981L434M716M929M410M162M344M356M247M722
55397A54059N541N318L457J141m63j772l586n242n401m187l232l546m413m603
55383A33071l849k855k361k463k611k233j421p92n41j32O43Q62m84k914m700m685
55367A02535l301j847j250j508j835j436m60po64j458j073J79O23m79j939k366
55351H3714j923j798k489l327l366k240l21J519K435K213J294J67r44j778j911
55336G1245j325o27l66l82k46Kj6l14n04k73M50J655L095L997L509J628n83j909
$$ y = [69458, 72734, 74638, 76947, 80329, 83005, 83542, 83187, 83986, 85807, 86884, 86575, 85931, 85763, 85652, 85015, 84066, 83502, 83896, 85371, 87162, 87727, 86255, 84079, 83612, 85701, 88802, 91172, 93003, 95795, 100122, 104768, 108063, 109544, 110075, 110654, 111556, 112758, 114739, 118173, 122889, 127818, 132228, 136390, 140734, 145090, 149337, 154059, 159600, 164918, 168375, 169516, 169053, 167281, 163695, 158453, 153052, 148865, 145633, 142087, 137674, 133071, 129222, 126367, 124006, 121543, 118932, 116699, 115278, 114486, 113945, 113813, 114456, 115318, 114834, 111920, 107220, 102535, 99234, 97387, 96137, 94629, 92794, 91358, 90898, 90891, 90227, 88769, 87696, 87875, 88498, 88019, 86080, 83714, 81791, 79993, 77504, 74177, 70811, 68571, 68250, 69769, 72204, 74417, 75711, 75878, 74934, 73156, 71245, 69920, 69293, 68927, 68545, 68299, 68301, 68285, 67971, 67467, 67194, 67644, 69299, 72394, 76391, 79900, 81528, 80945, 79036]
55318G9036k018j488j052r71j106j314j490j265j88J399K195J402J63L78J955
55303G5636K552O98k028l127k485j981k351k286p88J385L133M339N042M563K575
55288H4877J53j331j740j778j732j528j355j221n60P24J342R2k205l627l712l553
55272F2846l428k138O95L324L928K880J953J977K381K479K192J675J145R09J069
55257H3887J190P62j70j155j941k460k519k015j309r59j110j452j680j657j338
55242F6074q25l26J74R17J787K057J189l77j653k092j700n25J265K957L653L168
55226G5743K188J474J248J307J298R02J17o40j027j271j745k156j791n69O93J214
55210G6985R90M55q8m44l81J86J021J773K213K212J711Q51q9q51j164p50K23Q35
$$ y = [79036, 77018, 75530, 74478, 73507, 72401, 71087, 69597, 68332, 68144, 69543, 71738, 73140, 73303, 73681, 75636, 78188, 78886, 76858, 73731, 71246, 69265, 66914, 64628, 63840, 65225, 68358, 72697, 77739, 82302, 84877, 85030, 83699, 81959, 80181, 78449, 76921, 75566, 74345, 73785, 74509, 75851, 75943, 73738, 70111, 66399, 62846, 59418, 57280, 57975, 61299, 65227, 68107, 70060, 72037, 74418, 76897, 79089, 80764, 81909, 82818, 83887, 85077, 85839, 85669, 84514, 82573, 80113, 77594, 75579, 74270, 73311, 72201, 70749, 69069, 67412, 66074, 65249, 64923, 65097, 66014, 67801, 69858, 71047, 70670, 69017, 66925, 65225, 64700, 65965, 68922, 72575, 75743, 77931, 79405, 80653, 81960, 83258, 84160, 84277, 83637, 82610, 81339, 79594, 77438, 75647, 75078, 75771, 76985, 77975, 78430, 78342, 77898, 77517, 77703, 78724, 80497, 82710, 84922, 86633, 87484, 87395, 86544, 85380, 84630, 84853, 85688]
55192H5688K05j243k008j250K18J076J117J020J019N90n11j706k308k195j470
55177G8242r0J561K212Q87j458k399q10J568K104M36j386j693j011p36j130j398
55161G4899r31K69J825K890K441O10q99p23L13N15m8J11J101J222k19j514j021
55144H0841N66J629J944K040J453m34k399k339l15J246P34o77r51L36K122L385
55128H9181L704L132K342K266K920L192K496J858K407L460L367J984Q43P28M45
55113A24325j235l391l922k389p51q93k154k097L46L306M040K131j24n40N71J239
55097A18462K81j751l600m370l745k036j01J401K652L928M443L065L14j698j891
55082A15354j586k228k925j668J505M242M699L217J022j216k963l285j928k41
$$ y = [85688, 85893, 84650, 82642, 81392, 81610, 82686, 83803, 84823, 85842, 86432, 85921, 84215, 81907, 79712, 78242, 78152, 79713, 81925, 82812, 81354, 78955, 78145, 79713, 81817, 82253, 80867, 79174, 78163, 77427, 76297, 74899, 73968, 74237, 76062, 78952, 81393, 82003, 81104, 80381, 80694, 81209, 81161, 81272, 82373, 83595, 83376, 81862, 80841, 81407, 83036, 84980, 87020, 88473, 88039, 85640, 83301, 82986, 84232, 84966, 84289, 83338, 83674, 85796, 89181, 92885, 96017, 98359, 100625, 103545, 106737, 109233, 111091, 113498, 116958, 120325, 122309, 123152, 123880, 124325, 123090, 119699, 115777, 113388, 112637, 111744, 109590, 107493, 107839, 111145, 115185, 117316, 117192, 116652, 117223, 118462, 118743, 116992, 113392, 109022, 105277, 103241, 103140, 104541, 107193, 111121, 115564, 118629, 118943, 117245, 115354, 113768, 111540, 108615, 106947, 108452, 112694, 117393, 120610, 121632, 120416, 117453, 114168, 112240, 111999]
55068A11999O7j045j952j321M65J816J559O8j011l19J767L471L491K196Q86L79
55052A22516O26J136J347Q98N7m44k32M12J278K436L331K658J88k098k007J35
55036A32237K005K326J868J538J143N63N37J355J980J574Q81R27J201M89r20j366
55020A48338j60J496K225K052J838J992K258K358K232J812R53l64j861l046l553
55005A58570l497l295l074k617k090k179k965l223j861K01Q27n55k065j887o50
54990A29640m48k015l861m076k360j49Q97N00m8M84J611J743N22l62O07K621L562
54973A28868K639R31k53l98N78K309L574L279K102J956L417N019N528N466N638
54958A70653N719N474N971P882R745R743Q415P732Q072Q444R190J1753J5412J7062
$$ y = [111999, 112066, 111021, 109069, 107748, 108213, 110029, 111588, 111656, 110645, 110326, 112093, 115564, 119055, 121251, 122137, 122516, 123142, 124278, 125625, 126523, 126580, 126136, 125904, 126316, 127594, 130030, 133361, 136019, 136207, 134109, 132102, 132237, 134242, 136568, 138436, 139974, 141117, 141680, 142217, 143572, 145552, 147126, 148007, 148934, 150135, 150624, 149704, 148338, 148178, 149674, 151899, 153951, 155789, 157781, 160039, 162397, 164629, 166441, 167394, 167030, 165169, 162123, 158570, 155073, 151778, 148704, 146087, 143997, 141818, 138853, 135630, 133769, 133970, 134797, 134242, 132177, 130290, 129640, 129192, 127177, 123316, 119240, 116880, 116731, 117628, 118128, 118080, 118564, 120175, 121918, 122440, 122078, 122685, 125306, 128868, 131507, 132438, 132185, 131787, 132365, 134674, 138248, 141527, 143629, 145585, 149002, 154021, 159549, 165015, 170653, 176372, 181846, 187817, 195699, 205444, 215187, 223602, 231334, 239406, 247850, 257040, 268793, 284205, 301267]
54944C01267J5371J2846J2164J2561J1753R638P747O172L686L85k265m007o162
54931C81156r085j1365j2187j2604j3510j3872j2231q932n718l828l385l991m968
54918B65480n446n035m238l673l231k514j641j093j019j101p89N25L037N847P480
54903B52589P582P449Q325R818J0689J0523R708Q408O656N036M031K900L99l262
54889C40851o363p811q357r239j0545j1480j1575j0943r769q091o024l915k319
54876B34420j784k284k929k829k248k254l125l787l282k080j403j753k621l342
54862A98699l573l273k708k389k541k733k376j446m74o8n92j833k700j881N20
54847A70632K598K680J366N82R39J220M44r41k193l423m850n949o149n698n043
$$ y = [301267, 316638, 329484, 341648, 354209, 365962, 375600, 383347, 389519, 393205, 393590, 391325, 387318, 381156, 372071, 360706, 348519, 335915, 322405, 308533, 296302, 287370, 281652, 277824, 274439, 270448, 265480, 260034, 254999, 250761, 247088, 243857, 241343, 239702, 238609, 237590, 236489, 235700, 236225, 239262, 245109, 252589, 260171, 267620, 275945, 285763, 296452, 306975, 316683, 325091, 331747, 336783, 340814, 343714, 344113, 340851, 334488, 326677, 318320, 309081, 298536, 287056, 275481, 264538, 254769, 246678, 240654, 236739, 234420, 232636, 230352, 227423, 224594, 222346, 220092, 216967, 213180, 209898, 207818, 206415, 204662, 202041, 198699, 195126, 191853, 189145, 186756, 184215, 181482, 179106, 177660, 177186, 177118, 176526, 174693, 171993, 170112, 170632, 173230, 175910, 177276, 177858, 178797, 180017, 180461, 179520, 177327, 173904, 169054, 163105, 156956, 151258, 146215]
54832A46215l998k343p25M3J23J10k20j480l119l680k764j548r35l70R12K452
54816A28673L263L209K860K531K239K102J952J153k74q61O57L224M423L616K671
54801A61438L241M779O034P064Q578J0217J1042J1135J1385J1914J2242J2884
54789B71953J5065J8365K0159J8549J4796J1716J0304R241P378N173L517K244
54777D08460N68j699l957n480n835m952l218j297M24K132M135O332Q320R878J1046
54762D24857J1943J2696J3309J3390J2274R833P003N013M067L162J301j329l418
54749E14101l677k047O8J040O78M13J467L189L829K669N69j603m049p122j0173
54734D99352j2058j2506j2290j2214j2359j2360j2043j1677j1618j1667j0919
$$ y = [146215, 142217, 139874, 139149, 139192, 139315, 139425, 139205, 137725, 134606, 130926, 128162, 126614, 125679, 125309, 126221, 128673, 131936, 135145, 138005, 140536, 142775, 144877, 146829, 147982, 147708, 146847, 147504, 150728, 155151, 158767, 161438, 164679, 169458, 175492, 182556, 191134, 201351, 212393, 223528, 234913, 246827, 259069, 271953, 287018, 305383, 325542, 344091, 358887, 370603, 380907, 390148, 397526, 402699, 406216, 408460, 409028, 407329, 403372, 397892, 392057, 387105, 383887, 382590, 383014, 385146, 389281, 395613, 403933, 413811, 424857, 436800, 449496, 462805, 476195, 488469, 498302, 505305, 510318, 514385, 517547, 518848, 517519, 514101, 510424, 508377, 508445, 509485, 510163, 510576, 512043, 515232, 519061, 521730, 522299, 520696, 516647, 509525, 499352, 487294, 474788, 462498, 450284, 437925, 425565, 413522, 401845, 390227, 378560, 367641]
54723C67641q718n816l946l948m851n288n226n596o581p228o845n931n459n675
54709B86533o011n928n548n412n647n502m055j611N0n45k765m487m476l421k479
54694B28696j668m02J056J514L99j365k335k009r91K6R77K036L058L712M048M499
54678B41251N215N775N744N359N319N906O515O277N199M415N049O814Q192Q239
54664C25269P778Q367J0349J2585J3968J4533J5041J6088J7853K0173K2626K4844
54652E09474K6822K8610K9841L0079K9335K7564K3993J8006J0635L799j953p540
54640G28665j2969j6605j7754j8237k0091k2884k4726k4795k3451k0931j7616
54629E08606j4761j3191j1871r452o661n276n236m851l689l067l499l788l212
$$ y = [367641, 358923, 353107, 349161, 345213, 340362, 335074, 329848, 324252, 317671, 310443, 303598, 297667, 292208, 286533, 280522, 274594, 269046, 263634, 257987, 252485, 248430, 246819, 246869, 246324, 243559, 239072, 234596, 231175, 228696, 227028, 226626, 227682, 229196, 229595, 228230, 225895, 223886, 222895, 222921, 223898, 225934, 228992, 232704, 236752, 241251, 246466, 252241, 257985, 263344, 268663, 274569, 281084, 287361, 292560, 296975, 302024, 308838, 317030, 325269, 333047, 341414, 351763, 364348, 378316, 392849, 407890, 423978, 441831, 462004, 484630, 509474, 536296, 564906, 594747, 624826, 654161, 681725, 705718, 723724, 734359, 738158, 736205, 728665, 715696, 699091, 681337, 663100, 643009, 620125, 595399, 570604, 547153, 526222, 508606, 493845, 480654, 468783, 459331, 452670, 447394, 442158, 437307, 433618, 430551, 427052, 423264, 420052]
54616D20052k760l418m750n848o367o247n615n325o195p376p107n385m231m746
54602C44682n625n409m480l903l869m216n032n793n395m028l378m029m319l091
54588B82115j778k109l375l814l305k806k293j347p57j475k768l315l385l871
54574B45717m015k480j22Q08R4k21Q30J915K022K052K955M120M476L964L126K383
54558B67624K195K857L825M310M599N547O701O659N521N154O392P749P835P520
54544C44488Q497J0864J3361J5137J6085J6214J5678J4918J3866J1618P691L124
54532D91541n50k899m454n515n960o044o474p578q902r717r737r258q702q048
54518C97703o936n451m415m355m633m251l272k471j996j370o86n82j002j239j293
$$ y = [420052, 417292, 413874, 409124, 403276, 396909, 390662, 385047, 379722, 373527, 366151, 359044, 353659, 349428, 344682, 339057, 333648, 329168, 325265, 321396, 317180, 312148, 306355, 300960, 296932, 293554, 289525, 285206, 282115, 280337, 278228, 274853, 271039, 267734, 264928, 262635, 261288, 260531, 259056, 256288, 252973, 249588, 245717, 241702, 239222, 239100, 239908, 240002, 239781, 240611, 242526, 244548, 246600, 249555, 253675, 258151, 262115, 265241, 267624, 269819, 272676, 276501, 280811, 285410, 290957, 297658, 304317, 309838, 314992, 321384, 329133, 336968, 344488, 352985, 363849, 377210, 392347, 408432, 424646, 440324, 455242, 469108, 480726, 488417, 491541, 490991, 488092, 483638, 478123, 472163, 466119, 459645, 452067, 443165, 433448, 423711, 414453, 405751, 397703, 390767, 385316, 380901, 376546, 371913, 367662, 364390, 361919, 359923, 358553, 357867, 357285, 356283, 355044, 353751]
54503C53751j822k604k506j474j007j941l120l175k375j758j500j266j116r53
54489C27134n2J606K396J010j288j922k98J641K227J912J893K088J464j01j221
54474C38489n44J451K817K407J218Q17J010K62j706l217k923j468j61P26J378
54459C40556J357L99o00o36j03l8m69p01q14j492k540k904k190j170p49j151k105
54442C24650l001l174k759k916m148m969l609q23O80j69j461j175J00M20o14j555
54426B95477j272j62Q16J337J631J841J867J654J278Q36N70R84K357L958M366
54411C17538L178K001K641M499N041L224J057R60K704M190M249L299J891L09o01
54396C56180N1J620K268J371K77J70M41l4j014j392q82j31N38J408K291K127K06
$$ y = [353751, 351929, 349325, 346819, 345345, 344338, 342397, 339277, 336102, 333727, 331969, 330469, 329203, 328087, 327134, 327082, 328688, 331084, 332094, 330806, 328884, 328586, 330227, 332454, 334366, 336259, 338347, 339811, 339710, 338489, 337945, 339396, 342213, 344620, 345838, 346655, 347665, 347927, 346221, 343004, 340081, 338613, 338452, 339178, 340556, 341913, 342312, 341712, 341076, 340973, 340935, 340466, 339765, 338951, 337459, 334919, 332015, 329825, 328655, 327906, 326755, 324650, 321649, 318475, 315716, 312800, 308652, 303683, 300074, 299251, 299931, 299762, 298301, 297126, 297226, 297646, 297032, 295477, 294205, 294043, 294859, 296196, 297827, 299668, 301535, 303189, 304467, 305303, 305873, 306857, 309214, 313172, 317538, 320716, 322717, 325358, 329857, 334898, 338122, 339179, 340139, 342843, 347033, 351282, 354581, 356472, 356781, 356180, 356231, 357851, 360119, 361490, 361767, 361937, 362378, 362344, 361330, 359938, 359056, 358925, 359463, 360871, 363162, 365289, 365495]
54379C65495k585m347m105k834k232k671k893j869k84L42m05j447j653j044n62
54364C36906j004k151k757j687N80K055J488o0p22m56q14k121k589r42J359J835
54348C28920K30j362j443p42n61p45l47L53o5k018m058m821m814n187n552m568
54332B93220k446j200j931l446m341m977o301p901q582q044o638m296j275P03
54318B32545k3k542m175l890l239l589m147l491j767l97m15j807l789n174n069
54303A89031l673k001o85K82O42j43j763k941k968k474k235k109j720j318j327
54288A64598j681k134k613k832k316j241n33o52r91r67q80j217j754j979j650
54273A41158o37R10J870Q66j609l039j808P16K110J946J525J468J204N01o9j66
$$ y = [365495, 362910, 358563, 354458, 351624, 349392, 346721, 343828, 341959, 341675, 342017, 341612, 340165, 338512, 337468, 336906, 335902, 333751, 330994, 329307, 329887, 331942, 333430, 333370, 332648, 332192, 331378, 329257, 326668, 325726, 327085, 328920, 329150, 327788, 326345, 325603, 325042, 324297, 323950, 324303, 324238, 322220, 318162, 313341, 308527, 303340, 297788, 293220, 290774, 289574, 287643, 284197, 279856, 274879, 268578, 260677, 252095, 244051, 237413, 233117, 231842, 232545, 232522, 229980, 225805, 221915, 218676, 215087, 210940, 207449, 205682, 205285, 204870, 203063, 199274, 194100, 189031, 185358, 183357, 182672, 182954, 183596, 183453, 181690, 178749, 175781, 173307, 171072, 168963, 167243, 165925, 164598, 162917, 160783, 158170, 155338, 153022, 151781, 151248, 150596, 149605, 148638, 147758, 146541, 144787, 142808, 141158, 140521, 141431, 143301, 144167, 142558, 139519, 137711, 138427, 140537, 142483, 144008, 145476, 146680, 147181, 147112, 146946]
54257A46946o5Q6L75N24J25n01m83N15J974L077L080J577p47k120j455J73Q37
54240A53918K21l56q5M34M95J76k49p70j233j339j288j547j961j930j485j227
54224A41774j264j236j364k107k744j821M57J859J041n40o68O62J604R54p88k445
54208A33374l174k881k419k921m186m387k314O52K010J137l32q51l72N14J392
54193A15242J719R03p62k025k063j268m42K5j40j196k570k798j153J177K368K026
54177A09043J175N99J56m35j002j348j415r34L44J882K624K302J758J541J031
54162A17321l26j719j908j058m95p47r82m85L57R70J386J574Q54r33k338j638
54146A09833Q11K637K209N70K0J236K526J990l8j337n06J300J931J131P42J837
$$ y = [146946, 146881, 146967, 147342, 147866, 147991, 147490, 147007, 147522, 149496, 152573, 155653, 157230, 156483, 154363, 152908, 153081, 153918, 154139, 153783, 153698, 154132, 154627, 154803, 154554, 153784, 152551, 151212, 149924, 148377, 146416, 144486, 143001, 141774, 140510, 139274, 137910, 135803, 133059, 131238, 131695, 133554, 134595, 134055, 133387, 134049, 135653, 136607, 135819, 133374, 130200, 127319, 124900, 121979, 117793, 113406, 111092, 111744, 113754, 114891, 114559, 113708, 113336, 113850, 115242, 116961, 117864, 117102, 115077, 113014, 111746, 111304, 111329, 111189, 109993, 107423, 104625, 103472, 104649, 107017, 109043, 110218, 110817, 110973, 110538, 109536, 108188, 106773, 105839, 106183, 108065, 110689, 112991, 114749, 116290, 117321, 116995, 115276, 113368, 112310, 111815, 111068, 110086, 109601, 109958, 110928, 112314, 113888, 114742, 113809, 111471, 109833, 110644, 113281, 115490, 116060, 116080, 117316, 119842, 121832, 121794, 120457, 119951, 121251, 123182, 124313, 125055, 126892]
54130A26892K910J945n77k096j205Q13J828J169k98j466j788j421j154j680k572
54115A21300k524j005R41K058K447K970L582L247J567l96j185l98J128K251K460
54100A38443K119J953K163K192J412M7r75r53n9Q49Q58l70k145l079k373q00M5
54083A39327l73r70o47J88L21l78p33q8N47j17j573j852kK636M095L981L269K483
54065A50114J206o44k153k507j916r46L67J987L153L091K232J758J968K009J391
54050A61110Q85J423K649L250K555J306P89J418K447K987L113L462L997L865K906
54035A98162K395L435N137N573M400L191L159L876M707O042Q094R717R813R263
54021B76964R932J1991J3604J3334J1659R857Q524P654P181O904O493O110O422
$$ y = [126892, 129802, 131747, 131170, 129074, 127869, 128682, 130510, 131679, 131381, 129915, 128127, 126706, 125552, 123872, 121300, 118776, 117771, 118712, 120770, 123217, 126187, 129769, 133016, 134583, 134187, 133002, 132604, 133732, 135983, 138443, 140562, 142515, 144678, 146870, 148282, 148329, 147354, 146401, 146342, 147191, 148049, 147679, 145534, 142455, 140082, 139282, 139327, 138954, 137984, 137337, 137525, 137846, 137468, 136735, 136647, 137194, 137077, 135504, 133652, 133650, 136286, 140381, 144362, 147631, 150114, 151320, 150676, 148523, 146016, 144100, 143154, 143521, 145508, 148661, 151752, 153984, 155742, 157710, 159719, 161110, 161995, 163418, 166067, 169317, 171872, 173178, 173967, 175385, 177832, 180819, 183932, 187394, 191391, 195256, 198162, 200557, 203992, 209129, 214702, 219102, 222293, 225452, 229328, 234035, 240077, 248171, 257888, 267701, 276964, 286896, 298887, 312491, 325825, 337484, 347341, 355865, 363519, 370700, 377604, 384097, 390207, 396629]
54008C96629P458Q064P131M992L064K326K674L386L660K818P01j987m080m937
53994D31899m861m614m715n180n692n861n475m635l779l561m410n955o989o536
53980C59636m959l616l320l654l931m080m154l746k638j692k078l683n113n346
53966C07626m689l905l115k061r41l51m92q27o42J77R74J058N89M95J258K077
53950B97231J777M15o56m65N04J219J551K219L569N006N660N227M103K995K521
53935C32876L067M681O953R070J0287J0558J0540J0651J0444R307P623O494O252
53922D38803O045N263M538M663N166M910L840L076L182L311K545J418J475L607
53908D91842P141J0519J2476J2789J2200J1692J1645J1750J1641J1379J1209J1170
$$ y = [396629, 404087, 412151, 419282, 424274, 427338, 429664, 432338, 435724, 439384, 442202, 442903, 440916, 436836, 431899, 427038, 422424, 417709, 412529, 406837, 400976, 395501, 390866, 387087, 383526, 379116, 373161, 366172, 359636, 354677, 351061, 347741, 344087, 340156, 336076, 331922, 328176, 325538, 323846, 321768, 318085, 312972, 307626, 302937, 299032, 295917, 293856, 292915, 292564, 292072, 291245, 290603, 290780, 291754, 292812, 293401, 293896, 295154, 297231, 299008, 299423, 298767, 298302, 298806, 300025, 301576, 303795, 307364, 312370, 318030, 323257, 327360, 330355, 332876, 335943, 340624, 347577, 356647, 366934, 377492, 388032, 398683, 409127, 418434, 426057, 432551, 438803, 444848, 450111, 454649, 459312, 464478, 469388, 473228, 476304, 479486, 482797, 485342, 486760, 488235, 491842, 498983, 509502, 521978, 534767, 546967, 558659, 570304, 582054, 593695, 605074, 616283, 627453]
53896F27453J1203J1389J1636J1321R690O820L887K216K133K797L068K392R05
53883G06910j072l366n694p379p763p022o187o115o689p325p864q507r078r130
53869F13719q809q863r514r903r164p700o821p339q924j0593j1393j0877r455
53856D94364q192p800p900p708p221p115p629q332q937r481r586q500o349m498
53842C85116m025m473m756m723m981n567n856n606n159m599l510j870n22l39j287
53827C27843k565l368l369k832k426k614l070l015k236j445j404k029k730l219
53813B91521l592l739l291k264j291p69j26J423L354L884K143k64p64J197L670
53798B91092M808M881N189O048O887P568Q314Q658P879O544O333P792R427R686
$$ y = [627453, 638656, 650045, 661681, 673002, 682692, 689512, 693399, 695615, 697748, 700545, 703613, 706005, 706910, 705838, 702472, 696778, 689399, 681636, 674614, 668427, 662312, 655623, 648298, 640434, 631927, 622849, 613719, 604910, 596047, 586533, 576630, 567466, 559766, 552945, 545606, 536682, 526089, 514696, 503819, 494364, 486172, 478372, 470472, 462764, 455543, 448428, 440799, 432467, 423530, 414049, 404463, 395963, 389614, 385116, 381091, 376618, 371862, 367139, 362158, 356591, 350735, 345129, 339970, 335371, 331861, 329991, 329469, 329130, 327843, 325278, 321910, 318541, 315709, 313283, 310669, 307599, 304584, 302348, 300903, 299499, 297470, 294740, 291521, 287929, 284190, 280899, 278635, 277344, 276575, 276449, 277872, 281226, 285110, 287253, 286989, 286225, 287422, 291092, 295900, 300781, 305970, 312018, 318905, 326473, 334787, 343445, 351324, 357868, 364201, 371993, 381420, 391106]
53784C91106Q911Q431Q399P771O253N101N515O982P873P286N747M181K881J794
53770D78231J125J022R56K37q38j246q53r25k385m352n312n164n050n433n457
53755D44556m412k817j759j758k604l682m287m087l532l318l484l553l502l803
53741C97958m373m392l586k890l284m494n503n913o127o425o482n863m719l760
53727C30147l543l782l602k680j833k064l206m124m077l301k357j562j148j276
53713B91592j793k379k879l082k535j376q22j755l088k989j505m31n36p04k23
53698B65495po58j120n08K35K7l88K75J588K141J772J450J462J327J057R97P52
53681B75897j64r15j77J717L015L054L016L898N038N273M452L325K635K690L282
$$ y = [391106, 400017, 408448, 416847, 424618, 430871, 435972, 441487, 448469, 456342, 463628, 469375, 473556, 476437, 478231, 479356, 480378, 481334, 481571, 480733, 479487, 478634, 477709, 475324, 470972, 465660, 460496, 455446, 450013, 444556, 440144, 437327, 435568, 433810, 431206, 427524, 423237, 419150, 415618, 412300, 408816, 405263, 401761, 397958, 393585, 389193, 385607, 382717, 379433, 374939, 369436, 363523, 357396, 350971, 344489, 338626, 333907, 330147, 326604, 322822, 319220, 316540, 314707, 312643, 309437, 305313, 301236, 297935, 295578, 294016, 292868, 291592, 289799, 287420, 284541, 281459, 278924, 277548, 276726, 274971, 271883, 268894, 267389, 266958, 266422, 265718, 265495, 265488, 264830, 263710, 263202, 263437, 263464, 263076, 263351, 264939, 267080, 268852, 270302, 271764, 273091, 274148, 275145, 275897, 275733, 274818, 274641, 276358, 279373, 282427, 285443, 289341, 294379, 299652, 304104, 307429, 310064, 312754, 316036]
53666C16036L683L255K104Q13k85j079j292q57k93J06R25K495L661L043J259L67
53650C33941J113K139K185J597J279J373J598J890K124J942J250L04p96j938k392
53635C47609j422L24J138L24j062j686j251j55J056J673J373J016J680K719K323
53620C55659L26j166p32M78Q65Q14J583K958L652L306K614J990J451J326J857
53605C76981K450K503K553L373M433M571L871L431L390K909K200K796N013O679
53591D27153N725L086J640K638M543N440N267N061N042M566L580K922L050L517
53577D83230L985M748N635N533L999K468K467L323L208K106J732K516K818J751
53563E29519Q01J483L067M065M525N165N364L924J386k92k37N88J115J235J049
$$ y = [316036, 319719, 322974, 325078, 325891, 325606, 324527, 323235, 322378, 322085, 322191, 323116, 325611, 329272, 332315, 333574, 333941, 335054, 337193, 339378, 340975, 342254, 343627, 345225, 347115, 349239, 351181, 352431, 352735, 351939, 350001, 347609, 346187, 346511, 347649, 347973, 346911, 345225, 343974, 343819, 344875, 346548, 347921, 348937, 350617, 353336, 355659, 355985, 354819, 354087, 354565, 355430, 356244, 357827, 360785, 364437, 367743, 370357, 372347, 373798, 375124, 376981, 379431, 381934, 384487, 387860, 392293, 396864, 400735, 404166, 407556, 410465, 412665, 415461, 420474, 427153, 432878, 435964, 437604, 440242, 444785, 450225, 455492, 460553, 465595, 470161, 473741, 476663, 479713, 483230, 487215, 491963, 497598, 503131, 507130, 509598, 512065, 515388, 518596, 520702, 522434, 524950, 527768, 529519, 530320, 531803, 534870, 538935, 543460, 548625, 553989, 557913, 559299, 559007, 558770, 559358, 560473, 561708, 562757]
53548E62757M53j03L91K077L582L449J928P38J142K569L256K294P90O45K366M759
53532E93093O732Q267R355R269P833O392O201O573N988M629M327N986Q473J0296
53518F93414J1308J2241J3425J4527J5119J5181J5264J6040J7457J8570J8732
53507H61278J8579J9138K0333K1230K1658K2550K4515K6865K8483K9137K9643
53496A123409L0979L3224L5362L6298L6188L6231L6936L7478L7229L6932L7337
53485A517603L7749L7230L6458L6795L8133L9328M0287M1641M2651M1813L9860
53474A949548L9657M2144M4584M4200M1686L9515L8344L7067L5188L3040L0291
53463B375264K6351K2192J9908K0174K1479K2049K1337J9475J6609J3305J0493
$$ y = [562757, 563210, 563107, 563498, 565575, 569157, 572606, 574534, 575272, 576414, 578983, 582239, 584533, 585323, 585968, 588334, 593093, 599825, 608092, 617447, 626716, 634549, 640941, 647142, 653715, 659703, 664332, 668659, 674645, 683118, 693414, 704722, 716963, 730388, 744915, 760034, 775215, 790479, 806519, 823976, 842546, 861278, 879857, 898995, 919328, 940558, 962216, 984766, 1009281, 1036146, 1064629, 1093766, 1123409, 1154388, 1187612, 1222974, 1259272, 1295460, 1331691, 1368627, 1406105, 1443334, 1480266, 1517603, 1555352, 1592582, 1629040, 1665835, 1703968, 1743296, 1783583, 1825224, 1867875, 1909688, 1949548, 1989205, 2031349, 2075933, 2120133, 2161819, 2201334, 2239678, 2276745, 2311933, 2344973, 2375264, 2401615, 2423807, 2443715, 2463889, 2485368, 2507417, 2528754, 2548229, 2564838, 2578143, 2588636]
53452B588636Q454O644M865L699L130J677k128p691j2718j5522j6429j6983j8381
53439B527253k0760k3459k5759k7609k9669l2251l4307l4292l2274l0397l0536
53428B205940l2054l2872l2268l1300l0573k9317k7295k5983k6595k7912k7682
53417A882089k5485k2696j9979j6776j3249j0824r894q549m871L78M587O481P437
53404A768649R682J3931J8984K3291K6612K9899L3634L6884L8597L9320M0574
53393B080057M2746M4894M6781M9598N4095N9258O3723O7452P1080P4582P7562
53382B731828Q0091Q2223Q3606Q4665Q7115R1743R6479R8504R7800R6618R5762
53371C726434R3882R0748Q8541Q8517Q8532Q5892Q1212P7179P4324P0410O4127
$$ y = [2588636, 2597090, 2603734, 2608599, 2612298, 2615428, 2617105, 2614977, 2607286, 2594568, 2579046, 2562617, 2545634, 2527253, 2506493, 2483034, 2457275, 2429666, 2399997, 2367746, 2333439, 2299147, 2266873, 2236476, 2205940, 2173886, 2141014, 2108746, 2077446, 2046873, 2017556, 1990261, 1964278, 1937683, 1909771, 1882089, 1856604, 1833908, 1813929, 1797153, 1783904, 1773080, 1763186, 1754637, 1749766, 1750144, 1754731, 1761212, 1768649, 1778331, 1792262, 1811246, 1834537, 1861149, 1891048, 1924682, 1961566, 2000163, 2039483, 2080057, 2122803, 2167697, 2214478, 2264076, 2318171, 2377429, 2441152, 2508604, 2579684, 2654266, 2731828, 2811919, 2894142, 2977748, 3062413, 3149528, 3241271, 3337750, 3436254, 3534054, 3630672, 3726434, 3820316, 3911064, 3999605, 4088122, 4176654, 4262546, 4343758, 4420937, 4495261, 4565671, 4629798]
53360D629798N7232N2283M9730M8084M5838M2272L7276L1418K5701K0377J4415
53349E054424O926j366r013j5901k3236l1532l9916m7648n5086o2567o9427p5038
53337D630620p9851q4457q8240r0233r0739r0875r0932r0550r0173r0741r1820
53326C652009r1897r0908r0697r2103r3262r2120q9254q6708q5110q3515q1312
53315B675123p8460p4521o9327o4319o1178n9136n5736n0429m5337m1790l8325
53304B036565l3376k8007k4260k2126j9990j7184j4353j1842r458p393n829l910
53292A838837p02L010N588P169R565J3359J6973J9256K1075K3432K5707K7174
53280B010443K8858L2143L6349L9393M0470M0529M0446M0238M0070M0536M1512
$$ y = [4629798, 4687030, 4739313, 4789043, 4837127, 4882965, 4925237, 4962513, 4993931, 5019632, 5040009, 5054424, 5061350, 5059984, 5050971, 5035070, 5011834, 4980302, 4940386, 4892738, 4837652, 4775085, 4705658, 4630620, 4550769, 4466312, 4378072, 4287839, 4197100, 4106225, 4015293, 3924743, 3834570, 3743829, 3652009, 3560112, 3469204, 3378507, 3286404, 3193142, 3101022, 3011768, 2925060, 2839950, 2756435, 2675123, 2596663, 2522142, 2452815, 2388496, 2327318, 2268182, 2212446, 2162017, 2116680, 2074890, 2036565, 2003189, 1975182, 1950922, 1928796, 1908806, 1891622, 1877269, 1865427, 1855969, 1848576, 1842747, 1838837, 1838135, 1841145, 1846733, 1853902, 1863467, 1876826, 1893799, 1913055, 1934130, 1957562, 1983269, 2010443, 2039301, 2071444, 2107793, 2147186, 2187656, 2228185, 2268631, 2308869, 2348939, 2389475, 2430987]
53269B430987M1781M0342L7503L4464L2395L1866L2346L2222L0142K6609K3469
53258B794126K1683K0428J8641J6443J4348J1963Q386L658r72m464p248j0910
53246B886082j6492k3190k9077l3243l6692m0697m4908m7989m9694n1061n2647
53235B460392n3767n3745n2850n1713n0875n1053n2638n4563n4910n3210n1089
53224A879979n0132n0312n1110n2649n4713n5997n5617n4409n3478n2469n0517
53213A298576m7969m5783m4006m2227m0666l9394l7385l4100l1121l0264l0577
53202H75084k9488k6610k4116k3344k3267k2715k1881k0972j9422j7377j6250
53191F29642j6708j7582j7569j6698j5327j3289j1016j0021j0991j2499j2904
$$ y = [2430987, 2472768, 2513110, 2550613, 2585077, 2617472, 2649338, 2681684, 2713906, 2744048, 2770657, 2794126, 2815809, 2836237, 2854878, 2871321, 2885669, 2897632, 2906018, 2909676, 2908704, 2904240, 2896992, 2886082, 2869590, 2846400, 2817323, 2784080, 2747388, 2706691, 2661783, 2613794, 2564100, 2513039, 2460392, 2406625, 2352880, 2300030, 2248317, 2197442, 2146389, 2093751, 2039188, 1984278, 1931068, 1879979, 1829847, 1779535, 1728425, 1675776, 1621063, 1565066, 1509449, 1455040, 1401562, 1349093, 1298576, 1250607, 1204824, 1160818, 1118591, 1077925, 1038531, 1001146, 967046, 935925, 905661, 875084, 845596, 818986, 794870, 771526, 748259, 725544, 703663, 682691, 663269, 645892, 629642, 612934, 595352, 577783, 561085, 545758, 532469, 521453, 511432, 500441, 487942, 475038]
53180D75038j2336j1687j0796r110p320o701p161p328o396m961m199m903o946
53167C75194r082r645q203o067m676m213m234m614n016m539l067k024k485l258
53153C04071k410j96J152L31j779l651m509m114k567q32k53j184k603l322k905
53138B75229j624l09j05j418l036l286k053p39k94l55l71k94L6R94K220K668K231
53121B69494K090K810L188K038K01n03K98J391K064K873M144M996M540L249K334
53106C05207K183K229K162K296K517J799m90l253m577l941k632j926j735j445
53092B98394j204j520k222k697k944l563m768o047o704o259m549k205o73r77k427
53077B49635l472l759m325n575o288n313l287j731j043m77K16K93o97k046k733
$$ y = [475038, 462702, 451015, 440219, 431109, 423789, 417088, 409927, 402599, 396203, 391242, 387043, 382140, 375194, 366112, 356467, 348264, 342197, 337521, 333308, 329074, 324460, 319444, 314905, 311838, 309814, 307329, 304071, 301661, 301465, 302617, 302948, 301169, 297518, 293009, 288895, 286328, 285496, 285243, 284059, 281456, 278134, 275229, 273605, 273296, 273191, 271773, 268737, 265451, 263398, 262659, 262365, 262010, 261639, 261345, 261381, 262375, 264595, 267263, 269494, 271584, 274394, 277582, 279620, 279821, 279318, 279616, 281007, 283071, 285944, 290088, 295084, 299624, 302873, 305207, 307390, 309619, 311781, 314077, 316594, 318393, 317903, 314650, 310073, 306132, 303500, 301574, 299839, 298394, 297190, 295670, 293448, 290751, 287807, 284244, 279476, 273429, 266725, 260466, 255917, 253712, 253039, 252062, 249635, 246163, 242404, 238079, 232504, 226216, 220903, 217616, 215885, 214842, 214365, 214581, 214874, 214177, 212131, 209398]
53062B09398k624k311k152k057k017k212k535k448j660n91J26L35J96l66j517
53047A87565k835l422k825j493j71P19R78M52o94j874k525k561k247j955k055
53032A65057k546k680j580M93K089K119R56l26j182j613j682j635j876k196j756
53017A51642n20K1j296l335l897k659j345r78n57Q95K427K378P57p58r62k60L44
53000A41897O20J079J919K489J997N49p97j135n80M9R8n21j466k141k043j304
52984A40710o87o87r21p39m7R46K310L996N228N171M072K835J619j14k029k645
52968A59018j163J264K890L314L365L500L336K702K112J990K059K054K430L501
52954A92372M285L254N94j439j179J94K66j290k472k005r45p85j418k007k559
$$ y = [209398, 206774, 204463, 202311, 200254, 198237, 196025, 193490, 191042, 189382, 188791, 188917, 189252, 189448, 189082, 187565, 184730, 181308, 178483, 176990, 176819, 177538, 178516, 178968, 178274, 176400, 173875, 171314, 169067, 167112, 165057, 162511, 159831, 158251, 158744, 160833, 162952, 163908, 163582, 162400, 160787, 159105, 157470, 155594, 153398, 151642, 151122, 151143, 149847, 146512, 142615, 139956, 138611, 137633, 137076, 137971, 140398, 142776, 143533, 142775, 141813, 141553, 141897, 142517, 143596, 145515, 148004, 150001, 150550, 149753, 148618, 148038, 148087, 148185, 147664, 146198, 144057, 142014, 140710, 140023, 139336, 138415, 137676, 137629, 138575, 140885, 144881, 150109, 155280, 159352, 162187, 163806, 163692, 161663, 159018, 157855, 159119, 162009, 165323, 168688, 172188, 175524, 178226, 180338, 182328, 184387, 186441, 188871, 192372, 196657, 199911, 200505, 199066, 197887, 198081, 198347, 197057, 194585, 192580, 191635, 190850, 189432, 187425, 184866]
52939A84866l489m327m183l065j806j060j071j885k850k616p20J252J326m12k077
52924A57883k480k135j968k086j947r73R01K691K788P75j703k784k534k261k440
52909A41727k617k639k503j631N3R32l52k305k213j98R68J86o20j17K53q29k156
52892A25939k239j905k507l189k237r3J261J303J229J484J079l52j460q06J272
52877A18779K926K623N76j492k117j655j527k078k197j263j84J34R4L98Q03R68
52861A14788J483K885M485N253N146M525L098Q38r00o77R95K248K268J821J642
52846A49898J642J666J807J994K175K810M189N397N129L587K483K924M169M701
52832A94571L781J806j79j188j071q53j754l702n204m837k779p77n55j994l112
$$ y = [184866, 181377, 177050, 172867, 169802, 167996, 166936, 165865, 163980, 161130, 158514, 157794, 159046, 160372, 159960, 157883, 155403, 153268, 151300, 149214, 147267, 146294, 147195, 149886, 152674, 153449, 151746, 148962, 146428, 144167, 141727, 139110, 136471, 133968, 132337, 132390, 133322, 132970, 130665, 128452, 128254, 129222, 129408, 128788, 128671, 128924, 128095, 125939, 123700, 121795, 119288, 116099, 113862, 113769, 115030, 116333, 117562, 119046, 120125, 119773, 118313, 117507, 118779, 121705, 124328, 124904, 123412, 121295, 119640, 118113, 116035, 113838, 112575, 112391, 112525, 112619, 113017, 113820, 114788, 116271, 119156, 123641, 128894, 134040, 138565, 141663, 142501, 141601, 140924, 141919, 144167, 146435, 148256, 149898, 151540, 153206, 155013, 157007, 159182, 161992, 166181, 171578, 176707, 180294, 182777, 185701, 189870, 194571, 198352, 200158, 199979, 198791, 197720, 196867, 195113, 191411, 186207, 181370, 178591, 177814, 177259, 175265, 172153]
52817A72153k301l92M37l23r78m33N3j082l249m600m418l346k054j006q34j581
52801A46046k121j536m30J99N15R11N74j212l073k984j342m90j180j611l45J628
52785A33549K413J365p15k489k884k048j470k111k760j654O89K097J979J874K615
52770A30450L110K455J232P5j201k324k332j359p98p86L81L147N045L831N48k216
52754A39258l603m290m298l221j779j248j645j986j864j460o24O27J363R26K45
52739A16401M75R71K96j329k275j984j432j199q63l09K8L65J449K865L075J637
52723A18171j9n35l5Q74K026K912K399L12j689j896n22J060K222L171L728L330
52707A35509K135J137J042J624K266K583K529K248J831J085j49j225q31J465M219
$$ y = [172153, 169852, 169460, 169897, 169574, 168596, 168163, 168216, 167134, 163885, 159285, 154867, 151521, 149467, 148461, 147627, 146046, 143925, 142389, 141959, 142158, 142673, 143584, 144158, 142946, 139873, 136889, 135547, 135057, 133877, 132266, 131921, 133549, 135962, 137327, 136612, 134123, 131239, 129191, 127721, 125610, 122850, 121196, 121885, 123982, 125961, 127835, 130450, 133560, 136015, 137247, 137322, 136121, 133797, 131465, 130106, 129308, 128522, 128903, 132050, 137095, 140926, 141474, 139258, 135655, 131365, 127067, 123846, 122067, 120819, 119174, 117188, 115324, 113864, 113240, 113867, 115230, 116156, 116401, 116876, 117847, 118143, 116814, 114539, 112555, 111123, 109924, 109061, 108752, 108780, 109145, 110594, 113459, 116534, 118171, 118152, 117617, 117582, 118456, 120482, 123394, 125793, 126105, 124416, 122520, 121998, 123058, 125280, 128451, 132179, 135509, 137644, 138781, 139823, 141447, 143713, 146296, 148825, 151073, 152904, 153989, 153840, 152615, 151784, 153249, 157468]
52692A57468N457M715L043J424K45J01J532L587M107K259j94j294j415k112l263
52677A75660l275j860o12m80n56j32j34j276k398k289j927k907m402m077j784
52662A47551n9m65j638j817j376j543k100k033j517j586k323k753k336j392k51
52647A24362Q62J238K30j424j896l43K031L281K575O02j260j869j037L31J087
52632A28770R90P14O62L47p36k160k925k530j317J0Q06O01o40k218l002k293l69
52615A14710J801L190L147J633m74j673j118L43J003M22m3P08J709J164r07k522
52599A23093k326j150n79r21j318j154n19L33J205J717J513O94k21p38o05R6P76
52582A19896O94r9n04L27J716K124J073k55m28P04K106K746K373J365K00p44j121
$$ y = [157468, 162925, 167640, 170683, 172107, 172352, 172453, 173985, 177572, 181679, 183938, 183744, 182450, 181035, 178923, 175660, 172385, 170525, 169913, 169433, 168877, 168745, 168611, 167335, 164937, 162648, 160721, 157814, 153412, 149335, 147551, 147492, 147027, 145389, 143572, 142196, 140653, 138553, 136520, 135003, 133417, 131094, 128341, 126005, 124613, 124362, 125224, 126462, 126692, 125268, 123372, 123029, 125060, 128341, 130916, 131518, 130258, 128389, 127352, 127683, 128770, 129760, 130474, 131136, 131483, 130747, 128587, 125662, 123132, 121815, 121825, 122631, 123232, 122592, 120374, 117372, 115079, 114710, 116511, 119701, 122848, 124481, 124007, 122334, 121216, 121559, 122562, 122984, 122941, 123649, 125358, 126522, 125615, 123093, 120767, 119617, 119038, 118117, 116799, 115645, 115126, 115459, 116664, 118381, 119894, 120588, 120367, 119629, 119024, 119120, 119896, 120590, 120491, 119987, 120314, 122030, 124154, 125227, 124972, 124544, 125248, 127354, 130100, 132473, 133838, 134038, 133294, 132173]
52565A32173o98K68J034J064O70N15P18R70J410K500L784L789J853o58j721q89
52549A46782N93J464J399N74o44j401o74J589M010M846L521J082o96q57q6R1q34
52532A60759j687j190K03Q02j50j614k241j957j590j428q36P08K602L498K604
52517A58483N02j390k066j504l25P27J020L45p62j448j464j237r90m42L90Q52
52501A50691O24L22M81O51K66l01l88j79j06K57J424K520K098L90p88n77q6l74
52483A56925r22r03o41p63q46j32R89J390Q25J03j89k87o10j200j865k291k036
52466A47547q96O60J768J844Q31q75k320k189O7L187M877L950J441n24p91j5L36
52449A58898l86j387j485o20R4q1m67N1J381K358K298J728J348J055M50k22k85
$$ y = [132173, 131475, 131743, 132777, 133841, 134511, 135026, 135744, 136714, 138124, 140624, 144408, 148197, 150050, 149392, 147671, 146782, 147375, 148839, 150238, 150812, 150168, 148767, 148093, 149682, 153692, 158538, 162059, 163141, 162445, 161588, 161502, 161593, 160759, 159072, 157882, 158085, 158887, 158737, 157123, 154882, 152925, 151335, 149907, 149071, 149779, 152381, 155879, 158483, 158985, 157595, 155529, 154025, 153700, 154427, 155447, 155792, 155030, 153582, 152118, 150881, 149891, 149449, 149839, 150691, 151315, 151637, 152118, 152769, 153035, 152734, 152346, 152167, 152061, 152318, 153742, 156262, 158360, 158750, 157962, 157385, 157299, 156925, 156003, 155100, 154459, 153696, 152850, 152718, 153707, 155097, 155922, 156025, 155836, 155549, 154939, 153739, 151874, 149583, 147547, 146651, 147311, 149079, 150923, 151754, 150879, 148559, 146370, 146437, 149624, 154501, 158451, 159892, 159368, 158577, 158562, 158898, 158512, 157125, 155640, 155020, 155114, 155033, 154566, 154617, 155998, 158356, 160654, 162382, 163730, 164785, 165235, 165013, 164728]
52432A64728L88J113J227P38O0o08j364k206k834k850k076o44J037K402K987K748
52416A64846K001J050L2q05j051o54k29l02n02j20O37P49m0o19j61N10J04j058
52398A64388j397m67L64M6n13J26J650K350J494J92k34K99J140J982K773L146
52382A77339K701J615M01o91j547j744j021o2K0q84j737j799j373q25J92J842
52366A72427L211L295K495K004K002J564M35l71j90J58l00j031p90L13P54k30
52350A85746j423j147O20K347K878K515K145J911J245m3j219j326k19J225J937
52335A97192J638J039R91J501J713J058M5l89j56J3j68j54K79L10o84j804j587
52318B00837o1J240J411J286J947L136L830L679L018J932L81r89j201k96N10L55
$$ y = [164728, 165116, 166229, 167456, 168194, 168254, 167646, 166282, 164076, 161242, 158392, 156316, 155672, 156709, 159111, 162098, 164846, 166847, 167897, 167929, 167124, 166073, 165419, 165190, 164888, 164386, 164266, 164903, 165652, 165612, 164993, 164832, 165342, 165446, 164388, 162991, 162524, 162888, 162934, 162421, 162547, 164197, 166547, 168041, 168233, 167999, 168298, 169438, 171420, 174193, 177339, 180040, 181655, 182056, 181365, 179818, 178074, 177053, 176991, 177011, 176127, 174390, 172591, 171218, 170393, 170585, 172427, 175638, 178933, 181428, 183432, 185434, 186998, 187433, 187062, 186872, 187030, 186730, 185699, 184909, 185222, 185976, 185746, 184323, 183176, 183796, 186143, 189021, 191536, 193681, 195592, 196837, 196794, 195575, 194249, 194030, 195255, 197192, 198830, 199869, 200860, 202361, 204074, 205132, 205177, 204788, 204632, 204645, 204477, 204323, 204602, 204912, 204228, 202424, 200837, 200776, 202016, 203427, 204713, 206660, 209796, 213626, 217305, 220323, 222255, 222636, 221647, 220446, 220150, 220660, 221015]
52302B21015k60l75K37J299K880N062P006P349N802L750K786L086L574L378K646
52287B69235K051K046K713L975N668P445Q751R018Q042O262M540L513L138K992
52273C39389K831K766K921L059K577J014j066j863J08L921O498N917L820L298
52259C75190M801N739M330K075J387K225K633J830J064J514K799L869M237L947
52245D17640L165K312K015K455L142L624L981M381M589M280L603L043K837K778
52231D63845K531K099J918K366L140L449L203L480N088O917O834M441J910J503
52217E12724L030M525M829M441M112L730L013K447K896M476O293P277P054O031
52203E76878M904M206M237N068O449P774Q423Q259P690P242P131P191P104O628
$$ y = [221015, 220755, 220380, 220617, 221916, 224796, 229858, 236864, 244213, 250015, 253765, 256551, 259637, 263211, 266589, 269235, 271286, 273332, 276045, 280020, 285688, 293133, 301884, 310902, 318944, 325206, 329746, 333259, 336397, 339389, 342220, 344986, 347907, 350966, 353543, 354557, 353491, 351628, 351736, 355657, 362155, 368072, 371892, 375190, 379991, 385730, 390060, 392135, 393522, 395747, 398380, 400210, 401274, 402788, 405587, 409456, 413693, 417640, 420805, 423117, 425132, 427587, 430729, 434353, 438334, 442715, 447304, 451584, 455187, 458230, 461067, 463845, 466376, 468475, 470393, 472759, 475899, 479348, 482551, 486031, 491119, 498036, 504870, 509311, 511221, 512724, 515754, 520279, 525108, 529549, 533661, 537391, 540404, 542851, 545747, 550223, 556516, 563793, 570847, 576878, 581782, 585988, 590225, 595293, 601742, 609516, 617939, 626198, 633888, 641130, 648261, 655452, 662556, 669184]
52189F69184N833N148N070N698O655P411P676P487P211P325P836P987P018N330
52175G62869M344M693N171M197K065P89J553L290M256M161L878L656K817J199
52161H08938k56o95k52O28J871L144L447K265N63m27q13j398j851j130L96R00
52145H15330m12k188k928k807k636k330j538q62j180k290l247l565l299k557j868
52130G81623k200l508m110k854j142j154k647l480k995k771l765m896n130n126
52116G35845n694o100n172l091j087k7j42j302k778l530l413l398l985m309l598
52101F88219k524k206k700l372l953m239l585j875l68l28j278j673r10L30J278
52086F60816J584J097K79L26J618K668J999N59N93K320L710L634L204L399L410
$$ y = [669184, 675017, 680165, 685235, 690933, 697588, 704999, 712675, 720162, 727373, 734698, 742534, 750521, 757539, 762869, 767213, 771906, 777077, 781274, 783339, 784128, 785681, 788971, 793227, 797388, 801266, 804922, 807739, 808938, 808682, 807987, 807735, 808363, 810234, 813378, 816825, 819090, 819653, 819226, 818413, 817015, 815164, 814034, 814430, 815330, 814918, 812730, 809802, 806995, 804359, 802029, 800491, 799629, 798449, 796159, 792912, 789347, 786048, 783491, 781623, 779423, 775915, 771805, 768951, 767809, 766655, 764008, 760528, 757533, 754762, 750997, 746101, 740971, 735845, 730151, 724051, 718879, 715788, 714701, 714674, 714532, 713230, 710452, 706922, 703509, 700111, 696126, 691817, 688219, 685695, 683489, 680789, 677417, 673464, 669225, 665640, 663765, 663397, 663069, 661791, 660118, 659208, 659538, 660816, 662400, 663497, 663776, 664102, 665720, 668388, 670387, 670946, 671539, 673859, 677569, 681203, 684407, 687806, 691216]
52071F91216K440J631K557M837O666P064O394N175L706K634K640L441M079M186
52057G48666M184M180L646K566K009K874M465N117M158K757K494L533M551M447
52043G99647L623L230L646M218M388M298M111L464K177R67P94J595K250J882P14
52028H41004m02r15r53j029j484k142k474k330k286k992m228n045m903m184l503
52013H02134l025k671k520k496k144j246m36n12j306j922k011k027k120j640k28
51998G75830J326J889J215k16k032l932n177n093m058l217l168l556l975m503
51984G41333n115n373n095m821n197o270p638q883r629r666r401r746j1160j3043
51970F30296j4470j5076j4938j4080j2670j1397j0964j1284j1573j1206j0126
$$ y = [691216, 693656, 695287, 697844, 702681, 709347, 716411, 722805, 727980, 731686, 734320, 736960, 740401, 744480, 748666, 752850, 757030, 760676, 763242, 765251, 768125, 772590, 777707, 781865, 784622, 787116, 790649, 795200, 799647, 803270, 806500, 810146, 814364, 818752, 823050, 827161, 830625, 832802, 833769, 834563, 836158, 838408, 840290, 841004, 840602, 839687, 838734, 837705, 836221, 834079, 831605, 829275, 826989, 823997, 819769, 814724, 809821, 805637, 802134, 799109, 796438, 793918, 791422, 789278, 788032, 787596, 787084, 785778, 783856, 781845, 779818, 777698, 776058, 775830, 777156, 779045, 780260, 780044, 778012, 774080, 768903, 763810, 759752, 756535, 753367, 749811, 745836, 741333, 736218, 730845, 725750, 720929, 715732, 709462, 701824, 692941, 683312, 673646, 664245, 654499, 643339, 630296, 615826, 600750, 585812, 571732, 559062, 547665, 536701, 525417, 513844, 502638, 492512]
51959D92512q689p593p728r395j1556j2510j1597r912r045r346r733r075p509
51946C68824o202o014o629p163p275p282p240o702n592m727m808n223m639k847
51932B86481j297j518l321m973m924l119p88O70N47r84k985m177l773k167o13
51917B53059M4J04L12P29Q41N43N02J306K650L431K650M67j510j550J50J248n2
51900B64924k652l809k489k47J027R48R8q49j094j49J058Q38q87k104j454MP77
51883B53940J240K416L672L545K209J176R31O14n1l60l42j025k473l144k001p0
51867B60277R85R70Q94J349J949K107J680J001N96P85J338J757J914K136K591
51852B82329K940K687J751P10N10J611L184L701K680J304Q08R86J050J160J916
$$ y = [492512, 483823, 476230, 468502, 459107, 447551, 435041, 423444, 413532, 404487, 395141, 385408, 376333, 368824, 362622, 356608, 349979, 342816, 335541, 328259, 321019, 314317, 308725, 303998, 299190, 293967, 289328, 286481, 285184, 283666, 280345, 275372, 270448, 267329, 266541, 267211, 267758, 266774, 263789, 259612, 255839, 253672, 253059, 253103, 253207, 253519, 254248, 255089, 255632, 256134, 257440, 260090, 263521, 266171, 266638, 265128, 263578, 263728, 264976, 264924, 262272, 258463, 255974, 255727, 256754, 257702, 257800, 256951, 255857, 255708, 256766, 257604, 256717, 254613, 253159, 253163, 253940, 255180, 257596, 261268, 264813, 267022, 268198, 269129, 269743, 269692, 269332, 268990, 267965, 265492, 262348, 260347, 260277, 261262, 262232, 263126, 264475, 266424, 268531, 270211, 271212, 271808, 272593, 273931, 275688, 277602, 279738, 282329, 285269, 287956, 289707, 290417, 290927, 292538, 295722, 299423, 302103, 303407, 304215, 305201, 306251, 307411, 309327]
51837C09327K940L305L093L202L724L915L667L675L977L867L447L731M797N453
51823C62120N323N757P618R657J0298J0009J0416J1848J3139J3569J3637J3857
51811D87248J3827J2738J0360P353M814L283K063j56l735p518j0038j0791j0279
51798D99169r339q733q681q439o972m443k370j922k729l698m261m429m366m477
51784D24310n075n482m366j738L66J74j664l176l712m172n107n853n641m521l067
51769C71276j867j323j448j855k253k700l044k729j706r18j135j953k682l568
51755C42095m997o007n015k074P21J387k09k703m517m725l503k106j741k407l114
51740C01085l199k800k269j821j723k054k209j385L81K121L026L000K307J218
$$ y = [309327, 312267, 315572, 318665, 321867, 325591, 329506, 333173, 336848, 340825, 344692, 348139, 351870, 356667, 362120, 367443, 373200, 380818, 390475, 400773, 410782, 421198, 433046, 446185, 459754, 473391, 487248, 501075, 513813, 524173, 531526, 536340, 539623, 541686, 541530, 537795, 530277, 520239, 509448, 499169, 489830, 481097, 472416, 463977, 457005, 452562, 450192, 448270, 445541, 441843, 437582, 433153, 428787, 424310, 419235, 413753, 409387, 407649, 408015, 408189, 406525, 403349, 399637, 395465, 390358, 384505, 378864, 374343, 371276, 369409, 368086, 366638, 364783, 362530, 359830, 356786, 354057, 352351, 351433, 350298, 348345, 345663, 342095, 337098, 331091, 326076, 324002, 324723, 326110, 325901, 323198, 318681, 313956, 310453, 308347, 306606, 304199, 301085, 297886, 295086, 292817, 290996, 289273, 287219, 285010, 283625, 284006, 286127, 289153, 292153, 294460, 295678]
51726B95678J52n26q98j301j762k044k061j808j127j44M28J47k75J34J106J495
51710B87194R94L90J22k06o85o80k1L78k55j480k407k804k875k575j747o75J13
51693B72781L16p7r80k114l016l355l062k256j300q01q69o08Q40K835L784L348
51677B65466K862L208L473K465N53j076k155l117l704l179j828r29r77r97j72
51662B59893O86J38j786l289k785o64J256J710J060M98P94J973L660N131N480
51647B73755M402K714J559J237J339J641K071K084J198R6rP18P17o46k051k196
51631B88629j575j291j166k86J314K727L501L737L263J880K23p00p04k43O17J951
51615C01877K958K586J180K35L98Q40Q62P70P51K36q15j212j10J581K345K055
$$ y = [295678, 295830, 295304, 294406, 293105, 291343, 289299, 287238, 285430, 284303, 284159, 284587, 284734, 284459, 284593, 285699, 287194, 288188, 288578, 288700, 288494, 287809, 287129, 287108, 287486, 287231, 285751, 283344, 280540, 277665, 275090, 273343, 272668, 272781, 273097, 273020, 272040, 269926, 266910, 263555, 260493, 258237, 256937, 256136, 255267, 254659, 255499, 258334, 262118, 265466, 268328, 271536, 275009, 277474, 278027, 276951, 274796, 271679, 267975, 264796, 262968, 262039, 261062, 260065, 259893, 260579, 260717, 258931, 255642, 252857, 252193, 253449, 255159, 256219, 256717, 257511, 259484, 263144, 268275, 273755, 278157, 280871, 282430, 283667, 285006, 286647, 288718, 290802, 292000, 292096, 292087, 292805, 293522, 292876, 290825, 288629, 287054, 285763, 284597, 284311, 285625, 288352, 291853, 295590, 298853, 300733, 300956, 300256, 299552, 299309, 299926, 301877, 304835, 307421, 308601, 308836, 309234, 310074, 310936, 311706, 312457, 312693, 311878, 310666, 310556, 312137, 314482, 316537]
51599C16537J728J855J973J602O38j003l124m691m605l183k022k099k688k547
51585B98371j545o82q64j953k903k629j145J82P9q85o98J547M297N348M326K523
51569C03369Q78n76j432o30J806L942L829J746l06r70m61N45J776K838K934J796
51553C21084M68L39J527K685K556J335L46M48J090J139N11M16J622L017K771Q57
51537C42211o28j25J302J434j42j589j303K88J720K358K551K535K116J378R27
51522C55033J144J588J586J148R87J574K497K940K568J722Q05j56j223k129k431
51507C67653j984j030Q9R72J066oj838l315l552k601j126K75J232J478J025K74
51491C58612m06j112j941k469k333k211l302n463o850o027l866k430k417k733
$$ y = [316537, 318265, 320120, 322093, 323695, 324333, 323330, 320206, 315515, 310910, 307727, 305705, 303606, 300918, 298371, 296826, 296144, 295280, 293327, 290424, 287795, 286650, 286832, 286911, 286026, 285328, 286875, 291172, 296520, 300846, 303369, 304247, 303671, 302239, 301609, 303415, 307357, 311186, 312932, 312626, 311656, 311195, 311740, 313516, 316354, 319288, 321084, 321552, 321891, 323418, 326103, 328659, 329994, 330340, 330788, 331878, 333017, 333528, 333944, 335566, 338583, 341354, 342211, 341583, 341458, 342760, 344194, 344052, 342463, 341160, 341448, 343168, 345526, 348077, 350612, 352728, 354106, 355033, 356177, 357765, 359351, 360499, 361486, 363060, 365557, 368497, 371065, 372787, 373592, 373436, 372213, 370084, 367653, 365669, 364639, 364728, 365700, 366766, 366760, 364922, 361607, 358055, 355454, 354328, 354603, 355835, 357313, 358338, 358612, 358206, 357094, 355153, 352684, 350351, 348140, 344838, 339375, 332525, 326498, 322632, 320202, 317785, 315052]
51477C15052k420j952k244l274m337n057n458n339m304k490q07k54j056k526l659
51462B69875l924l488k732j769p89n19j683l776n171m820l348k003j196p07p41
51447B33209j643k792k946j949j056j152j552j175j70M37K50k51p45j393k086
51432B14986k185j384k71L45L38K00M13J093J877J953O72j297k108p99J152J430
51416B16415k7r36jJ206P11o90n76J385K845K148M83j04N44J180J291J424J840
51399B29138K082J850J308O30J3L3J132K751L690L452K526J402N6j457k692l354
51383B42560l586l499k983k215j755j840k093k176k221k249j818p45K66M12j02
51368B15956l30Q0L62l77j999l426l745l037k062j395j108j254k023l066l232
$$ y = [315052, 312632, 310680, 308436, 305162, 300825, 295768, 290310, 284971, 280667, 278177, 277370, 277116, 276060, 273534, 269875, 265951, 262463, 259731, 257962, 257173, 256654, 254971, 251195, 246024, 241204, 237856, 235853, 234657, 233950, 233209, 231566, 228774, 225828, 223879, 222823, 221671, 220119, 218944, 218774, 219211, 219461, 219210, 218465, 217072, 214986, 212801, 211417, 211146, 211491, 211829, 212029, 212442, 213535, 215412, 217365, 218037, 216740, 214632, 213833, 214985, 216415, 216388, 215452, 215451, 216657, 217368, 216678, 216102, 217487, 220332, 222480, 222963, 222859, 223403, 224583, 225874, 227298, 229138, 231220, 233070, 234378, 235008, 235021, 235054, 236186, 238937, 242627, 246079, 248605, 250007, 250063, 248606, 245914, 242560, 238974, 235475, 232492, 230277, 228522, 226682, 224589, 222413, 220192, 217943, 216125, 215380, 215646, 216058, 215956, 215626, 215706, 216068, 215691, 213692, 210266, 206521, 203484, 201422, 200027, 198919, 197665, 195642, 192576, 189344]
51353A89344j782K98J128K72p16n34j4p31k374k701n13K466L407J609r86k417
51337A85756k800l255l614k517K49K846L432K220O89m73j502k229k054j245q88
51322A74615j294j519r15j68j70o99q17m4J356K678L007J871N2r69q28o74j213
51305A74269j394m9K063L107K533J367N01N2R6O45Q45l34k212k669r89Q39O91
51288A79361q03j291j16Q80J29j425j713l65R18O87n29j189o94K22P04N78N6o55
51270A74755j236j377j210j095q49O1J294J554M33n85RJ472J733L47q64k96J457
51253A75603K604K212P79n46q00J51J341J477M34n87o35j24J39K87R57J973K419
51236A87684J957J207P43L97k15j064j827k229j951p28J079K317J939J87j474
$$ y = [189344, 187562, 187860, 188988, 189260, 188544, 188010, 187996, 187265, 184891, 182190, 181677, 184143, 187550, 189159, 188173, 185756, 182956, 179701, 176087, 173570, 173819, 176665, 180097, 182317, 183006, 182533, 181031, 178802, 176748, 175503, 174615, 173321, 171802, 170887, 170719, 170549, 169850, 169033, 168989, 170345, 173023, 176030, 177901, 177953, 176984, 176156, 175482, 174269, 172875, 172826, 174889, 177996, 180529, 181896, 182397, 182449, 182545, 183190, 184035, 183701, 181489, 178820, 177831, 178670, 179361, 178558, 177267, 177151, 178031, 178160, 176735, 175022, 174657, 175575, 176262, 175733, 174544, 173850, 174072, 174776, 175354, 175410, 174755, 173519, 172142, 170932, 169837, 168988, 169049, 170343, 171897, 172330, 171745, 171754, 173226, 174959, 175306, 174442, 174146, 175603, 178207, 180419, 181198, 180652, 179852, 180003, 181344, 182821, 183255, 182668, 182033, 181909, 182048, 182335, 183292, 185265, 187684, 189641, 190848, 191591, 191988, 191773, 190709, 188882, 186653, 184702, 183974, 185053, 187370, 189309, 189496, 188022]
51221A88022j680l53J435K523K550J962J417J197R97K35j277k793l041j459R78
51206A90713K558K459J300J05p61j408j764j572p89L75J523J899P72j251j932
51191A92227L37L970N331K910r23k978k844k348k508k702k346j610n84P60J635
51176A88327J106m5O5J516K058N37j053m63J509K483K035J532J265L54p63k95
51160B00168J908L608L145J255q02k871m521m073q04L072M525L058N99j186j869
51145B05212j284N49K579L321K468R52m88j677k125j103J111L122L867L436K494
51130B22434J638J315J495J408M75n96o65o3l63j982l334k958j287M32J871L258
51114B23078M125L726K345J074L72j84p58q69m54l77j357k848l566k815r51J170
$$ y = [188022, 186342, 185989, 187424, 189947, 192497, 194459, 195876, 197073, 198070, 198305, 197028, 194235, 191194, 189735, 190713, 193271, 195730, 197030, 197135, 196374, 194966, 193202, 191630, 190841, 191216, 192739, 194638, 195410, 194159, 192227, 192564, 196534, 201865, 204775, 203852, 200874, 198030, 195682, 193174, 190472, 188126, 186516, 185932, 186692, 188327, 189433, 189388, 189453, 190969, 193027, 193564, 192511, 192048, 193557, 196040, 198075, 199607, 200872, 201226, 200463, 200168, 202076, 205684, 208829, 210084, 209282, 206411, 201890, 197817, 197013, 200085, 204610, 207668, 208267, 207081, 205212, 203928, 204477, 207056, 210377, 212845, 213797, 213309, 211632, 209507, 208404, 209515, 212637, 216504, 219940, 222434, 224072, 225387, 226882, 228290, 228765, 228169, 227504, 227441, 227078, 225096, 221762, 218804, 217517, 217949, 219820, 223078, 227203, 230929, 233274, 234348, 234720, 234536, 233778, 232909, 232455, 232078, 230721, 227873, 224307, 221492, 220541, 221711]
51098B21711K620K597J022q76j383k04J037Q50o0K22K110L856L821K277N40p31
51082B39409j629k152k091j455m59N99J178R59P32J818L909M737K908J25r45q6
51066B47557Q03Q09P02P62J64j020j204L66K184K406J025o67j723j743n49J269
51050B51141K214J401l58j628j901j419l70Q93J616J624J876L050M239M160L038
51035B69576K032J397N60j73K95J913L059K676J630J338J931K524K643K465K121
51020B95987J494P97O54J384K464K818J709n41k650l226j859N40K476L072K628
51005C07747K015J624J157M10j43k2L96L38j33j47N70J121P13k54q84r61o50L61
50987C13258K386M547N150L617J312J16N47J688K597L263M102M980N169M311L099
$$ y = [221711, 224331, 226928, 227950, 227074, 225691, 225487, 226524, 227374, 227314, 227536, 229646, 233502, 237323, 239600, 240140, 239409, 237780, 235628, 233537, 232082, 231623, 232222, 233400, 234359, 235091, 236909, 240818, 245555, 248463, 248588, 247643, 247557, 248360, 249169, 249871, 250633, 250797, 249777, 248573, 248939, 251123, 253529, 254554, 253887, 252164, 250421, 249872, 251141, 253355, 254756, 254398, 252770, 250869, 249450, 249080, 249973, 251589, 253213, 255089, 258139, 262378, 266538, 269576, 271608, 273005, 273565, 273392, 273687, 275600, 278659, 281335, 282965, 284303, 286234, 288758, 291401, 293866, 295987, 297481, 298278, 298932, 300316, 302780, 305598, 307307, 306766, 304116, 300890, 299031, 299571, 302047, 305119, 307747, 309762, 311386, 312543, 312953, 312810, 312788, 313184, 313522, 313389, 313242, 313812, 314933, 315646, 315392, 314508, 313547, 312897, 313258, 315644, 320191, 325341, 328958, 330270, 330386, 330933, 332621, 335218, 338481, 342583, 347563, 352732, 357043, 360142]
50972C60142K597L055L801M253M451M536M376M082M265N268O589P624Q498R540
50958D33077J0377J0380R875R946J0997J2323J3347J4457J6087J7623J7991J7200
50946E93680J6531J7105J8762K0609K2248K3869K5380K6183K6193K6371K7566
50935H44497K9048K9048K6739K3083J9580J6921J4955J3204J0956P472K823j896
50923A036430n589q162j0152j1800j2990j3747j4294j4797j5325j5792j5704j4480
50911H83598j2403j0609r692q959p640o188n490n414n144m521l957l274j933m63
50897G97911l32j924l650l671j891K78J617K031K115K212J922N67j770l844m379
50882G87192l451k274j608j102l40K08k72j739l102l189j878j96O68N75L65N69
$$ y = [360142, 362739, 365794, 369595, 373848, 378299, 382835, 387211, 391293, 395558, 400826, 407415, 415039, 423537, 433077, 443454, 453834, 463709, 473655, 484652, 496975, 510322, 524779, 540866, 558489, 576480, 593680, 610211, 627316, 646078, 666687, 688935, 712804, 738184, 764367, 790560, 816931, 844497, 873545, 902593, 929332, 952415, 971995, 988916, 1003871, 1017075, 1028031, 1035503, 1038326, 1036430, 1030841, 1022679, 1012527, 1000727, 987737, 973990, 959696, 944899, 929574, 913782, 898078, 883598, 871195, 860586, 850894, 841935, 834295, 828107, 822617, 817203, 812059, 807538, 803581, 800307, 798374, 797911, 797579, 795655, 792005, 788334, 786443, 786721, 788338, 790369, 792484, 794696, 796618, 797185, 795415, 791571, 787192, 783741, 781467, 779859, 778757, 778417, 778625, 778353, 776614, 773512, 770323, 768445, 768249, 768917, 769492, 769857, 770426]
50866G70426O98M6j223k326k709k135m88J718L239L429L239L844M794M923M728
50851G92203O106R463J2789J4256J4233J4152J4683J5993J8470K2006K5370K7474
50839I87198K8666K9916L1404L2842L4375L6193L7788L8642L9162L9955M0859
50828A377000M1703M3345M6479M9944N1828N2131N2725N4511N6246N6567N5730
50817A938209N4560N2875M9897M5481M0103L4225K8212K2267J5946Q427p7p912
50805B282213j3795j8336k2806k6950k9274k9261k8051k6666k4737k1617j7806
50794B022914j4445j1715q555m036J459O556J0242J2941J6265K1459K7893L3345
50782B114323L6072L6472L6403L7063L7986L7975L6505L4036L1415K9170K7062
$$ y = [770426, 771124, 771170, 769947, 767621, 764912, 762777, 762289, 764007, 767246, 770675, 773914, 777758, 782552, 787475, 792203, 798309, 807772, 820561, 834817, 849050, 863202, 877885, 893878, 912348, 934354, 959724, 987198, 1015864, 1045780, 1077184, 1110026, 1144401, 1180594, 1218382, 1257024, 1296186, 1336141, 1377000, 1418703, 1462048, 1508527, 1558471, 1610299, 1662430, 1715155, 1769666, 1825912, 1882479, 1938209, 1992769, 2045644, 2095541, 2141022, 2181125, 2215350, 2243562, 2265829, 2281775, 2290202, 2290125, 2282213, 2268418, 2250082, 2227276, 2200326, 2171052, 2141791, 2113740, 2087074, 2062337, 2040720, 2022914, 2008469, 1996754, 1988199, 1984163, 1985622, 1992178, 2002420, 2015361, 2031626, 2053085, 2080978, 2114323, 2150395, 2186867, 2223270, 2260333, 2298319, 2336294, 2372799, 2406835, 2438250, 2467420, 2494482]
50771B494482K4104J9452J3552Q092M225J139l014q829j4982k0049k4220k8595
50759B465357l3191l6627l7997l8356l9640m2220m4313m4060m1706l9147l7652
50748B030448l6641l4668l0901k5629k0037j5686j3388j2115r717n427r03J977
50736A827313L671O240J0595J5750K0577K4741K7802K8999K8582K8088K8406K8546
50724B079310K7154K4249K0617J6421J1595O915L251J29l618p816j0791j1373
50712B156043j0111q292o617n088l440j344J345M374P471J0801J4417J7511J9174
50699B196244J9820K0815K2300K2577K0224J5994J1830Q654N964L208O00j300
50687B346930k179j992q33J137L721O560R006J0582J1738J3641J6815K0495K3705
$$ y = [2494482, 2518586, 2538038, 2551590, 2559682, 2563907, 2565046, 2562032, 2553203, 2538221, 2518172, 2493952, 2465357, 2432166, 2395539, 2357542, 2319186, 2279546, 2237326, 2193013, 2148953, 2107247, 2068100, 2030448, 1993807, 1959139, 1928238, 1902609, 1882572, 1866886, 1853498, 1841383, 1831666, 1826239, 1825336, 1827313, 1830984, 1837224, 1847819, 1863569, 1884146, 1908887, 1936689, 1965688, 1994270, 2022358, 2050764, 2079310, 2106464, 2130713, 2151330, 2167751, 2179346, 2186261, 2189512, 2189641, 2186023, 2178207, 2167416, 2156043, 2145932, 2137640, 2131023, 2125935, 2122495, 2121151, 2122496, 2126870, 2134341, 2145142, 2159559, 2177070, 2196244, 2216064, 2236879, 2259179, 2281756, 2301980, 2317974, 2329804, 2338458, 2344422, 2347630, 2348230, 2346930, 2344751, 2342759, 2341926, 2343063, 2346784, 2353344, 2362350, 2372932, 2384670, 2398311, 2415126, 2435621, 2459326]
50674B459326K6541K9847L4083L9217M5301N2338N9790O7021P4134Q1483Q8387
50663C057468R3248R5361R5786R6057R6504R6272R4583R1471Q7567Q3424P8910
50652D066651P3228O5927N7850N0489M4224L7972L0850K3452J6898J1477O996
50641D486014L865K662K938L646M726P275J1822J7332K2181K5499K7194K7532
50629D642686K7084K6438K5467K3379J9944J6022J2346Q401L331k389p167j0061
50617D785481j1689j3191j4868j5999j5674j3759j1323j0005j0561j2232j3845
50606D642335j5244j7109j9756k2999k7103l2712l9592m6571n3244o0682o9492
50595D237831p8120q4356q8135r1376r5060r7882r8294r6593r4053r1020q7149
$$ y = [2459326, 2485867, 2515714, 2549797, 2589014, 2634315, 2686653, 2746443, 2813464, 2887598, 2969081, 3057468, 3150716, 3246077, 3341863, 3437920, 3534424, 3630696, 3725279, 3816750, 3904317, 3987741, 4066651, 4139879, 4205806, 4263656, 4314145, 4358369, 4396341, 4427191, 4450643, 4467541, 4479018, 4486014, 4489879, 4492541, 4495479, 4499125, 4503851, 4511126, 4522948, 4540280, 4562461, 4587960, 4615154, 4642686, 4669770, 4696208, 4721675, 4745054, 4764998, 4781020, 4793366, 4801767, 4805098, 4802709, 4795542, 4785481, 4773792, 4760601, 4745733, 4729734, 4714060, 4700301, 4688978, 4678973, 4668412, 4656180, 4642335, 4627091, 4609982, 4590226, 4567227, 4540124, 4507412, 4467820, 4421249, 4368005, 4307323, 4237831, 4159711, 4075355, 3987220, 3895844, 3800784, 3702902, 3604608, 3508015, 3413962, 3322942, 3235793]
50584C235793q2904p9363p6582p3429o9367o5153o1376n7512n3275m9603m7100
50573B520129m4339l9445l3024k7712k4694k2473j9594j6790j5279j4381j2481
50562B249917r427o368l673p70K175M125N201P360J2265J9382K6745L2988L8115
50549B378035M2998M8768N6087O4455P2399P8783Q3623Q7481R0625R3208R5670
50538C192132R8321J00849J02763J04227J05988J08459J11189J13279J14299J14903
50528D266409J16402J19453J23293J26757J29885J33813J38953J44201J48312
50519E447478J51260J53692J55617J56211J54612J50409J43715J34958J24077
50510F772029J09812R0806O7997M4743K3429K869j9521m3497o5448q1970r2565
$$ y = [3235793, 3152889, 3073526, 2996944, 2923515, 2854148, 2788995, 2727619, 2670107, 2616832, 2567229, 2520129, 2475790, 2436345, 2403321, 2375609, 2350915, 2328442, 2308848, 2292058, 2276779, 2262398, 2249917, 2240490, 2234122, 2230449, 2229679, 2231854, 2235979, 2241180, 2248540, 2260805, 2280187, 2306932, 2339920, 2378035, 2421033, 2469801, 2525888, 2590343, 2662742, 2741525, 2825148, 2912629, 3003254, 3096462, 3192132, 3290453, 3391302, 3494065, 3598292, 3704280, 3812739, 3923928, 4037207, 4151506, 4266409, 4382811, 4502264, 4625557, 4752314, 4882199, 5016012, 5154965, 5299166, 5447478, 5598738, 5752430, 5908047, 6064258, 6218870, 6369279, 6512994, 6647952, 6772029, 6881841, 6972647, 7040644, 7085387, 7108816, 7111685, 7092164, 7048667, 6983219, 6901249, 6808684]
50499F808684r8794j02154j03323j02153r7714q9098p6855o3038m9467l6689k5096
50488E964303j6030j0909r774j1656j6174k3898l5195m9321o4843q0486r5524
50477E550493j09638j22584j33890j42950j49438j53402j54924j54044j51160
50468D278463j47191j42936j38523j33684j28248j22115j15206j07844j00922
50459C141794r5131r0214q5517q0965p6882p3057o8861o4343o0327n7082n3888
50448B335527n0427m7752m6784m6360m4104l9402l4406l1494l0506k9264k6356
50437A908672k2425j8766j5589j2153q090l903j11L605Q005J3203J8310K2435
50425A893193K5835K9737L4936M1019M7112N2961N8733O4144O8612P2357P6543
$$ y = [6808684, 6709890, 6607736, 6504413, 6402260, 6304546, 6215448, 6138593, 6075555, 6026088, 5989399, 5964303, 5948273, 5937364, 5927590, 5915934, 5899760, 5875862, 5840667, 5791346, 5726503, 5646017, 5550493, 5440855, 5318271, 5184381, 5041431, 4891993, 4738591, 4583667, 4429623, 4278463, 4131272, 3988336, 3849813, 3716129, 3587881, 3465766, 3350560, 3242716, 3141794, 3046663, 2956449, 2870932, 2789967, 2713085, 2640028, 2571167, 2506824, 2446497, 2389415, 2335527, 2285100, 2237348, 2190564, 2144204, 2100100, 2060698, 2026292, 1994798, 1964292, 1935028, 1908672, 1886247, 1867481, 1851892, 1839739, 1831649, 1827746, 1827635, 1831240, 1839245, 1852448, 1870758, 1893193, 1919028, 1948765, 1983701, 2024720, 2071832, 2124793, 2183526, 2247670, 2316282, 2388639, 2465182]
50414B465182Q1856Q7539R2400R6420J00609J05320J09603J12380J13728J14416
50404C479453J14661J13921J11755J08245J03448R7156Q9558Q1584P3890O5743
50394D439414N5800M3834L0893J7520K960j3189k9387m3251n3937o2495p0047
50383D318115p6649q1822q5033q5458q2389p6447o9527o2850n5828m7563l8870
50372C555679l1823k7471k4910k2653k0369j9162k0536k5086l1925l9307m5953
50361C246484n1739n7080o2012o6041o8631o9723o9938p0394p1767p3314p3296
50350B512549p0743o6459o1990n8117n4683n1403m8226m5171m2354l9998l8172
50339A935233l6754l5803l5336l4634l2589k9276k6316k4990k4798k4564k4111
$$ y = [2465182, 2547038, 2634577, 2726977, 2823397, 2924006, 3029326, 3138929, 3251309, 3365037, 3479453, 3594114, 3708035, 3819790, 3928035, 4031483, 4128639, 4218197, 4299781, 4373671, 4439414, 4495214, 4539048, 4569941, 4587461, 4590421, 4577232, 4547845, 4504594, 4450657, 4388162, 4318115, 4241466, 4159644, 4074611, 3989153, 3906764, 3830317, 3760790, 3697940, 3642112, 3594549, 3555679, 3523856, 3496385, 3471475, 3448822, 3428453, 3409291, 3388755, 3363669, 3331744, 3292437, 3246484, 3194745, 3137665, 3075653, 3009612, 2940981, 2871258, 2801320, 2730926, 2659159, 2585845, 2512549, 2441806, 2375347, 2313357, 2255240, 2200557, 2149154, 2100928, 2055757, 2013403, 1973405, 1935233, 1898479, 1862676, 1827340, 1792706, 1760117, 1730841, 1704525, 1679535, 1654737, 1630173, 1606062]
50328A606062k3823k3395k2407k1528k1665k2190k1433j8939j5935j3634j2306
50317A388807j1843j1792j0891q160m636k454j853q24J764M439N491N460N955
50304A359463P338R031J1103J3957J6965J8965J9801K0193K0325J9749J8573J7600
50292A553063J7283J7325J7279J6743J5074J1917P924M131N89l530q280j2412
50280A637106j4838j5968j7093j8844k0665k1535k0894j9098j7232j6264j6073
50269A438602j5419j3243j0120q039q367j0167j1102j0143q682q508r451j0050
50257A315311r995j0389j1457j1769j0431q759q523r486r957r220q060p142o218
50244A193905n096m289m244m574m488l684k554j648j096n22L47J182J554J769
$$ y = [1606062, 1582239, 1558844, 1536437, 1514909, 1493244, 1471054, 1449621, 1430682, 1414747, 1401113, 1388807, 1376964, 1365172, 1354281, 1346121, 1341485, 1339031, 1337178, 1336354, 1338118, 1342557, 1348048, 1353508, 1359463, 1366801, 1375832, 1386935, 1400892, 1417857, 1436822, 1456623, 1476816, 1497141, 1516890, 1535463, 1553063, 1570346, 1587671, 1604950, 1621693, 1636767, 1648684, 1656608, 1660739, 1661328, 1657798, 1649518, 1637106, 1622268, 1606300, 1589207, 1570363, 1549698, 1528163, 1507269, 1488171, 1470939, 1454675, 1438602, 1423183, 1409940, 1399820, 1391781, 1383414, 1373247, 1362145, 1352002, 1343320, 1334812, 1325361, 1315311, 1305316, 1294927, 1283470, 1271701, 1261270, 1252511, 1243988, 1234502, 1224545, 1215325, 1207265, 1200123, 1193905, 1188809, 1184520, 1180276, 1175702, 1171214, 1167530, 1164976, 1163328, 1162232, 1161710, 1162057, 1163239, 1164793, 1166562]
50230A166562K470L346L395K700K719M017N079M529L387L517M699N114M195L060
50216A218789K322J569J216K621N621P805P386N376L758K869J924J121J531L280
50202A267188N218O328O594O561O724P256P853Q024P871Q065Q649Q635P524O471
50188A368961O865Q354R602J0574J2460J5149J6593J5508J3499J3168J4785J6225
50176A521743J5948J4815J4565J5620J7084J8273J9224J9900J9973J9675K0146
50165A716966K2294K5605K8673L0705L2094L3536L5185L6903L8995M2413M7928
50154B091297N5189O2771O9521P5789Q2849R1197J00035J08538J16547J23544
50144B977277J28160J29759J29598J29011J27257J22754J15963J09011J02550
$$ y = [1166562, 1169032, 1172378, 1175773, 1178473, 1181192, 1185209, 1190288, 1194817, 1198204, 1201721, 1206420, 1211534, 1215729, 1218789, 1221111, 1222680, 1223896, 1226517, 1232138, 1239943, 1247329, 1252705, 1256463, 1259332, 1261256, 1262377, 1263908, 1267188, 1272406, 1278734, 1285328, 1291889, 1298613, 1305869, 1313722, 1321746, 1329617, 1337682, 1346331, 1354966, 1362490, 1368961, 1375826, 1384180, 1393782, 1404356, 1416816, 1431965, 1448558, 1464066, 1477565, 1490733, 1505518, 1521743, 1537691, 1552506, 1567071, 1582691, 1599775, 1618048, 1637272, 1657172, 1677145, 1696820, 1716966, 1739260, 1764865, 1793538, 1824243, 1856337, 1889873, 1925058, 1961961, 2000956, 2043369, 2091297, 2146486, 2209257, 2278778, 2354567, 2437416, 2528613, 2628648, 2737186, 2853733, 2977277, 3105437, 3235196, 3364794, 3493805, 3621062, 3743816, 3859779, 3968790, 4071340]
50135D071340R5092Q5831P5876O5752N3817L8804K2314O822p765k3512m1003n8382
50123D384986p3679q6391r6590j03998j08455j10355j10202j08244j04664r9587
50113C382821r3095q5811p9025p3483o8461o3040n7811n4152n2086n0279m8126
50102B657452m6465m6006m6265m6377m5872m4525m2548m1044m0898m0973l9071
50091B177408l5156l1906l1082l1000k9060k5411k2435k1255k0586j8739j5349
50080A895429j1216p678o016o237o519m904j559J728M118O356Q835J0520J0617
50067A893474J0110J0651J2620J5085J7193J8770J9797K0171K0152K0497K1856
50056B080376K4018K5904K6497K6093K6318K8487L1940L4676L5737L6234L7794
$$ y = [4071340, 4166432, 4252263, 4328139, 4393891, 4447708, 4486512, 4508826, 4515648, 4507883, 4484371, 4443368, 4384986, 4311307, 4224916, 4128326, 4024328, 3915873, 3805518, 3695316, 3587072, 3482408, 3382821, 3289726, 3203915, 3124890, 3051407, 2982946, 2919906, 2862095, 2807943, 2755857, 2705578, 2657452, 2610987, 2564981, 2518716, 2472339, 2426467, 2381942, 2339394, 2298350, 2257452, 2216479, 2177408, 2142252, 2110346, 2079264, 2048264, 2019204, 1993793, 1971358, 1950103, 1929517, 1910778, 1895429, 1884213, 1876535, 1870519, 1864282, 1857763, 1852859, 1851300, 1853028, 1857146, 1863502, 1872337, 1882857, 1893474, 1903584, 1914235, 1926855, 1941940, 1959133, 1977903, 1997700, 2017871, 2038023, 2058520, 2080376, 2104394, 2130298, 2156795, 2182888, 2209206, 2237693, 2269633, 2304309, 2340046, 2376280, 2414074]
50045B414074M0797M4730M9541N5564O2421O9036P5109Q1792R0546J01676J14333
50034C199619J27629J41336J55621J70413J85113J98680K10053K18646K24541
50025D831651K28100K29510K28780K26093K21888K16389K09189J99547J87091
50016F778238J72068J54847J35296J12863Q7248N8955K9208p26l0211n9247q7679
50005G350860j14500j38087j57274j72017j82977j90676j95182j96393j94405
49996E809349j89710j83137j75513j67269j58639j50213j42794j36395j29973
49987D375706j22890j16227j11756j09514j07334j03282r7859r3269r0885r0083
49977C332607q9368q7915q5809q3329q0559p7686p5175p3199p1061o7755o3324
$$ y = [2414074, 2454871, 2499601, 2549142, 2604706, 2667127, 2736163, 2811272, 2893064, 2983610, 3085286, 3199619, 3327248, 3468584, 3624205, 3794618, 3979731, 4178411, 4388464, 4607110, 4831651, 5059751, 5289261, 5518041, 5744134, 5966022, 6182411, 6391600, 6591147, 6778238, 6950306, 7105153, 7240449, 7353312, 7440560, 7499515, 7528723, 7527997, 7497786, 7438539, 7350860, 7236360, 7098273, 6940999, 6768982, 6586005, 6395329, 6200147, 6003754, 5809349, 5619639, 5436502, 5260989, 5093720, 4935081, 4784868, 4642074, 4505679, 4375706, 4252816, 4136589, 4024833, 3915319, 3807985, 3704703, 3606844, 3513575, 3422690, 3332607, 3243239, 3155324, 3069515, 2986186, 2905627, 2827941, 2752766, 2679567, 2608506, 2540751, 2477427]
49966B477427n9070n6065n3850n1247m8047m5033m2504l9808l6500l3134l0347
49955A981822k7949k5378k2614k0079j8017j6375j4972j3441j1399q932o627m879
49943A791160l660l012l050l228k543r40L82P88J286K863M781N791O325P876J0588
49928A815407J3104J4592J5452J6047J6467J7701K1178K6584L1800L5864M0442
49917B064638M7248N5455O3101P0086P8136Q8224R9450J10367J20170J28512J35039
$$ y = [2477427, 2418357, 2362292, 2308442, 2257195, 2209148, 2164115, 2121611, 2081803, 2045303, 2012169, 1981822, 1953873, 1928495, 1905881, 1885802, 1867785, 1851410, 1836438, 1822997, 1811598, 1802666, 1796039, 1791160, 1787500, 1784488, 1781438, 1778210, 1775667, 1774727, 1775109, 1775897, 1777183, 1780046, 1784827, 1790618, 1796943, 1804819, 1815407, 1828511, 1843103, 1858555, 1874602, 1891069, 1908770, 1929948, 1956532, 1988332, 2024196, 2064638, 2111886, 2167341, 2230442, 2300528, 2378664, 2466888, 2566338, 2676705, 2796875, 2925387, 3060426]
$$ [...]
##END NTUPLES=NMR SPECTRUM
##END=
