
##TITLE=AC1260_SUMRS11077_6534932_hEmxJmlG4X
##JCAMPDX= 6.0         $$ Bruker NMR JCAMP-DX V2.0
##DATA TYPE= NMR SPECTRUM
##DATA CLASS= NTUPLES
##ORIGIN= BRUKER
##OWNER= Administrator
$$ 1.72 TOPSPIN		Version 2.1
$$ 2012-07-16 19:50:56.218 -0500  Administrator@TOPSPIN
$$ Compression mode = diff/dup
##.OBSERVE FREQUENCY= 400.02188249412
##.OBSERVE NUCLEUS= ^1H
##.ACQUISITION MODE= SIMULTANEOUS (DQD)
##.ACQUISITION SCHEME= undefined
##.AVERAGES= 64
##.DIGITISER RES= 22
##SPECTROMETER/DATA SYSTEM= spect
##.PULSE SEQUENCE= noesygpps1d.comp
##.SOLVENT NAME= COFFEE_meoh
##.SHIFT REFERENCE= INTERNAL, COFFEE_meoh, 1, 14.96084
##AUDIT TRAIL= $$ (NUMBER, WHEN, WHO, WHERE, PROCESS, VERSION, WHAT)
$$ ##TITLE= Audit trail, TOPSPIN		Version 2.1
$$ ##JCAMPDX= 5.01
$$ ##ORIGIN= Bruker BioSpin GmbH
$$ ##OWNER= Administrator
$$ $$ C:\Bruker\TOPSPIN/data/COFFEE/nmr/AC1260_SUMRS11077_6534932_hEmxJmlG4X/22/pdata/1/auditp.txt
$$ ##AUDIT TRAIL=  $$ (NUMBER, WHEN, WHO, WHERE, PROCESS, VERSION, WHAT)
(   1,<2012-07-16 19:50:51.453 -0500>,<Administrator>,<TOPSPIN>,<go>,<TOPSPIN 2.1>,
      <created by zg
	started at 2012-07-16 19:39:21.125 -0500,
	POWCHK enabled, PULCHK disabled,
       configuration hash MD5:
       6B 1B 68 BB D9 2E 58 E2 7F 35 AD 54 07 DF 0E 41
       data hash MD5: 64K
       EB 98 2C B2 08 8C 77 F8 39 15 B0 3E 15 D1 B6 4D>)
(   2,<2012-07-16 19:50:54.359 -0500>,<Administrator>,<TOPSPIN>,<proc1d>,<TOPSPIN 2.1>,
      <Start of raw data processing
       efp LB = 0.3 FT_mod = 6 PKNL = 1 PHC0 = 0 PHC1 = 0 SI = 128K 
       data hash MD5: 128K
       0D FB B2 1D B7 6A 54 F4 48 C0 55 46 BF 3E 59 E1>)
(   3,<2012-07-16 19:50:55.437 -0500>,<Administrator>,<TOPSPIN>,<proc1d>,<TOPSPIN 2.1>,
      <pk PHC0 = 2.389526 PHC1 = 0 
       data hash MD5: 128K
       13 7F D6 8C 00 6C ED CC 32 83 FD 9B 88 50 0E C3>)
(   4,<2012-07-16 19:50:55.671 -0500>,<Administrator>,<TOPSPIN>,<proc1d>,<TOPSPIN 2.1>,
      <abs ABSG = 1 
       data hash MD5: 128K
       19 FA 57 48 20 3D 1B AF 29 59 3B 21 A6 F3 07 C8>)
(   5,<2012-07-16 19:50:55.750 -0500>,<Administrator>,<TOPSPIN>,<proc1d>,<TOPSPIN 2.1>,
      <abs ABSG = 2 
       data hash MD5: 128K
       3C A2 0F BB F4 87 52 4B 3C EF 42 85 1B 10 C4 29>)
(   6,<2012-07-16 19:50:55.906 -0500>,<Administrator>,<TOPSPIN>,<proc1d>,<TOPSPIN 2.1>,
      <abs ABSG = 3 
       data hash MD5: 128K
       77 DF FA D8 47 EE 47 05 C6 D2 C0 00 28 75 7C D1>)
(   7,<2012-07-16 19:50:56.062 -0500>,<Administrator>,<TOPSPIN>,<proc1d>,<TOPSPIN 2.1>,
      <abs ABSG = 4 
       data hash MD5: 128K
       A0 1A 88 B8 CE FA 87 F8 B7 AB 98 3C DF 2D A3 3A>)
(   8,<2012-07-16 19:50:56.125 -0500>,<Administrator>,<TOPSPIN>,<proc1d>,<TOPSPIN 2.1>,
      <abs ABSG = 5 
       data hash MD5: 128K
       0F EF 2A 52 11 B5 4E 9B A0 3E 84 E0 BF DF C5 BA>)
$$ ##END=
$$ 
$$ $$ hash MD5
$$ $$ 6B BD C0 17 F7 DF 60 81 EE 89 1C 0C 5B 34 57 BB
##$RELAX= 
##$RELAX= 
##$RELAX= 
##$RELAX= 
##$RELAX= 
##$RELAX= 
##$RELAX= 
##$RELAX= 
$$ Bruker specific parameters
$$ [...]
##$TP07= 0
##$TPNAME0= <>
##$TPNAME1= <>
##$TPNAME2= <>
##$TPNAME3= <>
##$TPNAME4= <>
##$TPNAME5= <>
##$TPNAME6= <>
##$TPNAME7= <>
##$TPOAL= (0..7)
0.5 0.5 0.5 0.5 0.5 0.5 0.5 0.5
##$TPOFFS= (0..7)
0 0 0 0 0 0 0 0
##$TUNHIN= 0
##$TUNHOUT= 0
##$TUNXOUT= 0
##$USERA1= <user>
##$USERA2= <user>
##$USERA3= <user>
##$USERA4= <user>
##$USERA5= <user>
##$V9= 5
##$VALIST= <valist>
##$VCLIST= <CCCCCCCCCCCCCCC>
##$VD= 0
##$VDLIST= <DDDDDDDDDDDDDDD>
##$VPLIST= <PPPPPPPPPPPPPPP>
##$VTLIST= <TTTTTTTTTTTTTTT>
##$WBST= 2048
##$WBSW= 25
##$XGAIN= (0..3)
0 0 0 0
##$XL= 0
##$YL= 0
##$YMAX_a= 10711112
##$YMIN_a= -7674266
##$ZGOPTNS= <>
##$ZL1= 120
##$ZL2= 120
##$ZL3= 120
##$ZL4= 120
##$ABSF1= 14.96084
##$ABSF2= -5.597342
##$ABSG= 5
##$ABSL= 3
##$ALPHA= 0
##$AQORDER= 0
##$ASSFAC= 0
##$ASSFACI= 0
##$ASSFACX= 0
##$ASSWID= 0
##$AUNMP= <proc_prof1d_extract.lims>
##$AXLEFT= 0
##$AXNAME= <>
##$AXNUC= <1H>
##$AXRIGHT= 0
##$AXTYPE= 0
##$AXUNIT= <>
##$AZFE= 0.1
##$AZFW= 0.1
##$BCFW= 0
##$BC_mod= 0
##$BYTORDP= 0
##$COROFFS= 0
##$CY= 15
##$DATMOD= 1
##$DC= 0
##$DFILT= <>
##$DTYPP= 0
##$F1P= 0
##$F2P= 0
##$FCOR= 0.5
##$FTSIZE= 131072
##$FT_mod= 6
##$GAMMA= 0
##$GB= 0
##$INTBC= 1
##$INTSCL= 1
##$ISEN= 128
##$LB= 0.3
##$LEV0= 0
##$LPBIN= 0
##$MAXI= 10000
##$MC2= 0
##$MEAN= 0
##$ME_mod= 0
##$MI= 0
##$NCOEF= 0
##$NC_proc= -2
##$NLEV= 6
##$NOISF1= 0
##$NOISF2= 0
##$NSP= 0
##$NTH_PI= 0
##$NZP= 0
##$OFFSET= 14.96084
##$PC= 1
##$PHC0= 2.389526
##$PHC1= 0
##$PH_mod= 1
##$PKNL= yes
##$PPARMOD= 0
##$PPDIAG= 0
##$PPIPTYP= 0
##$PPMPNUM= 2147483647
##$PPRESOL= 1
##$PSCAL= 4
##$PSIGN= 0
##$PYNMP= <proc.py>
##$REVERSE= no
##$SF= 400.020009700946
##$SI= 131072
##$SIGF1= 0
##$SIGF2= 0
##$SINO= 400
##$SIOLD= 131072
##$SPECTYP= <>
##$SREGLST= <1H.CDCl3>
##$SSB= 0
##$STSI= 131072
##$STSR= 0
##$SW_p= 8223.68421052631
##$SYMM= 0
##$S_DEV= 0
##$TDeff= 65536
##$TDoff= 0
##$TI= <>
##$TILT= no
##$TM1= 0
##$TM2= 0
##$TOPLEV= 0
##$USERP1= <user>
##$USERP2= <user>
##$USERP3= <user>
##$USERP4= <user>
##$USERP5= <user>
##$WDW= 1
##$XDIM= 131072
##$YMAX_p= 392411231
##$YMIN_p= -11980
##$CURPLOT= <Network HP LaserJet P1505>
##$CURPRIN= <$Network HP LaserJet P1505>
##$DFORMAT= <normdp>
##$LAYOUT= <+/1D_H.xwp>
##$LFORMAT= <normlp>
##$PFORMAT= <normpl>
##$SURQMSG= 1
$$ End of Bruker specific parameters
$$ ---------------------------------
##NTUPLES= NMR SPECTRUM
##VAR_NAME=  FREQUENCY,     SPECTRUM/REAL,   SPECTRUM/IMAG
##SYMBOL=    X,             R,               I
##VAR_TYPE=  INDEPENDENT,   DEPENDENT,       DEPENDENT
##VAR_FORM=  AFFN,          ASDF,            ASDF
##VAR_DIM=   131072,        131072,          131072
##UNITS=     HZ,            ARBITRARY UNITS, ARBITRARY UNITS
##FACTOR=    0.0627417313425164, 1,          1
##FIRST=     8223.62146879497, -2041,        -52715
##LAST=      0,             169,             -53962
##MIN=       0,             -11980,          0
##MAX=       8223.62146879497, 392411231,    0
$$ Real data points
##PAGE= N=1
##DATA TABLE= (X++(R..R)), XYDATA
$$ [...]
63945F36822M5272N2510O1355P1301Q1901R2989J04481J16302J28274J39755J49759
63934A680721J57758J64071J69086J72229J72141J67763J58916J45978J29435
63925C118098J09878Q8159O5272M1946J8246o326l2048n8110q2750j04389j22470
63914C035506j37037j47898j54708j57795j58322j57361j55000j50619j43854
63905A672912j35088j25040j14250j03129r2207q1974p2567o3915n6249n0003
63895G78490m5099m0739l6320l2132k8679k5702k2503j9177j6700j5580j5121
63884D80738j4264j2735j1016r656q925q746q540p475n321k802q05M89J372J984
63870C94298K403L129M666O730Q488R715J1050J2947J4979J6550J7827J9473K1635
$$ y = [636822, 682094, 734604, 795959, 867260, 949161, 1042150, 1146631, 1262933, 1391207, 1530962, 1680721, 1838479, 2002550, 2171636, 2343865, 2516006, 2683769, 2842685, 2988663, 3118098, 3227976, 3316135, 3381407, 3423353, 3441599, 3435273, 3403225, 3345115, 3262365, 3157976, 3035506, 2898469, 2750571, 2595863, 2438068, 2279746, 2122385, 1967385, 1816766, 1672912, 1537824, 1412784, 1298534, 1195405, 1103198, 1021224, 948657, 884742, 828493, 778490, 733391, 692652, 656332, 624200, 595521, 569819, 547316, 528139, 511439, 495859, 480738, 466474, 453739, 442723, 433067, 424142, 415396, 406856, 399381, 394060, 391258, 390453, 390942, 392314, 394298, 396701, 399830, 404496, 411226, 419714, 429429, 440479, 453426, 468405, 484955, 502782, 522255, 543890]
63857E43890K3722K5146K5965K6614K7292K7794K7817K7259K6171K4638K2755
63846H29063K0636J8323J5764J2942R943O753L142r62n097q680j1827j5285j9267
63833H55448k2835k4893k5510k5790k6560k7700k8647k8983k8492k7240k5796
63822E63002k4856k4394k3558k1743j9394j7352j5760j4129j2282j0614r467q708
63810C60745q064p477o901o227n594n460n992o698p007p028p231p538p308o347
63796B65873n394n215n575n579m865m023l799m224m639m362l242j769p01n16j014
63781B10956j556j641j228n89q2km24j001j202q88n48p30j350j779j576r15k65
63764A95180J26K53J57j04k86j29K83N49M80L60M67N09k6j050j806j715r82k06
$$ y = [543890, 567612, 592758, 618723, 645337, 672629, 700423, 728240, 755499, 781670, 806308, 829063, 849699, 868022, 883786, 896728, 906671, 913424, 916566, 915604, 910507, 901827, 890000, 874715, 855448, 832613, 807720, 782210, 756420, 729860, 702160, 673513, 644530, 616038, 588798, 563002, 538146, 513752, 490194, 468451, 449057, 431705, 415945, 401816, 389534, 378920, 369453, 360745, 352681, 345204, 338303, 332076, 326482, 321022, 315030, 308332, 301325, 294297, 287066, 279528, 272220, 265873, 260479, 255264, 249689, 244110, 239245, 235222, 231423, 227199, 222560, 218198, 214956, 213187, 212486, 211970, 210956, 209400, 207759, 206531, 205942, 205860, 205858, 205434, 204433, 203231, 202343, 201795, 201065, 199715, 197936, 196360, 195445, 195180, 195306, 195559, 195716, 195612, 195326, 195197, 195480, 196029, 196509, 196869, 197336, 197845, 197819, 196769, 194963, 193248, 192266, 192060]
63746A92060K70M62N16O40J020J523J734J480J115J024J146J281J543K069K585
63731B10468K764K827L281M142M944N444N755N899N780N616N768O072N952N341
63717B80053M939N247N846N876M915L146J091p06k041l207m474n466n566m909
63703B84744m317m190m134l824l427l011k277j318p35o12k15P52J452J229P73
63688B60890J113K092K811K994K936K599J881J334J514J857J377L19l6P71J887
63673B86339K523K751K789K665K833L978N718O624O019M840M179L862L231K375
63659C40726J684P98r80l439n563o653o808o392n727n222n162n284n044m310l480
63644B79144k864k355j745j094o17l10J57J095K349L258L305K711K218K250K663
$$ y = [192060, 192330, 192792, 193308, 193948, 194968, 196491, 198225, 199705, 200820, 201844, 202990, 204271, 205814, 207883, 210468, 213232, 216059, 219340, 223482, 228426, 233870, 239625, 245524, 251304, 256920, 262688, 268760, 274712, 280053, 284992, 290239, 296085, 301961, 306876, 310022, 311113, 310407, 308366, 305159, 300685, 295219, 289653, 284744, 280427, 276237, 272103, 268279, 264852, 261841, 259564, 258246, 257511, 256899, 256684, 257436, 258888, 260117, 260890, 262003, 264095, 266906, 269900, 272836, 275435, 277316, 278650, 280164, 282021, 283398, 283717, 283681, 284452, 286339, 288862, 291613, 294402, 297067, 299900, 303878, 309596, 316220, 322239, 327079, 331258, 335120, 338351, 340726, 342410, 343208, 342228, 338789, 333226, 326573, 319765, 313373, 307646, 302424, 297262, 291978, 286934, 282624, 279144, 276280, 273925, 272180, 271086, 270469, 270159, 270316, 271411, 273760, 277018, 280323, 283034, 285252, 287502, 290165]
63629B90165L238L991M909N735O281O631O877O972P076P643Q947J0714J2430J3781
63615C95390J4720J5430J6348J7885J9896K1830K3563K5640K8360L1045L2609
63604F42716L2638L1461K9417K6431K2251J6837J0655M760L30k201l434m262n103
63591H02496n960o879p973r269j0835j2902j5486j8092k0052k1052k1193k0741
63579F32062j9961j8941j7439j5183j2448r939p994o322m685l249j984m22J551
63566E15046L251M171M815N871P007P410P145P116P736Q484Q806Q794Q896R509
63552F14057J0907J3065J5632J8445K1951K6623L2101L7444M1916M4841M4982
63541I21964M1044L3016K2331J0865L55p441j1337j1869j0978j0140r397q410
$$ y = [290165, 293403, 297394, 302303, 308038, 314319, 320950, 327827, 334799, 341875, 349518, 358465, 369179, 381609, 395390, 410110, 425540, 441888, 459773, 479669, 501499, 525062, 550702, 579062, 610107, 642716, 675354, 706815, 736232, 762663, 784914, 801751, 812406, 817166, 817496, 815295, 811861, 807599, 802496, 796536, 789657, 781684, 772415, 761580, 748678, 733192, 715100, 695048, 673996, 652803, 632062, 612101, 593160, 575721, 560538, 548090, 538151, 530157, 523835, 519150, 515901, 513917, 513495, 515046, 518297, 522468, 527283, 533154, 540161, 547571, 554716, 561832, 569568, 578052, 586858, 595652, 604548, 614057, 624964, 638029, 653661, 672106, 694057, 720680, 752781, 790225, 832141, 876982, 921964, 963008, 996024, 1018355, 1029220, 1029575, 1022134, 1010797, 998928, 987950, 977810, 968413, 960003]
63529I60003p529p331p884r053j0960j3670j6876k0279k3790k6964k8963k9544
63517G57160k9443k9238k8403k6258k3268k0613j8825j7546j6370j5162j3797
63506E18237j2308j1086j0316r483q109o759o347o661o528n544m603m512m961
63493D21020n280n372n319m815l692k505j895j593q32M27J339J351R64J109K087
63478C96994L359M163M227L937L898M224M379L774K431R05l92j518k613l535m069
63463D20164m378m917n874o825p094o400n068l677k590j878j494j365j320j147
63449C66137p63k14M76J327K226K986L661M616O083P778R324J0866J3017J6161
63435D43681K0137K4635K9440L4058L7419L8274L5911L0451K2732J4222O658J302
$$ y = [960003, 952474, 945143, 937259, 928206, 917246, 903576, 886700, 866421, 842631, 815667, 786704, 757160, 727717, 698479, 670076, 643818, 620550, 599937, 581112, 563566, 547196, 532034, 518237, 505929, 494843, 484527, 475044, 466935, 460176, 453829, 447168, 440640, 435096, 430493, 425981, 421020, 415740, 410368, 405049, 400234, 396542, 394037, 392142, 390549, 389717, 390144, 391483, 392834, 393798, 394907, 396994, 400353, 404516, 408743, 412680, 416578, 420802, 425181, 428955, 431386, 432291, 431899, 430381, 427768, 424233, 420164, 415786, 410869, 404995, 398170, 391076, 384676, 379608, 375931, 373341, 371463, 369969, 368604, 367284, 366137, 365374, 365160, 365636, 366963, 369189, 372175, 375836, 380452, 386535, 394313, 403637, 414503, 427520, 443681, 463818, 488453, 517893, 551951, 589370, 627644, 663555, 694006, 716738, 730960, 737618, 738920]
63423G38920j573k325j192J794O349J1814J7483K2804K7371L1061L4005L5924
63411I22435L5654L2119K5840J8723J2109N854l25n561q757j0117j0819j1447
63399A005708j1834j2205j3412j5868j9055k2348k5508k8187k9754l0011k9465
63388G68061k8494k6854k4396k1682j9316j7184j4939j2820j1284j0190q926p302
63376E64674n639m079k372l98J620L454N048O294P093P765Q996J1093J3570J5616
63362F32735J6908J7881J9250K1278K3538K5470K7169K9288L1965L4256L5052
63351I14790L4235L2326K9286K4524J8141J1325N137l65n387r387j1537j1902
63339A031186j1534j1501j2290j3973j6328j8871k1218k3514k6012k8296k9468
$$ y = [738920, 737347, 735022, 733830, 735624, 741973, 753787, 771270, 794074, 821445, 852506, 886511, 922435, 958089, 990208, 1016048, 1034771, 1046880, 1052734, 1052409, 1046848, 1038091, 1027974, 1017155, 1005708, 993874, 981669, 968257, 952389, 933334, 910986, 885478, 857291, 827537, 797526, 768061, 739567, 712713, 688317, 666635, 647319, 630135, 615196, 602376, 591092, 580902, 571976, 564674, 559035, 554956, 552584, 552186, 553806, 557260, 562308, 568602, 575695, 583460, 592456, 603549, 617119, 632735, 649643, 667524, 686774, 708052, 731590, 757060, 784229, 813517, 845482, 879738, 914790, 949025, 981351, 1010637, 1035161, 1053302, 1064627, 1069764, 1069399, 1064012, 1054625, 1043088, 1031186, 1019652, 1008151, 995861, 981888, 965560, 946689, 925471, 901957, 875945, 847649, 818181]
63328H18181k9236k8318k7460k6451k4430k0869j6006j0590n468j243J873L707
63316F33690L522L17n780j2801j8244k1051k1814k1337j9785j7371j4954j3362
63304D71030j2498j1643j0406r058q027p507p441p645p909q141q265q021p127
63291C57342n834m868m584m501m090l616l636l986l953l385k874k718k485j826
63277C04986j191j162j590j831j667j401j201q31k14J48l38j582k754l117k709
63262B83546k111j651j260r58j034j482j736j400q54o39n72j49L89K51n74j074
63246B68692n89K64M83p6q34j344j464j077k19P02J226J305J081N60j69o18l73
63229B67550L07P37N78Oo89j242j301o94K27Q62R93Q40O84P25J124J800K366K615
$$ y = [818181, 788945, 760627, 733167, 706716, 682286, 661417, 645411, 634821, 629353, 628110, 629983, 633690, 637212, 637529, 631749, 618948, 600704, 579653, 557839, 536502, 516717, 499346, 484392, 471030, 458532, 446889, 436483, 427425, 419398, 411891, 404450, 396805, 388896, 380755, 372490, 364469, 357342, 351508, 346640, 342056, 337555, 333465, 329849, 326213, 322227, 318274, 314889, 312015, 309297, 306812, 304986, 303795, 302633, 301043, 299212, 297545, 296144, 294943, 294112, 293898, 294046, 293708, 292126, 289372, 286255, 283546, 281435, 279784, 278524, 277566, 276532, 275050, 273314, 271914, 271060, 270421, 269849, 269700, 270089, 270340, 269766, 268692, 268103, 268367, 268850, 268774, 267940, 266596, 265132, 264055, 263836, 264538, 265764, 267069, 268150, 268710, 268541, 267923, 267550, 267857, 268594, 269172, 269178, 268489, 267247, 265946, 265252, 265479, 266341, 267334, 268174, 268858, 269583, 270707, 272507, 274873, 277488]
63211B77488K846L228L166K018L14n57n1R39J368J282J384J916K520K876L017
63196C03754L137L418L886M337M533M576M845N428N995O404P061Q285R623J0213
63182C85495R775Q957Q643R112R884J0276J0124R857R780R579Q893Q214Q425R378
63168E16392R733Q700P148O215N433L405J30k630l649l888n127p679j0297j2014
63154E11872j3113j4197j5137j5289j4381j2760j1039r772r260r260q984p827
63142C70853o153n023m982n386n141l924k414j461j250j256p76L97J709K315K041
63127C39549J660J931K617K935K832L116M170N244N456M987M703M981N500O008
63113C95689O551O982O955O606O664P502Q472Q635P892P033O742P043P639Q342
$$ y = [277488, 280334, 283562, 286728, 288746, 289060, 288503, 288452, 289391, 290759, 292041, 293425, 295341, 297861, 300737, 303754, 306891, 310309, 314195, 318532, 323065, 327641, 332486, 337914, 343909, 350313, 357374, 365659, 375282, 385495, 395270, 404227, 412870, 421982, 431866, 442142, 452266, 462123, 471903, 481482, 490375, 498589, 507014, 516392, 526125, 534825, 541973, 548188, 553621, 557026, 557156, 554526, 550877, 546989, 541862, 534183, 523886, 511872, 498759, 484562, 469425, 454136, 439755, 426995, 415956, 406184, 396924, 387664, 378680, 370853, 364700, 359677, 354695, 349309, 344168, 340244, 337830, 336369, 335119, 333863, 333087, 333484, 335193, 337508, 339549, 341209, 343140, 345757, 348692, 351524, 354640, 358810, 364054, 369510, 374497, 379200, 384181, 389681, 395689, 402240, 409222, 416177, 422783, 429447, 436949, 445421, 454056, 461948, 468981, 475723, 482766, 490405, 498747]
63099D98747Q979R271R173R146R735J0831J1663J1609J0808R805Q834P681O138
63086F22420M270K223j8k491n027p219q673r317r540r883j0495j1048j1309j1581
63072E32312j2140j2486j1762j0001q270p325o735n786m743m404m748m873m270
63059D34769l436k939k620k031j192l95M09J465K662L507L735L591L485L606L867
63044D48483M108M282M554N133N963O625O742O368N901N706N907O380O723O459
63030E29334N615M899M900N145M541K832R94q6o98j558k521k857k551k388k625
63015E42976k534j651p29p06j243j080K89K131L607M696N800P070Q480J0031J1519
63000E88656J2447J2670J2752J3273J3968J4187J3975J4055J4619J4884J4225
$$ y = [498747, 507726, 516997, 526170, 535316, 545051, 555882, 567545, 579154, 589962, 599767, 608601, 616282, 622420, 626690, 628913, 628895, 626404, 621377, 614158, 605485, 596168, 586628, 576745, 566250, 555202, 543893, 532312, 520172, 507686, 495924, 485923, 477653, 470328, 463593, 457807, 453064, 448660, 443912, 439039, 434769, 431333, 428394, 425774, 423743, 422551, 422156, 422565, 424030, 426692, 430199, 433934, 437525, 441010, 444616, 448483, 452591, 456873, 461427, 466560, 472523, 479148, 485890, 492258, 498159, 503865, 509772, 516152, 522875, 529334, 534949, 539848, 544748, 549893, 554434, 557266, 558260, 558174, 557476, 555918, 553397, 550540, 547989, 545601, 542976, 540442, 538791, 538062, 537356, 536113, 535033, 535322, 537453, 541060, 545756, 551556, 558626, 567106, 577137, 588656, 601103, 613773, 626525, 639798, 653766, 667953, 681928, 695983, 710602, 725486, 739711]
62989G39711J3193J2874J3472J4187J4321J3884J3032J1498R014N832K408j164
62977H62262m914q435j1181j3347j5755j8633k1108k2329k2545k2516k2254k1185
62965F58060j9390j7768j6766j5753j4077j2126j0722r926r185q404q101q411
62953E07431q725q585q357q594r113r243q855q587q958r665r921r291q018o684
62939C84835n740n320n253n241n106m895m713m481l997l243k519k202k412k911
62925C26802l264l107k436j705j445j663j794j409p98n54p50q96o69k72M2L94
62909C06476J003J780K433K817K967K989L074L414L919M262M432M898N929P025
62895C57418P592P951Q996J0803J2205J2093J0599Q724P150N856M579L116J305
$$ y = [739711, 752904, 765778, 779250, 793437, 807758, 821642, 834674, 846172, 855186, 861018, 863426, 862262, 857348, 848913, 837732, 824385, 808630, 789997, 768889, 746560, 724015, 701499, 679245, 658060, 638670, 620902, 604136, 588383, 574306, 562180, 551458, 541532, 532347, 523943, 515842, 507431, 498706, 490121, 481764, 473170, 464057, 454814, 445959, 437372, 428414, 418749, 408828, 399537, 391519, 384835, 379095, 373775, 368522, 363281, 358175, 353280, 348567, 344086, 340089, 336846, 334327, 332125, 329713, 326802, 323538, 320431, 317995, 316290, 314845, 313182, 311388, 309979, 309181, 308627, 307877, 306981, 306312, 306040, 306082, 306476, 307479, 309259, 311692, 314509, 317476, 320465, 323539, 326953, 330872, 335134, 339566, 344464, 350393, 357418, 365010, 372961, 381957, 392760, 404965, 417058, 427657, 436381, 443531, 449387, 453966, 457082, 458387]
62882D58387q20k813m217n198o385p883q874q619p518o748o802o976o485n608
62868C73441n289n775o259n983n237m931n394n958n745m604l239k549k832l535
62854C06111l780l219k322j780j779j945j841j300m41L43N79J64l66m12q7K5k11
62837B87739k89K5K69J13K4N33J207J105J82n27k54N89J111J084R79J147J435
62820B96472J498J156M26n50j427j714j150r9O16M71k22p11q01j009j585j907
62804B89464j330l30k5n60q14P8J542K397K276J672R99L37j66l21l05m57o68n22
62786B93267k8L61N52J006J914K702K743K130J497J381K035L440N085O112O129
62771C30326N600N098M467L219J501R8n33p03q87j153j287j198j008r42j150j502
$$ y = [458387, 457567, 454754, 450537, 445339, 438954, 431071, 422197, 413578, 406060, 399312, 392510, 385534, 379049, 373441, 368152, 362377, 356118, 350135, 344898, 339967, 334573, 328615, 322870, 318266, 315027, 312478, 309646, 306111, 302331, 299112, 296790, 295010, 293231, 291286, 289445, 288145, 287704, 288047, 288626, 288790, 288424, 288012, 287925, 287950, 287739, 287450, 287475, 287744, 287857, 287881, 288414, 289621, 290726, 290908, 290381, 290127, 290716, 291827, 292911, 293890, 295037, 296472, 297970, 299126, 299552, 299002, 297575, 295861, 294711, 294612, 295228, 295699, 295477, 294766, 293965, 292956, 291371, 289464, 288134, 287804, 287779, 287219, 286405, 286483, 288025, 290422, 292698, 294370, 295369, 295706, 295540, 295219, 294914, 294457, 293789, 293267, 293239, 293600, 294152, 295158, 297072, 299774, 302517, 304647, 306144, 307525, 309560, 313000, 318085, 324197, 330326, 335926, 341024, 345491, 348710, 350211, 350309, 349776, 349073, 348186, 347033, 345746, 344548, 343540, 342598, 341448, 339946]
62755C39946j674j605j652k071k550k696k722l085l629l757l460l379l728l854
62741C00084l231k172j210m55k6m10j646k691k460j249l23k69n58n98l90l9N89
62724B82946J416K015K163K119K097J940J539J135R85J122J658K870M599O089
62710C14693O774O936P197P717Q349R253J0718J2565J4270J5691J7177J8894K0516
62697D70750K1753K2860K4363K6336K8141K9006K8836K8417K8494K8702K7796
62686G65454K5121K1334J7341J3082Q074K684k132o322j0884j6164k0971k3993
62674G72624k5507k6825k8466k9595k9209k7274k4684k2516k1346k0864k0206
62663D96132j8879j7312j6155j5275j3964j2081j0283r075q217p305o336n426
$$ y = [339946, 338272, 336667, 335015, 332944, 330394, 327698, 324976, 321891, 318262, 314505, 311045, 307666, 303938, 300084, 296853, 294681, 293471, 293016, 292990, 292580, 290934, 288243, 285783, 284534, 284211, 283942, 283384, 282786, 282396, 282357, 282946, 284362, 286377, 288540, 290659, 292756, 294696, 296235, 297370, 298355, 299477, 301135, 304005, 308604, 314693, 321467, 328403, 335600, 343317, 351666, 360919, 371637, 384202, 398472, 414163, 431340, 450234, 470750, 492503, 515363, 539726, 566062, 594203, 623209, 652045, 680462, 708956, 737658, 765454, 790575, 811909, 829250, 842332, 850406, 853090, 850958, 844636, 833752, 817588, 796617, 772624, 747117, 720292, 691826, 662231, 633022, 605748, 581064, 558548, 537202, 516338, 496132, 477253, 459941, 443786, 428511, 414547, 402466, 392183, 383108, 374891, 367586, 361250, 355824]
62651C55824m459l530l222l892m924n339n024m720m802m736l984k839j961j455
62637C00937r26k64J72J74L0L4Rl74j012j392j245q65p27r77j371j625j640j467
62619B87471j247j107j014p58k98m5m75j392j892j336j94M12m0r20j243p60m8
62602B75114L22M14O21R81J057M84n70j563k011j679o27O86J560J677J526J821
62586B79813K541K985K796K331J833R03o47k008k203j503j136j553j838j160q4
62571B81070J85o39j703k205k108j743j278q39o88q58r19m71J58K31l48p29k08
62554B66908P55J130O84J57Q5J42m7j18M09J203J446R66L78K33N45J149J902K465
62536B80392K416J771J037N64K59K4J29Q33J936K890L251L006K643K807L643M648
$$ y = [355824, 351365, 347835, 344613, 340721, 335797, 330458, 325434, 320714, 315912, 311176, 307192, 304353, 302392, 300937, 300011, 299747, 299919, 300093, 300123, 300157, 300166, 299792, 298780, 297388, 296143, 295278, 294551, 293574, 292203, 290578, 288938, 287471, 286224, 285117, 284103, 283345, 283047, 283002, 282527, 281135, 279243, 277907, 277713, 278125, 278085, 277165, 275922, 275162, 275114, 275436, 275850, 276471, 277452, 278509, 278993, 278423, 276860, 274849, 273170, 272543, 273229, 274789, 276466, 277992, 279813, 282354, 285339, 288135, 290466, 292299, 293202, 292555, 290547, 288344, 286841, 285705, 284152, 282314, 281154, 281070, 281255, 280616, 278913, 276708, 274600, 272857, 271579, 270740, 270052, 269194, 268275, 267804, 267962, 268193, 267845, 267116, 266908, 267663, 268793, 269477, 269634, 269719, 269861, 269814, 269696, 270105, 271308, 272754, 273720, 274098, 274331, 274876, 276025, 277927, 280392, 282808, 284579, 285616, 286180, 286439, 286463, 286592, 287425, 289361, 292251, 295502, 298508, 301151, 303958, 307601, 312249]
62520C12249N446O434Q034R672J0404J0515J1372J3401J5334J5969J5778J5988
62508D50596J6836J7683J8162J8285J7766J6315J4390J2738J1252R143O173K982
62496F12321J87k099l858m975n514n559m779k854l56J529K354K838L869N638P957
62481F06699J0647J3406J5837J7955K0075K1890K2246K0271J6369J1802P609M180
62469G88986J365j369m671q792j3419j8021k2103k5136k6801k7445k7819k8179
62457E86596k8060k7099k5521k3618k1319j8642j6038j3956j2394j1193j0349
62446C78407r797r300q756q194p274n525l327j864j635j785j501j252j752k477
62432C13968k318j296m47k08m3L49N33K04l04o30p83p41m04q1l30j046j381q97
$$ y = [312249, 317695, 324129, 332163, 341835, 352239, 362754, 374126, 387527, 402861, 418830, 434608, 450596, 467432, 485115, 503277, 521562, 539328, 555643, 570033, 582771, 594023, 603166, 609339, 612321, 612508, 610409, 606551, 601576, 596062, 590503, 585724, 582870, 582514, 584043, 586397, 589235, 593104, 598742, 606699, 617346, 630752, 646589, 664544, 684619, 706509, 728755, 749026, 765395, 777197, 784806, 788986, 790351, 788982, 784311, 775519, 762100, 744079, 721976, 696840, 670039, 642594, 614775, 586596, 558536, 531437, 505916, 482298, 460979, 442337, 426299, 412343, 399949, 388756, 378407, 368610, 359310, 350554, 342360, 335086, 329561, 326234, 324370, 322735, 320950, 319449, 318197, 316445, 313968, 311650, 310354, 309907, 309699, 309656, 310005, 310538, 310742, 310438, 309808, 309025, 308284, 307880, 307799, 307469, 306423, 305042, 304145]
62414C04145j74L6k67o15p47o30k48K10K94j79p66r10n71j25J84M00O53J039J569
62395C03298K106K493K757L066L429L724L978M261M329L891L257L155L710M165
62381C51619M007L797M401N758P036P726Q046Q375Q888R745J1101J2734J4051
62368D57284J4653J4795J5181J6375J8413K0813K3072K5232K7914L1588L5942
62357G01262M0230M4211M8338N2922N7344O0341O1013N9324N5678N0312M3265
62346A274240L4841K5728J6639Q065M11o036j1595j7273k3781l0531l6078l9628
62334A195002m1583m2576m2655m1669l9949l8044l6062l3749l1108k8519k6323
62323G92765k4531k2966k1501k0180j9223j8784j8653j8402j7898j7396j7006
$$ y = [304145, 303971, 304007, 303740, 303125, 302378, 301748, 301500, 301710, 302004, 301825, 301059, 300149, 299578, 299453, 299637, 300037, 300690, 301729, 303298, 305404, 307897, 310654, 313720, 317149, 320873, 324851, 329112, 333441, 337332, 340589, 343744, 347454, 351619, 355626, 359423, 363824, 369582, 376618, 384344, 392390, 400765, 409653, 419398, 430499, 443233, 457284, 471937, 486732, 501913, 518288, 536701, 557514, 580586, 605818, 633732, 665320, 701262, 741492, 785703, 834041, 886963, 944307, 1004648, 1065661, 1124985, 1180663, 1230975, 1274240, 1309081, 1334809, 1351448, 1359513, 1359924, 1353888, 1342293, 1325020, 1301239, 1270708, 1234630, 1195002, 1153419, 1110843, 1068188, 1026519, 986570, 948526, 912464, 878715, 847607, 819088, 792765, 768234, 745268, 723767, 703587, 684364, 665580, 646927, 628525, 610627, 593231, 576225]
62312E76225j6415j5433j4394j3709j3236j2535j1495j0293q971p493o082n033
62300D41136m277l566l001k902l187l329k922j963o40O80J435J353J033J392K449
62285D23691L249L212K928L241M064M622M499L959L375K943K880L496M827O326
62271D77312P099O613N398M882O183Q988J2003J4489J6825J9439K2046K4449K7431
62258F53157L1893L7440M2745M7299N1841N6795O1098O3139O2342N9274N4537
62247A221560M8175M0141L0792K0880J1168K148o118j3878k1306k8287l4632m0340
62235A230303m5428m9561n2168n2922n2035n0086m7625m4854m1495l7201l2307
62224G24621k8026k5387k4061k2714k0673j8608j7284j6344j4920j3054j1599
$$ y = [576225, 559810, 544377, 529983, 516274, 503038, 490503, 479008, 468715, 459744, 452251, 446169, 441136, 436859, 433293, 430292, 427390, 424203, 420874, 417952, 415989, 415349, 416029, 417464, 418817, 419850, 421242, 423691, 426940, 430152, 433080, 436321, 440385, 445007, 449506, 453465, 456840, 459783, 462663, 466159, 470986, 477312, 484411, 491024, 496422, 501304, 507487, 516475, 528478, 542967, 559792, 579231, 601277, 625726, 653157, 685050, 722490, 765235, 812534, 864375, 921170, 982268, 1045407, 1107749, 1167023, 1221560, 1269735, 1309876, 1340668, 1361548, 1372716, 1374864, 1368746, 1354868, 1333562, 1305275, 1270643, 1230303, 1184875, 1135314, 1083146, 1030224, 978189, 928103, 880478, 835624, 794129, 756928, 724621, 696595, 671208, 647147, 624433, 603760, 585152, 567868, 551524, 536604, 523550, 511951]
62213E11951j0837j0076q803p452o584o067n492m903m489l961k984j922j424j373
62199D35584r74P6J216J962K503L178M012N089O703Q678J0126J0495J0437J0942
62185E10027J1975J2660J2726J2876J3583J4273J4035J2743J1071R608Q325O885
62173F50787N368M532N240P502J0362J2988J5696J9411K4272K9378L3927L7915
62161H57378M1431M3860M4288M2336L8161L2064K4632J6996J0184M235j546p417
62149A146602j2931j7818k2489k7255l1648l5000l7333l9091m0133l9682l7394
62138H05828l4030l0812k8360k6396k4301k1716j8782j6025j3947j2599j1519
62127E67341j0180q390o282m110k227r59j72Q80K917N800Q719J1187J3499J6036
$$ y = [511951, 501114, 491038, 482235, 474783, 468199, 462132, 456640, 451737, 447248, 443287, 440303, 438381, 436957, 435584, 434610, 434686, 435902, 437864, 440367, 443545, 447557, 452646, 459349, 468027, 478153, 488648, 499085, 510027, 522002, 534662, 547388, 560264, 573847, 588120, 602155, 614898, 625969, 635577, 643902, 650787, 656155, 660687, 665927, 673429, 683791, 696779, 712475, 731886, 756158, 785536, 819463, 857378, 898809, 942669, 986957, 1029293, 1067454, 1099518, 1124150, 1141146, 1151330, 1155565, 1154019, 1146602, 1133671, 1115853, 1093364, 1066109, 1034461, 999461, 962128, 923037, 882904, 843222, 805828, 771798, 740986, 712626, 686230, 661929, 640213, 621431, 605406, 591459, 578860, 567341, 557161, 548771, 542489, 538379, 536152, 535193, 535021, 535901, 538818, 544618, 553337, 564524, 578023, 594059]
62113E94059J8489K0028J9967J8117J4886J1379R035Q597R407J0099R931R061
62101G53055P589N019R95l887q373j1530j3193j3652j3227j2200j0824r311p792
62088F62669o308m736k794k64K702N607P982R826J1571J3591J5769J7689J9250
62075G52554K0853K2872K5130K7120K8559K9474K9895K9801K9469K9439L0080
62064A055246L1247L2451L3222L3371L3068L2538L1495K9034K4507J8370J1784
62053A366333N508l52n624r895j3256j6516k0299k4434k8509l2454l6136l8924
62041A145442m0264m0343l9718l8574l6807l4553l2124k9672k7320k5298k3543
62030G77226k1537j9043j6601j4735j3106j1187r304q149p550o779n915n806o570
$$ y = [594059, 612548, 632576, 652543, 670660, 685546, 696925, 705960, 714557, 723964, 734063, 743994, 753055, 760644, 765663, 766658, 762771, 754398, 742868, 729675, 716023, 702796, 690596, 679772, 670461, 662669, 656361, 651625, 648831, 648567, 651269, 656876, 664858, 674684, 686255, 699846, 715615, 733304, 752554, 773407, 796279, 821409, 848529, 877088, 906562, 936457, 966258, 995727, 1025166, 1055246, 1086493, 1118944, 1152166, 1185537, 1218605, 1251143, 1282638, 1311672, 1336179, 1354549, 1366333, 1371841, 1371489, 1365865, 1355970, 1342714, 1326198, 1305899, 1281465, 1252956, 1220502, 1184366, 1145442, 1105178, 1064835, 1025117, 986543, 949736, 915183, 883059, 853387, 826067, 800769, 777226, 755689, 736646, 720045, 705310, 692204, 681017, 671713, 663564, 656014, 649235, 643320, 637514, 630944]
62017F30944p212p067o686o907p729q549q813q186o686n006m048l786l185j616
62003E45468M23K289M084O038P682Q466Q558Q364P785O646N382M459L460J674
61989F20778o41k448l311l788m470n354o224p023p714q260q849r713j0650j1136
61975E31197j0838r730p940n960m671m500m676m073k771j974k320l091l349l016
61961D62288k444j654o32J67K95kj11R8K86L96R07K176L894N356O221O856P924
61944D92021R646J1648J3595J5686J8241K0949K3066K4374K5435K6738K8039K8782
61932G38220K8841K8501K8011K7458K6897K6285K5304K3561K0944J7643J3855
61921A005520R575M722n45n669r877j2662j4023j4191j3269j1316q552n200j255
$$ y = [630944, 623732, 616665, 609979, 603072, 595343, 586794, 577981, 569795, 563109, 558103, 554055, 550269, 547084, 545468, 545891, 548180, 552264, 558302, 565984, 574450, 583008, 591372, 599157, 605803, 611185, 615644, 619104, 620778, 620137, 617689, 614378, 610590, 606120, 600766, 594542, 587519, 579805, 571545, 562696, 552983, 542333, 531197, 520359, 510629, 502689, 496729, 492058, 487558, 482882, 478809, 476038, 474064, 471744, 468653, 465304, 462288, 459844, 458190, 457558, 457725, 458020, 458018, 457907, 458005, 458291, 458687, 459594, 461770, 465664, 471020, 477241, 484097, 492021, 501667, 513315, 526910, 542596, 560837, 581786, 604852, 629226, 654661, 681399, 709438, 738220, 767061, 795562, 823573, 851031, 877928, 904213, 929517, 953078, 974022, 991665, 1005520, 1015095, 1019817, 1019272, 1013603, 1003726, 991064, 977041, 962850, 949581, 938265, 929713, 924513, 923258]
61908I23258L217P695J1610J5015J8274K1078K2385K1571J9109J5780J1800P056
61896A097848J713l933r766j5461k0064k2692k3600k4010k4813k5801k6247k5789
61884H77385k4644k3306k2182k1404k0779k0085j9318j8639j8099j7622j7230
61873F54077j7018j6831j6165j4627j2419j0250q648p421n921l841j591K44J662
61860E41251L226N399Q155J1137J3921J6215J8233K0826K4745K9665L4406L8296
61848G65475M1772M5368M8668N0817N1611N1442N0382M8017M4145L9057L2990
61837A269744K5793J7390Q315l93p795j3455j7336j9341j9089j6358j1774o624
61825A209077j676L447R340J5491K0354K2681K2347J9868J5572R480J757o884
$$ y = [923258, 926475, 934170, 945780, 960795, 979069, 1000147, 1022532, 1044103, 1063212, 1078992, 1090792, 1097848, 1099561, 1095628, 1085862, 1070401, 1050337, 1027645, 1004045, 980035, 955222, 929421, 903174, 877385, 852741, 829435, 807253, 785849, 765070, 744985, 725667, 707028, 688929, 671307, 654077, 637059, 620228, 604063, 589436, 577017, 566767, 558119, 550698, 544777, 540936, 539345, 539589, 541251, 544477, 549876, 558031, 569168, 583089, 599304, 617537, 638363, 663108, 692773, 727179, 765475, 807247, 852615, 901283, 952100, 1003711, 1055153, 1105535, 1153552, 1197697, 1236754, 1269744, 1295537, 1312927, 1321242, 1320849, 1313054, 1299599, 1282263, 1262922, 1243833, 1227475, 1215701, 1209077, 1207401, 1210848, 1220188, 1235679, 1256033, 1278714, 1301061, 1320929, 1336501, 1345981, 1347738, 1340854]
61813A340854j5425k3225l0435l7338m3311m7031m8114m7869m7779m7711m6426
61802I06190m3601m0261l7239l4247l0837k7334k4321k1768j9310j6946j4962
61791E95364j3415j2115j0879r564q120o836o227o318o423n970n185m621m366
61778D95325m131l760l203k355j409j070j761k880l448l360l300l491l377k686
61764D55094j998j887k099k018j521r12l59J39M76N84O72R55J233J178R21R58
61748D51416J417J782J495O30j81l73P8P07J002Q26L94j02o51j082q75L18K053
61731D58854L362L683L334K941K805K873L059L316L545L693L811L882L683L062
61717E05903K253J716J720K202K908L481L516K810J589L13p56j635k319k693k751
$$ y = [1340854, 1325429, 1302204, 1271769, 1234431, 1191120, 1144089, 1095975, 1048106, 1000327, 952616, 906190, 862589, 822328, 785089, 750842, 720005, 692671, 668350, 646582, 627272, 610326, 595364, 581949, 569834, 558955, 549391, 541271, 534435, 528208, 521890, 515467, 509497, 504312, 499691, 495325, 491194, 487434, 484231, 481876, 480467, 479397, 477636, 474756, 471308, 467948, 464648, 461157, 457780, 455094, 453096, 451209, 449110, 447092, 445571, 444659, 444300, 444439, 444915, 445499, 446171, 447126, 448359, 449537, 450458, 451416, 452833, 454615, 456110, 456740, 456559, 456186, 456264, 456971, 457973, 458799, 459193, 459091, 458440, 457358, 456483, 456801, 458854, 462216, 465899, 469233, 472174, 474979, 477852, 480911, 484227, 487772, 491465, 495276, 499158, 502841, 505903, 508156, 509872, 511592, 513794, 516702, 520183, 523699, 526509, 528098, 528411, 527655, 526020, 523701, 521008, 518257]
61702E18257k659k533k330k084j963j927j555m92R54J936J892J132M48K29J10
61687E09415l64r19p95K08J261J435P97K21K17M07K26l70j026j478j713j842j984
61670E03696k075j729o53O71J165L27j103k028k227k274k474k512k102j474j021
61655D84187q33p53n88j93M33J048J377J511J830K441K988L209L422M136N357
61640E09572O518P124P156O832O192N119L675K160Q39k60j180j900k467l085l782
61625E42513m162l831l103k726k896k945k334j478j154j453j814j888j812j782
61611E09135j861k226l011l879m275m261m553n514o622p164p052o556n739m643
61597D41779l804l899m906n948o135n265l873k776k568l132l582l048j648m26
$$ y = [518257, 515598, 513065, 510735, 508651, 506688, 504761, 503206, 502714, 503668, 505604, 507496, 508628, 509076, 509305, 509415, 509051, 508132, 507337, 507545, 508806, 510241, 511038, 511259, 511476, 511883, 512109, 511739, 510713, 509235, 507522, 505680, 503696, 501621, 499892, 499239, 499910, 501075, 501402, 500299, 498271, 496044, 493770, 491296, 488784, 486682, 485208, 484187, 483354, 482601, 482013, 481820, 482253, 483301, 484678, 486189, 488019, 490460, 493448, 496657, 500079, 504215, 509572, 516090, 523214, 530370, 537202, 543394, 548513, 552188, 554348, 555187, 554927, 553747, 551847, 549380, 546295, 542513, 538351, 534520, 531417, 528691, 525795, 522850, 520516, 519038, 517884, 516431, 514617, 512729, 510917, 509135, 507274, 505048, 502037, 498158, 493883, 489622, 485069, 479555, 472933, 465769, 458717, 452161, 446422, 441779, 437975, 434076, 429170, 423222, 417087, 411822, 407949, 405173, 402605, 399473, 395891, 392843, 391195, 390769]
61583C90769j67m95m22L91J269J374O48k69q41j078j221j334j382j511j893k339
61567C81499k369j817j156r76j276j516j298p99m50m77q48j463k140k517k340
61552C60057j835j537j665j858j725j367j110r87q38p96j174j827k121j748j179
61537C38290r83j027o83L55J808L175M005L953L009J724P91L09k58j317k569l343
61521C47239l347k906k577k605k789k811k622k456k433k332j889j196o31m94p78
61506C15373j215j417j160o64m18n42o21l74j49l48p09p42o30r38j467j261o6
61489C02652J047R86Q2m35n7N28N18q9o89p23n9R40J616J485P21K8kN74J178J227
61469C11528O16k14o65n38j69L7J10L85R04J249J082N87J45k30p60j219q67N15
$$ y = [390769, 390602, 390107, 389685, 390076, 391345, 392719, 393367, 393098, 392257, 391179, 389958, 388624, 387242, 385731, 383838, 381499, 379130, 377313, 376157, 375181, 373905, 372389, 371091, 370292, 369842, 369365, 368517, 367054, 364914, 362397, 360057, 358222, 356685, 355020, 353162, 351437, 350070, 348960, 347973, 347135, 346339, 345165, 343338, 341217, 339469, 338290, 337307, 336280, 335597, 335952, 337760, 340935, 344940, 348893, 351902, 353626, 354417, 354726, 354468, 353151, 350582, 347239, 343892, 340986, 338409, 335804, 333015, 330204, 327582, 325126, 322693, 320361, 318472, 317276, 316645, 316151, 315373, 314158, 312741, 311581, 310917, 310499, 309957, 309336, 308962, 308813, 308465, 307756, 307014, 306384, 305446, 303979, 302718, 302652, 303699, 304685, 304767, 304332, 304275, 304803, 305321, 305232, 304543, 303820, 303761, 304701, 306317, 307802, 308523, 308551, 308549, 309123, 310301, 311528, 312144, 311930, 311265, 310727, 310558, 310595, 310705, 311090, 311994, 313243, 314325, 314912, 315057, 314827, 314067, 312848, 311981, 312496]
61451C12496J951K151J053j50n62n87r71j531j460o04L14P20Q27J117J750K616
61435C19130L544M217M315L932L559L449L337K982K613K565K763K919K923K768
61421C65016K297J506Q51Q84J518K132K371K514K880L239L076K311J410P63K45
61406C93013m76j349j994k309k704l532m504m972m692l997l298k746k417k459
61392C51564k837l163l008k330j442o65j41J16J38M0j8L4J14Q6oL5K67M18K70
61373C39472Q2L36J014J583J774J955K470L060L293L102K546J514K56k57O68K308
61357C65176L194K929K544K978L942M536M418M068M275N479P328Q935R928J0983
61343D40713J2701J4364J4671J3589J2317J1407J0183Q344O792O089N353L643
$$ y = [312496, 314447, 316598, 317651, 317501, 316939, 316352, 315381, 313850, 312390, 311786, 312100, 312820, 313647, 314764, 316514, 319130, 322674, 326891, 331206, 335138, 338697, 342146, 345483, 348465, 351078, 353643, 356406, 359325, 362248, 365016, 367313, 368819, 369670, 370554, 372072, 374204, 376575, 379089, 381969, 385208, 388284, 390595, 392005, 392768, 393013, 392537, 391188, 389194, 386885, 384181, 380649, 376145, 371173, 366481, 362484, 359186, 356440, 354023, 351564, 348727, 345564, 342556, 340226, 338784, 338119, 337978, 338094, 338232, 338272, 338254, 338288, 338402, 338488, 338482, 338517, 338784, 339202, 339472, 339554, 339890, 340904, 342487, 344261, 346216, 348686, 351746, 355039, 358141, 360687, 362201, 362457, 362200, 362868, 365176, 368370, 371299, 373843, 376821, 380763, 385299, 389717, 393785, 398060, 403539, 410867, 419802, 429730, 440713, 453414, 467778, 482449, 496038, 508355, 519762, 529945, 538289, 545081, 551170, 556523, 560166]
61331E60166J622O49P10M92p75k575m177n454o533p327p668p495o796n647m370
61316E04822l360k798k618k662k723k691k723k918k865j996n84L35L76M06J336
61301D79337K903M323N433O468P203P207O531N437L752J278j485l735n242o135
61287E13275o204n301m108l574l706l754l398k934k428j629o42J88J043K329L677
61272D82834M250M184M653O168P755Q278P836P371P492Q151R010R641R781R614
61258E87018R636J0101J0970J2279J4070J5951J7324J8030J8154J7320J4958J1397
61246G57208P770M685J763j313m199o630q836j0762j1753j1574j0960j0554j0030
61233F84815q977p868p323o999o201n138m583m534m181l142j857p51J37O60M83
$$ y = [560166, 561788, 562437, 563147, 563639, 562864, 560289, 556112, 550658, 544125, 536798, 529130, 521635, 514839, 509192, 504822, 501462, 498664, 496046, 493384, 490661, 487970, 485247, 482329, 479464, 477468, 476884, 477219, 477595, 478001, 479337, 482240, 486563, 491996, 498464, 505667, 512874, 519405, 524842, 528594, 529872, 528387, 524652, 519410, 513275, 507071, 501770, 497662, 494088, 490382, 486628, 483230, 480296, 477868, 476239, 475597, 475785, 476828, 479157, 482834, 487084, 491268, 495921, 502089, 509844, 518122, 525958, 533329, 540821, 548972, 557982, 567623, 577404, 587018, 596654, 606755, 617725, 630004, 644074, 660025, 677349, 695379, 713533, 730853, 745811, 757208, 764978, 769663, 771426, 770113, 765914, 759284, 750448, 739686, 727933, 716359, 705399, 694845, 684815, 675838, 667970, 660647, 653648, 647447, 642309, 637726, 633192, 629011, 625869, 624012, 623261, 623398, 624058, 624541]
61218F24541j69m15J06N38k25k062l654l919l033j931j232q44m81j78j78n78j203
61201F05083j755j951j720j323j015m96R25L322N709P175Q162R957J3004J6345
61187F61422J8817K0091K0428K0000J8895J7210J5016J2515J0417R590J0037J0657
61175H45095J0357R050P309N542L887K508J494O23l95j558k724l958n476p360
61161H64394r455j1385j2614j2873j2624j2726j3390j3860j3397j2200j0954r840
61149G19076q513o840n094l441j723J09J727K790L369L687L541K281m21l918o963
61134F99667q834r795j0383j0542r817q161o149m341k792j153Q28K931M515N140
61120F41114N267N973P790J0209J2540J4693J6669J7995J8468J8889K0071K1473
$$ y = [624541, 624372, 623957, 624063, 624601, 624376, 622314, 618660, 614741, 611708, 609777, 608545, 607701, 607220, 607042, 606864, 606286, 605083, 603328, 601377, 599657, 598334, 597319, 596823, 597748, 601070, 606779, 613954, 622116, 632073, 645077, 661422, 680239, 700330, 720758, 740758, 759653, 776863, 791879, 804394, 814811, 824401, 834438, 845095, 855452, 864502, 871811, 877353, 881240, 883748, 885242, 885865, 885470, 883912, 881188, 877230, 871754, 864394, 854939, 843554, 830940, 818067, 805443, 792717, 779327, 765467, 752070, 739870, 728916, 719076, 710563, 703723, 698629, 695188, 693465, 693574, 695301, 698091, 701460, 705147, 708688, 710969, 710548, 706630, 699667, 690833, 681038, 670655, 660113, 650296, 642135, 635986, 631645, 628853, 627700, 628528, 631459, 635974, 641114, 646381, 652354, 660144, 670353, 682893, 697586, 714255, 732250, 750718, 769607, 789678, 811151]
61108H11151K1881K1203K0498K0268J9970J9265J8580J8094J7297J6004J4780
61097A018991J3818J2361R831O695L545R1m168q826j2826j5558j7129j7888j8137
61084I70800j8059j7686j7147j6915j7367j8036j8048j7329j6604j6105j5247
61073G82257j3847j2652j2130j1636j0436q786p334o100m708l085j385K60J566
61060F91984K190K371K813L685M454N004N942P421Q646R095R323R924J0686J1355
61046G84893J2347J3925J5540J6693J7683J8943K0471K2356K4824K7292K8670
61035A003637K9161L0355L2778L4953L5928L7002L9594M3069M6261M9580N3614
61024A435932N7021N8024N7106N6179N5954N6231N7933O2556P0017P9075Q9265
$$ y = [811151, 833032, 854235, 874733, 895001, 914971, 934236, 952816, 970910, 988207, 1004211, 1018991, 1032809, 1045170, 1055001, 1061696, 1065241, 1065332, 1061164, 1052338, 1039512, 1023954, 1006825, 988937, 970800, 952741, 935055, 917908, 900993, 883626, 865590, 847542, 830213, 813609, 797504, 782257, 768410, 755758, 743628, 731992, 721556, 712770, 705436, 699336, 694628, 691543, 690158, 690418, 691984, 694174, 696545, 699358, 703043, 707497, 712501, 718443, 725864, 734510, 743605, 752928, 762852, 773538, 784893, 797240, 811165, 826705, 843398, 861081, 880024, 900495, 922851, 947675, 974967, 1003637, 1032798, 1063153, 1095931, 1130884, 1166812, 1203814, 1243408, 1286477, 1332738, 1382318, 1435932, 1492953, 1550977, 1608083, 1664262, 1720216, 1776447, 1834380, 1896936, 1966953, 2046028, 2135293]
61013B135293J00460J11270J20401J29240J40983J57690J80509K12001K55394
61004C543241L11932L81988M68556N76938P12369Q82879J104281J395009J759659
60995A1136852K174754K583539K893838K984732K746768K157798J339510N26468
60987B8544259m9098k69186j56968J71870N61280Q35231Q23849M31968k89019
60978C0604186j146027j904167k404917k613650k585251k404754k150541j881081
60970A3513798j629729j406431j209153j035589q85065p55233o42881n47255m69043
60961D933419m06714l56603l15856k82798k55093k30202k07361j87052j68791
60952B522949j51254j34211j18467j04296r1633q1348p4432p0183o6894o4096
$$ y = [2135293, 2235753, 2347023, 2467424, 2596664, 2737647, 2895337, 3075846, 3287847, 3543241, 3855173, 4237161, 4705717, 5282655, 5995024, 6877903, 7982184, 9377193, 11136852, 13311606, 15895145, 18788983, 21773715, 24520483, 26678281, 28017791, 28544259, 28495161, 28225975, 28069007, 28240877, 28802157, 29637388, 30461237, 30893205, 30604186, 29458159, 27553992, 25149075, 22535425, 19950174, 17545420, 15394879, 13513798, 11884069, 10477638, 9268485, 8232896, 7347831, 6592598, 5949717, 5402462, 4933419, 4526705, 4170102, 3854246, 3571448, 3316355, 3086153, 2878792, 2691740, 2522949, 2371695, 2237484, 2119017, 2014721, 1923088, 1841740, 1767308, 1697125, 1630231, 1566135]
60942A566135o2415o1497n9860n6864n3279m9813m6513m3641m1735m0571l9317
60931A010630l7741l6297l5053l3660l2201l0939k9406k7018k4355k2537k1438
60920F79985j9913j7758j5977j5033j4234j3134j2184j1582j0662q982o999n344
60908E28183m147l372k998k642j873r33l92j27M63J192J232O33N15J374K213J911
60892E21232N97q15j760k193k266k214k179j975j436r32j001j516j923k203k756
60877D96660l466l790l772m047m745n334n628n942o199n887n149m834n162n371
60863D27334m970m366l911l339k587k114j927j311j54N20Rq91j060n15Q3O74J662
60846D03137K911L771L927L595L144K874K909L001K773K370K296K436K064J134
$$ y = [1566135, 1503720, 1442223, 1382363, 1325499, 1272220, 1222407, 1175894, 1132253, 1090518, 1049947, 1010630, 972889, 936592, 901539, 867879, 835678, 804739, 775333, 748315, 723960, 701423, 679985, 660072, 642314, 626337, 611304, 597070, 583936, 571752, 560170, 549508, 540526, 533527, 528183, 524036, 520664, 517666, 515024, 513151, 512218, 511826, 511699, 512162, 513354, 514586, 515219, 515734, 517108, 519321, 521232, 521829, 521014, 519254, 517061, 514795, 512581, 510402, 508427, 506991, 506059, 505058, 503542, 501619, 499416, 496660, 493194, 489404, 485632, 481585, 476840, 471506, 465878, 459936, 453737, 447850, 442701, 437867, 432705, 427334, 422364, 417998, 414087, 410748, 408161, 406047, 404120, 402809, 402655, 403175, 403184, 402293, 401233, 400718, 400801, 401475, 403137, 406048, 409819, 413746, 417341, 420485, 423359, 426268, 429269, 432042, 434412, 436708, 439144, 441208, 442342]
60832D42342O73J260J987J708O69o1j44j0K19Q06J575J990J989J912J614N27j208
60815D57848k488k479j637j121j543k578l570m177m467m579m585m620m982n804
60801D09218o715p132o860o146n172l977k899k473k686k811k326j655j609k313
60787C54444l047k980j967p52l83j092j872j599m89J86r2m87j93M18O68P52J262
60770C42777K078K605K807L220L995M704N054N233N442N596N632N747O150O745
60756D07785P146O949O089M986M177L792L566L361L286L348L417L618M177M721
60742D70418M384K955J289J28q48k258l864m881n087m914m780m906n571o784p881
60727D27400q104p503o724o068n393m784m599m799m799m232l371k763k657k804
$$ y = [442342, 443015, 444275, 446262, 447970, 448639, 448578, 448434, 448424, 448643, 449449, 451024, 453014, 455003, 456915, 458529, 459056, 457848, 455360, 452881, 451244, 450123, 448580, 446002, 442432, 438255, 433788, 429209, 424624, 420004, 415022, 409218, 402503, 395371, 388511, 382365, 377193, 373216, 370317, 367844, 365158, 362347, 360021, 358366, 356757, 354444, 351397, 348417, 346450, 345698, 345315, 344223, 342351, 340752, 340263, 340449, 340357, 339870, 339677, 340095, 340763, 341515, 342777, 344855, 347460, 350267, 353487, 357482, 362186, 367240, 372473, 377915, 383511, 389143, 394890, 401040, 407785, 414931, 421880, 427969, 432955, 437132, 440924, 444490, 447851, 451137, 454485, 457902, 461520, 465697, 470418, 474802, 477757, 479046, 479174, 478326, 476068, 472204, 467323, 462236, 457322, 452542, 447636, 442065, 435281, 427400, 419296, 411793, 405069, 399001, 393608, 388824, 384225, 379426, 374627, 370395, 367024, 364261, 361604, 358800]
60713C58800k574j442K33J327J237P92J191K315K948K540J823J640J997K643L584
60698C79054M648N220N076M929N509O508P045O857O388N900N159M045K870J933
60684D51141J152L67l20o71o04k11L27P75R56R47J019J268J490J569J791K530
60668D63526L770N184O557P841Q860R461R937J0794J1996J3022J3884J5369J7795
60655E97996K0230K1683K2555K3880K5523K6296K5792K4833K3876K2235J9382
60644H54281J5856J2104P441J219n623j1262j4926j7230j8917k0209k1210k2007
60632G59517k2345k1842k0636j9167j7521j5541j3504j1868j0435q566o347m754
60620E86991m364m599m548l992l300k819k697k940l291l364l152l138l712m679
$$ y = [358800, 356226, 354784, 355017, 356344, 357581, 358373, 359564, 361879, 364827, 367367, 369190, 370830, 372827, 375470, 379054, 383702, 388922, 393998, 398927, 404436, 410944, 417989, 424846, 431234, 437134, 442293, 446338, 449208, 451141, 452293, 452660, 452340, 451669, 451065, 450854, 451181, 451956, 452912, 453859, 454878, 456146, 457636, 459205, 460996, 463526, 467296, 472480, 479037, 486878, 495738, 505199, 515136, 525930, 537926, 550948, 564832, 580201, 597996, 618226, 639909, 662464, 686344, 711867, 738163, 763955, 788788, 812664, 834899, 854281, 870137, 882241, 889682, 890901, 885278, 874016, 859090, 841860, 822943, 802734, 781524, 759517, 737172, 715330, 694694, 675527, 658006, 642465, 628961, 617093, 606658, 598092, 591745, 586991, 582627, 578028, 573480, 569488, 566188, 563369, 560672, 557732, 554441, 551077, 547925, 544787, 541075, 536396]
60606E36396n549o028o115n948n750n692n735n826o199p154q401r016q314o606
60592D44063m913m065m118m395m075k960j658q04k56N25J467J851J410Q33Q07
60577D23712J141J237J162J665L190N267O973P893Q608J0188J3127J6800K0155
60564E21118K2772K4862K6391K6765K5470K2500J7955J1904M936j664o866j0634
60552F85509j3319j4738j4475j2701r988o494k139K558O652J0114J4091J9413
60540F64483K5310L0205L3372L5172L5786L4523L0602K4143J6034P166j744r704
60528I25348j5448j8279j8640j7605j5833j3396j0538q111o922o864p015o607
60516G80090n613m465l442k470j311K16K046L794N052N946P274R760J3213J6740
$$ y = [536396, 530847, 524819, 518704, 512756, 507006, 501314, 495579, 489753, 483554, 476400, 467999, 458983, 450669, 444063, 439150, 435085, 430967, 426572, 422497, 419537, 417879, 417075, 416819, 417344, 418811, 420662, 422072, 422905, 423712, 424853, 426090, 427252, 428917, 432107, 437374, 444347, 452240, 460848, 471036, 484163, 500963, 521118, 543890, 568752, 595143, 621908, 647378, 669878, 687833, 699737, 704673, 703009, 696143, 685509, 672190, 657452, 642977, 630276, 620288, 613794, 611655, 614213, 620865, 630979, 645070, 664483, 689793, 719998, 753370, 788542, 824328, 858851, 889453, 913596, 929630, 936796, 935052, 925348, 909900, 891621, 872981, 855376, 839543, 826147, 815609, 807498, 800576, 793712, 786697, 780090, 774477, 770012, 766570, 764100, 762789, 763005, 765051, 768845, 773897, 779843, 787117, 796877, 810090, 826830]
60502H26830J9930K3494K8563L5575M4184N3951O4590P5563Q6019R5331J03236
60491A457266J09186J11980J10416J03936R2184P4482N0604K2069q048l6873o2760
60480B024442q4572j00866j10561j14050j12883j08376j01133r1845q1904p2709
60470A045543o4755n7718n1304m5607m0719l6436l2575k9278k6773k4908k3173
60459F12297k1155j8829j6393j4013j1805r930q581p927p935q172p887o675n022
60446D67973l931l828m198m368m293m224m060l532k776k165j674r84k10O9l03
60431D27496p27p04o03j160k456l835m674m901m744m313l643k889k277j823j274
60416C87473m97J84L31M2j01J14K36K5J10J069K205K192Q99l76p09n71o31n42
$$ y = [826830, 846760, 870254, 898817, 934392, 978576, 1032527, 1097117, 1172680, 1258699, 1354030, 1457266, 1566452, 1678432, 1788848, 1892784, 1984968, 2059450, 2110054, 2132123, 2124075, 2087202, 2024442, 1939870, 1839004, 1728443, 1614393, 1501510, 1393134, 1292001, 1200156, 1118252, 1045543, 980788, 923070, 871766, 826159, 785440, 749004, 716429, 687151, 660378, 635470, 612297, 591142, 572313, 555920, 541907, 530102, 520172, 511591, 503664, 495729, 487557, 479670, 472995, 467973, 464042, 460214, 456016, 451648, 447355, 443131, 439071, 435539, 432763, 430598, 428924, 427940, 427730, 427799, 427496, 426769, 426065, 425462, 424302, 421846, 418011, 413337, 408436, 403692, 399379, 395736, 392847, 390570, 388747, 387473, 386976, 387160, 387491, 387533, 387432, 387546, 387782, 387807, 387917, 388986, 391191, 393383, 394282, 393906, 393197, 392626, 391995, 391453]
60398C91453J72Q52M68o50j089l07P25J065R70J120J495J638J492J320J178R55
60382D02857P71Q03Q74O97L90L19N35P37P93R09J161J304J129Q21P80J210J947
60365D18037K575K760K483K014J537R68K63k78k73K14P38R97J040R59P18L28q6
60348D34994m50p03n77K00J375K260K525K539K667K683K219J455Q72M87m5o90
60332D51811r31n18Q3K09j92n57l40L81R73R03L01j83r1N52J592K980M397N129
60314D66499M788L989L805M682O241P990R769J1647J3873J6894K0927K5659L0638
60301F27401L5684M0167M2287M0150L3776K5106J5671N278o460j8210k7496l2864
60289G80490l4669l4028l1739k8271k4133k0013j6589j4122j2213j0273q354p119
$$ y = [391453, 391625, 392477, 392945, 392295, 391206, 390899, 391624, 392689, 393659, 394779, 396274, 397912, 399404, 400724, 401902, 402857, 403628, 404431, 405305, 406002, 406392, 406711, 407246, 407983, 408776, 409685, 410846, 412150, 413279, 414100, 414880, 416090, 418037, 420612, 423372, 425855, 427869, 429406, 430374, 430637, 430359, 430086, 430300, 431038, 432035, 433075, 434034, 434752, 435080, 434994, 434544, 433841, 433264, 433464, 434839, 437099, 439624, 442163, 444830, 447513, 449732, 451187, 452059, 452546, 452501, 451811, 450880, 450362, 450445, 450654, 450462, 449905, 449565, 449946, 450919, 451822, 452123, 451940, 451849, 452401, 453993, 456973, 461370, 466499, 471287, 475276, 479081, 483763, 490004, 497994, 507763, 519410, 533283, 550177, 571104, 596763, 627401, 663085, 703252, 745539, 785689, 819465, 844571, 860242, 865520, 859060, 840850, 813354, 780490, 745821, 711793, 680054, 651783, 627650, 607637, 591048, 576926, 564713, 554440, 546086, 538967]
60277E38967o822o784o292n520n070n025m986m805m684m707m766m801m741m360
60263D65604l532k495j514o12P3J17n23j127j080p63q99j374j500j161p88l93
60247D48033L62J166J094nj084j220p14m26o28j018j307j343r52j60O24R75R66
60230D44363J105J825L089M322M801M360L621L258L154K783K227K137K641L029
60216D86715K796K322K167K248K179J949J759J585J343J290J676K263K578K527
60202E15397K360K141J727J256J185J699K375K597K218J614J191R08L97m81j250
60187E35334j183j02J256J749P99j061k650l241l151l142l382l367k864k289j946
60172E10760j507o84P8K00r6j52J85O04J088J816K488K537J984J352Q45L84L86
$$ y = [538967, 532145, 525361, 519069, 513549, 508479, 503454, 498468, 493663, 488979, 484272, 479506, 474705, 469964, 465604, 462072, 459577, 458063, 457451, 457524, 457641, 457118, 455991, 454911, 454148, 453249, 451875, 450375, 449214, 448426, 448033, 448395, 449561, 450655, 450650, 449566, 448346, 447632, 447206, 446578, 445560, 444253, 442910, 441958, 441798, 442422, 443397, 444363, 445468, 447293, 450382, 454704, 459505, 463865, 467486, 470744, 473898, 476681, 478908, 481045, 483686, 486715, 489511, 491833, 494000, 496248, 498427, 500376, 502135, 503720, 505063, 506353, 508029, 510292, 512870, 515397, 517757, 519898, 521625, 522881, 524066, 525765, 528140, 530737, 532955, 534569, 535760, 536668, 537065, 536584, 535334, 534151, 534049, 535305, 537054, 537853, 536792, 534142, 530901, 527750, 524608, 521226, 517859, 514995, 512706, 510760, 509253, 508569, 508647, 508847, 508751, 508599, 508784, 509388, 510476, 512292, 514780, 517317, 519301, 520653, 521498, 521882, 522268]
60155E22268J478L297M527M359L146J491l00j617j628n01M34M25L40J204K637
60140E41560L647M259N233O641P775Q221Q142P612O532N112L752K427Q33r43k451
60125F08352l461l968l864l137k333k100k293k119j206n0P11J000J197J628K330
60110E90687L054L597M068M682N207N048M102K960J943N99j304l018l793m098
60096F13734m824n724n770m845l848l121k003k23J360K030K217K678L380L890
60082E98931M220M624M983N055M936M693L885K164M5j583k600l596m706n295n020
60067F10736m547m763n671o530o821o609o101n374m680m495m945n470n401m723
60053E34606l992l622l590l745l942l925l482k863k510k378j950j148o08o44n45
$$ y = [522268, 523746, 527043, 531570, 535929, 539075, 540566, 540266, 538649, 537021, 536520, 536954, 537379, 537719, 538923, 541560, 545207, 549466, 554699, 561340, 569115, 577336, 585478, 593090, 599622, 604734, 608486, 610913, 611746, 610803, 608352, 604891, 600923, 597059, 593922, 591589, 589489, 587196, 585077, 583871, 583821, 584532, 585532, 586729, 588357, 590687, 593741, 597338, 601406, 606088, 611295, 616343, 620445, 623405, 625348, 625947, 624643, 621625, 617832, 613734, 608910, 603186, 597416, 592571, 588723, 585602, 583599, 583376, 584736, 586766, 588983, 591661, 595041, 598931, 603151, 607775, 612758, 617813, 622749, 627442, 631327, 633491, 633536, 631953, 629353, 625757, 621051, 615756, 610736, 606189, 601426, 595755, 589225, 582404, 575795, 569694, 564320, 559640, 555145, 550200, 544730, 539329, 534606, 530614, 526992, 523402, 519657, 515715, 511790, 508308, 505445, 502935, 500557, 498607, 497459, 496851, 496207, 495662]
60038D95662N39K272L412L258K311J544J437J763J927J462N32j59j74O4k36j269
60022E14345k595l815m885n760o258o318o050n511m737l997l592l387k882j906
60008D52652q88l16j60j1L97Q84J049P73M89P17J328J564J033K64K0L50P49R24
59990D61818R31Q13O46P81J480K425L072L330L379L064K218J391J381J978K034
59975D90741J008l33j068j219j321j508j577j515j389j030l11M86R28R16P14O60
59959D84182J015J767K350J994O76o09r29n01k86o90j177j101m81J69M48L71J44
59942D87342j09m21q28j280j755k275k697k670k100j468j347j661j841j638j361
59927D63891j279j278j191j037p07K8J002J599J547J330J493J882K062K109K433
$$ y = [495662, 496201, 498473, 501885, 505143, 507454, 508998, 510435, 512198, 514125, 515587, 516119, 515960, 515786, 515850, 515614, 514345, 511750, 507935, 503050, 497290, 491032, 484714, 478664, 473153, 468416, 464419, 460827, 457440, 454558, 452652, 451764, 451448, 451288, 451277, 451674, 452558, 453607, 454380, 454869, 455586, 456914, 458478, 459511, 459775, 459795, 460145, 460894, 461818, 462749, 463562, 464208, 464989, 466469, 468894, 471966, 475296, 478675, 481739, 483957, 485348, 486729, 488707, 490741, 491749, 491416, 490348, 489129, 487808, 486300, 484723, 483208, 481819, 480789, 480478, 480964, 481892, 482808, 483522, 484182, 485197, 486964, 489314, 491308, 491984, 491375, 490446, 489945, 489659, 488969, 487792, 486691, 486210, 486379, 486827, 487198, 487342, 487233, 486812, 485984, 484704, 482949, 480674, 477977, 475307, 473207, 471739, 470392, 468731, 466890, 465252, 463891, 462612, 461334, 460143, 459106, 458399, 458427, 459429, 461028, 462575, 463905, 465398, 467280, 469342, 471451, 473884]
59912D73884K987L240K909K342K025K028K015J665J023N19N57J072J537J576J298
59897E00677R95O82K65q3l0N03J345K400L616M650M977M540L935L726L813L811
59881E39822L825M357N432O305O333N746N158M594L599K243J229Q27L26r66k647
59866E86183l708l821l559l500l683l875l884l566k892k103j449q51j45M59O48
59851E50254O81J244K631M491O423Q242R695J0502J0806J0929J0436Q215M039
59838F38588m54k998k784r08J048K313K847K572J125j665n222q424j0452j1347
59824F04239j1578j1349j0637r781r352r424r464r130q678q349p855o834n492
59811D86316m342l587l109k852k849k957k860k390j671j028p60r16j243j516j835
$$ y = [473884, 476871, 480111, 483020, 485362, 487387, 489415, 491430, 493095, 494118, 494637, 495194, 496266, 497803, 499379, 500677, 501672, 502354, 502619, 502536, 502506, 503009, 504354, 506754, 510370, 515020, 519997, 524537, 528472, 532198, 536011, 539822, 543647, 548004, 553436, 559741, 566074, 571820, 576978, 581572, 585171, 587414, 588643, 589470, 589796, 588830, 586183, 582475, 578654, 575095, 571595, 567912, 564037, 560153, 556587, 553695, 551592, 550143, 549292, 549147, 549606, 550254, 550935, 552179, 554810, 559301, 565724, 573966, 583661, 594163, 604969, 615898, 626334, 634549, 638588, 638134, 635136, 632352, 631444, 632492, 634805, 637652, 640224, 641349, 639684, 634462, 626038, 615586, 604239, 592661, 581312, 570675, 560894, 551542, 542118, 532654, 523524, 514846, 506497, 498642, 491808, 486316, 481974, 478387, 475278, 472426, 469577, 466620, 463760, 461370, 459699, 458671, 457911, 456995, 455752, 454236, 452401]
59796D52401k352k744k434j462o77p93j593k316k547k357j883j168l71J88L12
59781D30204R0k12l92n18q53j514k218k595k566k238j600o86J07L11J3k49j52
59764D14932J78N31O69K94m68p21K01J497J705Q08M01J309K328K094J204J278
59748D28240K613L926M158L431K402J541J093J017R12N70L98P20R46K95p75q64
59732D50623M05J670J500J40j018j222r15o98n10j24P2n41j698k215j475m52n53
59715D42989j696k437j964r72k84L58J433K437K576K061J809K047K217K046J903
59700D54523K073K460L020L760M250L895K829J965J857K094J962J340O59L62N60
59685D87609R94J288J382J614K120K360J814R25O61J152J407O67o70j726k249
$$ y = [452401, 450049, 447305, 444871, 443409, 442732, 441939, 440346, 438030, 435483, 433126, 431243, 430075, 429704, 429892, 430204, 430294, 430082, 429690, 429172, 428319, 426805, 424587, 421992, 419426, 417188, 415588, 414902, 415009, 415320, 415333, 415084, 414932, 415110, 415641, 416310, 416604, 416136, 415415, 415616, 417113, 418818, 419626, 420027, 421336, 423664, 425758, 426962, 428240, 430853, 434779, 438937, 442368, 444770, 446311, 447404, 448421, 449333, 449903, 450301, 451021, 451967, 452262, 451487, 450623, 451028, 452698, 454198, 454338, 453320, 452098, 451183, 450485, 449975, 449851, 449923, 449382, 447684, 445469, 443994, 443542, 442989, 441293, 438856, 436892, 435920, 435636, 435994, 437427, 439864, 442440, 444501, 446310, 448357, 450574, 452620, 454523, 456596, 459056, 462076, 465836, 470086, 473981, 476810, 478775, 480632, 482726, 484688, 486028, 486687, 487049, 487609, 488603, 489891, 491273, 492887, 495007, 497367, 499181, 500106, 500767, 501919, 503326, 503993, 503323, 501597, 499348]
59670D99348k601k966l089k726k014j436j414j896k274j909p99L93R85P95R2o97
59654D77792j126q54J70J654L112M082M251L600K372R32l66j163j238p09m7K36
59638D92698k51j721l852n525n552l955k038q54k42L24O05J53o52r66o88m24m44
59621D66616m40l33m16p15q79q92j222k043k916l368l295k690j530j51P87R92
59605D47505Q19O92O11M03J00j29k05j60j56l97q18r90o36n8K99M76O83O61P6
59586D48776o35o61p0J44n86j681k317k315j977j639j675k253k910k842j954j026
59570D24379p06q61j149j500j770j627j136q20p97n30J37M80J7n48k67O77J326
59553D15305J345J232J385J666J890K052K111K047K104K550L215L764M376N685
$$ y = [499348, 496747, 493781, 490692, 487966, 485952, 484516, 483102, 481206, 478932, 477023, 476224, 476617, 477602, 478397, 478489, 477792, 476666, 475812, 475982, 477636, 480748, 484830, 489081, 492681, 495053, 495985, 495619, 494456, 493218, 492509, 492462, 492698, 492447, 490726, 486874, 481349, 475797, 471842, 469804, 468950, 468708, 469032, 469637, 469790, 469138, 468172, 467484, 467060, 466616, 466176, 465843, 465427, 464712, 463833, 462941, 461719, 459676, 456760, 453392, 450097, 447407, 445877, 445726, 446513, 447505, 448324, 449016, 449627, 450030, 450130, 450001, 449796, 449636, 449480, 449083, 448265, 447275, 446639, 446581, 446880, 447356, 448039, 448700, 448776, 448141, 447480, 447410, 447554, 446968, 445287, 442970, 440655, 438678, 437039, 435364, 433111, 430201, 427359, 425405, 424379, 423673, 422812, 421663, 420163, 418393, 416766, 415630, 414810, 414013, 413483, 413620, 414100, 414117, 413569, 413302, 413979, 415305, 416650, 417882, 419267, 420933, 422823, 424875, 426986, 429033, 431137, 433687, 436902, 440666, 445042, 450727]
59539D50727P989J0877J3784J6519J9026K0740K0383J6668R561R72o228j0188
59527E70830j1032r919p644m544j237J408L002L885M519N040N386N472N079L942
59513E74187K155K95j043j770k303l135m436n968p308q159q472q342p966p645
59499E10090p668p967p948o963n022k990j928k105k790l071k859k758k972k881
59485D50168j965p42j45k01o8O54J413J684J781K235K931L317L187K793K416K228
59469D71686K294K385J980Q51n04j293j207n03M43J345J939K222K616L545M834
59454D92633N947O771P678Q814R842J0558J1253J2069J2466J1838J0394Q796P050
59441F16109M486R31k727n537p447q822r626r674r266q753p874o389n093n011
$$ y = [450727, 458716, 469593, 483377, 499896, 518922, 539662, 560045, 576713, 586274, 587246, 581018, 570830, 559798, 549879, 542235, 537691, 536454, 537862, 540864, 544749, 549268, 554308, 559694, 565166, 570245, 574187, 576342, 576637, 575594, 573824, 571521, 568386, 563950, 557982, 550674, 542515, 534043, 525701, 517735, 510090, 502422, 494455, 486507, 479544, 474522, 471532, 469604, 467499, 464709, 461638, 458779, 456021, 453049, 450168, 448203, 447461, 447316, 447115, 447047, 447701, 449114, 450798, 452579, 454814, 457745, 461062, 464249, 467042, 469458, 471686, 473980, 476365, 478345, 479196, 478692, 477399, 476192, 475689, 476132, 477477, 479416, 481638, 484254, 487799, 492633, 498580, 505351, 513029, 521843, 531685, 542243, 553496, 565565, 578031, 589869, 600263, 609059, 616109, 620595, 621526, 618799, 613262, 605815, 596993, 587367, 577693, 568427, 559674, 551800, 545411, 540318, 535307]
59427E35307n697n590m260k893k118q91J530L989N132N611P016R514J2143J4942
59413E73735J8848K3711K8096L1000L1984K9646K2204J0382j919j0880j5518j6666
59401G24623j4855j0447m654R75N501Q039P052J526p409j6935k4403k8318k8322
59388F12373k5377k1582j8723j6880j4948j2320r461p141n710n042m677m201l692
59375D62619l482l318k485j040o8j48m19M4P79Q24L52K38N23N09J19l5K22N07
59357D55741Q32J613K684L356L548L991N091O442P686Q989J0433J1648J2422J3094
59343E47570J3977J4899J5585J6070J6515J6873J6955J6535J5353J3302J0645
59332G14279P781M820J715j281l662n208o158o925p836q975r959j0194r677r252
$$ y = [535307, 529610, 524020, 519760, 516867, 514749, 513858, 515388, 519377, 524509, 530120, 537136, 546650, 558793, 573735, 592583, 616294, 644390, 675390, 707374, 737020, 759224, 769606, 767687, 756807, 741289, 724623, 709768, 699321, 694667, 695642, 701143, 709182, 716234, 717760, 710351, 693416, 669013, 640695, 612373, 586996, 565414, 546691, 529811, 514863, 502543, 493082, 485941, 480231, 475189, 470512, 466311, 462619, 459137, 455819, 453334, 452294, 452226, 452078, 451659, 451703, 452482, 453306, 453658, 453896, 454419, 454928, 455047, 455012, 455234, 455741, 456573, 458186, 460870, 464226, 467774, 471765, 476856, 483298, 490984, 499973, 510406, 522054, 534476, 547570, 561547, 576446, 592031, 608101, 624616, 641489, 658444, 674979, 690332, 703634, 714279, 722060, 726880, 728595, 727314, 723652, 718444, 712286, 705361, 697525, 688550, 678591, 668397, 658720, 649468]
59318F49468r568j0109r888q748p360o104m770l316k141j497j176r13n93k4J008
59303E84269K437M051N860P898R940J1909J4402J8076K2444K5841K6513K3414
59291G57054J6354O341m219j2593j7467j9288j9114j7771j5922j4026j1953r382
59279F38014o707m822l839k825j098R59K713M153N546O839P891Q885J0020J1129
59265F76858J1927J2379J2511J2144J1098R393P165M602K013l26k444m480o282
59252G46558p609q623r658j0545j0745j0143r170q146p087o097n337m613l678
59239F45107k910k819k990k478j342o46o81m28O85J725J698J073Q63J038P89k07
59223F38477j750l721n871p397p789p747q311r358r857r400q573p873p221o551
$$ y = [649468, 639900, 629791, 619903, 611155, 603795, 597691, 592921, 589605, 587464, 585967, 584791, 583878, 583285, 583261, 584269, 586706, 590757, 596617, 604515, 614455, 626364, 640766, 658842, 681286, 707127, 733640, 757054, 773408, 779749, 775530, 762937, 745470, 726182, 707068, 689297, 673375, 659349, 647396, 638014, 631307, 626485, 622646, 619821, 618723, 619682, 622395, 626548, 632094, 638933, 646824, 655709, 665729, 676858, 688785, 701164, 713675, 725819, 736917, 746310, 753475, 758077, 760090, 759764, 757320, 752840, 746558, 738949, 730326, 720668, 710123, 699378, 689235, 680065, 671919, 664832, 658735, 653398, 648785, 645107, 642197, 639378, 636388, 633910, 632568, 631922, 631241, 630813, 631498, 633223, 634921, 635994, 636857, 637895, 638684, 638477, 636727, 633006, 627135, 619738, 611949, 604202, 595891, 586533, 576676, 567276, 558703, 550830, 543609, 537058]
59209E37058o046n695n313n080n342n805n719m926m090l634l221k501j715j151
59195D76820n92K10R80J314J328J465J873K379K841L231L494L718M270N341O428
59180E15100O710N976M805L771K935K338K485L790N669O882O906O494O616P271
59166E87748P758P788P766Q060Q543Q999R444R808R754R119Q275P583O795N385
59152G02825L416J599L61o53j905l190l946m259m911o286p618p785o594m961l859
59137F52234l564l829m303m638m621m417m303m135l520k623k096j927j116Q51
59123F07993K901L666L455L915N865Q466J0617J2151J3380J4319J4864J5199J5452
59110G32243J5421J4968J4410J4138J4165J4244J4143J3565J2254J0453Q989Q413
$$ y = [537058, 531012, 525317, 520004, 514924, 509582, 503777, 498058, 493132, 489042, 485408, 482187, 479686, 477971, 476820, 476228, 476438, 477418, 478732, 480060, 481525, 483398, 485777, 488618, 491849, 495343, 499061, 503331, 508672, 515100, 521810, 527786, 532591, 536362, 539297, 541635, 544120, 547910, 553579, 560461, 567367, 573861, 580477, 587748, 595506, 603294, 611060, 619120, 627663, 636662, 646106, 655914, 665668, 674787, 683062, 690645, 697440, 702825, 706241, 707840, 708201, 707548, 705643, 702453, 698507, 694248, 689337, 683051, 675433, 667648, 661054, 656093, 652234, 648670, 644841, 640538, 635900, 631279, 626862, 622559, 618424, 614904, 612281, 610185, 608258, 607142, 607993, 610894, 614560, 618015, 621930, 627795, 636261, 646878, 659029, 672409, 686728, 701592, 716791, 732243, 747664, 762632, 777042, 791180, 805345, 819589, 833732, 847297, 859551, 870004, 878993, 887406]
59098H87406Q293P623N887L517J382n6j067k158l253l665l129k510k918m251n374
59083H85727n743o118p402r420j1323j2686j3753j4796j5733j6290j6287j5840
59071G40336j5278j4788j4154j3111j1871j0919j0343r801r063q098o764n096
59059F11050l784l567m003l812k678j766j989k732l005k930l135l417l170k692
59045E68370k871l625l878l173k324k097k075j363J72J826K901L190K945K695
59031E60693K978L835M682M959M860N149O226P657Q755R422J0141J1209J2385
59018F52951J3308J3946J4357J4282J3331J1481R143O794M733L033J442m59k578
59005G55764l975l684j814N42K449L734M591N208N820O540P033O732N561L928
$$ y = [887406, 895699, 903322, 909209, 912726, 914108, 914052, 912985, 910827, 907574, 903909, 900780, 898270, 895352, 891101, 885727, 879984, 873866, 866464, 857044, 845721, 833035, 819282, 804486, 788753, 772463, 756176, 740336, 725058, 710270, 696116, 683005, 671134, 660215, 649872, 640071, 631008, 622910, 616146, 611050, 607266, 603699, 599696, 595884, 593206, 591440, 589451, 586719, 583714, 580784, 577649, 574232, 571062, 568370, 565499, 561874, 557996, 554823, 552499, 550402, 548327, 546964, 547136, 548962, 551863, 555053, 557998, 560693, 563671, 567506, 572188, 577147, 582007, 587156, 593382, 601039, 609794, 619216, 629357, 640566, 652951, 666259, 680205, 694562, 708844, 722175, 733656, 742799, 749593, 754326, 757359, 758801, 758342, 755764, 751789, 748105, 746291, 746833, 749282, 753016, 757607, 762815, 768635, 775175, 782208, 788940, 794501, 798429]
58991G98429K175N10o12q27p35j572l714o202q036r303j0536j1683j2269j2133
58977G23492j1462j0439r274q176p003n348l329j708q65j89R61K343L438M460
58963F76901N943P689Q935R381R396R283Q990Q473P687O228L624J28l219n554
58949G53885o924p964r103j0274j1243j1928j2303j2152j1206r629q047o747n319
58936F31046l542k299k750m646o339o675o037n368m965m629m227l600k613j636
58922E71720j429k099k907l377l775m128l766k540j467j267j135rJ702K829L283
58907E51635L829M495M618M367M843O424Q114Q948R146R442J0002J0424J0350
58894F46637R801R152Q925R310J0042J0984J2584J5229J8390K1056K2868K4150
$$ y = [798429, 800604, 801114, 800502, 799675, 798940, 797368, 793654, 787452, 779416, 770113, 759577, 747894, 735625, 723492, 712030, 701591, 692317, 684141, 677138, 671790, 668461, 666753, 665888, 665699, 666660, 669003, 672441, 676901, 682844, 690533, 699468, 708849, 718245, 727528, 736518, 744991, 752678, 758906, 762530, 762658, 759439, 753885, 746961, 738997, 729894, 719620, 708377, 696449, 684146, 671994, 660788, 651159, 643112, 636365, 631046, 627504, 625205, 622455, 617809, 611470, 604795, 598758, 593390, 588425, 583796, 579569, 575969, 573356, 571720, 570291, 568192, 565285, 561908, 558133, 554005, 550239, 547699, 546232, 544965, 543830, 543821, 545523, 548352, 551635, 555464, 559959, 564577, 568944, 573787, 580211, 588325, 597273, 606419, 615861, 625863, 636287, 646637, 656438, 665590, 674515, 683825, 693867, 704851, 717435, 732664, 751054, 772110, 794978, 819128]
58882H19128K4951K4867K3816K2226K0183J7135J2830Q031L769J86l462p674j1889
58869I54097j4970j6356j6580j6492j6250j5408j3895j2272j0948r789q766q369
58857G94002q919r984j0964j1808j2714j3560j4123j4487j4771j4832j4585j4197
58845F39058j3567j2276j0460r040q508q139p175o028n459n230m615l781l483
58832E41297l788m097m278m641m944m484l222j938j203r49r95j279j539j441r85
58817E01514k93O70J633J826J082N96J426K721K746J405L50N19J033Q64J96l57
58801E17931q22j430j883j707q74K48J165J384Q05J8l26l25l96k06R45K757M017
58784E21301M286M439N216O147O487O331O226O214N889N115M183L430K852K053
$$ y = [819128, 844079, 868946, 892762, 914988, 935171, 952306, 965136, 973167, 976936, 977122, 973660, 965986, 954097, 939127, 922771, 906191, 889699, 873449, 858041, 844146, 831874, 820926, 811137, 802371, 794002, 785083, 775099, 764135, 752327, 739613, 726053, 711930, 697443, 682672, 667840, 653255, 639058, 625491, 613215, 602755, 593715, 585207, 577068, 569893, 563865, 558406, 553176, 548561, 544780, 541297, 537509, 533412, 529134, 524493, 519549, 515065, 511843, 509905, 508702, 507753, 506758, 505479, 503940, 502499, 501514, 501221, 501891, 503524, 505350, 506432, 507028, 508454, 511175, 513921, 515326, 515676, 516195, 517228, 518092, 518288, 517931, 517109, 515679, 513796, 512089, 511215, 511463, 512628, 514012, 514817, 514835, 514509, 514184, 513788, 513582, 514527, 517284, 521301, 525587, 530026, 535242, 541389, 547876, 554207, 560433, 566647, 572536, 577651, 581834, 585264, 588116, 590169]
58770E90169O18j307l018m062m596m681l980k729k245l382n034n398m326l140
58756E42889k472j707m86P09J604K391K834K430J712K002L461M689M697M125L979
58741E72857M367M998N880O956P896Q649R369R717R267Q727R339J0876J1689J1201
58727F91788J0731J1176J1565J0856R658Q911Q209O840N426N159O088P431Q908
58714H02746J0514J1656J1764J1338J1335J1758J1774J0807Q752N618J839j627
58702I08274m388p280j1020j4815j7375j8807k0315k2304k3936k4427k3775k2250
58690F97582k0153j8088j6642j5651j4420j2735j1101r954r221q656q148p665
58678E45148p166o571n669m325k948k294k483k725k322j479o41L89K080M339O606
$$ y = [590169, 590787, 589480, 586462, 582400, 577804, 573123, 569143, 566414, 564169, 560787, 555753, 550355, 546029, 542889, 540417, 538710, 538224, 538933, 540537, 542928, 545762, 548192, 549904, 551906, 555367, 560056, 564753, 568878, 572857, 577224, 582222, 588102, 595058, 602954, 611603, 620972, 630689, 639956, 648683, 658022, 668898, 680587, 691788, 702519, 713695, 725260, 736116, 745774, 754685, 762894, 769734, 775160, 780319, 786407, 793838, 802746, 813260, 824916, 836680, 848018, 859353, 871111, 882885, 893692, 902444, 908062, 909901, 908274, 903886, 896606, 885586, 870771, 853396, 834589, 814274, 791970, 768034, 743607, 719832, 697582, 677429, 659341, 642699, 627048, 612628, 599893, 588792, 578838, 569617, 560961, 552813, 545148, 537982, 531411, 525742, 521417, 518469, 516175, 513692, 510967, 508645, 507166, 506525, 506914, 508994, 513333, 519939]
58663E19939Q490R827J0502J0595J0323R480P466M380J440k83j046j670k223k308
58649E84912k157k398k949l078k636k396k951l864m225l683k760k172k044j811
58635E45788j013L3O80Q99J185J540J355M00p22j388j578j439r93n28n41q79p00
58618E42099L47J726L153N131P771J0044J1032J1130J1157J1025J0157Q680P183
58605F40635N721L961K017M22n23q32o77o15j410l036m382m572m001l494l078
58590F26136k356j494r06m42L22J303K247L446N324P569R352J0214J0217R608
58576F80540Q839Q458Q479Q214P298O325O032O436P255Q534J0175J1676J2961
58563G91222J4784J7541K0361K2214K3174K3748K3738K2774K1221J9520J7161
$$ y = [519939, 528429, 538256, 548758, 559353, 569676, 579156, 586622, 591002, 592442, 592159, 591113, 589443, 587220, 584912, 582755, 580357, 577408, 574330, 571694, 569298, 566347, 562483, 558258, 554575, 551815, 549643, 547599, 545788, 544775, 544808, 545488, 546387, 547572, 549112, 550467, 550867, 550145, 548757, 547179, 545740, 544747, 544219, 543678, 542799, 542099, 542446, 544172, 547325, 552456, 560227, 570271, 581303, 592433, 603590, 614615, 624772, 633452, 640635, 646356, 650317, 652334, 652756, 652233, 651401, 650724, 650109, 648699, 645663, 641281, 636709, 632708, 629214, 626136, 623780, 622286, 621380, 620938, 621260, 622563, 624810, 628256, 633580, 641149, 650501, 660715, 670932, 680540, 689379, 697837, 706316, 714530, 721828, 728153, 734185, 740621, 747876, 756410, 766585, 778261, 791222, 806006, 823547, 843908, 866122, 889296, 913044, 936782, 959556, 980777, 1000297, 1017458]
58552A017458J3491R081N145J980j008m062o896r364j1373j2461j2494j2417j3310
58539I63770j4938j6214j6807j7290j7927j8336j8246j7721j6704j5109j3274
58528G81204j1682j0394r257q272p279n799l815k110j166m45N28J180R70N50P72
58513G24985J248J173Q34J068J698J874J558J379J361J136J082J948L506M720
58499G49570N016M413K824M64j498k109k128l012m625n358m474k933j885j564
58485G32701j704j883j338M38K833M745N964P103Q351R329R939J0393J0513J0009
58471H07393R095P934N953K801n22k683l744m668n608o003n957o005n946n247
58457G86793m291l674k825q64J529K957L628M873O580P175O260N097M202K578
$$ y = [1017458, 1030949, 1040030, 1045175, 1047155, 1046147, 1042085, 1035189, 1025825, 1014452, 1001991, 989497, 977080, 963770, 948832, 932618, 915811, 898521, 880594, 862258, 844012, 826291, 809587, 794478, 781204, 769522, 759128, 749871, 741599, 734320, 728521, 724706, 722596, 721430, 720985, 721513, 722693, 723663, 724213, 724985, 726233, 727406, 728240, 729308, 731006, 732880, 734438, 735817, 737178, 738314, 739396, 741344, 744850, 749570, 754586, 758999, 761823, 762287, 760789, 758680, 756552, 753540, 748915, 743557, 739083, 736150, 734265, 732701, 730997, 729114, 727776, 728214, 731047, 735792, 741756, 748859, 757210, 766539, 776478, 786871, 797384, 807393, 816488, 824422, 830375, 833176, 832654, 829971, 826227, 821559, 815951, 809948, 803991, 797986, 792040, 786793, 782502, 778828, 776003, 775139, 776668, 779625, 783253, 788126, 794706, 801881, 808141, 813238, 817440, 820018]
58443H20018l1k148k724k644l097l782l738k867j771q47j46N11J582L181M463
58428H05960M598M267M973O849Q564R492J0428J1845J2956J3137J2861J2508J1380
58415I29818Q737M969J119k087m246n095m767l827k806k070j944k339k556k155
58401I10751j668j611j358r5J619K525K505K393K414K219K131K768L603L518K646
58386I34360K143K235K132J701J633J987K195K394L132L812L240J695O97P07Q32
58371I64895Q19J465K799L789M150M753N910O900P462Q194R312J0457J1736J3334
58357A055975J4346J3783J2477J2035J2138J1128R063P643P135O055M248L585
58345A169611M801O219O537O642P654R188J0563J1869J3047J3534J3524J3942
$$ y = [820018, 819987, 817839, 815115, 812471, 809374, 805592, 801854, 798987, 797216, 796369, 796223, 796734, 798316, 801497, 805960, 810558, 814825, 819798, 826647, 835211, 844703, 855131, 866976, 879932, 893069, 905930, 918438, 929818, 938555, 943524, 944643, 942556, 938310, 933215, 928448, 924621, 921815, 919745, 917801, 915462, 912906, 910751, 909083, 907472, 906114, 906019, 907638, 910163, 912668, 915061, 917475, 919694, 921825, 924593, 928196, 931714, 934360, 936503, 938738, 940870, 942571, 944204, 946191, 948386, 950780, 953912, 957724, 960964, 962659, 963356, 964063, 964895, 965714, 967179, 969978, 973767, 977917, 982670, 988580, 995480, 1002942, 1011136, 1020448, 1030905, 1042641, 1055975, 1070321, 1084104, 1096581, 1108616, 1120754, 1131882, 1140945, 1148588, 1155723, 1161778, 1166026, 1169611, 1174412, 1180631, 1187168, 1193810, 1201464, 1210652, 1221215, 1233084, 1246131, 1259665, 1273189, 1287131]
58333A287131J4798J5228J5333J6001J6838J6539J5432J5269J6141J6175J4676
58322A459561J3039J2044J0863R356Q726R146R357R265J0266J2188J2837J1594
58310A588242J0697J1759J3570J4597J5113J5689J6047J6541J8415K1481K3798
58299A765949K4476K4510K4303K3142K1701K1993K3912K4886K3936K2995K3251
58288B025054K3552K3483K4590K7134K9032K9493L0375L2451L3860L3840L4465
58277B347329L6809L8893L9407M0030M2025M3954M4823M6181M8987N1580N2887
58266B832905N4405N7109N9666O1514O4284O8352P1634P3542P6283Q0402Q3191
58255C583287Q3509Q3920Q5825Q7035Q6553Q7186R0688R4844R8113J02559J09308
$$ y = [1287131, 1301929, 1317157, 1332490, 1348491, 1365329, 1381868, 1397300, 1412569, 1428710, 1444885, 1459561, 1472600, 1484644, 1495507, 1504863, 1513589, 1522735, 1532092, 1541357, 1551623, 1563811, 1576648, 1588242, 1598939, 1610698, 1624268, 1638865, 1653978, 1669667, 1685714, 1702255, 1720670, 1742151, 1765949, 1790425, 1814935, 1839238, 1862380, 1884081, 1906074, 1929986, 1954872, 1978808, 2001803, 2025054, 2048606, 2072089, 2096679, 2123813, 2152845, 2182338, 2212713, 2245164, 2279024, 2312864, 2347329, 2384138, 2423031, 2462438, 2502468, 2544493, 2588447, 2633270, 2679451, 2728438, 2780018, 2832905, 2887310, 2944419, 3004085, 3065599, 3129883, 3198235, 3269869, 3343411, 3419694, 3500096, 3583287, 3666796, 3750716, 3836541, 3923576, 4010129, 4097315, 4188003, 4282847, 4380960, 4483519, 4592827]
58244D592827J15822J20759J26738J35211J43415J49615J56413J65623J75023
58235E881446J83459J93767K07198K20569K32517K46616K64606K82782K99196
58226H012156L17818L41166L65699L89332M16405M49995M86435N22939N63352
58217A1865297O10735O61937P15428P76517Q48821R29113J016935J119966J243220
58208A9787969J383151J539900J724454J945972K204566K505849K869502L313769
58200C7275132L846868M486192N270699O242086P432836Q889511J0689364J2917931
58192I7050619J5652261J8974579K2937446K7422258L1986345L5830281L7885169
58185B87738958L6986902L2228134K3509680J1947557l49442j1139456j8943354
$$ y = [4592827, 4708649, 4829408, 4956146, 5091357, 5234772, 5384387, 5540800, 5706423, 5881446, 6064905, 6258672, 6465870, 6686439, 6918956, 7165572, 7430178, 7712960, 8012156, 8329974, 8671140, 9036839, 9426171, 9842576, 10292571, 10779006, 11301945, 11865297, 12476032, 13137969, 13853397, 14629914, 15478735, 16407848, 17424783, 18544749, 19787969, 21171120, 22711020, 24435474, 26381446, 28586012, 31091861, 33961363, 37275132, 41122000, 45608192, 50878891, 57120977, 64553813, 73443324, 84132688, 97050619, 112702880, 131677459, 154614905, 182037163, 214023508, 249853789, 287738958, 324725860, 356953994, 380463674, 392411231, 392061789, 380922333, 361978979]
58178C61978979k3395709k5037524k4893104k4037663k3201096k2553661k1844960
58171A97015262k0780586j9285984j7485601j5556352j3651881j1894174j0353200
58164H8007484r030963p894704o920544o092793n384544m766738m227026l761136
58156C9929036l355551k995060k677669k406127k172334j963671j777487j616611
58148B0964526j476922j350810j236923j136192j043743r54322q70369p96020
58140A2099225p28510o63529o03477n52333n07777m66208m30402m04289l84786
58131G357914l66129l47884l31723l14913k94263k72487k53753k36688k18240
58122D721834k00533j87211j76553j64703j52535j43070j35210j26164j17188
$$ y = [361978979, 338583270, 313545746, 288652642, 264614979, 241413883, 218860222, 197015262, 176234676, 156948692, 139463091, 123906739, 110254858, 98360684, 88007484, 78976521, 71081817, 64161273, 58068480, 52683936, 47917198, 43690172, 39929036, 36573485, 33578425, 30900756, 28494629, 26322295, 24358624, 22581137, 20964526, 19487604, 18136794, 16899871, 15763679, 14719936, 13765614, 12895245, 12099225, 11370715, 10707186, 10103709, 9551376, 9043599, 8577391, 8146989, 7742700, 7357914, 6991785, 6643901, 6312178, 5997265, 5703002, 5430515, 5176762, 4940074, 4721834, 4521301, 4334090, 4157537, 3992834, 3840299, 3697229, 3562019, 3435855, 3318667]
58113C318667j10959j05903r8982r1554q6843q3971q0023p5716p3479p2094o8619
58102B370524o3900o0993n9699n7573n4744n3012n1591m8362m4141m1354l9759
58091A795396l7494l5018l3994l3628l2000k9740k8698k8320k6999k5519k5577
58080A458409k6185k5288k3559k3129k3823k4028k3899k4375k4514k3185k1842
58069A194582k2232k2939k1663j9305j8147j7588j5602j2949j2005j2465j2183
58058A007504j1321j1745j3068j3239j2538j3153j5117j6186j5581j4537j3365
58047H57654j1316r164q671r478r508q393p674p773p639p237p571q271p919o743
58033G40297o370o982p272p095p612q853r540r404r335r348q740q017q343r138
$$ y = [3318667, 3207708, 3101805, 3002823, 2911269, 2824426, 2740455, 2660432, 2584716, 2511237, 2439143, 2370524, 2306624, 2245631, 2185932, 2128359, 2073615, 2020603, 1969012, 1920650, 1876509, 1835155, 1795396, 1757902, 1722884, 1688890, 1655262, 1623262, 1593522, 1564824, 1536504, 1509505, 1483986, 1458409, 1432224, 1406936, 1383377, 1360248, 1336425, 1312397, 1288498, 1264123, 1239609, 1216424, 1194582, 1172350, 1149411, 1127748, 1108443, 1090296, 1072708, 1057106, 1044157, 1032152, 1019687, 1007504, 996183, 984438, 971370, 958131, 945593, 932440, 917323, 901137, 885556, 871019, 857654, 846338, 837174, 828503, 819025, 809517, 801124, 793450, 785677, 778038, 770801, 763230, 754959, 747040, 740297, 733927, 726945, 719673, 712578, 704966, 696113, 686573, 677169, 667834, 658486, 649746, 641729, 633386, 624248]
58019F24248q659o931n730n683n641n010m489m327l876l123k869l256l708m171
58005E56775m838n020m033k765k530k895k491j511j306j936k196j828j580j379
57991E20467m23J026J906K237K988M224N188N784O375O488N522M195L544L058
57977E72579J704M0p29j067k207l655l922l268l249l934m043l581l815m722m906
57962E31225m098l437l249k740j938j737k078k139k270l416m849m862l672l143
57948D87597l581l419k258j527j701j429q2J208J808K578L832M492M162M061M985
57933E00726O167O900P531Q221Q368Q011Q059Q512Q145O515M740L734L187K694
57919E91510K214J159j209m077n646n778o211p719r052r282r147r340r340q769
$$ y = [624248, 615589, 608658, 602928, 597245, 591604, 586594, 582105, 577778, 573902, 570779, 567910, 564654, 560946, 556775, 551937, 546917, 542884, 540119, 537589, 534694, 532203, 530692, 529386, 527450, 525254, 523426, 521846, 520467, 520044, 521070, 522976, 525213, 528201, 532425, 537613, 543397, 549772, 556260, 561782, 565977, 569521, 572579, 574283, 574323, 573594, 572527, 570320, 566665, 562743, 559475, 556226, 552292, 548249, 544668, 540853, 536131, 531225, 527127, 523690, 520441, 517701, 515763, 514026, 511948, 509809, 507539, 504123, 499274, 494412, 490740, 487597, 484016, 480597, 478339, 476812, 475111, 473682, 473600, 474808, 476616, 479194, 483026, 487518, 491680, 495741, 500726, 506893, 513793, 521324, 529545, 537913, 545924, 553983, 562495, 570640, 577155, 581895, 585629, 588816, 591510, 593724, 594883, 593674, 589597, 583951, 578173, 571962, 564243, 555191, 545909, 536762, 527422, 518082, 509313]
57905E09313q165p676o786n972o676q829j0292r770q398p456o423m601k908k528
57891D12833l016l152k622j804q42J21P03J032J746K756L198L033L278M175M676
57876D26115M346M102M263L681J809j2n52m38p45j254j422j710k581l291l011
57861D29300k185j569r19J14Q39N93R8N10J755K964L852M624N184N472N979O924
57845D63535P545P177O371N993N864N196L895K497J222m8j267k286l219m143m876
57830D93456n304n498n294m472l518l299l686l461k048l16P68J311J794K217K519
57815D65169K954L478L671L676M200N128N199L706J369r25l085m909n572m916
57801D79143m168m377n116n543n694n873n771n170m613m445m067k997j832j343
$$ y = [509313, 501148, 493472, 486686, 480714, 474038, 465209, 454917, 445147, 436749, 429293, 422870, 418269, 415361, 412833, 409817, 406665, 404043, 402239, 401397, 401518, 402221, 403253, 404999, 407755, 410953, 413986, 417264, 421439, 426115, 430461, 434563, 438826, 442507, 444316, 444304, 443752, 443314, 442569, 441315, 439893, 438183, 435602, 432311, 429300, 427115, 425546, 424627, 424741, 425580, 426173, 426271, 426781, 428536, 431500, 435352, 439976, 445160, 450632, 456611, 463535, 471080, 478257, 484628, 490621, 496485, 501681, 505576, 508073, 509295, 509247, 507980, 505694, 502475, 498332, 493456, 488152, 482654, 477360, 472888, 469370, 466071, 462385, 458924, 456876, 456560, 457328, 458639, 460433, 462650, 465169, 468123, 471601, 475272, 478948, 483148, 488276, 493475, 497181, 498550, 497625, 494540, 489631, 484059, 479143, 474975, 470598, 465482, 459939, 454245, 448372, 442601, 437431, 432818, 428373, 424306, 421309, 419477, 418134]
57787D18134j433j730k309l031l177k561k017k032j880r60J90J086K275M038N316
57772D09909N229M637M849N692O210O409O817P050O313M901L828L222K308P79
57758D78153q59k072k638k565k290k450k878k601j449o87j169k007k068j704j746
57743D48970j802j120k34k05q29j189j372k005k602k130r02k56m33l55M36J183
57727D35155J382J487J819K026J955J979K218K317K214K228K272J890J252J153
57713D61347J788K332K081J361R44J067J353J358J018O52N86P59Q82J014J483
57698D80025K179K660L046M047N656O772O613N570M123K009o15k383k357j596
57684E15749j688k392k156n03J561L243M703O239P961J0306J3724J7917K2304
$$ y = [418134, 416701, 414971, 412662, 409631, 406454, 403893, 401876, 399844, 397964, 397004, 397194, 398280, 400555, 404593, 409909, 415138, 419775, 424624, 430316, 436526, 442935, 449752, 456802, 463115, 468016, 471844, 475066, 477374, 478153, 477294, 475222, 472584, 470019, 467729, 465279, 462401, 459800, 458351, 457664, 456495, 454488, 452420, 450716, 448970, 447168, 446048, 445814, 445609, 444780, 443591, 442219, 440214, 437612, 435482, 434580, 434324, 433891, 433536, 433972, 435155, 436537, 438024, 439843, 441869, 443824, 445803, 448021, 450338, 452552, 454780, 457052, 458942, 460194, 461347, 463135, 465467, 467548, 468909, 469853, 470920, 472273, 473631, 474649, 475301, 475887, 476646, 477528, 478542, 480025, 482204, 484864, 487910, 491957, 497613, 504385, 510998, 516568, 520691, 522700, 522085, 519702, 517345, 515749, 514061, 511669, 509513, 509010, 510571, 513814, 518517, 524756, 532717, 543023, 556747, 574664, 596968]
57671E96968K7208L3657M2098N2122O3111P3905Q1826Q3064P4577N5680K8548
57660A212764j947k9621m9632o0453o3329o0579n4812m8473m2670l6826l0519
57649G33903k4956k1544j9762j7921j5430j2891j0532q141o163n126m340k759
57637E84338q97j94o30q22l80k43n52k40Q56J410Q52L33O51Q48rj076r44L41J523
57618E85165J697Q42n08j434j144J36J337J954K478L230L685L447K927K543K124
57603F08479J631J568K070K369J832R10M51O58J137J473J397R23M82M51M39j25
57587F26145p99n35O14J374J120O85Q33J186J286J484J965K026J228L54K42N20
57571F39728N33O88J668K902L068J965P75M81R01J289J255R77R16J364K080K555
$$ y = [596968, 624176, 657833, 699931, 752053, 815164, 889069, 970895, 1053959, 1128536, 1184216, 1212764, 1210817, 1181196, 1131564, 1071111, 1007782, 947203, 892391, 843918, 801248, 764422, 733903, 708947, 687403, 667641, 649720, 634290, 621399, 610867, 602726, 596563, 591437, 587097, 584338, 583441, 583247, 582617, 581795, 581415, 581172, 580620, 580380, 581236, 582646, 583498, 583831, 584482, 585330, 585321, 584245, 583301, 583642, 585165, 586862, 587704, 587196, 585762, 584618, 584754, 586091, 588045, 590523, 593753, 597438, 600885, 603812, 606355, 608479, 610110, 611678, 613748, 616117, 617949, 618859, 619310, 619968, 621105, 622578, 623975, 624898, 625380, 625831, 626270, 626145, 625346, 624811, 625425, 626799, 627919, 628604, 629437, 630623, 631909, 633393, 635358, 637384, 638612, 638966, 639208, 639728, 640261, 640949, 642617, 645519, 648587, 650552, 651327, 651808, 652709, 653998, 655253, 656230, 657146, 658510, 660590, 663145]
57555F63145K703K931L386L729L920M508N678O649O616N778M892M264L778L478
57541G25455L505L744M041M475M978N103M692M323M538M961M853M200L686L716
57527G86270M114M568M846M660L914L017K558K618K756K665K546K773L418M119
57513H34842M424M326M372M986N784N977N476N053N300N898O225O198O187O437
57499I11485O825O893O080M364K707K307L204M224M495M280M148M102M103M562
57485I73779N621O520O504N895N543N664N939O351P031P515P092N861M675M000
57471A057990L573L251L433M292N234N571N396N347N655N849N415M524L930M186
57457A123646N084N944O338O427O563O839P059P075O997P078P379P629P519P160
$$ y = [663145, 665848, 668779, 672165, 675894, 679814, 684322, 690000, 696649, 703265, 709043, 713935, 718199, 721977, 725455, 728960, 732704, 736745, 741220, 746198, 751301, 755993, 760316, 764854, 769815, 774668, 778868, 782554, 786270, 790384, 794952, 799798, 804458, 808372, 811389, 813947, 816565, 819321, 821986, 824532, 827305, 830723, 834842, 839266, 843592, 847964, 852950, 858734, 864711, 870187, 875240, 880540, 886438, 892663, 898861, 905048, 911485, 918310, 925203, 931283, 935647, 938354, 940661, 943865, 948089, 952584, 956864, 961012, 965114, 969217, 973779, 979400, 985920, 992424, 998319, 1003862, 1009526, 1015465, 1021816, 1028847, 1036362, 1043454, 1049315, 1053990, 1057990, 1061563, 1064814, 1068247, 1072539, 1077773, 1083344, 1088740, 1094087, 1099742, 1105591, 1111006, 1115530, 1119460, 1123646, 1128730, 1134674, 1141012, 1147439, 1154002, 1160841, 1167900, 1174975, 1181972, 1189050, 1196429, 1204058, 1211577, 1218737]
57443A218737O950O932O733O319O341P163Q084Q219P813P849Q468Q788Q302P581
57429A324279P266P288P351P540P990Q503Q813Q794Q308P398O717P015Q009Q601
57415A433872Q390Q123Q305Q411P951P414P419P805Q242Q906R717R798Q704P554
57401A550611P764R084J0019R949R695J0077J0945J1672J1768J0994R683Q953
57389A671214R672J1196J1999J1726J1633J2644J3956J4178J3183J2032J1464
57378A804897J1242J0865J0255R612R090Q859R160R994J0919J1424J1465J1382
57366A929164J1299J0965J0314R832J0037J0852J1781J2540J3127J3445J3401
57355B056757J3231J3292J3476J3376J2958J2611J2530J2611J2895J3482J3998
$$ y = [1218737, 1225687, 1232619, 1239352, 1245671, 1252012, 1259175, 1267259, 1275478, 1283291, 1291140, 1299608, 1308396, 1316698, 1324279, 1331545, 1338833, 1346184, 1353724, 1361714, 1370217, 1379030, 1387824, 1396132, 1403530, 1410247, 1417262, 1425271, 1433872, 1442262, 1450385, 1458690, 1467101, 1475052, 1482466, 1489885, 1497690, 1505932, 1514838, 1524555, 1534353, 1543057, 1550611, 1558375, 1567459, 1577478, 1587427, 1597122, 1607199, 1618144, 1629816, 1641584, 1652578, 1662261, 1671214, 1680886, 1692082, 1704081, 1715807, 1727440, 1740084, 1754040, 1768218, 1781401, 1793433, 1804897, 1816139, 1827004, 1837259, 1846871, 1855961, 1864820, 1873980, 1883974, 1894893, 1906317, 1917782, 1929164, 1940463, 1951428, 1961742, 1971574, 1981611, 1992463, 2004244, 2016784, 2029911, 2043356, 2056757, 2069988, 2083280, 2096756, 2110132, 2123090, 2135701, 2148231, 2160842, 2173737, 2187219, 2201217]
57344B201217J3834J3121J2693J2931J3350J3576J3840J4159J3909J2894J2016
57333B347540J2155J2926J3350J3301J3417J3916J4301J4173J3688J3213J2990
57322B494970J3036J3105J2861J2415J2383J3080J4024J4626J4926J5205J5305
57311B645936J4894J4158J3622J3478J3533J3646J3723J3600J3338J3366J3864
57300B797158J4329J4276J4023J4187J4693J4958J4806J4547J4248J3697J3087
57289B954009J3034J3703J4437J4477J3775J2923J2485J2530J2642J2366J1650
57278C098031J0811J0069R402Q797Q316P844P234O770O946P653Q153Q167Q275
57265C206468Q949R838J0456J0900J1342J1485J1217J1174J1872J2755J2855J2098
$$ y = [2201217, 2215051, 2228172, 2240865, 2253796, 2267146, 2280722, 2294562, 2308721, 2322630, 2335524, 2347540, 2359695, 2372621, 2385971, 2399272, 2412689, 2426605, 2440906, 2455079, 2468767, 2481980, 2494970, 2508006, 2521111, 2533972, 2546387, 2558770, 2571850, 2585874, 2600500, 2615426, 2630631, 2645936, 2660830, 2674988, 2688610, 2702088, 2715621, 2729267, 2742990, 2756590, 2769928, 2783294, 2797158, 2811487, 2825763, 2839786, 2853973, 2868666, 2883624, 2898430, 2912977, 2927225, 2940922, 2954009, 2967043, 2980746, 2995183, 3009660, 3023435, 3036358, 3048843, 3061373, 3074015, 3086381, 3098031, 3108842, 3118911, 3128313, 3137110, 3145426, 3153270, 3160504, 3167274, 3174220, 3181873, 3190026, 3198193, 3206468, 3215417, 3225255, 3235711, 3246611, 3257953, 3269438, 3280655, 3291829, 3303701, 3316456, 3329311, 3341409]
57253C341409J1180J0589J0426J0788J1498J1846J1371J0682J0645J1079J1088
57242C462601J0406R576Q952Q441Q054P878P625P076O757P214P838P476O235N420
57228C571549N581N786N271M661M880N687O129N893N548N682O416P527Q584R034
57214C658228Q572P530O747O950Q102R305R584Q928Q269Q274Q544Q378P872P581
57200C772864P455O903N843M874M360M073L828L797L919L589K324M20j271k077
57186C820901j897j177n80n18r75j703k419k737k344j568j294j907k711k924k797
57171C793350l137m118n287o429p607q589q960q774q420p952p175o241n579n338
57157C699744n421n785o179o028n260m814n414o378o604o354o777q015r152r935
$$ y = [3341409, 3352589, 3363178, 3373604, 3384392, 3395890, 3407736, 3419107, 3429789, 3440434, 3451513, 3462601, 3473007, 3482583, 3491535, 3499976, 3508030, 3515908, 3523533, 3530609, 3537366, 3544580, 3552418, 3559894, 3566129, 3571549, 3577130, 3582916, 3588187, 3592848, 3597728, 3603415, 3609544, 3615437, 3620985, 3626667, 3633083, 3640610, 3649194, 3658228, 3666800, 3674330, 3681077, 3688027, 3696129, 3705434, 3715018, 3723946, 3732215, 3740489, 3749033, 3757411, 3765283, 3772864, 3780319, 3787222, 3793065, 3797939, 3802299, 3806372, 3810200, 3813997, 3817916, 3821505, 3823829, 3824249, 3822978, 3820901, 3819004, 3817827, 3817247, 3816729, 3815754, 3814051, 3811632, 3808895, 3806551, 3804983, 3803689, 3801782, 3799071, 3796147, 3793350, 3790213, 3786095, 3780808, 3774379, 3766772, 3758183, 3749223, 3740449, 3732029, 3724077, 3716902, 3710661, 3705082, 3699744, 3694323, 3688538, 3682359, 3676331, 3671071, 3666257, 3660843, 3654465, 3647861, 3641507, 3634730, 3626715, 3617563, 3607628]
57143C607628j1138j2988j4607j5407j5872j6496j7038j7263j7469j7808j7957
57132C433585j7922j8257j8993j9240j8395j7004j5907j5174j4444j3725j3268
57121C251256j3048j2834j2448j1733j0555q894o624l298J311O651J2017J7539
57109C209340K3788L0772L8337M7333N9176P4359R2625J14564J41726J75186K15363
57098D222569K63413L21245L89968M69646N60475O62342P72870Q87768J003506
57089I553802J117752J226925J325499J408121J469996J505235J508263J476668
57081B0592261J405839J277333J060589P38626L35606q6138m60099p47698r43278
57072B3173041j059903j116908j135059j132624j120600j102038j076000j041018
$$ y = [3607628, 3596490, 3583502, 3568895, 3553488, 3537616, 3521120, 3504082, 3486819, 3469350, 3451542, 3433585, 3415663, 3397406, 3378413, 3359173, 3340778, 3323774, 3307867, 3292693, 3278249, 3264524, 3251256, 3238208, 3225374, 3212926, 3201193, 3190638, 3181744, 3175120, 3171822, 3173133, 3179784, 3191801, 3209340, 3233128, 3263900, 3302237, 3349570, 3408746, 3483105, 3575730, 3690294, 3832020, 4007206, 4222569, 4485982, 4807227, 5197195, 5666841, 6227316, 6889658, 7662528, 8550296, 9553802, 10671554, 11898479, 13223978, 14632099, 16102095, 17607330, 19115593, 20592261, 21998100, 23275433, 24336022, 25074648, 25410254, 25324116, 24864017, 24116319, 23173041, 22113138, 20996230, 19861171, 18728547, 17607947, 16505909, 15429909, 14388891]
57064A4388891r95848r40010q75137q05130p34474o66731o04258n48210m98442
57055G720651m54044m14308l78973l47685l19840k95082k73524k55230k39654
57046D742311k25669k12191j98905j86365j75216j65387j56328j47968j40862
57037C133420j35178j30144j24935j19647j14784j10143j04838r8423r1295q3841
57027B020192p5551o5276n2224l6683k0085m622P127J2399Q535n949k9627n7409
57015A700827q2395r9414j07133j07087j01391r1931q0901p0665o2371n5357m8429
57004G93753m1446l5227l0398k6911k4419k2510k0701j8798j7197j6345j5964
56993E23837j5321j4173j2894j1677j0260q452o390m117j523J207L550N107N620
$$ y = [14388891, 13393043, 12453033, 11577896, 10772766, 10038292, 9371561, 8767303, 8219093, 7720651, 7266607, 6852299, 6473326, 6125641, 5805801, 5510719, 5237195, 4981965, 4742311, 4516642, 4304451, 4105546, 3919181, 3743965, 3578578, 3422250, 3274282, 3133420, 2998242, 2868098, 2743163, 2623516, 2508732, 2398589, 2293751, 2195328, 2104033, 2020192, 1944641, 1879365, 1827141, 1790458, 1770373, 1765751, 1772878, 1785277, 1793812, 1787863, 1758236, 1700827, 1618432, 1519018, 1411885, 1304798, 1203407, 1111476, 1030575, 959910, 897539, 842182, 793753, 752307, 717080, 686682, 659771, 635352, 612842, 592141, 573343, 556146, 539801, 523837, 508516, 494343, 481449, 469772, 459512, 451060, 444670, 440553, 439030, 440237, 443787, 448894, 454514]
56980D54514M570J587k644o617r404j1195j2285j2407j1463j0090q913p868o747
56967C61038n747m952l842j994K56K426M675P324J0035J2086J3122J3062J1709
56954D19198R010N349J097l658q416j1885j3157j2872j2515j2678j2666j1572
56942C35235r170o037l215j448k93J554M531P522R520J1183J3742J6900J8996
56929C99020J8864J6420J1714M833l083r946j4353j6475j7247j7375j7248j6934
56917C38190j6095j4459j2466j0864r709q474p094o082n624n294m762m054l063
56904B30150j638j90N58N35L38K65J34P3N26J329J763J829K446M049N928P438
56888B55533Q919J0776J2470J3219J2979J2005R928O205J202l769p502r525j0001
$$ y = [454514, 459084, 460671, 458027, 451410, 442006, 430811, 418526, 406119, 394656, 384566, 375653, 367785, 361038, 355291, 350339, 346497, 344503, 344759, 347185, 351860, 359184, 369219, 381305, 394427, 407489, 419198, 428208, 433557, 434654, 430996, 422580, 410695, 397538, 384666, 372151, 359473, 346807, 335235, 326065, 320028, 316813, 315365, 315072, 316626, 321157, 328679, 338199, 349382, 363124, 380024, 399020, 417884, 434304, 446018, 450851, 447768, 437822, 423469, 406994, 389747, 372372, 355124, 338190, 322095, 307636, 295170, 284306, 274597, 266123, 259029, 252947, 247323, 242029, 237267, 233213, 230150, 228512, 228322, 228880, 229415, 229753, 230018, 230152, 230225, 230751, 232080, 233843, 235672, 238118, 242167, 248095, 255533, 264452, 275228, 287698, 300917, 313896, 325901, 335829, 342034, 343236, 339467, 331965, 322440, 312439]
56875C12439r448q420p133n458l353r73J701M876Q418J1870J5221J9063K3592
56862C62395K8105L1945L5336L8462M0149L8241L1448K0435P357n160j4894k0756
56850E93063k3089k3082k1736j9499j6618j3399r923n887r53M721J0576J6422
56838D90596K2962L1134M0867N0823N9487O5779O8178O4176N2027L3064J1253
56827I90346r673k7728m1611m9939n2532n1233m8195m3996l8359l1881k5717j9899
56815E49583j3459o164J088P776J4476K1746K9212L6190M2123M5733M4648L7062
56803H10014K3694P435q788k3286l5105m3300m7168m6828m3266l7947l2354k7394
56791D95707k3079j8998j5123j1754q587m565Q80O860J1969J5844J8981K1158
$$ y = [312439, 302991, 294571, 287438, 281980, 278627, 277654, 279355, 284231, 292649, 304519, 319740, 338803, 362395, 390500, 422445, 457781, 496243, 536392, 574633, 606081, 626516, 633873, 628713, 613819, 593063, 569974, 546892, 525156, 505657, 489039, 475640, 465717, 459830, 458877, 463598, 474174, 490596, 513558, 544692, 585559, 636382, 695869, 761648, 829826, 894002, 946029, 979093, 990346, 980673, 952945, 911334, 861395, 808863, 757630, 709435, 665439, 627080, 595199, 569482, 549583, 536124, 529960, 531048, 538824, 553300, 575046, 604258, 640448, 682571, 728304, 772952, 810014, 833708, 841143, 832355, 809069, 773964, 730664, 683496, 636668, 593402, 555455, 523101, 495707, 472628, 453630, 438507, 426753, 418166, 413601, 414481, 421341, 433310, 449154, 468135, 489293]
56779D89293K1083J7771J1551L360n985j5363k3044k7798k9908l0345k9397k6937
56767C54281k3663k0892j9020j7199j4823j2478j1039j0426r840q787p443o198
56755A92473n231m493l905l562l629l947m010l588l146l113l060k307j169p03
56741A46610j104j357q16k41n94j536j964j579j108j085j224j052n54lL85M54
56725A33232P7n95j062q72j07O34Q04M16l0m7L68Q10Q54M28j65n93q45j168j498
56706A30641j297l33O39O32j70o07l17l38j397k559k482j236P3R29J510J651J003
56689A26342K4l77j70l4k0L93R33O86k01m29L92J094Q83N27P57Q90J74o52m30
56670A30782O10J300J267J002Q01O75Q54J322J290K33r57r67Q9R93J278J530J919
$$ y = [489293, 510376, 528147, 539698, 543058, 537073, 521710, 498666, 470868, 440960, 410615, 381218, 354281, 330618, 309726, 290706, 273507, 258684, 246206, 235167, 224741, 214901, 206114, 198671, 192473, 187242, 182749, 178844, 175282, 171653, 167706, 163696, 160108, 156962, 153849, 150789, 148482, 147313, 146610, 145506, 144149, 143333, 143092, 142498, 140962, 138998, 137419, 136311, 135226, 134002, 132950, 132396, 132393, 132778, 133232, 133309, 132714, 131652, 130780, 130673, 131307, 132111, 132527, 132497, 132450, 132818, 133628, 134482, 134910, 134745, 134152, 133307, 132139, 130641, 129344, 129011, 129650, 130282, 130112, 129505, 129188, 128850, 127453, 124894, 122412, 121176, 121249, 122178, 123688, 125339, 126342, 126366, 125989, 125819, 125785, 125765, 126158, 127091, 127777, 127576, 127147, 127539, 128633, 129516, 130043, 130800, 131690, 131864, 131212, 130782, 131392, 132692, 133959, 134961, 135762, 136437, 137291, 138613, 139903, 140136, 139179, 138212, 138301, 139294, 140572, 142102, 144021]
56653A44021J840J214R21J465K190K318J932J502J131P86O33N89J44q49j628j438
56637A56771o50l45q98j554j470o87J43O40R86J427J893K195K379K593K668K217
56621A68308J268N01O09J492K350K498J960J281R29R14R42Q38O88N23J51m43p81
56604A84028m56Q8k9r25j758j906j705j716j794j455p12q4Q5j69o97j338j827
56587A67630j931j652j130n08M3L84O02Q80J108R79O14N58J008J481J601J645
56571A73312J923K129J853J372J354J914K513K741K819L322M608O488Q346R716
56557B24410J0597J1000J0459Q622O180M364L409K408R42j79k91L9K1j57J4K87
56541B82125J60j40j81k65q87j651j828j581j661k085k238k104k360l286m458
$$ y = [144021, 145861, 147075, 147996, 149461, 151651, 153969, 155901, 157403, 158534, 159320, 159953, 160542, 160686, 159837, 158209, 156771, 156121, 155776, 154878, 153324, 151854, 151167, 151310, 151950, 152936, 154363, 156256, 158451, 160830, 163423, 166091, 168308, 169576, 170077, 170686, 172178, 174528, 177026, 178986, 180267, 181196, 182110, 183052, 183890, 184578, 185101, 185252, 184809, 184028, 183572, 183660, 183631, 182706, 180948, 179042, 177337, 175621, 173827, 172372, 171660, 171576, 171661, 171492, 170795, 169457, 167630, 165699, 164047, 162917, 162409, 162452, 162836, 163438, 164318, 165426, 166405, 167019, 167577, 168585, 170066, 171667, 173312, 175235, 177364, 179217, 180589, 181943, 183857, 186370, 189111, 191930, 195252, 199860, 206348, 214694, 224410, 235007, 246007, 256466, 265088, 271268, 275632, 279041, 281449, 282391, 282212, 281921, 281960, 281981, 281824, 281838, 282125, 282285, 282145, 281964, 281699, 280812, 279161, 277333, 275752, 274091, 272006, 269768, 267664, 265304, 262018, 257560]
56526B57560n498o261o363n479m134l347l374l589l545l402l316l270l498m201
56512A98283m838m564l508k639k307j872j031m60o66j041p69K6N76N00J5m71o31
56495A74603l59Q1L54N83J151J926K220J750J012M66q4q84j523j407n70M00J058
56478A80777J322J230Q29L56J49L61P53Q78N00q0l23l6M91J008J553K001J902
56461A93671J211P00J001J687J935J758J755J947J835J495J548J910J652M46p26
56446B13825p48L37J579K123J660M67n80n96L74J344J524J099O46L19m9n03r33
56429B21888j219j221r18o63q68j358j481j025n10l83l88j10K85K70k87q71q19
56412B10322k5Q28Q87J15n80m71J58O16Q11R97J043P08L55M53O33K04n40o09R5
$$ y = [257560, 252062, 245801, 239438, 233959, 229825, 226478, 223104, 219515, 215970, 212568, 209252, 205982, 202484, 198283, 193445, 188881, 185373, 182734, 180427, 178555, 177524, 177064, 176398, 175357, 174588, 174614, 175190, 175690, 175705, 175234, 174603, 174244, 174325, 174679, 175262, 176413, 178339, 180559, 182309, 183321, 183787, 183703, 182819, 181296, 179889, 179319, 179719, 180777, 182099, 183329, 184158, 184514, 184663, 185024, 185777, 186655, 187155, 187075, 186752, 186716, 187207, 188215, 189768, 191769, 193671, 194882, 195582, 196583, 198270, 200205, 201963, 203718, 205665, 207500, 208995, 210543, 212453, 214105, 214551, 213825, 213077, 213414, 214993, 217116, 218776, 219243, 218663, 218067, 218441, 219785, 221309, 222408, 223054, 223373, 223324, 222821, 221888, 220669, 219448, 218530, 217867, 216999, 215641, 214160, 213135, 212625, 212242, 211854, 211744, 212029, 212299, 212012, 211141, 210322, 210297, 211125, 212012, 212127, 211547, 211076, 211234, 211850, 212661, 213658, 214701, 215409, 215764, 216217, 216850, 217054, 216514, 215905, 216000]
56393B16000O68P87J122J848K015J044k07o16k11K77N68Q17J065J350J915K743
56377B31185L378L610L846M296M465L936L109K617K481K313J911J189J05r87j490
56362B65964j462j666k299k540j893j096q60o27L52J434J420N29J68P47J118M17
56346B59706o63r81n00r4k53o08n65L3R38J813K414K532K098J480J401K237L453
56329B74441M201M343M427M666M599L965L211K827K653K255J564Q20K05j51j28
56314C13898J42L34L41K66j7p16j501j698j335j166j357j040L52K139L343L786
56298C15771L569K354J55j813k205j235l10j83l54k09K01O29J108J689K198K451
56282C23816K447K197J708J145P84P58R60J133J014N84K48N09J363K292K891L171
$$ y = [216000, 216668, 217455, 218577, 220425, 222440, 223484, 223277, 222661, 222450, 222727, 223295, 224112, 225177, 226527, 228442, 231185, 234563, 238173, 242019, 246315, 250780, 254716, 257825, 260442, 262923, 265236, 267147, 268336, 268441, 267454, 265964, 264502, 262836, 260537, 257997, 256104, 255008, 254148, 253521, 253873, 255307, 256727, 257256, 257424, 258171, 259289, 259706, 259043, 258062, 257562, 257468, 257215, 256607, 256042, 256075, 257013, 258826, 261240, 263772, 265870, 267350, 268751, 270988, 274441, 278642, 282985, 287412, 292078, 296677, 300642, 303853, 306680, 309333, 311588, 313152, 313972, 314177, 314026, 313898, 314040, 314374, 314715, 314981, 314964, 314248, 312747, 311049, 309714, 308548, 307191, 306151, 306503, 308642, 311985, 315771, 319340, 321694, 321849, 320036, 317831, 316596, 316286, 316103, 315749, 315540, 315741, 316370, 317478, 319167, 321365, 323816, 326263, 328460, 330168, 331313, 332097, 332855, 333815, 334948, 335962, 336546, 336794, 337303, 338666, 340958, 343849, 347020]
56266C47020L191K898K456K236K266K206J984J952K246K572K860L427M251M783
56252C86348M834M934N437N985O247O482O886P134P172P673R005J0383J0770J0192
56238D89482R475R167R226R363R198Q499P612P091O660N394L243J384M85k70j591
56223E74418k777k991k879l504m519m750m141l730l985m405m573m492m048l210
56209E20414k577k766l396l578l164k635k112j425q78q58r34l58O80J252J110
56194D98775Q91J053J421J788K107K218K059K065K583L175L238K997L034L200
56180E30604K938K388K207K467K679K720K865L064L120L314L939M466M143L238
56166E74152K688K705K756K794L420M838O519P916Q749Q816Q292Q003Q517R319
$$ y = [347020, 350211, 353109, 355565, 357801, 360067, 362273, 364257, 366209, 368455, 371027, 373887, 377314, 381565, 386348, 391182, 396116, 401553, 407538, 413785, 420267, 427153, 434287, 441459, 449132, 458137, 468520, 479290, 489482, 498957, 508124, 517350, 526713, 535911, 544410, 552022, 559113, 565773, 571167, 574410, 575794, 576279, 576009, 574418, 571641, 568650, 565771, 562267, 557748, 552998, 548857, 545127, 541142, 536737, 532164, 527672, 523624, 520414, 517837, 515071, 511675, 508097, 504933, 502298, 500186, 498761, 497883, 497025, 496091, 495733, 496413, 497665, 498775, 499666, 500719, 502140, 503928, 506035, 508253, 510312, 512377, 514960, 518135, 521373, 524370, 527404, 530604, 533542, 535930, 538137, 540604, 543283, 546003, 548868, 551932, 555052, 558366, 562305, 566771, 570914, 574152, 576840, 579545, 582301, 585095, 588515, 593353, 599872, 607788, 616537, 625353, 633645, 641648, 650165, 659484]
56152F59484R706J0047J1083J2497J3392J3859J4761J6263J7848J9634K2285K5676
56140H46535K8973L2011L5372L9196M3306M8509N6267O6839P8950R1413J03624
56129A470995J14096J20064J19413J12372J00981Q7722P4926O4495N7468N3816
56119B376348N2375N0595M5301L5056K1701Q682j782r104j3054j4272j5691k1280
56107B514875l2651m8120o5059q1493r5281j03878j06135j03246r7207q9095p9380
56096A613330o8840n8533m9343m1801l5709l0103k4346j9071j5224j2525r991
56085A247844p532n737m400k695o13J249K990N012O660P001O786P719R875J1670
56071A285829J2432J3010J3724J3819J3277J3206J3915J4467J4614J5332J6876
$$ y = [659484, 669190, 679237, 690320, 702817, 716209, 730068, 744829, 761092, 778940, 798574, 820859, 846535, 875508, 907519, 942891, 982087, 1025393, 1073902, 1130169, 1197008, 1275958, 1367371, 1470995, 1585091, 1705155, 1824568, 1936940, 2037921, 2125643, 2200569, 2265064, 2322532, 2376348, 2428723, 2479318, 2524619, 2559675, 2581376, 2590058, 2588276, 2579172, 2566118, 2551846, 2536155, 2514875, 2482224, 2434104, 2369045, 2287552, 2192271, 2088393, 1982258, 1879012, 1781805, 1692710, 1613330, 1544490, 1485957, 1436614, 1394813, 1359104, 1329001, 1304655, 1285584, 1270360, 1257835, 1247844, 1240312, 1234575, 1230175, 1227480, 1226867, 1228116, 1231106, 1236118, 1242778, 1249779, 1256565, 1264284, 1274159, 1285829, 1298261, 1311271, 1324995, 1338814, 1352091, 1365297, 1379212, 1393679, 1408293, 1423625, 1440501]
56060A440501J8152J8592J8984J9873K0755K1374K2176K2979K2788K1515K0345
56049A668034K0040K0227K0608K1266K1761K1609K1643K3056K5187K6352K6728
56038A916511K8074L0563L2558L3649L5203L7471L8979L9401M0302M2249M3862
56027B318822M4542M5492M7264M8913N0313N2532N5198N6546N6916N8999O3524
56016B899061O7940P0565P2813P5958P9043Q1645Q5364R0687R5568R8947J02624
56005C820215J07822J13058J17307J22120J28548J35092J40711J46848J54616
55996D986337J63053J71901J82695J95374K07416K18168K30200K44496K58591
55987F858231K71533K86214L04400L24114L44548L68650L97941M29763M62748
$$ y = [1440501, 1458653, 1477245, 1496229, 1516102, 1536857, 1558231, 1580407, 1603386, 1626174, 1647689, 1668034, 1688074, 1708301, 1728909, 1750175, 1771936, 1793545, 1815188, 1838244, 1863431, 1889783, 1916511, 1944585, 1975148, 2007706, 2041355, 2076558, 2114029, 2153008, 2192409, 2232711, 2274960, 2318822, 2363364, 2408856, 2456120, 2505033, 2555346, 2607878, 2663076, 2719622, 2776538, 2835537, 2899061, 2967001, 3037566, 3110379, 3186337, 3265380, 3347025, 3432389, 3523076, 3618644, 3717591, 3820215, 3928037, 4041095, 4158402, 4280522, 4409070, 4544162, 4684873, 4831721, 4986337, 5149390, 5321291, 5503986, 5699360, 5906776, 6124944, 6355144, 6599640, 6858231, 7129764, 7415978, 7720378, 8044492, 8389040, 8757690, 9155631, 9585394, 10048142]
55978A0048142M99721N42090N87030O33957O87779P51774Q23458R01910R92547
55969A6468408J099737J221857J359266J520091J712190J937361K200412K516289
55961C0035611K901537L368275L935273M635752N505668O575644P885690R497082
55953G4340532J1480450J3908173J6864915K0417480K4496383K8754291L2508442
55946B22770666L4788867L4479620L0621686K2906801J2109406K8244j1183881
55939C46521409j9877677k5374602k7868637k8037676k6687221k4528923k2068726
55932A72077947j9594857j7246761j5093388j3166056j1465397r978061q693187
55925G6840240p598387o670600n882502n212513m641548m147742l713010l329591
$$ y = [10048142, 10547863, 11089953, 11676983, 12310940, 12998719, 13750493, 14573951, 15475861, 16468408, 17568145, 18790002, 20149268, 21669359, 23381549, 25318910, 27519322, 30035611, 32937148, 36305423, 40240696, 44876448, 50382116, 56957760, 64843450, 74340532, 85820982, 99729155, 116594070, 137011550, 161507933, 190262224, 222770666, 257559533, 292039153, 322660839, 345567640, 357677046, 357705290, 346521409, 326643732, 301269130, 273400493, 245362817, 218675596, 194146673, 172077947, 152483090, 135236329, 120142941, 106976885, 95511488, 85533427, 76840240, 69241853, 62571253, 56688751, 51476238, 46834690, 42686948, 38973938, 35644347]
55917C5644347k993297k695415k427032k185650j971145j779488j606018j450442
55909A8535860j313282j191235j080764r82483q97344q22229p53647o92194o38944
55900A0163738n90957n44798n01490m63614m30160l98408l68356l41308l16218
55891F208429k91241k67033k45018k24110k02297j79714j57290j34030j08486
55882D399210q1200n3188k3965O010L2457M9531N3825M4461K1559j2618n2581
55871D383501r2325j28247j57986j78668j88880j90740j87535j80538j70028j57652
55861B750902j45330j33192j20826j09250r9573r1036q2487p4473o7971o2360
55851A764404n6737n1864m8820m6952m5102m3593m2973m2175m0021l7276l5258
$$ y = [35644347, 32651050, 29955635, 27528603, 25342953, 23371808, 21592320, 19986302, 18535860, 17222578, 16031343, 14950579, 13968096, 13070752, 12248523, 11494876, 10802682, 10163738, 9572781, 9027983, 8526493, 8062879, 7632719, 7234311, 6865955, 6524647, 6208429, 5917188, 5650155, 5405137, 5181027, 4978730, 4799016, 4641726, 4507696, 4399210, 4318010, 4264822, 4240857, 4246867, 4279324, 4328855, 4382680, 4427141, 4448700, 4436082, 4383501, 4291176, 4162929, 4004943, 3826275, 3637395, 3446655, 3259120, 3078582, 2908554, 2750902, 2605572, 2472380, 2351554, 2242304, 2142731, 2051695, 1969208, 1894735, 1826764, 1764404, 1707667, 1655803, 1606983, 1560031, 1514929, 1471336, 1428363, 1386188, 1346167, 1308891, 1273633]
55840A273633l3550l1163k8673k7141k6061k4472k2968k2562k2596k1891k0800
55829I91756k0104j9042j6759j4540j4135j4809j4591j3637j3726j4942j5530
55818H19941j4904j4246j4125j3806j3090j2616j2167j0635q120o235n928o344
55806F87725o260n339l935k622k014k022j530K26K423L829M517N203N637N230
55792F91068M514M300M002K630R36M90R72M47j737m360o797r938j4190j8333k1054
55777F32950k2204k2108k0937j9209j7635j6118j4010j1556r774q763p516n769
55765D57351m558m470m673m312l690l384l224k924k822l332m235n105n868o551
55751C98203p013p273p597p960q010p637p130o650o088n491n038m548l647k455
$$ y = [1273633, 1240083, 1208920, 1180247, 1153106, 1127045, 1102573, 1079605, 1057043, 1034447, 1012556, 991756, 971652, 952610, 935851, 921311, 907176, 892367, 877776, 864139, 850413, 835471, 819941, 805037, 790791, 776666, 762860, 749770, 737154, 724987, 714352, 706232, 699997, 694069, 687725, 681465, 676126, 672191, 669569, 667555, 665533, 664003, 664229, 666652, 670481, 674998, 680201, 685838, 691068, 695582, 699882, 703884, 706514, 707450, 707940, 708912, 709359, 707622, 703262, 696465, 686527, 672337, 654004, 632950, 610746, 588638, 567701, 548492, 530857, 514739, 500729, 489173, 479399, 470636, 463120, 457351, 452793, 448323, 443650, 439338, 435648, 432264, 429040, 426116, 423294, 419962, 415727, 410622, 404754, 398203, 391190, 383917, 376320, 368360, 360350, 352713, 345583, 338933, 332845, 327354, 322316, 317768, 314121, 311666]
55737C11666j532j185j356k011k961l481k928j729r10p83r70j523k935m861o002
55722B76499n681m688m140m125l952l231k290j773j991k504k410j314K19J450
55708B40069K293K904K989K316J506J312J384O89r44k645l747m256m253l818l599
55693B32200m321n599o159n486m372l632l177k639k049j512q93j90L10M98O06
55678A93585P78R52J122J182O01r86k894l836l370k250j335q76r02j486k362k934
55662A74989k870k299j434n14J56O63J662L341M604M319L096K599L218L806L750
55647A99086L777M331M584L809K592J857J543J010K1j324k965m566n450n433n218
55632A97654n401n665n460m954m663m565m220l460k539j723j143q49q04r58j293
$$ y = [311666, 310134, 308949, 307593, 305582, 302621, 299140, 296212, 294483, 293573, 292790, 291820, 290297, 287362, 282501, 276499, 270818, 266130, 261990, 257865, 253913, 250682, 248392, 246619, 244628, 242124, 239714, 238400, 238619, 240069, 242362, 245266, 248255, 250571, 252077, 253389, 254773, 255462, 254518, 251873, 248126, 243870, 239617, 235799, 232200, 227879, 222280, 216121, 210635, 206263, 202631, 199454, 196815, 194766, 193254, 192361, 192171, 192481, 192979, 193585, 194363, 195315, 196437, 197619, 198220, 197234, 194340, 190504, 187134, 184884, 183549, 182673, 181771, 180285, 177923, 174989, 172119, 169820, 168386, 167872, 168028, 168691, 170353, 173694, 178298, 182617, 185713, 188312, 191530, 195336, 199086, 202863, 207194, 211778, 215587, 218179, 220036, 221579, 222589, 222610, 221286, 218321, 213755, 208305, 202872, 197654, 192253, 186588, 181128, 176174, 171511, 166946, 162726, 159266, 156727, 155004, 153861, 153012, 152208, 151250, 149957]
55617A49957j625j523q74k88l96r22j114r43j027j505j918k168k586k974k695
55602A27399j907j601k078k429j925r53j74K37J94m36j114q84J25N96k6o97n53
55585A13774k21m39o35j19M79L16K4P37K110K817K751L056M154N197N648O077
55569A45726O981P870P963P053N381L273J148o21k083l511m854n796o327o730
55555A55473o997o814o163n397m714l978l169k519k090j645j064n62l96o37j203
55540A08125j894k309k062j178j95K23k49j294k097k028j289p17q05j277j678
55525H9276j918k052j970j701j577j686j586r29j5P15J262J767K034J967J961
55510H5548K295K491J984J070M36Q1n14j336j819j812j679j447p47K60P25K29
$$ y = [149957, 148332, 146809, 145935, 145647, 145251, 144329, 143215, 142272, 141245, 139740, 137822, 135654, 133068, 130094, 127399, 125492, 123891, 121813, 119384, 117459, 116506, 116332, 116569, 116763, 116327, 115213, 114329, 114454, 115050, 115024, 114327, 113774, 113553, 113114, 112479, 112360, 112839, 113155, 113179, 113916, 116026, 118843, 121594, 124650, 128804, 134001, 139649, 145726, 152707, 160577, 168540, 175593, 180974, 184247, 185395, 184774, 182691, 179180, 174326, 168530, 162203, 155473, 148476, 141662, 135499, 130102, 125388, 121410, 118241, 115722, 113632, 111987, 110923, 110361, 109965, 109328, 108125, 106231, 103922, 101860, 100682, 100487, 100710, 100461, 99167, 97070, 95042, 93753, 93036, 92231, 90954, 89276, 87358, 85306, 83336, 81635, 80058, 78372, 76786, 75857, 75842, 76557, 77819, 79586, 81620, 83587, 85548, 87843, 90334, 92318, 93388, 93824, 93905, 93391, 92055, 90236, 88424, 86745, 85298, 84551, 84811, 85536, 85765]
55494H5765o22r82o66N9R19J488J199P5r46r58j51N40O85O83R03J093Q47L17j3
55475I0235o1j97n06n09Q9P19N31m92j504j886j804j570j078k58M78O91N36M64
55457H3878O16R01J343J864J939J163k4p10o90o28r23j030k58J056J692Q98o68
55440I0419j530r31L79J008M67m32o65j57L52K39m06j013j039m48K42M11l8o67
55422H6191j059j098p14J80J324K117K224J811J097J89m78k46P28J225L67j077
55406I2781j579p03N72J203R71J95p34j420j610j445j235j028o96k94PK46M73
55389H5704M95K44J16M25P62N62N8n6K34K70j19m16n39j133k314k981k114k48
55371G8950J185J643J832K299K476J525l40j914k377k141k136k544k649j892o55
$$ y = [85765, 85143, 84161, 83495, 83554, 84473, 85961, 87160, 87235, 86289, 85331, 85180, 85720, 86405, 87088, 87991, 89084, 89931, 90248, 90235, 90174, 89977, 89471, 88962, 89051, 89770, 90301, 89809, 88305, 86419, 84615, 83045, 81967, 81709, 82187, 82878, 83414, 83878, 84494, 85395, 86738, 88602, 90541, 91704, 91680, 90970, 90280, 89652, 88729, 87699, 87441, 88497, 90189, 91087, 90419, 88889, 87958, 88337, 89345, 89812, 89380, 88715, 88558, 88910, 89149, 88743, 87730, 86691, 86243, 86485, 86896, 86858, 86191, 85132, 84034, 83320, 83500, 84824, 86941, 89165, 90976, 92073, 92262, 91784, 91538, 92266, 93491, 93858, 92781, 91202, 90499, 91071, 92274, 93245, 93440, 92706, 91286, 89676, 88231, 86996, 85968, 85272, 84978, 84985, 85231, 85704, 86199, 86443, 86559, 86984, 87746, 88308, 88366, 88310, 88544, 88814, 88695, 88279, 87740, 86607, 84293, 81312, 79198, 78950, 80135, 81778, 83610, 85909, 88385, 89910, 89570, 87656, 85279, 83138, 81002, 78458, 75809, 73917, 73262]
55356G3262K22L36k8k66J40J223K296K377J309Q2k50K10N72L88m4l67n13l62K20
55337H0807Q90R19O1j049j526j095k34L02R5n59r32o84k74k53m59l73n9q2n36
55318G4959q13n06M7L83N54Q78J351J636J438P44j98r64j206q58q7Q25J446J308
55300H0937M12n64r27p11l67L5O76J287J282O58R7K8J95L18N22Q43R11N85L07
55281H6524M34N66J00q39j511j459r16l38L5J76Q5k17n83p11l21N21J331J595
55263H4472J251O42J30j13n2K13M04K99k2k75k45J07O17Q42L35o76j270q74jN41
55243H6325P36J008J181P33o5l38L9K20j97n00p4N93O59P6o29j204j693j984j893
55224H2993j458q13K1Q45J203R46N96O99J094J150N79l54j176j477j027l0Q83
$$ y = [73262, 73484, 73820, 73792, 73526, 73666, 74889, 77185, 79562, 80871, 80953, 80703, 80913, 81485, 81873, 81829, 81462, 80949, 80587, 80807, 81697, 82616, 82677, 81628, 80102, 79007, 78773, 79075, 79170, 78611, 77679, 76995, 76721, 76468, 76009, 75636, 75577, 75495, 74959, 74146, 73640, 73687, 74070, 74624, 75502, 76853, 78489, 79927, 80671, 80473, 79509, 78303, 77445, 77358, 78183, 79629, 80937, 81349, 80785, 79858, 79147, 78780, 78815, 79491, 80778, 82060, 82718, 82815, 82843, 83038, 83356, 83878, 84721, 85632, 86217, 86524, 86958, 87524, 87624, 86785, 85274, 83815, 82899, 82561, 82596, 82772, 82857, 82640, 82057, 81346, 81025, 81546, 82877, 84472, 85723, 86365, 86495, 86382, 86330, 86543, 86947, 87246, 87224, 86949, 86704, 86811, 87428, 88270, 88605, 87929, 86659, 85785, 85784, 86325, 87061, 88069, 89250, 89983, 89918, 89580, 89619, 89839, 89642, 89142, 89068, 89661, 90320, 90396, 89767, 88563, 86870, 84886, 82993, 81535, 80722, 80743, 81588, 82791, 83737, 84333, 85032, 86126, 87276, 87855, 87501, 86325, 84848, 83821, 83791, 84674]
55207H4674J192R44N67M17N87R58J260J266J039P93M87p0p46j087r24n95m82o96
55189H9584j192j751j845j128j17K89L7n2L38M95n0o67n76R1P92J415J903J767
55171H9333Q20j30k10L01N32L36J72M6l86q76q47m40l74o89o44k0M69L57J44M33
55151H8327J065J524J636J441R21K36j70j50j63o85j529k109k098j589q42j10
55135H5705L84N58L88j78j007j472r59K20R52O94J70K66P21O50K4k70J29M39k5
55116H7389p31o67K01R67J073Q55P05M91N9k69k18j15l18m81n4O88R09M79J96
55097I1159N73J119J144O92L20L59P65J250J320O20m41r12m74J01M6l87n16k96
55079I6442k22n31j084j681j919j222L41J645J711J005O85Q98Q02J71j88K06P25
$$ y = [84674, 85866, 86810, 87377, 87794, 88381, 89339, 90599, 91865, 92904, 93697, 94184, 94114, 93368, 92281, 91357, 90762, 90280, 89584, 88392, 86641, 84796, 83668, 83551, 83840, 83877, 83825, 84163, 84658, 84608, 83941, 83365, 83456, 84248, 85663, 87566, 89333, 90153, 90023, 89813, 90114, 90646, 90982, 91154, 91200, 90814, 89938, 89091, 88651, 88277, 87588, 86944, 86924, 87393, 87750, 87894, 88327, 89392, 90916, 92552, 93993, 94914, 95150, 94980, 94830, 94667, 93982, 92453, 90344, 88246, 86657, 85815, 85705, 86089, 86647, 87035, 86857, 85850, 84378, 83419, 83639, 84591, 85285, 85455, 85721, 86442, 87092, 87116, 86846, 86975, 87414, 87389, 86658, 85991, 86192, 87159, 88232, 89087, 89792, 90283, 90342, 90073, 89855, 89740, 89422, 88941, 88887, 89575, 90484, 90963, 91159, 91732, 92851, 93995, 94687, 95007, 95366, 96131, 97381, 98701, 99321, 98880, 97968, 97494, 97595, 97641, 97254, 96738, 96442, 96220, 95689, 94605, 92924, 91005, 89783, 90124, 91769, 93480, 94485, 95170, 96068, 96870, 97041, 96853, 97059, 97784]
55062I7784O22j0o76j226j673j851j676j396j175p89o6P57J369J672J527P00n39
55045I3354j250p67M01J168J115O86L04j30p26j080o25N54J563J505M88l74j63
55028I6023P51J118L52p29r23p7Q07Q05N7n94o44m04m31p35p95l19L36O13M13
55009I5624P0j01n8R8J49j00n66p82l92M05J131J568J763J733J552J436J423J170
54991A06123N92K96P41J271R26m6n17l67p69k144l113k279j70J536K020J646Q61
54974A06607k8l80K65J225J287M17j54K54Q42O74L3k35l8J04O2J74M35M35J37
54955A12116K6L01M81J39l41k88K56N53K12k83k87R4K30j41n72n76j94K22N01
54936A12449O72O75M74L17N64J133J481J281Q34N87N40M78N65J263K578L941M953
$$ y = [97784, 98406, 98396, 97720, 96494, 94821, 92970, 91294, 89898, 88723, 87934, 87868, 88625, 89994, 91666, 93193, 93893, 93354, 92104, 91337, 91738, 92906, 94021, 94707, 95011, 94881, 94155, 93075, 92450, 93004, 94567, 96072, 96560, 96186, 96023, 96774, 97892, 98244, 97515, 96592, 96515, 97322, 98127, 98184, 97590, 96946, 96542, 96111, 95376, 94581, 94262, 94598, 95211, 95624, 95694, 95593, 95535, 95633, 95782, 95682, 95116, 94334, 93942, 94347, 95478, 97046, 98809, 100542, 102094, 103530, 104953, 106123, 106715, 107011, 107752, 109023, 109949, 109903, 109386, 109019, 108250, 106106, 102993, 100714, 100544, 102080, 104100, 105746, 106607, 106579, 106199, 106464, 107689, 108976, 109393, 109239, 109493, 110335, 111009, 111042, 110807, 110769, 110873, 110935, 111109, 111544, 111979, 112116, 112142, 112443, 112924, 113063, 112722, 112434, 112690, 113243, 113455, 113172, 112885, 112979, 113209, 113068, 112496, 111920, 111726, 111948, 112449, 113121, 113796, 114270, 114587, 115151, 116284, 117765, 119046, 119880, 120467, 121007, 121485, 122050, 123313, 125891, 129832, 134785]
54919A34785N811O652O998O384N305M851N322N845N499M329K886J334n90k886
54905A92525n105o749p558p470o597n274l927k897k417k567l107l531l514l131
54891A28681k536j708p21J18O99J365K259K730J997L49r57r98N7J536K979M138
54875A39988M807N001N112N543O345P206P655P274N968M076K029m5k095l746m578
54860A90540m830n285o312p373p634o724m936l055k034k290l163l600l432l363
54846A26509l600l290j906l86q4r95j815j645q90m03m33o15n70k71mq0m74p69
54828A08279o20j63J96K63O7l66r30j284j147p08l18R4Q40J696J894J154K14k9
54810A09132L45N31J55l26l64%M59R02J312J454J143O54M00K91p7n74n38J52O98
$$ y = [134785, 140596, 147248, 154246, 160630, 165935, 170786, 176108, 181953, 187452, 191781, 194667, 196001, 195411, 192525, 187420, 180671, 173113, 165643, 159046, 153772, 149845, 146948, 144531, 141964, 138857, 135326, 131812, 128681, 126145, 124437, 123716, 123834, 124533, 125898, 128157, 130887, 132884, 133233, 132276, 131278, 131335, 132871, 135850, 139988, 144795, 149796, 154908, 160451, 166796, 174002, 181657, 188931, 194899, 198975, 201004, 200959, 198864, 195118, 190540, 185710, 180425, 174113, 166740, 159106, 152382, 147446, 144391, 142357, 140067, 136904, 133304, 129872, 126509, 122909, 119619, 117713, 117327, 117243, 116248, 114433, 112788, 111898, 111495, 111062, 110447, 109877, 109606, 109602, 109522, 109048, 108279, 107659, 107496, 107692, 107955, 108022, 107656, 106726, 105442, 104295, 103587, 103269, 103363, 104203, 105899, 107793, 108947, 109161, 109132, 109477, 110008, 110163, 109837, 109473, 109473, 109932, 110834, 112146, 113600, 114743, 115397, 115797, 116088, 116011, 115437, 114899, 115051, 115749]
54791A15749N38K65O36J163O47j013k494k686j774n45N32J152R58J25l99R6J242
54774A14192K241K869L276L266K618J825J760K551L515M177M744N492O301O997
54760A65824P650Q217Q293P491N875L817J623o11k894n184p153q203p968o776
54746A70001n390m260l309k464j957j935k084j936j386p32k97k03l61n64o04m67
54730A42052l46m52p47r71q45l22M07J110J811K761M077N475O503O986P096O990
54714A81585O572N641M124K093k38k519m366n616o360o687o482n654m470l471
54700A54152k963k730k380j883j585j694k007k195k203k122j910j482j029q97
54686A27072j127j332j171o92k13l2k51o52p10r8Q45J357J160P06M19J53l72r40
$$ y = [115749, 116287, 116552, 117188, 118351, 118998, 117985, 115491, 112805, 111031, 110486, 111018, 112170, 113128, 113253, 112854, 112950, 114192, 116433, 119302, 122578, 125844, 128462, 130287, 132047, 134598, 138113, 142290, 147034, 152526, 158827, 165824, 173474, 181691, 189984, 197475, 203350, 207167, 208790, 208179, 205285, 200101, 192948, 184745, 176777, 170001, 164611, 160351, 157042, 154578, 152621, 150686, 148602, 146666, 145280, 144548, 144251, 144048, 143687, 143123, 142519, 142052, 141706, 141254, 140507, 139536, 138691, 138369, 138776, 139886, 141697, 144458, 148535, 154010, 160513, 167499, 174595, 181585, 188157, 193798, 197922, 200015, 199777, 197258, 192892, 187276, 180916, 174229, 167747, 162093, 157623, 154152, 151189, 148459, 146079, 144196, 142611, 140917, 138910, 136715, 134512, 132390, 130480, 128998, 127969, 127072, 125945, 124613, 123442, 122750, 122537, 122505, 122254, 121602, 120892, 120794, 121639, 122996, 124156, 124862, 125281, 125434, 125062, 124122]
54668A24122j133r62p70o87n55l52k29j98r9M6J5k21l94l25j64j07q5R2L48L73
54648A18715M8k85j16O42J481J735J185J25r30j516j338n08M22R46J085J142J045
54631A23878N05k93o80m29n7l9j68j07Nq6k34j47J19L97P04R18O33j38o10k18
54611A23953M14L43k31k56N11J155R77L49o0j61k15l27n31q46j023o60K06J021
54593A24619J404J427J090J73j070j704j153m5M67K9o73p69j4J112J841J829J499
54576A30062J493J700J386M19k44K47J343J691P79n79j318j169n74o3J91L64O36
54559A36364P98M13m03p52P7J490K037J096l93j084o98QM35P01J080J361J145
54542A43675N45J66L90R19J247J299J402J702J953J884J570J284J159J066P92
$$ y = [124122, 122989, 122027, 121257, 120570, 120015, 119663, 119434, 119236, 119137, 119183, 119198, 118977, 118583, 118258, 118094, 117987, 117902, 117994, 118342, 118715, 118763, 118478, 118362, 119004, 120485, 122220, 123405, 123530, 122600, 121084, 119746, 119238, 119660, 120606, 121691, 122833, 123878, 124383, 124090, 123410, 122981, 122924, 122885, 122717, 122610, 122615, 122529, 122295, 122148, 122267, 122664, 123368, 124286, 124919, 124781, 124171, 123953, 124367, 124710, 124479, 124223, 124734, 125889, 126866, 127215, 127155, 126994, 126779, 126452, 125921, 125075, 124052, 123392, 123598, 124619, 126023, 127450, 128540, 128713, 127643, 125939, 124786, 124741, 125208, 125237, 124564, 123795, 123781, 124893, 126734, 128563, 130062, 131555, 133255, 134641, 135060, 134816, 135063, 136406, 138097, 138876, 138297, 136979, 135810, 135236, 135173, 135364, 135728, 136364, 137162, 137575, 137172, 136420, 136497, 137987, 140024, 141120, 140727, 139643, 138945, 138953, 139388, 140089, 141169, 142530, 143675, 144220, 144386, 144776, 145695, 146942, 148241, 149643, 151345, 153298, 155182, 156752, 158036, 159195, 160261, 161053]
54527A61053K70k86n61m98m20o24r73j019m98M42J359J724J161p7j088j142n43
54510A58280k60o51j154j251j164j242j200o10K34N10k1o71o89j70J24k66r41
54493A48858j115n54J61M18L71N94J109J318J012P95J178J773J855J400R94R15
54477A61082R03P99Q17J092J403J492J389J258J219J370J773K224K339K011J654
54462A82825J718K087K143J520O11K14O14J179J060K39m44l78Q1K45Q5Qq6q51
54444A92870k331l510l490k638k031k005j940j379o65k08J57O65R45M43o16j360
54428A72907j356j024q50p36m62k13k02j16M60J198J330Q04M82Q96J333P28q22
54411A74357k006j774m56P48J026M97k62p65p57j93O33J146R99N02K76M63N96
$$ y = [161053, 161323, 161037, 160476, 159978, 159558, 158934, 157961, 156942, 156444, 156886, 158245, 159969, 161130, 161053, 159965, 158823, 158280, 158020, 157369, 156215, 154964, 153800, 152558, 151358, 150748, 150982, 151492, 151471, 150800, 150111, 149941, 150065, 149799, 148858, 147743, 147189, 147350, 147768, 148139, 148733, 149842, 151160, 152172, 152967, 154145, 155918, 157773, 159173, 160167, 161082, 161985, 162784, 163601, 164693, 166096, 167588, 168977, 170235, 171454, 172824, 174597, 176821, 179160, 181171, 182825, 184543, 186630, 188773, 190293, 190904, 191118, 191732, 192911, 193971, 194210, 193766, 193388, 193469, 193714, 193799, 193807, 193721, 192870, 190539, 187029, 183539, 180901, 178870, 176865, 174925, 173546, 172881, 172673, 172830, 173495, 174440, 174883, 174267, 172907, 171551, 170527, 169677, 168941, 168479, 168266, 168064, 167948, 168408, 169606, 170936, 171740, 172222, 173118, 174451, 175179, 174357, 172351, 170577, 170121, 170869, 171895, 172392, 172130, 171365, 170608, 170415, 171048, 172194, 173193, 173695, 173971, 174434, 175030]
54394A75030L34LJ56Q43J572J886J671J048K62l84p25r23j190j403j222n96Q8
54377A76450M13K75j22m85o15n50m68m11k13J53L96K99R5J06K45K51K15M17P14
54358A77165O55J48m22p76r41r02n74k12k33n63o61m20m17j079j997k459k214
54341A64098j501p74n45j065j859k039j341m50m5j15l81p56r78n11N55J179O48
54324A54120l16n40j3K73j58q67j425j851k030j622o83K02N89N06J08l44k69P43
54306A46423K089K518J573J21p49p57j74O83J307J032j48j235j289n63m0j07l24
54289A50360l48m20p83j164j057l55M89Q62N19j28l56Q1N83L67n17j202j072m58
54271A45401j0K21O19J109J096M33k02k77k56q63j697j505O8J745K075J111J14
$$ y = [175030, 175364, 175367, 175523, 176366, 177938, 179824, 181495, 182543, 182805, 182421, 181696, 180773, 179583, 178180, 176958, 176362, 176450, 176863, 177138, 177016, 176531, 175916, 175366, 174898, 174487, 174274, 174427, 174823, 175122, 175217, 175323, 175568, 175819, 176034, 176451, 177165, 177820, 177968, 177546, 176770, 175829, 174927, 174353, 174141, 173908, 173345, 172684, 172264, 171847, 170768, 168771, 166312, 164098, 162597, 161823, 161278, 160213, 158354, 156315, 154974, 154524, 154479, 154364, 153983, 153227, 152249, 151738, 152293, 153472, 154120, 153804, 153264, 153251, 153524, 153366, 152499, 151074, 149223, 147193, 145571, 144888, 145090, 145679, 146185, 146293, 145949, 145680, 146423, 148512, 151030, 152603, 152724, 151975, 151218, 151044, 151727, 153034, 154066, 153918, 152683, 151394, 150831, 150791, 150684, 150360, 150012, 149592, 148809, 147645, 146588, 146233, 146722, 147584, 148103, 147975, 147619, 147700, 148283, 148650, 148133, 146931, 145859, 145401, 145391, 145612, 146231, 147340, 148436, 148869, 148667, 148390, 148134, 147271, 145574, 144069, 144137, 145882, 147957, 149068, 149182]
54254A49182p4K52L84M6n20r53j035q12n70n47o64o74m89k51j15j17j89j70M7
54235A42731L00K67q2l69l92m42p38q56k47P74J173M16q92j714j647j126p96q29
54217A35531q01k70N18P47K5j009j401r66k48L20O73P13K66m58r15q30l73K82
54199A31804J006J391R79M2n06j80N26R61J056J001P34K80N6K88M83R0o42j028
54181A38341j001j071j366j376q26k30j64m69m78J58J138J848J842J062j02j024
54165A36282j287r81m53J24P75J332J400R14M04L53M72Q0q11j349j004l01ok0
54147A35924K96R58J274R36M85M48O02M43k2l52l91m63q71j411j499p75L87J115
54129A37084R61M22L24P71J122R11L77j2j18n6Q7K35L42N19Q47J040O62j23n53
$$ y = [149182, 149108, 149360, 149744, 149790, 149270, 148317, 147282, 146470, 145900, 145353, 144689, 144015, 143526, 143275, 143160, 143043, 142854, 142684, 142731, 143031, 143298, 143216, 142847, 142455, 142013, 141275, 140419, 140172, 140946, 142119, 142535, 141643, 139929, 138282, 137156, 136360, 135531, 134730, 134460, 134978, 135725, 135750, 134741, 133340, 132374, 132126, 132446, 133119, 133832, 134098, 133640, 132725, 131895, 131522, 131804, 132810, 134201, 135180, 135222, 134716, 134536, 135062, 136023, 137079, 138080, 138814, 139094, 139150, 139438, 139921, 140011, 139369, 138341, 137340, 136269, 134903, 133527, 132701, 132471, 132307, 131838, 131360, 131518, 132656, 134504, 136346, 137408, 137306, 136282, 134995, 134014, 133561, 133685, 134460, 135792, 137192, 138106, 138510, 138863, 139335, 139415, 138604, 137255, 136251, 135950, 135944, 135924, 136220, 137178, 138452, 139388, 139873, 140321, 140923, 141366, 141344, 140992, 140601, 140138, 139267, 137856, 136357, 135582, 135969, 137084, 138045, 138467, 138791, 139562, 140684, 141595, 141972, 141960, 141842, 141786, 141873, 142108, 142450, 142969, 143816, 144856, 145518, 145395, 144842]
54110A44842k17L94N92L05p7k61j35K49M41j22j185j570o76M68M93l77p27r0N40
54091A42887M23J24K28J58q14k049k162r60K75N11J54J82P52J170R91N44L79N47
54073A43340O34L71j0j17Q9L17N09J024K045L037L163K262J046K53p5l26o54q59
54055A56049p75m39j7K44J39j71p3Q51K159K922K737K011J276P39O62J443K928
54038A72685M097M078L279K928L597M679N311N293M957M614M326M058L796L637
54024B31335L660L678L252K233J147P00R22J201J162J003R39P33O9r44j886k481
54008B46723k717k739k755k912l092l050k797k735l199m017m553m225k995j531
53994B03406p27q63j311j309q87o26p21q63j009j536k342k596j855q69o44j072
$$ y = [144842, 144625, 145019, 145611, 145916, 145839, 145578, 145443, 145692, 146133, 146011, 144826, 143256, 142580, 143048, 143541, 143164, 142437, 142347, 142887, 143310, 143434, 143662, 143820, 143006, 140957, 138795, 137835, 138110, 138621, 138775, 138957, 139709, 140879, 141870, 142414, 142793, 143340, 143974, 144345, 144335, 144218, 144307, 144624, 145133, 146157, 148202, 151239, 154402, 156664, 157710, 157963, 157888, 157562, 156908, 156049, 155274, 154835, 154818, 155062, 155201, 155030, 154957, 155808, 157967, 160889, 163626, 165637, 166913, 167652, 168314, 169757, 172685, 176782, 180860, 184139, 187067, 190664, 195343, 200654, 205947, 210904, 215518, 219844, 223902, 227698, 231335, 234995, 238673, 241925, 244158, 245305, 246005, 246927, 248128, 249290, 250293, 251232, 251965, 252034, 251090, 249204, 246723, 244006, 241267, 238512, 235600, 232508, 229458, 226661, 223926, 220727, 216710, 212157, 207932, 204937, 203406, 202679, 201816, 200505, 199196, 198309, 197683, 196962, 196099, 195090, 193554, 191212, 188616, 186761, 185892, 185248, 184176]
53978A84176j239q76o98j254k063k225j462k30Q88J604J856J652J076L30k84m66
53962A80785o0P74J573J897J746J515J484J485J285J151J595K576L416L779M182
53947B09183N218O680Q012R230J0676J2071J2600J1971J0636Q879O416L175j36
53934C14611k643m087m727m871m727m329l476k068o02J76J77Nl0j80m14p7J074
53917B83812K304K896L139L643M267M488M391M495M816M865M486M033L752L527
53903C38914L169K584J733P31j63r39j844k781l169k829k476k766l409l826m195
53888C18734m968n853o230o218o387o625o321n533m919m552l888k927k343k233
53874B49737j914j238j050j793k643k715k311k251k603k796k617k326k106j895
$$ y = [184176, 182937, 182061, 181363, 180109, 178046, 175821, 174359, 174129, 175017, 176621, 178477, 180129, 181205, 181535, 181251, 180785, 180725, 181499, 183072, 184969, 186715, 188230, 189714, 191199, 192484, 193635, 195230, 197806, 201222, 205001, 209183, 214401, 221081, 229093, 238323, 248999, 261070, 273670, 285641, 296277, 305156, 311572, 314747, 314611, 311968, 307881, 303154, 298283, 293556, 289227, 285751, 283683, 283081, 283257, 283434, 283439, 283409, 283229, 282815, 282738, 283812, 286116, 289012, 292151, 295794, 300061, 304549, 308940, 313435, 318251, 323116, 327602, 331635, 335387, 338914, 342083, 344667, 346400, 347131, 346968, 346029, 344185, 341404, 338235, 335406, 332930, 330164, 326755, 322929, 318734, 313766, 307913, 301683, 295465, 289078, 282453, 276132, 270599, 265680, 261128, 257240, 254313, 251970, 249737, 247823, 246585, 245535, 243742, 241099, 238384, 236073, 233822, 231219, 228423, 225806, 223480, 221374, 219479]
53860B19479j626j285q95o65p88j019q55l55j64m97q08p83r29j603k145j760p22
53843B02580P5L81N72O96M19j39m03k63k48o53j133j328j335j325j186q25m30
53826A95455j90q5j73o75j473j851j239m2O72L74l15l50N80J791K356J972J074
53809A97881L31J55O19J530K511L123L155K807K531K662L203L893M440M694M670
53794B38205M399L887L234K742K688K973L133K817K200J858K186K934L366K913
53780B79535J761O62J57P5m8l06l33J89J172K277L296M453O362R434J3069J5618
53764C37373J5494J2285O734J5o568j1663j4463j5314j5213j4680j3617j2193
53752B68190j1020j0223r130p257n098l432k426j858j755k124k470k269j768j645
$$ y = [219479, 217853, 216568, 215673, 215008, 214220, 213201, 212346, 211991, 211827, 211330, 210522, 209739, 208810, 207207, 205062, 203302, 202580, 202655, 203036, 203608, 204304, 204723, 204584, 204181, 203918, 203670, 203017, 201884, 200556, 199221, 197896, 196710, 195885, 195455, 195265, 195180, 195007, 194332, 192859, 191008, 189769, 189727, 190399, 190773, 190458, 190108, 190688, 192479, 194835, 196807, 197881, 198212, 198367, 198986, 200516, 203027, 206150, 209305, 212112, 214643, 217305, 220508, 224401, 228841, 233535, 238205, 242604, 246491, 249725, 252467, 255155, 258128, 261261, 264078, 266278, 268136, 270322, 273256, 276622, 279535, 281296, 281958, 282115, 282190, 282142, 281836, 281503, 281692, 282864, 285141, 288437, 292890, 299252, 308686, 321755, 337373, 352867, 365152, 371886, 371901, 365333, 353670, 339207, 323893, 308680, 294000, 280383, 268190, 257170, 246947, 237817, 230560, 225462, 222030, 219604, 217746, 215991, 213867, 211397, 209128, 207360, 205715]
53738B05715j941j986j473r30q86j071q09J1Q09J042P52L65J99L38P97J468J898
53721B04298J526L55q27j237r77p42q11q02m39k4J12J65N10J145J741K121K346
53704B08460K524K679K835L031L331L706L834L187J711K58j76M08J146J568J987
53689B40489K496K493J653O02P3n8j74k7P37J662K001J899K100K667K926K681
53673B64220K482K519K157R40o70j975k855l468l666l223k395j731j482j466j394
53658B47993j134p99p02j088j824k514k909k961k501j336J92J202J133L54l26
53643B32780m90k55R8L22K74J18K50P40J029N91k80p12l60J97K58j02k20K60R60
53624B35458J298J197J114J403J872K081J968J938K304K890L243L086K466J589
$$ y = [205715, 203774, 201788, 200315, 199385, 198499, 197428, 196619, 196630, 197439, 198481, 199233, 199598, 199797, 200135, 200932, 202400, 204298, 205824, 206179, 205352, 204115, 203138, 202396, 201585, 200783, 200344, 200320, 200432, 200597, 201107, 202252, 203993, 206114, 208460, 210984, 213663, 216498, 219529, 222860, 226566, 230400, 233587, 235298, 235556, 235380, 235788, 236934, 238502, 240489, 242985, 245478, 247131, 247733, 247806, 247748, 247574, 247547, 248284, 249946, 251947, 253846, 255946, 258613, 261539, 264220, 266702, 269221, 271378, 272318, 271648, 269673, 266818, 263350, 259684, 256461, 254066, 252335, 250853, 249387, 247993, 246859, 246060, 245358, 244270, 242446, 239932, 237023, 234062, 231561, 230225, 230417, 231619, 232752, 233106, 232780, 232290, 232035, 232133, 232455, 232729, 232847, 233097, 233837, 234866, 235457, 235177, 234465, 234105, 234302, 234560, 234458, 234238, 234498, 235458, 236756, 237953, 239067, 240470, 242342, 244423, 246391, 248329, 250633, 253523, 256766, 259852, 262318, 263907]
53610B63907P27K41M62J459K908M159M559L883K604J563J235J317J250R68R08
53595B92150J192J249N22o59j337j028k71R0k03p99j306j496j195m69J64J24n06
53578B86222j053j150j161j505j963k016j583j036o70n24n65p27p74m99jM54Q02
53561B72251J090J092M59o20j322r90J29J177J569J412J127R63R30J065J481K090
53545B83903K465K243J680J498K087L115M051M791N479O033O238O198O217O318
53531C42316O244O042O200P059Q398R783J0994J1876J2110J1618J1059J1392J2803
53518D67894J4394J5208J5319J5572J6432J7539J8486J9490K0920K2536K3700
53507F67490K4229K4504K4770K4873K4709K4404K3841K2639K0914J9526J9135
$$ y = [263907, 264634, 264875, 265337, 266796, 269704, 273863, 278422, 282305, 284909, 286472, 287707, 289024, 290274, 291242, 292150, 293342, 294591, 295113, 294454, 293117, 292089, 291818, 291908, 291705, 290906, 289600, 288104, 286909, 286440, 286604, 286728, 286222, 285169, 284019, 282858, 281353, 279390, 277374, 275791, 274755, 274085, 273561, 272996, 272269, 271495, 270996, 270995, 271449, 272251, 273341, 274433, 274892, 274272, 272950, 271960, 272089, 273266, 274835, 276247, 277374, 278337, 279267, 280332, 281813, 283903, 286368, 288611, 290291, 291789, 293876, 296991, 301042, 305833, 311312, 317345, 323583, 329781, 335998, 342316, 348560, 354602, 360802, 367861, 376259, 386042, 397036, 408912, 421022, 432640, 443699, 455091, 467894, 482288, 497496, 512815, 528387, 544819, 562358, 580844, 600334, 621254, 643790, 667490, 691719, 716223, 740993, 765866, 790575, 814979, 838820, 861459, 882373, 901899, 921034]
53496I21034J9431J9660J9522J9033J8140J7031J6480J7033J8083J8522J8180
53485A122149J7719J7309J6360J4788J3524J3263J3504J3302J2487J1475J0412
53474A276292R058P264N112K717K64j937l768n504p392r298j0994j2598j4333
53461A234883j6041j7270j7800j7879j8020j8699j9996k1432k2289k2322k1941
53450A021194k1561k1153k0650k0318k0302k0207j9588j8626j7745j6831j5452
53439H08761j3767j2461j1714j0887r429p532n611l678j647J63J394K289L516
53426G39397N366P466R360J0973J2508J4061J5561J6863J7883J8709J9686K1188
53414I09021K3211K5243K6800K7989K9321L0900L2099L2352L2107L2698L5052
$$ y = [921034, 940465, 960125, 979647, 998680, 1016820, 1033851, 1050331, 1067364, 1085447, 1103969, 1122149, 1139868, 1157177, 1173537, 1188325, 1201849, 1215112, 1228616, 1241918, 1254405, 1265880, 1276292, 1285350, 1292614, 1297726, 1300443, 1300707, 1298770, 1295002, 1289498, 1282106, 1272808, 1261814, 1249216, 1234883, 1218842, 1201572, 1183772, 1165893, 1147873, 1129174, 1109178, 1087746, 1065457, 1043135, 1021194, 999633, 978480, 957830, 937512, 917210, 897003, 877415, 858789, 841044, 824213, 808761, 794994, 782533, 770819, 759932, 750503, 742971, 737360, 733682, 732035, 732198, 733592, 735881, 739397, 744763, 752229, 761589, 772562, 785070, 799131, 814692, 831555, 849438, 868147, 887833, 909021, 932232, 957475, 984275, 1012264, 1041585, 1072485, 1104584, 1136936, 1169043, 1201741, 1236793]
53403A236793L8726M2306M4712M5993M7018M8540N0555N2383N3360N3453N3226
53392A767065N3205N3401N3485N3270N2859N2354N1591N0255M8163M5405M2207
53381B323260L8775L5242L1758K8494K5483K2524J9396J6119J2889R685O186K113
53369B571924k495p541j3207j9734k6973l4341m1222m7185n1831n4827n6328n7112
53357B159128n7971n9021n9821o0099n9937n9317n7914n5767n3788n3038n3437
53346A529018n3660n2601n0586m8817m7830m7013m5615m3666m1616l9492l6958
53335A021164l4111l1631k9878k8222k5738k2425j9228j6827j4886j2790j0700
53324G74728r290q659q065o830n058l248j655k99P34J385J909K763M178N979P757
$$ y = [1236793, 1275519, 1317825, 1362537, 1408530, 1455548, 1504088, 1554643, 1607026, 1660386, 1713839, 1767065, 1820270, 1873671, 1927156, 1980426, 2033285, 2085639, 2137230, 2187485, 2235648, 2281053, 2323260, 2362035, 2397277, 2429035, 2457529, 2483012, 2505536, 2524932, 2541051, 2553940, 2563625, 2569811, 2571924, 2569429, 2561888, 2548681, 2528947, 2501974, 2467633, 2426411, 2379226, 2327395, 2272568, 2216240, 2159128, 2101157, 2042136, 1982315, 1922216, 1862279, 1802962, 1745048, 1689281, 1635493, 1582455, 1529018, 1475358, 1422757, 1372171, 1323354, 1275524, 1228511, 1182896, 1139230, 1097614, 1058122, 1021164, 987053, 955422, 925544, 897322, 871584, 849159, 829931, 813104, 798218, 785428, 774728, 765438, 756779, 748714, 741884, 736826, 733578, 731923, 731624, 732358, 733743, 735652, 738415, 742593, 748572, 756329]
53309G56329R173J0223J1266J2612J4068J5223J6178J7468J9144K0502K1198K1980
53297I45364K3687K5959K7729K8708K9435L0065L0132K9669K9489K9824K9608
53286A259669K7858K5115K2771K1242J9697J7441J4826J2582J0766Q756O074K927
53274A449724o9k596m839p040r045j0635j2131j4174j6818j9364k1281k2895k4785
53261A284052k6945k8914l0504l1875l3050l3814l4089l4038l3776l3302l2647
53250I31098l1889l0946k9705k8336k7237k6602k6278k6133k6286k6757k7104
53239F23825k6688k5377k3736k2419k1409k0145j8311j6240j4400j2807j1265
53228D11028r961r299r183q988q391p781p639p860p969p694p120o507o139o137
$$ y = [756329, 765502, 775725, 786991, 799603, 813671, 828894, 845072, 862540, 881684, 902186, 923384, 945364, 969051, 995010, 1022739, 1051447, 1080882, 1110947, 1141079, 1170748, 1200237, 1230061, 1259669, 1287527, 1312642, 1335413, 1356655, 1376352, 1393793, 1408619, 1421201, 1431967, 1440723, 1446797, 1449724, 1449655, 1447059, 1442220, 1435180, 1426135, 1415500, 1403369, 1389195, 1372377, 1353013, 1331732, 1308837, 1284052, 1257107, 1228193, 1197689, 1165814, 1132764, 1098950, 1064861, 1030823, 997047, 963745, 931098, 899209, 868263, 838558, 810222, 782985, 756383, 730105, 703972, 677686, 650929, 623825, 597137, 571760, 548024, 525605, 504196, 484051, 465740, 449500, 435100, 422293, 411028, 401067, 391768, 382585, 373597, 365206, 357425, 349786, 341926, 333957, 326263, 319143, 312636, 306497, 300360]
53214C00360o194n779m757l566k639k055j875k317l215l834l696l274l278l568
53200B50313l432k719k002j652j444j135q50o68m12m6J56R5Rm5m54j407k328k432
53182B29547j666p52l00k08j5M33P97O87J40m16o48o60p41q60o56P8J004J477
53164B27241J200O02M58J075J893K054J341K97n16j045j350j201m70L60O63M31
53148B33033J56j9l80r44j283j215j095j138r57k07P36J167R19M04k1k70l10j89
53130B28387k42p43j232q19N86J772J515L2j303j606j205q11n72k74O8L01M78
53113B24332O68O78L47j26n44j126j969k400j732n12j35j055k253k759k741k666
53097B06007k312j459p51r11j528j550p85o9q9p64j629k063j415K80J857K134
$$ y = [300360, 294166, 288387, 283630, 280064, 277425, 275370, 273495, 271178, 267963, 264129, 260433, 257159, 253881, 250313, 246881, 244162, 242160, 240508, 239064, 237929, 237079, 236411, 235999, 235953, 236109, 236204, 236213, 236168, 235714, 234307, 231979, 229547, 227881, 227129, 226829, 226621, 226606, 227039, 227836, 228523, 228663, 228247, 227599, 226939, 226198, 225338, 224682, 224760, 225764, 227241, 228441, 229043, 229501, 230576, 232469, 234523, 235864, 236161, 235645, 234600, 233250, 232049, 231579, 231939, 232602, 233033, 233189, 233170, 232790, 231846, 230563, 229348, 228253, 227115, 226158, 225951, 226687, 227854, 228773, 229177, 229156, 228886, 228576, 228387, 228145, 227402, 226170, 225351, 225937, 227709, 229224, 229256, 227953, 226347, 225142, 224331, 223759, 223485, 223553, 223854, 224332, 225000, 225678, 226025, 225899, 225355, 224229, 222260, 219860, 218128, 217616, 217481, 216426, 214173, 211414, 208673, 206007, 203695, 202236, 201485, 200574, 199046, 197496, 196711, 196642, 196553, 195789, 194160, 192097, 190682, 190962, 192819, 194953]
53081A94953J412R96J285J406Q22J86J30K21k17j023j563j650j454r97l13K01
53065A94395J85j73m81o83q88r82q06m61j07K64N86O19L99L44N17L50m50j243
53047A91385j322r71q85r87o63lK14k57p21n74m3L40M12K71J6j79r2J69K32l7
53027A86305l76o44r83j387j459q98M5Q08R55L57o88j427j167m8J071J536J372
53010A83372P16m85j899k547j744o4J165J153J19j163j865j549o54k57q24j504
52994A71970j285n20l31p76p04L84J543J838J564J375J115M69L0N88J710K087
52978A81057J294J64n06p70q96q23n70m34m21j41M81R17R12R44J423J984K103
52961A86718J949J988K138J932J254L53o05j489j945j783j469j614k074k144j544
$$ y = [194953, 196365, 197361, 198646, 200052, 200874, 201060, 201190, 201411, 201194, 200171, 198608, 196958, 195504, 194507, 194194, 194395, 194580, 194407, 193926, 193243, 192355, 191373, 190567, 190106, 189999, 190263, 190849, 191468, 191867, 192211, 192728, 193078, 192628, 191385, 190063, 189092, 188207, 187220, 186557, 186554, 186768, 186511, 185790, 185216, 185173, 185513, 185925, 186196, 186212, 186033, 185941, 186110, 186342, 186305, 185929, 185285, 184302, 182915, 181456, 180558, 180603, 181411, 182366, 182723, 182035, 180608, 179441, 179393, 180464, 182000, 183372, 184088, 183603, 181704, 179157, 177413, 177349, 178514, 179667, 179786, 178623, 176758, 175209, 174555, 174298, 173474, 171970, 170685, 170165, 169834, 169058, 168354, 168738, 170281, 172119, 173683, 175058, 176173, 176642, 176672, 177260, 178970, 181057, 182351, 182515, 182009, 181239, 180343, 179520, 178950, 178516, 178095, 177954, 178435, 179352, 180264, 181208, 182631, 184615, 186718, 188667, 190655, 192793, 194725, 195979, 196332, 195727, 194238, 192293, 190510, 189041, 187427, 185353, 183209, 181665]
52946A81665p25j74J2o8k94m93o24r24j462j733j274m88j87m12m88j64Q8L5L1
52927A72321K15J47l36p07n91l31l31l79k13q9k73m93m16j75Q0N98J354J579P55
52908A72715l89p28k64O7j47m18l35n0K27M46M19l2n29m94n1J24p9J5P10J375
52888A72582J302N35m53j377k039k154j662q22K12J450K494K613J752Q85Q08J067
52872A77193P73j0m16j07L49M18K46J78K45K87K96L52N01P52J129J592K094K576
52854A88448K839K476J338q8j021j141p75l90k32l98q32j174j044o82q02j660
52838A84862k579k780k343j892j660j339q23m28k84m8N03R83R01M18J88N18J015
52821A75212J049M09n31j047o03N85J500J212j01j227j156J2J475K671L513L989
$$ y = [181665, 180940, 180766, 180778, 180710, 180416, 179923, 179299, 178375, 176913, 175180, 173906, 173418, 173231, 172819, 172331, 172167, 172255, 172290, 172321, 172536, 172683, 172347, 171640, 171049, 170718, 170387, 170008, 169795, 169706, 169433, 168940, 168524, 168349, 168429, 169027, 170381, 171960, 172715, 172326, 171598, 171334, 171401, 171254, 170836, 170501, 170451, 170678, 171124, 171543, 171511, 170982, 170488, 170437, 170561, 170482, 170497, 171207, 172582, 173884, 174419, 173966, 172589, 170550, 168396, 166734, 165912, 166124, 167574, 170068, 172681, 174433, 175318, 176126, 177193, 177966, 177956, 177540, 177433, 177782, 178200, 178446, 178624, 178869, 179156, 179452, 179804, 180305, 181057, 182186, 183778, 185872, 188448, 191287, 193763, 195101, 195013, 193992, 192851, 192076, 191686, 191454, 191056, 190224, 189050, 188006, 187324, 186522, 184862, 182283, 179503, 177160, 175268, 173608, 172269, 171446, 171018, 170734, 170686, 171189, 172172, 173073, 173491, 173679, 174197, 175212, 176261, 176670, 176139, 175092, 174489, 175074, 176574, 177786, 177685, 176458, 175302, 175314, 176789, 179460, 182973, 186962]
52805A86962L987L501K668J505r4j986l585m205l649k442j476j246j388j169m99
52790A76884j52o74j444j414o00j41p47j743k013j368n32j24k18o13j026j114
52774A62961p69l16m5L32J209K208K405J566N25M1r3l44m24K73J467K039J391
52757A74426J77n83o40m09j44K49O41N61j34q40q53l08l4m21q49n24M22J110J036
52738A72883N48K39K96O15J058J359J224P85O48J101J636J659J299J003P15J02
52722A87170n95q00n67n22q26j006r45j140j669j877j565j487k001k112r25O86
52706A69819J066J15o57l35L55M04j14m78l28J88P26Q33K81m79o49j35K86Q0m16
52687A70562p13q38q31k79R68K096K104J047r0o02n94m48l27k72l16l88l71k51
$$ y = [186962, 190949, 194450, 197118, 198623, 198529, 196543, 192958, 188753, 185104, 182662, 181186, 179940, 178552, 177383, 176884, 176732, 176058, 174614, 173200, 172600, 172459, 171712, 169969, 167956, 166588, 166056, 165932, 165714, 165101, 164075, 162961, 162192, 161876, 161831, 162163, 163372, 165580, 167985, 169551, 170076, 170117, 170024, 169680, 169256, 169529, 170996, 173035, 174426, 174603, 174020, 173380, 172971, 172827, 173076, 173717, 174278, 174144, 173304, 172451, 172143, 172109, 171688, 170839, 170315, 170737, 171847, 172883, 173431, 173670, 173966, 174581, 175639, 176998, 178222, 179007, 179655, 180756, 182392, 184051, 185350, 186353, 187068, 187170, 186575, 185775, 185208, 184686, 183860, 182854, 181909, 180769, 179100, 177223, 175658, 174171, 172170, 170058, 169133, 169819, 170885, 171000, 170343, 170008, 170363, 170767, 170653, 170175, 169847, 170035, 170761, 171594, 171875, 171396, 170747, 170612, 170898, 170978, 170562, 169849, 169011, 168180, 167901, 168869, 170965, 173069, 174116, 174026, 173424, 172830, 172382, 172055, 171783, 171467, 171079, 170708, 170457]
52669A70457n3K90Q13J348J646J582J111K59o34j003o43kM16O55J017J459J731
52652A80449J872K146K537K740K521J841P61m38j270j632k053k900l529k986j424
52637A78635j25M8m18n91k57J32K76L32N74J064J589J817J667J494J641J829J380
52620A91087J65j069j619j666j856k278k282j356J27J192J209M59k15l19q6M3
52604A81536Mk9j45n16q26m62N95J494J430N31m13q15o04LO58R82Q49N99O34Q87
52584A86392R10N00k3k04L8L85M17Ln35o22kQ36J061M24l71n23j14R5j86l17K74
52563A88438J142J336O67j44m95n07m51k55O9Q3n12j286j576j342j051q95o68
52546A82553k95P4M51R98J547J604J004K33q1J68N28M74o9o27o54k12Q2p5k53
$$ y = [170457, 170404, 170694, 171507, 172855, 174501, 176083, 177194, 177453, 176819, 175816, 175173, 175171, 175587, 176242, 177259, 178718, 180449, 182321, 184467, 187004, 189744, 192265, 194106, 194867, 194429, 193159, 191527, 189474, 186574, 183045, 180059, 178635, 178510, 178558, 178140, 177549, 177292, 177424, 177700, 178032, 178606, 179670, 181259, 183076, 184743, 186237, 187878, 189707, 191087, 191252, 190183, 188564, 186898, 185042, 182764, 180482, 179126, 179253, 180445, 181654, 182113, 181898, 181579, 181493, 181536, 181540, 181511, 181366, 180850, 180024, 179562, 180157, 181651, 183081, 183612, 183199, 182384, 181780, 181783, 182441, 183423, 184272, 184871, 185505, 186392, 187302, 187802, 187779, 187575, 187613, 187998, 188415, 188418, 187883, 187261, 187259, 188095, 189156, 189580, 189209, 188686, 188572, 188667, 188481, 188164, 188438, 189580, 190916, 191583, 191439, 190944, 190437, 189986, 189731, 189800, 189883, 189371, 188085, 186509, 185167, 184116, 183221, 182553, 182258, 182332, 182783, 183781, 185328, 186932, 187936, 188169, 188088, 188256, 188784, 189258, 189189, 188562, 187908, 187696, 187778, 187703, 187450]
52527A87450mM07M74L22M11O41N21R1m8L19P39Q38P05N07L91Q12K089L505L747
52508B03917K595J305R28J050P83J47l05n30q26j050r33q25j273j986k072j310
52492A99615m80l39q10j290j355r96n01j75l0K09P03J231J509J492J188N26k82
52475B00215o28j41Q22J679K224K418K031J098L20L22Q41J251J580K204K871K925
52459B22032K368J845J508Q34m02j763k882l730m038l374k106j344j503j714j139
52444B04592j33M64M97L46K02J47L50N71O1j267k136j367L36J127L86p32j106
52427B02338q87o53l17M09J183J459J337J331J462J207L71m92o77r2P11J142J057
52410B10889P85P89J344K470M035N764P290Q321Q796Q652P552N128J648j879m491
$$ y = [187450, 187446, 187853, 188327, 188649, 189060, 189701, 190222, 190313, 190265, 190584, 191323, 192161, 192866, 193373, 193764, 194576, 196665, 200170, 203917, 206512, 207817, 208745, 209795, 210578, 210725, 210420, 209890, 209064, 208014, 207081, 206256, 204983, 202997, 200925, 199615, 199135, 198796, 197986, 196696, 195341, 194345, 193844, 193669, 193639, 193848, 194551, 195782, 197291, 198783, 199971, 200497, 200215, 199587, 199446, 200268, 201947, 204171, 206589, 208620, 209718, 210038, 210360, 211201, 212452, 214032, 216236, 219107, 222032, 224400, 226245, 227753, 228587, 228185, 226422, 223540, 219810, 215772, 212398, 210292, 208948, 207445, 205731, 204592, 204459, 204923, 205420, 205766, 205968, 206115, 206465, 207036, 207097, 205830, 203694, 202327, 202663, 203790, 204176, 203444, 202338, 201451, 200798, 200481, 200890, 202073, 203532, 204869, 206200, 207662, 208869, 209240, 208748, 208071, 207979, 208690, 209832, 210889, 211674, 212463, 213807, 216277, 220312, 226076, 233366, 241687, 250483, 259135, 266687, 271815, 273463, 271584, 267093]
52395B67093n968o611o561n705m186k626j676j466j605j575j158n78k50l37n69
52380B26222n71k87J11N99J244J803J809J217O21N42Q41J108J411K102L058L553
52364B45383L083J902O23m25j246j856k156k078j687j161o92l37M1N02Q21P33
52348B41450L87K26L59L88K4m08l60K45R85J480J656J598J372J092J027J535K764
52331B55820M316N354N343M725M478M911N378N322N125N430O041O174N604M929
52317C28950M618M383L744K716J684R08M13K35M10Q26J227J418J399J321J373
52302C55625J640K048K420K587K498K339K427K850L191K889J958J005M12r4q22
52287C82973j475j621j471j610k067k247j792r83k22M58J179J953K695L223L261
$$ y = [267093, 261125, 254514, 247953, 242248, 238062, 235436, 233760, 232294, 230689, 229114, 227956, 227378, 227128, 226791, 226222, 225651, 225364, 225475, 226074, 227318, 229121, 230930, 232147, 232768, 233310, 234151, 235259, 236670, 238772, 241830, 245383, 248466, 250368, 250991, 250566, 249320, 247464, 245308, 243230, 241543, 240382, 239690, 239353, 239394, 239896, 240717, 241450, 241837, 242063, 242422, 242810, 242834, 242426, 242066, 242311, 243296, 244776, 246432, 248030, 249402, 250494, 251521, 253056, 255820, 260136, 265490, 270833, 275558, 280036, 284947, 290325, 295647, 300772, 306202, 312243, 318417, 324021, 328950, 333568, 337951, 341695, 344411, 346095, 347003, 347416, 347651, 348061, 348887, 350114, 351532, 352931, 354252, 355625, 357265, 359313, 361733, 364320, 366818, 369157, 371584, 374434, 377625, 380514, 382472, 383477, 383889, 383795, 382973, 381498, 379877, 378406, 376796, 374729, 372482, 370690, 369707, 369485, 369943, 371122, 373075, 375770, 378993, 382254]
52272C82254K782K291K302K543K300J618J494K548M172N322N697N603N172M340
52258D30438L333K532J978J462J071J218K064L291M401N063N204N099N175N460
52244D77789N344M245K435P96j58n20l88M36J876L223L737L417K912K762K893
52229E10799K879K528K183K382L224M224M863N055M863M118K846J874K242L835
52215E57915N226N294M496M086M536N334O013O545O807O397N304M143L425K995
52201F28516K482J934J572J336J159J431K568M123N008M700L743K904K391K125
52187F65992K253K817L287L060K240J361M67q59k497l579l665l425l642m080m011
52172F55719l591l750m657n166m278k573j548j792k395k179r51N84J725K301K481
$$ y = [382254, 385036, 387327, 389629, 392172, 394472, 396090, 397584, 400132, 404304, 409626, 415323, 420926, 426098, 430438, 433771, 436303, 438281, 439743, 440814, 442032, 444096, 447387, 451788, 456851, 462055, 467154, 472329, 477789, 483133, 487378, 489813, 490609, 490451, 489931, 489543, 489979, 491855, 495078, 498815, 502232, 505144, 507906, 510799, 513678, 516206, 518389, 520771, 523995, 528219, 533082, 538137, 543000, 547118, 549964, 551838, 554080, 557915, 563141, 568435, 572931, 577017, 581553, 586887, 592900, 599445, 606252, 612649, 617953, 622096, 625521, 628516, 630998, 632932, 634504, 635840, 636999, 638430, 640998, 645121, 650129, 654829, 658572, 661476, 663867, 665992, 668245, 671062, 674349, 677409, 679649, 681010, 681477, 680618, 678121, 674542, 670877, 667452, 663810, 659730, 655719, 652128, 648378, 643721, 638555, 634277, 631704, 630156, 628364, 625969, 623790, 622839, 623423, 625148, 627449, 629930]
52157F29930K474K369K122J640R43K70j38k90m41p84j212j408j130m58K38O24
52141F34749O99P25Q20Q19O10M11M06L22k68j218j830j695j109m76L21J492K739
52124F37517L613M335N572P340Q791R361R606J0310J1208J1277J0231R022Q548
52111G46731Q401P409N145K385J05j419k421k995l082k819k478k106j554q26q0
52096G50396P70K028L623M894N222M668L742K798J862Q60m04k272m772p098q069
52081G58248p239n316l288j514Q5J312J742J394R40R45J244J304J072J070J588
52066G53587K137J944Q66m68j332j553j472j516j878k416k803k858k722k579k347
52051G34590j906j557j806k591l184l117k834l076l925m845n440n707n730n449
$$ y = [629930, 632404, 634773, 636895, 638535, 639478, 639748, 639610, 639320, 638879, 638095, 636883, 635475, 634345, 633887, 634125, 634749, 635448, 636173, 636993, 637812, 638422, 638833, 639239, 639561, 639293, 638075, 636245, 634550, 633441, 632965, 633286, 634778, 637517, 641130, 645465, 651037, 658377, 667168, 676529, 686135, 696445, 707653, 718930, 729161, 738183, 746731, 755132, 762541, 767686, 770071, 770176, 768757, 766336, 763341, 760259, 757440, 754962, 752856, 751302, 750476, 750396, 751166, 753194, 756817, 761711, 766933, 771601, 775343, 778141, 780003, 780863, 780459, 778187, 773415, 766317, 758248, 751009, 745693, 742405, 740891, 740976, 742288, 744030, 745424, 746364, 747309, 748553, 749857, 750929, 751999, 753587, 755724, 757668, 758534, 758066, 756734, 755181, 753709, 752193, 750315, 747899, 745096, 742238, 739516, 736937, 734590, 732684, 731127, 729321, 726730, 723546, 720429, 717595, 714519, 710594, 705749, 700309, 694602, 688872, 683423]
52037F83423m754l509j635N17K138K731K802L274M244M867M526L615K911K618
$$ y = [683423, 678669, 675160, 673525, 674042, 676180, 678911, 681713, 684987, 689231, 694098, 698624, 702239, 705150, 707768]
$$ [...]
##END NTUPLES=NMR SPECTRUM
##END=
