
##TITLE=AC1260_SUMRS11077_6666646_ZD9ZvVsm6A
##JCAMPDX= 6.0         $$ Bruker NMR JCAMP-DX V2.0
##DATA TYPE= NMR SPECTRUM
##DATA CLASS= NTUPLES
##ORIGIN= BRUKER
##OWNER= Administrator
$$ 1.72 TOPSPIN		Version 2.1
$$ 2012-08-13 20:29:51.593 -0500  Administrator@TOPSPIN
$$ Compression mode = diff/dup
##.OBSERVE FREQUENCY= 400.02188249412
##.OBSERVE NUCLEUS= ^1H
##.ACQUISITION MODE= SIMULTANEOUS (DQD)
##.ACQUISITION SCHEME= undefined
##.AVERAGES= 8
##.DIGITISER RES= 22
##SPECTROMETER/DATA SYSTEM= spect
##.PULSE SEQUENCE= zg30
##.SOLVENT NAME= COFFEE_meoh
##.SHIFT REFERENCE= INTERNAL, COFFEE_meoh, 1, 14.98509
##AUDIT TRAIL= $$ (NUMBER, WHEN, WHO, WHERE, PROCESS, VERSION, WHAT)
$$ ##TITLE= Audit trail, TOPSPIN		Version 2.1
$$ ##JCAMPDX= 5.01
$$ ##ORIGIN= Bruker BioSpin GmbH
$$ ##OWNER= Administrator
$$ $$ C:\Bruker\TOPSPIN/data/COFFEE/nmr/AC1260_SUMRS11077_6666646_ZD9ZvVsm6A/10/pdata/1/auditp.txt
$$ ##AUDIT TRAIL=  $$ (NUMBER, WHEN, WHO, WHERE, PROCESS, VERSION, WHAT)
(   1,<2012-08-13 20:29:42.687 -0500>,<Administrator>,<TOPSPIN>,<go>,<TOPSPIN 2.1>,
      <created by zg
	started at 2012-08-13 20:28:35.734 -0500,
	POWCHK enabled, PULCHK disabled,
       configuration hash MD5:
       6B 1B 68 BB D9 2E 58 E2 7F 35 AD 54 07 DF 0E 41
       data hash MD5: 64K
       48 DA 89 1A B1 14 8B 7B 60 F0 EF C6 20 3E 53 3A>)
(   2,<2012-08-13 20:29:46.953 -0500>,<Administrator>,<TOPSPIN>,<proc1d>,<TOPSPIN 2.1>,
      <Start of raw data processing
       efp LB = 0 FT_mod = 6 PKNL = 1 PHC0 = 0 PHC1 = 0 SI = 32K 
       data hash MD5: 32K
       39 32 17 0E D2 AE 08 28 B9 5A 90 7E 44 C1 89 AB>)
(   3,<2012-08-13 20:29:47.265 -0500>,<Administrator>,<TOPSPIN>,<proc1d>,<TOPSPIN 2.1>,
      <pk PHC0 = 182.5653 PHC1 = 0 
       data hash MD5: 32K
       DA 17 92 10 A7 67 34 F3 5E E7 68 3B 85 2C C5 07>)
(   4,<2012-08-13 20:29:47.328 -0500>,<Administrator>,<TOPSPIN>,<proc1d>,<TOPSPIN 2.1>,
      <abs ABSG = 1 
       data hash MD5: 32K
       F0 29 C8 E5 CC C9 F3 E8 99 CC AA D7 53 AF AA 39>)
(   5,<2012-08-13 20:29:47.390 -0500>,<Administrator>,<TOPSPIN>,<proc1d>,<TOPSPIN 2.1>,
      <abs ABSG = 2 
       data hash MD5: 32K
       AB 3E B9 4F 6C 26 CE 03 25 9B 80 3D 22 00 34 DD>)
(   6,<2012-08-13 20:29:47.421 -0500>,<Administrator>,<TOPSPIN>,<proc1d>,<TOPSPIN 2.1>,
      <abs ABSG = 3 
       data hash MD5: 32K
       EA A4 DB 0D BD AA 82 08 0C D2 49 9E 7B A8 B9 E4>)
(   7,<2012-08-13 20:29:47.453 -0500>,<Administrator>,<TOPSPIN>,<proc1d>,<TOPSPIN 2.1>,
      <abs ABSG = 4 
       data hash MD5: 32K
       86 FB 74 66 15 82 C6 7B 0E 7E C6 26 8F CA 54 F0>)
(   8,<2012-08-13 20:29:47.500 -0500>,<Administrator>,<TOPSPIN>,<proc1d>,<TOPSPIN 2.1>,
      <abs ABSG = 5 
       data hash MD5: 32K
       21 48 4D 4B AF B7 59 22 CC B0 87 39 FD BA A1 60>)
$$ ##END=
$$ 
$$ $$ hash MD5
$$ $$ E6 B5 55 F8 B2 B1 90 03 AA 0D 8F DF AB 38 24 CA
##$RELAX= 
##$RELAX= 
##$RELAX= 
##$RELAX= 
##$RELAX= 
##$RELAX= 
##$RELAX= 
$$ Bruker specific parameters
$$ --------------------------
$$ [...]
150 150 150 150 150 150 150 150
##$TP07= 0
##$TPNAME0= <>
##$TPNAME1= <>
##$TPNAME2= <>
##$TPNAME3= <>
##$TPNAME4= <>
##$TPNAME5= <>
##$TPNAME6= <>
##$TPNAME7= <>
##$TPOAL= (0..7)
0.5 0.5 0.5 0.5 0.5 0.5 0.5 0.5
##$TPOFFS= (0..7)
0 0 0 0 0 0 0 0
##$TUNHIN= 0
##$TUNHOUT= 0
##$TUNXOUT= 0
##$USERA1= <user>
##$USERA2= <user>
##$USERA3= <user>
##$USERA4= <user>
##$USERA5= <user>
##$V9= 5
##$VALIST= <valist>
##$VCLIST= <CCCCCCCCCCCCCCC>
##$VD= 0
##$VDLIST= <DDDDDDDDDDDDDDD>
##$VPLIST= <PPPPPPPPPPPPPPP>
##$VTLIST= <TTTTTTTTTTTTTTT>
##$WBST= 1024
##$WBSW= 4
##$XGAIN= (0..3)
0 0 0 0
##$XL= 0
##$YL= 0
##$YMAX_a= 476201
##$YMIN_a= -611988
##$ZGOPTNS= <>
##$ZL1= 120
##$ZL2= 120
##$ZL3= 120
##$ZL4= 120
##$ABSF1= 14.98509
##$ABSF2= -5.573092
##$ABSG= 5
##$ABSL= 3
##$ALPHA= 0
##$AQORDER= 0
##$ASSFAC= 0
##$ASSFACI= 0
##$ASSFACX= 0
##$ASSWID= 0
##$AUNMP= <proc_prof1d_extract_pilot.lims>
##$AXLEFT= 0
##$AXNAME= <>
##$AXNUC= <1H>
##$AXRIGHT= 0
##$AXTYPE= 0
##$AXUNIT= <>
##$AZFE= 0.1
##$AZFW= 0.1
##$BCFW= 0
##$BC_mod= 0
##$BYTORDP= 0
##$COROFFS= 0
##$CY= 15
##$DATMOD= 1
##$DC= 0
##$DFILT= <>
##$DTYPP= 0
##$F1P= 0
##$F2P= 0
##$FCOR= 0.5
##$FTSIZE= 32768
##$FT_mod= 6
##$GAMMA= 0
##$GB= 0
##$INTBC= 1
##$INTSCL= 1
##$ISEN= 128
##$LB= 0
##$LEV0= 0
##$LPBIN= 0
##$MAXI= 10000
##$MC2= 0
##$MEAN= 0
##$ME_mod= 0
##$MI= 0
##$NCOEF= 0
##$NC_proc= -8
##$NLEV= 6
##$NOISF1= 0
##$NOISF2= 0
##$NSP= 0
##$NTH_PI= 0
##$NZP= 0
##$OFFSET= 14.98509
##$PC= 1
##$PHC0= 182.5653
##$PHC1= 0
##$PH_mod= 1
##$PKNL= yes
##$PPARMOD= 0
##$PPDIAG= 0
##$PPIPTYP= 0
##$PPMPNUM= 2147483647
##$PPRESOL= 1
##$PSCAL= 4
##$PSIGN= 0
##$PYNMP= <proc.py>
##$REVERSE= no
##$SF= 400.02
##$SI= 32768
##$SIGF1= 0
##$SIGF2= 0
##$SINO= 400
##$SIOLD= 32768
##$SPECTYP= <>
##$SREGLST= <1H.CDCl3>
##$SSB= 0
##$STSI= 32768
##$STSR= 0
##$SW_p= 8223.68421052631
##$SYMM= 0
##$S_DEV= 0
##$TDeff= 65536
##$TDoff= 0
##$TI= <>
##$TILT= no
##$TM1= 0
##$TM2= 0
##$TOPLEV= 0
##$USERP1= <user>
##$USERP2= <user>
##$USERP3= <user>
##$USERP4= <user>
##$USERP5= <user>
##$WDW= 1
##$XDIM= 32768
##$YMAX_p= 478275950
##$YMIN_p= -811062
##$CURPLOT= <Network HP LaserJet P1505>
##$CURPRIN= <$Network HP LaserJet P1505>
##$DFORMAT= <normdp>
##$LAYOUT= <+/1D_H.xwp>
##$LFORMAT= <normlp>
##$PFORMAT= <normpl>
##$SURQMSG= 1
$$ End of Bruker specific parameters
$$ ---------------------------------
##NTUPLES= NMR SPECTRUM
##VAR_NAME=  FREQUENCY,     SPECTRUM/REAL,   SPECTRUM/IMAG
##SYMBOL=    X,             R,               I
##VAR_TYPE=  INDEPENDENT,   DEPENDENT,       DEPENDENT
##VAR_FORM=  AFFN,          ASDF,            ASDF
##VAR_DIM=   32768,         32768,           32768
##UNITS=     HZ,            ARBITRARY UNITS, ARBITRARY UNITS
##FACTOR=    0.250966925370066, 1,           1
##FIRST=     8223.43324360094, 73808,        145342
##LAST=      0,             -60664,          -112071
##MIN=       0,             -811062,         0
##MAX=       8223.43324360094, 478275950,    0
$$ Real data points
##PAGE= N=1
##DATA TABLE= (X++(R..R)), XYDATA
$$ [...]
19509a29797A63888a02691j04274G5542a25955B07831F2670Q0611h1255C0042
19498i9523c6833G416b33987J12794q2341i7064J5236J7945g600A40415d9713
19486a80554f8544l4820I5225L0195b84900j92A69508F8343b41012b1936A57926
19474b7622j21309C92584d5518p6398j56164B1314F109J13015A4582R2509E2722
19462a32262l25009J35314g8487l46424A32406A0404a01562j40420d068j15655
19452a19723j54459E4957P272k4772b98060A18986Q8955F4148a43173k7773q1510
19441b52456N8323G1653K04511a92198k91420a14188o7089b7433l71250L4086
19431c64597A15820a75074O1454j28840H9131j7802f969G7648d9753j07268m7503
$$ y = [-129797, 163888, -102691, -206965, 75542, -125955, 207831, 62670, 143281, -81255, 30042, -99523, -36833, 7416, -233987, -121193, -203534, -97064, -81828, -63883, -7600, 140415, -49713, -180554, -68544, -103364, 95225, 125420, -284900, -285092, 169508, 68343, -241012, -21936, 157926, -27622, -148931, 392584, -45518, -121916, -278080, 21314, 6109, 119124, 14582, 107091, 52722, -132262, -457271, -321957, -78487, -424911, 132406, 10404, -101562, -241982, -4068, -119723, -274182, 54957, 62229, 37457, -298060, 118986, 207941, 64148, -143173, -170946, -252456, -194133, 71653, 276164, -192198, -483618, -114188, -181277, -27433, -398683, -364597, 115820, -175074, -113620, -242460, 89131, 71329, -6969, 77648, -49753, -157021, -204524]
19420b04524g9325A49759Q4840a52418J0547J7240G5028n747L58J00992d0291
19408a45745L6095c1350J3631I2303g0533j16713N8868L3510d6865G0487c33156
19396H9485A5778e0860A06245d1101k16074d0325H9071J14572a22681k70078A83211
19384b01480B5573e08284e4287l41051A17725d95592a68263c3399j28530A13932
19373A73287d9102B416a7095j120B10206e244k29727K0363R2166k34162l1540
19362c88144J65534b5783j970C18832F0715d04539b00132B4611a91957A35230
19351a00032j4763A72847a4294m0622r0167j7423A24090b12105A02732c64324
19340a66455C7578h8209M156k1317j75501B31804E3830a89396a5387C28a49255
$$ y = [-204524, -79325, 149759, 234599, -152418, -141871, -124631, 75028, 69281, 69639, 170631, -40291, -145745, -109650, -31350, -17719, 92303, -70533, -187246, -128378, -94868, -46865, 70487, -333156, 89485, 15778, -50860, 106245, -41101, -257175, -40325, 89071, 203643, -122681, -392759, 183211, -201480, 25573, -508284, -54287, -395338, 117725, -495592, -168263, -33399, -161929, 113932, 173287, -49102, 2416, -17095, -18215, 210206, -5244, -234971, -214608, -122442, -356604, -388144, -222610, -25783, -27753, 318832, 60715, -404539, -200132, 24611, -191957, 135230, -100032, -114795, 172847, -14294, -54916, -145083, -162506, 124090, -212105, 102732, -364324, -166455, 37578, -88209, -84053, -105370, -280871, 231804, 53830, -189396, -15387, 328, -149255]
19328a80119O8293m1651n7443B5144e7996j22456b857A37451a46017M2263B99722
19316I7654N0905a9602B67896a82065Q5703D0470K09100a73342q3505Q738l0534
19305b78643c6071j97527B16602c2305n6726j81383g4872A71949a85051K0565
19295a64486g5709j92707A80387e84533e7113j62885A45670J36839D6998a60866
19284D846b00687A67544F7676J41664B7847b78292L0304C20567b13930q7928A07375
19272b07136B74028b16162a2777m9124k38805j50933C5511L8357a09968A20397
19261a5737D4103b62630i6954A22309b03804J8746B18628b35194a12060c2822
19250c69953j54720b23473g3131L4311j51707r5889A07792b49483H7442O3418
$$ y = [-180119, -111826, -153477, -210920, 25144, -57996, -180452, -2857, 137451, -146017, -103754, 299722, 97654, 148559, -19602, 267896, -182065, -96362, 40470, 249570, -173342, -256847, -248109, -278643, -36071, -233598, 216602, -32305, -89031, -270414, -74872, 171949, -185051, -164486, -75709, -268416, 180387, -584533, -57113, -219998, 145670, 282509, 46998, -160866, 4846, -200687, 167544, 67676, 209340, 27847, -278292, -247988, 320567, -213930, -301858, 107375, -207136, 274028, -216162, -12777, -61901, -300706, -451639, 35511, 73868, -109968, 120397, -15737, 44103, -262630, -96954, 122309, -203804, -185058, 218628, -235194, -112060, -32822, -369953, -524673, -223473, -73131, -38820, -190527, -286416, 107792, -249483, 87442, 150860]
19240A50860a50077A13977j9493M9875b63083b9400A63461k5652b1323D8946b12369
19228G4597J30657a84162A31729J14082b51843d0726F9522m059P2207b7050j60032
19217a87082h652q461m94539b44905I6765K1499a15488b7181A33661b45819L12
19206b45507A38799E1671L6281c85106h0082p8779D6226M0242d8194j18931I8517
19194b55492J03328B24056b12663E2662O4686b29837j25220a09725A12981c79340
19183b4051F2326b18254M235J85B91644a7309l89519d5992F8271c50923p327m7836
19171d06086A99432c63977m1888A34537A4393a17191c7643k25680L2574m7122
19161b77871H4524a08398A79853B4446d6726I6491a7507q6286A34246c5600B49691
$$ y = [150860, -150077, 113977, 94484, 144359, -263083, -29400, 163461, 137809, -21323, 48946, -212369, 74597, 205254, -184162, 131729, 245811, -251843, -40726, 69522, 65463, 137670, -27050, -187082, -8652, -17113, -511652, -244905, 96765, 118264, -115488, -27181, 133661, -245819, -245507, 138799, 51671, 87952, -385106, -80082, -158861, 46226, 86468, -48194, -167125, 98517, -255492, -152164, 224056, -212663, 52662, 117348, -229837, -355057, -109725, 112981, -379340, -24051, 62326, -218254, -214019, -213834, 291644, -17309, -406828, -45992, 68271, -350923, -358250, -406086, 199432, -363977, -405865, 134537, 14393, -117191, -37643, -263323, -230749, -277871, 84524, -108398, 179853, 24446, -46726, 96491, -17507, -103793, 134246, -35600, 249691]
19149e2184l14892c5178m299l60885A8883K7765h759l61207G997O2903G536b35782
19136b3976j35219I8268c85207F1708c3933o1519B30747a1387n0490F5556a33707
19124D523J88500a00032a9408l63930B15797b4442m26666g8286J9736B56643f8562
19112b51649O9152c0215D12127D717g0865K7027A53330a23687A35698E3211b54750
19100a19735d5077j08976j69831i129k75633i9036A38286c80847J37300D9568
19089E86a75547A42408A6995c97678J65634D1860K83286a78343K0534g2329p09
19078g3038e75D0581a96666e4843p0206K7503C17680r4815G8541N0906D9682d36427
19065G8737a07039A33910E7588j4599b2266m17309A15110b67589m9125A99695
$$ y = [-52184, -367076, -35178, -39477, -400362, 18883, 46648, -8759, -369966, 7997, 70900, 7536, -235782, -23976, -159195, 98268, -385207, 61708, -33933, -95452, 230747, -11387, -61877, 65556, -133707, 4523, 193023, -100032, -19408, -383338, 215797, -24442, -451108, -78286, -58550, 256643, -68562, -251649, -182497, -30215, 412127, 4717, -70865, -43838, 153330, -123687, 135698, 53211, -254750, -119735, -45077, -154053, -323884, -9129, -284762, -99036, 138286, -380847, -243547, 49568, 586, -175547, 142408, 16995, -397678, -232044, 41860, 325146, -178343, -157809, -72329, -73038, -575, 40581, -196666, -54843, -125049, -97546, 317680, 222865, 78541, 129447, 49682, -436427, 78737, -107039, 133910, 57588, 42989, -22266, -439575, 115110, -267589, -316714, 199695]
19054A44559C2398n660C001c41156P2802m3778A12225p921B4450J04103b0703
19042A61360a99138R0397G3652k6555d68133f5847j10943M409r8795g0379l4819
19031a05198I7647a23970P686F0455b05989D4575K79937a49704O9527q9902b9868
19019b31673g4449m1559B8209a8092I0950K8647a34797a3790H9646c0842l6126
19008f6968r8429I350Q8918K3287O8245j9889J21196A43508d31482A02256R9509
18997B01765O5935a11784B6939g6453L0891j6612j74027g1379a6666j83490j07697
18986c07853a04968l98455A06385D5189D586J35491B3107M7599A0787a19091r6216
18975b15307f779j98103g9307r5043B31267b20894A08525R5270a24433e216C4066
$$ y = [144559, 32398, 26738, 3001, -341156, -268354, -312132, 112225, 104304, 24450, 128553, -20703, 161360, -199138, -108741, 73652, 47097, -468133, -65847, -176790, -172381, -271176, -70379, -105198, 97647, -123970, -116284, 60455, -205989, 44575, 324512, -149704, -80177, -170079, -29868, -231673, -74449, -116008, 28209, -18092, 90950, 119597, -134797, -13790, 89646, -30842, -66968, -165397, 9350, 98268, 121555, 189800, 169911, 291107, 143508, -431482, 102256, 201765, 267700, -111784, 26939, -76453, -45562, -62174, -236201, -71379, -16666, -200156, -307853, -104968, -503423, 106385, 45189, 4586, 140077, 23107, 70706, 10787, -119091, -215307, -6779, -204882, -79307, -174350, 231267, -220894, 108525, 203795, -124433, -5216, 34066]
18963b13791b0105F79807j1656l07301A10292B5579g1458A11773a24653m2520
18953a67173B62822o4717a645C1647J77235G1483b16805F7558c21846B04853A4294
18941C238h5839C90707b0433j19843C55945H2801R6758J92985A39303o254b07520
18929b7452B21079c4715l62392J00728c6995P54l63192h8094B05516H2984K03699
18918B86683a01405k0756q130N1769n6118G7541a43936k02942F8371c72806O9209
18907c03597d6884B0837J4712R1340a21085A08768a18882D48323a966C32265J43119
18896D75384A28987k3924l2779b793n5526k8168H3010P5331i6934M0927m27707
18885d83714f4909o1782j93539f0083k05274I5849N8969p814Q6191E3523H578
$$ y = [-213791, -20105, 679807, 668151, 360850, 110292, 25579, -71458, 111773, -124653, -167173, 262822, 198105, -1645, 31647, 208882, 71483, -216805, 67558, -321846, 204853, 14294, 3238, -85839, 390707, -20433, -140276, 355945, 82801, 179559, 372544, 139303, 133049, -207520, -27452, 221079, -34715, -397107, -296379, -36995, -36241, -399433, -88094, 205516, 82984, 286683, -101405, -122161, -130291, -78522, -134640, 77541, -143936, -346878, 68371, -372806, -303597, -46884, 20837, 35549, 126889, -121085, 108768, -118882, 448323, -1966, 332265, 475384, 128987, 105063, 72284, -2793, -58319, -86487, 83010, 158341, -96934, -56007, -483714, -64909, -126691, -320230, -60083, -265357, 95849, 154818, 147004, 233195, 53523, 8578]
18873c81074a49184L5596F6045a62739G6579c24627B02245p0900b16829c529k65093
18862b68622B91691r1256h8718C38499A52928j0482b89413E17121k11077c09547
18851A11286b08212B9507R8523a56131F9145a54965k7507B34183a75389l543h71
18839a29844A52262p1683g0920a3602C8345f488p146l28038E8193K1490l6258
18828D3425a71443l0253j14243l6268C7296j3316Q532c02598A85403D0371i6159
18816I0646b00515P5117B50597g4482j03182A13735a22399N520R058n9259j129
18805a68209K0176B62480a38832d0207k35870J07362m097g776k0184C08209B2186
18793a30982I9597M2653c99639a830m06943d1176k9358k4085o9027M3880l34420
$$ y = [-381074, -149184, -113588, 66045, -162739, 76579, -324627, 202245, 131345, -216829, -3529, -268622, 291691, 200435, -88718, 338499, 152928, 142446, -289413, 517121, 306044, -309547, 111286, -208212, 29507, 128030, -156131, 69145, -154965, -182472, 234183, -175389, -178932, -871, -129844, 152262, 80579, -70920, -13602, 38345, -6488, -13634, -341672, 58193, 79683, 43425, -171443, -201696, -315939, -352207, 37296, 23980, 32512, -302598, 185403, 40371, -96159, 90646, -200515, -125398, 250597, -74482, -177664, 113735, -122399, -116879, -107821, -167080, -168209, -148033, 262480, -138832, -40207, -276077, -168715, -172812, -7776, -27960, 308209, 22186, -130982, 99597, 142250, -399639, -1830, -408773, -41176, -70534, -94619, -163646, -119766, -454186]
18782d54186E2088a10484B6560L0911d3204j72547A21975K6769b08623l47g7901
18770A50550o2166a67352k13813B57543b08930H165N1512g5687j07103G0307e75770
18758g2515p1293b3828B8140L45470c27095A48054m0703b45680c5793A16555g1224
18746c38418C16079c67926P1065c9442j46498d4790A75722Q2691A05392R9860
18736B05252a3983k16359A01050a647k07063f4894D4942O7737a40250i726k73973
18725b83699f4195P30l59127a21562O0280F676a28149A19500j8727C7123J35869
18714A72992E9904O9511M5110Q7533L843c32218K0918a31639C8373k480J02024
18703A37917b02243j10501B0225G733h1770k00252F1726A1120c51826E9945c86214
$$ y = [-454186, 52088, -110484, 26560, 57471, -43204, -215751, 121975, 148744, -208623, -208970, -77901, 150550, 88384, -167352, -381165, 257543, -208930, 8165, 59677, -75687, -182790, 70307, -575770, -72515, -143808, -23828, 28140, 373610, -327095, 148054, 107351, -245680, -35793, 116555, -71224, -338418, 316079, -367926, -296861, -39442, -185940, -44790, 175722, 258413, 105392, 205252, -13983, -230342, 101050, -1647, -208710, -64894, 44942, 112679, -140250, -9726, -283699, -64195, -63465, -422592, -121562, -61282, 6676, -128149, 119500, 100773, 37123, 172992, 59904, 129415, 174525, 262058, 265901, -332218, -311300, -131639, 38373, 35893, 137917, -202243, -312744, 20225, 7733, -81770, -282022, 61726, 11120, -351826, 59945, -386214]
18691A93392n1702a00623F2896a41232a0484m2397C2828a35179f409j91480J9701
18680a78188m5838b9768A54878b603j77214A4141b45790h2228j76763a28265O3140
18669f5125F6031a42634A76496i3632j2350j08965G9779e5962k07160A67137P6743
18658B43880H5749p433b07660D0479O3399O9197G4197a93777a9586j25904j15082
18647b60572B59560a66564G493c8162c279A02219a97304g5813j7825L8913F3819
18635b41214F3432P9305B8805J04921D0681L51747c7481p2635B35773r4551c74346
18623c22915A15522b71339b6302C0317J90332R139a89807j17119P4459J02497
18613a29970J5297F933b14723M5049A37222c14760f2524k10441D1511b22949i9645
$$ y = [193392, 141690, -100623, 62896, -141232, -10484, -52881, 32828, -135179, -6409, -197889, -178188, -224026, -29768, 154878, -2603, -179817, 14141, -245790, -82228, -258991, -128265, -65125, 66031, -142634, 176496, -93632, -105982, -214947, 79779, -55962, -263122, 167137, 243880, 85749, 78316, -207660, 40479, 103878, 173075, 74197, -193777, -19586, -145490, -260572, 259560, -166564, 7493, -38162, -3279, 102219, -197304, -75813, -93638, -54725, 63819, -241214, 63432, 142737, 28805, 133726, 40681, 392428, -37481, -110116, 235773, 141222, -374346, -322915, 115522, -271339, -26302, 30317, 220649, 229788, -189807, -306926, -232467, -129970, -114673, 6933, -214723, -169674, 137222, -314760, -62524, -272965, 41511, -222949, -99645]
18601c15402C6586g646D6320A0217C224R2650d543A12561a13372E05304b53700
18589a59107B25600e199C4487M8161a40925N4337A8500B963e18499a60921A18019
18577a33415A63305a57974m22045A19163c8684j55019O2104J1325I4261b63692
18566D31655A492d04482A1972d4533k37341D862L195J22504f4913p3807B8293
18554e7665I4392c4062A58339E9039J79032J12550a4795k19723f1753l9963l6275
18543a37991A7986d78235b09177A44108a98416m0960N5517q3902C80375D8030
18532b23414B24409a79557a4400j12893A5405J24928h1364k23240c5178A21101
18521c74888b8479R245E0795a05816n3327A5052L47384a94453I1018J6422K15993
$$ y = [-315402, 36586, -7646, 46320, 10217, 3224, 95874, -4543, 112561, -113372, 505304, -253700, -159107, 225600, -5199, 34487, 82648, -140925, -86588, 18500, 2963, -518499, -160921, 118019, -133415, 163305, -157974, -580019, 119163, -38684, -193703, -131599, -120274, 94261, -263692, 431655, 1492, -404482, 11972, -44533, -281874, 4862, 8057, 130561, -64913, -138720, 28293, -57665, 94392, -34062, 158339, 59039, 238071, 350621, -14795, -234518, -61753, -101716, -137991, 17986, -478235, -209177, 144108, -198416, -239376, -183859, -267761, 380375, 48030, -223414, 224409, -179557, -14400, -127293, 15405, 140333, -81364, -304604, -35178, 121101, -374888, -28479, -19234, 50795, -105816, -159143, 15052, 362436, -194453, 91018, 107440, 323433]
18510C23433d00181c710m70840B00002e258k00593R7825m5890d0981G810a95117
18498h9529c8976A55297m4455a94868H0391b6863k21690b0182H6508a32807B29224
18486d99405b39899c7342B6218J44510B1813J38316o2480b43492A23960D4493
18475a34844G7697c10257O6665F3576J9677K8583c67771J53153O9917j63794J524
18464c06971B97710b93050G7202k6992g8378C16275a46681j95572C69020B5561
18453b2710r4998j42110i2641c9843o0911A7539b02052O5633F8236b6558o2737
18442h9295k51937g723A56023a22011l4356D8461c25549F7603a23124o2027d2537
18430b07286f2944A78135n6961J32191A5750M9093a21118j56110J05932B14846
$$ y = [323433, -400181, -3710, -474550, 200002, -5258, -205851, -108026, -153916, -40981, 7810, -195117, -89529, -38976, 155297, 110842, -194868, 80391, -26863, -248553, -20182, 86508, -132807, 229224, -499405, -239899, -37342, 26218, 170728, 21813, 160129, 97649, -243492, 123960, 44493, -134844, 77697, -310257, -243592, 63576, 83253, 111836, -367771, -214618, -144701, -308495, -306971, 297710, -293050, 77202, 50210, -78378, 316275, -146681, -342253, 369020, 25561, -22710, -117708, -259818, -92641, -39843, -100754, 17539, -202052, -136419, 68236, -26558, -89295, -341232, -7723, 156023, -122011, -156367, 48461, -325549, 67603, -123124, -185151, -42537, -207286, -62944, 178135, 121174, 253365, 15750, 64843, -121118, -277228, -171296, 214846]
18419b08093q0771E9028R6521B5484M0369J57691A05918l0242h6805N006j9988
18408a01787R141E7942a38665C4778b34145f59k83928a7072A94839a99225i8719
18396d6779E4573b16795B12673a18342H1279b143m9940D4658J73583j00323a67354
18384A94499p4899a05196A4702N8936J67209f9071B8989a8531C2434b19183O8800
18373a50383B6609a86939A76684N0821e33946A51603L5053b07573a4167C00251
18362a0752k32449m1698E0072a20324B55374h5625c5712G1713l1592a89705j19123
18351c08828C8263c6716F922e0544q6503B80250a32422j73718C44530E4498k3667
18340C0831J4249M8180a30202j27246C3305b88891a30389e6058a4735F1007b097
$$ y = [-208093, -288864, 59028, 155549, 25484, 65853, 223544, 105918, 75676, -86805, -81799, -101787, -92646, 57942, -138665, 34778, -234145, -659, -284587, -17072, 194839, -199225, -98719, -46779, 54573, -216795, 212673, -118342, 81279, -2143, -52083, 44658, 218241, 117918, -167354, 194499, 119600, -105196, 14702, 73638, 240847, -69071, 28989, -18531, 32434, -219183, -150383, 26609, -186939, 176684, 227505, -533946, 151603, 186656, -207573, -14167, 300251, -10752, -243201, -284899, 50072, -120324, 255374, -85625, -35712, 71713, 40121, -189705, -308828, 38263, -36716, 6922, -50544, -137047, 280250, -132422, -306140, 344530, 54498, 30831, 45080, 93260, -130202, -257448, 33305, -288891, -130389, -56058, -14735, 61007, -2097]
18328B23733a18321c6844o8399J9026q0326k82472i9587j14071A89503a64129
18317h6071r2751B09113b4913B68223a33150E6381a08852B18690q726h3550K2122
18306f1428j70694J12427k65858a42621C26833b90493b7207A51549g94A2777a53144
18294d3380A74636g3501j73451O9390c2478j44910K5357N4193O788D4442c12869
18282b09669A02388J2181b72112A83396b78501A2908b98540O0131L448D4791h1434
18270c72905G5L47508i754n2091C0129c70369n6888a99954C2531L02319a94598
18258f8355A24006a0624l78844c5550l58553E3386N0112a09492D9481a44699H5333
18246A80128g1385D3483L62401g4599j84413h9343F4177c60301g1190k81907H6462
$$ y = [223733, -118321, -36844, -105243, -86217, -166543, -449015, -99587, -213658, 189503, -164129, -86071, -178822, 209113, -24913, 268223, -133150, 56381, -108852, 218690, 209964, -83550, -61428, -232122, -119695, -385553, -142621, 326833, -290493, -27207, 151549, -794, 12777, -153144, -43380, 174636, -73501, -246952, -177562, -32478, -177388, -152031, -97838, -91050, 44442, -312869, -209669, 102388, 114569, -272112, 183396, -278501, 12908, -298540, -238409, -234961, 44791, -81434, -372905, 75, 347583, -9754, -61845, 30129, -370369, -427257, -199954, 32531, 334850, -194598, -68355, 124006, -10624, -389468, -35550, -394103, 53386, 103498, -109492, 49481, -144699, 85333, 180128, -71385, 43483, 405884, -74599, -259012, -89343, 64177, -360301, -71190, -353097, 86462]
18234f3643C27440f6817F9760J85409a29905C0134K2786f5957J5570a0627B0489
18222B70393c4367G0158a415B51587E9767P9230a03168A73794a1338B51459a81448
18210B72374a2341A62569a94593G1730a33309b2459F0422L22667h243k33063a08323
18198b62559h5454j9770N1291C12180a26064J1506K4976l37336A43296g5055j55241
18187b30296g5592B2998L02656F273K1028e8739a39C81673B7350b36386d3897
18175a01943A23551C4599Q9348I473J03826c12713J28965j94047G5092K46825
18165C21917b57474e0850j29540g691A0581J01351C4832a1304B3399K82616A16607
18153A18999N4203b43781A39490n0973c08658l2345H1731O5150a69571h4283B81992
$$ y = [-63643, 327440, -66817, 69760, 255169, -129905, 30134, 52920, -65957, -50387, -10627, 20489, 270393, -34367, 70158, -1415, 251587, 59767, 138997, -103168, 173794, -11338, 251459, -181448, 272374, -12341, 162569, -194593, 71730, -133309, -22459, 60422, 383089, -8243, -241306, -108323, -262559, -85454, -105224, -53933, 312180, -126064, -114558, -89582, -426918, 143296, -75055, -230296, -75592, 22998, 325654, 6273, 27301, -58739, -139, 381673, 27350, -236386, -43897, -101943, 123551, 34599, 123947, 9473, 113299, -312713, -183748, -377795, 75092, 321917, -257474, -50850, -180390, -7691, 10581, 111932, 34832, -11304, 23399, 306015, 116607, 118999, 173202, -243781, 139490, 88517, -308658, -341003, 81731, 146881, -169571, -84283, 281992]
18141c4013G2817J47653b37483j22731a22294j84052B58769J5481I6381c0947
18130I7692H84J8375M2364Q0105b0462A07484M8151g9102B70874d6479n6466q3665
18118a86610B4655c40101a37044m4050F4304c03669N0173i7046A40527c23288
18107g7464j2446k58510J15338C01886a08628k908j71471A40451c24810g2848
18096I3344b00r3520A84202a4812b053A24926C3614a78513Q1720H7865a32126
18084a72860J678e942G9028b41949a08289p9893C10770b9181k2588H2288A5874
18072A12661B5743b2104F695J40268a16749E4522d672j53952e024A9380K364b49937
18059A92781a65425E6392b76230O3508B9289K3197J38887a63935A51395C1594
$$ y = [-34013, 72817, 220470, -237483, -360214, -122294, -306346, 258769, 274250, 96381, -30947, 97692, 884, 19259, 61623, 141728, -20462, 107484, 155635, -79102, 270874, -46479, -102945, -186610, 24655, -340101, -137044, -181094, 64304, -303669, -253496, -97046, 140527, -323288, -77464, -89910, -348420, -233082, 301886, -108628, -111536, -283007, 140451, -324810, -72848, 93344, -200, -93720, 184202, -14812, -2053, 124926, 33614, -178513, -96793, 87865, -132126, -172860, -171182, -5942, 79028, -241949, -108289, -188182, 310770, -29181, -51769, 82288, 15874, 112661, 25743, -22104, 6695, 146963, -116749, 54522, -4672, -158624, -5024, 19380, 21744, -249937, 192781, -165425, 56392, -276230, -212722, 29289, 52486, 191373, -163935, 151395, 31594]
18048b5467q2607A5276K94011b12423i714C431a7488q7278r739a1631n1319B470
18035B7509K18588b68490C7411J75314C6122f4594F2860J39578B6291g7557B80734
18023d49692a55826d0750m75o6171H8266K60293H2731K1021c41666J70503d0596
18011a1421q4434D3391a77934L1446A298b30311j9572j59484d5366o6689D8541
17999a06438j4280C5135a84841d577o8301A23327D9312i908D3496a8061j49399
17988a67460c467l0454M20D0440b23149A5693a15355D91675H4390K2546K3480
17977A30416P7609d24694A37771f6585l1771c7987p1642q6185B90081i6787A19759
17965A74558K7733a40407A67179k220J94072D2961J70519a32835o7116q5320j1706
$$ y = [-25467, -108074, 15276, 309287, -212423, -9714, 3431, -17488, -104766, -114505, -11631, -62950, 2470, 27509, 246097, -268490, 37411, 212725, 36122, -64594, 62860, 202438, 26291, -77557, 280734, -449692, -155826, -40750, -41225, -107396, 88266, 348559, 82731, 103752, -341666, -171163, -40596, -11421, -95855, 43391, -177934, -146488, 1298, -230311, -249883, -409367, -45366, -112055, 48541, -106438, -120718, 35135, -184841, -4577, -72878, 123327, 49312, -9908, 43496, -18061, -167460, -3467, -33921, -33501, 40440, -223149, 15693, -115355, 491675, 84390, 106936, 130416, 208025, -424694, 137771, -66585, -98356, -37987, -109629, -195814, 290081, -96787, 119759, 174558, 202291, -140407, 167179, 164959, 359031, 42961, 213480, -132835, -199951, -285271, -296977]
17954b96977a14547q1069k410a1248A30961f2952I4664a91507A2642g3474A0607
17942c71471C34353b59857H8829K1588g4201j08585k21572a29030D8980M27306
17932D76286A50588J12436D3853e4869B08836c44203g8767j33622L0276A34073
17921a68115o7593Q3254d790l7158L904j07751B0844i4520p4008A47048h8926
17909F9802f6286m3298e2988l8400A68488m226b14019c0588N861j34866A17850
17897b42076A15007c417k04531G9331c37235E267b01829A53421B6017e0784D9470
17885a3308B44686e6320k6645q4148A22798b96227d0273B46717e6011B6233J95879
17874B22112f6084D5213g6574a7427J234B26855a77687F241N6079J16686a31110
$$ y = [-296977, -114547, -195616, -198026, -11248, 130961, -62952, 94664, -191507, 12642, -73474, 10607, -371471, 334353, -259857, 88829, 110417, -74201, -182786, -404358, -129030, 48980, 476286, 150588, 263024, 43853, -54869, 208836, -344203, -78767, -212389, -182113, 134073, -168115, -235708, -152454, -4790, -41948, -38044, -145795, 20844, -94520, -168528, 147048, -88926, 69802, -66286, -109584, -52988, -91388, 168488, 164262, -214019, -30588, -24727, -159593, 117850, -242076, 115007, -3417, -207948, 79331, -337235, 5267, -201829, 153421, 26017, -50784, 49470, -13308, 244686, -56320, -82965, -167113, 122798, -296227, -40273, 246717, -56011, 26233, 222112, -66084, 45213, -76574, -17427, -16193, 226855, -177687, 6241, 62320, 179006, -131110]
17862a00745E3395f704j52083n8244B7378J80801a42737f6837A39026P0966A5448
17850E5742K81609A24975R106a4943j31863a2258j38872b274j6316A5356K33425
17839B48781e3120B463b93460A97034K0129a13564M9848l818A1291J5269J1450
17828C8010N7546M6274b4080j3713b455A36673b39369f3906j73222A59332b31039
17816c4772j4473D8638a82029A32348o3400A5880J4942a78080A29833c29665G6672
17804a76045C28442I8978a77349a6061k11310B50860Q190q8458J32334D8401a80180
17792a78362B79064C6386K67458c35455C85197e3903A46415K25161A16883d3981
17781f1350L919A7994g8776k9764B95065a53986j15757J6101B69297j02275D6095
$$ y = [-100745, 53395, -6704, -158787, -217031, 27378, 208179, -142737, -66837, 139026, 209992, 15448, 55742, 337351, 124975, 134081, -14943, -146806, -12258, -151130, -2274, -18590, 15356, 248781, -53120, 2463, -293460, 197034, 217163, -113564, -63716, -67534, 11291, 26560, 38010, 95556, 141830, -24080, -37793, -2455, 136673, -239369, -63906, -237128, 159332, -231039, -34772, -49245, 48638, -182029, 132348, 68948, 15880, 30822, -178080, 129833, -329665, 76672, -176045, 328442, 98978, -177349, -16061, -227371, 250860, 259050, 170592, 302926, 48401, -180180, -178362, 279064, 36386, 303844, -335455, 385197, -53903, 146415, 371576, 116883, -43981, -61350, -57431, 17994, -78776, -108540, 295065, -153986, -269743, -253642, 269297, 167022, 46095]
17769A02621R736D6122b0728G0119K40M167K24158P7475b73190B56321b09544
17757B78494A19828h3242q5493A28514J9207F7575c25433H7692f1931A44920R9638
17746B44558c2487k20258H8953g038l03305C10889a28096b9729H7056L42724B4562
17734F527L33473j52099b8768A61320P4857m8839n7762N5495D2793K43104j29988
17723A55909l5913m2467a9336A39087E1970a56689B8883f829A08375h577j64973
17712a73550l23913A73494E6134a67961e9033a6148k34957O9129b462j42646J8829
17701a26279C3427a48609e2132b2456A33205b31766A96285p6028a14138A65219
17690a50041B30545A564J15874J98966a5083m1739j13329F5678J40984k4257B5015
$$ y = [102621, 112357, 46122, -20728, 70119, 70359, 74526, 298684, 376159, -273190, 256321, -209544, 278494, 119828, -83242, -168735, 128514, 147721, 67575, -325433, 87692, -61931, 144920, 244558, -32487, -252745, 88953, -7038, -310343, 310889, -128096, -29729, 87056, 429780, 24562, 6527, 340000, 187901, -28768, 161320, 236177, 187338, 129576, 185071, 42793, 285897, 155909, 119996, 77529, -19336, 139087, 51970, -156689, 28883, -6829, 108375, -8577, -173550, -497463, 173494, 56134, -167961, -59033, -16148, -251105, -181976, -2462, -145108, -126279, 33427, -148609, -52132, -22456, 133205, -231766, 196285, 120257, -114138, 165219, -150041, 230545, 1564, 117438, 316404, -15083, -56822, -170151, 65678, 206662, 182405, 25015]
17678A34770J84860H3305J25130A01769R6330p7496J20674i3323I3191P1080e7454
17666E18631A92407Q7775E9006a06012b1363L677F8391R9923a33178B7113c1334
17654b5476m6146K2926j75410A87249F7725c09264B34572C4548M58323a20109
17643a06737B60692b07699d297k546B00739a57314C47780q6002a34506B40258
17632b8473E59450B00093b38566a03743K187J545k56240J38392D23071A72098
17621a95775m36215d0713B10695J37392a21298A65528b5106A66364o3342a34692
17610A98901a52131L4789M7414A71010a35990M9324A28381B1595b08947I9796
17599C74745A8522K40896a18937B26864c5238G7831Q4020f3920B56697C3315a70833
$$ y = [134770, 319630, 83305, 208435, 101769, 198099, 120603, 241277, -93323, 93191, 164271, -57454, 518631, 192407, 280182, 59006, -106012, -21363, -17686, 68391, 168314, -133178, 27113, -31334, -25476, -71622, -48696, -224106, 187249, 67725, -309264, 234572, 34548, 492871, -120109, -106737, 260692, -207699, -4297, -6843, 200739, -157314, 347780, 261778, -134506, 240258, -28473, 559450, 200093, -238566, -103743, -101556, -100011, -356251, -217859, 423071, 172098, -195775, -631990, -40713, 210695, 348087, -121298, 165528, -25106, 166364, 103022, -134692, 198901, -152131, -117342, -69928, 171010, -135990, -86666, 128381, 21595, -208947, 99796, 374745, 18522, 259418, -118937, 226864, -35238, 77831, 161851, -63920, 256697, 33315, -170833]
17587b6339p9934H1217B3662J90942d00503C83696N3869F992L14654N3335i3197
17575A53575a86777N4734A68142o2567O5434i7222A49267D2327J0129b30471C87080
17563I8357Q8451O3022g5813A83980H2108J56789J7169n2286L4577A149L7182
17552C8331K83807r8205a76545C018J60158a09105B95049l5322c4993A32555J06878
17541B39433Q7688A59239a6056B95901A08422A9025J20880k2101b3888E42790
17530D160K7230b21037k2051J12631A12233J14574E6705M72857J58899M4865C38848
17518D21890B01519j4281J14290A50759B4140e1082A39583o2801K18924M2754
17508C38460K44112j73670A49672M61134B44121K74218a79095B18590l3051a56143
$$ y = [-26339, -106273, 81217, 23662, 214604, -400503, 383696, 437565, 6992, 321646, 374981, -93197, 153575, -186777, -132043, 168142, 105575, 171009, -97222, 149267, 42327, 52456, -230471, 387080, 98357, 186808, 249830, -75813, 183980, 82108, 238897, 256066, 203780, 238357, 1149, 38331, 322138, 223933, -176545, 3018, 163176, -109105, 295049, 259727, -34993, 132555, 239433, 327121, 159239, -16056, 295901, 108422, 19025, 139905, 117804, -23888, 542790, 4160, 31390, -221037, -243088, -130457, 112233, 226807, 56705, 529562, 688461, 733326, 338848, 421890, 201519, 187238, 301528, 150759, 24140, -51082, 139583, 76782, 295706, 338460, 582572, 408902, 149672, 610806, 244121, 518339, -179095, 218590, 185539, -156143]
17497A88725N481E4783M5360l516J09704J91561j45516K3086l6830N2111n5853
17486B34890D6848L55862I2260A0407K6291J91388R5565K96225j74212D6050K4345
17475G0395K2386K77926n0826a68892C04696J65363A65912J86595E6518K77023
17465C33541o9227F950K14395o0484a32357C9717M6371M21394A17911J71604J93051
17454D82566A46051Q0485j9213K2154D9419K23563M6366J96224j35955I7971O01816
17443F99787C02633L4380J37061k27493J92110K9827j60847M9846E5833d8176
17432A94915H1537J81307K17632A0355K4683L74351A89275P2036j28505P3506
17422B06312Q9276L27099B44118J0408r1455K63197A47221M91081C11140J01769
$$ y = [188725, 194206, 54783, 100143, 96627, 206331, 397892, 252376, 275462, 238632, 290743, 234890, 46848, 402710, 92260, 10407, 36698, 228086, 323651, 619876, 445664, 46050, 70395, 92781, 370707, 319881, -168892, 304696, 470059, 165912, 352507, 56518, 333541, 264314, 6950, 221345, 160861, -132357, 39717, 86088, 507482, 117911, 289515, 482566, 146051, 226536, 207323, 229477, 49419, 272982, 319348, 515572, 379617, 97971, 699787, 302633, 337013, 474074, 246581, 438691, 468518, 307671, 357517, 55833, -48176, 194915, 81537, 262844, 480476, 10355, 35038, 409389, 189275, 261311, 132806, 206312, 295588, 622687, 244118, 254526, 163071, 426268, 147221, 638302, 311140, 412909]
17412D12909L16952j49621B61043L12833j55657A48900J61882j5204P2029G8605
17401A94875M5389J6595p7041h0273B61997j06059c843A50155L2314M358a24329
17389A90958p5018L21780c8962r1054A03530K7921f1281C50638A45191J77767
17379C22958j15578n9965G0224J35531J86913j90974J8758L52102A76347n4545
17369A21802J30662o6127J54697m4524o5119I1576O8867J8156o2911l1704J16200
17358B00184M8112J3516l1367L51713B64065g4292D74385G4555a62440B28823
17347A12267D5509K93022A25559m4825P5170C0521J46652J10523n6950q8415J50168
17336B92499O6151A76305J3280J18013n2400K8654f7285R523B27044c3999G6851
$$ y = [412909, 729861, 580240, 261043, 573876, 418219, 148900, 310782, 295578, 367607, 78605, 194875, 240264, 256859, 179818, -80273, 261997, 155938, -3843, 150155, 182469, 186827, -124329, 190958, 115940, 437720, -38962, -130016, 103530, 131451, -61281, 350638, 145191, 322958, 207380, 147415, 70224, 205755, 392668, 201694, 220452, 572554, 176347, 121802, 252464, 186337, 341034, 296510, 231391, 91576, 160443, 178599, 115688, 83984, 200184, 248296, 261812, 230445, 582158, 264065, -74292, 474385, 74555, -162440, 228823, 112267, 45509, 338531, 125559, 80734, 155904, 30521, 177173, 287696, 230746, 142331, 292499, 358650, 176305, 189585, 307598, 255198, 283852, -67285, -57762, 227044, -33999, 76851]
17324A9102L3401B2839J74141o4796K35663J09599H0983P8837K47083j92154I8814
17312C24280K78440k99967o500J003J797a05375A10011K0874r420J67990n6487
17301B32968E8712m357K39467I9272K44229A37201O17536A18318N4501J92685
17291C65504N080H8163K18192j49710J11913d8105H2562K73864j63443m1028K20184
17280C72139K4666j45947K87764k47192J44688g1306A52064K83454A70216d5203
17269C19695f81D71469J72810F7394L80037I8034a6793B18463k1968J74818I4660
17257B43650q7453b09298B8998H5K48882n2679E1294M05195I318j429P22561j85690
17245E44760k57143A03462L03155j62866J36881m6671K72529G4951K39192o9077
$$ y = [19102, 52503, 22839, 196980, 132184, 367847, 477446, 80983, 159820, 406903, 214749, 98814, 324280, 602720, 302753, 296253, 297256, 299053, -105375, 110011, 130885, 121465, 289455, 232968, 58712, 54355, 293822, 99272, 343501, 137201, 754737, 118318, 172819, 365504, 370584, 88163, 306355, 156645, 268558, -48105, 82562, 356426, 192983, 151955, 372139, 396805, 250858, 538622, 291430, 436118, -71306, 152064, 435518, 170216, -45203, 319695, -681, 471469, 644279, 67394, 447431, 98034, -16793, 218463, 196495, 371313, 94660, 243650, 156197, -209298, 28998, 85, 248967, 196288, 51294, 456489, 9318, 7889, 730450, 544760, 287617, 103462, 406617, 243751, 380632, 333961, 606490, 74951, 314143, 245066]
17235B45066A00585J97046Q9774J04488o3655Q9777r7681i042B54503J424J81551
17224D37478F437K60223j19631K08717a13728B63994G7542J41515J97840Q4159
17214E01056G1559M32840A34196J12361A19967J84059r0319J99352j27746R6492
17204C81805M16839l82609J31982k72638L64950C08311K24565B41560M35663l12862
17194C64361F9775O49172A69582J79989G1527J12617m0106J457L42110I0713N33417
17183F24130k27369j24468R0636J09877n1067J50811B06973o3528M0090m1498
17173A42037J45551M90662B08005I7862L01884J7952q3531n7224M6608J37652
17163D61203B21592M40373B93398L62936B15170J88763j97396K80353j4639k3693
$$ y = [245066, 100585, 297631, 387405, 491893, 428238, 518015, 420334, -9042, 254503, 255927, 437478, 6437, 266660, 147029, 355746, -113728, 263994, 77542, 219057, 416897, 501056, 71559, 504399, 134196, 246557, 119967, 304026, 213707, 413059, 285313, 381805, 798644, 416035, 548017, 275379, 640329, 308311, 532876, 241560, 677223, 364361, 69775, 718947, 169582, 349571, 71527, 184144, 144038, 145495, 487605, 90713, 624130, 396761, 272293, 362929, 472806, 421739, 572550, 206973, 143445, 183535, 142037, 287588, 778250, 208005, 97862, 399746, 417698, 334167, 276943, 323551, 461203, 221592, 661965, 293398, 656334, 215170, 403933, 206537, 486890, 472251, 448558]
17153D48558O4732L5256K49926k03682A95950q3889J36874L95521k39302K05641
17143F10795k95098J38422j063n1639J08930P0693B86745R3414P1798A92772K83709
17132D76481K3240L7008j67062K56961k49685K67347k05224k5612o850L9587K5412
17121D71603p9441L1474N7084r8280J22519A16514K86527L25426k60357j81613
17111B86497r345K51165j30006J81594j61940k2651P1497k22486L17436p705k09762
17100C44294K4597K75620B51541J24160K05512J14844k22281o040j7144J5954
17090D66546J9492J0448J15549j03521M6300j18844M2340J14710n5113j50769
17080C87138R7233J257R93o295O6041o3308j44886N16820l03594M9417j469J93039
$$ y = [448558, 513290, 548546, 798472, 594790, 195950, 112061, 248935, 644456, 405154, 610795, 315697, 454119, 453056, 401417, 510347, 581040, 286745, 380159, 451957, 192772, 476481, 499721, 536729, 369667, 626628, 376943, 644290, 439066, 413454, 406604, 446191, 471603, 392162, 423636, 480720, 382440, 504959, 116514, 403041, 728467, 468110, 286497, 277152, 528317, 398311, 579905, 417965, 395314, 466811, 244325, 561761, 554056, 344294, 368891, 644511, 251541, 375701, 581213, 696057, 473776, 467736, 450592, 466546, 486038, 496486, 612035, 508514, 554814, 435970, 478310, 593020, 537907, 387138, 484371, 485628, 486621, 480326, 546367, 483059, 338173, 854993, 551399, 600816, 599347, 792386]
17068G92386j49503j18518q1866J48350j74599K91957K07614j84970J49707C28258
17057H13187k33554M89150C97092J90087Q7184R284j46148J00350j68145J20466
17047E90170J79544j3361Q5525j37045O1889k07774K14132J44813j83644p4464
17037F59785K09957o2483k78427J08142L56482N08D25743L94328K22752m52006
17027E90817J27678Q529n2290L26224j94040J70549j14514k24274K54043k6692
17017H66030N5875L59541n00174J59788k70231J20545K48300j95748J6322n2724
17007H07524L38680k49000m2317J11179j36450L38959j26318p5451k9531J86571
16997A123846l8343n4867o3298k32286K82729j03735R079Q8354R7013l12767K20885
$$ y = [792386, 642883, 524365, 442499, 590849, 416250, 708207, 915821, 730851, 880558, 328258, 813187, 579633, 1068783, 397092, 587179, 674363, 683647, 537499, 637849, 469704, 590170, 769714, 756353, 841878, 704833, 766722, 558948, 773080, 917893, 734249, 659785, 869742, 807259, 528832, 636974, 993456, 993964, 425743, 820071, 1042823, 590817, 718495, 727024, 674734, 1000958, 806918, 977467, 862953, 638679, 892722, 866030, 921905, 1281446, 781272, 941060, 670829, 791374, 1039674, 843926, 860248, 807524, 1146204, 897204, 854887, 966066, 829616, 1168575, 1042257, 966806, 937275, 1123846, 1085503, 1030636, 967338, 735052, 1017781, 914046, 923125, 1011479, 1108492, 795725, 1016610]
16986A016610J00534l15193L72111j96079L2883K534r1695M67725m41597j63629
16976G84204K74676j16298J10311j37273P19100l15276J45978q0504m97941L90397
16966A277374Q5142r2502k38089M1299J63961L06220p9872m05933L92393k28225
16956A221768J90378L1524l73178N09402P8861j28156k35932K81998j29982J36752
16946A583435l26676L603K29278m0341J02664j83162L49924j10862j51278Q0559
16936A537144K56551j13024J27528n36035L93139j46671L15211k22170M87443
16927B099116k52921k747n34898O53548k04524J54079Q0118k70273L00037J249
16917B022784j39852M18719K7522k12700J15559N9346j76961k10286K40089j93842
$$ y = [1016610, 1117144, 801951, 1174062, 977983, 1010866, 1013400, 921705, 1389430, 947833, 784204, 1058880, 942582, 1052893, 915620, 1634720, 1319444, 1465422, 1384918, 886977, 1277374, 1362516, 1270014, 1031925, 1073224, 1237185, 1543405, 1463533, 1057600, 1449993, 1221768, 1412146, 1443670, 1070492, 1579894, 1658755, 1530599, 1294667, 1576665, 1446683, 1583435, 1256759, 1260362, 1489640, 1449299, 1551963, 1368801, 1718725, 1607863, 1456585, 1537144, 1793695, 1680671, 1808199, 1272164, 1665303, 1518632, 1833843, 1611673, 2099116, 1846195, 1843448, 1308550, 1962098, 1757574, 1911653, 1991771, 1721498, 2021535, 2022784, 1882932, 2301651, 2329173, 2116473, 2232032, 2291378, 2114417, 1904131, 2144220, 1950378]
16907A950378L66020n20069M05287j5889j60654M40321j75202L4383Q6658j8296
16897B392937J01272J08306j01736L8433J17871J91654l17033j01226l5213J91494
16887B586759L4691r2789M824M97388m831k64663J01844K11858j07181j18777
16877B849123J93308r8559L13924j19043n0573o1479j05914P14823l21431J43653
16867C457832r0358O5015J87172r4325K62021p212Q6743l29656L15584K19490
16857D072306j69924K18610j20721L81840k17471j3284Q5798m2332K37242K75002
16847D707066l78739O03259k62763J88954k74506J79119J30123O04135l53009
16838E143639L32276J69292j77161r6785L55707M2508L03102j48985M28518j24232
$$ y = [1950378, 2316398, 1796329, 2201616, 2185727, 2025073, 2465394, 2290192, 2324575, 2411233, 2392937, 2494209, 2602515, 2500779, 2539212, 2657083, 2848737, 2531704, 2430478, 2395265, 2586759, 2621450, 2528661, 2533485, 3030873, 3026042, 2761379, 2863223, 3075081, 2967900, 2849123, 3042431, 2943872, 3257796, 3138753, 3088180, 3026701, 2920787, 3635610, 3314179, 3457832, 3367474, 3432489, 3619661, 3525336, 3787357, 3780145, 3866888, 3537232, 3852816, 4072306, 3902382, 4120992, 4000271, 4382111, 4164640, 4151356, 4237154, 4194822, 4432064, 4707066, 4328327, 4931586, 4668823, 4857777, 4583271, 4762390, 4892513, 5496648, 5143639, 5475915, 5645207, 5468046, 5371261, 5726968, 5769476, 6072578, 5923593, 6352111, 6227879]
16828F227879N1684N8019P2934K94248m4932K60225q8303L19360J09148K06561
16818G466823J16036K17499P7152K76128M5550M32267L0518N65J62136P5924J50146
16807I050744M61847K98992j96783O25789q2921N59587J95760K40781L04154L7283
16797A1495233L67259Q5781N33170j72942O97482K73303M78117R5409O91822J82929
16787A4727563M74260M79882O21141J89617O08678M11294O51706N16560L54053
16778A9034754O44785L38933R19318N33408O94622O84066Q38735Q29997M36409
16769B4955027J146147P60548R09529R54206J007098J410844P47996J122733J559370
16760C4573498J186146J187208J521960J756117J359868J627337J899689J581404
$$ y = [6227879, 6279563, 6337582, 6410516, 6704764, 6659832, 6920057, 6831754, 7151114, 7260262, 7466823, 7582859, 7800358, 7877510, 8153638, 8199188, 8631455, 8661973, 8662538, 8824674, 8900598, 9050744, 9512591, 9811583, 9614800, 10240589, 10157668, 10717255, 10913015, 11153796, 11457950, 11495233, 11862492, 11948273, 12481443, 12308501, 13005983, 13279286, 13757403, 13852812, 14544634, 14727563, 15201823, 15681705, 16302846, 16492463, 17101141, 17512435, 18164141, 18680701, 19034754, 19679539, 20018472, 20937790, 21471198, 22165820, 22849886, 23688621, 24518618, 24955027, 26101174, 26861722, 27771251, 28725457, 29732555, 31143399, 31891395, 33014128, 34573498, 35759644, 36946852, 38468812, 40224929, 41584797, 43212134, 45111823, 46693227]
16752D6693227K047698K148142K213891K263113K333971K143463L011332K233189
16744F5088026K953961K868464L040913L293482L142307L289842L457241L689068
16736I0823304L257273L683214L843495L470184L525320L396832L117922L492518
16728A18610062K830547K619384K480947J959073J686935J325123Q96924K93651
16720A32702646m3923l43814j219922j280310j822762k410773k317380l085369
16712A20178393k836191l635070k972172l621037l459804l503119m001910l522555
16704I2626535l582417l339827l868973l126957l036297l358516k935632k921813
16696F6456103k931899k393203k406863k339442k495919k257283k243441j825518
$$ y = [46693227, 48740925, 50889067, 53102958, 55366071, 57700042, 59843505, 62854837, 65088026, 68041987, 70910451, 73951364, 77244846, 80387153, 83676995, 87134236, 90823304, 94080577, 97763791, 101607286, 105077470, 108602790, 111999622, 115117544, 118610062, 121440609, 124059993, 126540940, 128500013, 130186948, 131512071, 132408995, 132702646, 132658723, 132314909, 131094987, 129814677, 127991915, 125581142, 123263762, 120178393, 117342202, 113707132, 110734960, 107113923, 103654119, 100151000, 96149090, 92626535, 89044118, 85704291, 81835318, 78708361, 75672064, 72313548, 69377916, 66456103, 63524204, 61131001, 58724138, 56384696, 53888777, 51631494, 49388053, 47562535]
16688D7562535j806258j734134j402965k124364j489587j339075j637105j317629
16680C4711418j082264r90735j494773r24754j245725r84911q85714j089729r10653
16671B5102160o32727o61916q05197r86235p04434q09733n85452o50084m13372
16662A8853010l78010n90225o65478n48569n04765l45439k85711n05762n02188
16653A4526863k75832m49675l62645l75207k91971k66614m28443j70880k13431
16644A1692165n94708K69130l86417k73634l04445j83171n29276Q4943l65394
16635I409193n96782Q1656n0469k36058j65579L59633p45546l00773J4164j37825
16625G631614O2810o51515L9873j63981J21428k25769k14144j03582l79104L11755
$$ y = [47562535, 45756277, 44022143, 42619178, 40494814, 39005227, 37666152, 36029047, 34711418, 33629154, 32638419, 31143646, 30218892, 28973167, 27988256, 27102542, 26012813, 25102160, 24469433, 23807517, 23002320, 22016085, 21311651, 20501918, 19916466, 19266382, 18853010, 18475000, 17884775, 17219297, 16670728, 16165963, 15820524, 15534813, 15029051, 14526863, 14251031, 13801356, 13438711, 13063504, 12771533, 12504919, 12076476, 11905596, 11692165, 11097457, 11366587, 10980170, 10706536, 10402091, 10218920, 9689644, 9774587, 9409193, 8812411, 8894067, 8843598, 8607540, 8441961, 8801594, 8056048, 7755275, 7769439, 7631614, 7694424, 7042909, 7082782, 6918801, 7040229, 6814460, 6600316, 6496734, 6117630, 6429385]
16615F429385o6160k22216m03226m2599J19815m4494m5734l28673j21678n2450
16605E221970k57709K2961k04101K40549j10803m24872L51483k88907j11561m0252
16595D398758m1309k23070l1842N3257r6431j23579J7852n4166k76590K05816
16585C828696K7331m26121P5552K88061k96531k5955q0480q3940M6731j67348
16575C185996N7192O0789k38814K46089k95066K88362k38225m8005j98588Q5956
16565B905686K1177O9091j45188j3407J03688n63806M79276m83000J63188k7529
16555B509176K30960o51627L41066j31905j29339K10387l19851K98924N2421j36887
16545B273325n020J5734q9773r5578J77400j22307J84103p3812k00667K6578j28421
$$ y = [6429385, 6363225, 6141009, 5737783, 5695184, 5814999, 5770505, 5724771, 5396098, 5274420, 5221970, 4964261, 4987222, 4783121, 5023670, 4912867, 4487995, 4839478, 4550571, 4439010, 4398758, 4357449, 4134379, 4102537, 4155794, 4059363, 3935784, 3953636, 3899470, 3622880, 3828696, 3856027, 3429906, 3505458, 3793519, 3496988, 3471033, 3390553, 3306613, 3353344, 3185996, 3243188, 3303977, 3065163, 3311252, 3016186, 3304548, 3066323, 3018318, 2819730, 2905686, 2926863, 2995954, 2850766, 2837359, 2941047, 2377241, 2856517, 2373517, 2536705, 2509176, 2740136, 2088509, 2429575, 2297670, 2168331, 2378718, 2058867, 2357791, 2410212, 2273325, 2268305, 2284039, 2194266, 2098688, 2276088, 2153781, 2337884, 2264072, 2063405, 2089983, 1961562]
16534A961562L868j15718N6320J06300o4609m7009L2259Q9067j06749j54208K37763
16523A998846l26987K7004R9973N36o0847k18427K83699l16799k19266L18335
16513A586067j266m6034Q7436k02232L2821L99816o8416k18267l04265K36839
16503A502499j14958j84656K02502J8708J15698j90079j3512o8955J01808k10614
16493A158441L40108k86177j03330J03995P0996q9539L6853Q2576j54722K92996
16483A452197m48536O49993l99441j8143k2620j95424k0907J13925R1006j07674
16473A094376m1145j6885R7495j01733J69257k40093L74694n71678L66812M3726
16463A174826k10961N5132m3894K52286n09982M0714L57587l42754j92575K51007
$$ y = [1961562, 1965430, 1849712, 1906032, 2012332, 1947723, 1900714, 1932973, 2022040, 1915291, 1761083, 1998846, 1671859, 1698863, 1798836, 1799372, 1738525, 1520098, 1803797, 1486998, 1267732, 1586067, 1584801, 1538767, 1626203, 1423971, 1456792, 1856608, 1788192, 1569925, 1265660, 1502499, 1387541, 1202885, 1405387, 1424095, 1539793, 1349714, 1336202, 1267247, 1369055, 1158441, 1498549, 1212372, 1109042, 1213037, 1284033, 1194494, 1231347, 1313923, 1159201, 1452197, 1003661, 1653654, 1254213, 1236070, 1213450, 1018026, 997119, 1111044, 1202050, 1094376, 1053231, 1036346, 1133841, 1032108, 1201365, 961272, 1335966, 764288, 1131100, 1174826, 963865, 1018997, 975103, 1227389, 717407, 758121, 1115708, 772954, 580379, 831386]
16453H31386K44460R1331m59769k07831P5822L25700j49759K28796l53779j7514
16443F08843j2341K79477l0279L6280q1927M64539F13880N6652K0390J87439K22310
16432A100671C57304O45883r7616J24801l25370K9931j32300q9188O56303E55132
16421H25229k62117N02084m8049l49823l7397N4927j19406L841M2030k3356K07778
16410G95741k64938P0512J02222j43139M03866l44579K36002L3290j88776k21290
16400D78911J42790J14882j75606j10964L70875k83199R0539k8522K20417k67374
16390E52749O1509k60169L66338p7729B65155N67278k64903J42742k94546P3365
16380D89091M85470l85930p5851J02760j48443L01894C07235k2122K44356J22191
$$ y = [831386, 1075846, 1167177, 707408, 499577, 575399, 901099, 751340, 980136, 626357, 608843, 596502, 875979, 845700, 881980, 800053, 1264592, 613880, 670532, 690922, 878361, 1100671, 357304, 1003187, 905571, 1030372, 705002, 734933, 602633, 513445, 1169748, 555132, 825229, 563112, 1065196, 1017147, 667324, 629927, 684854, 565448, 569289, 611319, 587963, 795741, 530803, 601315, 703537, 560398, 964264, 619685, 855687, 888977, 700201, 478911, 621701, 736583, 560977, 450013, 820888, 537689, 628228, 599706, 820123, 552749, 614258, 354089, 720427, 642698, 265155, 832433, 567530, 710272, 415726, 489091, 974561, 588631, 512780, 615540, 467097, 768991, 307235, 285113, 529469, 651660]
16370F51660j73902K53087l13233K595J82887O5326l1064k48601K04776q145Q8226
16359F73612k8830k7542A95464R884M45920j65224O7083n5852J54239j60630o9995
16348D20889K2942K26404A71962J47020j48002K43313J00327j76896K41731B85175
16337C66082K21571k34890j54557N35710B31805L59511L7359j34357A62873L03347
16327D66220J45728j31614q0414H9117K84204n9352J11834l9152j24709L15013
16317E76955B19237J32352J45016q1961o3655K07959A89607L53772A17638K72347
16307C89985p1712M48210a70193D32496o1006Q2357j77041L2559J76759A51193
16296C26237K4169M5190A86198m6062K16239j72039l0382J59718L7581I2901L01132
$$ y = [651660, 477758, 730845, 417612, 420207, 603094, 668420, 637356, 388755, 593531, 585386, 673612, 644782, 617240, 195464, 205348, 651268, 486044, 553127, 497275, 651514, 490884, 420889, 443831, 670235, 171962, 318982, 170980, 414293, 514620, 337724, 579455, 285175, 366082, 587653, 352763, 198206, 733916, 231805, 591316, 628675, 494318, 162873, 466220, 611948, 480334, 399920, 89117, 373321, 313969, 425803, 386651, 261942, 576955, 219237, 351589, 496605, 414644, 350989, 558948, 189607, 543379, 117638, 389985, 318273, 766483, -170193, 432496, 371490, 453847, 276806, 309365, 486124, 151193, 326237, 350406, 395596, 186198, 140136, 356375, 184336, 153954, 313672, 351253, 92901, 394033]
16285C94033D2829L59052j84767M09275J80057C01953j423J86693k16581J04854
16275C75496j18838N4962j8913r5675q4981L58114A39016L1064K5361Q6258K5380
16264C07079M7351A9670P946K41737O8041A20453k025J97909f7425D56937j81326
16253B75611j07724j4768M34554k88185l3325L2421J26060M9412j83570J07433
16243C97919k799o1407J97861B46740P0560K4915A27131K46274J52639A81905
16232C86142a3183A30578J20331b3466A62258J79826K9090A66439K81805I0471
16221A40302e4315D22582J16782I8444L13297A39344L01436A02415K98344A45865
16210A72389p6801a67114p3505A99944q4808n337J70801I1264J10793R6744I2472
$$ y = [394033, 42829, 401881, 217114, 626389, 806446, 301953, 300530, 487223, 270642, 375496, 256658, 311620, 292707, 197032, 112051, 470165, 139016, 170080, 195441, 281699, 307079, 354430, 19670, 27616, 269353, 337394, 120453, 118428, 316337, -67425, 456937, 275611, 167887, 153119, 587673, 299488, 266163, 298584, 424644, 474056, 290486, 397919, 395120, 333713, 531574, 246740, 317300, 342215, 127131, 373405, 526044, 181905, 386142, -13183, 130578, 250909, -23466, 162258, 342084, 371174, 166439, 448244, 90471, 140302, -54315, 422582, 539364, 98444, 411741, 139344, 440780, 102415, 400759, 145865, 172389, 95588, -167114, -240619, 199944, 115136, 109799, 280600, 91264, 202057, 298801, 92472]
16198A31893k0122e1701A9313O2162L81795j07836P6136A83221F2670M06225a941
16186a32946C62970j76464q6452m9928K03634n8198J4050K90643d4998N085A24043
16174C2277J11139d39325G7596k2820a25165B57698b1972k6839B5595a39995A83389
16162e1993B31167c7242C16572n6501m2950J09995k0486D2472J8304b0011j89229
16151b09240D55297j95614B7066L00832c9111C44110b61225B41769a47275n9772
16141b07047j6833A93412H8830b42459A51902B2449a84713b2104B4807K17546
16131B42353b7629F7542J44740I7257a13305k4563B67261j16226p0268e7091G1863
16119A58998c442l9579j4252m5880I3245a00704o0184B4265J25252l7679b1213
$$ y = [131893, 111771, -51701, 19313, 81475, 463270, 355434, 431570, 183221, 62670, 468895, -1941, -132946, 362970, 186506, 100054, 50126, 253760, 195562, 209612, 500255, -44998, -39913, 124043, 32277, 143416, -439325, 77596, 54776, -125165, 257698, -21972, -48811, 25595, -139995, 183389, -51993, 231167, -37242, 316572, 260071, 217121, 327116, 306630, 42472, 60776, -20011, -209240, 455297, 259683, 27066, 327898, -39111, 344110, -261225, 241769, -147275, -207047, -223880, 193412, 88830, -242459, 151902, 22449, -184713, -22104, 24807, 242353, -27629, 67542, 212282, 97257, -113305, -137868, 267261, 151035, 80767, -57091, 71863, 158998, -3442, -43021, -57273, -103153, 93245, -100704, -160888, 24265, 149517, 111838, -21213]
16107A2660B134J18500J58718N0000E9623a03767c9012H953K00257l5563i2579
16095b0891f865B89381L4270A32022J47128D6485j0077O0296h7744n050B39494
16083e6425C54466h3375A6281J38820J36178A12627K79604A20839J34820a05538
16072a15723B64056D8794e0105B31401b5575C62403j58627q2565J95269A36756
16061h8113B4850c2427E7524N314a00119D0794J05774J05989m7756d04432a03126
16049a01032A00285K13766D3102J62052r4532n2468d2215r788M220A42765P6760
16038B19525k1455h2286B8567K18991r2212K0625P9285b15245D20977B00741g5481
16026b8345j25038O3698A84634p2227a11588E6395J29949q2035a79560h1705j47874
$$ y = [12660, 2134, 120634, 279352, 329352, 59623, -103767, -39012, 8953, 209210, 173647, -92579, -20891, -6865, 289381, 323651, 132022, 279150, 46485, 36408, 96704, -87744, -92794, 239494, -56425, 354466, -83375, 16281, 155101, 291279, 112627, 392231, 120839, 255659, -105538, -115723, 264056, 48794, -50105, 231401, -25575, 362403, 203776, 121211, 316480, 136756, -88113, 24850, -32427, 57524, 62838, -100119, 40794, 146568, 252557, 204801, -404432, -103126, -101032, 100285, 314051, 43102, 205154, 110622, 58154, -42215, -52003, -47783, 142765, 219525, 198070, -82286, 28567, 247558, 155346, 175971, 255256, -215245, 420977, 200741, -75481, -28345, -153383, -89685, 184634, 112407, -111588, 56395, 186344, 104309, -179560, -81705, -229579]
16015b29579H3219Q361O780a08699p2248f3588F2812A6237e6845A38133B8905
16003a05662J453G5109b321n6074C37234a9043C21420a4133j23416B2652Q207
15992C0859K26211o4150c00216a36347A64665J34990G1596L1505c93714A24277
15981C1590L98075M0674J68883j24814k15294K04263B50732j21366M1162a03511
15970B0734r900b97146c121C11745E3744P4659c5527G2714l4736e8261b6461j00537
15958a26998A8222K4959o702J36809e4454A87366b83028G3900R363k5551a03749
15946A12328J82737A18101K83224b24767B06500f5649a8353j01703C89141c6632
15935A3770J4648K4151c18456h7577E4019L32330i6006a8524A25016a57358j26648
$$ y = [-229579, 83219, 91580, 98360, -108699, -180947, -63588, 62812, 16237, -56845, 138133, 28905, -105662, -104209, 75109, -2321, -58395, 337234, -19043, 321420, -14133, -137549, 22652, 30859, 257070, 192920, -300216, -136347, 164665, 299655, 71596, 103101, -393714, 124277, 31590, 429665, 470339, 639222, 514408, 299114, 503377, 250732, 129366, 170528, -103511, 20734, 10834, -297146, -3121, 311745, 53744, 128403, -35527, 72714, 37978, -58261, -26461, -126998, 18222, 43181, 36479, 173288, -54454, 187366, -283028, 73900, 83263, 57712, -103749, 112328, 295065, 118101, 401325, -224767, 206500, -65649, -18353, -120056, 389141, -36632, 13770, 28418, 52569, -318456, -87577, 54019, 386349, -96006, -18524, 125016, -157358, -284006]
15924b84006a29474K6539a8000j51096A14866n6476b04068e1738j24501J028a1397
15912H8804a5230B08366n4116n6253a9257o2555k10040B12148c23483Q2644L4789
15901b06050f1524k48371E5256l367L41724a0031F0592d9221j20615A64955Q4812
15890B49767r9748a09984H913e3677A19028b0600I5873b7697A6405a19776j01243
15879b21019C740J71579a45240E8397h2463q4598n0053K9928I7733J9515b25584
15867a28359A795L28196a22010M1523A01912o114J33823K14330f7081j50140J5376
15856b01845B41319a15064b05D9757c09308a40513N179A0309J5281e26939J67288
15845c59651a24718r9165J1071a3651A6533b5781A58795a71795L8653N9118B30505
$$ y = [-284006, -129474, -102935, -18000, -169096, 114866, 58390, -204068, -51738, -176239, -175211, -11397, 88804, -15230, 208366, 154250, 97997, -19257, -81812, -291852, 212148, -323483, -240839, -206050, -61524, -309895, 55256, 51889, 393613, -10031, 60592, -49221, -169836, 164955, 249767, 150019, -109984, 8913, -53677, 119028, -20600, 95873, -27697, 16405, -119776, -221019, 3740, 175319, -145240, 58397, -82463, -167061, -217114, -187186, 97733, 117248, -225584, -128359, 1795, 329991, -122010, -80487, 101912, 95798, 229621, 443951, -67081, -217221, -201845, 241319, -115064, -205, 49757, -309308, -140513, -135334, 10309, 25590, -526939, -359651, -124718, -223883, -212812, -13651, 16533, -25781, 158795, -171795, -133142, -74024, 230505]
15833B39899j05101b92645k9570J56082E0607c05008D6885H268a71463e7072E7883
15821D07503c798q0881A76706q5604c74305l1561a21507N4396B88518g8393j35457
15810b13850f5512j51984b1696I3367c75980a48214b2352G2687L4691c82109b5676
15798h4497a6357l4024A23292a02070a5959j64535b9057k6263A09342R4797d0614
15786a12551M8318A13712g2571D0636g632j17426l03883I3600b16096d3478C10677
15774F1507K6335b06667A39093a12416F1988M6216j3969d7383m379G6470g1331
15762B2092b46644J22160d6921l69001E8346L976a23119g827m5119B76952q6555
15751A90397a66997g8117A49940b54729d8793k18768c6951E943a38635j79853
$$ y = [239899, 134798, -292645, -322215, -166133, 50607, -305008, 46885, 8268, -171463, -57072, 57883, 407503, -3798, -84679, 176706, 91102, -374305, -405866, -121507, -67111, 288518, -78393, -213850, -65512, -217496, -21696, 93367, -375980, -148214, -22352, 72687, 107378, -382109, -25676, -84497, -16357, -50381, 123292, -102070, -15959, -180494, -29057, -55320, 109342, 204139, -40614, -112551, -64233, 113712, -72571, 40636, -7632, -125058, -428941, 93600, -216096, -43478, 310677, 61507, 87842, -206667, 139093, -112416, 61988, 108204, 94235, -47383, -51762, 76470, -71331, 22092, -246644, -124484, -46921, -415922, 58346, 62322, -123119, -7827, -52946, 276952, 190397, -166997, -78117, 149940, -254729, -48793, -267561, -36951, 5943, -138635, -318488]
15741c18488l2490F9765d78042B80418a1904j62283G146Q8755h4314o9343j62660
15730c16317q7418i3299B027c49136O3089R1189Q8671N991j9247A57519d9452
15718B16383E9023b8120G5434b4098A11030d20354a87986A84971B7334g2984l2662
15707a05646A14095J20911n5084b05676c8628q196j95083j13710i3686A43404
15696A28967b80266H7120c4938H1215J5695b04695d0635l31911F1203c08918N8610
15685b50308j78D01961A2301K91824c85945B78284G4322b44489b1276D9284g0615
15673a46753A56288M9720C4790i2775A64074D8409Q5395a33185H3664k5423a298
15661c87794Q7621c3298B34592a25564f531J547B9456a31213j43393L8841f4752
$$ y = [-318488, -350978, 69765, -478042, 280418, -11904, -174187, 7146, 95901, -84314, -153657, -316317, -403735, -93299, 2027, -349136, -286047, -194858, -106187, -100196, -119443, 157519, -49452, 216383, 59023, -28120, 75434, -24098, 111030, -420354, -187986, 184971, 27334, -72984, -105646, 114095, 235006, 179922, -205676, -38628, -46824, -241907, -355617, -93686, 143404, 128967, -280266, 87120, -34938, 81215, 96910, -204695, -40635, -372546, 61203, -308918, -250308, -250486, 401961, 12301, 304125, -385945, 278284, 74322, -244489, -21276, 49284, -70615, -146753, 156288, 206008, 34790, -92775, 164074, 48409, 133804, -133185, 83664, 58241, -1298, -387794, -300173, -33298, 234592, -125564, -6531, -4984, 29456, -131213, -274606, -235765, -64752]
15649A49331a3872C14002d19984M9809f2302a4059k40813F8863Q0766a1435q1126
15638i2561F624e3363A39494a23879A79104b45217A76982E3153d5251A2868N1788
15627F4656N9420c89406i6727L8378n9721A22649h2511l06712A36214d8467a4088
15615A19901e5338j55204e5587a7103p5649A4382a16822k18535A07506a15622
15604a94786P8289r229G0083b09522C6502P1039a7014j26415c2693e799n228C0018
15591a1445A9755f2745j84779B49010b86551a20644B30199a33906a8322q5680
15581a04002q5706Q8051C7064Q4226n1167i6974A06035a62812A58170a28030a5023
15569I3439a13825G2798Q5975a94742A40446J02315g8128p8790j52728C8842J01549
$$ y = [149331, -13872, 314002, -419984, -370175, -62302, -14059, -254872, 68863, 149629, -11435, -92561, 6624, -53363, 139494, -123879, 179104, -245217, 176982, 53153, -45251, 12868, 64656, 124076, -389406, -96727, -58349, -118070, 122649, -82511, -389223, 136214, -48467, -14088, 119901, -55338, -210542, -55587, -17103, -92752, 14382, -116822, -335357, 107506, -115622, -194786, -116497, -125726, 70083, -209522, 36502, 107541, -17014, -143429, -32693, -5799, -11027, 30018, -11445, 19755, -62745, -247524, 249010, -286551, -120644, 230199, -133906, -18322, -104002, -189708, -101657, 37064, 121290, 70123, -96974, 106035, -162812, 158170, -128030, -15023, 93439, -113825, 72798, 158773, -194742, 140446, 242761, -78128, -156918, -309646, 38842, 140391]
15558A40391a04617K4935G3273K8803J79334j39256A0790J07259e4151I7429j4619
15547H2810M20316g0094B89518b2784j42865E3686J20552p370m3955J31831g7201
15535E9812B2192J60319q0774L2247a16410B89605a56762A27851a54686A56058
15524a23509L5482A12903j7270b35853e5294b4157C25805A62571L51067A44328
15513a1637D70086b49720B56769E625a54306A77816d4889D2755b37628h5245n0814
15502a36059l54452O1806B84913B9300J14251A0002a18477J3171D5942K4228M2728
15491A12898a90147E1140J11978c73911c2501I8080f5590j65570b7818B87302
15480a119j1109A10138c29024A75290a09676G0305b7065H3605Q1789G8646K81722
$$ y = [140391, -104617, -79682, 73273, 102076, 281410, 142154, 10790, 118049, -54151, 97429, 82810, 503126, -70094, 289518, -22784, -165649, 53686, 174238, 166868, 122913, 254744, -77201, 59812, 22192, 182511, 101737, 133984, -116410, 289605, -156762, 127851, -154686, 156058, -123509, -88027, 112903, 95633, -235853, -55294, -24157, 325805, 162571, 513638, 144328, -11637, 470086, -249720, 256769, 5625, -154306, 177816, -44889, 42755, -237628, -85245, -136059, -490511, -428705, 284913, 29300, 143551, 10002, -118477, -105306, 45942, 70170, 112898, -190147, 51140, 163118, -373911, -32501, 98080, -65590, -231160, -27818, 287302, -1119, -12228, 110138, -329024, 175290, -109676, 70305, -27065, 83605, 165394, 78646, 360368]
15469C60368F9938b68899A92345c42643B45364a50784e6761B26002D9996b31335
15458D6286L3461A049J79460P631R0800b2049A0208b56913a14842o6239g908j0738
15446a8646p7087C3650L28184A36846a40497F5978L28199j38347q6165p0285K11474
15435C10854a31215A47979L86932F4240J48499q8452J05313j09839n8807P6074
15425A37028c11421H7071a8811B38512b0945o7399B16006b25925J6134J8097k68006
15414d59700G6008c00890E9996L2984c20317i7363C00921b03391A36629a62452
15403a0903H8794b58490C81529a04744j23678A82992e50754C27952g0010j0167
15393h0177A04386h0177K508j18384d3822F23381b76912D40811A05497a30467
$$ y = [360368, 69938, -268899, 192345, -342643, 245364, -150784, -56761, 226002, 49996, -231335, 46286, 79747, 1049, 180509, 188140, 278940, -22049, 10208, -256913, -114842, -181081, -7908, -18646, -95733, 33650, 361834, 136846, -140497, 65978, 394177, 255830, 169665, 99380, 310854, -131215, 147979, 534911, 64240, 212739, 124287, 229600, 119761, 60954, 137028, -311421, 87071, -18811, 238512, -20945, -88344, 216006, -225925, -209791, -191694, -459700, 76008, -300890, 59996, 92980, -320317, -97363, 300921, -203391, 136629, -162452, -10903, 88794, -258490, 381529, -104744, -228422, 182992, -550754, 327952, -70010, -80177, 104386, -80177, -77669, -196053, -43822, 623381, -276912, 440811, 105497, -130467]
15382E5893a40131d8103B9994a97993m1986i3915A6566d5294a2973A85799e3855
15370a81150B62822C5907R0317b11270c6227k11259a6219B56449b4805G9741J92569
15359B72310R2902g1377B97150a77895E8901K55603a12671G9399J27342A5765
15348f1925G2851f7927B68922J4662F4763b75439B26441r8298D0198a56863A31807
15336C4368K07553a28924A91279b23563K4410C21392F7045e920C0660J34490J31395
15325B96545F7838k0383P9605a48093B9356a53235D7211K42086O0064A20022K8674
15314A48696c4127B07844r3780K33375p5038d7497B3954J39441a58075j86252
15304c44327c0626j56441C4716a07944G446e5549l7364q6640o6529J9731A36130
$$ y = [55893, -140131, -48103, 29994, -197993, -239979, -93915, 16566, -45294, -12973, 185799, -53855, -181150, 262822, 35907, 126224, -211270, -36227, -247486, -16219, 256449, -24805, 79741, 272310, 365212, -71377, 297150, -177895, 58901, 314504, -112671, 79399, 206741, 15765, -61925, 72851, -67927, 268922, 283584, 64763, -275439, 226441, 128143, 40198, -156863, 131807, 34368, 241921, -128924, 191279, -223563, -199153, 321392, 67045, -5920, 30660, 165150, 296545, 67838, 47455, 127060, -148093, 29356, -153235, 47211, 289297, 349361, 120022, 148696, -34127, 207844, 114064, 347439, 272401, -47497, 23954, 163395, -158075, -344327, -30626, -187067, 34716, -107944, 7446, -55549, -92913, -179553, -246082, -226351, 136130]
15292a1810A42342b11379B67534J4331a5246A90188b36159h3977M569G5895a53151
15280B75235J56699a4425l2711j04484G2026B0009b4252A82008d913C26144B7991
15268c5983A59147c64643D3260c0625q8429I4058N8356A0685K38428J05022C9733
15256B64523i4306B15859p8956d8938j23525p865A40541a07307k9292B97297a36071
15244A36249B5200b08753c0344A46214N0699N02787L98770J695641r13332j72005
15234A708774J645064A257497D42025E9822K54613F6989J75497g106H5317J83220
15224B68537j07295J9021b60826b6398A23790h7418H3865c1964r0518B29029K03074
15213D32103a54933A92299a73147A87146J16705D8832i6171B89422J90766I7092
$$ y = [-11810, 142342, -211379, 267534, 281865, -15246, 190188, -236159, -83977, -79408, 75895, -153151, 275235, 431934, -14425, -47136, -151620, 72026, 20009, -24252, 182008, -4913, 326144, 27991, -35983, 159147, -364643, 43260, -30625, -119054, 94058, 152414, 10685, 249113, 354135, 39733, 264523, -94306, 215859, 136903, -48938, -172463, -180328, 140541, -107307, -136599, 297297, -136071, 136249, 25200, -208753, -30344, 146214, 196913, 699700, 1098470, 2794111, 1880779, 1708774, 3353838, 1257497, 442025, 59822, 314435, 66989, 242486, -7106, 85317, 268537, 161242, 180263, -260826, -26398, 123790, -87418, 83865, -31964, -122482, 229029, 432103, -154933, 192299, -173147, 187146, 303851, 48832, -96171, 289422, 480188, 97092]
15202D7992J44890A8934e5418C28203A09370b24256L4873F4930J21807B3486a90630
15190A14261B3996R2965J93849K5898h3681A94453g7582A65409l5570B3922K86858
15179C10780A38450g0349C21660e3617A12612h6555C04784g5349j95890a08785
15168G189N81385c24779B77180J4472h3790j6002D7358J53494k7776h3614B75948
15156B3834R6209n9325J49368a15972M3869H9326R0462J30082F5815k1785H359
15144B56243A13787l6537C5557K32136C7704R2657L5894J69981K286C4307J57657
15133A91964L23700F9900a17886B49530J11541H2512K16477d0646B99091j16975
15123A82116o8136l501O85J0386J17843F7096b99267D7235K90137A17772o060
$$ y = [47992, 192882, 18934, -55418, 328203, 109370, -224256, -189383, 64930, 186737, 23486, -190630, 114261, 23996, 116961, 310810, 336708, -83681, 194453, -77582, 165409, 129839, 23922, 310780, 138450, -70349, 321660, -53617, 112612, -86555, 304784, -75349, -271239, -108785, 7189, 588574, -324779, 277180, 291652, -83790, -99792, 47358, 200852, 173076, -83614, 275948, 23834, 120043, 60718, 210086, -115972, -72103, 89326, 179788, 309870, 65815, 44030, 8359, 256243, 113787, 77250, 35557, 267693, 37704, 130361, 166255, 336236, 338522, 34307, 191964, 515664, 69900, -117886, 249530, 361071, 82512, 298989, -40646, 299091, 182116, 113980, 110479, 111164, 121550, 239393, 67096, -299267, 47235, 337372, 117772, 111712]
15112A11712a831E08062K4453J77089B2666K66980p5681D6045A4888a404B93933
15100A63507J65940b02339B24877g6958m1958b6302k17689h1848F9400J4365k9624
15089E4141b2334h327F6266A292J17279a62646A5527K65605A22729J69828J26802
15078D19359j15255m2775K12443B0546b59839B79595l2417p032A00435b38625
15067H3579H53c462E5392J12263K76390h1026G0079R1316D0474I025M7550J28622
15055A85197m0715j5153l6588R2274j4537N3650p2526R5682a28754C7295M0944
15044G8239J9873O4582J90970a43387A41196l2428K27106J57456A70631a25286
15033A41109N2408e6279B58543O9930O2759o6843M11145G9490J8309L65711j49212
$$ y = [111712, -1831, 508062, 532515, 709604, 22666, 289646, 213965, 46045, 14888, -1404, 293933, 163507, 329447, -202339, 224877, -76958, -118916, -26302, -243991, -81848, 69400, 83765, 54141, -22334, -8327, 66266, 1292, 118571, -162646, 15527, 281132, 122729, 292557, 419359, 304104, 261329, 473772, 20546, -259839, 279595, 247178, 240146, 100435, -238625, 83579, 853, -3462, 55392, 167655, 444045, -81026, 70079, 161395, 40474, 9025, 56575, 185197, 144482, 129329, 92741, 185015, 170478, 224128, 151602, 247284, -128754, 37295, 78239, 98112, 162694, 353664, -143387, 141196, 108768, 335874, 493330, 170631, -125286, 141109, 193517, -56279, 258543, 328473, 391232, 324389, 735534, 79490, 97799, 463510, 314298]
15022C14298c0739B99998j28211K4095M3690J74638A69129M08031K1843B27648
15011B24866L39923I401M68226A72945J96399a51651i859B05895F5901R2180P7565
15000B35646c1261B53093A7510M01866k4878J69298j95835J9019j72713m0254
14990A74013O1739J19560n1932J56083J03837B62019p5981C0171L11737J96904
14980E38812J5218k34589j19752d807H14831A68253N8049E5876K07570K02273
14970D65719q0594g7380C10067K2376q9335J05344l9889C3257N1305K21617A46326
14958B69714q6324c1230C73722h3794G9284K95086A78764J2494D8387K3427P0944
14947A42758L60502j43863j42422K02997E3140L73995n4633E2520N86805A46372
$$ y = [314298, -30739, 299998, 171787, 195882, 239572, 414210, 169129, 577160, 599003, 227648, 224866, 564789, 9401, 477627, 172945, 369344, -151651, -9859, 205895, 65901, 158081, 235646, -31261, 253093, 17510, 419376, 394498, 563796, 367961, 386980, 214267, 174013, 235752, 355312, 303380, 459463, 563300, 262019, 186038, 30171, 341908, 538812, 554030, 319441, 199689, -4807, 814831, 168253, 226302, 55876, 263446, 465719, 385125, -77380, 310067, 332443, 243108, 348452, 308563, 33257, 84562, 306179, 146326, 269714, 183390, -31230, 373722, -83794, 79284, 374370, 178764, 191258, 48387, 71814, 142758, 503260, 359397, 216975, 419972, 53140, 427135, 372502, 52520, 639325, 146372]
14936G5506K10688J91973j85118I1646J52822l37j6596K91810j64020L82435C38233
14924C38542K52728j08146j97413L03144K23913j67320L98372o2733j40872R0099
14914I30314j63641N016j44245j85192R2349j37415P1295B31748K25407q156j48393
14903C00606M5704P2442K00598A60516K16168E3784M81656Q3866j45397m43j52984
14892C20482j32586L81440k47251I6001L27460J303Q6428A24452M73346j33148
14882D64650J37882j23619M1712q8049L20663l33729L34564k37834j72835O1608
14872D05013n8831e6127C94524O5530p1562O2657r7841M8065j59610J43998Q3187
14861D68948A30593L23994L67847I0815M09989B46384K27633B26631L703Q5742
$$ y = [75506, 286194, 478167, 293049, 91646, 244468, 244131, 227535, 519345, 355325, 737760, 338233, 338542, 591270, 483124, 285711, 588855, 812768, 645448, 1043820, 981087, 840215, 930314, 766673, 771689, 627444, 442252, 534601, 397186, 468481, 231748, 457155, 448999, 300606, 346310, 418752, 619350, 160516, 376684, 53784, 535440, 619306, 473909, 473466, 320482, 187896, 569336, 322085, 96001, 423461, 424764, 511192, 124452, 597798, 464650, 602532, 478913, 520625, 432576, 753239, 419510, 754074, 516240, 343405, 405013, 346182, -56127, 394524, 460054, 388492, 451149, 353308, 401373, 241763, 385761, 468948, 130593, 454587, 822434, 90815, 500804, 246384, 474017, 226631, 230334, 316076]
14851C16076j57910M43203B98846j42762o8191K1051J54681M3494L56213B28540
14840G28144k61405J3835P8927j2572l2969K17408J17727o8866l28640K00024
14830F51613j83941P446A65770J87623P0427M34406m07013o5932k3135L48426
14820G10572k14074k09366J54314N2421P2889j77214K15310k67334j6330M38828
14810G60016A84047K39888m8227K83962k90653J50941B05642K19877q940K53963
14800F70542j50822m9775J71059k77646M18954k68688j76842j34466O74413B56343
14789B24238P27986D24478j84485L51253R6857j52001J71061j27660j94003p8647
14779C06853q9882M34053M4427J14337k04009k28446K2365L22439k25203q0629
$$ y = [316076, 158166, 601369, 298846, 156084, 87893, 108944, 263625, 307119, 663332, 228540, 728144, 466739, 480574, 559501, 546929, 513960, 731368, 849095, 780229, 451589, 651613, 467672, 475118, 165770, 353393, 423820, 858226, 451213, 385281, 362146, 710572, 496498, 287132, 441446, 493867, 566756, 389542, 604852, 337518, 321188, 760016, 184047, 423935, 375708, 659670, 369017, 519958, 205642, 425519, 416579, 670542, 519720, 469945, 641004, 363358, 782312, 513624, 336782, 202316, 876729, 256343, 224238, 952224, 424478, 239993, 591246, 688103, 536102, 707163, 579503, 385500, 306853, 216971, 651024, 695451, 809788, 605779, 377333, 399698, 722137, 496934, 416305]
14769D16305R4715k07673N28268l10135M2526o552j20421J78749B97865K31849
14759E29714K33578P8856l86190M29265k47233A03957L11424P4339Q0117J36724
14749G06561n8062k57014Q4975K42786j56486j4659j12315J65448L8457p7922
14739E61769j10030J41574J39702k9824k8461q3468r685k5555K57455j98389L2146
14728F47234J99531J4852j23025J10990J38094K03672m94007L05939j79441J71337
14718I95176n9457m407Q4971n00163K32203L910r1313K00726l6123j9666j39459
14707F66398J46489l8518p3203l1157J86782j88990K8302K28527r6984K02811
14697A030457J27455n4776l18709J87232J98562k77426j86461j26429L18818k66652
$$ y = [416305, 511020, 303347, 831615, 521480, 564006, 557454, 437033, 615782, 297865, 529714, 763292, 842148, 455958, 885223, 637990, 103957, 415381, 489720, 569837, 706561, 648499, 391485, 476460, 719246, 562760, 548101, 435786, 601234, 639691, 561769, 451739, 593313, 733015, 703191, 674730, 591262, 581577, 556022, 813477, 615088, 647234, 846765, 861617, 738592, 849582, 987676, 1191348, 697341, 1003280, 823839, 995176, 935719, 931312, 1016283, 516120, 748323, 752233, 660920, 861646, 825523, 805857, 666398, 812887, 774369, 701166, 670009, 856791, 667801, 696103, 924630, 827646, 1030457, 1157912, 1103136, 784427, 971659, 1170221, 892795, 706334, 579905, 898723, 632071]
14687F32071L25417k12867J24439j94641J16545K03602q3402j53759p0777K3690
14677G10318J16668N9021M2533k12580L91276l06823K56002r8748K36593j87217
14667A007043j20441P6627j8318j36305j27893J58340L6270L58127n02022M65563
14657A196991l4127n04148N05894M9255l43836K15332p9343j882k95253M36241
14647A145124j67604j02164J61069k13388K70434J85586q4869j07085K54630l44097
14637I97636J256L91934k9545l10508m6910r8228Q8414J58568l81058N66819M804
14626A343182l56910K13495j39300K58332l03187K14470j31475J87207L71593
14617A657407p7117j92952o1191j85490j11952N80960l29751O1968J52915l92137
$$ y = [632071, 957488, 744621, 869060, 674419, 790964, 994566, 911164, 757405, 686628, 710318, 826986, 886007, 928540, 715960, 1107236, 800413, 1056415, 957667, 1194260, 1007043, 886602, 963229, 944911, 808606, 680713, 839053, 875323, 1233450, 731428, 1196991, 1162864, 658716, 1164610, 1213865, 870029, 1085361, 1006018, 1004136, 708883, 1145124, 977520, 875356, 1036425, 823037, 1093471, 1279057, 1194188, 1087103, 1341733, 997636, 998892, 1390826, 1361281, 1050773, 1003863, 905635, 994049, 1152617, 771559, 1338378, 1343182, 986272, 1199767, 1060467, 1318799, 1015612, 1230082, 1098607, 1285814, 1657407, 1580290, 1387338, 1326147, 1140657, 1028705, 1609665, 1279914, 1341882, 1494797, 1102660]
14607A102660J82279R1668J55219l60152K38750l88149J26964J99615j76332k05861
14597I66661L66074j13805N52687l80900L0054K67805j01907j54027P3714k2085
14587A484271J6029L3626K45802j88546j19069J61919N6255O8670J19499n9498
14577A818958j23776L33105R6306m28034L21722n7525j09162J99857k66023J99855
14567A985283j51150J53639J23305o3098L2839n9953L70786m300K21116j48767
14557B459700K22921K65958j64981L11597J50995J85140N44011R29879J889953
14548F795173L504641Q221786K1487299O056977A6533017F588109k747319j254812
14540B585978m23576j36301j81372J93796k7731L81441J88509K202809L579017
$$ y = [1102660, 1284939, 1376607, 1531826, 1171674, 1410424, 1022275, 1149239, 1348854, 1172522, 966661, 1332735, 1218930, 1771617, 1390717, 1420771, 1688576, 1586669, 1432642, 1506356, 1484271, 1500300, 1533926, 1779728, 1591182, 1472113, 1634032, 1690287, 1758957, 1878456, 1818958, 1695182, 2028287, 2124593, 1696559, 2018281, 1960756, 1851594, 2051451, 1785428, 1985283, 1834133, 1987772, 2111077, 2047979, 2080818, 2020865, 2391651, 2387351, 2608467, 2459700, 2682621, 2948579, 2783598, 3095195, 3246190, 3431330, 3975341, 4905220, 6795173, 10299814, 18521600, 40008899, 46065876, 16533017, 6588109, 3840790, 2585978, 2162402, 2026101, 1844729, 2038525, 2010794, 2392235, 2580744, 4783553, 8362570]
14531H362570C644246j194783l72353l08246J04515j9833M14817j41044J49588
14522B276907k29845J78642L9489l85206J68668L5686k980j1346K58612q3892
14512B244735J70289N4085Q8058k32786J41362J44445K0635k71109J20909J42440
14502B623063K50832m52019M76866j73379k16068K25191M3503m66747M02929J93469
14492B907640K43125m65080K53558J90512J48333j56514l11727K07871N7952K95500
14482C371170L11961k21461P2298j91688L40486J914j02577r8869N78718k41928
14472C820024p1000j9124N7055l38051L15579J82550K34728k37702K6208n0394
14462C919873K86056K44700n02728J27237P9638K77616m0050k4508J90685J05842
$$ y = [8362570, 3644246, 2449463, 2077110, 1768864, 1873379, 1853546, 2268363, 2127319, 2276907, 2047062, 2225704, 2265193, 1879987, 2048655, 2084341, 2081361, 2070015, 2328627, 2244735, 2415024, 2469109, 2557167, 2324381, 2465743, 2610188, 2630823, 2359714, 2480623, 2623063, 2873895, 2421876, 2898742, 2725363, 2509295, 2734486, 2777989, 2311242, 2714171, 2907640, 3150765, 2685685, 2939243, 3129755, 3278088, 3121574, 2809847, 3017718, 3075670, 3371170, 3683131, 3461670, 3533968, 3342280, 3682766, 3684680, 3582103, 3483234, 4061952, 3820024, 3749024, 3729900, 3786955, 3448904, 3764483, 3947033, 4181761, 3944059, 3970267, 3919873, 4205929, 4450629, 3947901, 4075138, 4154776, 4432392, 4392342, 4367834, 4558519, 4664361]
14452D664361N8451j86697K11073l13919j56387N62480r7756K90957K0474j69575
14442D883462k11033M96778M93270m03446p2645O9077K73048K49634p3033O3789
14432E768901j99130N29483N7453Q508J00240l69855L90657J25877J19682M18920
14422F950736l31978K6297K26297K96973k28015N07236K53926J19285O9599R0490
14412G980846l60850M37585k1166L25846J18412k77210K88518p9359N45005k83877
14402H673750R1847L48430L01812P6470L57591m04928m4139N71718J86520K93260
14392A0452331J66031j33694L98577K87172K0258R1869J53192M78169K62511J33201
14382A2309617K43884K31699K52016j40042N46110j7735L79143L93918k12698
$$ y = [4664361, 4722812, 4536115, 4747188, 4433269, 4276882, 4839362, 4741606, 5032563, 5053037, 4883462, 4672429, 5169207, 5662477, 5259031, 5186386, 5255463, 5528511, 5778145, 5705112, 5768901, 5569771, 6099254, 6156707, 6165215, 6265455, 5895600, 6286257, 6412134, 6531816, 6950736, 6618758, 6645055, 6871352, 7168325, 6940310, 7447546, 7701472, 7820757, 7890356, 7980846, 7619996, 8057581, 8036415, 8362261, 8480673, 8203463, 8491981, 8412622, 8957627, 8673750, 8765597, 9114027, 9415839, 9492309, 9849900, 9444972, 9400833, 9972551, 10159071, 10452331, 10618362, 10484668, 10883245, 11170417, 11190675, 11282544, 11435736, 11913905, 12176416, 12309617, 12553501, 12785200, 13037216, 12897174, 13443284, 13425549, 13804692, 14198610, 13985912]
14373A3985912R24938j47254L86543L00547J87114N11616M07430L24331K53458
14364A7134635M49888K12937P27626L39402J85449N79452L18700L26467P13677
14355B0988233M74772N15427M62580N50291J90300O45273Q26767L98374O71180
14346B5723197P02347N77189O97293P41061R05991O40393J022063R01457P63792
14337C2674783Q76563J000494J621303P24137R11884O98984J611038J099261J516338
14328D2734785J350132J315556J485723J379734J822043J901552J251161K424116
14320E5664802J887477K156936K202354K178420K570179K065808K982460L082044
14312G4790480K800192K896975L769460L506700L854634L963356M464526M407478
$$ y = [13985912, 14910850, 14763596, 15150139, 15450686, 15637800, 16149416, 16556846, 16881177, 17134635, 17584523, 17797460, 18525086, 18864488, 19049937, 19629389, 19948089, 20274556, 20988233, 21463005, 21978432, 22441012, 22991303, 23181603, 23826876, 24653643, 25052017, 25723197, 26425544, 27002733, 27700026, 28441087, 29347078, 29987471, 31009534, 31910991, 32674783, 33551346, 34551840, 36173143, 36897280, 37809164, 38508148, 40119186, 41218447, 42734785, 44084917, 45400473, 46886196, 48265930, 50087973, 51989525, 53240686, 55664802, 57552279, 59709215, 61911569, 64089989, 66660168, 68725976, 71708436, 74790480, 77590672, 80487647, 84257107, 87763807, 91618441, 95581797, 100046323, 104453801]
14304A04453801M694346N293583N802674N718720O292655O393118O901768P834248
14296A53384913Q179857Q604442R110495R832927J0365488J1291469J2018708
14289B22788299J1982819J3477660J3897637J4612143J5064026J6012759J6241196
14282C24076539J6920838J6984056J7573287J7030879J6503081J6275181J5123844
14275D40487705J3099868J0049050N911796L921521L309402J496608k6159l176876
14267D75072915m875150p951279j0382809j1109458j3851771j5646762j6616639
14260C94639047j7161027j7202123j7255934j6990317j6588016j5969684j5405171
14253B78066775j5227428j3814662j3485536j2674781j1986271j1298173j0621169
$$ y = [104453801, 109148147, 114441730, 120244404, 125963124, 132255779, 138648897, 145550665, 153384913, 161564770, 170169212, 179279707, 189112634, 199478122, 210769591, 222788299, 234771118, 248248778, 262146415, 276758558, 291822584, 307835343, 324076539, 340997377, 357981433, 375554720, 392585599, 409088680, 425363861, 440487705, 453587573, 463636623, 469548419, 473469940, 476779342, 478275950, 478249791, 475072915, 470197765, 462246486, 451863677, 440754219, 426902448, 411255686, 394639047, 377478020, 360275897, 343019963, 326029646, 309441630, 293471946, 278066775, 262839347, 249024685, 235539149, 222864368, 210878097, 199579924, 188958755]
14246A88958755j0003391r509603o751084n951652q722020p541629p060177o557848
14238A26861351n572000n640859n052866n387291m580679m424082l554533l808187
14230H8840854m041555l397119l410955l243179k736988k719896k647000k395067
14222F4249095k263519k281610j989847j973442j896032j828509k115291j520210
14214D8380635j356225r10448j864122j648324j356153r78489q14110q34223j108194
14205C7510347j102172j283595j110324r21516p13127l65729j443861q42148j004886
14196B8722989m58297r74917m10569n66394n76680m84948j435360j04986n68606
14187B3142232n24007o44391j09120r53756o9022p87974k48602p00867o5928m77322
$$ y = [188958755, 178955364, 169445761, 162694677, 156743025, 148021005, 140479376, 133419199, 126861351, 121289351, 115648492, 110595626, 105208335, 100627656, 96203574, 92649041, 88840854, 84799299, 81402180, 77991225, 74748046, 72011058, 69291162, 66644162, 64249095, 61985576, 59703966, 57714119, 55740677, 53844645, 52016136, 49900845, 48380635, 47024410, 46113962, 44249840, 42601516, 41245363, 40266874, 39452764, 38618541, 37510347, 36408175, 35124580, 34014256, 33092740, 32379613, 32013884, 30570023, 29727875, 28722989, 28264692, 27289775, 26879206, 26312812, 25736132, 25251184, 23815824, 23710838, 23142232, 22618225, 21973834, 21864714, 20910958, 20841936, 20053962, 19805360, 19104493, 19038565, 18561243]
14177A8561243l55660l64726p84712j68623l36743m59063k4212m25000k79893
14168A5362611n71987n5321l94911k20632K01311o03680m62807k1711n6534k20002
14158A2956337o52452K49349k47592o66451J23107m90121j87990O0786j24226
14149A1020747n2117l14369l56112k81381j09238J78018k20271p6850o50202J01825
14139I240050k06868P0297j28987r7709q2483o20862M68902k05807n27790J62512
14129H071255m11664K05362J03863n39404j7474j23571p7543j64848J69772l61904
14119F853844K4727K1513n7322p0312j20065n2511j71699L742j36158M47622p82380
14108E961001K66995n59339K98115k14401k13523L04087L2785k02067j52721n3900
$$ y = [18561243, 18205583, 17840857, 17056145, 16887522, 16550779, 16091716, 16067504, 15642504, 15362611, 14790624, 14735303, 14340392, 14119760, 14321071, 13717391, 13254584, 13232873, 13176339, 12956337, 12303885, 12553234, 12305642, 11639191, 11762298, 11272177, 11084187, 11144973, 11020747, 10968630, 10654261, 10298149, 10016768, 9907530, 10085548, 9865277, 9788427, 9138225, 9240050, 9033182, 9103479, 8974492, 8876783, 8794300, 8173438, 8642340, 8436533, 7908743, 8071255, 7659591, 7864953, 7968816, 7429412, 7411938, 7288367, 7210824, 7045976, 7215748, 6853844, 6878571, 6900084, 6842762, 6772450, 6652385, 6599874, 6428175, 6431917, 6295759, 6743381, 5961001, 6227996, 5668657, 5966772, 5752371, 5538848, 5842935, 5875720, 5673653, 5520932, 5467032]
14098E467032O637k5204k58635k00664k01j01429J16269J6939j6744k22262R268
14087D791006q090k40355K17303j7254r8220k70454k76509K96287l04677k2911
14077D066126L69885j83746k92651K03861j01999P836J96455k33756j86180k19987
14067C625844R6441k76280P1875J01605J23535j62102N2314l90201L04371Q7627
14057C635029j61096k66828K99225j88526k01705q2708L72353j24555J46579j2807
14047C414961l13139O0244l02996L06757j59147j05719J84815j39508p4022M1636
14037B913882k44265K02283l86649M00228j17901j41252L7798J33364K0483k18288
14027B599683M36324k40746k90846J33393J93700o30965P5646j6390J15465J56862
$$ y = [5467032, 5473669, 5448465, 5189830, 4989166, 4988965, 4887536, 5003805, 5020744, 5004000, 4781738, 4791006, 4782916, 4542561, 4759864, 4742610, 4644390, 4373936, 4097427, 4393714, 4089037, 4066126, 4436011, 4252265, 3959614, 4163475, 4061476, 4069312, 4265767, 4032011, 3845831, 3625844, 3722285, 3446005, 3517880, 3619485, 3743020, 3580918, 3633232, 3243031, 3547402, 3635029, 3473933, 3207105, 3506330, 3317804, 3116099, 3033391, 3405744, 3281189, 3427768, 3414961, 3101822, 3162066, 2859070, 3165827, 3006680, 2900961, 3085776, 2946268, 2872246, 2913882, 2669617, 2871900, 2485251, 2885479, 2767578, 2626326, 2664124, 2797488, 2817971, 2599683, 3036007, 2795261, 2504415, 2637808, 2831508, 2200543, 2276189, 2259799, 2375264, 2532126]
14017B532126j81389j92808M44430m69457l8037k06764O33861k70700k90193J59685
14007B120754J14354l43996j28770L68842K5580j9796m787n57949K71482k66724
13997A578990M47999j17971m3701j12853N9555k31802L58071M13619Q85881K078487
13987E316275O395917J9766114J9932690B4041465A1521177m406452k047134j086578
13979C981013k63059n21292q3305k61945r5428n554m72930L84075m80612J26406
13969B307369j71842k52311J76134J25140m1761J86508k09951m71709N40550j88051
13959B000076l7758Q5278n2890j42491k5242n4724O5665r7134l1584J84272o47070
13948A246398M25134K47427L63l47044k23563k22730J09586M07647n3186N7031
$$ y = [2532126, 2350737, 2157929, 2602359, 2132902, 2094865, 1888101, 2521962, 2251262, 1961069, 2120754, 2235108, 1891112, 1762342, 2131184, 2156764, 2136968, 2132181, 1574232, 1845714, 1578990, 2026989, 1909018, 1865317, 1752464, 1812019, 1580217, 1938288, 2351907, 3237788, 5316275, 11712192, 31478306, 51410996, 24041465, 11521177, 7114725, 5067591, 3981013, 3717954, 3196662, 3113357, 2851412, 2755984, 2750430, 2277500, 2661575, 2180963, 2307369, 2135527, 1883216, 2059350, 2184490, 2142729, 2329237, 2119286, 1647577, 2188127, 2000076, 1962318, 2047596, 1994706, 1852215, 1826973, 1772249, 1837914, 1740780, 1709196, 1893468, 1246398, 1671532, 1918959, 1919322, 1572278, 1348715, 1125985, 1235571, 1643218, 1590032, 1647063]
13938A647063N0623j39244j63002M74312l72654O9306k3708q4456k18046K36341
13928A476535J16703k47129L55529q0905j76402l12502J73618P4014P6253j61264
13918A294450N1896K63340q906n17928N38926Q135m02239J0271k51729L70195
13908A356411K11893k56763k86633L76939L2968q9530L13801m21230L9809j79526
13898A098139q3833K50805N9670k91759M80657k30017J06145m28662Q3790Q6708
13888A131643l16973P35866m99854j56355L08136j674j84390o4403J49025q0355
13878A020666K66670k69415k81882K22850L020J27416K8520j62234K52351j48634
13868A059328j96167J33958K15222j80540J52671m13725L87341k2508m48676N12036
$$ y = [1647063, 1697686, 1558442, 1395440, 1869752, 1497098, 1566404, 1542696, 1458240, 1240194, 1476535, 1593238, 1346109, 1701638, 1620733, 1444331, 1131829, 1305447, 1379461, 1455714, 1294450, 1346346, 1609686, 1600780, 1082852, 1621778, 1629913, 1227674, 1237945, 986216, 1356411, 1568304, 1311541, 1024908, 1401847, 1434815, 1345285, 1659086, 1237856, 1277665, 1098139, 1014306, 1265111, 1324781, 1033022, 1513679, 1283662, 1389807, 961145, 1044935, 1131643, 814670, 1550536, 1050682, 894327, 1202463, 1200789, 1016399, 951996, 1101021, 1020666, 1287336, 1017921, 736039, 958889, 961909, 1089325, 1117845, 955611, 1207962, 1059328, 863161, 997119, 1212341, 1031801, 1184472, 770747, 1158088, 1135580, 686904, 1198940]
13858A198940m50520Q2054K88901j21866M51763F51578J31468J92570J05634m6145
13848A035105l51300L56589m88436L65213M7737K7907n6061q6556J68977m8496
13838I70679r8022j72935M72907n34821J24977p6619L34081m17254M06048j32832
13828H76209m5522D08822N91670J22028k70139K38036k95927l7349R0364j6192
13818H31313l33120j64790M32181P1088l38523k4679R2213M40622k29945k12690
13808E63670R5760l26043L04813J66395j02773N0300J9517l4793L39605k79040
13798G97411j56351J31145N4322k8196L9063l02624K16843K04420j84692J00128
13788H71469k98829M05499l41869J99117p0893k59705J57564o8386P7239r5486
$$ y = [1198940, 748420, 830474, 1119375, 997509, 1449272, 651578, 783046, 975616, 1081250, 1035105, 683805, 1040394, 551958, 917171, 964908, 992815, 936754, 850198, 1019175, 970679, 872657, 699722, 1172629, 637808, 762785, 686166, 1020247, 602993, 1009041, 876209, 830687, 408822, 1000492, 1122520, 852381, 1090417, 794490, 757141, 847505, 831313, 498193, 333403, 765584, 836672, 498149, 473470, 565683, 1006305, 776360, 563670, 659430, 333387, 638200, 804595, 701822, 752122, 771639, 736846, 1076451, 797411, 641060, 772205, 826527, 798331, 837394, 534770, 751613, 956033, 771341, 871469, 572640, 978139, 636270, 835387, 764494, 504789, 662353, 593967, 671206, 575720]
13778E75720K68034C52743N0130J6587L10873k1529p4550l7150B43162K68273
13768E11435l4579J99074j09568L05345r1380k06735A31451O80884j05774n1994
13758F54567J218B29373n3349P48688D60006J18931J55925j52273K9890k73978
13748C38501K14502j48810K53116k88053J65518j54388M33801o5458k26464p5111
13738D47154R7774k23342M22806J79348m18440J94629k16612J23028j72444j60827
13728B73074J69290j89138M9809K21028Q6345M3807k7964G4462K87657N8495J83288
13717F03902k73738K29280k51091M66699C58325A34804L53544K09022j78583k00367
13707C18420J94330o5286J9570L56933C83612J89452P5151k54303J27336K03479
$$ y = [575720, 843754, 352743, 402873, 419460, 730333, 708804, 634254, 597104, 243162, 511435, 476856, 675930, 566362, 871707, 780327, 573592, 131451, 812335, 706561, 654567, 655785, 229373, 176024, 924712, 460006, 578937, 734862, 582589, 612479, 338501, 553003, 404193, 657309, 369256, 534774, 380386, 814187, 748729, 522265, 447154, 544928, 321586, 744392, 923740, 505300, 699929, 483317, 606345, 433901, 273074, 442364, 253226, 303035, 524063, 610408, 654215, 626251, 74462, 362119, 420614, 603902, 330164, 559444, 308353, 775052, 358325, 134804, 488348, 697370, 518787, 318420, 512750, 447464, 467034, 823967, 383612, 573064, 648215, 393912, 521248, 724727]
13697G24727C13823q3823L74189n4484r7106P1292J38958k17634J61428k98121
13687C08522N6632k1007A40154M11174k65799A23066N72456k84275J9498J94829
13677F25574k49843j5210O4766K93185l56083q1156j04018J80936G1220L02790
13667C74010A50112h063C91498L4360n7835J9048K7408J85358j15299j80686q3159
13656B20693K96456j0507K33906k66466j03787K03403B56633K63414j53270e8578
13645C53483K31139B29574K70749A02330K48141M3114A93399K80393J05450B42005
13634E86659B39612j7008L08636j80566j29944K53119j08650o7678j997k7279
13624B68245L08940k01498j08701J95760L75161l04798A42831M70276B91627q4395
$$ y = [724727, 313823, 230000, 604189, 549705, 452599, 523891, 662849, 445215, 606643, 308522, 365154, 344147, 140154, 551328, 285529, 123066, 695522, 411247, 430745, 625574, 375731, 360521, 425287, 718472, 362389, 281233, 177215, 358151, 71220, 374010, 150112, -8063, 391498, 425858, 368023, 387071, 414479, 599837, 484538, 303852, 220693, 517149, 506642, 740548, 474082, 370295, 573698, 256633, 520047, 366777, -58578, 353483, 584622, 229574, 500323, 102330, 350471, 393585, 193399, 473792, 579242, 242005, 586659, 239612, 222604, 531240, 350674, 220730, 473849, 365199, 297521, 295524, 268245, 577185, 375687, 266986, 462746, 837907, 533109, 142831, 613107, 291627, 207232]
13614B07232J71862j83849L29826B07809J63243l819Q5247k12573L10421A45392
13603B62150L64624B05870J33505r268A41182L17275K21891A55832J5287J48657
13593C19776K50891B04732a9716C77325j68593J00726A50018L10312J71515B12304
13582A77914L915M31682q3500k34845j43833K42485D3218J01792J17894Q3975
13572C46879l8285k1960M3557L02343j63085A39038J06455k1731M5279c5921A8310
13560B13414J48131k3058j58975K1070R6753I6894J9309d2688G46904B21146a11727
13548D97494k30696m5546p330E7393K05724k3082J68301A68378A6743N70549A38697
13536A48288k03O55916d2904r4047B23737H6222M12550r6132p8703j11571l8140
$$ y = [207232, 379094, 195245, 525071, 207809, 371052, 367233, 452480, 239907, 550328, 145392, 262150, 626774, 205870, 339375, 330107, 141182, 458457, 680348, 155832, 171119, 319776, 570667, 204732, -19716, 377325, 208732, 309458, 150018, 460330, 631845, 212304, 177914, 181829, 613511, 530011, 295166, 151333, 393818, 43218, 145010, 262904, 346879, 308594, 286634, 330191, 632534, 469449, 139038, 245493, 223762, 269041, -35921, 18310, 213414, 361545, 338487, 179512, 200582, 297335, 96894, 116203, -42688, 746904, 221146, -111727, 497494, 266798, 221252, 213922, 57393, 263117, 240035, 408336, 168378, 16743, 587292, 138697, 148288, 148085, 804001, -42904, -136951, 223737, 86222, 498772, 402640, 323937, 212366, 174226]
13525A74226N40132k02966j78799r2834Q7593D2177N8383N9483K2245j7959L12745
13514D77074h2866B16305H1924a88113A53213R6629R5249A04437K38922a4978
13503D09598o2040p7628o1657J22445j41280J00099O4948A63635b30C03118k666
13492C00452J16726Q8875K33760B10044h160D99210A51422n250R8627J5424l1052
13481B29171g5714a4239B96731l1294H2798d4000C30332q5159g4617C12740A45241
13469E48699e5055E19193B5296h7500c6375B89529a25750B10978E2734N2377M39572
13458E44683k20073K05630j17753q1171N5589j24492R5567H4900J86684l7307
13448B34277k6381P4392J72054E7326J39985J8251G5797K50653j07070J05897
$$ y = [174226, 714358, 511392, 332593, 239759, 327352, 42177, 100560, 160043, 182288, 164329, 477074, -82866, 216305, 81924, -188113, 153213, 249842, 345091, 104437, 343359, -14978, 409598, 347558, 269930, 208273, 330718, 189438, 289537, 354485, 163635, -230, 303118, 300452, 417178, 506053, 739813, 210044, -8160, 499210, 151422, 146172, 244799, 260223, 229171, -75714, -14239, 296731, 265437, 82798, -44000, 330332, 245173, -74617, 312740, 145241, 548699, -55055, 519193, 25296, -87500, -36375, 289529, -125750, 210978, 52734, 105111, 544683, 324610, 530240, 412487, 331316, 386905, 262413, 357980, 84900, 271584, 234277, 207896, 282288, 454342, 57326, 197311, 215562, 75797, 326450, 219380, 325277]
13438C25277L7297k8803l7402b42449A48690O6681K42140k7654c9313B79621G1858
13426A15002M9616N4923d1759A65772a08435H7175J16671o9349O9916C5830j5961
13415A9869J18957L20789r0432H9760N28961j48473k32861a50396B13099r3096
13405A20003N0610b2024D53119d9879B11969N752b0313j96619A97318I5488M0271
13394A35759O5299P696r4376J6184L073K55329F7941a9809A46523c8096A55705
13382D091J0639J29502J44066E7299L1417K99382b3623A04311B3724J47545k8511
13371A42758P7235f3973a4089C99052j70217D1786L2260Q8149J88714K17020B05462
13359A29838J28783e9196n6986B55447R280L08653k63942j08648D6471N68218
$$ y = [325277, 362574, 333771, 296369, -242449, 148690, 215371, 457511, 429857, -39313, 279621, 71858, 115002, 164618, 219541, -41759, 165772, -108435, 87175, 203846, 134497, 204413, 35830, 19869, 138826, 459615, 369183, 89760, 618721, 470248, 237387, -150396, 213099, 120003, 170613, -22024, 453119, -49879, 211969, 217721, -20313, -216932, 197318, 95488, 135759, 201058, 208754, 114378, 130562, 133635, 388964, 67941, -19809, 146523, -38096, 155705, 4091, 14730, 144232, 288298, 57299, 88716, 388098, -23623, 104311, 23724, 171269, 142758, 219993, -63973, -14089, 399052, 228835, 41786, 74046, 162195, 350909, 567929, 205462, 129838, 258621, -59196, -116182, 255447, 264727, 573380, 309438, 200790, 46471, 614689]
13349F14689b29409e5384A71069l7637O5387J80096A55576L1240R4075j06333
13339A74558P8788A04447K01253c8773C78097A04700d4199B07017g5751A94262
13328E0517K54925j39268j3488N2389a73154B02414K1470A03765J30784k1984
13318B12565o9552q326k4059a30303A51538K2876J6650M9105j0103n2935N3435
13307B30566A10984P839b35878C5233J37448c8601B29426F0085a61052C26899
13296B44938A2934N4680e7267A88568q4002P3638i0829m8695A70010b26289A27686
13284C52406B7062O2683b11781B39221B7605d0396B04781J89531A33474J0126
13274A43600J27517r0744G7770J87238o5557a53390C05833O3257g801A45020Q1599
$$ y = [614689, -229409, -55384, 171069, 133432, 198819, 378915, 155576, 186816, 280891, 174558, 253346, 104447, 305700, -38773, 378097, 104700, -44199, 207017, -75751, 194262, 50517, 305442, 166174, 152686, 205075, -173154, 202414, 223884, 103765, 234549, 212565, 143013, 134687, 110628, -130303, 151538, 174414, 191064, 240169, 230066, 177131, 230566, 110984, 118823, -235878, 35233, 172681, -38601, 229426, 60085, -161052, 326899, 244938, 12934, 67614, -57267, 188568, 104566, 178204, -90829, -139524, 170010, -226289, 127686, 352406, 27062, 89745, -211781, 239221, 27605, -40396, 204781, 394312, 133474, 143600, 271117, 180373, 77770, 265008, 199451, -153390, 305833, 369090, -7801, 145020, 226619]
13263B26619J32116A64068A4537M64528I2112J49749A03887C6607a49360B10260
13252b02374H8299c194B36704m453I475K38208J8273m0974A3427J70052M04769
13241E88248B89423a43457C15472b44657B81857b83660l5065e6330B1952J92063
13231B14015J62839P1807A23731O3292j520G2561a86286A7487d5586A52195J94772
13220C46967b30794J12129A73993f0483j88299A34387k893a04208A43519k5984
13210A17535m851a07202H1165J84677A07748a20913j04709C67213A13387k888
13200A10499h9610A82619b32633I6641i045m4345A13322B0493J1162K28353c2922
13188D54279A40156a14738C40167a74278H8736K19948p1415J44505a36567d5128
$$ y = [226619, 358735, 164068, 14537, 479065, 92112, 241861, 103887, 36607, -149360, 210260, -202374, 88299, -3194, 236704, 232251, 9475, 247683, 265956, 224982, 13427, 183479, 588248, 289423, -143457, 315472, -244657, 281857, -283660, -318725, -56330, 21952, 214015, 376854, 448661, 123731, 187023, 185503, 72561, -186286, 17487, -45586, 152195, 346967, -230794, -118665, 173993, -60483, -248782, 134387, 131494, -104208, 143519, 117535, 112684, -107202, 81165, 265842, 107748, -120913, -225622, 367213, 113387, 110499, -89610, 182619, -232633, 96641, -9045, -53390, 113322, 20493, 31655, 260008, -32922, 454279, 140156, -114738, 340167, -174278, 88736, 308684, 237269, 381774, -136567, -45128]
13177C6754J5354i7942J2077b3907j27574g2377m9439B26781I4021g8036L3667
13166d4369k00694I6953J63717j04086a60680M2228H9821l9456K8017h3079H0849
13154A62688H618O8524k9332J16210P321b0539a039j1149d86l6456F1096B6315
13141F3315K25100b35432B7860g68A43485E3747J841L04260j41541a63938a4957
13129a47518L1050B16213B1904O6636J47117r0706k099d17245a25978N8497B16109
13117b9642q9615M2475A28834J59423f816j8875C9479O8377J39006D0471K95752
13106C36223F4320b1159A252L43800g3941K8704A04359q939J47142F8235P1252
13095A39487a12399B36810A959J64212A4826h3630a797j12008A27731l9365a00639
$$ y = [36754, 52108, -97942, -85865, -23907, -151481, -72377, -121816, 226781, 94021, -78036, -44369, -245063, 96953, 260670, 156584, -160680, -118452, 89821, 50365, 78382, -83079, 80849, 162688, 8618, 77142, 47810, 164020, 171341, -20539, -1039, -12188, -486, -36942, 61096, 26315, 63315, 288415, -235432, 27860, -768, 143485, 53747, 55588, 359848, 218307, -163938, -14957, -147518, -116468, 216213, 21904, 88540, 235657, 144951, 142852, -417245, -125978, -67481, 216109, -29642, -119257, -76782, 128834, 288257, -6816, -25691, 39479, 107856, 246862, 40471, 336223, 64320, -21159, 1252, 345052, -73941, -45237, 104359, 95420, 242562, 68235, 139487, -112399, 236810, 1959, 166171, 14826, -83630, -1797, -113805, 127731, 88366, -100639]
13083a88257E4428f1130k5283o0984e501G1919d8050A40152J20314A14509J7634
13072A32143J5490J588e26469B19896m9669a77367B090M8905a35119r6814B02171
13060A47213N1020a02665G0503J61628J3003F9477P902J03174a00472b9229A4581
13048g2578a972A32781k3627i7411C24809a24377d9461J6863E0067d9998B04924
13036E4560b39102O9124B82267b9507B9136h7556D38015C9924J37845p5331B3426
13024E4869P0113B3198K05928I3413N1977o0818K376b40340F06626A46161a83666
13012d355o649A26778j7598n2099d8966G515J61067b27634A86671f4961F7070
13000a40020K1019j1626a889j64919n6159C74929E8663f9412D3360c42307A73687
$$ y = [-188257, 54428, -61130, -86413, -147397, -5501, 71919, -48050, 140152, 260466, 114509, 132143, 147633, 149221, -526469, 219896, 170227, -177367, 2090, 50995, -135119, -231933, 202171, 147213, 198233, -102665, 70503, 232131, 245134, 69477, 77379, 180553, -100472, -29229, 14581, -72578, -1972, 132781, 109154, -97411, 324809, -124377, -49461, -32598, 50067, -49998, 204924, 54560, -239102, -169978, 282267, -29507, 29136, -87556, 438015, 39924, 177769, 102438, 23426, 54869, 124982, 23198, 229126, 93413, 145390, 84572, 86948, -240340, 606626, 146161, -183666, -4355, -11004, 126778, 109180, 57081, -48966, 7515, 168582, -227634, 186671, -64961, 67070, -140020, -119001, -130627, -1889, -166808, -222967, 374929, 58663, -69412, 43360, -342307, 173687]
12988c60835F408c95970d2701H0469a275B35835i2136k0431C20916E7827b73995
12976b2067M053D0256a73728A03984M6232f4776g561A2754N5021c35713C21371
12964a86098A32146a62988A14292c52476f1308j31790A35100n9852a46336a3206
12953a3419k33645a2260k9375B2975J7959a62778j92674a27944j33524a26511
12942e3816H5124M8442b12173A74325C6820b22085P9473k5537A91969a97455b2083
12930a44561d7661m054j20951B21791G3966B4988J43011b36075m3781H5771E79
12918B59661G2290J39302b00910C22496p5465i8098o9596p5643C95223A5590J06502
12907A22092A3339K33223H2236L31459c04794J14876A45639P96c1474B8874h7077
$$ y = [-360835, 6408, -395970, -42701, 80469, -1275, 235835, -92136, -112567, 320916, 57827, -273995, -22067, -18014, 40256, -173728, 103984, 150216, -64776, -7561, 12754, 67775, -335713, 321371, -186098, 132146, -162988, 114292, -352476, -61308, -193098, 135100, 75248, -146336, -13206, -13419, -247064, -12260, -41635, 22975, 40934, -162778, -355452, -127944, -261468, -126511, -53816, 85124, 133566, -212173, 174325, 36820, -222085, -142612, -168149, 191969, -197455, -22083, -144561, -47661, -51715, -172666, 221791, 73966, 24988, 167999, -236075, -279856, 85771, 579, 259661, 72290, 211592, -200910, 322496, 247031, -98098, -167694, -243337, 395223, 15590, 122092, 13339, 246562, 82236, 413695, -304794, -189918, 145639, 146435, -31474, 28874, -87077]
12895b01920B8530P6489K85585r0874A49567b42690C3416K44109b67732A85476
12884A16073J13427b45009d8743A4624a56424A40556f6374A40015a05312A11846
12873I4612b50329e6372l63273a4423q2105l92566B52302e4091k8239A14908e5818
12861c5533A27263i1215H5655a51818b6896k15729D17946g9692B54853A5819n9
12850A5760a39267I0396j0327e2289B31983l4010H9373a25497B2999h1544A04486
12838D97777f5641B37505j05022B8466g7863j00188E0108c7121F4435J66191I7052
12826g5393E825a04427j1580C7074L4017j621N7206J27428a18441l3013j0608
12815a62062g1509k71124E5191l114b32893A36789b71372d348j45722d7415B48086
$$ y = [-201920, 28530, 105019, 390604, 299730, 149567, -242690, 33416, 277525, -267732, 185476, 116073, 229500, -245009, -48743, 14624, -156424, 140556, -66374, 140015, -105312, 111846, 94612, -250329, -56372, -419645, -14423, -96528, -489094, 252302, -54091, -82330, 114908, -55818, -35533, 127263, -91215, 85655, -151818, -26896, -242625, 417946, -79692, 254853, 15819, 15760, -139267, 90396, 80069, -52289, 231983, 197973, 89373, -125497, 22999, -81544, 104486, 497777, -65641, 237505, 132483, 28466, -77863, -178051, 50108, -37121, 64435, 230626, 97052, -75393, 5825, -104427, -116007, 37074, 71091, 69470, 126676, 254104, -118441, -151454, -162062, -71509, -342633, 55191, 52077, -232893, 136789, -271372, -4348, -150070, -47415, 248086]
12803d34869e1984r2144n0614b1776p4582l05075G8530b28012F7957O5118a417
12791A27251i4343m3133l8833A6932a65087A05732D7598a97708c2851K714E8910
12779b62103A58785f7191j29612I2381a59798c1510j3171l3547n4228A13344a18666
12767i4112A46996p76G1994g883j03206b3005M204j26196A91533f268l2518k7432
12755f6218m4122n1930B7927b51078B22811C2445d67334b03226B26916R4392A38896
12743a44657O7474p8707M2317l16306A11556a92201C16869a61252P5816A5506
12732B82341d6816n2040k343C361J35708e9733C14139a1676A08931c37317C9509
12720A551J25293b28627A16665J9989C7843J62745N5125a51613p1822m9527k64598
$$ y = [-434869, -51984, -144128, -194742, -21776, -96358, -401433, 78530, -228012, 67957, 133075, -1417, 127251, -94343, -137476, -176309, 16932, -165087, 105732, 47598, -197708, -32851, -30137, 58910, -262103, 158785, -67191, -196803, 92381, -159798, -31510, -44681, -78228, -132456, 113344, -118666, -94112, 146996, 146220, 71994, -7883, -111089, -23005, -18801, -144997, 191533, -6268, -38786, -66218, -110340, -162270, 27927, -251078, 222811, 32445, -467334, -203226, 226916, 321308, 138896, -144657, -77183, -155890, -113573, -429879, 111556, -192201, 316869, -161252, -85436, 15506, 282341, -46816, -98856, -101199, 3361, 139069, -59733, 314139, -11676, 108931, -337317, 39509, 1551, 126844, -228627, 116665, 136654, 37843, 200588, 255713, -151613, -223435, -272962, -537560]
12709e37560a75021e082B45385f4727j18933P5931E3339F822M3215J4150e3706
12697F3117c8741B93033g3725A88159D4576q071a67563D55525c7922A6829c62227
12685b60976l2767N7089B7750J55424a65755k21309h9638F1485a37083p4320A51520
12673C63741G8621b73149a08347C95153e1757j05364A8842b12850D3537a22078
12662b3956A75522A3846Q8390J52961I5144A3755j323J8805L00417A36466L1868
12651A68334n7944E1660J12704G1624K04601E0532d6501j22722j38736N5495A83468
12639G5795f5467l60167E5432b0251C719c87825B86298m7137F9067d4960I3608
12627C54824A53606E5178O6852J31955b1429A95437M13495A83457a11429F7173
$$ y = [-537560, -175021, -5082, 245385, -64727, -183660, -107729, 53339, 6822, 50037, 64187, -53706, 63117, -38741, 293033, -73725, 188159, 44576, 36505, -167563, 455525, -37922, 16829, -362227, -260976, -293743, -236654, 27750, 183174, -165755, -387064, -89638, 61485, -137083, -211403, 151520, 363741, 78621, -273149, -108347, 395153, -51757, -157121, 18842, -212850, 43537, -122078, -23956, 175522, 13846, 102236, 255197, 95144, 13755, 12432, 31237, 331654, 136466, 168334, 110390, 51660, 164364, 71624, 276225, 50532, -46501, -169223, -307959, -252464, 183468, 75795, -65467, -425634, 55432, -20251, 3719, -387825, 286298, 239161, 69067, -44960, 93608, 354824, 153606, 55178, 122030, 253985, -21429, 195437, 608932, 183457, -111429, 67173]
12616A27637d4370C06011b43845a4973B84563a01072C52925H604J16541D5208
12605C54003b6715A22665O3922E4654L15970i0294C0273b17175B59927a52382
12594D4956R7957P250a54630B44109C7681c10846E0612r409c40492b6183B49970
12582C2804k787R0095J15133a01899a5911j22132J7787A88568g7759p3320I5166
12570a74334c1902H2950f9703k4817O16l40452g5670C1557J17854h9565A94886
12558D1270g0257I9369a42916C90198m0942j49079c68552b4716A0463c7911k39019
12547b76930e7168B30464h4636c2593k80550h0459c3600k95720F6417J01780M82208
12536F50405A42851B0848J32487b8286n5722B14714A01242f3779A8373d7467B40453
$$ y = [127637, -44370, 306011, -243845, -14973, 284563, -101072, 352925, 8604, 125145, 45208, 354003, -26715, 122665, 186587, 54654, 370624, -90294, 30273, -217175, 259927, -152382, 44956, 142913, 150163, -154630, 244109, 37681, -310846, 50612, 41203, -340492, -26183, 249970, 32804, 30017, 120112, 235245, -101899, -15911, -138043, -120256, 188568, -77759, -151079, 95166, -174334, -31902, 82950, -69703, -94520, -93904, -434356, -75670, 31557, 149411, -89565, 194886, 41270, -70257, 99369, -142916, 390198, 349256, 200177, -368552, -24716, 10463, -37911, -276930, -57168, 230464, -84636, -32593, -313143, -80459, -33600, -329320, 66417, 168197, 650405, 142851, 20848, 153335, -28286, -84008, 214714, 101242, -63779, 18373, -47467, 240453]
12524B8645L09139l0860b83530d4469a0043k10762i8182j78479l43347B31406
12513A88565G2237a04864b5966A46652f6103j25102B46322B30K99710a099B95627
12501E09642B34056a01648J6581C01127A9706d1823A62622P1986B0147a02338
12490B04616m023b14891N1560R531A42610c19648a19316A196a32264j91131a14987
12478H5254P4568A6629a392G7021l0738J05637m2358f2253C70437b17484c7841
12466e867m7056A80476a55388N4090B22176n3574J74684a34460M2499q7483H4787
12454b52838G1639b6404k0346F8544b17267F2121J95603f7198j45845b3127A08639
12442A05557J20673a07799r6511A0493b45227b648m0828A5399c23974e1457k78624
$$ y = [28645, 337784, 306924, -283530, -44469, -10043, -220805, -98182, -276661, -620008, 231406, 188565, 72237, -104864, -25966, 146652, -66103, -191205, 246322, 230, 299940, -1099, 295627, 509642, 234056, -101648, -85067, 301127, 19706, -41823, 162622, 234608, 20147, -102338, 204616, 200593, -214891, -163331, -153800, 142610, -319648, -119316, 1196, -132264, -323395, -114987, 85254, 159822, 16629, -1392, 77021, 46283, 151920, 109562, -62253, 370437, -217484, -37841, -5867, -52923, 180476, -155388, -101298, 222176, 168602, 343286, -134460, -91961, -179444, 84787, -252838, 71639, -26404, -46750, 68544, -217267, 62121, 257724, -67198, -213043, -23127, 108639, 105557, 226230, -107799, -204310, 10493, -245227, -2648, -43476, 15399, -323974, -51457, -330081]
12431c30081a49853A97925N9489b38199M8574B8982M2811J50845e9258I2748J04975
12420A97723E2451K2862i1826k54236Q4390B05280h4671b4613p7382A48359f0380
12408F107M5579a81451F7627J5381b2460A77546k6913k2877b0838F6430J64981
12397B31411Q155B0220g8284A8412L33605a80945D27431A81743o1532L75083A03069
12385D6741J31141a27502B7614K38137a50002B20058h6791L9849B69574r8461
12375A71113b0961A51150a84513a6691F092H95i7117A24851a13220l8194j50260
12364c01674B01397J38136a05063k04279C15031c31652R4953O9789B12351E6824
12353A03282a57161B11915C8905Q8315a25054B77776L0144J7819B584K18071J84416
$$ y = [-330081, -149853, 197925, 257414, -238199, -189625, 28982, 71793, 222638, -59258, 92748, 197723, 52451, 75313, -91826, -346062, -261672, 205280, -84671, -24613, -101995, 148359, -60380, 6107, 51686, -181451, 67627, 83008, -22460, 177546, 150633, 127756, -20838, 66430, 231411, 239566, 20220, -78284, 18412, 352017, -180945, 427431, 181743, 120211, 495294, 103069, 46741, 177882, -127502, 27614, 265751, -150002, 220058, -86791, -46942, 269574, 171113, -20961, 151150, -184513, -16691, 6092, 895, -97117, 124851, -113220, -151414, -301674, 201397, 339533, -105063, -309342, 315031, -331652, -236699, -166910, 212351, 56824, 103282, -157161, 211915, 38905, 127220, -125054, 277776, 307920, 325739, 2584, 220655, 405071]
12342D05071A06216O9068k1000o8366C8518i1158A16157P7902G0661K11631h4279
12330H4244M7335a2958C39422j68259N6821P1831h81p0361B02216r417i1001A80766
12317B29162m7337L5871J31136I2463c01r77B78307a2859A47458J5677n3138K2070
12305A32067N3578e6641k96249A35841C5608c9973B28740b22639Q2285B48899
12294A94756J08995a31911L6569C84881F9836R6202J7644k0782J11422a91162
12283b45893H9859A9166K65165b6253D63374k06553J44979j75632J71311d5620
12272a59412o6214o9802B39093A02230a09736d0171r5775I222c2682F4348a07000
12260H9033a55327c8600N438m9849A550R7295Q7941G8266d9721N741A66686a04669
$$ y = [405071, 106216, 175284, 154284, 85918, 38518, -91158, 116157, 194059, 70661, 282292, -84279, 84244, 131579, -12958, 339422, 171163, 227984, 299815, -881, -71242, 202216, 192799, -91001, 180766, 229162, 181825, 217696, 348832, 92463, -301, -1278, 278307, -12859, 147458, 163135, 109997, 132067, 185645, -56641, -352890, 135841, 35608, -39973, 228740, -222639, -140354, 248899, 194756, 303751, -131911, -95342, 384881, 69836, 166038, 183682, 162900, 274322, -191162, -245893, 89859, 19166, 284331, -26253, 463374, 256821, 401800, 226168, 397479, -45620, -159412, -225626, -295428, 239093, 102230, -109736, -40171, -135946, 9222, -32682, 64348, -107000, 89033, -155327, -38600, -33162, -83011, 1550, 98845, 186786, 78266, -49721, -43980, 166686, -104669]
12247A86488l922G243J88028h7483B61595c00482A44450h3533A15509R4430p9263
12236A30676m4497a40548A41735n3481L5747j8474b18548E4279g7299F6823f7730
12224A34779k7477M9779f820A80582O908J67943K55753j09466E2739K81987a5389
12212D37438A6644A319J75386D6420J49787J63050l553A11571n1620P2615i912
12200A25108R4414b16490g0622B53288B1773K09772m0615j8185J56027F2102K68532
12189C30634p9119O5175q9113K75128I9868L140k3535O6929i501C09830k2798
12178B87032n9248a24306B66149j2560j598j7135C7351J61916K23439H0252N3445
12167A33697k9989h5865k39301D05163A00144J81805j2537h125C1223J79791G1028
$$ y = [186488, 182566, 7243, 195271, -87483, 261595, -300482, 144450, -83533, 115509, 209939, 130676, 86179, -140548, 141735, 88254, 124001, 105527, -218548, 54279, -77299, 66823, -67730, 134779, 107302, 157081, -6820, 180582, 187490, 355433, 611186, 501720, 52739, 334726, -15389, 437438, 16644, 1319, 176705, 46420, 196207, 359257, 355704, 111571, 59951, 132566, -9912, 125108, 219522, -216490, -70622, 253288, 21773, 231545, 190930, 172745, 328772, 62102, 330634, 251515, 316690, 227577, 502705, 99868, 103008, 79473, 146402, -9501, 309830, 287032, 227784, -124306, 266149, 253589, 251991, 234856, 37351, 199267, 422706, 80252, 133697, 103708, -85865, -325166, 405163, 100144, 281949, 269412, -8125, 31223, 211014, 71028]
12155B57683A27858K3564D9129R2827K09899o8940A26051K19792r2104k9410k1512
12144B02817O6149K0513j7272L0124p9461j00431L02296B12010P3698I5684O5094
12133A60778K55955j6799H3942K32748k0359A34524a05004A59647G8640M57618
12123E36258b06699e1494l5461B20406C6622K02698j4777A1827a30720D00800
12112E76324a42219A68499j8158i2313j55991B09547B5908L26531a45359B86500
12101e192l82185A15780O020h3720J0094A00191m0885a35565B08990c15752a15484
12089B01460C2442a48149L3893G0228f3315q3096F6836J14955a5813B78137q2942
12078A95195D5788O2937A120K91184a14870M1682p675A05121C1187d8009k1063
$$ y = [257683, 127858, 151422, 49129, 141956, 351855, 282915, 126051, 345843, 253739, 224329, 202817, 268966, 289479, 272207, 302331, 222870, 122439, 424735, 212010, 285708, 95684, 160778, 416733, 399934, 83942, 316690, 296331, 134524, -105004, 159647, 78640, 536258, -206699, -51494, -86955, 220406, 36622, 239320, 224543, 11827, -130720, 400800, 576324, -142219, 168499, 150341, -92313, -248304, 209547, 25908, 352439, -145359, 286500, -5192, -387377, 115780, 121800, -83720, -73626, 100191, 59306, -135565, 208990, -315752, -115484, 201460, 32442, -148149, -114256, 70228, -63315, -146411, 66836, 181791, -15813, 278137, 195195, 45788, 108725, 1120, 292304, -114870, -73188, -80863, 105121, 31187, -48009, -69072]
12067f9072j34195A7375a5041C8126P3171e2554J2922J0474l9112B7043i0059
12055B65063j30003L07683I4307a12012d54p6621B7587j2741h6491k5512j91675
12044c03678A12641b37528R837B4498i1161j89598R3908G4167i9683C693P2634
12033G6327f1622k52886J06558F759i207j05671B03608b27752R3243B40401b55696
12021B7674m447J42385a00299j57451N9221A94029i5887B90815A10484b2284B24496
12009b88704g3110B94249f1862C02709g3236o2653k22120B9272e6156o7408e2391
11997a41487A63414b81690A9010b90968d77k4541B86516h8803k34621i1536H4724
11985d23264a39429j28693f8613B73294A6558b04357a9660F4501f8571A99321
$$ y = [-69072, -203267, 17375, -15041, 38126, 111297, -52554, -39632, -29158, -68270, 27043, -90059, 265063, 135060, 442743, 94307, -112012, -454, -77075, 27587, 14846, -86491, -112003, -303678, 112641, -237528, -227691, 24498, -91161, -280759, -186851, 74167, -99683, 3693, 76327, -61622, -314508, -207950, 6759, -9207, -114878, 203608, -227752, -134509, 240401, -255696, 27674, 23227, 165612, -100299, -257750, -198529, 194029, -95887, 290815, 110484, -22284, 224496, -288704, -73110, 294249, -61862, 302709, -73236, -135889, -358009, 29272, -56156, -123564, -52391, -141487, 163414, -281690, 19010, -290968, -477, -25018, 286516, -88803, -323424, -91536, 84724, -423264, -139429, -268122, -68613, 273294, 16558, -204357, -19660, 64501, -68571, 199321]
11974H6746a46857A3396d3482j17426m1781A20463K8964A5367J95201d7111j96522
11963b43633c5539q4898I8762Q331c63345a03578j23587B3131K45496j0069a09520
11951c6167g734B4806a90476j4152P1832J0615k71572a15151E5662b11092P2159
11940a38933K9788D02534A1495i3662j52986A4842a98718B5316B418a30068m4599
11929a74667j67153F284P8571O315a400j7942F4990c8687l0537h093A26627J4123
11917A40750a85092B2330a30595o1953O9726A43039J07404A06895d07250b4361
11906a5213H9969g8651I577i4719J5133j94856i574j52123L2623E4192g4769J2728
11894f2041j13233g6714B42769G2743a47102K6594H7236a04382B38366q1477b27499
$$ y = [86746, -146857, 13396, -43482, -160908, -202689, 120463, 149427, 15367, 210568, -47111, -243633, -35539, -120437, 98762, 107093, -363345, -103578, -227165, 23131, 268627, 258558, -109520, -36167, -7734, 24806, -190476, -204628, -132796, -122181, -393753, -115151, 55662, -211092, -138933, -109145, 402534, 11495, -93662, -246648, 14842, -198718, 25316, 2418, -130068, -174667, -341820, 6284, 84855, 91170, -1400, -19342, 64990, -38687, -69224, -8093, 126627, 140750, -185092, 22330, -130595, -192548, -122822, 143039, 250443, 106895, -407250, -24361, -15213, 89969, -78651, 9577, -94719, -79586, -274442, -9574, -161697, -129074, 54192, -74769, -62041, -175274, -76714, 242769, 72743, -147102, -120508, 87236, -104382, 238366, 156889, -227499]
11882A30759e8800C53011H2533a96044O9637F6717B5572f3762n7666k68279a69857
11870f3121j23171C44939a39305j4909c7467l22121K9025D0205J15697J31504
11860B87406B9702J13697a93121B18965q1383o5741A9229a404j24162C96186D1485
11848D15313h8443j12432j88273J91719D6789Q893b75882A3721L1560b95290e3669
11836a73302B2645a63407P6208A72019G2997b44827g2583A61790n5752k9894a08987
11824a17364C32341d31327b05045C21479a96465e98o2733B72004h7339r7489d7475
11812B2030b32254e9977D6124N0696P523j535c19607i0836C7909K3588a77678
11800A87336a64185A03607b19788R3529L8618E9192c48109j454M5373a46484K0423
$$ y = [130759, -58800, 353011, 82533, -196044, -126407, 66717, 25572, -63762, -121428, -389707, -169857, -63121, -186292, 344939, -139305, -154214, -37467, -359588, -330563, 40205, 155902, 287406, 29702, 143399, -193121, 218965, 137582, 71841, 19229, -1404, -125566, 396186, 41485, 415313, -88443, -200875, -389148, -197429, 46789, 55682, -275882, 13721, 45281, -295290, -53669, -173302, 22645, -163407, -87199, 172019, 72997, -244827, -72583, 161790, 106038, 76144, -108987, -117364, 332341, -431327, -205045, 321479, -196465, -598, -63331, 272004, -87339, -184828, -47475, 22030, -232254, -59977, 46124, 96820, 104343, 102808, -319607, -90836, 37909, 61497, -177678, 187336, -164185, 103607, -219788, -126259, -87641, 59192, -348109, -349563, -304190, -146484, -126061]
11789a26061o8134q7180e1071A19483a75121n2370k3105b2808G8397a28772j26665
11778b55437A18016N7953a86031B06145g5912A86300g5472j31190c583p8954C30
11766a31429k47689E1780a20273D46124g738E4040b74954f79k51309A46836a33713
11754f3328r943A70035n1664h4954K9196A5313a85454P3296A19451a20909A44436
11742C44002A01575Q6063a99470A24384i8633k86281G977J18072a16097D6892
11731b34964f9926A42502e9458B2052c5350A89028f8812L0851B72149a6540m7744
11720f4284k41648c0821A7846b50913H3572b51860M8294M2807M6919B07349a12182
11708d4242o6369F5386a09194K6528C5155I796a00036A59938b45496O6910K6187
$$ y = [-126061, -194195, -281375, -51071, 119483, -175121, -227491, -250596, -22808, 78397, -128772, -255437, 118016, 175969, -186031, 206145, -75912, 186300, -75472, -206662, -3583, -82537, 330, -131429, -379118, 51780, -120273, 446124, -7738, 54040, -274954, -679, -251988, 146836, -133713, -63328, -73271, 170035, 118371, -84954, -55758, 15313, -185454, -112158, 119451, -120909, 144436, 344002, 101575, 187638, -199470, 124384, -98633, -384914, 7977, 126049, -116097, 46892, -234964, -69926, 142502, -59458, 22052, -35350, 189028, -68812, -37961, 272149, -16540, -64284, -305932, -30821, 17846, -250913, 83572, -251860, -203566, -160759, -113840, 207349, -112182, -44242, -110611, 65386, -109194, -82666, 35155, 9796, -100036, 159938, -245496, -178586, -152399]
11697a52399d9992k33681D184a41185m005G2866a40618C58865D9588e1025B57767
11685b1661l02729N7386P5707C6761a82784B4597c80009r1817a86884b0250I2929
11673c473A70989b6853I0075M2569J26147c6944B21624a59402F2422a69181e466
11661E2123M792n333J6821k281a4695A4543N8627b03638j55580b5530B4154d55644
11648c0460k56863f8778j40173q4005A904a03380j51193i1758l9838E9017b89918
11636C5468a77926A1524N3526b83002M6793J05635j37274A14106a2015C13485
11625h4476k5443A90939i1420D25546A20809a2411j30394H0668c786A19985a87043
11613I60d14109K06772I07J00187c1403A75165a78983A92475a2696A9292c69357
$$ y = [-152399, -49992, -283673, 4184, -141185, -145190, 72866, -140618, 358865, 49588, -51025, 257767, -21661, -324390, -267004, -191297, 36761, -182784, 24597, -380009, -471826, -186884, -20250, 92929, -3473, 170989, -26853, 90075, 132644, 258791, -36944, 221624, -159402, 62422, -169181, -5466, 52123, 56915, 51582, 68403, 66122, -14695, 14543, 73170, -203638, -359218, -25530, 24154, -455644, -30460, -287323, -68778, -208951, -292956, 1904, -103380, -254573, -91758, -131596, 59017, -289918, 35468, -177926, 11524, 65050, -283002, -236209, -130574, -267848, 114106, -12015, 313485, -84476, -109919, 190939, -91420, 425546, 120809, -12411, -142805, 80668, -3786, 119985, -187043, 960, -414109, -207337, 907, 101094, -31403, 175165, -178983, 192475, -12696, 19292, -369357]
11601H8147Q9755B271J6942a01938r2022k4133i1028j28465A15441k6528c90718
11589a48685L3009L6543a8582n17907a27482l5144F159b99231A72664b72647B30041
11577a03561A85274a88255R802o6406E0960b99559J40521G0013L33997C3775J70638
11566B04413a1195A62682R2583b7652m2493J2555J9671H4574J70967d4835C1375
11554C37828b7491k28787M9177p325a8657A60934i6933C876e0539j86849d2353
11542A541h1989l0425C1538a75484A3261b10025B10105a3545H9736J08818q1962
11531A16592i0607r0826R476l04801e8405k29359a0919l87674A1690m597J48064
11520A55157k2022a33261B13287K27905a50448G0041J23307G3892n190N4179J59209
$$ y = [88147, 177902, 2271, 19213, -101938, -193960, -218093, -91028, -219493, 115441, 88913, -390718, -148685, -115676, -79133, -18582, -536489, -127482, -162626, 6159, -299231, 172664, -272647, 230041, -103561, 185274, -188255, -178453, -244859, 50960, -299559, -159038, 70013, 404010, 33775, 204413, -11195, 162682, 255265, -27652, -70145, -57590, -37919, 84574, 255541, -44835, 31375, 337828, -27491, -256278, -207101, -214426, -18657, 160934, -96933, 3876, -50539, -237388, -42353, 1541, -81989, -112414, 31538, -175484, 13261, -210025, 210105, -13545, 89736, 198554, 116592, -90607, -181433, -171957, -476758, -58405, -287764, -10919, -398593, 11690, 7093, 155157, 133135, -133261, 213287, 441192, -150448, 70041, 193348, 73892, 68702, 122881, 282090]
11509B82090o3806G1341f6378A936O8438B6115C528a9692B67915H3606J07328
11498A90934H4241P6113K01901B2867M72593k34857A00608L06980q2493e8192
11487b32258A68919o0335b19974i2465E5879L52299I5386P7056b06336g0413A73127
11475C53690a01099H050L23454j61041F7188c3095B89007b19775B84919o5237
11465B19682J14754j44644a29331B69719H2217J63527J88083A62663C0658J96428
11455B27086E3442M15024H4941K17549a05964A81572h7394A17507R4506f3690
11444A07793K64229e1202C11611A41060R1981G3488a50140F9868c7990o1272o3702
11433a62964r2085A56052a99123l7140E2482b969j04670J0332L5926C17638p184
$$ y = [282090, 218284, 71341, -66378, 1936, 70374, 26115, 3528, -19692, 267915, 83606, 190934, 84241, 160354, 362255, 22867, 495460, 260603, 100608, 407588, 325095, -58192, -232258, 168919, 108584, -219974, -92465, 55879, 408178, 95386, 172442, -206336, -70413, 173127, 353690, -101099, 8050, 331504, 170463, 67188, -33095, 289007, -219775, 284919, 219682, 334436, 189792, -129331, 269719, 82217, 245744, 433827, 162663, 30658, 227086, 53442, 468466, 84941, 302490, -105964, 181572, -87394, 117507, 212013, -63690, 107793, 372022, -51202, 311611, 141060, 233041, 73488, -150140, 69868, -37990, -99262, -162964, -255049, 156052, -199123, -236263, 52482, -2969, -107639, -97307, -61381, 317638, 310454]
11422C10454e9788A83113G7820i1174j54315a05661C77366A67929G5679a02948
11411A25183J17981b165j48944E589Q8587h1482a5251j08350j31926C7396K53885
11400B91281C8098A1255f9386j32209d6030j17594B8734a06097G1735J13919b93807
11388f851A03493b99458k8878J49100g7465b1580j25150E3364b21733C2164d580
11376b08129e5331q0075j43373A1027J86371a81145A52068i3521p8920n4154e1901
11364b30226B38329A1786R9365d46783A70917a98926l0117H3866M6014r617b82365
11352d9596A7544a26736r9243k45852A77577a8834A9833R5046K37218a81910j22492
11341c04402A93182j8308p2485a76899H5786a55684j68264k22073A21946l1403
$$ y = [310454, -59788, 183113, 77820, -91174, -245489, -105661, 377366, 167929, 75679, -102948, 125183, 243164, -2165, -151109, 5589, 94176, -81482, -15251, -123601, -255527, 37396, 291281, 38098, 11255, -69386, -201595, -46030, -163624, 28734, -106097, 71735, 185654, -293807, -6851, 103493, -299458, -328336, -179236, -77465, -21580, -146730, 53364, -221733, 32164, -4580, -208129, -55331, -135406, -278779, 11027, 197398, -181145, 152068, -93521, -172441, -226595, -51901, -230226, 238329, 11786, 111151, -446783, 170917, -198926, -229043, 83866, 129880, 120263, -282365, -49596, 17544, -126736, -225979, -471831, 177577, -18834, 19833, 114879, 352097, -181910, -304402, 193182, 174874, 102389, -176899, 85786, -155684, -323948, -546021, 121946, 90543]
11331I0543k3074J03440c05395g4873K3973q9095A39805c1935B16086G6298K9442
11320A05740a243r9672l13656e513j41812b1311A8343a14090j12129g3347A31872
11308H984O5027J54197o518q8093a56074j76383J47444B68058a03430P348J905
11297i4177p8900N4535p3247Q4184m2305A62466f9667j40155h5320k39229D3175
11285b92888a1762j40848L7645J5659A59501B0981O356b87278i0762m6924j06565
11274b44251e0340j66562D8257a41491e8838B04599B2742A1208a08929M8551j03690
11263a64068J5198c8269j36179C07084A17953b5247j5716j69918A79733b98108
11252B53678g2016j47448g434H441L11098b4556H496R0357a44647A5370c3056
$$ y = [90543, 67469, 170909, -305395, -74873, -50900, -139995, 139805, -31935, 216086, 76298, 105740, -1243, -100915, -414571, -5513, -147325, -21311, 18343, -114090, -226219, -73347, 131872, 8984, 74011, 228208, 221690, 133597, -156074, -332457, -185013, 268058, -103430, -96082, -94177, -173077, -118542, -191789, -107605, -149910, 162466, -69667, -209822, -85320, -324549, 43175, -292888, -11762, -152610, -114965, -99306, 159501, 20981, 27337, -287278, -90762, -137686, -244251, -50340, -216902, 48257, -141491, -58838, 204599, 22742, 11208, -108929, -60378, -164068, -148870, -38269, -174448, 307084, 117953, -25247, -40963, -210881, 179733, -298108, 253678, -72016, -219464, -7434, 8441, 319539, -24556, 8496, 98853, -144647, 15370, -33056]
11240a33104d9855j33790O3416A28549b5845B70725b46961h7992A46343b10521
11229A08860d31523J19729J10185c2224j31839c4321j03907M5551j43537A94618
11218D8982a74597O4538j39771b6154A05750b09396j14789E7083a72115j20851
11208b92966L5896E3872B1832c02694j36612O1470N8806J02027C11312A25886
11197A62565E9447b33100A26041c15728a36060a672D482b00103B28257a65513
11186B3268d06189d5105p4359j00155e4662j77576j02527A49698b63952C4525
11175a62140B04286J57348b70115B3897f7151B15069b96742A41921E7208a94323
11164A61942D989J50772H137a25325M6517K3460a0868A3816K1810a9771D5306
$$ y = [-133104, -49855, -183645, -120229, 128549, -25845, 270725, -246961, -87992, 146343, -210521, 108860, -431523, -311794, -201609, -32224, -164063, -34321, -138228, -92677, -236214, 194618, 48982, -174597, -110059, -249830, -26154, 105750, -209396, -324185, 57083, -172115, -292966, -257070, 53872, 21832, -302694, -439306, -377836, -319030, -217003, 311312, 125886, 162565, 59447, -233100, 126041, -315728, -136060, -1672, 4482, -200103, 228257, -165513, 23268, -406189, -45105, -119464, -219619, -54662, -232238, -334765, 149698, -263952, 34525, -162140, 204286, 361634, -270115, 23897, -67151, 215069, -296742, 141921, 57208, -194323, 161942, 4989, 155761, 8137, -125325, -78808, -55348, -10868, 13816, 35626, -19771, 45306]
11152b85412K6195A23243a73091B16939h9520B36569H7208B1761J03869a92769
11141b45253b6335B504b04451P6018N162j18927g250G4786f8821B87177c12658
11129A32846D8357K89542j00930b10000Q0510I6292e301I5683a9626j42655q3961
11118b46242A47592D6202J67668H8455J50562b1743a147B72979j13478a62605
11107D37294b11491B02004F3337L53430J39582A25338q581Q8344L8588E0574N6934
11096A07508D409O08329d3782B13452L234J70444r344A78959E0280L12507a22886
11084B80681j19270j8621L75693A34559O2217N5306g8750C27200A07867Q6223
11074A94090F7670K52759J67897q2697q4638J77409k15088L4999K59712B88383
$$ y = [-285412, -259217, 123243, -173091, 216939, -89520, 236569, 87208, 21761, 125630, -192769, -245253, -26335, 2504, -204451, -128433, -123271, -242198, -7250, 74786, -68821, 287177, -312658, 132846, 48357, 337899, 236969, -210000, -129490, 96292, -5301, 95683, -19626, -162281, -246242, 147592, 46202, 213870, 88455, 239017, -21743, -1147, 272979, 159501, -162605, 437294, -211491, 202004, 63337, 416767, 556349, 125338, 116757, 205101, 243689, 50574, 107508, 4409, 612738, -43782, 213452, 216686, 387130, 377786, 178959, 50280, 362787, -122886, 280681, 161411, 142790, 518483, 134559, 196776, 252082, -78750, 327200, 107867, 194090, 67670, 320429, 488326, 405629, 320991, 498400, 283312, 318311, 578023, 288383]
11063D78064J529N2995j97330j09245P0325L29257B34570j2969N80640B15513
11052C50420K67283K49800l59055J28075J31451O4957J49919l16064K07921k48341
11042F26366K26369r8979N1639o8072r5220J81676K3356J74065l03031J82300
11032I00469p2385K81930D33282K25693J70834J06951k98970q6200N05118l99441
11022F57267r5697L16053l13771K02878j48105k8776K04924l55331j78728J81939
11012D42653P17K75654K96709k38245k45382M78091l28641K80696J49150D00882
11001G72080k66912J47557j59170M27951B94577K7843L14166r1225K01405l06613
10991D40153J12277L20117j18100p9940m3899J64194o0494L37002l45965Q0034
$$ y = [478064, 479593, 532588, 335258, 226013, 296338, 625595, 234570, 221601, 802241, 215513, 350420, 617703, 867503, 508448, 636523, 767974, 832931, 982850, 666786, 874707, 626366, 852735, 753756, 805395, 737323, 642103, 823779, 847135, 1021200, 718169, 900469, 828084, 1110014, 433282, 658975, 829809, 936760, 637790, 551590, 1056708, 657267, 561570, 877623, 563852, 766730, 618625, 589849, 794773, 439442, 260714, 442653, 443370, 719024, 1015733, 777488, 532106, 1010197, 681556, 962252, 1111402, 400882, 772080, 505168, 652725, 493555, 921506, 294577, 322420, 636586, 545361, 746766, 440153, 552430, 872547, 754447, 674507, 630608, 794802, 734308, 1071310, 725345, 805379]
10981H05379J57367L6770M3959n0279L09866j34118L18237R2962P49191j54617
10971B174717M55320k18919M44693N04166j11793J21044N80120m96153q4039p89649
10961B579507r26090J83904n59013j31213q7640O7468l8071k25815j51225L61823
10951A073635j98369k67244k14310j51319K95373j91479A69437J15343J41245
10942D26025A52354j4210F8724K88799E7179L07203C9285J39900E6934j9652c13512
10930C33417a20398A25216d8524j60986A17878b56195H2793b46628b8488k85978
10920c14466A03634N131a22416D6488b75982k370c5277B56484I420K06433J41960
10909C57813h1430A80700a55880A42571d3666H6837b51024J10176j86221R3851
$$ y = [805379, 962746, 999516, 1043475, 993196, 1303062, 1168944, 1487181, 1580143, 2329334, 2174717, 2630037, 2411118, 2855811, 3359977, 3248184, 3369228, 3949348, 3453195, 3369156, 2579507, 1653417, 1837321, 1278308, 1147095, 1059455, 1126923, 1088852, 863037, 711812, 1073635, 875266, 608022, 393712, 242393, 537766, 346287, 169437, 284780, 426025, 152354, 138144, 68724, 357523, 57179, 364382, 39285, 179185, 56934, 37282, -313512, 333417, -120398, 125216, -48524, -209510, 117878, -256195, 82793, -246628, -28488, -314466, 103634, 108765, -122416, 46488, -275982, -278352, -35277, 256484, 9420, 215853, 357813, -81430, 180700, -155880, 142571, -43666, 86837, -251024, -140848, -327069, -233218]
10899b33218c4878j17853E7402b2650j05869r4272A00451a71399c7523C9545c2931
10887A8286i5492j84403c8261j48622r2916f8283f786k55548R6924a446l1796
10876c3242F4054d47180D7527n429K1863g053m50486C6540b73801E8106c37397
10864I7337a07318b6704C0200a44133F316h1541B97705a36301d4745B8773J67167
10853A95940F9941L1787a2355B15594f3551A05520L05730D4314A9546J99021j05882
10842A12685m7062g6797F9785a78880E3342J41881e34553f8384C1791b57666k64343
10831e22009B48991G0851J00975J19769C3973b76343E654g2300b951j37899B45741
10819h9141C8993C03L0250a84957C53258h1611j72699J04959m7720O3396J3075
$$ y = [-233218, -34878, -152731, 57402, -22650, -128519, -222791, 100451, -171399, -37523, 39545, -32931, 18286, -95492, -279895, -38261, -186883, -279799, -68283, -6786, -262334, -165410, -1446, -33242, 64054, -447180, 47527, 42098, 63961, -7053, -457539, 36540, -273801, 58106, -337397, 97337, -107318, -26704, 30200, -144133, 6316, -81541, 297705, -136301, -44745, 28773, 195940, 69941, 101728, -12355, 215594, -63551, 105520, 411250, 44314, 19546, 218567, 112685, 65623, -76797, 69785, -178880, 53342, 195223, -534553, -68384, 31791, -257666, -522009, 248991, 70851, 171826, 291595, 33973, -276343, 5654, -72300, -2951, -140850, 245741, -89141, 38993, 303, 30553, -184957, 353258, -81611, -254310, -149351, -197071, -133675, -120600]
10808a20600r6011Q9903q7672A75712a50668j41608q4086f1A73516c9037G5336
10796G3666i40j32701i398j19329A9197c72040E2177d3840A57041Q1850D4108
10784i4712m43194A34998a53320A47689F62c2580B05972a21060j29615A2578a93149
10772a70767g0383k66426a22594A68279N2327b26611o1208A35726A8469Q9848
10762A08317n3852b75536J08805O1926m969c9650D7651J10697f486B79662a35876
10750d03232H0981a88322A72391a94209i7036j8616A95345c18461B4114P9682
10740A03796J979Q3251b93420j50795a97035B7045a55911F3010e43678a37832
10729g8719A63691a42529A53336a89125B46011a45029A1567J14209b64912B00960
$$ y = [-120600, -216611, -126708, -214380, 175712, -150668, -292276, -376362, -61, 173516, -39037, 75336, 73666, -940, -133641, -9398, -128727, 19197, -372040, 52177, -43840, 157041, 238891, 44108, -94712, -537906, 134998, -153320, 147689, 662, -32580, 205972, -121060, -250675, 12578, -193149, -170767, -70383, -336809, -122594, 168279, 220606, -226611, -287819, 135726, 18469, 108317, 54465, -275536, -166731, -104805, -109774, -39650, 47651, 158348, -6486, 279662, -135876, -403232, 80981, -188322, 172391, -194209, -97036, -115652, 195345, -318461, 24114, 103796, 105775, 189026, -293420, -444215, -197035, 27045, -155911, 63010, -543678, -137832, -78719, 163691, -142529, 153336, -189125, 246011, -145029, 11567, 125776, -264912, 200960]
10718D484K39397a72365M8191e3012l86837B10187l2628a09742A65161b70158
10707G4003L3367R892b17027e2252B71573A18459A2074K47627G0392b82653B49894
10695f38A14631a27773J0059A15853J39656c1679j78345D97486A25014a37498
10684a35186B2285J74236D8597a30032B8389P9248b47o5028e322D8797n567Q681
10672E1911J06700c76811P8259c9401q5000j30311C41784b98583e9130C0816a14947
10660a6021G5721i6797k6773f401l70538H6764K2948a12944c9770j39719H6920
10648A98536E7598i5092C4963R0971a58387B01849a924A59606d58734P7777a20406
10636I2502D2131k60e4010b18k99992c3627j17681F0984a38000H4466b55455F5804
$$ y = [4484, 243881, -172365, -124174, -53012, -439849, 210187, 177559, -109742, 165161, -270158, 74003, 107370, 117262, -217027, -52252, 271573, 118459, 12074, 259701, 70392, -282653, 249894, -638, 114631, -127773, -117714, 115853, 255509, -31679, -210024, 497486, 125014, -137498, -135186, 22285, 196521, 48597, -130032, 28389, 107637, -247, -65275, -5322, 48797, 43230, 51911, 158611, -376811, -298552, -39401, -124401, -254712, 341784, -298583, -59130, 30816, -114947, -16021, 75721, -96797, -123570, -6401, -376939, 86764, 109712, -112944, -39770, -179489, 86920, 198536, 57598, -95092, 34963, 125934, -158387, 201849, -1924, 159606, -458734, -380957, -120406, 92502, 42131, 41871, -54010, -218, -300210, -33627, -151308, 60984, -138000, 84466, -255455, 65804]
10623i5257E3225l51J32578f4706j86544P6691k9808q9904a6903E3751b66518
10611C594J00969c835k10430f6295l14676A16008l1163d3955A77736a361k52051
10600b53412i4327A14704K56242h195k91396e6094a2573k3382j38709k975C53370
10588b39526h9199j59233D06035a50844I1710a0873D9961g0232p632r1642h3488
10576a99223j36146a30049M6557j63692l5578B2760f8331A1208f2662a3812j92110
10565b05922A45785J1406a44171B48883p6952C1390h7709E4770J42057K21075
10555D17902a14992d3979B00150a95985n8696A70557J09272b45531G942c02341
10544b16556i392B26732b2435k94953P7647b9073q3899l2686D5532b63965A3950
$$ y = [-95257, 53225, 52874, 185452, -64706, -251250, -174559, -204367, -294271, -16903, 53751, -266518, 3594, 104563, -3835, -214265, -66295, -380971, 116008, 84845, -43955, 177736, -1361, -253412, -94327, 114704, 370946, -8195, -299591, -56094, -12573, -35955, -174664, -177639, 353370, -239526, -89199, -248432, 406035, -150844, 91710, -10873, 49961, -70232, -77864, -169506, -83488, -199223, -335369, -130049, -83492, -247184, -282762, 22760, -68331, 11208, -62662, -13812, -205922, 145785, 157191, -144171, 248883, 171931, 31390, -87709, 54770, 196827, 417902, -114992, -43979, 200150, -195985, -254681, 170557, 279829, -245531, 7942, -302341, -216556, -9392, 226732, -22435, -317388, -239741, -29073, -112972, -145658, 45532, -263965, 13950]
10532a00749j28552B26801a1821C1427a36846n4295k88268b01400R025j39734
10522c32109H4150b20013A78796f7099C81173b56545c437E1958h5632b6822F1660
10510a45719O5460j41190d7293j49841a2943E5147d9856k58324f2495n7336c4911
10498a89100E992a84688A47014b81748H7050P4659e9485A44936c2517k25216B23956
10486c03014a22234l059d9299j77088J08680j7830d4251b0659B33131A13129a8358
10474G0815K02589c05352A7888c80272a85867B69265e6430j31240A50932P6131
10464B27063a43271j25550L6644L3059N0732k6703N2339F0467a13178A11369c23783
10452A32781C2876a76562P8400H2897a37137H8777a47832i736l27356G4745b85526
$$ y = [-100749, -229301, 226801, -11821, 31427, -136846, -191141, -479409, -201400, -192375, -332109, 84150, -220013, 178796, -67099, 381173, -256545, -3437, 51958, -85632, -26822, 61660, -145719, -80259, -221449, -47293, -197134, -12943, 55147, -49856, -308180, -62495, -119831, -34911, -189100, 5992, -184688, 147014, -281748, 87050, 161709, -59485, 144936, -32517, -257733, 223956, -303014, -122234, -125293, -49299, -226387, -117707, -135537, -44251, -20659, 233131, 113129, -18358, 70815, 273404, -305352, 17888, -380272, -185867, 269265, -56430, -187670, 150932, 227063, -143271, -268821, -232177, -199118, -148386, -175089, -122750, 60467, -113178, 111369, -323783, 132781, 32876, -176562, -98162, 82897, -137137, 88777, -147832, -9736, -337092, 74745, -285526]
10440A00154g320l18379c4610E0633a60398B52597e40494a10306D7647M9675j8751
10429G8571a52403E0398J04539c76104g8355C03705a20889c8402k4147j06493
10419a69042j9083g669q3147M2199k76734h2254A8848i2929j10855B06b58107
10407C03278e6218A01626K17507a67995A07189N4217J84932r7802A02410i7333
10396I0227i7145q6858e3728A26777b46192A34349L77492A09732P9531J24576
10386C13839P5213h3450A65880b01065A49382J69484A09513N6048o563K32886
10376C91884q6204j8304g8778B30009G1962J97774J28756D2085M47394L2082l4850
10365D86711J41243G8654K07141K09827p2566J14076A08692A7611L8681a49383
$$ y = [100154, -7320, -325699, -34610, 50633, -160398, 252597, -540494, -110306, 47647, 97322, 78571, -152403, 50398, 154937, -376104, -78355, 303705, -120889, -38402, -62549, -169042, -188125, -7669, -90816, -48617, -325351, -82254, 18848, -92929, -203784, 206, -258107, 303278, -56218, 101626, 319133, -167995, 107189, 161406, 346338, 248536, 102410, -97333, 90227, -97145, -184003, -53728, 126777, -246192, 134349, 511841, 109732, 189263, 313839, 389052, -83450, 165880, -201065, 149382, 318866, 109513, 165561, 158998, 391884, 305680, 287376, -78778, 230009, 71962, 269736, 398492, 42085, 489479, 521561, 486711, 627954, 78654, 285795, 495622, 423056, 537132, 108692, 17611, 56292, -149383]
10354b39005c8230D48871A31366L66074J19714J41337q3615j79033L5998j88438
10344C43403q0742r9997J70896d0480A60735D9486J95703M2316j30901J00326
10334B56930h9839B33157q1431b31315j75414A49326A8720K53869a13956B88660
10323B43781g8362C29645k9975J59117A32837R7070q1211a992D5861K37300b84962
10311b43637k1943d5775k03208B95251h693n51905D01147i4231A24712L3046a14844
10299b6020j4446j89798B54299b45884j30712A09330o957c800j36808C9145b47289
10287C94987b75674a07979I0334c11675A02393k4750a22728D3212J67474D5850
10276E9759K83484G838a43256r4275A48188d8662j41389a0435B32321l7710d0470
$$ y = [-239005, -38230, 448871, 131366, 497440, 617154, 758491, 674876, 495843, 531841, 343403, 262661, 162664, 333560, -40480, 160735, 49486, 245189, 287505, 156604, 256930, -89839, 233157, 151726, -231315, -406729, 149326, 18720, 272589, -113956, 288660, 243781, -78362, 329645, 299670, 458787, 132837, 229907, 148696, -1992, 45861, 283161, -284962, -243637, -265580, -45775, -248983, 295251, -8693, -560598, 401147, -94231, 124712, 157758, -114844, -26020, -40466, -230264, 254299, -245884, -376596, 109330, 102373, -3800, -140608, 39145, -247289, 394987, -275674, -107979, 90334, -311675, 102393, 77643, -122728, 43212, 210686, 45850, 59759, 343243, 7838, -143256, -237531, 148188, -48662, -190051, -10435, 232321, 194611, -40470]
10264b89116A11296b1144B58474b5533a2401j7482B02935b4806k13643A44168
10253F0118a2537p4532B23187Q2377E3072d7932o7229b594G288a00653j62856
10242b63509f0556k23928C25314F5352L9748l6855J7430c26054I4805J86581C5721
10230a33572B82149A26271A1530a6435k49963G5336a15719j9024k531E1365a02809
10218D0535J584K81178A55340a7943j91189j7278d2661A07390a24732B00852a17049
10206C73812a74500j5688e0407B031f6617b8172l56418d3533C7312i9212C7278
10194a62618M4547j71685A89727d84992B66707b19449e6455A26356L8301h3347
10183H8258d5602B40886c1706k36083J16403r1003C43479a49435K9145j10444
$$ y = [-289116, 111296, -21144, 258474, -25533, -12401, -29883, 202935, -24806, -238449, 144168, 60118, -12537, -87069, 223187, 305564, 53072, -47932, -115161, -2594, 7288, -100653, -263509, -60556, -284484, 325314, 65352, 105100, 68245, 85675, -326054, 94805, 281386, 35721, -133572, 282149, 126271, 11530, -16435, -266398, 75336, -115719, -134743, -137274, 51365, -102809, 40535, 42119, 323297, 155340, -17943, -209132, -226410, -42661, 107390, -124732, 200852, -117049, 373812, -174500, -190188, -50407, 2031, -66617, -28172, -384590, -43533, 37312, -99212, 37278, -162618, -118071, -289756, 189727, -484992, 266707, -219449, -56455, 126356, 164657, -83347, 88258, -45602, 240886, -31706, -267789, -151386, -242389, 343479, -149435, -120290, -230734]
10173b30734A44255E2815a77539p5866C1281a08683I8324a31039q6979k40955
10163d58973f9688E0586a09396c4798k75652J12874e6064A75098G3698l5255K3014
10152F1457a75991A340K48774J39716g0447A71108a99493P166c6345j08809B8726
10140c20355J48199j34025J49809F0007R8142b45020A80966E3190a22557a3341
10129A99604b84901g1025q6791j81103A53193J55093d06420a41281d0118q9600
10119a29718A58423c95326C78121G5378O0467a61202F0918A1422a7212k47188
10109b64400J19540f9987m5653l6654q2936A55580n031F1387E057e42929C0484
10097d40285b04503A06867B7328b29144C6786R179c10210B38377J40742p6591
$$ y = [-230734, 144255, 52815, -177539, -253405, 31281, -108683, 98324, -131039, -218018, -458973, -69688, 50586, -109396, -34798, -310450, -197576, -56064, 175098, 73698, 38443, 61457, -175991, 1340, 250114, 389830, -70447, 171108, -199493, -192327, -36345, -145154, 28726, -320355, -172156, -306181, -156372, 60007, 158149, -245020, 180966, 53190, -122557, -13341, 199604, -284901, -71025, -157816, -338919, 153193, 308286, -406420, -141281, -40118, -129718, 158423, -395326, 378121, 75378, 135845, -161202, 60918, 11422, -17212, -264400, -144860, -69987, -115640, -152294, -235230, 155580, 150549, 61387, 5057, -542929, 30484, -440285, -204503, 106867, 27328, -229144, 36786, 45965, -310210, 238377, 379119, 302528]
10087C02528b76302B92046C3964c52814J65976M7548E7570k3846b14448p146M9193
10076a72401A12858a9688C22598B9640b02025k7706J13648p6633E3576b3016A4951
10064b92645Q6360N3001K7298G4794a76979e6412D45929a06304B0474L015J61687
10053A85176M58f9446a6135j81375E2733c5127B45388r6553m8132a2732j92361
10042b05093B98801j36078f6960b8744r6133m9763h904k38354A81883b5117k13301
10031b38418H6933a75815A35646G003b17850A93692f3525F0389a4570j44470j53889
10020c12929C1436a21940b5522k68939A3556b19601D9735c60586a4136L443k73955
10009b84648C50109f5264k15603Q4194H8051L46814e8674e894p7759o55A33017
$$ y = [302528, -276302, 292046, 33964, -352814, -186838, -139290, 57570, 33724, -214448, -221594, -172401, 112858, -19688, 322598, 29640, -202025, -229731, -116083, -192716, 53576, -23016, 14951, -292645, -206285, -153284, -125986, 74794, -176979, -56412, 445929, -106304, 20474, 23489, 185176, 185634, -69446, -16135, -197510, 52733, -35127, 245388, 148835, 100703, -12732, -205093, 298801, 162723, -66960, -28744, -124877, -174640, -8904, -247258, 181883, -25117, -238418, 86933, -175815, 135646, 7003, -217850, 193692, -63525, 60389, -14570, -159040, -312929, 31436, -121940, -25522, -294461, 13556, -219601, 49735, -360586, -14136, -10693, -284648, 350109, -65264, -280867, -196673, 88051, 434865, -58674, -5894, -83653, -84308, 133017]
9997a7740F6681c4254p9743d3769B1070a89395C6493c207l54814N7589c0485p4492
9985a04977C9833c21400A16814l3490l9883b33844A24494g691A39207b59927k3329
9974b83256J36262a3395j02286B2689K19957j20190N1530b26152h5381F4334d9610
9962E8151a28797L4776q04j47594J1342F4093d52230B02480a83437O936j1440
9951a87941j2165N7819Q722j91436R1887l7499J19314k49626b1757l68191A21056
9939A4040c6443j03552f8483H163J38057F8632N3829I984b07225J5288M8759g0725
9926B4919c30982a18353Q449l9389A04547N0069a66618A04266b49876e9647B83001
9914b53048B20960d1483i446E0512a01740q5576P9685c7971j17215b2351k76617
$$ y = [-17740, 66681, -34254, -113997, -43769, 21070, -189395, 36493, -3207, -358021, -300432, -30485, -104977, 39833, -321400, 116814, 83324, 43441, -233844, 124494, -7691, 139207, -259927, -283256, -146994, -13395, -115681, 22689, 242646, 122456, 173986, -226152, -85381, 64334, -49610, 58151, -128797, -94021, -94825, -242419, -231077, 64093, -452230, 202480, -183437, -176501, -187941, -200106, -142287, -133565, -325001, -233114, -270613, -151299, -400925, -21757, -389948, 121056, 14040, -36443, -139995, -68483, 8163, 146220, 68632, 122461, 9984, -207225, -191937, -143178, -70725, 24919, -330982, -118353, -109904, -149293, 104547, 154616, -166618, 104266, -249876, -59647, 283001, -253048, 220960, -41483, -9446, 50512, -101740, -187316, -107631, -37971, -155186, -22351, -298968]
9903b98968R0061K0111F295f5557j38256c7673B5457b58433j59586E624h6312
9891C55163r5704j21745o7549a06360A24603b43324A99189c08275H0261a39228
9880A18819A9224l493b59470B22813a95158h8568d0076D1223a39107A76660a37064
9868g2127C79690G1671a61635l7930D92368A31387d9232A20214J81043p1811d25822
9856g9338I4414P10b08707O4775N2918B8395j2140a44830d2634j0622j54085B83348
9843E3208a54536e2307D976a1302p5781m3813G061J00257a99265k1093A65053
9831d2814l5545l30428d2190m3539j46586B3696P2460a18829K6512l8275k12074
9820c42666A44292b43592C4877N1336a36495q82f4055n5114d2710H3226a15135
$$ y = [-298968, -208907, -188796, 6295, -65557, -203813, -37673, 25457, -258433, -418019, 5624, -86312, 355163, 259459, 137714, 70165, -106360, 124603, -243324, 199189, -308275, 80261, -139228, 118819, 19224, 15731, -259470, 222813, -195158, -88568, -40076, 41223, -139107, 176660, -137064, -72127, 379690, 71671, -161635, -199565, 492368, 131387, -49232, 120214, 301257, 229446, -425822, -79338, 94414, 95124, -208707, -143932, -91014, 28395, 16255, -144830, -42634, -53256, -207341, 283348, 53208, -154536, -52307, 4976, -11302, -87083, -130896, 7061, 107318, -199265, -220358, 165053, -42814, -78359, -408787, -42190, -85729, -232315, 23696, 96156, -118829, -92317, -130592, -342666, 144292, -243592, 34877, 86213, -136495, -137377, -64055, -119169, -42710, 83226, -115135]
9808b46884r20F3751h4666j14023A66986a40200p9758A9315c59204O8217j39004
9797d29991F4582M0193a78541L8747c4632p7220L1549j94949J1901R606I6757
9785b93084E8374a08726n7657A70362b28530H0743a78916d93j03284G4263a75941
9773a12122m5527E8016J55812a40598A39170b73649B70628a59105N879C351a15647
9761e1922I9682C9588b96342A94539H9460D0167O7756m4841c89435e0086q3416
9750a33502j23844J17097O5670A4616a54321f8566m4672J2608A8798c75783D22288
9738b14086B83360c5860m9585F63L86041j59322c27168i7652H5977c96070A1214
9726c8832k52215a1089n0006D3110a87079h4171j40378b010C8788b20779n073
$$ y = [-246884, -247804, 63751, -84666, -198689, 166986, -140200, -219958, 19315, -359204, -290987, -429991, 64582, 104775, -178541, -139794, -34632, -111852, -80303, -275252, -263351, -253745, 96757, -293084, 58374, -108726, -166383, 170362, -228530, 80743, -178916, -493, -103777, 74263, -175941, -112122, -157649, 58016, 213828, -140598, 139170, -273649, 270628, -159105, -153226, 3351, -115647, -51922, 99682, 39588, -296342, 194539, 89460, 40167, 107923, 63082, -389435, -50086, -133502, -257346, -140249, -74579, 14616, -154321, -68566, -113238, -100630, 18798, -375783, 422288, -214086, 283360, -35860, -85445, 663, 386704, 227382, -327168, -97652, 85977, -396070, 11214, -38832, -291047, -11089, -61095, 43110, -187079, -84171, -224549, -2010, 38788, -220779, -225852]
9715b25852c5761r8816B6180J78576D2335b06995O2217j36123R0448A43300b59982
9703a96098k15296b01749k05661A16054a1628A67198b69101i2854j30866C1959
9692b36584h4714m6572B78051c3099l03824A7058J34602a56827b8092j46910j17976
9681b92978J11396l2285B78289j14135a34546A92302c48874e7396J133j33682
9671a89945A25129r19b6499k15663E0117c30566A4692a00436j22461L5498E9796
9659G3075e693I9845l6949a45104d0964j22763j66528q4898a6325B48604J20683
9648C69287a61601L6818k13596p6002a34525L7277p8442o0257l271g8122a1273
9636E5611i0157A49046g5589j29501h3054H1355J53120d48063B00587h828k3693
$$ y = [-225852, -35761, -134577, 26180, 204756, 42335, -206995, -144778, -280901, -190453, 143300, -259982, -196098, -411394, -201749, -407410, 116054, -11628, 167198, -269101, -92854, -223720, 31959, -236584, -84714, -131286, 278051, -33099, -336923, 17058, 151660, -156827, -28092, -175002, -292978, -181582, -213867, 278289, 164154, -134546, 192302, -348874, -57396, -56263, -189945, 125129, 124210, -26499, -242162, 50117, -330566, 14692, -100436, -222897, -187399, 59796, 73075, -5693, 99845, 62896, -145104, -40964, -163727, -330255, -415153, -16325, 248604, 369287, -161601, -124783, -338379, -414381, -134525, -97248, -175690, -235947, -239218, -78122, -11273, 55611, -90157, 149046, -75589, -205090, -83054, 81355, 234475, -448063, 200587, -8828, -32521]
9625c2521E2733b47252J00412K3733F2505a77896e5124j85454A5754a07786C11642
9613h5457F023J5335K5515j7366a40614j86613J11881F4899M5232A9447a62790
9601I7516D2637f9677j98009f2914G4304c0899H1336O2841a85530B8067Q7664
9590A15731a385C0329J25772d34869B69844d902n315D8495c9869j27595Q0522
9579h6942K2617E0537Q1845a11076i584k40208J03857G9130a932l03298f5785
9567H4849b48646D1104b06100b8810B2999b9562k36884B47432m7000a23463j78509
9556c01972L8681a4211j77890b3726j44796O627A25375B2985M7645j1828d0215
9544c50501C17433a64508J4127l2715l3406C1754b47842g2085j38741c8791A0436
$$ y = [-32521, 52733, -247252, -146840, -123107, 62505, -177896, -55124, -240578, 15754, -107786, 311642, -85457, 6023, 21358, 46873, 29507, -140614, -327227, -215346, 64899, 110131, 19447, -162790, 97516, 42637, -69677, -267686, -62914, 74304, -30899, 81336, 144177, -185530, 28067, 115731, -1385, 30329, 156101, -434869, 269844, -4902, -10217, 48495, -39869, -167464, -86942, -64325, 50537, 132382, -111076, -9584, -249792, -145935, 79130, -1932, -305230, -65785, 84849, -248646, 41104, -206100, -28810, 22999, -29562, -266446, 247432, 200432, -123463, -301972, -263291, -14211, -192101, -23726, -168522, -161895, 125375, 22985, 70630, 58802, -40215, -350501, 317433, -164508, -150381, -183096, -216502, 31754, -247842, -72085, -210826, -38791, 10436]
9532B33174a0869j96263f6746A9580L81821b71556A41826J53269c03760C342O8231
9521G1573a60103k188O634A13241a13568k31907J11547M4723J1262j34032b6427
9509a91378A32552B8101a89739b5101m2085A41328a41372k699A84140L3128b54378
9497c05547Q3999c4263C6090f308k83251a24872j41312C70554a69553M0496A71080
9485b15294N5323d1187j42199D7915q31O634J15959n0654a29242F1360J63415
9474B24775D7102Q6743o0789a69468L6617m662d9775l86900g2248k65829e4878
9462b74884f1689p3950k235f4573m814g091A50014L3665j9982m9061f2955L0146
9450c2809A89134G5088a09885A18259a30502l36286a47518r7054M958o2815H89
$$ y = [233174, -10869, -207132, -66746, 19580, 401401, -271556, 141826, 295095, -303760, 3342, 71573, -160103, -162291, -155657, 113241, -113568, -345475, -233928, -189205, -177943, -311975, -26427, -191378, 132552, 28101, -189739, -25101, -67186, 141328, -141372, -144071, 184140, 217268, -254378, -305547, -221548, -34263, 36090, -6308, -289559, -124872, -266184, 370554, -169553, -129057, 171080, -215294, -159971, -41187, -183386, 47915, 47084, 53718, 169677, 119023, -129242, 61360, 224775, 47102, 133845, 73056, -169468, -132851, -137513, -49775, -436675, -72248, -338077, -54878, -274884, -61689, -135639, -137874, -64573, -69387, -7091, 150014, 183679, 163697, 114636, -62955, -32809, 189134, 75088, -109885, 118259, -130502, -466788, -147518, -244572, -239614, -302429, 889]
9438a63685B40714b16136i1378A1178J33142D46d9443B52220e13137A64183a23879
9426c43605a67624d0775A5037b10038l6146n7342A91697p5621a93671A95066c3860
9414A1842a10123M1779k58824A84432d66371c5580k1974C4700K17239a65262A41181
9402b0514j07798e0057j93793J00249o175B37152c49548H8294m3352b27703a4731
9390B32682A2787J47806a33517d6568A27524d25663J28425d9591A82347a46750
9379a09868a4767I4597J4359b49843a14413j54125A99533n4221d9994p2024A24573
9367h4887J9399j81178B73252b66765M4198p6230L1536O6265k1240a6901l8700
9356e5601a0766p2492j77062e9060j8782K4647j33798i3344B02700g5478D0860
$$ y = [-163685, 240714, -216136, -91378, 11178, 144320, 446, -49443, 252220, -513137, 164183, -123879, -343605, -167624, -40775, 15037, -210038, -246184, -303526, 191697, 116076, -193671, 195066, -33860, 11842, -110123, -68344, -327168, 184432, -466371, -35580, -57554, 34700, 251939, -165262, 141181, -20514, -128312, -50057, -243850, -143601, -149776, 237152, -349548, 88294, 44942, -227703, -14731, 232682, 12787, 160593, -133517, -46568, 127524, -425663, -297238, -49591, 182347, -146750, -109868, -14767, 94597, 108956, -249843, -114413, -268538, 199533, 145312, -49994, -122018, 124573, -84887, -65488, -246666, 273252, -266765, -222567, -298797, -267261, -200996, -222236, -16901, -55601, -10766, -83258, -260320, -59060, -77842, -53195, -186993, -93344, 202700, -75478, 40860]
9344d9619j7578n945l32928E8754a69587P5845m07847A75145a78214J6969c9720
9332A1751K09947a2494E2883J3318a60834r6274A30706K13949a12374k393A03731
9320D1884a50372k91906A27673E5303f4025a3383k35544j901J00302B61140a62306
9308c00n3878G3429a26737A52709G5235O1156f7335A0565d5710k0720E0270a04168
9295a01749C5828M57498a45290A15187i9668d6753j30013H0505b46789a14260
9284I5669c00353a15788e5574m5158D2822b2421q1630A89394C726f4641H1634
9272g8110I8651J11342H9526e498K311B346i6169C6950J20943b20321k6583A78494
9259a18423D3398b66849A83367f8414j74103N9111G4383a80877m6019g5841F4297
$$ y = [-49619, -67197, -73142, -406070, 58754, -169587, -93742, -501589, 175145, -178214, -161245, -39720, 11751, 221698, -12494, 52883, 66201, -160834, -257108, 130706, 344655, -112374, -114767, 103731, 41884, -150372, -442278, 127673, 55303, -64025, -13383, -248927, -250828, -150526, 261140, -162306, -300, -54178, 73429, -126737, 152709, 75235, 136391, -67335, 10565, -45710, -66430, 50270, -104168, -101749, 35828, 493326, -145290, 115187, -99668, -46753, -176766, 80505, -246789, -114260, 95669, -300353, -115788, -55574, -100732, 42822, -22421, -104051, 189394, 3726, -64641, 81634, -78110, 98651, 209993, 89526, -5498, -3187, 2346, -96169, 36950, 157893, -220321, -246904, 178494, -118423, 43398, -266849, 183367, -68414, -242517, -183406, 74383, -180877, -226896, -75841, 64297]
9247b16374a08133K8320A61847A7235a09475A88145g7932B8834c41956J19032
9237b22924B38315a24049H1148b59431J4805b5501l48345J73548e8746c216l58651
9226c61867a30716H5480a70585k7856e6502k66865a06170b8265k89481P5932p9833
9215c21647D25560a27993d6385j9849A67666a4199q3742j71628A76092d11515
9204c7877j96560C97341A22704c82704a63390f324A47319e0089A9748L18368b54918
9192I1868a31309e8080j11264k62840D45210a92854P8718K4571P736A30800g2662
9180a86450Q017k0635L3975k8657P8071A44100e61557c0215A29962L1213i6424
9168e556A41139h0404j0599B56166g6349j3472p4503A42898f4017F6022h1545
$$ y = [-216374, -108133, -79813, 161847, 17235, -109475, 188145, -77932, 28834, -341956, -222924, 238315, -124049, 81148, -259431, -244626, -25501, -373846, -200298, -58746, -3216, -361867, -130716, 85480, -170585, -198441, -56502, -323367, -106170, -28265, -317746, -241814, -321647, 425560, -127993, -46385, -66234, 167666, -14199, -97941, -269569, 176092, -411515, -37877, -234437, 397341, 122704, -382704, -163390, -6324, 147319, -50089, 19748, 338116, -254918, 91868, -131309, -58080, -169344, -432184, 445210, -192854, -114136, -89565, -81829, 130800, -72662, -186450, -178433, -199068, -165093, -193750, -115679, 144100, -561557, -30215, 129962, 161175, -96424, -5556, 141139, -80404, -91003, 256166, -76349, -89821, -164324, 142898, -64017, 66022, -81545]
9156D918a71948M8955E9076P6655c61405A77449a58263d3788B24381a52552l62365
9145e14917b05332h364l56920b221l3646j06378D65582F4803a6285p9175F183
9133b69420B7789K174c87613a23448j26968B4822b18197g6114n7227e380n3732
9122e9112o0670B31304p3560a05204K6765B18889b55259c2410C11469a35936a9765
9110c63590J25687k66527B2153h2435n3585j06425j4193A16631N6338D1265P0968
9099A12233f189E5072c0458A73793i7919D9354K78295a32532N9342F4024i8562
9087e8476m1145C8964J7907a51156c3468p2718J8318A96480c6249C6902J53152
9076A90054c58375E3724J04577a31151A349e4674k05880d2241r4741d0661j80692
$$ y = [4918, -171948, -122993, 59076, 135731, -361405, 177449, -158263, -43788, 224381, -152552, -514917, -205332, -8364, -365284, -2221, -35867, -142245, 465582, 64803, -16285, -95460, 6183, -269420, 27789, 29963, -387613, -123448, -250416, 24822, -218197, -76114, -133341, -5380, -59112, -119782, 231304, 157744, -105204, -78439, 218889, -255259, -32410, 311469, -135936, -19765, -363590, -237903, -504430, 22153, -82435, -136020, -242445, -256638, 116631, 172969, 41265, 112233, -6189, 55072, -30458, 173793, -97919, 49354, 327649, -132532, -73190, 64024, -98562, -58476, -99621, 38964, 56871, -151156, -33468, -106186, -87868, 196480, -36249, 36902, 190054, -358375, 53724, 158301, -131151, 1349, -54674, -260554, -42241, -136982, -40661, -221353]
9065b21353i8992k9975A33380a62087j5061B29107D97K67436h0699A63660a86188
9053A51569J63273c02349A38663b8023j89150i5483L5340k6497n8564p8711M3658
9042a80257e7488A3783J30235c47200a29427I0675b4846m5848n2631j29373A41473
9030A73486b48430i6815G5107K08420a40738k3470L4136m0169H3888d9257O723
9019d2534F0035b4633E211N8541i8081j21525h4405j27893d3573A65077b50379
9007a08478g770k31913A98121a59430j3583j36056h2606A21516J12719d8507j596
8996e0103B09373b61463a19658C9908K39158o8692a51953c2856A91371K14346
8986D05717j87788E7373J07883e4569k02430n7490d8633A54384a42698C56796
$$ y = [-221353, -98992, -128967, 133380, -162087, -177148, 229107, 497, 267933, -80699, 163660, -186188, 151569, 314842, -302349, 138663, -28023, -217173, -95483, -60143, -86640, -145204, -223915, -180257, -57488, 13783, 144018, -347200, -129427, 90675, -24846, -70694, -123325, -252698, 141473, 173486, -248430, -96815, 75107, 283527, -140738, -164208, -130072, -170241, 83888, -49257, -42534, 60035, -24633, 5211, 63752, -98081, -219606, -84405, -212298, -43573, 165077, -250379, -108478, -7770, -239683, 198121, -159430, -173013, -309069, -82606, 121516, 234235, -48507, -50103, 209373, -261463, -119658, 39908, 279066, 210374, -151953, -32856, 191371, 405717, 217929, 57373, 165256, -54569, -256999, -314489, -48633, 154384, -142698, 356796]
8975c93052J4578J69900k36700R7325a00610G8151R070b39174j40645a5598k62063
8964b77661D485h7419A76885a8717l5319g51n37213a99904A29095c43042F1756
8952b08713a4299k022k15471d5100a4191k29564C74177c45432h6147C8442A6956
8940d99953B28552d16596B24329a47076M453C4813a47602B67048f7770j39966
8930b07736e7266F6572N7889B1692e2272A48110J0202M01052L03001J677926Q724032
8919A1264323J821070B752766E87114M4216q2502K9231C4646f3777K4157A95778
8908e9218A8419M0928O38827A80368J736c29728e7877A96184c4855C4918a35227
8896a73183b8905j70959L4148m1289f7987B86519h8503A88205f3810E3123Q7268
$$ y = [-393052, -378474, -208574, -445274, -347949, -100610, 78151, 87221, -239174, -379819, -15598, -277661, 4485, -87419, 176885, -18717, -54036, -751, -537964, -199904, 129095, -343042, 61756, -208713, -14299, -16321, -231792, -45100, -14191, -243755, 374177, -345432, -86147, 38442, 16956, -499953, 228552, -416596, 224329, -147076, -142623, 34813, -147602, 267048, -67770, -207736, -57266, 66572, 124461, 21692, -52272, 148110, 158312, 559364, 862365, 2540291, 11264323, 13085393, 2752766, 587114, 631330, 548828, 578059, 34646, -63777, -39620, 195778, -59218, 18419, 59347, 698174, 180368, 182104, -329728, -57877, 196184, -34855, 34918, -135227, -173183, -28905, -199864, -165716, -207005, -67987, 286519, -88503, 188205, -63810, 53123, 140391]
8885A40391h132F0101a6453q7957H4472a01083A32228m452a48531A59654e5347
8873D490L63931A39436n0394g0837F2905R0284J45954a43354B61170c37573J41865
8862a95708b6417j0479j77529B57410A22879b9504k32536a24893o040e4761B37802
$$ y = [140391, -8132, 60101, -16453, -104410, 84472, -101083, 132228, 127776, -148531, 159654, -55347, 4490, 368421, 139436, 89042, -70837, 62905, 153189, 299143, -143354, 261170, -337573, -195708, -26417, -36896, -214425, 257410, 122879, -29504, -262040, -124893, -130933, -54761, 237802]
$$ [...]
##END NTUPLES=NMR SPECTRUM
##END=
