
##TITLE=AC1260_SUMRS11077_6666646_ZD9ZvVsm6A
##JCAMPDX= 6.0         $$ Bruker NMR JCAMP-DX V2.0
##DATA TYPE= NMR SPECTRUM
##DATA CLASS= NTUPLES
##ORIGIN= BRUKER
##OWNER= Administrator
$$ 1.72 TOPSPIN		Version 2.1
$$ 2012-08-13 20:42:59.375 -0500  Administrator@TOPSPIN
$$ Compression mode = diff/dup
##.OBSERVE FREQUENCY= 400.02188249412
##.OBSERVE NUCLEUS= ^1H
##.ACQUISITION MODE= SIMULTANEOUS (DQD)
##.ACQUISITION SCHEME= undefined
##.AVERAGES= 64
##.DIGITISER RES= 22
##SPECTROMETER/DATA SYSTEM= spect
##.PULSE SEQUENCE= noesygpps1d.comp
##.SOLVENT NAME= COFFEE_meoh
##.SHIFT REFERENCE= INTERNAL, COFFEE_meoh, 1, 14.96214
##AUDIT TRAIL= $$ (NUMBER, WHEN, WHO, WHERE, PROCESS, VERSION, WHAT)
$$ ##TITLE= Audit trail, TOPSPIN		Version 2.1
$$ ##JCAMPDX= 5.01
$$ ##ORIGIN= Bruker BioSpin GmbH
$$ ##OWNER= Administrator
$$ $$ C:\Bruker\TOPSPIN/data/COFFEE/nmr/AC1260_SUMRS11077_6666646_ZD9ZvVsm6A/12/pdata/1/auditp.txt
$$ ##AUDIT TRAIL=  $$ (NUMBER, WHEN, WHO, WHERE, PROCESS, VERSION, WHAT)
(   1,<2012-08-13 20:42:50.203 -0500>,<Administrator>,<TOPSPIN>,<go>,<TOPSPIN 2.1>,
      <created by zg
	started at 2012-08-13 20:31:19.609 -0500,
	POWCHK enabled, PULCHK disabled,
       configuration hash MD5:
       6B 1B 68 BB D9 2E 58 E2 7F 35 AD 54 07 DF 0E 41
       data hash MD5: 64K
       AF 98 70 B1 9D 28 BB CE 2D 32 7B 0F 30 76 36 CE>)
(   2,<2012-08-13 20:42:56.078 -0500>,<Administrator>,<TOPSPIN>,<proc1d>,<TOPSPIN 2.1>,
      <Start of raw data processing
       efp LB = 0.3 FT_mod = 6 PKNL = 1 PHC0 = 0 PHC1 = 0 SI = 128K 
       data hash MD5: 128K
       C4 06 DE B2 29 D3 10 5A EF 88 D9 4F FA CD 61 11>)
(   3,<2012-08-13 20:42:57.359 -0500>,<Administrator>,<TOPSPIN>,<proc1d>,<TOPSPIN 2.1>,
      <pk PHC0 = 5.141602 PHC1 = 0 
       data hash MD5: 128K
       9B 4D 48 88 A1 17 2E 75 F1 8D FA A4 C8 48 6B 66>)
(   4,<2012-08-13 20:42:58.500 -0500>,<Administrator>,<TOPSPIN>,<proc1d>,<TOPSPIN 2.1>,
      <abs ABSG = 1 
       data hash MD5: 128K
       2E 3A 9A 32 2C 3E 24 A8 88 AF 7E 2B 6B 98 23 ED>)
(   5,<2012-08-13 20:42:58.671 -0500>,<Administrator>,<TOPSPIN>,<proc1d>,<TOPSPIN 2.1>,
      <abs ABSG = 2 
       data hash MD5: 128K
       43 E4 BE 4C 93 94 A0 0A 63 C0 16 32 DA 76 0C 07>)
(   6,<2012-08-13 20:42:58.796 -0500>,<Administrator>,<TOPSPIN>,<proc1d>,<TOPSPIN 2.1>,
      <abs ABSG = 3 
       data hash MD5: 128K
       A4 C8 29 C5 B2 EC 77 8A 80 24 D9 EE D2 BC 1D B2>)
(   7,<2012-08-13 20:42:58.921 -0500>,<Administrator>,<TOPSPIN>,<proc1d>,<TOPSPIN 2.1>,
      <abs ABSG = 4 
       data hash MD5: 128K
       37 A3 DF 20 1E D0 40 5D 0E 7E 22 15 88 57 62 F2>)
(   8,<2012-08-13 20:42:59.093 -0500>,<Administrator>,<TOPSPIN>,<proc1d>,<TOPSPIN 2.1>,
      <abs ABSG = 5 
       data hash MD5: 128K
       B5 2D 9A 49 0E A9 77 CA CE 89 A7 45 44 2B 4C 2C>)
$$ ##END=
$$ 
$$ $$ hash MD5
$$ $$ 1B 64 8A 0D DD 21 D4 79 2E 72 CF A7 34 EA 30 39
##$RELAX= 
##$RELAX= 
##$RELAX= 
##$RELAX= 
##$RELAX= 
##$RELAX= 
##$RELAX= 
##$RELAX= 
$$ Bruker specific parameters
$$ [...]
150 150 150 150 150 150 150 150
##$TP07= 0
##$TPNAME0= <>
##$TPNAME1= <>
##$TPNAME2= <>
##$TPNAME3= <>
##$TPNAME4= <>
##$TPNAME5= <>
##$TPNAME6= <>
##$TPNAME7= <>
##$TPOAL= (0..7)
0.5 0.5 0.5 0.5 0.5 0.5 0.5 0.5
##$TPOFFS= (0..7)
0 0 0 0 0 0 0 0
##$TUNHIN= 0
##$TUNHOUT= 0
##$TUNXOUT= 0
##$USERA1= <user>
##$USERA2= <user>
##$USERA3= <user>
##$USERA4= <user>
##$USERA5= <user>
##$V9= 5
##$VALIST= <valist>
##$VCLIST= <CCCCCCCCCCCCCCC>
##$VD= 0
##$VDLIST= <DDDDDDDDDDDDDDD>
##$VPLIST= <PPPPPPPPPPPPPPP>
##$VTLIST= <TTTTTTTTTTTTTTT>
##$WBST= 1024
##$WBSW= 4
##$XGAIN= (0..3)
0 0 0 0
##$XL= 0
##$YL= 0
##$YMAX_a= 13569714
##$YMIN_a= -7816838
##$ZGOPTNS= <>
##$ZL1= 120
##$ZL2= 120
##$ZL3= 120
##$ZL4= 120
##$ABSF1= 14.96214
##$ABSF2= -5.596042
##$ABSG= 5
##$ABSL= 3
##$ALPHA= 0
##$AQORDER= 0
##$ASSFAC= 0
##$ASSFACI= 0
##$ASSFACX= 0
##$ASSWID= 0
##$AUNMP= <proc_prof1d_extract.lims>
##$AXLEFT= 0
##$AXNAME= <>
##$AXNUC= <1H>
##$AXRIGHT= 0
##$AXTYPE= 0
##$AXUNIT= <>
##$AZFE= 0.1
##$AZFW= 0.1
##$BCFW= 0
##$BC_mod= 0
##$BYTORDP= 0
##$COROFFS= 0
##$CY= 15
##$DATMOD= 1
##$DC= 0
##$DFILT= <>
##$DTYPP= 0
##$F1P= 0
##$F2P= 0
##$FCOR= 0.5
##$FTSIZE= 131072
##$FT_mod= 6
##$GAMMA= 0
##$GB= 0
##$INTBC= 1
##$INTSCL= 1
##$ISEN= 128
##$LB= 0.3
##$LEV0= 0
##$LPBIN= 0
##$MAXI= 10000
##$MC2= 0
##$MEAN= 0
##$ME_mod= 0
##$MI= 0
##$NCOEF= 0
##$NC_proc= -2
##$NLEV= 6
##$NOISF1= 0
##$NOISF2= 0
##$NSP= 0
##$NTH_PI= 0
##$NZP= 0
##$OFFSET= 14.96214
##$PC= 1
##$PHC0= 5.141602
##$PHC1= 0
##$PH_mod= 1
##$PKNL= yes
##$PPARMOD= 0
##$PPDIAG= 0
##$PPIPTYP= 0
##$PPMPNUM= 2147483647
##$PPRESOL= 1
##$PSCAL= 4
##$PSIGN= 0
##$PYNMP= <proc.py>
##$REVERSE= no
##$SF= 400.020009178915
##$SI= 131072
##$SIGF1= 0
##$SIGF2= 0
##$SINO= 400
##$SIOLD= 131072
##$SPECTYP= <>
##$SREGLST= <1H.CDCl3>
##$SSB= 0
##$STSI= 131072
##$STSR= 0
##$SW_p= 8223.68421052631
##$SYMM= 0
##$S_DEV= 0
##$TDeff= 65536
##$TDoff= 0
##$TI= <>
##$TILT= no
##$TM1= 0
##$TM2= 0
##$TOPLEV= 0
##$USERP1= <user>
##$USERP2= <user>
##$USERP3= <user>
##$USERP4= <user>
##$USERP5= <user>
##$WDW= 1
##$XDIM= 131072
##$YMAX_p= 457208667
##$YMIN_p= -11251
##$CURPLOT= <Network HP LaserJet P1505>
##$CURPRIN= <$Network HP LaserJet P1505>
##$DFORMAT= <normdp>
##$LAYOUT= <+/1D_H.xwp>
##$LFORMAT= <normlp>
##$PFORMAT= <normpl>
##$SURQMSG= 1
$$ End of Bruker specific parameters
$$ ---------------------------------
##NTUPLES= NMR SPECTRUM
##VAR_NAME=  FREQUENCY,     SPECTRUM/REAL,   SPECTRUM/IMAG
##SYMBOL=    X,             R,               I
##VAR_TYPE=  INDEPENDENT,   DEPENDENT,       DEPENDENT
##VAR_FORM=  AFFN,          ASDF,            ASDF
##VAR_DIM=   131072,        131072,          131072
##UNITS=     HZ,            ARBITRARY UNITS, ARBITRARY UNITS
##FACTOR=    0.0627417313425164, 1,          1
##FIRST=     8223.62146879497, -259,         -51815
##LAST=      0,             1351,            -52774
##MIN=       0,             -11251,          0
##MAX=       8223.62146879497, 457208667,    0
$$ Real data points
##PAGE= N=1
##DATA TABLE= (X++(R..R)), XYDATA
$$ [...]
61156F92442j0251q942q230p414o047m719l740k290J59K713M524O246Q854J1999
$$ 692442 682191 673249 665019 657605 651558 646839 643099 640809 640968 643681 648205 654451 663305 675304
61142F75304J4728J6894J8645J9283J7805J4010Q244J038o342j2024j5233j6848
$$ 675304 690032 706926 725571 744854 762659 776669 784913 785951 779609 767585 752352 735504
61130G35504j7601j7041j5078j3000j1733j0568q812p299o850o691n907n154n274
$$ 735504 717903 700862 685784 672784 661051 650483 641671 634372 627522 620831 614924 609770 604496
61117F04496n502m784l724l539m029m309m580n443o321o257n517m918m358l465
$$ 604496 598994 594210 590486 586947 582918 578609 574029 568586 562265 556008 550491 545573 541215 537750
61103E37750k776k735k427q62J403L293M940O773P999P658O151M171J182l223
$$ 537750 534974 532239 529812 528950 530353 533646 538586 545359 553358 561016 567167 571338 572520 569297
61089E69297p549r940j0656j1169j1676j1411j0574j0010r548q434o792n101l121
$$ 569297 561748 551808 541152 529983 518307 506896 496322 486312 476764 468330 461538 456437 453316
61076D53316q42N64M75K76J252K353K153J661K704M679N610N514N910O636O029
$$ 453316 452474 453038 453513 453789 455041 457394 459547 461208 463912 468591 474201 479715 485625 492261 498290
61061D98290M049K604K640L257L636L846L794L289K933L220L245K069O56N11J229
$$ 498290 502339 504943 507583 510840 514476 518322 522116 525405 528338 531558 534803 536872 537528 538039 539268
61046E39268J468J484K363L612L917L566L651L659K471J043J303K880L666L200
$$ 539268 540736 542220 544583 548195 552112 555678 559329 562988 565459 566502 567805 570685 574351 577551
61032E77551K855L119L310L556M468N382N467N863Q016J0714J1708J1335J1511
$$ 577551 580406 583525 586835 590391 594859 600241 605708 611571 619587 630301 642009 653344 664855
61019F64855J2087J1615J0763J1320J2481J1945J0130R454R874R176P349O489
$$ 664855 676942 688557 699320 710640 723121 735066 745196 754650 764524 773700 781049 787538
61007G87538O666O066N050N742P695Q439Q238R627J2411J3978J4620J7235K1594
$$ 787538 794204 800270 805320 811062 818757 827196 835434 845061 857472 871450 886070 903305 924899
60994I24899K4480K5858K9055L4134L7409L8568M1788M8273N4310N8721O5335
$$ 924899 949379 975237 1004292 1038426 1075835 1114403 1156191 1204464 1258774 1317495 1382830
60983A382830P5424Q4454Q9281R2127R4565R4738R3920R8429J10877J26661J43104
$$ 1382830 1458254 1542708 1631989 1724116 1818681 1913419 2007339 2105768 2216645 2343306 2486410
60972B486410J64042J90523K15664K35109K54345K79327L08907L43964L93843
$$ 2486410 2650452 2840975 3056639 3291748 3546093 3825420 4134327 4478291 4872134
60963D872134M64078N48067O42442P60054R14757J106733J342261J655143K082573
$$ 4872134 5336212 5884279 6526721 7286775 8201532 9308265 10650526 12305669 14388242
60954A4388242K629296L282133M029598M782066N246577M987723L763169J845302
$$ 14388242 17017538 20299671 24329269 29111335 34357912 39345635 43108804 44954106
60946D4954106o1353j293597j631348j258124m44918N94752J557115J952033J355046
$$ 44954106 44892753 43599156 41967808 40709684 40264766 40859518 42416633 44368666 45723712
60937D5723712j97006k135963l745855m622596m795295m512184m002607l411128
$$ 45723712 45526706 43390743 39644888 35022292 30226997 25714813 21712206 18301078
60929A8301078k833002k326736j904480j551578j259292j026474q42383o89900
$$ 18301078 15468076 13141340 11236860 9685282 8425990 7399516 6557133 5867233
60921E867233n63075m66108l97252l46486l07253k78669k57037k35803k14022
$$ 5867233 5304158 4838050 4440798 4094312 3787059 3508390 3251353 3015550 2801528
60912B801528j95694j80459j63137j42707j23792j08619r4859q2419p5285p4738
$$ 2801528 2605834 2425375 2262238 2119531 1995739 1887120 1792261 1709842 1634557 1559819
60902A559819p6674p7444p7291p6456p2967o6307n9068n3163m7822m2528l8366
$$ 1559819 1483145 1405701 1328410 1251954 1178987 1112680 1053612 1000449 952627 910099 871733
60891H71733l5296l1567k6955k3430k1683k0035j7665j5737j4617j3122j1308
$$ 871733 836437 804870 777915 754485 732802 712767 695102 679365 664748 651626 640318
60880F40318j0818j1582j1357r536q349r102j0241j0337j0110j0224r808q601
$$ 640318 629500 617918 606561 597025 588676 579574 569333 558996 548886 538662 528854 520253
60868E20253p916q150p787o281n337n969o663o073n240n413n772n047l597k265
$$ 520253 512337 504187 496400 490119 484782 478813 472150 466077 460837 455424 449652 444605 441008 438743
60854D38743r31L56M85q81k214k288j827j716j282J40J591K065K170K677K906
$$ 438743 437812 438168 438653 437772 435558 433270 431443 429727 428445 428585 430176 432241 434411 437088 439994
60839D39994K086R37K61o53k518m376n102n268n722n600l821j440l90n63k71R15
$$ 439994 442080 443017 443278 442625 440107 435731 430629 425361 419639 414039 410218 408778 408388 407825 407554 408469
60823D08469J737J499Q46M20K27L21Q66J630K497M052O446Q172P520M987K832
$$ 408469 410206 411705 412551 412971 413198 413519 414385 416015 418512 422564 429010 437182 444702 449689 452521
60808D52521K303K630K742K642K823L402M136M585M249L132K017J523J186J69
$$ 452521 454824 457454 460196 462838 465661 469063 473199 477784 482033 485165 487182 488705 489891 490060
60794D90060j409k643l075k951k642k525l085m285n239n287m872m624m262l404
$$ 490060 488651 486008 482933 479982 477340 474815 471730 467445 462206 456919 452047 447423 443161 439757
60780D39757k756l193m147m326l715l413l640l456k494j619j527j852j957j656
$$ 439757 437001 433808 429661 425335 421620 418207 414567 411111 408617 406998 405471 403619 401662 400006
60766D00006r02L35J659K510K916L248L341K794K021J925K513K871K624K372K538
$$ 400006 399104 399439 401098 403608 406524 409772 413113 415907 417928 419853 422366 425237 427861 430233 432771
60751D32771K945L647N001O529O940N873M615M411M871M643L101P28j692l783
$$ 432771 435716 439363 444364 450893 457833 463706 468321 472732 477603 482246 485347 486075 484383 480600
60737D80600n650p477q927r195q176p150p435q574q964q166p323p173p010o134
$$ 480600 474950 467473 458546 449351 441175 434025 426590 418016 409052 400886 393563 386390 379380 373246
60723C73246n042m501m392m258m201m480m875n056n009m670l781k555j763j678
$$ 373246 368204 363703 359311 355053 350852 346372 341497 336441 331432 326762 322981 320426 318663 316985
60709C16985j689j447j541k360l162l036k274j803j860j979j974k005j962j541
$$ 316985 315296 313849 312308 309948 306786 303750 301476 299673 297813 295834 293860 291855 289893 288352
60695B88352q11j71K05L76L01p0n05o37l78J30P77J527K308K973L238K813J953
$$ 288352 287541 287370 287575 287951 288252 288182 287677 287040 286662 286792 287569 289096 291404 294377 297615 300428 302381
60678C02381J598K351L511L908L532L339L514L213K271J813K586L852M687N297
$$ 302381 303979 306330 309841 313749 317281 320620 324134 327347 329618 331431 334017 337869 342556 347853
60664C47853O166O933P072O931P118P538P899Q441R258R623R059Q389Q660R544
$$ 347853 354019 360952 368024 374955 382073 389611 397510 405951 415209 424832 433891 442280 450940 460484
60650D60484R907R457Q768Q116P347O532N688M222J703j165l357m964o712q410
$$ 460484 470391 479848 488616 496732 504079 510611 516299 520521 522224 521059 517702 512738 506026 497616
60636D97616r135q788q260q038p773p245o704o207n587n076n014m931l987k318
$$ 497616 488481 479693 471433 463395 455622 448377 441673 435466 429879 424803 419789 414858 410871 408553
60622D08553r77m17p3M42Q30R89J356K033K514K545K482K496K335K197K876M560
$$ 408553 407576 407159 407086 407528 408358 409347 410703 412736 415250 417795 420277 422773 425108 427305 430181 434741
60606D34741O291P182P514Q146R396J0987J2654J4236J5563J6607J7531J8391
$$ 434741 441032 448214 455728 463874 473270 484257 496911 511147 526710 543317 560848 579239
60594E79239J9022J9272J8931J7423J4167R386M032j222o340j1171j4939j6927
$$ 579239 598261 617533 636464 653887 668054 677440 681472 680250 673910 662739 647800 630873
60582F30873j7189j6357j5025j3550j2105j0674r252q070p403p152o952o662o342
$$ 630873 613684 597327 582302 568752 556647 545973 536721 528651 521248 514096 507144 500482 494140
60569D94140n857n023m046l283k550j334K33J240J069J05p84j102q44j73P53J824
$$ 494140 488283 483260 479214 475931 473381 472047 472280 473520 474589 474694 473910 472808 471964 471791 472544 474368
60553D74368K883L535L330K467J954K567L835M642M553M010L474L115L179L897
$$ 474368 477251 480786 484116 486583 488537 491104 494939 499581 504134 508144 511618 514733 517912 521809
60539E21809M999N986O823P798Q948J0271J2212J5074J8176K0584K2528K5090
$$ 521809 526808 532794 539617 547415 556363 566634 578846 593920 612096 632680 655208 680298
60527F80298K8639L2680L7200M2837M9597N6750O4447P4128Q6651J00972J15255
$$ 680298 708937 741617 778817 821654 871251 928001 992448 1066576 1153227 1254199 1369454
60516A369454J28248J38687J44185J41924J30395J10169Q3439N3240K2708n539
$$ 1369454 1497702 1636389 1780574 1922498 2052893 2163062 2246501 2299741 2322449 2316910
60506B316910k9452m7459n9165o6130p0973p5260p8791q0909q1464q0184p6326
$$ 2316910 2287458 2239999 2180834 2114704 2043731 1968471 1889680 1808771 1727307 1647123 1570797
60495A570797o9688o1261n2123m2383l1778k0636r447K077J4714K8619M3117N7470
$$ 1570797 1501109 1439848 1387725 1345342 1313564 1292928 1283481 1285558 1300272 1328891 1372008 1429478
60483A429478P1508Q5301R8002J06888J08059R9084Q1079N7569L1511M512k1338
$$ 1429478 1500986 1586287 1684289 1791177 1899236 1998320 2079399 2136968 2168479 2172991 2151653
60472B151653m2523n5929o0699n7843m8993l6200k1772p118P889K3887M0938N8960
$$ 2151653 2109130 2053201 1992502 1934659 1885666 1849466 1827694 1820576 1828465 1852352 1893290 1952250
60460A952250P8388R9719J23025J48594J77444K10454K47710K89480L37229L92536
$$ 1952250 2030638 2130357 2253382 2401976 2579420 2789874 3037584 3327064 3664293 4056829
60450D056829M55122N22331N89673O50510O94968P10200O83294O05756M77287
$$ 4056829 4511951 5034282 5623955 6274465 6969433 7679633 8362927 8968683 9445970
60441I445970L06567J08566r9138k98152m70041n99379o78643p10194p03013o67855
$$ 9445970 9752537 9861103 9761965 9463813 8993772 8394393 7715750 7005556 6302543 5634688
60431E634688o14936n53326m89787m28087l70360l18719k74684k37782k06203
$$ 5634688 5019752 4466426 3976639 3548552 3178192 2859473 2584789 2347007 2140804
60422B140804j78796j55416j35630j18272j02481q8342p6353o6695n9087n2912
$$ 2140804 1962008 1806592 1670962 1552690 1450209 1361867 1285514 1218819 1159732 1106820
60412A106820m7521m2666l8555l5304l2735l0802k9604k8718k7294k5215k3367
$$ 1106820 1059299 1016633 978078 942774 910039 879237 849633 820915 793621 768406 745039
60401G45039k2223k1002j8896j6396j4514j3363j2351j1201r963q545p110o361
$$ 745039 722816 701814 682918 666522 652008 638645 626294 615093 605130 596585 589475 583114
60389E83114o532o669n838m520l862l983m142m121m306m584m357l581k831k393
$$ 583114 576582 569913 564075 559555 555693 551710 547568 543447 539141 534557 530200 526619 523788 521395
60375E21395k110k084k624l465l826l342k364j357o27m30p58j141j188j145j330
$$ 521395 519285 517201 514577 511112 507286 503944 501580 500223 499596 499166 498408 497267 496079 494934 493604
60360D93604j434j071o87j072k180l220l738l872l682l126k592k632l126l359
$$ 493604 492170 491099 490412 489340 487160 483940 480202 476330 472648 469522 466930 464298 461172 457813
60346D57813k950k153j327o53l00k81k61P6N94J152K010L291M434M892N029N508
$$ 457813 454863 452710 451383 450730 450430 450149 449888 449964 450558 451710 453720 457011 461445 466337 471366 476874
60330D76874O134O133N386M482L772L230L175M146N972P768R085J0396J2226J4266
$$ 476874 483008 489141 494527 499009 502781 506011 509186 513332 519304 527072 536157 546553 558779 573045
60316E73045J5506J4943J2231Q043L723K14k662n554q474j0703j1609j1219j0180
$$ 573045 588551 603494 615725 623768 627491 627705 625043 619489 611015 600312 588703 577484 567304
60303E67304r387r281r376q826p630o668o373o204n821n718o080o086n238m461
$$ 567304 557917 548636 539260 530434 522804 516136 509763 503559 497738 492020 485940 479854 474616 470155
60289D70155m783n629n684m850m156m071m133l938l515k902k244j956j968j328
$$ 470155 465372 459743 454059 449209 445053 440982 436849 432911 429396 426494 424250 422294 420326 418998
60275D18998N26K630L699L881M151M593M579M254M293M519M206L589L609M163
$$ 418998 419524 422154 425853 429734 433885 438478 443057 447311 451604 456123 460329 463918 467527 471690
60261D71690M177L447L024L445M001M173M513N558O869P740Q171Q675R673J1279
$$ 471690 475867 479314 482338 485783 489784 493957 498470 504028 510897 518637 526808 535483 545156 556435
60247E56435J3159J4624J5425J6358J8430K1550K4791K7664L0318L2764L4834
$$ 556435 569594 584218 599643 616001 634431 655981 680772 708436 738754 771518 806352
60236H06352L6763L8958M1271M3273M4938M6182M6213M4402M1431L8428L5362
$$ 806352 843115 882073 923344 966617 1011555 1057737 1103950 1148352 1189783 1228211 1263573
60225A263573L1445K6706K1790J6549J0366L754j954o478j0665j4630j7428j8732
$$ 1263573 1295018 1321724 1343514 1360063 1370429 1374183 1372229 1365751 1355086 1340456 1323028 1304296
60213A304296j9278j9308j8086j5422j2265r265n983k067K002N842R847J4401
$$ 1304296 1285018 1265710 1247624 1232202 1219937 1210672 1204689 1202622 1204624 1210466 1220313 1234714
60201A234714J9256K4100K8875L3374L7374M1219M5248M8731N0483N0547M9960
$$ 1234714 1253970 1278070 1306945 1340319 1377693 1418912 1464160 1512891 1563374 1613921 1663881
60190A663881M8818M5999M0987L4557K7386J9399J0882K780m595j1861j9139k5571
$$ 1663881 1712699 1758698 1799685 1834242 1861628 1881027 1891909 1894689 1890094 1878233 1859094 1833523
60178A833523l0628l4574l7340l8334l7700l6246l3724k8807k1384j3231n641
$$ 1833523 1802895 1768321 1730981 1692647 1654947 1618701 1584977 1556170 1534786 1521555 1515914
60167A515914J967J0259J8478K5953L3565M2381N1870O0820O9018P6769Q3538
$$ 1515914 1517881 1528140 1546618 1572571 1606136 1648517 1700387 1761207 1830225 1906994 1990532
60156A990532Q8199Q9947Q8089Q1686P0396N5076L6862J6440n068k5482m2780
$$ 1990532 2078731 2168678 2256767 2338453 2408849 2463925 2500787 2517227 2512159 2486677 2443897
60145B443897n6204o5474o9976o9742o6304o1353n5127m7047l7281k6687j5747
$$ 2443897 2387693 2322219 2252243 2182501 2116197 2054844 1999717 1952670 1915389 1888702 1872955
60134A872955m625O190J6310K6160L6468M7326N8450P0002Q2351R5285J08071
$$ 1872955 1868330 1874520 1890830 1916990 1953458 2000784 2059234 2129236 2211587 2306872 2414943
60123B414943J20108J31021J40429J47993J53534J56814J57499J55472J50712
$$ 2414943 2535051 2666072 2806501 2954494 3108028 3264842 3422341 3577813 3728525
60114C728525J42837J31332J16325R8449P7929N4541K8490O03k8272n7055q3858
$$ 3728525 3871362 4002694 4119019 4217468 4295397 4349938 4378428 4379031 4350759 4293704 4209846
60103D209846j06824j25634j40904j52114j57700j57454j53130j46170j36467
$$ 4209846 4103022 3977388 3836484 3684370 3526670 3369216 3216086 3069916 2933449
60094B933449j24030j10181r6082q1478o5963n0236l5139k0603o555O323J7673
$$ 2933449 2809419 2699238 2603156 2521678 2455715 2405479 2370340 2349737 2343182 2349505 2367178
60083B367178K8180L8158M6473N1780N3899N3131M9480M3432L6324K8902K0670
$$ 2367178 2395358 2433516 2479989 2531769 2585668 2638799 2688279 2731711 2768035 2796937 2817607
60072B817607J1595L193l278q454j3412j7783k0685k2386k3550k3711k1990j8540
$$ 2817607 2829202 2832395 2829117 2820663 2807251 2789468 2768783 2746397 2722847 2699136 2677146 2658606
60060B658606j3922p845J3Q575J6161K2094K6308K8053K6423K1687J4881O645
$$ 2658606 2644684 2636839 2636852 2645427 2661588 2683682 2709990 2738043 2764466 2786153 2801034 2807679
60048B807679k449j1033j7666k1913k3669k2234j7300j0174k723M318J0830J5926
$$ 2807679 2805230 2794197 2776531 2754618 2730949 2708715 2691415 2681241 2678518 2682836 2693666 2709592
60036B709592J8480J8535J6731J2869O457j757j0201j8228k6271l4578m2940n1276
$$ 2709592 2728072 2746607 2763338 2776207 2782664 2780907 2770706 2752478 2726207 2691629 2648689 2597413
60024B597413n9380o6421p1767p5767p8688p9560p7355p2696o7083o0942n3784
$$ 2597413 2538033 2471612 2399845 2324078 2245390 2165830 2088475 2015779 1948696 1887754 1833970
60013A833970m5777l7621k9235k0143j0953k966L684J0179J7271K4632L1931L9394
$$ 1833970 1788193 1750572 1721337 1701194 1690241 1687275 1690959 1701138 1718409 1743041 1774972 1814366
60001A814366M7134N4823O2070O8447P3341P6485P8252P8630P6496P0810O2072
$$ 1814366 1861500 1916323 1978393 2046840 2120181 2196666 2274918 2353548 2430044 2500854 2562926
59990B562926N1557L9775K6809J3578J304j0000k1300l2959m4433n5169o4630
$$ 2562926 2614483 2654258 2681067 2694645 2695949 2685949 2664649 2631690 2587257 2532088 2467458
59979B467458p1660p5075p4808p1641o6184n8929n0803m2536l3877k4486j5006
$$ 2467458 2395798 2320723 2245915 2174274 2108090 2049161 1998358 1955822 1921945 1897459 1882453
59968A882453o153K569J1863K0905K8103L3244L7481M1450M4758M7042M8272M8243
$$ 1882453 1876300 1878869 1890732 1911637 1939740 1972984 2010465 2051915 2096673 2143715 2191987 2240230
59956B240230M7025M5547M4385M2369L7885L1297K4524J8451J2257N322j730p949
$$ 2240230 2287255 2332802 2377187 2419556 2457441 2488738 2513262 2531713 2543970 2549292 2547562 2539613
59944B539613j2713j5363j5481j3559j0329n523J546J0442K0020L0242M2144N5973
$$ 2539613 2526900 2511537 2496056 2482497 2472168 2466645 2468191 2478633 2498653 2528895 2571039 2627012
59932B627012P0742Q5749J01206J17165J32900J47563J60418J70322J75800J75612
$$ 2627012 2697754 2783503 2884709 3001874 3134774 3282337 3442755 3613077 3788877 3964489
59922C964489J68525J53068J28679R6846O0026J9925k1960o2672r8470j27100
$$ 3964489 4133014 4286082 4414761 4511607 4571633 4591558 4569598 4506926 4408456 4281356
59912D281356j48172j61648j67618j67388j63022j55538j44859j31618j17478
$$ 4281356 4133184 3971536 3803918 3636530 3473508 3317970 3173111 3041493 2924015
59903B924015j03539q9760p6092o2845m9840l6573k3369j1120L03J2031K4459
$$ 2924015 2820476 2730716 2654624 2591779 2541939 2505366 2481997 2470877 2471180 2483211 2507670
59892B507670L6613M7468N6744O4396P0298P4463P6549P5366O9947O0716M8481
$$ 2507670 2544283 2591751 2648495 2712891 2783189 2857652 2934201 3009567 3079514 3140230 3188711
59881C188711L2826J3080r478l2168n3453p3260r0882j04502j13087j17193j17692
$$ 3188711 3221537 3234617 3225139 3192971 3139518 3066258 2975376 2870874 2757787 2640594 2522902
59870B522902j15253j11115j06730j02323r7208r1599q6488q1686p5755o8221
$$ 2522902 2407649 2296534 2189804 2087481 1990273 1898674 1812186 1730500 1654745 1586524
59860A586524o0257n2880m5895l8988l2319k5851j9424j3623r207n716k244O25
$$ 1586524 1526267 1473387 1427492 1388504 1356185 1330334 1310910 1297287 1288080 1282364 1280120 1280745
59848A280745J494O76LK3l87j372j349M76K927N001P111R405J0830J0839J0193
$$ 1280745 1282239 1282915 1282918 1282941 1282554 1281182 1279833 1280309 1283236 1288237 1295348 1304753 1315583 1326422 1336615
59833A336615R147O634K287k522o736j1006j5872k0103k2276k2633k2185k1195
$$ 1336615 1345762 1352396 1354683 1352161 1345425 1334419 1318547 1298444 1276168 1253535 1231350 1210155
59821A210155j9635j8080j6997j6146j5460j5432j5877j5491j3477j0439p007
$$ 1210155 1190520 1172440 1155443 1139297 1123837 1108405 1092528 1077037 1063560 1053121 1046114
59810A046114k858K148P212J1922J6985K2854K8823L4350L9837M5035M7881M6181
$$ 1046114 1043256 1045404 1052616 1064538 1081523 1104377 1133200 1167550 1207387 1252422 1300303 1346484
59798A346484L9678K9890J9043R750M203K511K735L184L459K784o89p441j4841
$$ 1346484 1386162 1416052 1435095 1444845 1449048 1451559 1454294 1457478 1460937 1463721 1463032 1455591 1440750
59785A440750j9384j9776j6749j1138l600M686J2629K0238K8112L6516M5652N6007
$$ 1440750 1421366 1401590 1384841 1373703 1370103 1374789 1387418 1407656 1435768 1472284 1517936 1573943
59773A573943O7586P9615R1822J05225J20695J37504J53770J67270J74802J71790
$$ 1573943 1641529 1721144 1812966 1918191 2038886 2176390 2330160 2497430 2672232 2844022
59763B844022J54014J20039P2145J6067l9983q7774j22322j42920j51158j49081
$$ 2844022 2998036 3118075 3190220 3206287 3166304 3078530 2956208 2813288 2662130 2513049
59753B513049j39413j25683j10768r5837q1351o7944n5947m5113l5521k7596k0807
$$ 2513049 2373636 2247953 2137185 2041348 1959997 1892053 1836106 1790993 1755472 1727876 1707069
59742A707069j3721n973J205P054J2417J8068K3510K8323L3296L9134M5461N1995
$$ 1707069 1693348 1687375 1688580 1695634 1708051 1726119 1749629 1777952 1811248 1850382 1895843 1947838
59730A947838N9327O7554P5650Q3342R2116J03104J15352J27554J40126J54218
$$ 1947838 2007165 2074719 2150369 2233711 2325827 2428931 2544283 2671837 2811963 2966181
59720B966181J69815J86219K03300K20839K37596K52265K64455K73539K77624
$$ 2966181 3135996 3322215 3525515 3746354 3983950 4236215 4500670 4774209 5051833
59711E051833K75021K65929K51630K33169K12105J91519J74768J63681J58676
$$ 5051833 5326854 5592783 5844413 6077582 6289687 6481206 6655974 6819655 6978331
59702F978331J59708J65998J75765J87076J98092K06002K07267J99991J84799
$$ 6978331 7138039 7304037 7479802 7666878 7864970 8070972 8278239 8478230 8663029
59693H663029J62651J33437R7804N8493J8410k1078n8456r0453j14060j28949
$$ 8663029 8825680 8959117 9056921 9115414 9133824 9112746 9054290 8963837 8849777 8720828
59683H720828j36188j35889j27853j13352r4239p1214m4474j5114J5892M9047
$$ 8720828 8584640 8448751 8320898 8207546 8113307 8042093 7997619 7982505 7998397 8047444
59673H047444Q5001J22752J60781J99036K38088K77230L14798L49298L78465L98209
$$ 8047444 8132445 8255197 8415978 8615014 8853102 9130332 9445130 9794428 10172893 10571102
59663A0571102M04213L93804L64998L15257K43346J51737M5806o8075j82104k86641
$$ 10571102 10975315 11369119 11734117 12049374 12292720 12444457 12490263 12422188 12240084 11953443
59653A1953443l73253m37988m80316n00308m99114m80812m50874m12948l69140
$$ 11953443 11580190 11142202 10661886 10161578 9662464 9181652 8730778 8317830 7948690
59644G948690l22520k77116k36167k02866j82089j78511j92620k20142k54654
$$ 7948690 7626170 7349054 7112887 6910021 6727932 6549421 6356801 6136659 5882005
59635E882005k88878l14942l27201l25572l14084k96139k73136k47034k21023
$$ 5882005 5593127 5278185 4950984 4625412 4311328 4015189 3742053 3495019 3273996
59626C273996j97050j74938j54461j36246j20323j05846r2703q1521p1937o2733
$$ 3273996 3076946 2902008 2747547 2611301 2490978 2385132 2292429 2210908 2138971 2076238
59616B076238n3953m6743m0925l4831k7978k1866j7496j4141j1266r714j0006
$$ 2076238 2022285 1975542 1934617 1899786 1871808 1849942 1832446 1818305 1807039 1797325 1787319
59605A787319j1070j1749j2372j3984j6972k1051k5647k9860l2929l4993l6597
$$ 1787319 1776249 1764500 1752128 1738144 1721172 1700121 1674474 1644614 1611685 1576692 1540095
59594A540095l7490l7022l5493l3847l2156k9746k6772k4174k2051j9619j6848
$$ 1540095 1502605 1465583 1430090 1396243 1364087 1334341 1307569 1283395 1261344 1241725 1224877
59583A224877j4656j3198j1470q904o063l553j423L06J795L988P516J1082J2610
$$ 1224877 1210221 1197023 1185553 1176649 1170586 1167033 1165610 1165916 1167711 1171699 1179215 1190297 1202907
59570A202907J2121J1734J2528J3264J2771J1849J1783J2423J2869J3129J4065
$$ 1202907 1215028 1226762 1239290 1252554 1265325 1277174 1288957 1301380 1314249 1327378 1341443
59559A341443J6207J9204K2140K4151K5268K6657K9511L3805L8764M4097M9917
$$ 1341443 1357650 1376854 1398994 1423145 1448413 1475070 1504581 1538386 1577150 1621247 1671164
59548A671164N5894O1645O7711P4840Q2524Q9498R5462J00970J05753J08682J09463
$$ 1671164 1727058 1788703 1856414 1931254 2013778 2103276 2198738 2299708 2405461 2514143 2623606
59537B623606J08923J07408J04350R9832R5146R0948Q5431P5093N7537L3960R317
$$ 2623606 2732529 2839937 2944287 3044119 3139265 3230213 3315644 3390737 3448274 3482234 3491551
59526C491551j0711k3855l2226l8974m5014m9569n2335n3376n1983m7537m0835
$$ 3491551 3480840 3456985 3424759 3385785 3340771 3291202 3238867 3185491 3133508 3085971 3045136
59515C045136l2793k2545q614Q546K6974M5631O4435Q2459R8053J10437J19171
$$ 3045136 3012343 2989798 2981184 2989730 3016704 3062335 3126770 3209229 3307282 3417719 3536890
59504C536890J22402J17695J04565Q4365N8131K6607q032m2924p6805j09222j37719
$$ 3536890 3659292 3776987 3881552 3965917 4024048 4050655 4042623 3999699 3922894 3813672 3675953
59493C675953j58632j71004j77114j78592j74621j64736j50943j35872j20713
$$ 3675953 3517321 3346317 3169203 2990611 2815990 2651254 2500311 2364439 2243726
59484B243726j05977r2431q0233o8677n7619m7797l9193l0623k1564j2847m982
$$ 2243726 2137749 2045318 1965085 1896408 1838789 1790992 1751799 1721176 1699612 1686765 1681783
59473A681783K656J0549J8433K6312L4522M2618M9896N7147O5865P5451Q3438
$$ 1681783 1684439 1694988 1713421 1739733 1774255 1816873 1866769 1923916 1989781 2065232 2148670
59462B148670Q8998R3850R8872J02117J01350R6441Q7965P5442N8552L8607J7310
$$ 2148670 2237668 2331518 2430390 2532507 2633857 2730298 2818263 2893705 2952257 2990864 3008174
59451C008174m749k7178m8627o7733q4184r7813j07714j13218j14835j13506j09932
$$ 3008174 3003425 2976247 2927620 2859887 2775703 2677890 2570176 2456958 2342123 2228617 2118685
59440B118685j05120j00267r5315q8964q0920p2915o6566o1377n5850m9585m3371
$$ 2118685 2013565 1913298 1817983 1729019 1648099 1575184 1508618 1447241 1391391 1341806 1298435
59429A298435l7985l3665l0111k6527k2398j8371j5498j3447j0694o714k700K55
$$ 1298435 1260450 1226785 1196674 1170147 1147749 1129378 1113880 1100433 1089739 1083025 1080325 1080580
59417A080580K374M234N891P525R832J3051J6532J9774K3257K7762L3062L7067
$$ 1080580 1082954 1087188 1093079 1100604 1110436 1123487 1140019 1159793 1183050 1210812 1243874 1280941
59405A280941L6098K7393J2752j275q573q426m206J574Q786J7608K7610L8185
$$ 1280941 1317039 1344432 1357184 1355909 1347336 1338910 1334704 1336278 1345064 1362672 1390282 1428467
59393A428467M7064M9330M1661K7733J6058J1808J3629J8392K5160L3384M1151
$$ 1428467 1475531 1524861 1566522 1594255 1610313 1622121 1635750 1654142 1679302 1712686 1753837
59382A753837M7432N3538O0549O7693P4553Q2421R1834J01242J09616J18240J28413
$$ 1753837 1801269 1854807 1915356 1983049 2057602 2140023 2231857 2333099 2442715 2560955 2689368
59371B689368J39727J52014J66644J84173K02948K21625K40748K60120K76878
$$ 2689368 2829095 2981109 3147753 3331926 3534874 3756499 3997247 4257367 4534245
59362D534245K88101K93367K93038K86270K72838K55064K35823K16289J97209
$$ 4534245 4822346 5115713 5408751 5695021 5967859 6222923 6458746 6675035 6872244
59353F872244J80352J66623J54516J42519J31202J20923J09362R3607P3127M8387
$$ 6872244 7052596 7219219 7373735 7516254 7647456 7768379 7877741 7971348 8044475 8092862
59343H092862J8209j8901o1828j07534j53619j98015k37346k68244k89966l03815
$$ 8092862 8111071 8092170 8030342 7922808 7769189 7571174 7333828 7065584 6775618 6471803
59333F471803l10448l09524l01505k88099k71127k52169k32740k13672j94834
$$ 6471803 6161355 5851831 5550326 5262227 4991100 4738931 4506191 4292519 4097685
59324D097685j76266j58848j43174j28810j15388j03131r1737q0289o9079n9702
$$ 4097685 3921419 3762571 3619397 3490587 3375199 3272068 3180331 3100042 3030963 2971261
59314B971261n2509m5802l8622l2106k6920k1625j5301r532n801k892J006N380
$$ 2971261 2918752 2872950 2834328 2802222 2775302 2753677 2738376 2728844 2723043 2720151 2721157 2726537
59302B726537Q683J0885J2562J2993J1407Q851O678M313M48m657r951j5382k1145
$$ 2726537 2735220 2746105 2758667 2771660 2783067 2791918 2798596 2802909 2803357 2798700 2788749 2773367 2752222
59289B752222k6391l0429l3964l7410l9484l9211l7821l6753l5248l1870k7017
$$ 2752222 2725831 2695402 2661438 2624028 2584544 2545333 2507512 2470759 2435511 2403641 2376624
59278B376624k1886j6494j0601n113m64M767J1500J8009K2355K5316K8393L0520
$$ 2376624 2354738 2338244 2327643 2322530 2322066 2326833 2338333 2356342 2378697 2404013 2432406 2462926
59266B462926K9539K5647K0603J4464N932m827j6207k7372l8160m7428n3779n7252
$$ 2462926 2492465 2518112 2538715 2553179 2559111 2554284 2538077 2510705 2472545 2425117 2371338 2314086
59254B314086n8404n6574n0977m2479l2609k2426j4416j3449k2440l7837n2128
$$ 2314086 2255682 2199108 2148131 2105652 2073043 2050617 2036201 2022752 2000312 1962475 1910347
59243A910347o0245o1561n7286m9152l9848l1488k3700j5362p410j520K965Q002
$$ 1910347 1850102 1788541 1731255 1682103 1642255 1610767 1587067 1571705 1564295 1562775 1565740 1573742
59231A573742J3572J8251K2299K7219L2846L7733M2100M7550N4206O0882O7800
$$ 1573742 1587314 1605565 1627864 1655083 1687929 1725662 1767762 1815312 1869518 1930400 1998200
59220A998200P6334Q6301R6152J05792J16592J28733J41134J53862J68081J83515
$$ 1998200 2074534 2160835 2256987 2362779 2479371 2608104 2749238 2903100 3071181 3254696
59210C254696J98272K11099K21503K27857K27745K20196K05642J84030J55176
$$ 3254696 3452968 3664067 3885570 4113427 4341172 4561368 4767010 4951040 5106216
59201E106216J20548Q2447M1899l30m1423p7763j08000j32370j49770j58573j59909
$$ 5106216 5226764 5309211 5351110 5350780 5309357 5231594 5123594 4991224 4841454 4682881 4522972
59190D522972j57102j51955j44320j35112j26582j19530j13077j07280j03188
$$ 4522972 4365870 4213915 4069595 3934483 3807901 3688371 3575294 3468014 3364826
59181C364826j00235r6509r1881q8136q5681q2820p8583p3744o8807o3446n8048
$$ 3364826 3264591 3168082 3076201 2988065 2902384 2819564 2740981 2667237 2598430 2534984 2476936
59170B476936n3336m8500m2325l5906l1435k8414k4330j9104j5367j3871j2194
$$ 2476936 2423600 2375100 2332775 2296869 2265434 2237020 2212690 2193586 2178219 2164348 2152154
59159B152154q964n912m384k955j09L259N770P757J0086J2623J5149J8043K1050
$$ 2152154 2143190 2137278 2132894 2129939 2129830 2133089 2138859 2146616 2156702 2169325 2184474 2202517 2223567
59146B223567K3001K3545K3611K3549K2544K0291J7430J3993R309L762j354o038
$$ 2223567 2246568 2270113 2293724 2317273 2339817 2360108 2377538 2391531 2400840 2404602 2403248 2397210
59134B397210j1504j7694k3094k7319l1518l5783l8657l9698m0154m0333l8756
$$ 2397210 2385706 2368012 2344918 2317599 2286081 2250298 2211641 2171943 2131789 2091456 2052700
59123B052700l4712k9472k4142j8486j2617p660l880j08M173Q081J1242J4459
$$ 2052700 2017988 1988516 1964374 1945888 1933271 1925611 1921731 1921623 1925796 1933877 1945119 1959578
59111A959578J7963K1044K3869K7395L0980L2383L0867K8054K5020K1026J6032
$$ 1959578 1977541 1998585 2022454 2049849 2080829 2113212 2144079 2172133 2197153 2218179 2234211
59100B234211J2171J1394J3552J7851K4326L2785M1845M9949N6005N8680N6617
$$ 2234211 2246382 2257776 2271328 2289179 2313505 2346290 2388135 2438084 2494089 2552769 2609386
59089B609386M9731L8712K3222K607k1517m5582o7221q5997j01087j10918j15538
$$ 2609386 2659117 2697829 2721051 2723658 2702141 2656559 2589338 2503341 2402254 2291336 2175798
59078B175798j16862j15908j12130j05869r8876r1795q3678p4621o6403n9774
$$ 2175798 2058936 1943028 1830898 1725029 1626153 1534358 1450680 1376059 1309656 1249882
59068A249882n3651m7642m2830l9317l5655l1484k8183k6029k3391j9713j6577
$$ 1249882 1196231 1148589 1105759 1066442 1030787 999303 971120 945091 921700 901987 885410
59057H85410j4777j2985j0358p921o202m133j460L14O30R42J810J553p40l228
$$ 885410 870633 857648 847290 839369 833167 829034 827574 827888 828518 829460 831270 832823 832083 828855
59043H28855l925k995j191J734N718R653J3293J7768K3143K7803L1202L4731L8649
$$ 828855 824930 821935 820744 822478 828196 837849 851142 868910 892053 919856 951058 985789 1024438
59030A024438M0780L9598L6116L1426K5139J7731J1707Q481O443L797R87j315
$$ 1024438 1065218 1104816 1140932 1172358 1197497 1215228 1226935 1235416 1241859 1245656 1246643 1245328
59018A245328m067p769j0801j1778j1459j0655q531m757j090J185L279O561J0205
$$ 1245328 1241261 1233492 1222691 1210913 1199454 1188799 1180268 1175511 1174421 1175606 1178885 1185446 1195651
59005A195651J2965J5175J7018J6858J3368P622J179o108j4639k3190l0253l5672
$$ 1195651 1208616 1223791 1240809 1257667 1271035 1278657 1279836 1273728 1259089 1235899 1205646 1169974
58993A169974l9440m0754l9765l8368l7604l6158l2929k9002k5566k2004j7829
$$ 1169974 1130534 1089780 1050015 1011647 974043 937885 904956 875954 850388 828384 810555
58982H10555j4330j2407j0677p721m375j991k93J365K505L068M490P509J0654
$$ 810555 796225 783818 773141 765420 761045 759054 758761 760126 762631 765699 770189 777698 788352
58969G88352J2657J4442J7056J9587K0854K1306K1532K0774J8586J5974J3372
$$ 788352 801009 815451 832507 852094 872948 894254 915786 936560 955146 971120 984492
58958I84492R643M704Q81k45r2l14r1J865M818P640J0855J4957J8609K0552K1452
$$ 984492 994135 998839 999720 999475 999383 999069 998978 1000843 1005661 1013301 1024156 1039113 1057722 1078274 1099726
58943A099726K2041K1552J9769J8374J8308J8165J7084J6715J8108J9285J8378
$$ 1099726 1121767 1143319 1163088 1181462 1199770 1217935 1235019 1251734 1269842 1289127 1307505
58932A307505J6762J6467J6890J6699J6847J8800K1802K4597K7974L2976L8450
$$ 1307505 1324267 1340734 1357624 1374323 1391170 1409970 1431772 1456369 1484343 1517319 1555769
58921A555769M2957M7219N2280N7231O1306O6086P3012Q0837Q8268R6879J08458
$$ 1555769 1598726 1645945 1698225 1755456 1816762 1882848 1955860 2036697 2124965 2221844 2330302
58910B330302J21555J33747J45484J58603J72984J87675K03444K20939K38066
$$ 2330302 2451857 2585604 2731088 2889691 3062675 3250350 3453794 3674733 3912799
58901C912799K52407K64529K75701K83977K85944K80758K69082K49527K19787
$$ 3912799 4165206 4429735 4705436 4989413 5275357 5556115 5825197 6074724 6294511
58892F294511J80293J33453Q0516K2485l6989r3118j43623j87940k23986k49111
$$ 6294511 6474804 6608257 6688773 6711258 6674269 6581151 6437528 6249588 6025602 5776491
58882E776491k63572k69920k69581k62930k51857k39133k25703k11321j97015
$$ 5776491 5512919 5242999 4973418 4710488 4458631 4219498 3993795 3782474 3585459
58873C585459j84265j72526j60381j48363j38071j29324j20729j12117j03939
$$ 3585459 3401194 3228668 3068287 2919924 2781853 2652529 2531800 2419683 2315744
58864B315744r5367q5687p6393o9322o3868n8700n4776n3676n4228n3888n2403
$$ 2315744 2220377 2134690 2058297 1988975 1925107 1866407 1811631 1757955 1703727 1649839 1597436
58853A597436n1068m9509m6284m1779l7480l3197k8000k2885j9569j7478j4795
$$ 1597436 1546368 1496859 1450575 1408796 1371316 1338119 1310119 1287234 1267665 1250187 1235392
58842A235392j1580r053o850l906j005M87J427L513O216P983R352J1774J4592
$$ 1235392 1223812 1214759 1207909 1204003 1202998 1203485 1204912 1208425 1214641 1222624 1231976 1243750 1258342
58829A258342J6340J7881K1050K5192K8384L1042L4991L9916M4088M7763N2452
$$ 1258342 1274682 1292563 1313613 1338805 1367189 1398231 1433222 1473138 1517226 1564989 1617441
58818A617441N7720O2023O5947P1267P7604Q3306Q8867R6164J05018J13871J23026
$$ 1617441 1675161 1737184 1803131 1874398 1952002 2035308 2124175 2220339 2325357 2439228 2562254
58807B562254J33998J46360J58569J71089J85435K00934K15686K29777K44150
$$ 2562254 2696252 2842612 3001181 3172270 3357705 3558639 3774325 4004102 4248252
58798D248252K57270K66264K70363K69810K62461K45292K18290J83316J40333
$$ 4248252 4505522 4771786 5042149 5311959 5574420 5819712 6038002 6221318 6361651
58789F361651Q8840L1973k5039p9753j31851j78619k15801k42610k61554k73482
$$ 6361651 6450491 6482464 6457425 6377672 6245821 6067202 5851401 5608791 5347237 5073755
58779E073755k77011k72787k64002k52565k38492k22970k08174j94155j79613
$$ 5073755 4796744 4523957 4259955 4007390 3768898 3545928 3337754 3143599 2963986
58770B963986j65436j53647j43369j31998j19943j09906j01793r2921q3180p5339
$$ 2963986 2798550 2644903 2501534 2369536 2249593 2139687 2037894 1944973 1861793 1786454
58760A786454o9931o4287n7230n0449m4736l8947l3193k9040k6035k1950j6835
$$ 1786454 1716523 1652236 1595006 1544557 1499821 1460874 1427681 1398641 1372606 1350656 1333821
58749A333821j2913j0184o196n19M716R078J4525K1326K7437L2369L7513M2078
$$ 1333821 1320908 1310724 1304528 1304009 1308725 1317803 1332328 1353654 1381091 1413460 1450973 1493051
58737A493051M2914L9066L2450K3570J0967m336j8180k8137l5102l9297l9103
$$ 1493051 1535965 1575031 1607481 1631051 1642018 1637682 1619502 1591365 1556263 1516966 1477863
58726A477863l5016l0614k8121k6616k5577k6378k9173l1961l3983l6544l9719
$$ 1477863 1442847 1412233 1384112 1357496 1331919 1305541 1276368 1244407 1210424 1173880 1134161
58715A134161m1743m2352m3169m4072m3046m0178l7930l6769l4496l0544k6939
$$ 1134161 1092418 1050066 1006897 962825 919779 879601 841671 804902 770406 739862 712923
58704G12923k4266k0827j6588j3779j2655j0799p623n431n044m496l122k762l896
$$ 712923 688657 667830 651242 637463 624808 614009 606386 600955 595911 591415 588293 585531 581635
58691E81635m665m707n776p632p691n831n082o293o676m955l405l226k406M7K096
$$ 581635 576970 572263 566487 558855 551164 545333 540251 533958 527282 522327 518922 515696 513290 513337 515433
58676E15433K784M195P427J0558J2462J4791J8413K1601K3337K4729K5704K4132
$$ 515433 518217 522412 529839 540397 552859 567650 586063 607664 631001 655730 681434 705566
58664G05566J9731J5051J1241O700J130l170n422p735j1018j3519j4629j6031
$$ 705566 725297 740348 751589 758289 759419 756249 750827 743092 732074 718555 703926 687895
58652F87895j7931j8489j7943j8738k0492j9664j5660j2181j0994r528o452m315
$$ 687895 669964 651475 633532 614794 594302 574638 558978 546797 535803 526275 519823 515508
58640E15508m413m107j810J49J40J14J405K206J657J939L889N005M253M284O424
$$ 515508 511095 506988 505178 505327 505467 505581 506986 509192 510849 512788 516677 521682 525935 530219 536643
58625E36643Q069P645P585R674J1897J2635J3691J6389J8933K0225K2154K5594
$$ 536643 544712 552357 559942 569616 581513 594148 607839 624228 643161 663386 685540 711134
58613G11134K8476L0160L3219L8545M3292M6146M9858N6008O2098O6477P1221
$$ 711134 739610 769770 802989 841534 884826 930972 980830 1036838 1098936 1165413 1236634
58602A236634P7321Q2057Q4063Q5831Q8070Q6655P8621O6271N2091L4764J3804
$$ 1236634 1313955 1396012 1480075 1565906 1653976 1740631 1819252 1885523 1937614 1972378 1986182
58591A986182o936k4327l9738n4153o4435o8460o9161o9399o7446o1662n4892
$$ 1986182 1979246 1954919 1915181 1861028 1796593 1728133 1658972 1589573 1522127 1460465 1405573
58580A405573m9792m4238l5948k7416k1757j7449j1677n305l74L758Q062J1207
$$ 1405573 1355781 1311543 1275595 1248179 1226422 1208973 1197296 1191991 1191617 1195375 1203437 1214644
58568A214644J2816J5559K0752K5967L0160L6397M5847N4030N6859N5459N0909
$$ 1214644 1227460 1243019 1263771 1289738 1319898 1356295 1402142 1456172 1513031 1568490 1619399
58557A619399L9629J9131o209l0150n1181o9513q2177q6622q5505q2882p8874
$$ 1619399 1659028 1678159 1671950 1641800 1590619 1521106 1438929 1352307 1266802 1183920 1105046
58546A105046p2470o5751o0680n5375m7990m0752l5996l1965k6694k1995j9549
$$ 1105046 1032576 966825 906145 850770 802780 762028 726032 694067 667373 645378 625829
58535F25829j7248j3555j1021j1267j1167q387n842o066o164l382o38j250k929
$$ 625829 608581 595026 584005 572738 561571 553184 547342 541276 535112 531730 531092 529842 526913
58522E26913k526j933l719n473m251k290k595l227j596M2r26j896J37K655K379
$$ 526913 524387 522454 518735 513262 509011 506721 504126 500899 499303 499345 498419 496523 496660 499315 501694
58507E01694J569L489N967N715M749O188P901O802N332P136J0229J1002J1237
$$ 501694 503263 506752 512719 518434 523183 529371 537272 544074 549406 556542 566771 577773 589010
58494E89010J4590J9673K3108K5843L0356L5139L7995M0756M4766M6006M0960
$$ 589010 603600 623273 646381 672224 702580 737719 775714 816470 861236 907242 948202
58483I48202L3059K6949K1093J2476L766j572o497j5243k5301l1980l6522m2037
$$ 948202 981261 1008210 1029303 1041779 1045545 1043973 1037476 1022233 996932 964952 928430 886393
58471H86393m5875m4104l9503l6981l5006k9669k3288k0611k0069j7208j3157
$$ 886393 840518 796414 756911 719930 684924 655255 631967 611356 591287 574079 560922
58460E60922j1567j0747p246l582l891n472l334M78Q62o92N26K943J917p15K02
$$ 560922 549355 538608 531362 527780 523889 518417 515083 515561 516423 515731 516257 519200 521117 520402 520604
58445E20604L301L415J504K449N445N882M533N689Q488R072Q931J1976J5859J5480
$$ 520604 523905 527320 528824 531273 536718 542600 547133 552822 561310 570382 579313 591289 607148 622628
58431F22628J2602J2599J4136J1674N838J686j013o032j1537j2539j0446j0464
$$ 622628 635230 647829 661965 673639 679477 681163 680150 674118 662581 650042 639596 629132
58419F29132j1676r474n504n090o858n138p49R01M32K831P130Q229P227R389J3523
$$ 629132 617456 607982 602478 597388 590530 585392 584643 585544 585976 588807 595937 604166 611393 620782 634305
58404F34305J4093J2159J3401J6747J5987J1380Q727Q180M866n24k768k552m962
$$ 634305 648398 660557 673958 690705 706692 718072 726799 734979 739845 739321 736553 734001 729039
58391G29039q865q693n457m841n815k571L662O405O008P983J0684P144j645p708
$$ 729039 720174 711481 706024 701183 695368 692797 696459 702864 708872 716855 727539 734683 733038 725330
58377G25330r626j2713j6523j4975q832n248m893j850L684N292K882K904N915
$$ 725330 715704 702991 686468 671493 662661 657413 652520 650670 654354 659646 662528 665432 671347
58364F71347O307M304N619R385R150N707O032R783J0045P090P869J2091J2721
$$ 671347 677654 681958 687577 696962 706112 711819 717851 727634 737679 744769 752638 764729 777450
58351G77450J0195J1932J7608J9303J6531J6600J9716J8477J2700R843J0100O261
$$ 777450 787645 799577 817185 836488 853019 869619 889335 907812 920512 930355 940455 946716
58339I46716j011l273l89q21m985m469J056K672n50J69N963Q106N219N828J1308
$$ 946716 945705 942432 942043 941222 936237 931768 932824 935496 934946 935115 941078 949184 954403 960231 971539
58324I71539J3197J0123J0392J5110J5874J1940J2334J8046J9851J6644J7893
$$ 971539 984736 994859 1005251 1020361 1036235 1048175 1060509 1078555 1098406 1115050 1132943
58313A132943K4697K6951K2806K2229K7338K8160K2151J8800K0476J7942R657
$$ 1132943 1157640 1184591 1207397 1229626 1256964 1285124 1307275 1326075 1346551 1364493 1374150
58302A374150O061R606J0116N057M644J1401J4709J1346J1324J7527J9953J6142
$$ 1374150 1380211 1389817 1399933 1404990 1409634 1421035 1435744 1447090 1458414 1475941 1495894 1512036
58290A512036J6631K3923K7009K3029K3193L0738L4632L1741L3168M1747M5877
$$ 1512036 1528667 1552590 1579599 1602628 1625821 1656559 1691191 1722932 1756100 1797847 1843724
58279A843724M2822M5119N6359O4004O4005O8723Q2145R1541R2146R5523J04538
$$ 1843724 1886546 1931665 1988024 2052028 2116033 2184756 2266901 2358442 2450588 2546111 2650649
58268B650649J05215R2685P9942P1666N5507K8948Q012p39r767k2449k3966j0915
$$ 2650649 2755864 2848549 2928491 3000157 3055664 3084612 3092624 3091885 3082118 3059669 3035703 3024788
58256C024788p79l72N630K3044L5667L6793M2054N7709O7772O6252O9827Q4504
$$ 3024788 3024009 3023637 3029267 3052311 3087978 3124771 3166825 3224534 3292306 3358558 3428385 3512889
58244C512889R2934Q9218R1923J07623J17113J13389J16434J33883J45266J42562
$$ 3512889 3605823 3695041 3786964 3894587 4011700 4125089 4241523 4375406 4520672 4663234
58234D663234J46947J66941J80859J80036J87307K12295K31978K36744K50252
$$ 4663234 4810181 4977122 5157981 5338017 5525324 5737619 5969597 6206341 6456593
58225F456593K81638L05452L12301L29902L69460M03029M19668M49379N04266
$$ 6456593 6738231 7043683 7355984 7685886 8055346 8458375 8878043 9327422 9831688
58216I831688N53779N87196O39432P24060Q05648Q71668R62861J097179J237942
$$ 9831688 10385467 10972663 11612095 12336155 13141803 14013471 14976332 16073511 17311453
58207A7311453J375714J562250J822414K118884K447824K872891L414093M008516
$$ 17311453 18687167 20249417 22071831 24190715 26638539 29511430 32925523 36934039
58199C6934039M638585N385797O299301P347773Q576946J0167869J2261384J4907183
$$ 36934039 41572624 46958421 53257722 60605495 69182441 79350310 91611694 106518877
58191A06518877J8283099K2730911K8409616L5102803M2363061M9188292N3036169
$$ 106518877 124801976 147532887 175942503 211045306 253408367 302596659 355632828
58184C55632828M9876578L6738441J4960820r556755k9967215m2505516m7369011
$$ 355632828 405509406 442247847 457208667 447651912 417684697 375179181 327810170
58177C27810170m6761390m2914477l7520610l1815207k6517842k1854086j7858669
$$ 327810170 281048780 238134303 200613693 168798486 142280644 120426558 102567889
58170A02567889j4576865j1973224r883011q169464o804130n747268m887882m151473
$$ 102567889 87991024 76017800 66134789 57965325 51161195 45413927 40526045 36374572
58162C6374572l547351l068470k651240k264875j939406j678688j437907j205915
$$ 36374572 32827221 29758751 27107511 24842636 22903230 21224542 19786635 18580720
58154A8580720j021053q90122p73504o57609n61797m72530l50822k02444o3622
$$ 18580720 17559667 16669545 15896041 15238432 14676635 14204105 13853283 13650839 13587217
58145A3587217P2713K40216M29834O18759Q41363J147890J532869J997069K625962
$$ 13587217 13659930 13900146 14329980 14948739 15790102 16937992 18470861 20467930 23093892
58136B3093892L498981M587025N843403P231540Q397123Q431087O423409K475420
$$ 23093892 26592873 31179898 37023301 44254841 52651964 61083051 67506460 69981880
58128F9981880k068800n613608p442311p832322p375432o490405n445158m453809
$$ 69981880 67913080 62299472 54857161 47024839 39649407 33159002 27713844 23260035
58120B3260035l615915k908774k310195j845868j509493j241578j010268q32879
$$ 23260035 19644120 16735346 14425151 12579283 11069790 9828212 8817944 7985065
58112G985065p06206n91177m77167l93318l46453l07826k67461k45251k43047
$$ 7985065 7278859 6687682 6210515 5817197 5470744 5162918 4895457 4650206 4407159
58103D407159k37401k23399k17867k17645k00259j66618j39788j22058r4691n8903
$$ 4407159 4169758 3946359 3728492 3510847 3310588 3143970 3004182 2882124 2787433 2728530
58093B728530l6672l2062k9906l0373m7185p3808q8229q9573r5452j06035j05204
$$ 2728530 2691858 2659796 2629890 2599517 2552332 2478524 2390295 2300722 2205270 2099235 1994031
58082A994031r4377r0834r4473q9140p5035o7863o7848o0748m7676m3397m6723
$$ 1994031 1899654 1808820 1714347 1625207 1550172 1482309 1414461 1353713 1306037 1262640 1215917
58071A215917m2474l1173k7672l1875k9548k0829j9597k5528k4519j6292j4492
$$ 1215917 1173443 1142270 1114598 1082723 1053175 1032346 1012749 987221 962702 946410 931918
58060I31918j9702j8829j1311j0084j6150j7277j2449j3119j9560j9884j3404
$$ 931918 912216 893387 882076 871992 855842 838565 826116 812997 793437 773553 760149
58049G60149j1834j6371j6159j0358r584j4462j4368q499p088j0841r855l859
$$ 760149 748315 731944 715785 705427 695843 681381 667013 658514 651426 640585 630730 626871
58037F26871k985p533p120j083K02m494n353j000q13o222q453o283p817j3121
$$ 626871 623886 616353 609233 608150 608352 603858 598505 597505 596692 590470 582017 575734 567917 554796
58023E54796j3188p640n834q914q222k870j447m844m541L98J619j705j249L671
$$ 554796 541608 533968 528134 519220 510998 508128 506681 501837 497296 497694 499313 497608 496359 500030
58009E00030M492M44N85O623R929Q129Q848J4320J7741J7571K0348K6661K8897
$$ 500030 504522 504966 505551 512174 522103 530232 539080 553400 571141 588712 609060 635721 664618
57996F64618K5480K3147K2840J7567O515k666p719j4082k1751k3970k0921k0658
$$ 664618 690098 713245 736085 753652 760167 757501 749782 735700 713949 689979 669058 648400
57984F48400k4448k5037k1272k0306k3211k2679j7445j4891j6672j5741j0485
$$ 648400 623952 598915 577643 557337 534126 511447 494002 479111 462439 446698 436213
57973D36213p999j0134r877m918j671k449j576K426L611Q89R27N399P734N833
$$ 436213 428214 418080 408203 403285 401614 399165 397589 400015 403626 404515 405442 410841 418575 424408
57959D24408N651Q767Q781L613o61j706m616j0325j2452r436p914j0252j0503
$$ 424408 430059 438826 447607 451220 450559 448853 444237 433912 421460 412024 404110 393858 383355
57946C83355o524m311o180o296k258L19r49o44L401N590L650L322P403J0708J0503
$$ 383355 376831 372520 366340 360044 357786 358105 357156 356512 359913 365503 369153 372475 379878 390586 401089
57931D01089J1478J5668J7752J5193J3131J4393J4501J1058Q371Q244N883m08
$$ 401089 412567 428235 445987 461180 474311 488704 503205 514263 522634 530878 536761 536353
57919E36353n129n656o964j1759j5449j5470j6093j9241k0011j6276j3471j4808
$$ 536353 531224 525568 518604 506845 491396 475926 459833 440592 420581 404305 390834 376026
57907C76026j5673j2749r854r757r019n905m736p397q992o847n303o742o629k572
$$ 376026 360353 347604 337750 327993 318974 313069 308333 300936 291944 285097 279794 273052 266423 263851
57893B63851M30r02k144K27K411J070l82J142K682J980K508O356R376Q706P967
$$ 263851 264281 263379 261235 261462 263873 264943 264561 265703 268385 270365 272873 279229 288605 297311 305278
57878C05278R844J0754P973M898M168K664j551m525l767l178n557p333n843m678
$$ 305278 315122 325876 333849 338747 342915 345579 344028 339503 335736 332558 327001 319668 313825 309147
57864C09147o480p536n003k535l220l809j487M99l72l43L506P184O822N532P210
$$ 309147 302667 295131 290128 287593 284373 280564 279077 279576 279204 278861 282367 289551 296373 301905 309115
57849C09115R544R295Q701J0550J2338J1172R285R160Q432N027K028K042K020
$$ 309115 318659 327954 336655 347205 359543 370715 380000 389160 397592 402619 404647 406689 408709
57836D08709r76m150m447m347o821r602r804r276j0182j0327p920n952o684o976
$$ 408709 407733 403583 399136 394789 387968 378366 368562 359286 349104 338777 330857 324905 318221 311245
57822C11245m084r87p43q05J771M547M464L432L944M019J743j53N43P95k011m691
$$ 311245 307161 306174 305431 304626 306397 310944 315408 318840 322784 326803 328546 328393 328936 329731 327720 323029
57806C23029l995k727m526p338p653o772p213p409n432l701m584n589m077k371
$$ 323029 319034 316307 311781 304443 296790 290018 282805 275396 269964 266263 261679 256090 252013 249642
57792B49642l040l760k021j43l03M88M802R057R307Q007R047J0662R551P557P750
$$ 249642 246602 242842 240821 240678 240375 240863 245665 254722 264029 272036 281083 291745 301296 308853 316603
57777C16603Q048N310J979K015L794L521K327L483N749N935N196O492Q458P876
$$ 316603 324651 329961 331940 333955 337749 341270 343597 347080 352829 358764 363960 370452 378910 386786
57763C86786N606M291K790j198n681p267p129q493j0689j1100j0542j1254j2031
$$ 386786 392392 396683 399473 398275 392594 385327 378198 369705 359016 347916 337374 326120 314089
57750C14089j0622q519q190q148n852k842j882j740K3J915J440K71J199K641J599
$$ 314089 303467 294948 286758 278610 272758 269916 268034 266294 266317 268232 269672 269943 271142 273783 275382
57735B75382o30j078p12j976l456k468m88m62j210Q9K344K863K728M294N932M831
$$ 275382 274752 273674 272962 270986 267530 265062 264574 264112 262902 262991 265335 268198 270926 275220 281152 285983
57719B85983K686K952M738M995M427N589P317O881N519O222P920P551N949O072
$$ 285983 288669 291621 296359 301354 305781 311370 318687 325568 331087 337309 345229 352780 358729 364801
57705C64801P354P408P318R680J3229J5125J6708K1269K7875L3009L6639M0800
$$ 364801 372155 379563 386881 396561 409790 424915 441623 462892 490767 523776 560415 601215
57693F01215M3789M1640L4186K4303J2718r29j3451k0420k1994k1315j8715j2813
$$ 601215 645004 686644 720830 745133 757851 756922 743471 723051 701057 679742 661027 648214
57681F48214n540j74M229J0904J9377K6961L4484M4626N6002O5131P3116Q4322
$$ 648214 642674 642500 646729 657633 677010 703971 738455 783081 839083 904214 977330 1061652
57669A061652R9380J15360J32007J51640J73551J93918K09888K17366K06062J64803
$$ 1061652 1161032 1276392 1408399 1560039 1733590 1927508 2137396 2354762 2560824 2725627
57659B725627R3903P842p4663j39686j79959j95563j94045j84673j71317j53839
$$ 2725627 2819530 2827372 2752709 2613023 2433064 2237501 2043456 1858783 1687466 1533627
57649A533627j34481j17484j03547r0365p8015o8503o0859n2313m3660l7857l4088
$$ 1533627 1399146 1281662 1178115 1087750 1009735 941232 880373 828060 784400 746543 712455
57638G12455k9007k3135j9937j9053j6622j2107q696o934m202o31O96r9O75L836
$$ 712455 683448 660313 640376 621323 604701 592594 583898 576964 572762 572131 572827 572728 573403 577239
57624E77239O334P203Q795J1463J2858J3231J5749K0626K4505K6639L0085L5694
$$ 577239 583573 590776 599571 611034 623892 637123 652872 673498 698003 724642 754727 790421
57612G90421M0492M3358M6975N2595N7988O1977O6181P0724P2768P0730O5643
$$ 790421 830913 874271 921246 973841 1031829 1093806 1159987 1230711 1303479 1374209 1439852
57601A439852N7434M4325K6950Q683r021k7247m5048n9045o8330p5173q0077q0879
$$ 1439852 1497286 1541611 1568561 1577244 1568223 1540976 1495928 1436883 1368553 1293380 1213303 1132424
57589A132424p7539p3120o8980o3630n7122n1851m8140m3657l8199l4275l2172
$$ 1132424 1054885 981765 912785 849155 792033 740182 692042 648385 610186 575911 543739
57578E43739k9248k5061k2355k1848k0839j8169j5865j4717j2972j0498r560j0203
$$ 543739 514491 489430 467075 445227 424388 406219 390354 375637 362665 352167 342607 332404
57566C32404r626p242n719n867n327l492k766l628l430j549p64j972k437r88n6
$$ 332404 322778 315536 309817 303950 298623 295131 292365 288737 285307 283758 282994 281022 278585 277597 277541
57551B77541p88q72P98J973J511J465K829L667L324M035O439P944P490P524R284
$$ 277541 276753 275881 276679 278652 280163 281628 284457 288124 291448 295483 301922 309866 317356 324880 334164
57536C34164J0507R789R009R401R458Q629Q851J0568J1505J1183J2300J5723J8637
$$ 334164 344671 354460 363469 372870 382328 390957 399808 410376 421881 433064 445364 461087 479724
57523D79724J9570K0767K3559K5931K6890K8734L2637L6477L9266M3251M9174
$$ 479724 499294 520061 543620 569551 596441 625175 657812 694289 733555 776806 825980
57512H25980N3982N5784N6624N7675N6126M9737M0260K9496J6170k84j6826l0629
$$ 825980 879962 935746 992370 1050045 1106171 1155908 1196168 1225664 1241834 1241550 1224724 1194095
57500A194095m2141n1789n7738n9617o0311o1216n9757n4527m8660m4922m1508
$$ 1194095 1151954 1100165 1042427 982810 922499 861283 801526 746999 698339 653417 611909
57489F11909l6189l0671k7265k4811k1537j8623j7433j6333j3635j0691q975p210
$$ 611909 575720 545049 517784 492973 471436 452813 435380 419047 405412 394721 385746 378536
57477C78536m383k361k411k377m43J574J788J769L204M412L684L027M910Q190
$$ 378536 374153 371792 369381 367004 366561 368135 369923 371692 374896 379308 382992 386019 390929 399119
57463C99119J0656J2970J6592K0455K3087K5582K9314L3155L5921L9064M3964
$$ 399119 409775 422745 439337 459792 482879 508461 537775 570930 606851 645915 689879
57452F89879M9101N2728N5561N8035N7864N3388M6409L8656K8458J4163k056j7110
$$ 689879 738980 791708 847269 905304 963168 1016556 1062965 1101621 1130079 1144242 1142186 1125076
57440A125076l0802m3537n3232n8144o0035o1107o0479n7066n2936n0133m6992
$$ 1125076 1094274 1050737 997505 939361 879326 818219 757740 700674 647738 597605 550613
57429E50613m1450l5364l1574k9220k5987k2599k0900j9739j7012j3908j2955
$$ 550613 509163 473799 442225 413005 387018 364419 343519 323780 306768 292860 279905
57418B79905j3470j2898j1196j0061r290p645n979n841o256n241l351k523k695
$$ 279905 266435 253537 242341 232280 222990 215345 209366 203525 197269 192028 188677 186154 183459
57405A83459k608k526l145l372k090o03n06q04k8P66P2r85p66k34q10j172L90
$$ 183459 180851 178325 175180 171808 169718 169115 168609 167805 167777 168543 168615 167630 166864 166630 165820 164648 165038
57388A65038K458K755K073K446L298K959K202K592L019J607m89q48P8J24p16j044
$$ 165038 167496 170251 172324 174770 178068 181027 183229 185821 188840 190447 189958 189110 189188 189312 188596 187552
57372A87552j206k181k786j565L5j86j359j444j280k860n040n063l252k234k398
$$ 187552 186346 184165 181379 179814 179849 179663 178304 176860 175580 172720 167680 162617 159365 157131 154733
57357A54733k072j266j407j985j263K04K96q49j218n77m70j029j015n42p42j244
$$ 154733 152661 151395 149988 148003 146740 146944 147240 146391 145173 144596 144126 143097 142082 141540 140798 139554
57341A39554q17J17L59L82J165J719P27o07l29Q70J177J111K159L349K759J251
$$ 139554 138737 138854 139213 139595 140760 142479 143206 142599 142270 143140 144317 145428 147587 150936 153695 154946
57325A54946J041J706J243Q6K35J275J139J84O12K343L117K425J857J840J437
$$ 154946 155987 157693 158936 159022 159257 160532 161671 161855 162467 164810 167927 170352 172209 174049 175486
57310A75486R86J663K803K811K166K428L033K327R16O71J242J074Q50K248M088
$$ 175486 176472 178135 180938 183749 185915 188343 191376 193703 194619 195290 196532 197606 198456 200704 204792
57295B04792L708J555M77R21Q18j78l62K85J6j032j024k97j129l458m523l270
$$ 204792 208500 210055 210532 211453 212271 212093 211731 212016 212032 211000 209976 209679 208550 205092 200569 197299
57279A97299j519m99M48J431J578J376K255L750M056L334L263L581K567O65l6
$$ 197299 195780 195281 195729 197160 198738 200114 202369 206119 210175 213509 216772 220353 222920 223585 223549
57264B23549K20q23l103m183l768m296o386p552o422m711l968l556k848k513k689
$$ 223549 223769 222946 219843 215660 211892 207596 201210 193658 187236 182525 178557 175001 172153 169640 166951
57249A66951k463j873j912k298j808q34q76j562j113L07P95J61M0O30N44j61o0
$$ 166951 164488 162615 160703 158405 156597 155763 154887 153325 152212 152519 153314 153475 153515 154145 154689 154528 154468
57232A54468N84K41n97j33R56K63j751k003P8J688J509J328K094K315J513J430
$$ 154468 155052 155293 154696 154563 155519 155782 154031 152028 152106 153794 155303 156631 158725 161040 162553 163983
57216A63983K568L064K203J678K252K451J724J562K389K610J834J801K920L183
$$ 163983 166551 169615 171818 173496 175748 178199 179923 181485 183874 186484 188318 190119 193039 196222
57202A96222J794P19J220J839J255L99M07R90J776K915L647K871J620K110M023
$$ 196222 198016 198735 199955 201794 203049 203448 203855 204845 206621 209536 213183 216054 217674 219784 223807
57187B23807M817M078M151N908P468P861Q394R389R198P652O934P836Q494Q091
$$ 223807 228624 232702 236853 242761 250229 258090 266484 275873 285071 292723 299657 307493 315987 324078
57173C24078Q293R791J0860J0855J1680J4180J6402J6968J7125J7927J8444J8246
$$ 324078 332371 342162 353022 363877 375557 389737 406139 423107 440232 458159 476603 494849
57161D94849J8557J9527J9446J7990J7234J8071J8797J8563J8905K0461K1512
$$ 494849 513406 532933 552379 570369 587603 605674 624471 643034 661939 682400 703912
57150G03912K1287K1462K2760K3422K2564K1837K2160K2160K1404K1705K3542
$$ 703912 725199 746661 769421 792843 815407 837244 859404 881564 902968 924673 948215
57139I48215K4697K4175K3965K5130K5837K5223K5421K7501K9114K8650K8128
$$ 948215 972912 997087 1021052 1046182 1072019 1097242 1122663 1150164 1179278 1207928 1236056
57128A236056K9360L0754L0713L0810L2627L4645L5211L5647L7448L9344M0122
$$ 1236056 1265416 1296170 1326883 1357693 1390320 1424965 1460176 1495823 1533271 1572615 1612737
57117A612737M1565M5521N0726N5400O0398O6907P3712P9865Q7602R9458J14831
$$ 1612737 1654302 1699823 1750549 1805949 1866347 1933254 2006966 2086831 2174433 2273891 2388722
57106B388722J32269J52807J78183K08247K43242K86298L40662M06684M84226
$$ 2388722 2520991 2673798 2851981 3060228 3303470 3589768 3930430 4337114 4821340
57097D821340N75348O81382Q00370R31237J078388J248305J443241J660949J897173
$$ 4821340 5396688 6078070 6878440 7809677 8888065 10136370 11579611 13240560 15137733
57088A5137733K143395K384057K601154K780823K911152K974478K947352K809697
$$ 15137733 17281128 19665185 22266339 25047162 27958314 30932792 33880144 36689841
57080C6689841K551866K174137J684533J099431M44099k48857r41267j591289
$$ 36689841 39241707 41415844 43100377 44199808 44643907 44395050 43453783 41862494
57072D1862494k157776k606480k915164l076910l101475l012067k837490k605577
$$ 41862494 39704718 37098238 34183074 31106164 28004689 24992622 22155132 19549555
57064A9549555k342026k070400j808872j567552j351068j162572j003272q70093
$$ 19549555 17207529 15137129 13328257 11760705 10409637 9247065 8243793 7373700
57056G373700p57304o60461n77154n05159m42284l87362l39610k97712k60857
$$ 7373700 6616396 5955935 5378781 4873622 4431338 4043976 3704366 3406654 3145797
57047C145797k29386k02918j79408j57687j39074j24684j13029j02278r2840q5509
$$ 3145797 2916411 2713493 2534085 2376398 2237324 2112640 1999611 1897333 1804493 1718984
57037A718984p9045p2108o5693o1085n7208n2664m8544m6403m5157m2924m0306
$$ 1718984 1639939 1567831 1502138 1441053 1383845 1331181 1282637 1236234 1191077 1148153 1107847
57026A107847l8775l7465l4743l1612l0159k9842k8536k6239k4505k3211k1188
$$ 1107847 1069072 1031607 996864 965252 935093 905251 876715 850476 825971 802760 781572
57015G81572j9175j8737j8991j7796j5555j4440j4448j3682j2153j1671j2047
$$ 781572 762397 743660 724669 706873 691318 676878 662430 648748 636595 624924 612877
57004F12877j1011q108n287l301q74K216M550O163Q928J3125J6949K0298K5716
$$ 612877 601866 593758 588471 585170 584296 586512 591062 597225 606153 619278 636227 656525 682241
56991F82241L4322M4213N4409O7026Q3588J02949J25673J56856K00686K55483
$$ 682241 716563 760776 815185 882211 965799 1068748 1194421 1351277 1551963 1807446
56981A807446L18733L91577M66390N08187M63294L03211O1798j79962l51080m31716
$$ 1807446 2126179 2517756 2984146 3492333 3955627 4258838 4320636 4140674 3789594 3357878
56971C357878m43777m16103l66783l08412k52808k06050j66729j32747j05219
$$ 3357878 2914101 2497998 2131215 1822803 1569995 1363945 1197216 1064469 959250
56962I59250q4106o5787m7870l2084j9747q626K640J0704J1346M488p100k0872
$$ 959250 875144 809357 761487 729403 709656 701030 703670 714374 725720 730208 723108 702236
56950G02236l3692m1290m2081l9232l6277l3006k8126k2891j8912j5022r735m627
$$ 702236 668544 627254 585173 545941 509664 476658 448532 425641 406729 391707 381972 377345
56938C77345j949p32J579N368R629J4626K1024K7859L3756L7986L8189L0071J2786
$$ 377345 375396 374664 376243 381611 391240 405866 426890 454749 488505 526491 564680 594751 607537
56925F07537p690k3889l3588l8547l9513l6464l1510k7248k3464j8932j4799j2736
$$ 607537 599847 575958 542370 503823 464310 427846 396336 369088 345624 326692 311893 299157
56913B99157j1587r502p608p729q330o752l945k807l188k735j489j346j885r33
$$ 299157 287570 278068 270460 262731 254401 247649 243704 240897 237709 234974 233485 232139 230254 229321
56899B29321J285K576K853L967O046P580Q553J0047J1571J2271J3732J7896K3261
$$ 229321 230606 233182 236035 240002 246048 253628 262181 272228 283799 296070 309802 327698 350959
56886C50959K6964K9314L1871L2226K5767J2565k048j3777k2050k6688k6841k3856
$$ 350959 377923 407237 439108 471334 497101 509666 507618 493841 471791 445103 418262 394406
56874C94406k0890j8696j5364j0681o872m461j172M132R975J5530K2039L0072
$$ 394406 373516 354820 339456 328775 321903 317442 316270 320402 330377 345907 367946 398018
56862C98018L8474M6948N6702O7306P5054P5092O3876M0678R610k0577m2018n3334
$$ 398018 436492 483440 540142 607448 682502 757594 821470 862148 871758 851181 809163 755829
56850G55829n7734n7135n1579m2950l4534k6842j8009q319k63O018J3279K2755
$$ 755829 698095 640960 589381 546431 511897 485055 467046 458727 458464 464482 477761 500516
56838E00516L3124M4245N8007P4802R2782J10467J25592J30725J15537P6630K2775
$$ 500516 533640 577885 635892 710694 803476 913943 1039535 1170260 1285797 1362427 1385202
56827A385202l1179p3574r9440j09399j07738r9519q7690p3554n9198m6866l6306
$$ 1385202 1354023 1280449 1181009 1071610 963872 864353 776663 703109 643911 597045 560739
56816E60739k5706j5123o133J678J0560K1058L1935M3553N7759P3953Q7857R4013
$$ 560739 535033 519910 513777 515455 526015 547073 579008 622561 680320 754273 842130 936143
56804I36143Q7103O3006K3444k0788n6221p7116q6382q7603q1622p0725n9723
$$ 936143 1023246 1086252 1109696 1088908 1032687 955571 869189 781586 699964 629239 569516
56793E69516n0897m2419l3227k5042j8387j1377l820J940N889J1442K0005K8849
$$ 569516 518619 476200 442973 417931 399544 388167 384347 386287 392176 403618 423623 452472
56781D52472L6043M2694M7950M6550L4593J4561p776k8209m3889n2243n3204m9986
$$ 452472 488515 531209 579159 625709 660302 674863 667087 638878 594989 542746 489542 439556
56769D39556m5430l9818l3478k8234k4647k0950j6456j2993j1446j0180q274p105
$$ 439556 394126 354308 320830 292596 267949 246999 230543 217550 206104 195924 187650 180545
56757A80545p156o678n021l954m182l987k808k484l466l499j793o73j358j913
$$ 180545 173389 166711 161690 157736 153554 149567 146759 144275 140809 137310 135517 134844 133486 131573
56743A31573j189r14j907k164q68k63j328j623J66J502M99p32r9Q56L16l97K19
$$ 131573 130384 129470 127563 125399 124531 124268 122940 121317 121483 122985 123484 122752 122653 123509 123825 123428 123647
56726A23647P59j86j206r55p95j719j917j89J345Q42p3L85Q38k92j518j089j31
$$ 123647 124406 124220 123014 122059 121264 119545 117628 117439 118784 119626 119553 119938 120776 120484 118966 117877 117746
56709A17746r8P7J353K070J001j9N61J025j61j107N0J430O92p93o33L11np97j85
$$ 117746 117648 117725 119078 121148 122149 122130 122691 123716 123555 122448 122498 123928 124620 123827 123194 123505 123500 122703 122518
56690A22518J059J069L32M17R15O36J35L44M19m72j223q95o26j223j232K30J425
$$ 122518 123577 124646 124978 125395 126310 126946 127081 127425 127844 127372 126149 125254 124628 123405 122173 122403 123828
56673A23828J064O65J425J753N27l46N41J218K6j066r8J157O04k34N78J369L6
$$ 123828 124892 125557 126982 128735 129262 128916 129457 130675 130701 129635 129537 130694 131298 131064 131642 133011 133047
56656A33047j629r76P36P61l48m49j10r82j991j264N2j79j118q13r1p13j579p16
$$ 133047 131418 130442 131178 131939 131591 131142 131032 130050 128059 126795 126847 126668 125550 124737 124646 123933 122354 121638
56638A21638Q28R15K94Q50J685R11m36j34J228J719J769K720L561K814J804K270
$$ 121638 122466 123381 123675 124525 126210 127121 126685 126551 127779 129498 131267 133987 137548 140362 142166 144436
56622A44436K835J705N80J647K981J595r43r28J073J384n04j733j412j301j728
$$ 144436 147271 148976 149556 151203 154184 155779 154836 153908 154981 156365 155861 154128 152716 151415 149687
56607A49687j309m36q39k045k040r84n96o24M37J971K249J811K211K580J260m26
$$ 149687 148378 147942 147103 145058 143018 142034 141438 140814 141251 143222 145471 147282 149493 152073 153333 152907
56591A52907k6J639J970J331J982L366K880O51q04j031j564k082r03J142J504
$$ 152907 152881 154520 156490 157821 159803 163169 166049 166700 165896 164865 163301 161219 160316 161458 162962
56576A62962K75j45P31J350J602K568L410K464Q14R45K466L010K662L481N233
$$ 162962 163237 163092 163823 165173 166775 169343 172753 175217 176031 176976 179442 182452 185114 188595 193828
56561A93828N827N450O191P950Q625Q124Q360R693J0882J1926J3398J3899J2010
$$ 193828 199655 205105 211296 219246 227871 235995 244355 254048 264930 276856 290254 304153 316163
56548C16163R702R806J1209J0758Q688P672P542N800K705R39O23o23k968m335
$$ 316163 325865 335671 346880 357638 366326 373998 381540 387340 390045 390984 391607 390984 388016 383681
56534C83681m738o088q036q579q373r788j2065j2231j0562j0116j1118j0815q923
$$ 383681 378943 372855 364819 356240 347867 338079 326014 313783 303221 293105 281987 271172 262249
56521B62249q023q395p490n076l881m587m837l840l375l666k848j076o65j683
$$ 262249 254226 245831 238341 233265 229384 224797 219960 216120 212745 209079 206231 205155 204490 202807
56507B02807j835j034j528l188l370j849j254k078k096j116j457l052l048j093
$$ 202807 200972 199938 198410 195222 191852 190003 188749 186671 184575 183459 182002 178950 175902 174809
56493A74809j42j113j478j88O56J33m6N85L59o88m40J001J135j63j77J605K606
$$ 174809 174667 173554 172076 171888 172544 172677 172631 173216 173575 172887 172447 173448 174583 174420 174243 175848 178454
56476A78454J988J747K336J980R27J554L423L343J148L18J926L126K706K860M270
$$ 178454 180442 182189 184525 186505 187432 188986 192409 195752 196900 197218 199144 202270 204976 207836 212106
56461B12106M709L880M380O467P097N615N059O298O386M400L394M527M799K813
$$ 212106 216815 220695 225075 231542 238639 244254 249313 255611 261997 266397 269791 274318 279117 281930
56447B81930J418K239K792J553P80J707J927K27q09L57J346N28n8R81J598M51
$$ 281930 283348 285587 288379 289932 290712 292419 294346 294573 293764 294121 295467 295995 295937 296918 298516 298967
56431B98967n62l37p74k608l516k696k820m977o290n060l716m093m347l259k973
$$ 298967 298405 298068 297294 294686 291170 288474 285654 280677 274387 269327 265611 261518 257171 253912 250939
56416B50939m625n678m443l011l015k757j175l27j271j697k85Q16L72M38J916
$$ 250939 246314 240636 236193 233182 230167 227410 226235 225908 224637 222940 222655 223471 223843 224281 226197
56401B26197K318N96m68O57J386q3j691j953k631m220l887r17Q73n89k017p73
$$ 226197 228515 229111 228643 229300 230686 230603 228912 226959 224328 220108 216221 215304 216177 215588 213571 212798
56385B12798O27k60j202N2J246L2j448o27Q49N67m06m55q01k328k849j027P33
$$ 212798 213425 213165 211963 212015 213261 213293 211845 211218 212067 212634 212228 211773 210972 208644 205795 204768 205501
56368B05501N46K10J099J290j40n33J290K268P36j20J790L251J594k97P13K513
$$ 205501 206047 206257 207356 208646 208506 207973 209263 211531 212267 212147 213937 217188 218782 218485 219198 221711
56352B21711K220J459K524L610K635J538K260K647R46l9J994M107L254J707K331
$$ 221711 223931 225390 227914 231524 234159 235697 237957 240604 241550 241511 243505 247612 250866 252573 254904
56337B54904K868L53k901l267j988k027k339o39J538J732J279K236L013J859J098
$$ 254904 257772 258125 255224 251957 249969 247942 245603 244964 246502 248234 249513 251749 254762 256621 257719
56322B57719L045N239M702L236L655M498L487K419L509M642L470K288L694N292
$$ 257719 260764 266003 270705 273941 277596 282094 285581 288000 291509 296151 299621 301909 305603 310895
56308C10895M176K636L700N087L496J032J270K548J447n41j40J202K92j453q89
$$ 310895 315071 317707 321407 326494 329990 331022 332292 334840 336287 335746 335606 336808 337100 335647 334758
56293C34758N85j48j723j096L07o40k557k191n58n79j316m00P02l52j561k57J224
$$ 334758 335343 335195 333472 332376 332683 332043 329486 327295 326737 326158 324842 324442 325144 324792 323231 322974 324198
56276C24198l72k666j636J058J236k63J21J683J458N56J864M041M187L804N625
$$ 324198 323826 321160 319524 320582 321818 321555 321676 323359 324817 325373 327237 331278 335465 339269 344894
56261C44894P494O057L671M629P389P711O667Q173J1097J1446J0169J1265J4072
$$ 344894 352388 358445 362116 366745 374134 381845 388512 396685 407782 419228 429397 440662 454734
56248D54734J4826J4012J4936J6805J6312J4347J4134J4646J2788J0023R762J0358
$$ 454734 469560 483572 498508 515313 531625 545972 560106 574752 587540 597563 607325 617683
56236F17683P948M082L170M527M321L149M092N498L582K14J72K581K905J525K270
$$ 617683 625631 629713 632883 637410 641731 644880 648972 654470 658052 658266 658438 661019 663924 665449 667719
56221F67719M262L448N81m17l53k831o278o321m455n744r326r969p757p451r321
$$ 667719 671981 675429 676010 675593 675240 672409 666131 659810 655355 649611 640285 630316 622559 615108 605787
56206F05787r368p747q180r852q539n106m362o158o128m367m766o654n821k965
$$ 605787 596419 588672 580492 570640 562101 556995 552633 546475 540347 535980 531214 524560 518739 515774
56192E15774k431l561k152O23m9l033k881l1K01k007j488J565J836q06j162J267
$$ 515774 513343 509782 507630 508253 508204 505171 502290 502259 502460 500453 498965 500530 502366 501560 500398 501665
56176E01665J945Q70K467N899N685K183J387M015M875L332L976O596O044K689
$$ 501665 503610 504480 506947 512846 518531 520714 522101 526116 530991 534323 538299 544895 550939 553628
56162E53628K412N491O082L587L691P087Q128N941N964R009R751P626Q267J2285
$$ 553628 556040 561531 567613 571200 574891 581978 590106 596047 602011 611020 620771 628397 636664 648949
56148F48949J3693J1372J1096J4144J4931J2193J1622J4891J6855J5976J6790
$$ 648949 662642 674014 685110 699254 714185 726378 738000 752891 769746 785722 802512
56137H02512J9816J9997J7499J9057K6120L2718L7323M5598N8920P1795Q3472
$$ 802512 822328 842325 859824 878881 905001 937719 975042 1020640 1079560 1151355 1234827
56126A234827J00506J24776J50248J74422K01043K28245K45716K47366K35989
$$ 1234827 1335333 1460109 1610357 1784779 1985822 2214067 2459783 2707149 2943138
56117B943138K13225J77491J35216J01273Q3344P6325P4484P6553P6193O1855
$$ 2943138 3156363 3333854 3469070 3570343 3653687 3730012 3804496 3881049 3957242 4019097
56107D019097L2048q91k6511m4468n4724n3988m7000m7947o4548r1716j24158
$$ 4019097 4051145 4050254 4023743 3979275 3924551 3870563 3823563 3775616 3711068 3619352 3495194
56096C495194j61909j99284k23018k27674k20604k07200j84685j54919j28416
$$ 3495194 3333285 3134001 2910983 2683309 2462705 2255505 2070820 1915901 1787485
56087A787485j09448r1031p0419n5235m8347m1548l0928k3908k4072k3676j8475
$$ 1787485 1678037 1587006 1516587 1461352 1413005 1371457 1340529 1316621 1292549 1268873 1250398
56076A250398j5306j7561j7738j2179q510j0583j0695m777n14k183k369K945O116
$$ 1250398 1235092 1217531 1199793 1187614 1179104 1168521 1157826 1153049 1152535 1150352 1147983 1150928 1157044
56063A157044L153K024O997J0105P062O068J1605J5299J2320J0824J5472J7868
$$ 1157044 1160197 1162221 1169218 1179323 1186385 1192453 1204058 1219357 1231677 1242501 1257973 1275841
56051A275841J3427J1178J6340J9895J6185J3946J8807K1988J7959J5938K1912
$$ 1275841 1289268 1300446 1316786 1336681 1352866 1366812 1385619 1407607 1425566 1441504 1463416
56040A463416K6622K3615K1645K6786L0164K6118K4268L0465L4461K9931K7581
$$ 1463416 1490038 1513653 1535298 1562084 1592248 1618366 1642634 1673099 1707560 1737491 1765072
56029A765072L4328L9117L4204L0517L6452M1523L7318L4356M1351M8000M5636
$$ 1765072 1799400 1838517 1872721 1903238 1939690 1981213 2018531 2052887 2094238 2142238 2187874
56018B187874M4401N2402N8633N4812N2798O1781O9806O7023O4969P3194P9904
$$ 2187874 2232275 2284677 2343310 2398122 2450920 2512701 2582507 2649530 2714499 2787693 2867597
56007B867597P6143P5382Q7634R8626R6864R6235J08489J19377J16751J15536
$$ 2867597 2943740 3019122 3106756 3205382 3302246 3398481 3506970 3626347 3743098 3858634
55997C858634J28860J41597J39905J39167J54091J69561J71042J74629J95587
$$ 3858634 3987494 4129091 4268996 4408163 4562254 4731815 4902857 5077486 5273073
55988E273073K17176K23475K32081K59777K87961K98577L11008L44870L80733
$$ 5273073 5490249 5713724 5945805 6205582 6493543 6792120 7103128 7447998 7828731
55979G828731L98491M18897M63963N13422N46238N86231O58027P38543Q03887
$$ 7828731 8227222 8646119 9110082 9623504 10169742 10755973 11414000 12152543 12956430
55970A2956430Q81172R98795J131796J256406J409652J630625J896283K185395
$$ 12956430 13837602 14836397 15968193 17224599 18634251 20264876 22161159 24346554
55962B4346554K546263L021399L568924M147782M813132N631662O585399P677680
$$ 24346554 26892817 29914216 33483140 37630922 42444054 48075716 54661115 62338795
55954F2338795R049645J0863056J3175665J6093964J9916527K4895498L0943553
$$ 62338795 71388440 82251496 95427161 111521125 131437652 156333150 187276703
55947A87276703L7712787M4534481M9609852M9475857M0571688K2442755o80387
$$ 187276703 224989490 269523971 319133823 368609680 409181368 431624123 430943736
55940D30943736k2141776l6996020m4137783m5211885m2467472l7708554l2269225
$$ 430943736 408801960 371805940 327668157 282456272 239988800 202280246 170011021
55933A70011021k7034517k2376687j8351118j4983438j2286060j0145908q398530
$$ 170011021 142976504 120599817 102248699 87265261 74979201 64833293 56434763
55926E6434763o975819n865824m992902m255354l630116l136190k738335k377930
$$ 56434763 49458944 43593120 38600218 34344864 30714748 27578558 24840223 22462293
55918B2462293k057135j806742j606133j411701j230685j094698r90311q82593
$$ 22462293 20405158 18598416 16992283 15580582 14349897 13255199 12264888 11382295
55910A1382295p79183p07902o56335n93143n25979m82272m53906m13920l68288
$$ 11382295 10603112 9895210 9238875 8645732 8119753 7637481 7183575 6769655 6401367
55901F401367l40814l24793k97264k64435k47661k40322k21488j97327j87556
$$ 6401367 6060553 5735760 5438496 5174061 4926400 4686078 4464590 4267263 4079707
55892D079707j85322j70474j49074j41127j41724j31626j14563j07997j07951
$$ 4079707 3894385 3723911 3574837 3433710 3291986 3160360 3045797 2937800 2829849
55883B829849r7913q2333p7573p9261p1111n7018n2712n4277m5771l0123k2511
$$ 2829849 2731936 2649603 2572030 2492769 2421658 2364640 2311928 2257651 2211880 2181757 2159246
55872B159246k0367r049R538K1873K9666M4361O0948O3592N1876L6644J6334j7276
$$ 2159246 2138879 2129830 2139368 2161241 2190907 2235268 2296216 2359808 2411684 2448328 2464662 2447386
55860B447386n5729q1584r4589j06739j16987j14816j03765r7178r4527q4910
$$ 2447386 2391657 2310073 2215484 2108745 1991758 1876942 1773177 1675999 1581472 1496562
55850A496562p0240o2292o0264n3405m2700l8399l8987l3760k3541j8273j6732
$$ 1496562 1426322 1364030 1303766 1250361 1207661 1169262 1130275 1096515 1072974 1054701 1037969
55839A037969q945L903J1819J5202K1689K6728J8053j755j7050k2509k5883k8859
$$ 1037969 1029024 1032927 1044746 1059948 1081637 1108365 1126418 1124663 1107613 1085104 1059221 1030362
55827A030362k4657j4607q350o887k648L572K835m855j0395j2462j8134k6825
$$ 1030362 1005705 991098 982748 975861 973213 976785 979620 974765 964370 951908 933774 906949
55815I06949l0162k8076k8884l2957l2159k6105k3160k4508k2550j6187j2682
$$ 906949 876787 848711 819827 786870 754711 728606 705446 680938 658388 642201 629519
55804F29519j3121j0619m187k13Q88N500J3231J6424J4324J4089J6642J5148Q871
$$ 629519 616398 605779 601592 601379 602267 607767 620998 637422 651746 665835 682477 697625 706496
55791G06496M978N033K900k347m429k445k580n573n051q4K948K761N078J0378
$$ 706496 711474 716507 719407 717060 712631 710186 707606 702033 696982 696898 699846 702607 707685 718063
55777G18063J2040Q643O037N127k89j1027j9706k3000k5551k9131k9256k5178
$$ 718063 730103 738746 744783 749910 749621 738594 718888 695888 670337 641206 611950 586772
55765E86772k2385k2359k0182j4812j1416j1386j0253p625q604j3170j4659j1284
$$ 586772 564387 542028 521846 507034 495618 484232 473979 466354 457750 444580 429921 418637
55753D18637q911r960r953p462p079r702j0055o858n590q195r835q661r069j2250
$$ 418637 409726 399766 389813 382351 375272 365570 355515 348657 343067 334872 325037 316376 307307 295057
55739B95057j3222j0430q787j0037r507n624l288m364m089m04K069Q99j85M87
$$ 295057 281835 271405 262618 252581 243074 237450 234162 229798 225709 225305 227374 228273 228088 228575
55725B28575q54n104p324n693m890p050p873n381l959n863p013n203m194n678
$$ 228575 227721 222617 215293 209600 204710 197660 189787 184406 180447 174584 167571 162368 158174 152496
55711A52496n348j170K363K440K712N648P746O670N706O827O526K904k44o67j895
$$ 152496 147148 145978 148341 150781 153493 159141 166887 173557 179263 186090 192616 195520 195276 194609 192714
55696A92714n930q664p157m836m902n006k921j296k207k974j550l57q39j07L200
$$ 192714 186784 178120 170963 166127 161225 156219 153298 152002 149795 146821 145271 144914 144075 143968 147168
55681A47168N693N622O409R975J2724J2074J0784J0805R062L648j818m431o680
$$ 147168 152861 158483 164892 174867 187591 199665 210449 221254 230316 233964 232146 227715 221035
55668B21035j0664j3401j2481j0823j1185j1287q794o037n400m998l156k135l325
$$ 221035 210371 196970 184489 173666 162481 151194 142400 136363 130963 125965 122809 120674 117349
55655A17349l782j666j7j056j861J00K222J844J006J863K322O55m23J204K680
$$ 117349 113567 111901 111884 110828 108967 109067 111289 113133 114139 116002 118324 118979 118556 119760 122440
55640A22440J221r93j316j422l210m510l360k166l139l939k185r6j65n56P68J600
$$ 122440 123661 122668 121352 119930 116720 112210 108850 106684 103545 99606 97421 97325 97160 96604 97372 98972
55624I8972k02k075j152N72P7j424j534j316k402l070j641l01j238k342j119O34
$$ 98972 98770 96695 95543 96115 96192 94768 93234 91918 89516 86446 84805 84504 83266 80924 79805 80439
55608H0439K87q09l42N32k1n11Q89K470K177J531K441L310K272J022J496K027
$$ 80439 80726 79917 79575 80107 80086 79575 80464 82934 85111 86642 89083 92393 94665 95687 97183 99210
55592I9210P65m92K02R98p3r68O07K705K677J996L156M963N323N585P746J0343
$$ 99210 99975 99483 99685 100683 100610 99642 100249 102954 105631 107627 110783 115746 121069 126654 134400 144743
55576A44743J1453J2779J6338K0186K1913K3444K7765L3754L8863M4034N1045
$$ 144743 156196 168975 185313 205499 227412 250856 278621 312375 351238 395272 446317
55565D46317N7470N9244N6098M9883L9844K4366N642j2007k6917l9418m8464n2998
$$ 446317 503787 563031 619129 669012 708856 733222 738864 726857 699940 660522 612058 559060
55553E59060n4744n5728n4923n0920m5446m0587l5241k8264k2185j9467j7889
$$ 559060 504316 448588 393665 342745 297299 256712 221471 193207 171022 151555 133666
55542A33666j4264j0065q533q718p489n271m620m965l911k251k501l827l328j323
$$ 133666 119402 109337 100804 92086 84597 79326 74706 69741 65830 63579 61078 57251 53923 52600
55528E2600o06j377j520r59j304k033j305J49Q5j068j090j47l07j521j877j095
$$ 52600 51994 50617 49097 48138 46834 44801 43496 43645 43730 42662 41572 41425 41118 39597 37720 36625
55512C6625m04J92J274J828Q62j68L27J015J75p07M42K190K015R11J305K295J310
$$ 36625 36221 36413 37687 39515 40377 40209 40536 41551 41726 41019 41461 43651 45666 46577 47882 50177 51487
55495E1487r89j946j681k233l281l051k293k923l897k818n94l3q34m62R61J153
$$ 51487 50498 48552 46871 44638 41357 38306 36013 33090 29193 26375 25781 25748 24914 24452 25413 26566
55479B6566K57M23J437J204K7nO71k36k367l179k447k111k096p03J256J230l93
$$ 26566 26823 27246 28683 29887 29914 29909 30580 30344 27977 24798 22351 20240 18144 17441 18697 19927 19534
55462A9534p53M68P85l58r01l35l33r84n31Q75J095qk91P01J191P57Q43J435R93
$$ 19534 18781 19249 20034 19676 18775 18440 18107 17123 16592 17467 18562 18554 18263 18964 20155 20912 21755 23190 24183
55443B4183k48m54J72l23j742j815l89K48m90p38J89R29J140J888K772K214P66
$$ 24183 23935 23481 23653 23330 21588 19773 19384 19632 19142 18404 18593 19522 20662 22550 25322 27536 28302
55426B8302N72J454J141n07j332j064j658l117l033r93M60J55j62N64J130J100
$$ 28302 28874 30328 31469 30962 29630 28566 26908 23791 20758 19765 20225 20380 20218 20782 21912 23012
55410B3012J870L668M727M504M627N721O277N510M474L619K118K09p39r46k104
$$ 23012 24882 28550 33277 37781 42408 48129 54406 59916 64390 68009 70127 70336 69597 68651 66547
55395F6547m085m837l904l043k956k584j890k127k903k384q30n70j941k682j950
$$ 66547 62462 57625 53721 50678 47722 45138 43248 41121 38218 35834 35004 34434 32493 29811 27861
55380B7861j395j598j010P04J645J068M81N42M6j124j394o38o21j489j226M09
$$ 27861 26466 24868 23858 24562 26207 27275 27756 28298 28344 27220 25826 25188 24567 23078 21852 22261
55364B2261R53o26k171k009j159p04q9P36O00k78n2J310J545N7r25l18J30n65
$$ 22261 23214 22588 20417 18408 17249 16545 16456 17192 17792 17514 17462 18772 20317 20374 19449 19131 19261 18696
55346A8696p80K76P65m33j586j192k68N8L19O22k68k060k282k00J613J373P22
$$ 18696 17916 18192 18957 18524 16938 15746 15478 15536 15855 16477 16209 14149 11867 11667 13280 14653 15375
55329A5375J305J817O89r79j554j464j571j225k8P03J81k62L55Q90M54K38J106
$$ 15375 16680 18497 19186 18207 16653 15189 13618 12393 12365 13068 13249 12987 13342 14232 14686 14924 16030
55312A6030J723J002J60L79O28k53j381j664j684j967j485J60J228M86n99k86
$$ 16030 17753 18755 18915 19294 19922 19669 18288 16624 14940 12973 11488 11648 12876 13362 12763 12477
55296A2477P02Q58M44M37O08N12P39J521J727Q38J48N16Q32K68j2Q96J707J070
$$ 12477 13179 14037 14481 14918 15526 16038 16777 18298 20025 20863 21011 21527 22359 22627 22615 23511 25218 26288
55278B6288k10q97j311j900j710k38R92O59k72m19k47o14q41k00L23k83j089p57
$$ 26288 26078 25181 23870 21970 20260 20022 21014 21673 21401 20982 20735 20121 19280 19080 19403 19120 18031 17274
55260A7274L18J043J347J352M71j104j704n43Q09Q89M56N98P11J39p6Q91J728
$$ 17274 17592 18635 19982 21334 21805 20701 18997 18454 19263 20152 20608 21206 21917 22056 21980 22871 24599
55243B4599J006m40j126j232j455j192M1R92N15l95l90j20p42j620j581j098j103
$$ 24599 25605 25165 24039 22807 21352 20160 20201 21193 21708 21313 20923 20803 20061 18441 16860 15762 14659
55226A4659r87R9J199J003J73J26O19N92L33O95J131O58q0K05J124J207K43p06
$$ 14659 13672 13771 14970 15973 16146 16272 16891 17483 17816 18511 19642 20300 20220 20425 21549 22756 22999 22293
55208B2293j059r90n65P1L33J40L02R32Q57k76q71K01J568J446K93l53l59m78
$$ 22293 21234 20244 19679 19750 20083 20223 20525 21457 22314 22038 21167 21368 22936 24382 24675 24322 23963 23485
55190B3485n48o2M76M12K38M83N09k15q38n63o7o9L4O86Q90M7o12j60K29n34j205
$$ 23485 22937 22875 23351 23763 24001 24484 24993 24778 23940 23377 23310 23241 23275 23961 24851 24898 24286 24126 24355 23821 22616
55169B2616l68Q75O90m35q78p45j088j440p78J53o4q18m31R12J522R75K73j81
$$ 22616 22248 23123 23813 23378 22500 21755 20667 19227 18449 18602 18538 17720 17289 18201 19723 20698 20971 20790
55151B0790o83q48k34K34n39j724j647l93N69P52P37N16k54q87m57M75P35M87
$$ 20790 20107 19259 19025 19259 18720 16996 15349 14956 15525 16277 17014 17530 17276 16389 15932 16407 17142 17629
55133A7629O19Q50L78l00j29M95L71l49n08K5M56P27J345K006K066J856K001K089
$$ 17629 18248 19098 19476 19176 19047 19542 19913 19564 19056 19081 19537 20264 21609 23615 25681 27537 29538 31627
55115C1627J558J121J622K289J876P93L17M26K66J6M05J003Q05k7o93j245j938
$$ 31627 33185 34306 35928 38217 40093 40886 41203 41629 41895 41911 42316 43319 44124 44097 43404 42159 40221
55098D0221k020r85j26q07k115k155r43O6N03J004J368Q42k27r44j397j902j634
$$ 40221 38201 37216 37090 36283 34168 32013 31070 31136 31639 32643 34011 34853 34626 33682 32285 30383 28749
55081B8749j5J561J506N91M27N18o28k296k344p35M94N10L78O20N55O9j98l49
$$ 28749 28734 30295 31801 32392 32819 33337 32709 30413 28069 27334 27828 28338 28716 29336 29891 29960 29762 29413
55063B9413q74j007K63J960K098P43j72P8M19K60J37J23k62o69m37j67p82j438
$$ 29413 28539 27532 27795 29755 31853 32596 32424 32502 32921 33181 33318 33441 33179 32510 32073 31906 31124 29686
55045B9686o36J030J622R66N55P00L33m88n70rp5o06j40J286K008J609J372J726
$$ 29686 29050 30080 31702 32668 33223 33923 34256 33768 33198 33189 33114 32508 32368 33654 35662 37271 38643 40369
55027D0369J760J482J944K804K375N87n80k02M52L52nk30o98j091n04N93P55J77
$$ 40369 42129 43611 45555 48359 50734 51321 50741 50539 50991 51343 51338 51108 50410 49319 48815 49408 50163 50340
55009E0340N32J911K514J906J793K848L388K290P25o4m75q97n88O02J367R75L50
$$ 50340 50872 52783 55297 57203 58996 61844 65232 67522 68247 68183 67708 66811 66223 66825 68192 69167 69517
54992F9517J81k03j178j815j551j106r33m77K70L17n10j026p21m97p83p91l69
$$ 69517 69698 69495 68317 66502 64951 63845 62912 62435 62705 63022 62512 61486 60765 60268 59485 58694 58325
54975E8325n77j637k282j946j632j724j092O17J879J657R80R61J139R19Q96J429
$$ 58325 57748 56111 53829 51883 50251 48527 47435 48052 49931 51588 52568 53529 54668 55587 56483 57912
54959E7912J529N11p06j128j068r95m56P82J875K191K229K406K351K046K254L126
$$ 57912 59441 59952 59246 58118 57050 56055 55599 56381 58256 60447 62676 65082 67433 69479 71733 74859
54943G4859L863M318N249O443O558N523N083O071P186P487P897R044R665Q702
$$ 74859 78722 83040 88289 94732 101290 106813 111896 117967 125153 132640 140537 149581 159246 167948
54929A67948P016N507L247q17n764r878j2568j3852j3376j1420r556q777q236
$$ 167948 174964 180471 183718 182901 177137 167259 154691 140839 127463 116043 106487 97710 89474
54916H9474p003n744n317n082m091k780k114j980j731j353j033n28J23L43K46
$$ 89474 82471 76727 71410 66328 62237 59457 57343 55363 53632 52279 51246 50718 50841 51184 51430
54901E1430P75J943K488K100K297L954N759O423O727P914R627J0899J1779J2426
$$ 51430 52205 54148 56636 58736 61033 64987 70746 77169 83896 91810 101437 112336 124115 136541
54887A36541J1985R907P145M566J489k784p213j0286j1831j2272j1451r586q006
$$ 136541 148526 158433 165578 170144 171633 168849 161636 151350 139519 127247 115796 106210 98204
54874I8204p362o442m275k054j355j754j949j885j971j486K16K000K448K151K544
$$ 98204 90842 84400 80125 78071 76716 74962 73013 71128 69157 67671 67887 69887 72335 74486 77030
54859G7030L412L556L151L284L752L387K250J603J912K512K911K915J853p05l682
$$ 77030 80442 83998 87149 90433 94185 97572 99822 101425 103337 105849 108760 111675 113528 112823 109141
54844A09141n485o002o287o653o534n930n539n489n202m401l308k152j318j464
$$ 109141 103656 97654 91367 84714 78180 72250 66711 61222 56020 51619 48311 46159 44841 43377
54830D3377k455k894j788p6O57L04j20k90n90q86o70j25J60K06L67M53K14Q4L98
$$ 43377 40922 38028 36240 36164 36821 37125 37005 36715 36125 35239 34569 34444 34604 34810 35177 35630 35844 35928 36326
54811C6326N09j59q73o35J88N77O34J190K141K563K185J539R37M29M42J256K189
$$ 36326 36835 36676 35803 35168 35356 35933 36567 37757 39898 42461 44646 46185 47122 47551 47993 49249 51438
54794E1438K341J850J502J526J764K401L450M106L819L515M484O493Q253R358
$$ 51438 53779 55629 57131 58657 60421 62822 66272 70378 74197 77712 82196 88689 96942 106300
54780A06300J0489J1901J2990J3300J3016J2361J1177R103N793J404k891n606
$$ 106300 116789 128690 141680 154980 167996 180357 191534 200637 206430 207834 204943 199337
54768A99337o588p045p560p341o024m744m362m019k730j105p6Q87K703M871O320
$$ 199337 192749 185704 178144 170803 164779 160035 155673 151654 148924 147819 147743 148630 151333 156204 162524
54753A62524P105P632P206N077K165mj421l003m625n480n737o028n807m069j333
$$ 162524 169629 177261 184467 189544 191709 191705 190284 187281 182656 177176 171439 165411 159604 155535 154202
54738A54202Q76K246L701N420O552O718O292N282L279M40k642n775q741j0669
$$ 154202 155078 157324 161025 166445 172997 179715 186007 191289 194568 195008 192366 186591 177850 167181
54724A67181j1057j0786j0855j0778r679q125p194o517n125l607l415m400n007
$$ 167181 156124 145338 134483 123705 114026 105901 98707 92190 87065 83458 80043 75643 70636
54711G0636m657m064l498k581j634j353j313o29K09Kq27p14L98R35L75p7K65O77
$$ 70636 65979 61915 58417 55836 54202 52849 51536 50907 51116 51118 50291 49577 49975 50910 51285 51208 51473 52150
54693E2150P48J061J717J910J473J198J243Q06j17l55N64J626J969J880J756J451
$$ 52150 52898 53959 55676 57586 59059 60257 61500 62306 62189 61834 62398 64024 65993 67873 69629 71080
54677G1080J179J626K706L408L376L372L800M004L464K576J858J415J320J518
$$ 71080 72259 73885 76591 79999 83375 86747 90547 94551 98015 100591 102449 103864 105184 106702
54663A06702J354L69n23l2J446K277K029J842K274K645K797L645N429P128Q228
$$ 106702 108056 108425 107902 107870 109316 111593 113622 115464 117738 120383 123180 126825 132254 139382 147610
54648A47610R573J1752J4071J5833J7252J8481J8985J8452J7075J4503R919L706
$$ 147610 157183 168935 183006 198839 216091 234572 253557 272009 289084 303587 313506 317212
54636C17212k366p230j1395j5125j7370j7420j6202j4902j3437j1350r085p422
$$ 317212 314846 307616 296221 281096 263726 246306 230104 215202 201765 190415 181330 173908
54624A73908o410n813n710n853n328l766k102j356j389j577j917k627l291l382
$$ 173908 167498 161685 155975 150122 144794 141028 138926 137570 136181 134604 132687 130060 126769 123387
54610A23387l115l096l433l795l952l848l423k782k167j637j092p17q48j390j868
$$ 123387 120272 117176 113743 109948 105996 102148 98725 95943 93776 92139 91047 90330 89482 88092 86224
54595H6224k096k155j890j191n95p50j338j402p28N2N85J018J170O76n3j05N65
$$ 86224 84128 81973 80083 78892 78297 77547 76209 74807 74079 74131 74716 75734 76904 77580 77527 77422 77987
54578G7987J109J106Q80N67N9j83L20Q36J30j414k017j058J40M76L86M92N32L71
$$ 77987 79096 80202 81082 81649 81708 81525 81845 82681 82811 81397 79380 78322 78462 78938 79324 79816 80348 80719
54560H0719P03J806K816L034K908K995K930K245J279O41N02Q58J660K304J997
$$ 80719 81422 83228 86044 89078 91986 94981 97911 100156 101435 102076 102578 103436 105096 107400 109397
54545A09397J051P55J569K543K935L226M015N029N910O899Q074Q855Q909Q711
$$ 109397 110448 111203 112772 115315 118250 121476 125491 130520 136430 143329 151403 160258 169167 177878
54531A77878Q663Q392P388N582K970l70l704o035p333q351r200r195q310p371
$$ 177878 186541 194933 202321 207903 210873 210503 206799 200764 193431 185080 175880 166685 158375 151004
54517A51004o684n796m940n010n780n720m249k636j962j720j171o37n77o85o86
$$ 151004 144320 138524 133584 128574 122794 117074 112825 110189 108227 106507 105336 104699 104122 103437 102751
54502A02751p82o58M64K138K681J653O96R77J468J021M11Q58J897K380K432K818
$$ 102751 101969 101311 101775 103913 106594 108247 108943 109920 111388 112409 112820 113678 115575 117955 120387 123205
54486A23205L266K953J982J139P86R84J838K833K795J556O20J072J919J719P27
$$ 123205 126471 129424 131406 132545 133331 134315 136153 138986 141781 143337 143957 145029 146948 148667 149394
54471A49394P3k64r68j706j487l12Q39J368J307P00k24o43J3J243K132K344J849
$$ 149394 149467 149203 148235 146529 145042 144730 145569 146937 148244 148944 148720 148077 148090 149333 151465 153809 155658
54454A55658N41j061j728j043k22m13j121j332j125j094j050o76o04j495k677
$$ 155658 156199 155138 153410 152367 152145 151732 150611 149279 148154 147060 146010 145334 144730 143235 140558
54439A40558l026k638k428k591k661k537k343j831r23l41o04j013p12j9K73K40
$$ 140558 137532 134894 132466 129875 127214 124677 122334 120503 119580 119239 118635 117622 116910 116891 117164 117404
54423A17404L51L91O2p2N62J374J496J148J009Q97L68j51j18k7m59o54L81K045
$$ 117404 117755 118146 118208 118136 118698 120072 121568 122716 123725 124622 124990 124839 124721 124694 124235 123581 123962 126007
54405A26007K949L036L318L864L784K942K201J969J891J801J725J180j83j523
$$ 126007 128956 131992 135310 139174 142958 145900 148101 150070 151961 153762 155487 156667 156484 154961
54391A54961j724j160j080j596j779j591k036l216l892l376k513k262k390k115
$$ 154961 153237 152077 150997 149401 147622 146031 143995 140779 136887 133511 130998 128736 126346 124231
54377A24231j278l76j1l97j049j091l50K35o7o26m79P8M2n91q31k48O54J360J637
$$ 124231 122953 122577 122566 122169 121120 120029 119679 119914 119847 119221 118742 118820 118862 118271 117440 117192 117846 119206 120843
54358A20843J158l2r55o74L35R42J150J863L041L516K726J457O57N26Q57J274
$$ 120843 122001 121969 121014 120340 120675 121617 122767 124630 127671 131187 133913 135370 136027 136553 137410 138684
54342A38684J108j8j383j884j521j273j609k076k368k733l264l619l621l406l012
$$ 138684 139792 139774 138391 136507 134986 133713 132104 130028 127660 124927 121663 118044 114423 111017 108005
54327A08005k396j795j442j153p94p38j214j716j835j971k426k483j574o09q32
$$ 108005 105609 103814 102372 101219 100425 99687 98473 96757 94922 92951 90525 88042 86468 85859 85027
54312H5027j855k338k032j738j618j202q00j180j921j754o28J25j22n47m53k71
$$ 85027 83172 80834 78802 77064 75446 74244 73444 72264 70343 68589 67961 68086 67964 67417 66964 66693
54296F6693n51j120j619j913j824j344j051j343j488o30O10Q72J57l29k63m44
$$ 66693 66142 65022 63403 61490 59666 58322 57271 55928 54440 53810 54420 55292 55449 55120 54857 54413
54280E4413r70j004m92l82p85o92P6L44l62q88l80M29O55O63J083J635J860J911
$$ 54413 53443 52439 51947 51565 50780 50088 50164 50508 50146 49258 48878 49307 49962 50625 51708 53343 55203 57114
54262E7114J858J278L05N5J082K358K621J967J250P55K53k36n46p84j054j217
$$ 57114 58972 60250 60555 60610 61692 64050 66671 68638 69888 70643 70896 70660 70114 69330 68276 67059
54246F7059j204j081n88N53J675J525L2j298j277m87j63m79o77l18L06P08N84
$$ 67059 65855 64774 64186 64739 66414 67939 67971 66673 65396 64909 64746 64267 63590 63272 63578 64286 64870
54229F4870L9l85k76K1j68p83j170j134j042q23kJ082J266J63j239j937j988j784
$$ 64870 64909 64524 64248 64269 64101 63318 62148 61014 59972 59149 59147 60229 61495 61658 60419 58482 56494 54710
54211E4710j317p04n18r74j501j578j342r90l96L38P56Q09R64J227R16k12j467
$$ 54710 53393 52689 52171 51197 49696 48118 46776 45786 45390 45728 46484 47293 48257 49484 50400 50188 48721
54194D8721k208k479k414j857j006m64l37j15K32R1n58q65m74r8j61j23L05M07
$$ 48721 46513 44034 41620 39763 38757 38293 37956 37841 38073 38164 37606 36741 36267 36169 36008 35885 36190 36597
54176C6597k31p92m99J63L79K86M14O33N72M23M49K77m46j274j576j401j032l21
$$ 36597 36366 35574 35075 35238 35617 35903 36317 36950 37522 37945 38394 38671 38225 36951 35375 33974 32942 32621
54158C2621Q21J765J808J108L89R7K79Q17J271J079L29k08k11k39o46r08n66l7
$$ 32621 33442 35207 37015 38123 38512 38609 38888 39705 40976 42055 42384 42176 41965 41726 41080 40172 39606 39569
54140C9569J32Q2M4k63r16j241p05K85J090J681K046J588O1j516j888j100j45
$$ 39569 39701 39783 39827 39564 38648 37407 36702 36987 38077 39758 41804 43392 43453 41937 40049 38949 38804
54123C8804M51R18J414J757J815J579J036L76mj6ll1K75Q09P21l70j562j786j081
$$ 38804 39255 40173 41587 43344 45159 46738 47774 48150 48146 48130 48127 48096 48371 49180 49901 49531 47969 46183 45102
54104D5102k01M18O55L52k62l48N01J508J656R69J70l78o87o28j82K21K11L2M0
$$ 45102 44901 45319 45974 46326 46064 45716 46217 47725 49381 50350 50520 50142 49455 48827 48645 48866 49077 49109 49149
54085D9149J55K81O33J092R63Rr17j009n97l19jP47J492J566J129P14K33m90q17
$$ 49149 49304 49585 50218 51310 52273 52282 51365 50356 49759 49440 49439 50186 51678 53244 54373 55087 55320 54830 54013
54066E4013j02R83J159M27mM26R28P57K00n0K14P33J143J111N89J4j19J26K31
$$ 54013 53911 54894 56053 56480 56476 56902 57830 58587 58787 58737 58951 59684 60827 61938 62527 62541 62422 62548 62779
54047F2779o6n02o37k16O12J285J323J042J260K076K558K021J118R70J752K708
$$ 62779 62713 62211 61574 61358 61970 63255 64578 65620 66880 68956 71514 73535 74653 75623 77375 80083
54031H0083L262L448L609M047M816N477N489N057M987N401N410M531L588L449
$$ 80083 83345 86793 90402 94449 99265 104742 110231 115288 120275 125676 131086 135617 139205 142654
54017A42654L737L610L155K938K772K032Q62Q5%J26k3n53j350k055k224k048k402
$$ 142654 146391 150001 153156 156094 158866 160898 161760 161845 161845 161971 161948 161395 160045 157990 155766 153718 151316
54000A51316l550m396l957k924k741l561m213l986l279k603j990j475j308j470
$$ 151316 147766 143370 139413 136489 133748 130187 125974 121988 118709 116106 114116 112641 111333 109863
53986A09863j679j940k401k802k601j768q13j43J25j01q13j615k056k132k040
$$ 109863 108184 106244 103843 101041 98440 96672 95859 95716 95841 95740 94927 93312 91256 89124 87084
53971H7084j710j029l21m4k08m67n98n33k19J83L40K73L10L47j19q37o84P45K307
$$ 87084 85374 84345 84024 83980 83772 83305 82707 82174 81955 82138 82478 82751 83061 83408 83289 82452 81768 82513 84820
53952H4820K844K644K480K229J547J120J785L014L609L468L485L956M345M396
$$ 84820 87664 90308 92788 95017 96564 97684 99469 102483 106092 109560 113045 117001 121346 125742
53938A25742M246L747K784K067K382L275L644L439L528M059M218L655K895K305
$$ 125742 129988 133735 136519 138586 140968 144243 147887 151326 154854 158913 163131 166786 169681 171986
53924A71986J748J343J388J523J087L49K92J051J720J834J865K125K254K130K268
$$ 171986 173734 175077 176465 177988 179075 179424 179716 180767 182487 184321 186186 188311 190565 192695 194963
53909A94963L016M130N315O368O848O532O145O510P055O417M569K927K177J441
$$ 194963 197979 202109 207424 213792 220640 227172 233317 239827 246882 253299 257868 260795 262972 264413
53895B64413N7j232j643j560j634j713j543j570k168k930l476m235n506o473o173
$$ 264413 264470 263238 261595 260035 258401 256688 255145 253575 251407 248477 245001 240766 235260 228787 222614
53880B22614m993m286m664n476n826n517m964m667m707m612l876k784k256k757
$$ 222614 217621 213335 208671 203195 197369 191852 186888 182221 177514 172902 169026 166242 163986 161229
53866A61229l644l989l611l069k937l417m312n102n232m620l697k870k174j516
$$ 161229 157585 153596 149985 146916 143979 140562 136250 131148 125916 121296 117599 114729 112555 111039
53852A11039r40n46l59l93o06p73p21n76n58n64l70j10j26l52l36O9M93N26J09
$$ 111039 110099 109553 109194 108801 108195 107422 106701 106125 105567 105003 104633 104523 104397 104045 103709 103778 104271 104797 104906
53833A04906n36j010r34l84j3l17r48j194r51o89o08m88k51j73m50r86j469j415
$$ 104906 104370 103360 102426 102042 102029 101712 100764 99570 98619 97930 97322 96834 96583 96410 95960 94974 93505 92090
53815I2090m36J092K025J717Q91O06Q34Q84P43R86J584J909J811J780J980K131
$$ 92090 91654 92746 94771 96488 97379 97985 98819 99703 100446 101432 103016 104925 106736 108516 110496 112627
53799A12627K264K719L353L661L685L919M377M590M551M654M761M373L707L504
$$ 112627 114891 117610 120963 124624 128309 132228 136605 141195 145746 150400 155161 159534 163241 166745
53785A66745L671L294K241J504J602J760J211K62m17p41q89q48p74j107j832k326
$$ 166745 170416 173710 175951 177455 179057 180817 182028 182290 181873 181132 180243 179395 178621 177514 175682 173356
53769A73356k315k301k682l120l168k843k260j447p68p26j019o31O92J909K131
$$ 173356 171041 168740 166058 162938 159770 156927 154667 153220 152452 151726 150707 150076 150768 152677 154808
53754A54808J724J427J156L88q55k120l125l655l368k342j433j425k091k595k586
$$ 154808 156532 157959 159115 159503 158648 156528 153403 149748 146380 144038 142605 141180 139089 136494 133908
53739A33908k420k472k660k639k243j710j469j619j684j185k60N28Q53P25K11
$$ 133908 131488 129016 126356 123717 121474 119764 118295 116676 114992 113807 113547 114075 114928 115653 115864
53724A15864m33p17n37n15j080j602j298n85n11j112j482j282r86p54k48L50M10
$$ 115864 115431 114714 114177 113662 112582 110980 109682 109097 108586 107474 105992 104710 103724 102970 102722 103072 103482
53707A03482J2j12P2m9l11K05J432K109J799J638K438L378L392K655J872J199
$$ 103482 103494 103382 103454 103405 103094 103299 104731 106840 108639 110277 112715 116093 119485 122140 124012 125211
53691A25211O66O71J257J755J808J903K268K254J508P46O62R74J265J735K352
$$ 125211 125877 126548 127805 129560 131368 133271 135539 137793 139301 140047 140709 141683 142948 144683 147035
53676A47035K362J518Q98J409K363K558J971J377R35K75m87q57p40m40j87j85
$$ 147035 149397 150915 151813 153222 155585 158143 160114 161491 162426 162701 162214 161357 160617 160177 159990 159805
53660A59805n92j029p38K66R99R01N40L97L5p98j326j000n16o03p19j44N69N11
$$ 159805 159213 158184 157446 157712 158711 159612 160152 160549 160584 159786 158460 157460 156944 156341 155622 155478 156047 156558
53642A56558N9K56J042J413R68J44p49j683k290k121j408p48l09O5L08L82N27
$$ 156558 156617 156873 157915 159328 160296 160440 159691 158008 155718 153597 152189 151441 151132 151197 151505 151887 152414
53625A52414O96L83l38m18O55J780J730R50P14J154J412J218J051J078J179J645
$$ 152414 153110 153493 153155 152737 153392 155172 156902 157852 158566 159720 161132 162350 163401 164479 165658 167303
53609A67303K684L586L521K951L025L814M327M090L576L200K940K921L301L686
$$ 167303 169987 173573 177094 180045 183070 186884 191211 195301 198877 202077 205017 207938 211239 214925
53595B14925L536L108L042L246L090K574K286K362K375K154J892J591J262J340
$$ 214925 218461 221569 224611 227857 230947 233521 235807 238169 240544 242698 244590 246181 247443 248783
53581B48783K070K791K761K322K268K422J994J015K25k14p15j166j106q32j064
$$ 248783 250853 253644 256405 258727 260995 263417 265411 266426 266651 266437 265722 264556 263450 262618 261554
53566B61554j593j554r51n88n03Q9J129J403L53j143k130k596k720k272j384q48
$$ 261554 259961 258407 257456 256868 256365 256454 257583 258986 259339 258196 256066 253470 250750 248478 247094 246246
53550B46246j042j379j266q85n39j05M66Q03P60P32R70J216J337J585J929J930
$$ 246246 245204 243825 242559 241674 241135 241030 241496 242299 243059 243791 244761 245977 247314 248899 250828 252758
53534B52758J640J879L102M531N102M707M085L821L968M385N031O017P427Q979
$$ 252758 254398 256277 259379 263910 269012 273719 277804 281625 285593 289978 295009 301026 308453 317432
53520C17432R950R888R253Q962R339J0024J0809J1894J3273J4505J5262J5630
$$ 317432 327382 337270 346523 355485 364824 374848 385657 397551 410824 425329 440591 456221
53508D56221J5863J6247J7126J8590K0221K1639K3037K4591K5711K5739K5220
$$ 456221 472084 488331 505457 524047 544268 565907 588944 613535 639246 664985 690205
53497F90205K5406K6565K7707K8125K8122K8059K7680K6923K6432K6768K7652
$$ 690205 715611 742176 769883 798008 826130 854189 881869 908792 935224 961992 989644
53486I89644K8538K9358L0369L1643L3092L4650L6110L7095L7265L6452L4562
$$ 989644 1018182 1047540 1077909 1109552 1142644 1177294 1213404 1250499 1287764 1324216 1358778
53475A358778L1854K9007K6481K3882K0672J7278J4771J3494J2831J2370J2410
$$ 1358778 1390632 1419639 1446120 1470002 1490674 1507952 1522723 1536217 1549048 1561418 1573828
53464A573828J3166J4198J4925J5056J4414J2947J1031R120O982L984K55l236
$$ 1573828 1586994 1601192 1616117 1631173 1645587 1658534 1669565 1678685 1685667 1689651 1689906 1686670
53452A686670n943q376j1186j4320j7379k0233k2978k5648k8148l0133l1064l0945
$$ 1686670 1680727 1672351 1661165 1646845 1629466 1609233 1586255 1560607 1532459 1502326 1471262 1440317
53440A440317l0831l1848l3732l5099l5154l4332l3242l2017l0892l0421l0690
$$ 1440317 1409486 1377638 1343906 1308807 1273653 1239321 1206079 1174062 1143170 1112749 1082059
53429A082059l1057l0999l0554k9706k8091k5665k2957k0316j7495j4315j1086
$$ 1082059 1051002 1020003 989449 959743 931652 905987 883030 862714 845219 830904 819818
53418H19818q141n470l028p89J599M570P903J0910J3444J5989J8670K1061K3027
$$ 819818 811677 806207 803179 802390 803989 808559 816462 827372 840816 856805 875475 896536 919563
53405I19563K4943K6813K8187K9207L0702L2892L4927L6186L7071L8099L9170
$$ 919563 944506 971319 999506 1028713 1059415 1092307 1127234 1163420 1200491 1238590 1277760
53394A277760M0358M2367M5447M8641N1049N3176N6184O0203O4245O7440O9751
$$ 1277760 1318118 1360485 1405932 1454573 1505622 1558798 1614982 1675185 1739430 1806870 1876621
53383A876621P1540P3080P4290P4844P4697P4587P5457P7194P8623P8916P8220
$$ 1876621 1948161 2021241 2095531 2170375 2245072 2319659 2395116 2472310 2550933 2629849 2708069
53372B708069P6667P3666O8831O2822N6703N0989M5893M1823L8899L6509L4085
$$ 2708069 2784736 2858402 2927233 2990055 3046758 3097747 3143640 3185463 3224362 3260871 3294956
53361C294956L1844L0213K8864K6965K4041K0142J5445J0127M108l436j3793k7286
$$ 3294956 3326800 3357013 3385877 3412842 3436883 3457025 3472470 3482597 3486705 3483269 3469476 3442190
53349C442190m2475n7174o9899q0002q7131r1381r3483r4227r3878r2713r1551
$$ 3442190 3399715 3342541 3272642 3192640 3105509 3014128 2920645 2826418 2732540 2639827 2548276
53338B548276r1013r0507q8864q5954q3004q1222q0605q0231p9367p8033p6679
$$ 2548276 2457263 2366756 2277892 2191938 2108934 2027712 1947107 1866876 1787509 1709476 1632797
53327A632797p5436p3776p1040o7179o2760n8321n4089n0213m6708m3121l8844
$$ 1632797 1557361 1483585 1412545 1345366 1282606 1224285 1170196 1119983 1073275 1030154 991310
53316I91310l3908k9043k4747k0849j7009j3202r582o329l715j756J00K323M400
$$ 991310 957402 928359 903612 882763 865754 852552 842970 836641 832926 831170 831270 833593 837993
53303H37993N435N626O162P490Q800R510J0132J1173J2205J2761J3280J4424J6159
$$ 837993 843428 849054 855216 862706 871506 881016 891148 902321 914526 927287 940567 954991 971150
53290I71150J8160K0430K2923K5261K7384K9738L2216L3866L4348L4796L6229
$$ 971150 989310 1009740 1032663 1057924 1085308 1115046 1147262 1181128 1215476 1250272 1286501
53279A286501L7975L8712L8407L8030L7836L7122L5617L3914L2519L1226K9644
$$ 1286501 1324476 1363188 1401595 1439625 1477461 1514583 1550200 1584114 1616633 1647859 1677503
53268A677503K7754K5918K4555K3807K3265K2434K1381K0373J8822J5584J0789
$$ 1677503 1705257 1731175 1755730 1779537 1802802 1825236 1846617 1866990 1885812 1901396 1912185
53257A912185O134K656p29n434j0932j5691j9631k4128k9810l5851m1306m5997
$$ 1912185 1918319 1920975 1920246 1914812 1903880 1888189 1868558 1844430 1814620 1778769 1737463 1691466
53245A691466m9892n2758n4643n5879n6480n6209n5222n3865n1885m8687m4525
$$ 1691466 1641574 1588816 1534173 1478294 1421814 1365605 1310383 1256518 1204633 1155946 1111421
53234A111421m0622l7988l6656l6206l6361l6922l7649l8481l9495m0591m1395
$$ 1111421 1070799 1032811 996155 959949 923588 886666 849017 810536 771041 730450 689055
53223F89055m1448m0286l7663l4060l0534k7607k4712k1287j7970j5910j5152
$$ 689055 647607 607321 569658 535598 505064 477457 452745 431458 413488 397578 382426
53212C82426j4555j3233j1358r579q301p577p139o576n804n266n214n131m497
$$ 382426 367871 354638 343280 333701 325400 317823 310684 304108 298304 293038 287824 282693 278196
53199B78196l716l634m312n030n351n451n541n707o142o801o943n845l993k705
$$ 278196 274480 270846 266534 261504 256153 250702 245161 239454 233312 226511 219568 213723 209730 207025
53185B07025k599l110l541l736l638l059k199j728j971k531k948l216l418l396
$$ 207025 204426 201316 197775 194039 190401 187342 185143 183415 181444 178913 175965 172749 169331 165935
53171A65935l071k677k372j995j498j282j707k419k583j832q69q35j952l041k731
$$ 165935 162864 160187 157815 155820 154322 153040 151333 148914 146331 144499 143630 142795 140843 137802 135071
53156A35071j117L59O69K29j08k89o96j224j480j478j429j179n92j48l38p84p95
$$ 135071 133954 134313 134982 135211 135103 134814 134118 132894 131414 129936 128507 127328 126736 126588 126250 125466 124671
53139A24671n56q32j548j714q69J94M82j20j039j699j794j321o31r2L74J016J569
$$ 124671 124115 123283 121735 120021 119152 119346 119828 119708 118669 116970 115176 113855 113224 113132 113506 114522 116091
53122A16091J397M16n99q26j73Q37J577J608Q38l13j128j114l64N65J098J091
$$ 116091 117488 117904 117305 116479 116306 117143 118720 120328 121166 120853 119725 118611 118247 118812 119910 121001
53106A21001Q50N97M2j108k340k749k396k367l156l858l586k803k420k308j782
$$ 121001 121851 122448 122490 121382 119042 116293 113897 111530 108374 104516 100930 98127 95707 93399 91617
53091I1617r52m45j41N75J502J706J011L09K72O56R94J144R61L22l06j04J006
$$ 91617 90665 90220 90079 90654 92156 93862 94873 95182 95454 96110 97104 98248 99209 99531 99225 99121 100127
53074A00127K135K632K860L452M290M647M066K870J847J534J734J761J236L89
$$ 100127 102262 104894 107754 111206 115496 120143 124209 127079 128926 130460 132194 133955 135191 135580
53060A35580m87j395k215k531k276j967j883j670j297j503k536l292k813j875
$$ 135580 135093 133698 131483 128952 126676 124709 122826 121156 119859 118356 115820 112528 109715 107840
53046A07840j865k728l343l401l428l273k319j060p94j552j983j566j388k127
$$ 107840 105975 103247 99904 96503 93075 89802 87483 86423 85629 84077 82094 80528 79140 77013
53032G7013k794k281j022k32l90j039j500j199j03Q84P42k35q00p18j090k307
$$ 77013 74219 71938 70916 70684 70294 69255 67755 66556 66453 67337 68079 67844 67044 66326 65236 62929
53016F2929l073k362j051m70l95K38J263J390K22j114j425p12J72N40L20j25m45
$$ 62929 59856 57494 56443 55973 55578 55816 57079 58469 58691 57577 56152 55440 55612 56152 56472 56347 55902
52999E5902n79o23n68m66o80j366j869j294J46J129Q39p3n00j59M94J030J217
$$ 55902 55323 54700 54132 53666 52986 51620 49751 48457 48603 49732 50571 50498 49998 49839 50333 51363 52580
52982E2580R45M54K65N12P26N49K03m5l37p78j027p69k00L10O43P64N27J2l73
$$ 52580 53525 53979 54244 54756 55482 56031 56234 56189 55852 55074 54047 53278 53078 53388 54031 54795 55322 55334 54961
52963E4961m17l89n54p56o95l21K28O83O08k29j286j590q33L08J026J088O71J48
$$ 54961 54544 54155 53601 52845 52150 51829 52057 52740 53348 53119 51833 50243 49410 49718 50744 51832 52503 52651
52945E2651N9O60J381J413R03P50J164J324P10j65o75q09n77L54J780K607K146
$$ 52651 52710 53370 54751 56164 57067 57817 58981 60305 61015 60850 60175 59366 58789 59143 60923 63530 65676
52928F5676J156Q68J540K531L366L968M238M006L289K254J177N02M89P34N54o2
$$ 65676 66832 67700 69240 71771 75137 79105 83343 87349 90638 92892 94069 94571 95060 95794 96348 96286
52912I6286n50q66j497k294k341j450p07r42j648k004k051k139k127j906j915
$$ 96286 95736 94870 93373 91079 88738 87288 86581 85639 83991 81987 79936 77797 75670 73764 71849
52897G1849k301k365j686j042j326k214k800k882k689k127j217p01j076j593j258
$$ 71849 69548 67183 65497 64455 63129 60915 58115 55233 52544 50417 49200 48499 47423 45830 44572
52882D4572l52J73K57N21Q56N72j73l87K36R08R59N81J56k65n96n76k28L0j05
$$ 44572 44220 44393 44650 45171 46027 46599 46426 46039 46275 47183 48142 48723 48879 48614 48018 47442 47214 47244 47139
52863D7139n45r41q42M7J255J676Q68j85k96L87Q24O71M29L04qm51n93m51m23
$$ 47139 46594 45653 44811 44858 46113 47789 48657 48472 48176 48563 49387 50058 50487 50791 50783 50332 49739 49288 48865
52844D8865l71L39J695K838L139K768K085J269O17M31M23K2o14p11j53K66J32
$$ 48865 48494 48833 50528 53366 56505 59273 61358 62627 63244 63675 64098 64120 63506 62795 62642 62908 63040
52827F3040PK40K02o16j524j512p55k84m45n94k83O2p7n17p09n12j54L62J292
$$ 63040 63047 63287 63489 62873 61349 59837 59082 58798 58353 57759 57476 57538 57461 56944 56235 55723 55569 55931 57223
52808E7223K486L165K744J718J194J576K115J910R99K50M19J555K998L739L097
$$ 57223 59709 62874 65618 67336 68530 70106 72221 74131 75130 75380 75799 77354 80352 84091 87188
52793H7188J335m87j516j738j550j174q12r19j703k574k647j753o23n4k54q88
$$ 87188 88523 88036 86520 84782 83232 82058 81246 80327 78624 76050 73403 71650 71027 70973 70719 69831
52777F9831j514j919k265k756l136k806j674n08n0j28n8L15N17K04m48j119j665
$$ 69831 68317 66398 64133 61377 58241 55435 53761 53253 53203 53075 53017 53332 53849 54053 53605 52486 50821
52760E0821k041k160j932j302l84L72L94l42j062r42O1J265J997K056J628J071
$$ 50821 48780 46620 44688 43386 43002 43374 43768 43426 42364 41422 41483 42748 44745 46801 48429 49500
52744D9500O59M00J09k41n03o20o54n30j43K61K91K2j16j14m14j041j388j130
$$ 49500 50159 50559 50668 50427 49924 49304 48650 48120 47977 48238 48529 48551 48435 48321 47907 46866 45478 44348
52726D4348o31k32K13P13Q99P48P56R86P88K0m55j52J26l12p59k50P35J084Q54
$$ 44348 43717 43485 43698 44411 45310 46058 46814 47800 48588 48608 48153 48001 48127 47815 47056 46806 47541 48625 49479
52707D9479R39J293R40l22j540j996j898j585j067n37l98n68n11j27R7l9r8K71
$$ 49479 50418 51711 52651 52329 50789 48793 46895 45310 44243 43706 43308 42740 42229 42102 42199 42160 42062 42333
52689D2333Q21J101Q96L16k34l01L5P3n66j295j376r80o81m12K13Q99R97N94L20
$$ 42333 43154 44255 45151 45467 45233 44932 44967 45040 44474 43179 41803 40823 40142 39730 39943 40842 41839 42433 42753
52670D2753K36l3k38L07J432K095J834J251R28P81O78Q28J254J667K075K751L387
$$ 42753 42989 42956 42718 43025 44457 46552 48386 49637 50565 51346 52024 52852 54106 55773 57848 60599 63986
52653F3986L221K263J503J537J751J374O38K93M97P33N91J89q6o3J3k14o47q42
$$ 63986 67207 69470 70973 72510 74261 75635 76273 76566 77063 77796 78387 78576 78490 78427 78440 78226 77579 76737
52635G6737q24j210k085k481j745q19j030k014k142q60P21J619K035K302K031
$$ 76737 75913 74703 72618 70137 68392 67573 66543 64529 62387 61527 62248 63867 65902 68204 70235
52620G0235R12o02j926k941l576l566k990k287j515l56R09J375Q02L1l13n63r77
$$ 70235 71147 70545 68619 65678 62102 58536 55546 53259 51744 51388 52297 53672 54474 54505 54192 53629 52652
52603E2652r53p7Q71R03K49o2K62N15N4q96j583j457o13K85N86K21m02r37j189
$$ 52652 51699 51622 52493 53396 53645 53583 53845 54360 54414 53518 51935 50478 49865 50150 50736 50957 50555 49618 48429
52584D8429q74P9J087J404J102R05R60O92j09q28r86q37o47k12N55J206J389J220
$$ 48429 47555 47634 48721 50125 51227 52132 53092 53784 53675 52847 51861 51024 50377 50165 50720 51926 53315 54535
52566E4535P62j77j289j665r75j40j01n19l35P48J986K530K176J343O95O11P86
$$ 54535 55297 55120 53831 52166 51191 51051 50950 50431 50096 50844 52830 55360 57536 58879 59574 60185 60971
52549F0971O42J81J1M08Q84Q79M25j26n36o95o33o53r32j045m55M74P82K75k69
$$ 60971 61613 61794 61805 62213 63097 63976 64401 64275 63739 63044 62411 61758 60826 59781 59326 59800 60582 60857 60588
52530F0588m15n60q01n01N43J453J551J368J626J984J681P75l1l61k39L33J127
$$ 60588 60173 59613 58812 58311 58854 60307 61858 63226 64852 66836 68517 69292 69261 68900 68661 68994 70121
52513G0121J487J019J91k88l00r0K38N51N47L01K88M43p4j457k523k243j271r19
$$ 70121 71608 72627 72818 72530 72230 72140 72378 72929 73476 73777 74065 74508 74434 72977 70454 68211 66940 66021
52495F6021j237j225n84K9K58M44P00N85j21j058j763j972j543o45P0J91K44R30
$$ 66021 64784 63559 62975 63004 63262 63706 64406 64991 64870 63812 62049 60077 58534 57889 57959 58150 58394 59324
52477E9324J806J666L32q97q77P4Q70J061R52Q08N45J85mP3P5k74n96k09Q52J575
$$ 59324 61130 62796 63128 62231 61354 61428 62298 63359 64311 65119 65664 65849 65845 65918 65993 65719 65123 64914 65766 67341
52457F7341J187K41j20L22P13M93O5l7J65M63P87Q61K88o76j163q65m32l84m49
$$ 67341 68528 68769 68649 68971 69684 70177 70242 70205 70370 70833 71620 72481 72769 72093 70930 70065 69633 69249 68800
52438F8800m56q27j540j579l79J046J414R05M59J07o60j352r52K62Q52K89l85
$$ 68800 68344 67517 65977 64398 64019 65065 66479 67384 67843 67950 67290 65938 64986 65248 66100 66389 66004
52421F6004k74K00L31K69M61P77Q45P21O42M71j9n44n29R0O60M65m57j281j201
$$ 66004 65730 65930 66261 66530 66991 67768 68613 69334 69976 70447 70428 69884 69355 69445 70105 70570 70113 68832 67631
52402F7631l43L81M15J84L89R52J182P47N6l38l14j20o3j61n9N51J340J498P93
$$ 67631 67288 67669 68084 68268 68657 69609 70791 71538 71594 71256 70942 70822 70759 70598 70539 71090 72430 73928 74721
52383G4721qj15K76N10N16O36P42L58l35n25O4P10O79J38k73k97j51PL01Q28J383
$$ 74721 74713 74598 74874 75384 75900 76536 77278 77636 77301 76776 76840 77550 78229 78367 78094 77797 77646 77653 77954 78782 80165
52362H0165J587J250N99N8j17Q9N98J213J528J282Q48Q98J399J513P80r0j02P22
$$ 80165 81752 83002 83601 83659 83542 83631 84229 85442 86970 88252 89100 89998 91397 92910 93690 93600 93498 94220
52344I4220J428J316N70j88m97l10Q3K82J26k40o56j067j395j556j640j679j330
$$ 94220 95648 96964 97534 97346 96849 96539 96622 96904 97030 96790 96134 95067 93672 92116 90476 88797 87467
52327H7467l05Q03R64J21n85l81J52J64j74j99J29M01O00R65J304J229Q22N54
$$ 87467 87162 87965 88929 89050 88465 88084 88236 88400 88226 88027 88156 88557 89157 90122 91426 92655 93477 94031
52309I4031O69J129J818K406K432J971J751K104K376J975J372J307J616J683J587
$$ 94031 94700 95829 97647 100053 102485 104456 106207 108311 110687 112662 114034 115341 116957 118640 120227
52294A20227J745J910J606J240J591K319K169Q39m85p75l76j91l01k3J007K299
$$ 120227 121972 123882 125488 126728 128319 130638 132807 133646 133161 132386 132010 131819 131518 131495 132502 134801
52278A34801K970K600J609P91N07N48P12R25P86j68j414j541r4J545J932J446
$$ 134801 137771 140371 141980 142771 143278 143826 144538 145463 146249 146081 144667 143126 143032 144577 146509 147955
52262A47955J367J764J625P38j5j55j58l38k49M80J517K316K623K412J875J481
$$ 147955 149322 151086 152711 153449 153434 153279 153121 152783 152534 153014 154531 156847 159470 161882 163757 165238
52246A65238J469J421R34M92R17K177L430M060L941K971J347Q2J89J370K386K693
$$ 165238 166707 168128 169062 169554 170471 172648 176078 180138 184079 187050 188397 188479 188668 190038 192424 195117
52230A95117K707K610K004Q99rk92j00N11J612K664K773J973J262J174J214J010
$$ 195117 197824 200434 202438 203337 203328 203036 202936 203447 205059 207723 210496 212469 213731 214905 216119 217129
52214B17129R40J264J586J686J974K647L076K709J901J396J442J851K338K531
$$ 217129 218069 219333 220919 222605 224579 227226 230302 233011 234912 236308 237750 239601 241939 244470
52200B44470K122J430J241J764K256K018J350J097J630K564L153K878J934J162
$$ 244470 246592 248022 249263 251027 253283 255301 256651 257748 259378 261942 265095 267973 269907 271069
52186B71069J118J374J188O30L47M06K88jJ75R41J591J591J113L79o16j469j421
$$ 271069 272187 273561 274749 275379 275726 276132 276420 276419 276594 277535 279126 280717 281830 282209 281593 280124 278703
52169B78703m65L77L97kj70j52k67m11l75l64o44j098j390j342j017p53j039j839
$$ 278703 278238 278615 279012 279010 278840 278688 278421 278010 277635 277271 276627 275529 274139 272797 271780 271027 269988 268149
52151B68149k216j403j46P0r18j781j704j367j440j456q76j85o0k55k20j44n11
$$ 268149 265933 264530 264384 264454 263536 261755 260051 258684 257244 255788 254912 254727 254667 254412 254192 254048 253537
52134B53537j140j526j694j963k198k015j505j174j320j843k437k619k044j095
$$ 253537 252397 250871 249177 247214 245016 243001 241496 240322 239002 237159 234722 232103 230059 228964
52120B28964p52j412k227k103j030J7K35l20r68j095o43j05J04J09J78J73o6j10
$$ 228964 228212 226800 224573 222470 221440 221457 221692 221372 220404 219309 218666 218561 218665 218774 218952 219125 219059 218949
52102B18949N25J418J656J202Q43Q55P52L97K24J74k94q40k37J692L424L738L215
$$ 218949 219474 220892 222548 223750 224593 225448 226200 226597 226821 226995 226701 225861 225624 227316 230740 234478 237693
52085B37693K932K842K439K066K294K742K599J896J287J053J080J385J847J945
$$ 237693 240625 243467 245906 247972 250266 253008 255607 257503 258790 259843 260923 262308 264155 266100
52071B66100J527J328J903K566K242J003j06m43j77L44Q23R12N88M65J044J880
$$ 266100 267627 268955 270858 273424 275666 276669 276563 276120 275943 276287 277110 278022 278610 279075 280119 281999
52055B81999K123J610Q56K33k64o17p64q19r32j068j166j233j077m34M13P71M74
$$ 281999 284122 285732 286588 286821 286557 285940 285176 284357 283425 282357 281191 279958 278881 278447 278860 279631 280105
52038B80105Q5j35o06j372j701j284r25j216j486r80k18j56o07p23m99o48j295
$$ 280105 280190 280055 279449 278077 276376 275092 274167 272951 271465 270485 270267 270111 269504 268781 268282 267634 266339
52021B66339j874k125k280k332k049j537j117p64l52q2p1J00P02J147Q03Q3j57
$$ 266339 264465 262340 260060 257728 255679 254142 253025 252261 251909 251827 251756 251856 252558 253705 254508 254591 254434
52004B54434Q8J96J33L52P01M91k96q80q67q33j481k832m318n305n441m882m123
$$ 254434 254522 254718 254851 255203 255904 256395 256099 255219 254352 253519 252038 249206 244888 239583 234142 229260 225137
51987B25137l451k817k424k864m225n642o305o323o119n589m644l793l415l116
$$ 225137 221686 218869 216445 213581 209356 203714 197409 191086 184967 179378 174734 170941 167526 164410
51973A64410k671k907m476o331o771n720m696m643m958m751l941k943k142j777
$$ 164410 161739 158832 154356 148025 141254 135534 130838 126195 121237 116486 112545 109602 107460 105683
51959A05683j770j633j138q42j261j867j745r96n54q28j381j805k010j781r88
$$ 105683 103913 102280 101142 100300 99039 97172 95427 94431 93877 93049 91668 89863 87853 86072 85084
51944H5084j51Rm66r58j196j261r76k45L20O2n84o04J79J132J940K587K521J149
$$ 85084 84933 84942 84476 83518 82322 81061 80085 79840 80160 80222 79638 79034 79213 80345 82285 84872 87393 88542
51926H8542q11j785j267k39M27Q59J313J569J472J223Q79L35j54k29j66m17o27
$$ 88542 87731 85946 84679 84440 84867 85726 87039 88608 90080 91303 92182 92517 92363 92134 91968 91551 90924
51909I0924j68N14L73m64p30oP31P57M44Q7o43j541j507j57J285J535Q08J20j32
$$ 90924 90756 91270 91643 91179 90449 90443 91174 91931 92375 92462 91819 90278 88771 88614 89899 91434 92242 92362 92230
51890I2230j69k08m49j053j652j541p53k14m04p41o36k59K18J064K092K315J330
$$ 92230 92061 91853 91404 90351 88699 87158 86405 86191 85787 85046 84410 84151 84369 85433 87525 89840 91170
51873I1170J43k37j57m35q24n56K15N80K86j2J76O55J008R91N30j27l89O7P99
$$ 91170 91313 91076 90919 90484 89660 89104 89319 89899 90185 90173 90349 91004 92012 93003 93533 93406 93017 93084 93883
51854I3883J116R59P89P74O19J27m37o59m90k37j20J34R55K126K737K375J844
$$ 93883 94999 95958 96747 97521 98140 98267 97830 97171 96681 96444 96324 96458 97413 99539 102276 104651 106495
51837A06495K065K617K405J552J277J832J917P97k60L03K023K984K313J080P60
$$ 106495 108560 111177 113582 115134 116411 118243 120160 120957 120697 121000 123023 126007 128320 129400 130160
51822A30160J604K690L152L088L300M256N473O275O876Q072R924J1491J1937J1167
$$ 130160 131764 134454 137606 140694 143994 148250 153723 159998 166874 174946 184870 196361 208298 219465
51808B19465R184N787J359k871n941p954r300r750r050p785o876o494o102n336
$$ 219465 228649 234436 235795 232924 226983 219029 209729 199979 190929 183144 176268 169774 163672 158336
51794A58336m265l031j787q82n75o58p06o25o12p66r34r24o54k61j26n12j116
$$ 158336 154071 151040 149253 148371 147796 147138 146432 145807 145195 144429 143495 142571 141917 141656 141530 141018 139902
51777A39902j340j069q08r29j163j116q50p48j004j448j700j467r24o35p94q22
$$ 139902 138562 137493 136685 135756 134593 133477 132627 131879 130875 129427 127727 126260 125336 124701 123907 123085
51761A23085k19N05M96j15m60m09o60j305j465p79j26l55j159j813k180k337k042
$$ 123085 122866 123371 123867 123752 123292 122883 122223 120918 119453 118674 118548 118193 117034 115221 113041 110704 108662
51744A08662j220m03j3K43O80R37O04Rk34r6k5k75p67j239j261n66L67P10M87
$$ 108662 107442 107039 107026 107269 107949 108886 109490 109499 109265 109169 109144 108869 108102 106863 105602 105036 105403 106113 106600
51725A06600N98J318J740J240N60O20J083J039N24L26O34Q26M47l26j110j626
$$ 106600 107198 108516 110256 111496 112056 112676 113759 114798 115322 115648 116282 117108 117555 117229 116119 114493
51709A14493j757j656j619j539j028k59p7p40j297q99p8L8o91j466j762j706j462
$$ 114493 112736 111080 109461 107922 106894 106635 106558 105818 104521 103622 103544 103582 102891 101425 99663 97957 96495
51692I6495r86l46K38N50L60l10p34J2J682K771K378J426J390K516M027N330O020
$$ 96495 95509 95163 95401 95951 96311 96001 95267 95279 96961 99732 102110 103536 104926 107442 111469 116799 122819
51675A22819N396L123M8k559m220n046m910l847k737k474k750k669k163j743j262
$$ 122819 128215 131338 131386 128827 124607 119561 114651 110804 108067 105593 102843 100174 98011 96268 95006
51660I5006k14J031J592J546J786K403K564K108J977K641L292L090K239J272J93
$$ 95006 94792 95823 97415 98961 100747 103150 105714 107822 109799 112440 115732 118822 121061 122333 122526
51645A22526j096k151k438j973j148l32P6k55j054j468r85qQ09J359J858K168
$$ 122526 121430 119279 116841 114868 113720 113388 113464 113209 112155 110687 109702 109694 110503 111862 113720 115888
51629A15888J795N94q03j378o24R27K133K287J565N24m14q80n83J12K79l04n81
$$ 115888 117683 118277 117474 116096 115472 116399 118532 120819 122384 122908 122494 121614 121031 121143 121422 121118 120537
51612A20537L53J714J947Q85j30k41Qq1l11k98l21p63j296j369j065r26j076j158
$$ 120537 120890 122604 124551 125436 125306 125065 125073 124992 124681 124383 124062 123299 122003 120634 119569 118643 117567 116409
51594A16409r90q20q73j065j205j261j228r65m06J51K70oj25J39K46l04j010r25
$$ 116409 115419 114599 113726 112661 111456 110195 108967 108002 107596 107747 108017 108011 107886 108025 108271 107967 106957 106032
51576A06032kQ96J275J450J563J181K89k99j18K22J08n7K77P36P25N46P38R15
$$ 106032 106030 106926 108201 109651 111214 112395 112684 112385 112267 112489 112597 112540 112817 113553 114278 114824 115562 116477
51558A16477L81m81o01J27P40O06K8n04p83o24J1O70R23J043J396J528Q55l6K5
$$ 116477 116858 116377 115776 115903 116643 117249 117277 116773 115990 115366 115377 116047 116970 118013 119409 120937 121792 121756 121781
51539A21781R55J465J037N88Q38J199R68N06N48J022J284J091P84P63J148J670
$$ 121781 122736 124201 125238 125826 126664 127863 128831 129337 129885 130907 132191 133282 134066 134829 135977 137647
51523A37647J775J196M63L65Q68J141P83L50M58R71J332J257Q38L88K91N87O76
$$ 137647 139422 140618 141081 141446 142314 143455 144238 144588 145046 146017 147349 148606 149444 149832 150123 150710 151386
51506A51386r3j454k384k314j692j268j339j751k080j843j043m53p27j367j392
$$ 151386 151293 149839 147455 145141 143449 142181 140842 139091 137011 135168 134125 133672 132945 131578 130186
51491A30186q83q74j573j856j013O2J22p53j480j468j060p72p89j060j411j619
$$ 130186 129303 128429 126856 125000 123987 124049 124171 123418 121938 120470 119410 118638 117849 116789 115378 113759
51475A13759j612j509j343j005n62l63o80j486k497l198k947j593L9Q48O79L12
$$ 113759 112147 110638 109295 108290 107728 107365 106685 105199 102702 99504 96557 94964 95003 95851 96530 96842
51459I6842K68K65j4m41q25j232j583j593j345j336j710j989j845j512j165n37
$$ 96842 97110 97375 97361 96920 96095 94863 93280 91687 90342 89006 87296 85307 83462 81950 80785 80248
51443H0248M48J259J448J229R69O34J72p4J15L03J5m49l69L50J084J274R32L36
$$ 80248 80696 81955 83403 84632 85601 86235 86407 86333 86448 86751 86766 86317 85948 86298 87382 88656 89588 89924
51425H9924k85p43q69o55k88K6K17K72J01l39p48n19N30J569J453J78r38q43J26
$$ 89924 89639 88896 88027 87372 87084 87110 87327 87599 87700 87361 86613 86094 86624 88193 89646 89824 88886 88043 88169
51406H8169J076J738K130J847P53j20K91J348J402J64r43r73o15p21r75p48k59
$$ 88169 89245 90983 93113 94960 95713 95593 95884 97232 98634 98798 97855 96882 96267 95546 94571 93823 93564
51389I3564n4l8J91N62P34O58M88L04K55N26Q72P00q2q32j088j141j408j758j868
$$ 93564 93510 93472 93663 94225 94959 95617 96105 96409 96664 97190 98062 98762 98680 97848 96760 95619 94211 92453 90585
51370I0585j666j159l40M32N57L7m42n52p56j335j779j619j217j126j244j215
$$ 90585 88919 87760 87420 87852 88409 88446 88004 87452 86696 85361 83582 81963 80746 79620 78376 77161
51354G7161j181j457j828j770j151k98M39Q22P59M57K93L01J74j48m03n71q75
$$ 77161 75980 74523 72695 70925 69774 69476 69915 70737 71496 71953 72246 72547 72721 72573 72170 71599 70724
51337G0724j110p74m9J82k85n48j0O41N46j1j93J31N17Q15J085J067N22j71l89
$$ 70724 69614 68840 68791 68973 68688 68140 68130 68771 69317 69306 69113 69244 69761 70576 71661 72728 73250 73079 72690
51318G2690j07J90J37k93q77j127n83M96J291J493J615J820J414J43r23o83M11
$$ 72690 72583 72773 72910 72617 71740 70613 70030 70526 71817 73310 74925 76745 78159 78302 77379 76696 77107
51301G7107J044P53Q3n50j068j168o27K6j3o65j108r69o40m57l13j06L7N3l1l14
$$ 77107 78151 78904 78987 78437 77369 76201 75574 75600 75587 74922 73814 72845 72205 71748 71435 71329 71366 71419 71388 71074
51281G1074q28j212j071n10L6L71N11L59p1l66j30M55Q65Q25L76l05p87n40L00
$$ 71074 70246 69034 67963 67453 67489 67860 68371 68730 68659 68293 68163 68618 69483 70308 70684 70379 69592 69052 69352
51262F9352P95L57m07n40J4O06Q53P29K15m14m37M04J238J146N19L68O76N40k62
$$ 69352 70147 70504 70097 69557 69571 70177 71030 71759 71974 71560 71123 71527 72765 73911 74430 74798 75474 76014 75752
51243G5752r69j126j107j198j123p13l13j67q4J57N16R13J268J281P84J92J01
$$ 75752 74783 73657 72550 71352 70229 69516 69203 69036 68952 69109 69625 70538 71806 73087 73871 74063 74164
51226G4164M35O52O85R41J380J376O35l77j093j354j134l86O07J231J117M37l93
$$ 74164 74599 75251 75936 76877 78257 79633 80268 79891 78798 77444 76310 75924 76531 77762 78879 79316 78923
51209G8923r40p45K65J387J633Q16k65p76n23J74Q22R41M18k61n60n89p99j152
$$ 78923 77983 77238 77503 78890 80523 81339 81074 80298 79775 79949 80771 81712 82130 81869 81309 80720 79921 78769
51191G8769j179q14m91l85k10J63M85O28P21O77K64k21o9P64J336Q45l24j148
$$ 78769 77590 76776 76285 75900 75690 75853 76338 76966 77687 78364 78628 78407 78338 79102 80438 81283 80959 79811
51173G9811j145o37j78J1R0L44P61R14M61k77o29m30j09M2J78L65L06j05m01j02
$$ 79811 78666 78029 77851 77862 77952 78296 79057 79971 80432 80155 79526 79096 78987 79029 79207 79572 79878 79773 79372 79270
51153G9270N93J118J291J410J624J651J221N94L02M78P22P41P48R81J115P15R7
$$ 79270 79863 80981 82272 83682 85306 86957 88178 88772 89074 89552 90274 91015 91763 92744 93859 94574 94671
51136I4671J2M42M29n18j642j965j511r68n98j72L71Q26J075J077P23J76q1O9
$$ 94671 94683 95125 95554 95036 93394 91429 89918 88950 88352 88180 88551 89377 90452 91529 92252 92428 92347 92416
51118I2416Q0m09r00q48n95p19q81l25P59J310Q86J49j68q0Pr8l22n25o63r33
$$ 92416 92496 92087 91187 90339 89744 89025 88144 87819 88578 89888 90774 90923 90755 90675 90682 90584 90262 89737 89074 88141
51098H8141j473j793j054O58J999J971J192Q17Q26M59k64o31n50n39o34m59k35
$$ 88141 86668 84875 83821 84479 86478 88449 89641 90458 91284 91743 91479 90848 90298 89759 89125 88666 88431
51081H8431m76q55n76J64M12K00N43J575K082J386L45n3P5K21L46M17Q4n47p55
$$ 88431 87955 87100 86524 86688 87100 87300 87843 89418 91500 92886 93231 93178 93253 93474 93820 94237 94321 93774 93019
51062I3019l56j6O7O36J813K282J114n82j015r0Q14R13O29L57q9o52o93J40J234
$$ 93019 92663 92647 92714 93350 95163 97445 98559 97977 96962 96872 97686 98599 99228 99585 99496 98844 98151 98291 99525
51043I9525J642J093K33r2K94Q02Q72P64J100J764J853Q97m33j119p82L48J858
$$ 99525 101167 102260 102493 102401 102695 103497 104369 105133 106233 107997 109850 110747 110314 109195 108413 108761 110619
51026A10619L141L482K734J623J012J059J367J612J698J569J231Q21M61J66JJ9
$$ 110619 113760 117242 119976 121599 122611 123670 125037 126649 128347 129916 131147 131968 132429 132595 132596 132615
51010A32615O9m7k75m66p45j206j477j218r69j578k753l186k408j475j350j505
$$ 132615 132684 132637 132362 131896 131151 129945 128468 127250 126281 124703 121950 118764 116356 114881 113531 112026
50994A12026r19L18J176J082M13p9J45J069J970J954J052K85L34O99O83N54R32
$$ 112026 111107 111425 112601 113683 114096 114017 114162 115231 117201 119155 120207 120492 120826 121525 122208 122762 123694
50977A23694J590J674R81J94j18n9P4K70N96R10R69P72N89O92J059J428J697K067
$$ 123694 125284 126958 127939 128133 128015 127956 128030 128300 128896 129806 130775 131547 132136 132828 133887 135315 137012 139079
50959A39079K599L019L217L627M468N079M694L693L148L279L452L657M686O521
$$ 139079 141678 144697 147914 151541 156009 161088 165782 169475 172623 175902 179354 183011 187697 194218
50945A94218P854P843P375P721Q883R998J0700J1217J1645J1995J2439J2914J2823
$$ 194218 202072 209915 217290 225011 233894 243892 254592 265809 277454 289449 301888 314802 327625
50932C27625J1753J0076Q388O826N315L890K311Q0k647m850o006o801p907q850
$$ 327625 339378 349454 357842 364668 369983 373873 376184 376264 373617 368767 362761 355960 348053 339203
50918C39203r023q922r290r690r163p858o788o198n358l985k703k060j911j863
$$ 339203 330180 321258 311968 302278 293115 285257 278469 272271 266913 262928 260225 258165 256254 254391
50904B54391j594p51P52K333L257L538L770M188M501M480M105L359K467K119K697
$$ 254391 252797 252046 252798 255131 258388 261926 265696 269884 274385 278865 282970 286329 288796 290915 293612
50889B93612L534L615K819J779P83l21j325j728j555j312j131p55l11k24m51o44
$$ 293612 297146 300761 303580 305359 306142 305821 304496 302768 301213 299901 298770 298015 297704 297480 297029 296385
50873B96385j068k318m036m906m320l162k556k596k767k855k885k729k300j845
$$ 296385 295317 292999 288963 284057 279737 276575 274019 271423 268656 265801 262916 260187 257887 256042
50859B56042j561j286q80n42l92j84K89P62R87J259K003K967L340K821K099K097
$$ 256042 254481 253195 252315 251773 251381 251197 251486 252248 253235 254494 256497 259464 262804 265625 267724 269821
50843B69821K925L866M367M718N574P001Q394R264R752J0350J1423J3095J5160
$$ 269821 272746 276612 280979 285697 291271 298272 306666 315930 325682 336032 347455 360550 375710
50830C75710J7099J8566K0022K2281K5313K8036K9641L0436L0989L1229L0983
$$ 375710 392809 411375 431397 453678 478991 507027 536668 567104 598093 629322 660305
50819F60305L0731L0832L0501K8590K5224K1765J9042J6439J2848Q022K731j963
$$ 660305 691036 721868 752369 780959 806183 827948 846990 863429 876277 884299 887030 885067
50807H85067n548q329j0912j3297j4893j5523j5811j6045j5402j3035r384n634
$$ 885067 879519 871190 860278 846981 832088 816565 800754 784709 769307 756272 746888 741254
50795G41254k290Q51L713O034Q136J0657J3637J6772K0358K4904K9986L4550L8357
$$ 741254 738964 739815 743528 749562 757698 768355 781992 798764 819122 844026 874012 908562 946919
50782I46919M1954M5247M7192M7135M5326M1978L7090L1380K6168K1836J7448
$$ 946919 988873 1034120 1081312 1128447 1173773 1215751 1252841 1284221 1310389 1332225 1349673
50771A349673J2446P542L419l72m463q625j2564j6868k2184k8081l3585l8210
$$ 1349673 1362119 1369661 1373080 1372708 1368245 1359620 1347056 1330188 1308004 1279923 1246338 1208128
50759A208128m1707m3483m3307m2149m1233m0506l8923l6036l2465k8963k5882
$$ 1208128 1166421 1122938 1079631 1037482 996249 955743 916820 880784 848319 819356 793474
50748G93474k3414k1552j9795j7599j5056j2563r982o877l518o94J497L893P006
$$ 793474 770060 748508 728713 711114 696058 683495 673513 666636 663118 662424 663921 667814 674820
50735F74820J0292J3063J5436J7909K0557K3235K6061K9123L1785L2945L1891
$$ 674820 685112 698175 713611 731520 752077 775312 801373 830496 862281 895226 927117
50724I27117K8687K3851J8167J2669Q106M299N11l376o566q588j0182j2306j4621
$$ 927117 955804 979655 997822 1010491 1018597 1022896 1023407 1020031 1013465 1004877 994695 982389 967768
50711I67768j5732j4944j3052j1240r860q556p007n100k848n56J256K543L964
$$ 967768 952036 937092 924040 912800 902940 894384 887377 882277 879429 878873 880129 882672 886636
50698H86636N998Q078R199R092Q273P149N757M260L102K582K779L842N876Q488
$$ 886636 892634 900712 909911 919003 927276 934425 940182 944442 947544 950126 952905 956747 962623 971111
50684I71111J1049J3432J5973J8677K1015K2584K3378K3313K2212K0657K0142
$$ 971111 982160 995592 1011565 1030242 1051257 1073841 1097219 1120532 1142744 1163401 1183543
50673A183543K1835K5556L0410L6126M3255N2199O2474P2895Q2202Q9465R4156
$$ 1183543 1205378 1230934 1261344 1297470 1340725 1392924 1455398 1528293 1610495 1699960 1794116
50662A794116R5853R4056Q8636Q0516P1421O2587N4116M5803L8265L2431K8141
$$ 1794116 1889969 1984025 2072661 2153177 2224598 2287185 2341301 2387104 2425369 2457800 2485941
50651B485941K3887J8238J1083L296m433j1974j9181k5527l0481l3830l5437l4949
$$ 2485941 2509828 2528066 2539149 2542445 2538012 2526038 2506857 2481330 2450849 2417019 2381582 2346633
50639B346633l2180k7703k2593j7501j2312o782j195L834P766J0195J0767R491
$$ 2346633 2314453 2286750 2264157 2246656 2234344 2227562 2226367 2230201 2237967 2248162 2258929 2268420
50627B268420O830L254j056n772j0024j3051j5103j7101j9295k0716k0071j6790
$$ 2268420 2275250 2278504 2277448 2271676 2261652 2248601 2233498 2216397 2197102 2176386 2156315 2139525
50615B139525j1124l588N305J4833K3819L0821L4781L5578L3795K9872K3741J5452
$$ 2139525 2128401 2124813 2130118 2144951 2168770 2199591 2234372 2269950 2303745 2333617 2357358 2372810
50603B372810N755m425j4863k6000l8076n0623o2656p3051q0849q5748q8249q8977
$$ 2372810 2378565 2374140 2359277 2333277 2295201 2244578 2181922 2108871 2028022 1942274 1854025 1765048
50591A765048q7948q4910q0295p5267p0657o6261o1403n5883n0167m4854m0149
$$ 1765048 1677100 1592190 1511895 1436628 1365971 1299710 1238307 1182424 1132257 1087403 1047254
50580A047254l5781l1390k6958k2779j9050j5670j2539r696o973l887k95L175
$$ 1047254 1011473 980083 953125 930346 911296 895626 883087 873391 866418 862531 862236 865411
50568H65411N738P376Q723J0176J1444J1981J1567J0593R906J0181J1236J2328
$$ 865411 871149 878525 887248 897424 908868 920849 932416 943009 952915 963096 974332 986660
50556I86660J3278J4873J7838K1957K6689L2117L8570M5703N2698N9185O5335
$$ 986660 999938 1014811 1032649 1054606 1081295 1113412 1151982 1197685 1250383 1309568 1374903
50545A374903P1181P6304P9939Q0988P8566P3277O7474O3323O0898N9008N7445
$$ 1374903 1446084 1522388 1602327 1683315 1761881 1835158 1902632 1965955 2026853 2085861 2143306
50534B143306N7258N8966O1638O3920O5045O4819O3571O2230O1736O2139O2978
$$ 2143306 2200564 2259530 2321168 2385088 2450133 2514952 2578523 2640753 2702489 2764628 2827606
50523B827606O4314O6573O9485P2254P4648P6909P8577P8531P6260P1963O5307
$$ 2827606 2891920 2958493 3027978 3100232 3174880 3251789 3330366 3408897 3485157 3557120 3622427
50512C622427N5474M2628K8012J2155n613k5248m4944o2879p8818r3037j04698
$$ 3622427 3677901 3720529 3748541 3760696 3755083 3729835 3684891 3622012 3543194 3450157 3345459
50501C345459j12410j15674j14733j09556j00085q7076p1790n5029l7239j9258
$$ 3345459 3233049 3117375 3002642 2893086 2793001 2705925 2634135 2579106 2541867 2522609
50491B522609k361J2370K4200L2494L6679L6306L0990K0759O519j0383k9169m9375
$$ 2522609 2520248 2532618 2556818 2589312 2625991 2662297 2693287 2714046 2720565 2710182 2681013 2631638
50479B631638o9423q6586r9038j07126j11959j13789j12542j09001j04282r8762
$$ 2631638 2562215 2475629 2376591 2269465 2157506 2043717 1931175 1822174 1717892 1619130
50469A619130r2482q6088q0204p4414o8030o1570n6197n1872m7335m2015l6814
$$ 1619130 1526648 1440560 1360356 1285942 1217912 1156342 1100145 1048273 1000938 958923 922109
50458I22109l2591k8947k5094k1214j8190j6297j4772j2745j0256q081o696n730
$$ 922109 889518 860571 835477 814263 796073 779776 765004 752259 742003 733922 727226 721496
50446G21496m617l445k697k272j488q9J380K457L378M534N887P266Q663R947J0985
$$ 721496 716879 713434 710737 708465 706977 706888 708268 710725 714103 718637 724524 731790 740453 750400 761385
50431G61385J2335J4979J8834K2389K4596K6413K9510L4129L9150M3812M8230
$$ 761385 773720 788699 807533 829922 854518 880931 910441 944570 983720 1027532 1075762
50420A075762N2376N5727N8078N9928O1786O3624O5165O6372O7562O9218P1512
$$ 1075762 1128138 1183865 1241943 1301871 1363657 1427281 1492446 1558818 1626380 1695598 1767110
50409A767110P3808P5056P4818P3497P1239O7322O1278N3955M6686L9808L2836
$$ 1767110 1840918 1915974 1990792 2064289 2135528 2202850 2264128 2318083 2364769 2404577 2437413
50398B437413K5677J8772J2204N514j614r328j8141k8635m0556n2714o3966p3755
$$ 2437413 2463090 2481862 2494066 2499580 2497966 2488638 2470497 2441862 2401306 2348592 2284626 2210871
50386B210871q1790q7710r1163r1816q9328q3753p5912o7015n7920m8949m0104
$$ 2210871 2129081 2041371 1950208 1858392 1769064 1685311 1609399 1542384 1484464 1435515 1395411
50375A395411l1167k1876j2482l842L287Q685J2019J2452R574M254k212r377j7315
$$ 1395411 1364244 1342368 1329886 1326044 1329331 1338016 1350035 1362487 1372061 1376315 1374103 1364726 1347411
50362A347411k5443l2629l8294m2488m5025m5490m4165m2151m0315l8727l7123
$$ 1347411 1321968 1289339 1251045 1208557 1163532 1118042 1073877 1031726 991411 952684 915561
50351I15561l5352l3295l0861k8167k5383k2561j9893j7817j6357j4798j2678
$$ 915561 880209 846914 816053 787886 762503 739942 720049 702232 685875 671077 658399
50340F58399j0670r634r181q192o555n332n081n084m494l397k427j939j889k041
$$ 658399 647729 638095 628914 620722 614167 608835 603754 598670 594176 590779 588352 586413 584524 582483
50326E82483k131k148k392k853k835j835n38p0m05l98O16K135L461M450N141N542
$$ 582483 580352 578204 575812 572959 570124 568289 567751 567681 567276 566878 567494 569629 573090 577540 582681 588223
50310E88223N990P020Q620J0332J2187J4689J7843K0982K3812K6555K8796K9264
$$ 588223 594213 601233 609853 620185 632372 647061 664904 685886 709698 736253 765049 794313
50298G94313K7387K4265K1387J9084J6919J4891J3410J2476J1606J0364Q375N121
$$ 794313 821700 845965 867352 886436 903355 918246 931656 944132 955738 966102 974477 979598
50286I79598L24n543j1635j7524k3153k8105l1420l2398l1346k9388k7514k5778
$$ 979598 979922 974379 962744 945220 922067 893962 862542 830144 798798 769410 741896 716118
50274G16118k3532k0420j6933j3822j1295r170p539o705o527o417o072n686n448
$$ 716118 692586 672166 655233 641411 630116 620946 613407 606702 600175 593758 587686 582000 576552
50261E76552n283n198n325n451n038l921k627j867j972k855m021m638m116k776
$$ 576552 571269 566071 560746 555295 550257 546336 543709 541842 539870 537015 532994 528356 524240 521464
50247E21464j521p74k16L62N78P4q66j671k059k044j675r90j8J176K273K681K182
$$ 521464 519943 519169 518953 519315 519893 519967 519101 517430 515371 513327 511652 510662 510644 511820 514093 516774 518956
50230E18956J414J135J136O50k50o48l46l70j397k632k977k619k536k945l213
$$ 518956 520370 521505 522641 523291 523041 522393 522047 521677 520280 517648 514671 512052 509516 506571 503358
50215E03358l083l007l158k996k118j047o12q75j070o07K85J030J502J971K427
$$ 503358 500275 497268 494110 491114 488996 487949 487337 486462 485392 484785 485070 486100 487602 489573 492000
50200D92000K446J917J432J651K553L676M679N311N277M687M355M939N982O474
$$ 492000 494446 496363 497795 499446 501999 505675 510354 515665 520942 525629 529984 534923 540905 547379
50186E47379O264O131O546P099P273P131O994P063P469Q150Q618Q384P679P235
$$ 547379 553643 559774 566320 573419 580692 587823 594817 601880 609349 617499 626117 634501 642180 649415
50172F49415P258P324P323P781Q962J0428J1801J3319J5134J6823J8076J9452
$$ 649415 656673 663997 671320 679101 688063 698491 710292 723611 738745 755568 773644 793096
50160G93096K1809K5286K9321L3483L7834M2611M7915N3819O0617O8864P9003
$$ 793096 814905 840191 869512 902995 940829 983440 1031355 1085174 1145791 1214655 1293658
50149A293658R0821J03520J16538J29876J43182J54744J62030J63159J57446J45020
$$ 1293658 1384479 1487999 1604537 1734413 1877595 2032339 2194369 2357528 2514974 2659994
50139B659994J27031J06237Q6335P0123N8671N1996M9518M9553M9259M5735L6835
$$ 2659994 2787025 2893262 2979597 3049720 3108391 3160387 3209905 3259458 3308717 3354452 3391287
50128C391287K1020k485l2760o6972j01487j32927j58327j75455j83731j84267
$$ 3391287 3412307 3409822 3377062 3310090 3208603 3075676 2917349 2741894 2558163 2373896
50118B373896j78582j67808j53339j37305j21660j07118r3520q0710o8832n8196
$$ 2373896 2195314 2027506 1874167 1736862 1615202 1508084 1414564 1333854 1265022 1206826
50108A206826m9339m2607l7394l2440k7364k3134k0518j8736j6429j3396j0544
$$ 1206826 1157487 1114880 1077486 1045046 1017682 994548 974030 955294 938865 925469 914925
50097I14925q527p198o188n339m552l783l102k582k222k095k214k182j491l76
$$ 914925 906398 899200 893012 887673 883121 879338 876236 873654 871432 869337 867123 864941 863450 863074
50083H63074K50J4l62l4J021K457M135N762O642O562O373O995Q241R298R961J0653
$$ 863074 863324 863338 862976 862942 863963 866420 870555 876317 882959 889521 895894 902889 911130 920428 930389 941042
50067I41042J1568J2503J3367J4219J4984J5563J6064J6547J6855J7024J7425
$$ 941042 952610 965113 978480 992699 1007683 1023246 1039310 1055857 1072712 1089736 1107161
50056A107161J8052J8250J7721J7325J8138K0052K2066K3687K5265K7131K9133
$$ 1107161 1125213 1143463 1161184 1178509 1196647 1216699 1238765 1262452 1287717 1314848 1343981
50045A343981L1101L3260L6067L9891M4728N0169N5923O2582P1257Q2245R4695
$$ 1343981 1375082 1408342 1444409 1484300 1529028 1579197 1635120 1697702 1768959 1851204 1945899
50034A945899J08173J23751J42667J64493J87525K10510K32655K51927K64623
$$ 1945899 2054072 2177823 2320490 2484983 2672508 2883018 3115673 3367600 3632223
50025C632223K67356K59301K42513K20704J97890J77536J62020J52347J47910
$$ 3632223 3899579 4158880 4401393 4622097 4819987 4997523 5159543 5311890 5459800
50016E459800J46476J44772J39332J26895J04397O9770K3515l0696q7362j41068
$$ 5459800 5606276 5751048 5890380 6017275 6121672 6191442 6214957 6184261 6096899 5955831
50006E955831j87541k24225k50910k69230k80782k85937k84794k78517k68844
$$ 5955831 5768290 5544065 5293155 5023925 4743143 4457206 4172412 3893895 3625051
49997C625051k56695k42162k25510k07435j88587j69669j51753j35628j20985
$$ 3625051 3368356 3126194 2900684 2693249 2504662 2334993 2183240 2047612 1926627
49988A926627j07050r3955q2728p3940o6949o0645n4372m8186m2658l8364l5221
$$ 1926627 1819577 1725622 1642894 1568954 1502005 1441360 1386988 1338802 1296144 1257780 1222559
49977A222559l2494k9766k7526k6316k5783k5149k4308k3764k3789k4222k4734
$$ 1222559 1190065 1160299 1132773 1106457 1080674 1055525 1031217 1007453 983664 959442 934708
49966I34708k4729k3453k0945j8441j7064j6458j5510j3963j2331j0746q971p330
$$ 934708 909979 886526 865581 847140 830076 813618 798108 784145 771814 761068 752097 744767
49954G44767o399n912n053l784k861k498k160j680j436j301n79Q03K059K774L381
$$ 744767 738368 732456 727403 723619 720758 718260 716100 714420 712984 711683 711104 711907 713966 716740 720121
49939G20121M062M326M037L906M448N260N826O217O606O869P216Q411J0735J3397
$$ 720121 724183 728509 732546 736452 740900 746160 751986 758203 764809 771678 778894 787305 798040 811437
49925H11437J5508J7066J8534K0106K2025K4972K9375L4717M0156M5667N2099
$$ 811437 826945 844011 862545 882651 904676 929648 959023 993740 1033896 1079563 1131662
49914A131662O0361P0866Q3400R7186J11413J25983J41291J56826J70443J79367
$$ 1131662 1192023 1262889 1346289 1443475 1554888 1680871 1822162 1978988 2149431 2328798
49904B328798J81742J76815J64376J45071J21340R7302P7166O3484N6634N5403
$$ 2328798 2510540 2687355 2851731 2996802 3118142 3215444 3292610 3356094 3412728 3468131
49894C468131N7675O0589O0450N3252L6037Q049k9200p2479j17165j57847j89877
$$ 3468131 3525806 3586395 3646845 3700097 3736134 3744183 3714983 3642504 3525339 3367492 3177615
49883C177615k10921k20855k20609k11797j97080j79566j61272j42786j24517
$$ 3177615 2966694 2745839 2525230 2313433 2116353 1936787 1775515 1632729 1508212
49874A508212j07473r2466p9446o8152n8715n1125m4768l9040l3882k9304k5016
$$ 1508212 1400739 1308273 1228827 1160675 1101960 1050835 1006067 967027 933145 903841 878825
49863H78825k1067j8090j6268j4791j3069j1728j1399j1197r705p139n117m375
$$ 878825 857758 839668 823400 808609 795540 783812 772413 761216 751511 744372 739255 734880
49851G34880l995l251k737l143l970m360m429m815n405n459m779l951l488l415
$$ 734880 730885 727634 724897 721754 717784 713424 708995 704180 698775 693316 688537 684586 681098 677683
49837F77683l642m082m366m131l659l653m202m637m564m408m513m455l812l029
$$ 677683 674041 669959 665593 661462 657803 654150 649948 645311 640747 636339 631826 627371 623559 620530
49823F20530k693k444j495r3N63j3q59q57j21L64M9o45q15K4J442K410K424K093
$$ 620530 617837 615393 613898 613805 614368 614355 613496 612639 612518 612882 612931 612286 611471 611495 612937 615347 617771 619864
49805F19864K158K294J696O57M47J429K456K630K529K965L596L647L229K887K491
$$ 619864 622022 624316 626012 626669 627116 628545 631001 633631 636160 639125 642721 646368 649597 652484 654975
49790F54975J654P14K49k5p69j781k283k260k421k863k871k116j152n76m55o97
$$ 654975 656629 657343 657592 657567 656798 655017 652734 650474 648053 645190 642319 640203 639051 638475 638020 637323
49774F37323j227j741j905j834j800j599r32j90n8m37o97q41j363j997j811q36
$$ 637323 636096 634355 632450 630616 628816 627217 626285 626095 626037 625600 624903 624062 622699 620702 618891 618055
49758F18055l19r44j803j848j386j384j968k532k826l094l356l274k713j984j525
$$ 618055 617736 616792 614989 613141 611755 610371 608403 605871 603045 599951 596595 593321 590608 588624 587099
49743E87099j563k019k538k727k492k115j892j843j717j258m53L70Q26R47J078
$$ 587099 585536 583517 580979 578252 575760 573645 571753 569910 568193 566935 566482 566852 567678 568625 569703
49728E69703J222R39J86l37j87O6k63q48r52p58j060j927k645k813k587j995j037
$$ 569703 570925 571864 572050 571713 571526 571592 571329 570481 569529 568771 567711 565784 563139 560326 557739 555744 554707
49711E54707l01m40r79q22P8O25L28q1P6O47J382K326L069K816J693R41J233J781
$$ 554707 554406 553966 552987 552165 552243 552868 553196 553115 553191 553838 555220 557546 560615 563431 565124 566065 567298 569079
49693E69079J689J220J037J100J099J239J816K563K974K887K340J476Q75J257
$$ 569079 570768 571988 573025 574125 575224 576463 578279 580842 583816 586703 589043 590519 591394 592651
49679E92651K430L350L523L542L857M004L695L603M245N017N171M999N144N403
$$ 592651 595081 598431 601954 605496 609353 613357 617052 620655 624900 629917 635088 640087 645231 650634
49665F50634N269M984N067N278N012M395M049M016L859L592L636M013M296M327
$$ 650634 655903 660887 665954 671232 676244 680639 684688 688704 692563 696155 699791 703804 708100 712427
49651G12427M318M338M302M457N262O690Q065Q688Q460P954P897Q447Q944Q669
$$ 712427 716745 721083 725385 729842 735104 741794 749859 758547 767007 774961 782858 791305 800249 808918
49637H08918P729O782N978M928L747L199L556M135M352M423M591M584M284M172
$$ 808918 816647 823429 829407 834335 838082 841281 844837 848972 853324 857747 862338 866922 871206 875378
49623H75378M470M674M458M266M414M525M494N105O783Q614R491R482R157Q391
$$ 875378 879848 884522 888980 893246 897660 902185 906679 911784 918567 927181 936672 946154 955311 963702
49609I63702O921N417M792M957N299N906P155Q510R032Q751Q556Q883R587J0767
$$ 963702 970623 976040 980832 985789 991088 996994 1004149 1012659 1021691 1030442 1038998 1047881 1057468 1068235
49595A068235J2551J4236J4833J4486J4307J4809J5544J6258J7327J8777J9953
$$ 1068235 1080786 1095022 1109855 1124341 1138648 1153457 1169001 1185259 1202586 1221363 1241316
49584A241316K0411K0432K0387K0266K0098K0194K0749K1572K2407K3087K3426
$$ 1241316 1261727 1282159 1302546 1322812 1342910 1363104 1383853 1405425 1427832 1450919 1474345
49573A474345K3335K3031K2811K2742K2860K3334K4044K4431K4264K4090K4337
$$ 1474345 1497680 1520711 1543522 1566264 1589124 1612458 1636502 1660933 1685197 1709287 1733624
49562A733624K4483K3889K2912K2315K2025K1487K0870K0776K1016K0798K0010
$$ 1733624 1758107 1781996 1804908 1827223 1849248 1870735 1891605 1912381 1933397 1954195 1974205
49551A974205J9195J8304J6685J4476J2758J2042J1583J0569R120P638O104M442
$$ 1974205 1993400 2011704 2028389 2042865 2055623 2067665 2079248 2089817 2098937 2106575 2112679 2117121
49539B117121K997K003J148Q0j021j657j568r01q9L35J70k08k93oM77J195K194
$$ 2117121 2120118 2122121 2123269 2123349 2122328 2120671 2119103 2118202 2118113 2118448 2118618 2118410 2118117 2118111 2118588 2119783 2121977
49522B121977L141L796M623O197Q135R458R948J0358J1269J2447J3417J3839J3361
$$ 2121977 2125118 2128914 2133537 2139734 2147869 2157327 2167275 2177633 2188902 2201349 2214766 2228605 2241966
49509B241966J1875J0038Q796Q211P450O012M209K324J96k141m253o058p985j0024
$$ 2241966 2253841 2263879 2272675 2280886 2288336 2294348 2298557 2300881 2301077 2298936 2294683 2288625 2280640 2270616
49495B270616j1407j1772j2000j3226j5496j7889j9649k0680k1209k1433k1492
$$ 2270616 2259209 2247437 2235437 2222211 2206715 2188826 2169177 2148497 2127288 2105855 2084363
$$ [...]
##END NTUPLES=NMR SPECTRUM
##END=
