
##TITLE=AC1261_BRARS10079_6528385_2QOHSo1Me2
##JCAMPDX= 6.0         $$ Bruker NMR JCAMP-DX V2.0
##DATA TYPE= NMR SPECTRUM
##DATA CLASS= NTUPLES
##ORIGIN= BRUKER
##OWNER= Administrator
$$ 1.72 TOPSPIN		Version 2.1
$$ 2012-07-15 13:36:21.828 -0500  Administrator@TOPSPIN
$$ Compression mode = diff/dup
##.OBSERVE FREQUENCY= 400.02188249412
##.OBSERVE NUCLEUS= ^1H
##.ACQUISITION MODE= SIMULTANEOUS (DQD)
##.ACQUISITION SCHEME= undefined
##.AVERAGES= 8
##.DIGITISER RES= 22
##SPECTROMETER/DATA SYSTEM= spect
##.PULSE SEQUENCE= zg30
##.SOLVENT NAME= COFFEE_meoh
##.SHIFT REFERENCE= INTERNAL, COFFEE_meoh, 1, 14.98509
##AUDIT TRAIL= $$ (NUMBER, WHEN, WHO, WHERE, PROCESS, VERSION, WHAT)
$$ ##TITLE= Audit trail, TOPSPIN		Version 2.1
$$ ##JCAMPDX= 5.01
$$ ##ORIGIN= Bruker BioSpin GmbH
$$ ##OWNER= Administrator
$$ $$ C:\Bruker\TOPSPIN/data/COFFEE/nmr/AC1261_BRARS10079_6528385_2QOHSo1Me2/10/pdata/1/auditp.txt
$$ ##AUDIT TRAIL=  $$ (NUMBER, WHEN, WHO, WHERE, PROCESS, VERSION, WHAT)
(   1,<2012-07-15 13:36:02.437 -0500>,<Administrator>,<TOPSPIN>,<go>,<TOPSPIN 2.1>,
      <created by zg
	started at 2012-07-15 13:34:53.046 -0500,
	POWCHK enabled, PULCHK disabled,
       configuration hash MD5:
       6B 1B 68 BB D9 2E 58 E2 7F 35 AD 54 07 DF 0E 41
       data hash MD5: 64K
       22 17 7E 89 37 A7 53 F6 30 CD 66 99 7B 2B 57 06>)
(   2,<2012-07-15 13:36:09.671 -0500>,<Administrator>,<TOPSPIN>,<proc1d>,<TOPSPIN 2.1>,
      <Start of raw data processing
       efp LB = 0 FT_mod = 6 PKNL = 1 PHC0 = 0 PHC1 = 0 SI = 32K 
       data hash MD5: 32K
       07 CB 28 59 14 C1 C6 CF 2E A5 80 C4 5D D5 0D 46>)
(   3,<2012-07-15 13:36:10.625 -0500>,<Administrator>,<TOPSPIN>,<proc1d>,<TOPSPIN 2.1>,
      <pk PHC0 = 177.962 PHC1 = 0 
       data hash MD5: 32K
       B6 AF B5 40 F1 40 1C 29 71 F7 3D 5C 28 E3 D8 03>)
(   4,<2012-07-15 13:36:11.078 -0500>,<Administrator>,<TOPSPIN>,<proc1d>,<TOPSPIN 2.1>,
      <abs ABSG = 1 
       data hash MD5: 32K
       BC E0 31 FD 0F 2D 3A 0E E0 1D CF 8D B7 31 3A 92>)
(   5,<2012-07-15 13:36:11.359 -0500>,<Administrator>,<TOPSPIN>,<proc1d>,<TOPSPIN 2.1>,
      <abs ABSG = 2 
       data hash MD5: 32K
       40 EB D5 AA 39 57 D1 3D 41 75 C9 D8 34 96 0D CC>)
(   6,<2012-07-15 13:36:11.546 -0500>,<Administrator>,<TOPSPIN>,<proc1d>,<TOPSPIN 2.1>,
      <abs ABSG = 3 
       data hash MD5: 32K
       47 DC 0C 29 F7 27 9D 71 D8 13 52 A8 17 A2 0D 86>)
(   7,<2012-07-15 13:36:11.828 -0500>,<Administrator>,<TOPSPIN>,<proc1d>,<TOPSPIN 2.1>,
      <abs ABSG = 4 
       data hash MD5: 32K
       53 DC E3 51 02 D3 39 8E 2C E8 91 49 29 BD C4 55>)
(   8,<2012-07-15 13:36:12.109 -0500>,<Administrator>,<TOPSPIN>,<proc1d>,<TOPSPIN 2.1>,
      <abs ABSG = 5 
       data hash MD5: 32K
       44 6A B2 A9 3A 33 C2 BC 77 01 14 4F F3 EB 03 E1>)
$$ ##END=
$$ 
$$ $$ hash MD5
$$ $$ C7 73 5E C4 82 47 71 94 A4 EB 4C B5 39 39 77 4C
##$RELAX= 
##$RELAX= 
##$RELAX= 
##$RELAX= 
##$RELAX= 
##$RELAX= 
##$RELAX= 
$$ Bruker specific parameters
$$ --------------------------
$$ [...]
##$TP= (0..7)
150 150 150 150 150 150 150 150
##$TP07= 0
##$TPNAME0= <>
##$TPNAME1= <>
##$TPNAME2= <>
##$TPNAME3= <>
##$TPNAME4= <>
##$TPNAME5= <>
##$TPNAME6= <>
##$TPNAME7= <>
##$TPOAL= (0..7)
0.5 0.5 0.5 0.5 0.5 0.5 0.5 0.5
##$TPOFFS= (0..7)
0 0 0 0 0 0 0 0
##$TUNHIN= 0
##$TUNHOUT= 0
##$TUNXOUT= 0
##$USERA1= <user>
##$USERA2= <user>
##$USERA3= <user>
##$USERA4= <user>
##$USERA5= <user>
##$V9= 5
##$VALIST= <valist>
##$VCLIST= <CCCCCCCCCCCCCCC>
##$VD= 0
##$VDLIST= <DDDDDDDDDDDDDDD>
##$VPLIST= <PPPPPPPPPPPPPPP>
##$VTLIST= <TTTTTTTTTTTTTTT>
##$WBST= 2048
##$WBSW= 25
##$XGAIN= (0..3)
0 0 0 0
##$XL= 0
##$YL= 0
##$YMAX_a= 510748
##$YMIN_a= -655323
##$ZGOPTNS= <>
##$ZL1= 120
##$ZL2= 120
##$ZL3= 120
##$ZL4= 120
##$ABSF1= 14.98509
##$ABSF2= -5.573092
##$ABSG= 5
##$ABSL= 3
##$ALPHA= 0
##$AQORDER= 0
##$ASSFAC= 0
##$ASSFACI= 0
##$ASSFACX= 0
##$ASSWID= 0
##$AUNMP= <proc_prof1d_extract_pilot.lims>
##$AXLEFT= 0
##$AXNAME= <>
##$AXNUC= <1H>
##$AXRIGHT= 0
##$AXTYPE= 0
##$AXUNIT= <>
##$AZFE= 0.1
##$AZFW= 0.1
##$BCFW= 0
##$BC_mod= 0
##$BYTORDP= 0
##$COROFFS= 0
##$CY= 15
##$DATMOD= 1
##$DC= 0
##$DFILT= <>
##$DTYPP= 0
##$F1P= 0
##$F2P= 0
##$FCOR= 0.5
##$FTSIZE= 32768
##$FT_mod= 6
##$GAMMA= 0
##$GB= 0
##$INTBC= 1
##$INTSCL= 1
##$ISEN= 128
##$LB= 0
##$LEV0= 0
##$LPBIN= 0
##$MAXI= 10000
##$MC2= 0
##$MEAN= 0
##$ME_mod= 0
##$MI= 0
##$NCOEF= 0
##$NC_proc= -8
##$NLEV= 6
##$NOISF1= 0
##$NOISF2= 0
##$NSP= 0
##$NTH_PI= 0
##$NZP= 0
##$OFFSET= 14.98509
##$PC= 1
##$PHC0= 177.962
##$PHC1= 0
##$PH_mod= 1
##$PKNL= yes
##$PPARMOD= 0
##$PPDIAG= 0
##$PPIPTYP= 0
##$PPMPNUM= 2147483647
##$PPRESOL= 1
##$PSCAL= 4
##$PSIGN= 0
##$PYNMP= <proc.py>
##$REVERSE= no
##$SF= 400.02
##$SI= 32768
##$SIGF1= 0
##$SIGF2= 0
##$SINO= 400
##$SIOLD= 32768
##$SPECTYP= <>
##$SREGLST= <1H.CDCl3>
##$SSB= 0
##$STSI= 32768
##$STSR= 0
##$SW_p= 8223.68421052631
##$SYMM= 0
##$S_DEV= 0
##$TDeff= 65536
##$TDoff= 0
##$TI= <>
##$TILT= no
##$TM1= 0
##$TM2= 0
##$TOPLEV= 0
##$USERP1= <user>
##$USERP2= <user>
##$USERP3= <user>
##$USERP4= <user>
##$USERP5= <user>
##$WDW= 1
##$XDIM= 32768
##$YMAX_p= 464675952
##$YMIN_p= -788525
##$CURPLOT= <Network HP LaserJet P1505>
##$CURPRIN= <$Network HP LaserJet P1505>
##$DFORMAT= <normdp>
##$LAYOUT= <+/1D_H.xwp>
##$LFORMAT= <normlp>
##$PFORMAT= <normpl>
##$SURQMSG= 1
$$ End of Bruker specific parameters
$$ ---------------------------------
##NTUPLES= NMR SPECTRUM
##VAR_NAME=  FREQUENCY,     SPECTRUM/REAL,   SPECTRUM/IMAG
##SYMBOL=    X,             R,               I
##VAR_TYPE=  INDEPENDENT,   DEPENDENT,       DEPENDENT
##VAR_FORM=  AFFN,          ASDF,            ASDF
##VAR_DIM=   32768,         32768,           32768
##UNITS=     HZ,            ARBITRARY UNITS, ARBITRARY UNITS
##FACTOR=    0.250966925370066, 1,           1
##FIRST=     8223.43324360094, -318433,      24741
##LAST=      0,             961,             -115630
##MIN=       0,             -788525,         0
##MAX=       8223.43324360094, 464675952,    0
$$ Real data points
##PAGE= N=1
##DATA TABLE= (X++(R..R)), XYDATA
$$ [...]
23832 -191202 63068 113740 -181160 -143320 478256 -35332 39495 303824 -162811 -129434 -346912
23821 -346912 279304 127743 -446969 -501857 -42913 208174 12041 -121419 -155553 -103117
23811 -103117 -80159 -183388 200321 -133387 95296 278904 44555 -11860 93193 60895 17656
23799 229505 -509347 18685 -206993 -84514 146626 20531 -70059 202602 155324 144792 -406658
23787 2592 -190000 -61876 41849 -7044 -29557 -269469 -181346 54194 -148481 11455 139378
23776 139378 -161767 -151755 -509 -72860 -155599 -287448 19355 157301 -178879 -38057 44450
23764 -84191 12233 -154833 26992 -207699 293844 -50492 -68211 24893 -84540 -192929 -279416
23753 -279416 265729 -90345 -121474 229273 142316 12019 -160350 -110494 52308 -174007 -139732
23742 -139732 -65884 -151254 197529 -316541 -57662 -9799 -16543 -284395 153259 64829 84037
23731 84037 121489 -230270 -90 -274660 24592 -322222 -208213 -6751 150578 -40075 71182
23719 -97436 -141999 -394514 -72247 9358 292938 -44600 -150215 -6257 -253795 -241248 422560
23707 66095 9172 79416 -52867 -496255 129033 30386 -17133 -49373 -33517 -86488 -39834
23695 120515 165081 267099 -285743 63510 28054 15350 128989 163181 -135523 -184924 97236
23683 131003 -199556 160872 181964 151471 9188 -314451 287907 -104626 -2440 -191704 -58318
23671 -32260 58685 258226 -126694 -85447 115788 193174 2450 248260 314206 41786 77939
23660 77939 -55994 -67668 -309484 242997 6211 -110011 162409 87727 -252401 115862 171677
23649 171677 -203230 -155319 212745 114691 -131084 -81577 230666 -42872 -200852 -89136
23638 5226 82402 -59230 -43951 17316 166872 488198 -504517 45082 -139002 -53415 -74478
23627 -74478 -31137 -167016 -75417 -139819 -682234 68571 -108664 8583 -467757 121921 -104461
23615 -345665 -267153 -38720 183767 -155691 -69941 82819 -109631 282806 -93948 108896
23604 23741 -266579 8555 -92626 -161001 -124120 134705 -80682 121402 -125537 248671 28972
23592 -98180 -78893 -100693 235534 -30114 248094 9656 -209826 60584 225037 386793 54358
23580 -259239 291411 40046 -837 151027 -80251 -607817 -16366 -66881 -99688 49884 72407
23569 72407 191839 130763 61356 -32567 -62096 147174 -48932 109954 -82759 330665 -57478
23557 197561 -129643 -47251 93886 70453 -178101 98553 74060 -178689 -45685 -199081 8697
23545 29741 -146135 -104720 29461 -162945 29055 283295 -77759 16100 -89434 12565 66137
23534 66137 -27568 77950 -17743 128774 149448 30028 32418 52394 -231565 93371 -48633
23522 136260 45735 -62242 -13458 60959 13757 -118583 -380744 -109183 -108706 -99645 -46564
23510 29831 75042 101843 -39481 -124169 -80473 -173609 -18324 291692 51484 -133329 -43137
23498 -164931 335884 192615 116521 161774 -20033 -65330 -72726 -111533 -130841 -42719 324807
23486 -283979 -314935 87513 3424 -199358 24027 -147132 -126524 -114568 -168764 69098 -43199
23474 -142602 5288 246557 126006 -157830 -66754 216364 -157458 -12569 175442 189899
23464 189899 9894 194824 -55506 106618 30021 170575 54468 24363 -127784 -131337 210590
23452 -262396 229915 -134477 -76139 -232393 -65012 -267308 -100410 129227 296788 -204660
23441 -148897 -162056 -214258 36006 20675 5097 -140278 -161105 -32908 -22841 -282715 -52054
23429 -211967 81327 19222 59244 86771 -231842 -95130 -294637 -231080 35183 326925 -265450
23417 134817 -32542 96386 53370 -147661 240210 -58395 -136079 303529 211792 -25418 123579
23405 -257506 70307 -160647 456 129326 260461 51164 224196 56222 -6477 -189865 26325
23393 -10466 -267823 217274 24730 -117707 92383 118100 -72800 19192 460478 -82112 -134432
23382 -134432 -343820 39199 -154786 99016 -196055 28848 -128748 132248 7388 -313656
23371 345500 182554 -73194 119256 -135253 -98070 -349209 82378 94844 -33447 283225
23360 26497 -215334 -155040 -250185 334293 292716 -12911 8112 -64445 -20857 878 -27890 -104879
23348 -104879 72854 76975 -185053 -133804 12208 -6549 -260326 -12739 -106792 -150193 -16643
23336 151029 -220461 -152873 43764 153994 -351234 46476 130107 -86734 -86166 -237326 -347982
23325 -347982 -129275 -234761 3417 -67074 60385 -90584 -211603 -39904 105662 -299235 219742
23313 183682 -480607 -63043 -74539 102708 154375 -114771 101010 -205971 188011 55070
23302 259031 66251 179494 76596 -67520 -10306 -261346 -42893 125275 -53236 137797 56304
23290 -126669 228361 -45913 -238767 -180558 145886 71373 150882 -373680 225249 -67097
23279 80021 78943 -426047 -64379 199511 287084 -127900 -212773 34195 -14235 106283 19904
23267 364505 -54533 93360 -38148 369057 -28409 -200655 -319047 91224 10074 -167813 -273463
23256 -273463 72875 -64893 -272713 -80945 12486 -22087 118332 -2609 -248307 316867 -22094
23244 -31105 -162377 -393134 -18979 67781 -72696 -281808 45351 91988 -430866 -123421 108409
23232 462909 91081 -89876 -70388 -66160 135953 -236968 144315 -172434 -80988 450234 -148550
23220 146189 -445334 -275461 -12411 275758 -33064 -6930 -416202 49905 148206 146358 375416
23209 375416 -8785 -97681 41836 -183761 -246975 124532 108831 -174970 -221252 20987 57764
23198 57764 7904 240092 -70992 -53269 -145863 -1260 -65690 83513 119640 -78513 -385127 -194558
23186 -194558 -230186 -62514 61995 83998 -41865 114680 -96318 -191172 -108053 -199774 -228304
23175 -228304 -18455 -379755 427858 64853 -187255 291612 -47364 -223555 -170851 -137293
23165 -137293 450733 -242523 42786 159507 -268363 -185125 75563 -173007 173485 66549
23154 83762 30801 196592 -93503 -81358 -67 -154018 -126381 -116464 34216 -135846 112682 -63653
23141 29182 -481529 -234192 -264316 -114393 82603 -17061 -167055 -377921 -206033 -167183
23131 -167183 19998 -107933 -248150 -320627 257464 -131546 89936 -27787 114672 61671
23121 61671 -46815 -140581 405949 -65583 -135502 124074 -108433 -2422 130345 279043 65057
23109 28432 -141759 -121093 -149882 105261 -291340 -109696 164566 195765 -125331 -179437
23099 -179437 -40656 47078 471535 83182 -117095 91887 -124821 66527 51878 -36529 53620
23087 134181 -327815 25332 344674 347497 90310 167287 281966 -391094 11608 19963 -29661
23075 -10359 150008 -75768 161322 75863 -2990 55572 -188006 150943 -82929 -190411 126529
23063 -179197 89146 -95410 317752 292583 -29582 4856 136457 -246652 -225039 40671 278920
23052 278920 -134144 -347848 137749 -367845 -194359 -222333 -51239 -473357 64390 -191704
23041 -92188 184852 84312 -420442 -34585 47411 310685 106110 13722 -93755 76550 -101691
23029 -48938 -311588 433813 -350332 6052 115560 -86955 75033 -324173 -333773 221511 21506
23017 -40717 202337 -10555 88166 180347 -130126 -190720 -136783 -133409 38725 -194639 -221609
23006 -221609 -73877 -22421 -94474 415425 184141 -181140 232449 -62376 -217477 -87023
22995 -16217 160633 -144685 183805 172894 21192 -100752 -17198 -269664 -126777 70120
22984 -311350 129096 -43692 -317626 -191405 -314011 -210979 81004 -50105 -250703 107132
22973 202226 25934 199122 -201355 -428695 -63 -195662 30460 -236461 -204753 -288564 94395
22961 -57446 -214193 118325 -60298 63208 -386573 -244507 88559 696 -252132 233835 55354
22949 -134883 77070 -187481 -168512 93676 144356 62855 -177264 -58058 -431955 -79026 -67974
22938 -67974 67011 -26209 -347901 129678 199377 90859 273549 275342 90481 -22393 50815
22926 291 -183926 -322363 284174 -163988 -401636 470422 22433 -247955 -270519 187720
22915 -207080 -71571 -387239 -171624 -50275 78871 -288452 226599 268426 237005 22294 342870
22904 342870 64389 -58072 -184112 -115395 10276 -52400 -426983 441439 -202838 17585 189428
22893 189428 428111 243020 -122769 -35981 213277 6299 313533 46586 -247258 363119
22882 -32514 296474 -78656 199614 -12847 64778 64291 107460 -126272 234678 158926 -72888
22870 -37979 68308 -28771 -83418 93727 41389 -58589 70668 94999 -236424 190714 -39245
22858 190410 -49110 -245470 75498 -138811 152448 13904 -340294 105615 -288157 -111238
22847 14058 -4489 -213199 311983 -56423 40037 -318097 -116649 -118667 -114729 -29790 -8551 93121
22834 187823 281193 -90953 -64356 -130522 -6480 -111700 -111059 -58407 362636 -23806 -41655 -83155
22822 -83155 -453975 254766 211313 -192349 101931 90092 183812 81015 148311 -265478 -128090
22810 -13556 58187 -456245 -77511 -264765 -11908 265965 -10187 85945 -223640 297612 175813
22799 175813 62703 -179522 -170989 107150 367382 -95486 253774 -9892 -241730 -318190 51904
22787 -87294 -76952 -403298 239873 -116681 -72474 -159095 -53597 284912 100792 -307567
22776 70062 82080 221379 77088 85710 -3066 48219 -102996 -271585 -347238 -12571 -15335 -306839
22764 -306839 -28423 -380270 -151021 -511478 -176960 -231308 42104 -225771 -9100 74908 -243304
22752 75534 72882 -71818 -176256 -11351 125903 229855 143873 475723 -159318 302035 106337
22740 176291 -88667 -156374 -202087 264480 -327524 166525 -49156 -68377 31904 9390 -42382
22728 -39666 -181948 231025 -295392 -115471 -89368 -92127 -185452 131754 -161997 139352
22717 94729 57277 -208442 -343455 244297 12182 -147891 21192 -253272 120250 110161
22707 110161 189217 -104137 46295 -43385 -191960 -162408 -53952 9459 -42096 -198048 -312765
22696 -312765 93802 -172444 77618 164473 -215375 -212455 10866 -153550 -169772 16271 140294
22685 140294 258098 71504 -202645 -175537 98997 -12201 324804 -153775 -40021 -142120
22675 -142120 185139 -188016 -192726 17830 -44708 -46155 -143771 -269766 316929 -233455 -114286
22663 -242708 -257558 173814 69418 11444 289078 -177767 -364038 -149350 -412833 132865
22652 7925 -37400 22979 -132806 -128346 -202598 224570 23629 291741 148622 529 -366814
22640 -92491 -136055 -49169 264495 104105 142494 -236085 155383 -182318 -470653 -227633
22629 25355 -103757 62146 178138 221951 7462 120766 -166211 -96748 -143200 -210849 -339428
22618 -339428 115658 -173746 -45194 300067 -191444 -245001 -96031 38613 17590 211531
22608 211531 81661 85206 -60014 46854 -61040 6124 187722 -94819 557 69387 -28535 -94613
22596 -94613 -8804 222138 -8185 -241401 60818 -52426 -144330 223161 -148413 134379 349188
22585 349188 -417108 -29402 -197158 -28038 -126002 -129801 202658 -204639 -1814 -52761 97712
22573 -195261 176336 55521 -20392 -117067 -240870 12822 66758 125891 342412 -81360 -668407
22562 -668407 114590 292796 -82247 -60920 -3261 -3617 49681 114304 -1021 -45165 -190106 -12967
22549 10215 64324 -215117 78153 33866 11035 -118758 52548 -186613 -8957 76192 -348246
22537 93822 33802 -371580 -124111 215448 53586 -64584 13416 -242114 -221855 -312890 -293011
22526 -293011 -125910 222751 126536 -146697 180334 232190 -4881 -271679 -222329 -68304 169499
22514 34699 422817 -44769 -80322 -4196 -47207 -175585 225704 -205514 -52929 -69380 -113821
22503 -113821 -138379 -289583 -104059 -57623 -34953 -35021 59472 9685 -19905 -358075 16950 123391
22491 123391 -237611 -172384 -403709 428716 50923 -74026 -305749 -53555 -113933 -183455 -16546
22479 70710 25939 -33485 202207 23169 16881 -194551 170788 -160334 22055 21287 14898 76015
22467 76015 9451 301290 -293905 138967 -303319 -7017 114428 -20228 -94871 35252 -90874
22455 -31617 -12721 -107064 -13795 -354651 -60437 175141 399532 128966 143577 270149 -106673
22443 -199753 -356654 -56430 -205038 -34482 -29716 -445002 32843 182274 250125 151810 28191
22431 217748 -53566 101202 43096 -199512 38079 -56985 -285474 150011 126558 -19029 -96736
22420 -96736 -221828 -190901 -180253 -140657 -299240 287694 28971 -249716 79922 -29385 -129954
22409 -129954 -258619 -264675 -190349 -21508 147963 7868 -223406 -55579 -121741 -96058 315812
22397 -266777 -50322 -192731 -137180 -230668 -15962 61829 188922 116015 -107309 215323 119909
22386 119909 -156075 197723 -149578 309996 122226 -116640 30183 53307 52801 -402775
22375 345573 77552 -122090 35076 88275 -192046 -66189 -159997 108293 73735 -69708 -39918
22364 -39918 -199862 -181001 -243336 85835 127907 346519 155601 -212872 -45893 123944 -137234
22352 196581 118215 367720 -213931 158879 -77104 48227 85702 196193 140298 129916 -8617
22340 269459 -414863 -297091 -66069 -64013 -92306 -441023 140607 51114 94089 -286971 -126993
22328 -79802 58361 -144388 -169053 -165012 -124680 40895 386064 94524 65204 148658 104941
22317 104941 -142999 -226748 -217651 -570642 45468 -98163 62797 106338 -251319 153790 254353
22306 254353 49546 270386 -127747 130831 -83185 -11373 -117420 -223435 19613 -391085
22295 6560 -36124 -208906 25263 -35881 -61928 400785 193830 -88583 55461 57989 33228
22284 33228 -32943 93260 96738 -183274 172237 105759 71996 493 -79615 -78179 -450127 -67948
22271 145520 -348850 -125478 3035 -60722 -4621 100419 -55603 -308119 407380 -135854 91845
22259 9114 63529 57079 -559 167458 -88802 -11970 176305 75518 81368 -10591 -87480 -159929
22247 -159929 240670 -45463 -322977 162286 352470 -38401 180333 -68767 256405 19674
22236 -349662 109460 -173448 -137063 -296203 -127511 -250452 -77700 -209911 168977 -64208
22225 -134908 -249170 -238002 9633 30408 -163983 161025 -176739 -157930 -71893 164669 -205771
22213 57921 -460680 196854 -135244 -38525 -186234 -47201 7099 -19291 164044 14945 -67080
22201 39183 85284 -168765 -31864 -165132 -446886 2402 -81394 -225436 -181601 -295676 114377
22189 267438 -2890 24822 -72731 34782 134530 -48865 118761 -267991 -98310 -121903 231098
22177 -399802 -43955 85299 -6909 81733 -401933 454517 -188200 -156343 144749 -328286 -51059
22165 158583 -77447 33746 26352 12067 22654 7550 -2061 -169993 -62073 53298 -45561 473142
22152 -296633 55349 -119864 -268987 29135 383595 76686 -29378 25673 26984 -23650 -87034
22141 -87034 -82534 199423 -95710 -12822 121885 -212882 -262738 330638 179652 -38133 218307
22129 -158923 47421 -70357 -376977 -77074 -277082 81679 130684 -37045 -304339 208040 61070
22117 -370778 -198266 256805 -74643 59835 392045 63224 -232666 -145461 -83185 182964
22106 54508 -401835 -13336 86486 -126105 -352568 -133681 162099 -291344 -142835 189106
22095 64063 106627 71436 -447086 -296942 115538 -270311 184560 71074 -377967 -201532
22085 -201532 -8172 -179403 35311 -518354 -83648 -111596 136262 -214321 -98620 -39561 -328493
22074 -328493 -63790 206309 168876 81804 210973 360825 -140697 154240 65791 -71184
22063 1106 -336498 25898 -49566 31170 -224885 -149448 10819 -480077 52080 -250238 -285403
22052 -285403 -10746 -157262 -385566 135519 -419052 -220712 -65730 -16869 271375 56037
22041 22189 173495 -90065 121997 61294 -203658 209064 206131 12538 -187536 -45991 76904
22029 -41578 -216468 48000 -37462 -26011 20863 -170925 -174120 -6802 -137990 15140 52139
22018 52139 -70834 -235859 60844 465672 20046 109940 -144124 -136758 -25399 88483 101035
22007 101035 -341020 587890 19704 -199669 -319513 -51384 -17515 170613 84367 -88603
21996 -85089 29003 -57490 160044 219055 142444 -21032 15204 -200245 28202 -6346 73272
21984 159429 130708 -38885 88709 118664 -120951 139781 -91363 146518 189534 76280 91580
21973 91580 123190 -19312 -108004 120096 116435 -23546 -25025 -356135 -238206 158441 18252
21961 -462988 16715 -3102 -55704 -297635 69681 -98995 122165 -51869 207224 75569 -18022
21949 68573 -395831 -303285 -119247 -96231 -409446 -176139 23673 1806 -169290 -166767 -56732
21937 79858 28036 -588520 -172764 -130043 -219090 56000 -109752 141843 -43312 -152774 99320
21925 -116001 -47081 -98412 85067 -82644 1508 -105506 -392215 320052 248447 -333405 -95229
21913 -160419 -219743 214849 -70539 9078 29162 -112492 138518 144029 103353 56840 190258
21902 190258 -190243 214745 22556 -268057 -125218 69002 189549 -11853 -29574 308308
21891 -102781 -213507 320044 -72042 81750 -245723 -46990 -143190 -436885 -486066 -244626
21881 -244626 19849 70290 17694 -96397 119141 -65395 -490945 29302 -331871 33558 104891
21870 104891 11791 -43612 342060 -139142 -123710 178876 -50876 -107474 36218 86528 -244498
21858 -334174 285031 -238417 -216979 306046 -270187 27724 -93753 -389087 211839 -273629
21847 -507607 113997 -37499 -399501 18079 -261802 94208 -63747 -70952 62895 -112629 -212091
21836 -212091 90599 -84375 43968 138913 -70888 -365354 -7626 -181579 -156414 -229101 186130
21824 262130 50182 2440 -46996 87072 151791 25607 -112535 -90213 -307180 114943 118452
21813 118452 245622 186058 -372456 10247 -120996 -296603 17709 -2363 -223331 243710
21802 -156224 -242061 -50187 -323988 -323628 65237 -17114 26707 -276659 -241282 -217592 136596
21790 -135125 71225 84759 -313852 23774 -211811 -180864 96758 -68523 -101657 -4944 241886
21778 -134427 -72707 -307084 -403706 182265 -47506 51203 -45891 30849 21341 107922 -183433
21766 41493 -150796 -99459 93254 54448 -221712 -200491 70436 238805 44119 357105 260691
21755 260691 4801 192250 -93903 71358 -88092 109880 -160844 -171217 135438 228766 -293883
21743 25537 -21772 112267 -256829 -119594 -124972 -107029 204682 15014 -40123 -198963 -259438
21732 -259438 -146443 -392506 28468 -74340 -9061 187841 -75317 247221 214845 282130 -173485
21720 210166 -50248 -90111 35108 -152046 -63387 -114903 -202757 -227957 -60505 -255189 -18111
21708 105465 231230 122422 67695 14104 20838 -1630 51061 -178152 548307 -212670 315931
21696 35740 -248125 295979 -190304 84370 19470 -191809 -84991 -261071 -361244 163120
21685 -67658 -214651 -218074 -216274 47825 246484 -417909 -107715 -163892 -437080 -179130 -99640
21674 -99640 56373 188193 -104443 149073 -325621 -110765 -255538 8827 322180 121107
21663 177323 75537 192538 -185424 -110935 -23879 -238835 -205175 -109379 -292794 -60398 26647
21651 -41864 342495 186448 58003 -199202 -416448 26464 20068 96395 -230595 -285231 -32001
21639 -150347 -47920 -221834 -290052 151389 -102624 -788525 -48168 -233204 -83345 -146097
21629 -146097 120868 2806 -30990 -120723 -491652 -283141 -157102 -113452 -266746 350696
21618 109561 185168 158351 -177548 -65782 -339380 -128558 -265697 -186358 -41602 25389 147404
21607 147404 3866 199468 -23533 198659 -186635 -193263 -24842 -184342 36713 -20465 -48200
21596 -48200 113443 -269254 38971 -66333 -39338 -97652 -58492 8485 130974 124229 -491463
21584 334140 -97108 216225 -294004 -19156 -94014 -319127 -14936 -281480 -243239 -26236 184591
21572 -119310 -110043 -1440 115868 5071 -386664 -193897 -114957 131737 -222644 -76452 -42939
21561 -42939 -82130 -143302 259724 -81648 -318696 -25879 223011 -95938 316644 -238869 -345996
21550 -345996 -188269 141824 -243629 -387162 -170313 47218 72849 154124 -124274 -46943
21539 -52428 -79838 -55479 119612 314231 -50070 120517 25228 216544 -120668 -28310 -98781
21528 -98781 115621 194591 6526 65771 -200804 -158171 21209 -103127 -264625 -385266 -165519
21516 -156391 322786 42889 -136048 242917 -104341 -174205 115120 -300565 -129777 -131423
21506 -131423 20494 -118272 122721 -215078 82125 36075 -374273 -126823 134725 -106998
21495 -89615 -68942 74508 -491111 -28165 -215315 73786 -311694 34051 7575 -108809 -60138
21484 -60138 -492427 151083 -90790 212047 21559 -178812 -201299 -48892 -49171 337312 -10293
21472 -114617 -379437 -307823 94696 270918 -33166 -36725 -239184 -358809 118508 -133778
21461 117861 45621 -157280 125896 228975 59965 173704 31270 -23072 4895 396889 -134440
21449 -222252 55987 192887 -10212 -100544 108449 -71045 -48639 90994 16480 123901 -57623
21437 -69959 148829 207972 258158 368040 247821 195525 -135622 210874 131526 112891 275117
21426 275117 242077 -292598 -120684 175678 -45147 -131608 -135885 94270 -92464 -91189 431031
21414 358890 -67143 204152 -65636 58883 -227865 -402921 -6559 -243676 -356425 14732 69542
21403 69542 -91388 -160417 -23869 -238979 125009 -79130 35664 -26267 79357 -81731 127855
21391 9303 -31103 342 -248723 353420 144082 40981 118388 -23842 -266545 1956 -110216
21379 21358 8567 137313 -189796 151233 -201198 -185903 -103584 -210892 -143873 -474151 66624
21367 -188954 149381 21794 -141040 -266334 93454 -201205 -244444 -236216 46055 -87483 -13176
21355 -417445 -382984 19667 127738 -260646 -145408 274286 106057 -298895 -389330 -229960
21345 -229960 128364 -350010 -5773 194753 12117 73713 -192422 212089 75191 247656
21335 247656 162655 -86705 171618 -98553 53764 -2995 -227498 -133398 -218837 967 44452 -172017
21322 -173626 -15035 3433 -279767 -34427 140864 -92027 -8522 -260121 -140601 187638 122746
21311 122746 19016 -369092 -264382 -258234 -149587 -55479 -89891 -55306 -116168 15732 139201
21300 139201 78743 154275 -62734 21639 -248822 -4151 53308 163470 -135301 -139295 48829
21288 -75656 -249646 95850 -142559 54423 -17628 -328963 -62222 -452638 -76951 113360 -102350
21276 61213 -102256 -249052 -76888 -276830 -58347 -81577 -177311 97779 -250571 -208809 -49620
21264 220172 -104412 -1542 253035 -31990 93090 259430 -71107 -171323 88529 -49570 248814
21252 -81781 -4063 -111615 106359 134984 78618 -69122 26824 26269 9444 -133683 -468651 -242067
21240 -242067 -40848 -99520 239705 239051 85684 -240192 -347825 -51600 139754 -40245 298233
21228 46398 -1584 -148410 46678 39550 20519 -19008 -167758 -88186 -212761 -315739 -121024
21216 -88158 -101456 142611 39083 54100 -37863 -75967 -137978 57166 -339420 -76608 -167866
21205 -167866 144837 -103375 73167 -115124 -230114 164976 -137626 -289093 182887 72049
21194 -148992 -104537 -159018 -201095 -108018 103886 -85833 -418608 320321 -70474 19953 263766
21183 263766 69927 -20502 -85747 -86340 108326 173209 45965 164836 -209883 218626 176839
21172 176839 146199 44513 148642 24250 24787 119407 -201017 -105764 -346979 -240402 -149653
21161 -149653 -28949 -384962 -313638 -8074 -154439 -144334 -417957 184023 -27475 74389 -173211
21149 167302 -99173 -35925 245729 -223307 21909 160877 102047 -75414 189960 134516 -352426
21137 110398 -155266 -222375 -214818 -24253 131132 1645 37454 96424 -19235 -281136 -356166
21126 -356166 -80606 -118930 -84335 30908 235686 -59381 14136 -251449 32291 -56920 -337262
21115 -337262 50030 -278734 95754 -267233 137260 -77346 -10811 -39806 141245 450345
21105 450345 -170739 -131012 99932 -274242 288690 119609 -27527 -317580 -30313 1602 141905
21094 141905 29079 58077 -116498 -21028 160756 -356515 162566 -223733 9474 -101487
21083 236974 198705 189687 -292461 149587 43052 -99616 165460 -34489 -209605 70063 -196139
21071 -202183 160402 -11944 -271657 -327078 8365 -56663 43401 255201 -142095 -381072 -56941
21059 165056 -3840 118373 60493 -120795 -110866 -89238 -122200 168679 39968 184982 -180233
21047 -92016 137618 117992 -157700 -141564 -117836 -33747 -125914 191655 -326710 15002 -184754
21035 39565 -85349 -22234 -173681 -313219 -348418 -15285 -207048 -206657 132042 -105430 -105419 270824
21022 44713 -154310 -22153 117920 -533695 -374182 -86878 -231073 -377267 132025 -165668
21011 -275292 -205257 269853 372 -209184 37476 26801 -231054 -265330 -70031 -236889 39990
20999 -248035 160158 -112258 -92748 236435 -186688 276426 117313 -259240 -102678 178241
20988 146648 -20000 -114145 -597871 169454 53944 -75685 -296295 -130702 -332977 -403069
20978 -403069 62279 -166145 235073 -279612 140165 -75292 -263125 132836 19650 41869
20968 41869 125631 42642 -158105 147368 -48 145590 -188497 -55881 -216590 -185722 156186
20956 -99137 116869 52929 220177 -228646 -86539 196021 -398268 -125434 -132278 -159761 143527
20944 74985 83378 -228560 -209750 -145437 -182716 -235077 -79463 -154062 370099 -54596 -222352
20933 -222352 143072 184286 -358908 31323 -202845 274252 -217696 104406 -193779 -6143
20922 -28770 -147618 62894 128687 39975 -71350 -203563 -219784 93405 -60380 -23991 269734
20910 98685 -112201 61023 -161625 5108 -59027 106699 154012 152084 -35397 -76389 169922
20898 -97222 387551 -218308 -153207 -52253 240262 8039 -434420 83288 31943 43515 -141958
20886 -197930 10090 -252840 -120090 178698 -159038 -52189 -24792 -416361 -317051 12422
20875 218891 94511 88297 137958 -260602 -193425 -111560 -411757 42878 -78 34331 -127883 162036
20862 -223397 -252686 178154 274378 293684 -205475 31171 -108916 175536 75694 -39915 54057
20850 184047 -538563 -87892 -135136 -77359 -315164 21878 -520991 33801 -646937 -138759
20839 -353472 -60786 360312 -316512 -170055 -129917 -118084 -148603 -233420 -65303 -61007 -222369
20828 -222369 43245 -203456 -146992 181854 -54936 -285732 -134077 -2632 -261140 52332 -148217
20816 -54543 -24626 -17337 -507693 90797 -286785 -419858 -34763 208287 -241497 -251588 -211140
20805 -211140 257310 -14102 254331 167446 -58076 88722 -98124 59640 -100704 -38436 126758
20793 66192 10055 358330 200 -26758 83185 56918 -234286 -208772 33428 -254496 -114135
20781 58779 275802 -213097 -128087 -200786 -2712 -104500 77808 -77771 -282052 25393 56513
20770 56513 187657 257008 186412 -78005 126322 -129542 -130585 14272 143965 -166961 80497
20758 -165209 58879 23942 -590488 -392723 -11699 -70628 -291023 123463 129919 38150 -182776
20746 52353 -122764 -125351 -5890 -36690 -116914 -218783 -169632 -67854 131479 -154762 -29540
20734 -174818 -13883 -212597 179000 -72725 -339043 -135584 -3700 -211040 -186993 -192704 128706
20722 81677 -43932 -222341 -45186 80530 -58442 192055 -608043 -16245 -171221 68685 116761
20711 116761 -233828 -17683 -116553 -232572 53643 185434 -41524 -372870 -264439 314695
20700 -236358 -157908 169643 508283 -96505 -6579 -57313 155760 -85046 70791 107015 -29747
20688 -8280 125364 64282 69438 -138796 -466716 233533 -60510 -17164 -117286 -377447 150838
20676 -282632 222611 75464 -104708 53285 -91540 -345487 -93701 80186 -259972 -107841
20665 107728 -73119 62523 -138000 -289616 90019 -146940 -173031 -30867 22161 51636 83516
20654 83516 -171822 -11833 94618 75104 -387682 176303 160206 15435 -19100 -117276 -323492
20643 -323492 -237560 -6409 -132117 -238793 -57156 221866 123529 -128080 -251254 -35238 -65218
20632 -65218 -184138 -145047 274439 120011 -100218 211120 -126207 -329471 -294151 28354
20621 -152349 -15414 -134799 -20942 22542 -27295 -149363 15018 -334971 30411 165672 -65049
20609 -165239 69584 -15413 2092 140103 9060 -321912 160431 68997 125370 -314649 214296
20597 -17010 -12004 -155433 -33307 -49302 26598 172035 -196829 209415 -207108 32413 18396
20586 18396 -85747 40803 -414946 -143380 -28102 -162346 -107429 -259299 -141780 -2066 66236
20574 -71138 302836 -145499 172219 421 416263 -1106 -26426 -133944 291463 -59541 -202637
20563 -202637 62561 81742 12814 -55108 59979 -121074 19178 -140805 -90427 -57536 -101869
20552 -101869 65030 -11476 -205047 -129699 -136074 -150573 128357 -86404 -25304 -51911 -290390
20541 -290390 92996 -93557 -148115 -16479 -4740 -37877 -328980 89875 -202337 -82424 -84164
20530 -84164 92875 50789 -309975 210348 -88349 -79658 -46687 -225877 -140047 -175450 218069
20518 -74012 -73080 -25425 9621 108835 -169120 -378217 -132520 -110797 -110101 -84625 -55408 150112
20505 -259892 173219 141143 -184834 34545 175848 -164035 -431510 163147 -298553 -301955
20495 -301955 40657 -381813 -16923 -321752 -5503 -56682 -87100 -116493 -31878 75973 -190540
20483 216421 -251306 248156 135424 -314416 104623 260465 -204130 -226302 123460 -254329
20472 -49233 124418 96174 -17517 -393048 -187305 394951 182801 -417756 -177994 183258
20461 -67788 207427 -18611 30286 -30755 -11277 253689 433983 308470 173838 -195818
20450 128591 -222301 -245246 -149436 80967 -378999 -180075 -5099 -278741 -359939 -148792 -345931
20439 -345931 -203135 -196006 -93592 91087 37951 -257441 69602 -88935 -168715 107153 -112354
20427 25041 293976 -331335 107094 -394906 -113622 56929 123249 248861 -409664 -163522
20416 -82745 89627 105860 9987 -84073 -81023 -175969 -23527 125500 -306868 -350252 -21638 98380
20403 -412872 43266 -117444 -159137 33135 -212159 21314 10398 -146159 -386427 86574 -4374
20391 9505 -381944 -248433 -92132 205637 -167913 -275355 210356 -178477 69752 -22706
20380 -145175 219059 188294 257980 -225352 103819 9686 -17188 84135 -87649 -5427 116797
20368 368268 32470 4177 -88736 30632 -126271 -481762 -147039 180669 34121 -104989 -198329
20357 -198329 -40311 -53494 74221 92153 -95073 -237074 -132138 -303398 107560 -260662
20346 77530 -67016 275185 -43283 4503 -61160 -39711 126148 -132063 11500 -83270 -248019
20335 -248019 -292959 -124771 26072 -207280 44987 78965 39954 39623 992 199356 -36456 -93818
20323 -93818 143172 -107385 12475 58130 -154611 304749 -268165 -137282 -49145 63817
20312 -95489 -188075 40026 20194 -66214 266506 -123820 -111747 -203639 -5880 -228944 -94667
20300 33835 -258308 -188142 71626 69041 28870 181638 -22632 21862 -5149 -23077 -325231
20289 -325231 -290470 -186427 -10243 58666 -310082 -55979 -14833 132311 -230931 19905 -45236
20277 -156141 -112327 -244349 171220 -215211 164247 30306 -271947 56988 -100425 258298
20266 -155319 18226 -162151 -81522 -361922 -65518 -47910 -329912 -170317 -176965 24642 -408687
20254 -33564 -457341 10810 -107351 -170910 -123860 -23545 -116067 -277504 -175003 -251227 -113043
20242 -29802 -319451 24344 -109085 4359 -202739 -112474 -25746 104421 -405176 -525123 -341130
20231 -341130 78882 156321 -167064 129371 25677 216829 -94258 -92018 71658 -10143 -287788
20220 -287788 -107144 262206 59051 -236182 385996 172467 131474 -53456 -107869 150579
20209 -99294 -208731 -223831 22268 147759 -332088 63662 6392 206587 -6244 -104960 45537
20197 -101520 -496503 -132935 -117955 -397908 -185767 372533 -83093 -102195 -305431 38451
20186 201025 -76234 -137642 192043 -436573 14818 -78658 -32306 130906 -23091 -111229 -37980
20174 48410 189978 12760 -219970 -104700 123062 -185142 -249628 -179971 -461163 -313875
20164 -313875 -86686 -42339 127057 -39053 -189591 -24606 -149891 45070 -42344 -314417 346805
20152 -22062 108097 42221 7682 -89851 33167 101983 -16771 62458 -336073 -139642 29692
20140 91839 -28012 330603 -131829 67654 -192656 126845 213789 -77246 -1839 43745 306432
20129 306432 35244 -274866 -177348 -154056 -214824 -172993 -49193 -1161 -57691 -359929 103910
20117 1716 -288731 21727 -281595 -165169 71931 -63357 10897 -66516 -370003 345924 -283953
20105 -144921 -91962 58299 -131105 -43523 -346660 -59281 255474 102933 5228 76894 -88408
20093 -198740 -394997 65078 -304139 56125 300240 -121573 -341803 223079 -116503 -49704
20082 -201310 90551 -144069 217444 -10353 -437290 -203379 184069 -155941 -220651 -268954
20072 -268954 -96307 -78652 -379157 283400 211451 181517 -437253 52109 33996 200744 -24579
20060 -82677 -205857 -129494 -95796 75455 -206599 -84678 -54664 89919 73098 200636 -260909
20048 23120 -54300 64037 -189468 53127 5431 21198 -67849 -71786 60782 -55780 -241464 25745
20035 53501 163226 -227165 -107248 -2853 124480 139678 124761 210202 -254828 42828 411985
20024 411985 198421 295876 -132281 -40917 79356 176337 -84622 20730 -256897 63151 -207766
20012 175797 -206481 3471 -303668 -114535 148645 -6096 142204 -22381 335776 -24292 -242028
20001 -242028 -29618 102394 -28240 -349880 -10942 93183 19675 -90076 4930 -215073 -205986
19990 -205986 -403219 -187952 -72333 246121 -75236 165636 161538 -110221 38664 -59700 -12876
19978 -96325 162543 -107825 -20990 210713 45471 -103005 -30876 -265864 -301025 11069 -232870
19966 99625 -204029 108965 -367012 -194119 -27231 -91560 -160481 -290435 255967 -382556
19955 -255737 50767 366623 94882 -97355 -122936 177882 21378 -185359 260741 31262 -129568
19943 98933 -208382 349072 20221 -230061 -32292 -81325 310608 204921 49805 -53731 194846
19931 -86885 -411048 221351 -128458 52721 568 -38405 34735 266579 -221978 85058 -132798
19919 -126822 -326874 57973 -94969 24378 -295814 -123753 150865 -175727 77993 -245108
19908 271884 -127932 136580 216006 45630 -89864 -220297 141655 -333230 -44026 -173675
19898 -173675 -279701 137962 132471 9907 -73361 -73980 143657 31416 -16891 104877 366701
19887 366701 -24860 -77375 -198139 -424805 -10543 40133 156388 52776 94501 118924 -253067
19875 -180857 -30491 -422436 -230854 -289455 -4120 -50965 -2337 -130642 -114169 51082 -222594
19863 3273 -90275 -117577 -268413 -33556 -7142 -114099 -111058 188529 24026 -177890 -176399 130977
19850 -132518 -200686 -101833 -29318 220721 -141056 46895 -67821 -52754 -99436 -48338 164498
19838 -380197 87499 -86417 -84214 -42496 -32986 -69576 135173 -274839 -76912 -37106 -236829
19827 -236829 180215 -29947 -132505 147508 19654 141147 56640 -31643 222986 46108
19816 -229994 -330605 -95414 15301 -87095 -116474 -255130 155924 -296992 -261616 121819
19805 -410805 -394078 -187006 12824 -10553 71766 -203646 -78105 -294625 30229 251126 -921
19793 166425 -75333 -237344 -119238 95246 -18843 1402 -262584 119675 4633 -191784 -109069
19782 -109069 187135 162344 -395209 91760 -168282 -87939 41911 -116694 105854 -136917
19771 -113918 77893 -374533 -212543 -202342 68192 11658 -74632 67544 -127570 -133523 -230578
19760 -230578 -54652 -95974 360731 -167746 89828 73682 -15285 -156774 61315 179992 -66500
19748 208537 244768 17149 -224382 -80773 104402 -246667 90971 -303967 123479 95762
19738 95762 -56142 11119 189429 89585 -97305 -61785 -148399 204863 -337274 -167257 88166
19726 1660 -332577 39061 -328741 183471 123611 -268920 136758 -47905 -21207 -93717 -206113
19715 -206113 -178871 -221856 63168 -154091 81544 -25581 -236567 -191062 -6194 -152954 186447
19703 -138064 13599 142721 -115096 76811 139337 138669 -172754 61844 114543 189015 -107918
19691 96959 -36137 148149 386529 -157881 -43335 155496 44784 -21841 54778 -51333 193674
19679 -84804 -97991 -182372 -85575 -141978 -321054 -4443 193157 -179570 -257595 -67451 -134079
19668 -134079 -235755 -220470 -162500 167899 32276 -82040 -42041 -70460 -174755 -33474 -277818
19657 -277818 -257421 55714 184543 119506 -25934 -273069 179275 204835 109525 -203297 -87256
19645 -234665 9271 -410452 -76905 -155787 -350177 -93854 -326226 -447379 -3994 -204410 -106642
19634 -106642 39927 100790 234320 -364655 -34748 -118632 9287 -152206 -145102 -142920 -107370
19623 -107370 51414 128006 -31380 61978 -163177 -121816 -220813 -44832 -349562 84767 -364509
19611 4339 240398 -137493 -248847 -308926 123438 350348 68568 110633 80962 224047 75195
19599 -102980 -110667 152124 27170 -3379 -171187 -186980 -60981 183413 -185517 9336 219707
19588 219707 82273 -126984 -97588 306041 222267 276125 -101114 120995 -139320 15465
19577 38354 -260136 -165994 -206461 10963 -158025 -25117 -47303 -224295 17984 -47709 -340217
19566 -340217 16312 -349257 146900 -1506 149467 91158 152796 47186 48754 -15157 168181
19554 -354299 78315 93741 -449888 139878 97277 -60752 223823 -414835 -135691 181257
19543 -325 -284159 -175255 -133570 125376 -188950 -131848 -277725 -243549 -148792 54494 -212179
19531 24416 -470077 -153951 -519561 -90583 -216051 -73567 -135159 -284779 146737 -48895
19520 -73005 14004 -26256 -194204 271608 39380 37646 154048 -215788 6198 -142849 199990
19508 -32246 154341 -192993 74043 -238949 -113904 -3896 -180656 -241632 -31335 -125445 13575
19496 73495 -291420 -270712 -68280 321101 -13202 -110220 146670 -182920 1137 -236266 -147669
19485 -147669 -121942 -4463 13479 -330362 249199 3931 92318 -56397 142320 -253034 -199292
19474 -199292 395477 -28211 -144818 -200317 27422 -83013 -42804 -139348 -94673 -550939 -191940
19462 -392514 176938 -81040 -227906 -199225 -93583 -65482 -362301 -77066 -452308 272345
19451 -269154 250576 81038 -178659 11005 320700 13925 -263830 -268326 -44530 -324992 279797
19439 -19543 114228 -171277 79855 308595 -306101 339526 48989 -207177 -83111 -97887
19429 -97887 10035 -47478 94057 -216797 84299 -22979 -45990 -390965 -171094 -7095 60957
19417 -28893 -32079 184462 -270777 51321 -76168 -56638 98404 -159451 67226 -168683 -14923
19405 -402989 24788 81010 -78736 19108 -156380 111217 80130 183658 63219 -331161 -104982
19393 -78992 391281 -107003 -93974 64559 -76633 -201641 142257 28765 -176679 230543
19382 -18841 -325690 -131961 -204276 -246482 -65580 31056 42267 -123356 91050 -342100 -74879
19370 -42838 -43490 -222741 39694 103606 11147 310121 117069 42942 12587 -116441 155977
19358 -29858 16957 -145951 72500 -84615 156365 -3154 -139349 57148 289425 122245 -65567
19346 324803 -160895 -119351 91523 -143249 -117796 -140947 -42660 -310978 -323406 -140607 -36143
19334 -225933 -238535 -264964 -31604 -272593 -234347 52305 -91023 -221620 41952 70741 -698913
19322 -72160 -179012 110484 -54805 -281405 -200894 37884 -183621 -60911 -94804 76399 123312
19311 123312 -210542 -19397 -61848 110147 67522 -247670 -182665 68470 -12188 102734 14862
19299 -24343 -16954 -343323 -167336 37275 214081 -21117 -413765 -212941 2122 -164889 181452
19287 -159797 89762 -403678 72030 -20683 -42807 -121413 49878 -27758 3548 108759 -43773
19275 -188270 89529 118777 -129934 -144587 48815 39681 -165615 -177731 -153277 124046 -120840
19263 -133114 -89649 31610 -114572 -320658 52267 -189181 229141 -38856 63717 -159273
19252 -228676 -124257 170886 14393 -4703 17476 -40710 -153936 18934 59089 -281630 -247054
19241 -247054 -80078 -233846 -187148 8973 -38523 -61354 128799 -176453 122157 222006 -166414
19229 160748 -135187 -131806 -255475 -45405 -33344 17365 -177026 133586 -380924 -58129 184900
19217 -1686 -72344 -221908 176966 -134301 84783 -185972 -60026 30088 -94784 15871 87109
19206 87109 -131566 -51777 282287 -25216 -172605 -221950 48630 61781 232227 -75864 -1401
19194 -4791 -182303 -39580 -3752 267181 204950 -145874 -167548 39080 132154 -2523 94061 -243939
19181 122888 8294 6425 107469 73448 -230109 -78120 48585 142403 -559252 44158 -451293
19169 -175666 -326789 206329 -366269 -130620 -646703 -11326 -90876 -138571 31681 -19496
19158 2168 -355723 65713 63544 296868 -79223 -147279 -282002 -260094 -85140 61901 -75586
19146 -75988 -96641 100551 -60035 -247455 44831 -3310 -288786 -237424 -106228 -238160 -319556
19135 -319556 -55095 448384 4498 173708 -115968 125355 -77068 180618 155484 -187930
19124 -211223 43805 -10943 -103077 127941 -33136 62760 -188336 -371171 -163514 -91211 47848
19112 -140709 126256 -169089 -438713 -121289 179316 5471 195435 -122779 -332206 -335289
19102 -335289 -438839 -124383 73296 108388 273536 -187115 -152591 27826 363245 -323055
19091 -1265 -279488 -449609 -384917 -14052 206492 -81988 -310967 211611 -268046 8000 -15816
19079 4138 -300667 -280622 -12144 8356 -89268 -236638 -132740 -256667 185230 8622 137519
19068 137519 -150906 -473220 70176 -438728 -62187 29955 -168705 44167 104299 -51775 89980
19056 -56674 154227 -21144 266158 -185381 -288362 -414246 -73006 416625 -62416 349821
19045 -201424 -86895 -175331 -193433 278486 195670 -204266 161939 -54996 -54486 -36429 41639
19033 78203 -57409 -3501 31018 -42511 -225445 179736 -50601 13732 -38160 -92155 -140758
19022 -140758 -112674 -259976 -50309 -53149 157738 59480 -92612 -102740 -115914 334092 159312
19010 29740 -58038 -217511 -76544 140163 -399269 -255918 143443 -331191 183706 80101
18999 304084 57605 84803 -185516 -102609 109322 1455 17210 164181 -54674 60747 7934
18987 167264 -96477 25425 70611 415290 -158418 -56546 -88297 -302707 482914 209409
18976 -155973 75587 177876 119786 202635 -113118 55895 158995 -280837 -226938 -126594
18966 -126594 223633 -165719 -74833 15206 -115643 -12825 47683 -43322 366979 -158354
18955 -286653 -222519 -286966 164530 -11344 -296970 71999 -202595 -160537 -218132 -121683 -34845
18943 -21807 -341261 -115759 233597 -139244 -20761 -176128 -178540 -88165 -20968 -184834 -61130
18931 -143135 157629 -86516 -84988 -110666 -9867 -139628 -374695 7545 -33855 -247286 -37913
18919 -30527 312274 61266 -209660 -568914 -50335 -178587 -87887 308682 -173029 107477
18908 -142793 -114835 55659 178149 22141 50903 -42940 -51222 -159134 -73279 -295416 -177176
18897 -177176 -9411 95643 -157967 -98334 -256740 -369820 44029 197803 -64607 50097 -226101
18885 -172157 -134148 -235873 276605 70983 -296696 -240493 -225850 173991 183704 76999 -149319
18873 16039 266811 110988 -99146 86723 -191957 -239754 -25426 206431 291584 74528 -174064
18861 -262254 -305047 24913 -312474 71575 -18904 -413255 -222065 65238 -53505 -167527 -171031
18850 -171031 -13523 14124 -353851 17257 -28652 -77779 -205781 138868 -109368 -166774 138084
18838 -108731 -76846 -54949 -302207 -150697 335850 -80327 -49226 94515 -123615 67921 -173925
18826 97543 211497 9211 44346 344794 -271621 -204407 -10040 151616 -49739 -25998 38176
18814 -59780 278085 1857 -40696 -54904 394346 382155 14549 89345 -83591 -967 -183773 -31929
18801 3058 -176150 -64242 8237 37873 -38892 -63513 -108859 149638 476522 -137454 90983
18789 202585 -19733 -134962 -253112 91216 -237928 -266344 -117614 -62384 314099 -683076
18778 127204 -247881 -115570 -159417 156537 -37707 -330620 205393 -169206 47589 116755
18768 116755 -237936 -54850 -122106 -212460 -243160 189453 30033 -177005 14902 -352660 -33804
18756 18614 -26165 22221 126012 -80425 -282129 -149669 86457 -55737 -320318 -91929 -132615
18745 -132615 -165340 428100 -103943 -208241 -224144 -100232 -53589 -41009 198664 -219937
18734 -61202 -294644 3620 -172939 100238 -201338 171720 -159017 -47680 -153241 11813
18723 208968 -182028 389797 216609 7907 -170607 -115501 126016 -39768 131711 141004 47505
18711 -44799 -138670 -162051 -253477 90766 242747 -37630 29167 33808 -342346 -339053 25189 -48841
18698 -522449 -306422 62708 -234780 15914 -141355 -124766 54627 -219738 -113795 -405126
18688 -405126 -333629 57400 213951 -371094 86139 24687 -60804 -192369 -92293 -53365 -16058
18676 -39614 -163205 -101200 106475 -207653 -389814 -117975 104123 250921 -73324 -67599
18666 -67599 -384095 96976 -30375 -21467 -15574 -130696 -18849 58996 -298247 99041 66572
18655 66572 73377 340885 23487 -53039 -115846 -176164 83689 -146906 -115970 -171517 -236306
18644 -236306 12827 -52729 23296 -9938 -185031 -39444 37905 -305865 -16795 -82802 -107327
18633 -107327 -77628 2797 -243200 -349359 -46257 -293938 -237409 64268 -90631 -185692 34016
18621 178497 174922 -421816 -327131 71211 -340715 -44085 -170335 -139485 53087 100532 201116
18610 201116 -383628 -46923 117537 -113619 29437 -51756 -125966 -24174 68117 94772 16691
18598 348835 -56279 216885 -487104 -143707 -150972 94462 -206044 -89421 -241279 45423 127619
18587 127619 -85054 41522 -40601 -156086 -120947 39082 -74179 96884 64522 152623 119206
18576 119206 107089 64168 -4535 -2718 277148 -157262 -143378 15002 134657 -162416 100683
18564 -246741 -101563 28967 73127 -17087 -8537 -80519 -45724 -36010 -28758 -20669 170752 150026
18552 150026 -90436 197637 79444 57485 -146384 167180 74519 -27504 -244928 -279484 -109438
18540 264144 -10212 -236274 -395175 58417 -89864 -154997 55682 -239357 49509 -259685 196562
18528 -13066 -51867 -135515 -11317 242248 -423685 -185820 -42144 -96301 23738 -135274 -104049
18517 -104049 163114 51962 25575 243179 36055 147355 -47084 75931 115949 -358080 -282511
18506 -282511 144369 259827 -327315 17947 -217861 -213608 93738 92423 -183622 -322893 45703
18494 34443 135406 -168358 216743 112003 -196376 -106249 131745 -155678 181761 -441139
18483 188786 256802 301149 221566 -168941 -235158 -145761 51425 -181962 -127754 -394942 -153424
18471 3431 -82635 251612 -113502 -210255 -202205 -23514 -43531 56044 -49189 -471568 -143690
18459 -25312 -246212 -56227 119945 207264 332369 -106562 91519 123899 -199877 299957
18448 5653 274237 152654 -338329 -280044 -84133 -179239 -266841 19653 -102295 68564 -150943
18436 -322388 -24798 7597 -87382 134458 -55721 170393 -29534 -206664 11560 -197111 146159
18424 59018 -168050 -200452 -168009 -121214 10583 -155050 -135489 -56371 10397 105302 -276491
18412 -150352 390321 -59854 125896 -442319 -118421 -236616 134381 29219 276 55643 -214221
18400 69119 4165 -33554 -273518 -29092 -132441 -32391 190016 -102759 34565 -46105 -40085
18389 -40085 -152535 -184290 325167 -347316 -43034 -190445 204272 -269807 -26760 252734
18378 49557 104453 -165503 -139419 -310059 -90759 -13451 24077 39125 -104395 -57621 -39700
18367 -39700 128089 152000 -212552 17017 -268813 -1647 26748 60223 -150769 -234067 -58183
18355 199051 38227 -106898 -67704 -266688 89426 68573 -292722 108377 14659 84121 -194654
18343 8601 -369356 -195602 34283 11345 -252611 -173846 -161154 209111 92052 -13148 -182864
18332 -182864 -191886 -83232 -154537 -178913 -300130 8288 241285 33740 -57257 53240 34962
18321 34962 59878 15331 -8275 -258990 -125995 -233171 61335 41962 36707 190370 -78955
18309 -31153 -103460 -289306 -278360 -69118 -295082 -55425 -49769 208379 93182 192226 68951
18297 -260609 143995 -14954 -58222 -25840 -221104 340052 88462 -18216 26740 21245 195379
18286 195379 -294468 136684 192495 -469203 -19427 -183160 -182793 -158815 15207 -148102 -390550
18275 -390550 -41339 -48789 143876 -136761 213196 152832 -152478 7166 -167534 92077 -219747
18263 258486 212556 -72499 142254 19619 -35140 -98432 54124 128824 -17102 51517 111660
18252 111660 46894 260242 -189123 247402 1074 -202138 -245307 -127486 133895 -117595
18241 91472 63192 -27258 -37087 50872 -194654 584 -117115 -225702 34425 108510 -162277
18229 -267364 -24888 262165 -249442 -105722 -124732 -129481 86723 -196126 -366430 -131091
18218 -236707 -176758 167530 54250 -49048 -174344 -254224 -156585 -116775 -162366 -31266 -51498
18207 -51498 -65838 -468563 -1192 -231959 -38026 -58003 26195 10612 4589 -380032 -384129 53538
18194 -60879 -28675 119613 -116885 -177229 98681 -54861 -79217 21366 -140314 -348812 -169909
18182 -329034 23349 -260156 -207684 69596 -169236 -12489 -153360 -184443 -177594 -214608 46051
18170 -174039 61851 -273708 -327887 -191754 -313289 -76852 26215 -111288 -14640 109447
18159 -310059 -370674 18738 -57110 -158646 -150083 -186974 31388 70731 209920 -253689 50553
18147 -143800 -342874 68167 198433 188524 -68765 -351369 -459928 230398 110875 -247553
18136 -55757 -117269 174089 44135 146586 76048 -144421 142399 -101230 51168 -84578 54913
18124 -82488 -26810 -227387 -111518 -229043 -60924 120747 -203017 172293 80255 -76080
18113 71566 424359 -179569 -222889 352591 12176 167957 238697 -393115 -151579 -64127
18102 126072 -203793 -178123 54740 -179603 -100314 527731 221221 -33777 201411 8311 -156025
18090 -190760 97905 -295088 -76769 -80560 151991 -136574 -216134 -190687 -90020 -81322 -314620
18079 -314620 109291 -205393 -58240 12598 41763 -109556 -276979 4995 -51618 5174 -15910
18067 -46668 275130 -298441 -126590 308849 243459 23192 94175 -3867 -131062 -90203 -122183
18056 -122183 5924 52377 26796 -181464 -117418 -16946 82411 124001 -491092 -190263 -260237
18045 -260237 -202187 -40678 -8324 -45030 69067 177279 -60270 249532 138215 252496 -246511
18033 -118455 -511361 -173648 -39204 -259415 -256158 12199 -98329 204717 13437 -115202 3253
18021 -29248 -189220 99236 -121082 -29946 -78412 2216 291061 -75981 -60286 -361963 -310911
18010 -310911 46170 -84879 129593 -74385 -263047 399165 -83426 -361725 150745 -97112
17999 -99166 -22779 -107447 159947 39194 282500 87885 233311 -164353 160081 -220196
17988 -371746 29646 285062 304359 -173180 -86562 22908 221714 -5476 108638 -347567 -220669
17977 -220669 -104339 -344258 -26812 84515 -192298 -86738 -39952 -384057 -216769 -64811
17966 215360 460941 -56211 -99785 255999 -49593 133240 -222444 133768 -15278 100870
17955 -131728 201876 -264373 -213370 33134 233374 -294399 -129796 -255986 -17771 -176199
17945 -176199 164225 -52743 251313 139307 -213161 41359 -401480 -81171 263240 -219047
17934 76137 -110287 30228 61610 131799 48582 33182 -28610 -259537 -99761 206340 -14263
17922 -489373 -178136 -289514 80385 -27462 -249719 126546 -23459 58980 -42697 -8262 -226834
17911 -226834 308238 -167963 27719 202246 153820 39079 86509 -176408 40999 -139890
17900 -248413 -116855 -84259 68805 163217 158079 -5685 -106742 -206222 -19114 24841 62239
17889 62239 163758 133006 135234 297998 -67511 -124310 -70593 -193925 58778 20318 10910
17878 10910 17403 176128 -192166 33440 -33015 -272768 4119 147629 -13525 194816 -305806
17866 -57903 248641 58721 -144187 51615 21529 8686 -213530 -234640 29426 32574 407646
17855 407646 131988 -142082 -74964 114417 13864 164968 397043 194937 -161486 -164882
17845 -164882 125803 78952 -24903 116651 -1469 47900 53831 -53556 193097 -171755 -267903
17834 -267903 60240 16682 47953 -59386 -177219 139181 -149998 181310 117141 145582 15102
17822 -190174 126091 284787 274255 44938 -163494 -80710 -291485 345292 -346739 -158967
17811 57062 218563 106477 -56791 409955 88766 23816 104645 -75452 -166839 46884 115859
17800 115859 -17421 -149149 219910 78850 181266 -445858 -311809 289608 -242859 107555
17789 3108 74869 129849 -152631 99836 -153445 -200353 212840 -218409 -49786 147045 -96850
17777 72136 -182307 -150626 -57319 172148 -31529 60435 118658 -246758 -38879 180229 32018
17765 137179 155112 -62464 -117727 378819 -43341 -85142 -183907 -23280 229572 278807 297326
17754 297326 -29182 -139336 128640 -417484 -331554 45054 2028 -52294 -38257 -470369 153091
17742 -58534 -113124 115408 -306378 -409591 -122064 -144302 227709 -14044 -466520 6426 -208368
17730 -25448 -160492 135960 371444 188929 -36592 -96998 29442 111827 96480 -167923 221115
17718 267621 21438 148302 -6029 128827 1416 -60193 -51522 306187 39080 172716 17236
17706 -176020 -24215 111128 -12428 177932 139516 91677 -193268 -71209 -187756 -124656 -152027
17695 -152027 170030 -32548 56001 -4976 52665 -135048 9441 -205145 111714 66128 101445
17684 101445 86551 31777 -156776 -31179 -62261 -302448 63476 -250454 195843 -81337 77315
17672 -203301 -26780 -236969 2628 104791 270143 -74506 127113 -206988 203271 -484203
17661 142224 131867 -291443 153068 224836 368214 213593 -402986 67867 184080 -86825
17650 252839 -336093 57894 135529 292215 -191132 313038 -45417 -152957 -10069 -149628
17640 -149628 -79352 98475 45532 -235502 -82236 -53707 470622 -18276 220060 56069 -98500
17628 213558 -123792 240437 -159525 263379 -13051 132617 -160074 128814 -177158 -152091
17618 -152091 279012 195663 -273479 13058 78297 -74381 294723 216896 -243858 259415
17607 352627 -209601 178296 -15987 68459 240609 460995 90528 38945 43414 100340 215485
17596 215485 363421 -198547 328186 -23122 61427 -57440 327109 164408 72073 -17171
17585 36573 39426 -47308 -303232 104615 -63924 -54282 -79860 556 -71733 176036 329370 353954
17573 353954 114093 -5427 -59115 -303721 421405 -62432 -235430 41369 -7869 -360607 -39347
17561 186442 -453015 -165815 81213 109552 251217 -168738 -57807 161534 252618 232659
17551 232659 208795 113026 10061 69093 -77204 -191396 166757 -82486 182044 -104752 308041
17539 73628 -5220 257223 52453 203955 99734 118794 248887 201957 -1208 -117701 -44984
17527 -63716 312245 166742 -96106 106527 350030 44939 346003 -62807 -242538 148142
17516 217820 429735 11456 -248775 439761 183999 -9414 78943 -388376 138309 212017
17506 212017 -51445 -106006 119298 -221091 501885 125274 407175 -13919 392549 -228639
17495 121400 -75260 -4124 -156667 -99727 98327 137438 305587 159547 -84068 124302 -11490
17483 -10048 8196 -242650 220820 58568 -111636 -180805 177812 -54520 22232 223345 131659
17472 131659 442396 180527 -54551 99921 -343495 338857 165508 140981 -145405 248673
17461 273405 257201 132362 123130 166554 -43953 78459 136188 221454 9681 90512 270730
17450 270730 286429 163141 430000 321581 438550 178633 -20513 6583 190502 106545
17440 106545 165247 372120 111494 150484 75780 167542 179141 237419 364974 361139 92413
17428 480897 105111 452714 31693 235136 336459 54458 312328 -122575 -109663 226303
17417 407954 208755 100894 238932 441343 78009 372109 115287 147140 294415 183634
17407 183634 174929 74305 46522 158451 268504 -5022 118050 -94112 195289 190369 -50371
17395 -109446 321138 28331 -302511 145369 -253433 -177453 -174041 186240 -3552 327020 542617
17384 542617 -127004 134522 92285 325026 -217569 80041 188876 140846 159161 235916
17374 235916 62289 365901 236626 191840 165804 263632 158002 194037 265521 500249 230379
17362 390254 -20010 104884 -99535 296724 454696 119244 -222578 -179356 111173 132385
17352 132385 214348 32071 978 -15755 282322 113022 -223109 363865 147897 285088 -2007
17340 187096 -62812 24566 -85221 106673 213515 53580 280915 321900 270690 -30482 164471
17328 223960 320236 124584 91602 -158394 337890 194685 282796 419266 -5295 110605
17317 39006 384432 308814 207405 -197926 567944 208602 43428 124627 302825 78645
17306 245062 -12668 267303 80536 220992 407465 89652 -128798 193257 131761 -87171
17295 129414 236124 55549 305278 179564 151505 98128 157114 574203 97568 -87781 180116
17283 -50269 96223 62692 84138 131116 255168 42722 117499 364876 508116 232504 168143
17272 168143 205933 -9354 300802 390781 179370 145742 54989 204738 -88959 -165254 99077
17260 296765 255512 208469 -30498 -60895 428663 106358 148165 181893 11876 370797 394835
17249 394835 202457 230148 77184 523666 106172 367173 142780 163631 127178 329122
17239 329122 88095 145950 150855 212492 56336 -152762 41519 91128 61382 245167 169471
17228 169471 11162 482411 271359 137441 249107 -166063 357728 -158231 269509 238197
17218 238197 234005 353821 -264916 162428 72398 23648 277931 277172 -41310 287129 365049
17207 365049 232617 220680 425458 205309 450485 167128 365644 165460 259333 479827
17197 479827 69999 246470 -54587 396331 290528 -101092 80153 259354 310921 274829
17187 274829 144699 245699 283655 452923 324037 571336 326067 341450 60763 134951
17177 134951 51207 -71668 120824 308478 326333 188633 593533 500284 358948 295191
17167 295191 318443 304491 -231335 225916 146206 315456 419973 47475 130876 148531 329510
17156 329510 448769 165881 505964 439474 439609 410262 158632 425085 303082 351289 370961
17145 370961 201897 210617 460882 162712 168824 489425 209568 129963 73215 308427 235812
17134 235812 228459 87106 154643 297835 356437 189478 156429 261344 152253 438931 100292
17122 535024 356608 272517 255453 55277 91752 331402 610959 269654 571294 299724
17112 299724 233845 405255 241872 451727 442973 431394 626418 -26248 149981 509630
17102 509630 317020 260136 165260 501916 533409 781348 469844 369097 616514 482369
17092 482369 347661 25161 367363 -46909 257516 89251 691171 334712 527873 380056
17082 380056 507702 178935 492216 135602 492130 372472 60091 214304 363343 293017
17072 293017 483659 440397 151489 509395 631286 530078 686116 519653 431179 598003
17062 598003 636020 610514 382030 539709 76725 526557 267132 803572 630994 394085
17052 394085 640030 527639 335184 229623 164601 412215 895305 354014 455652 377460
17042 377460 321952 525250 653177 356097 723711 731640 469270 456607 575638 697791
17032 697791 533233 529010 511358 612109 615027 677399 618131 319375 390410 664142 331860
17020 535815 322480 422509 957460 675496 505524 448475 859384 544066 311531 383948
17010 383948 784920 674537 751235 529852 845512 615353 834563 586272 781251 749656
17000 749656 759110 542339 694643 788856 651981 726855 796807 830328 859214 647398 321528
16988 706789 810148 804376 724186 833509 902641 939789 757844 873257 1085798 838599
16978 838599 930293 1078642 899045 572256 1035926 852448 595732 799510 661758 822512
16968 822512 907117 631890 792209 980304 903764 819920 859252 1105634 1479049 1044586
16958 1044586 1019817 1036479 1261188 807511 891157 1106847 828824 919161 817236 1032825
16948 1032825 1276911 799827 1370843 866200 1016304 983682 1087443 1164759 1222350 1058368
16938 1058368 1265658 1357971 751790 1171763 1124484 1425407 1030304 1456562 1215601 1375792
16928 1375792 1522323 1244022 1466120 1458196 1331484 1471247 1458737 1640406 1454890 1408396
16918 1408396 1804374 1292480 1380424 1528236 1483954 1502526 1403111 1588826 1573500 1215222
16908 1215222 1693680 1506138 1977998 1208267 1528748 1612796 1905335 1465658 1846409 1561484
16898 1561484 2025448 1755010 1725242 1531317 1874433 1667206 1856896 2012141 2064465 2067491
16888 2067491 1873901 1857600 2010451 2174740 1825489 2147985 2296365 1873848 2044857 1701787
16878 1701787 1941990 2029788 2456378 2229735 2450940 2063225 2708334 2018799 2368442 2476762
16868 2476762 2595247 2509653 2627218 2581547 2795656 2814098 2437622 2665628 2902343 2818759
16858 2818759 2934763 2829279 2947032 2847986 2993205 3151627 2930831 2965622 3131435 3436217
16848 3436217 3105442 3503262 2969327 3640559 3315575 3772646 3755490 3705080 3605860 3672349
16838 3672349 4025619 3777312 4061094 4315742 4043582 4612231 4091190 4271911 4115558
16829 4115558 4814171 4883486 4986917 4912655 5088004 4897131 4890432 4905559 5292726 5522616
16819 5522616 5385157 5351708 5704167 5663247 5843808 6192279 6253964 6359164 6402252 6701695
16809 6701695 6766188 6910657 6722054 7015820 7284786 7425508 7879697 7863625 8232373 8371290
16799 8371290 8289716 8648763 8904508 9000910 9310946 9343292 10189935 10207746 10530025 10438758
16789 10438758 10978870 10742677 11434348 11870217 12055214 12568128 13045749 13269081 13523878
16780 13523878 13949033 14467438 15153942 15357799 15871631 16078190 17085839 17394474 17832822
16771 17832822 18455214 19503027 19320424 20438284 21231710 21982560 22521475 23476495 24657347
16762 24657347 25625949 26515011 27725686 28855544 29758339 31120265 32634558 33406477 35690408
16753 35690408 36659307 38947065 40296135 42406935 44103949 46628784 48692228 51093829
16745 51093829 54181363 56613624 60046016 62883346 66662498 70668535 74645596 78621268
16737 78621268 83292652 88089413 93084941 98757102 104774142 111163653 117515293 124879412
16729 124879412 132115022 139564068 147272258 155353724 162937256 170601206 177737185 184655233
16721 184655233 191126511 195833968 200107092 203112237 204515225 204598542 203423416 200955116
16713 200955116 196932880 191715255 185511061 178478745 171212131 162998324 155096109 147026605
16705 147026605 138797134 130978282 123434283 116139776 109078667 102377041 96061260 90412720
16697 90412720 85185215 80065646 75404152 71034746 66988705 63373095 59910332 56605911
16689 56605911 53526609 50186546 47826625 45455229 43405783 40999797 39113702 37138111
16681 37138111 35458747 33693297 32392892 30920991 29359022 28215514 27180860 26117962
16673 26117962 25101271 23958375 23015212 21991756 21447730 20403862 19785288 18835002 18225512
16664 18225512 17578149 16969617 16302913 15917710 15301927 14854362 14315153 13954486 13255147
16655 13255147 12883790 12590159 12227323 12015966 11619119 11069218 10716105 10648428 10347281
16646 10347281 9678950 9769973 9465888 8808091 9335205 8504387 8370184 8177148 8216387 7812252
16636 7812252 7833777 7320142 7307532 7052885 6997366 6735646 6290672 6343379 6219912 6212452
16626 6212452 5885427 5945705 5601640 5502613 5608659 5282488 5244549 5092924 4864888 5165316
16616 5165316 5024091 4684517 4737113 4612393 4580638 4262513 4320288 3983891 3786289 3957247
16606 3957247 4052182 3950859 3948789 3781887 3643263 3585401 3586008 3635015 3568117 3410027 3506525
16595 3506525 3457046 3261541 3216503 3043800 2991986 3129863 3210372 2852271 3106633 2594253
16585 2594253 2649436 2780207 2778175 2410258 2696083 2660413 2608966 2511570 2542476 2574188 2712814
16574 2712814 2514494 2375680 2259174 2333656 2453970 2125783 2080568 2111327 2025438 2199290
16564 2199290 2224529 1716345 2312438 2137635 1968886 2050974 2258988 1956779 1844090 1735057
16554 1735057 1665528 1573189 1903366 1913894 1703942 1669306 1421358 1726369 1453354 1875469
16544 1875469 1465388 1753808 1569331 1296851 1741025 1650624 1557828 1365263 1921522 1581843
16534 1581843 1128324 1645959 1555690 1440670 1353949 1434988 1274440 1491529 1491488 1449130 1144029
16523 1144029 1312431 1172376 1136867 1052705 1839374 1134937 1372541 1357449 1263234 1210377
16513 1210377 1350277 1244347 1364220 907715 1189327 1382577 1049320 992111 1064622 880191
16503 880191 909172 1179209 1013798 1123568 1256345 996292 998378 1076401 791395 841411
16493 841411 1054239 894018 959228 956643 820917 800766 1231264 1096418 1022859 827068
16483 827068 890937 718512 1237045 1002157 735744 755314 825572 698673 876549 1035640
16473 1035640 701355 896624 954406 1102814 430325 658118 934944 772065 811465 646963
16463 646963 638595 804614 948237 740345 681313 695648 578521 788337 839433 324734
16452 647329 516508 769359 1100984 405031 325736 652033 363496 623037 499258 467640
16442 467640 438094 577360 604918 543406 708043 428112 500241 625032 799994 684293
16432 684293 809799 474734 612892 276981 337397 613060 464992 605364 716312 669578
16422 669578 595595 599562 515385 425594 542490 353457 470415 398800 584925 654246 414645
16411 414645 722848 521425 756852 683682 816979 314478 507323 455291 272209 372850
16401 372850 583591 474429 359110 626986 603946 498077 577567 778382 192936 289906
16391 289906 598119 427552 606123 616895 283086 462105 698619 553399 359831 195584
16381 195584 697331 329689 321946 409339 576616 212012 578296 650481 485333 652608
16371 652608 447822 503147 400821 498196 616056 78962 525252 462988 266449 522088
16361 522088 248068 286224 335649 179316 599655 295672 634373 203010 458062 645506
16351 645506 331067 571441 681872 415451 407308 542885 278415 72172 292566 401378
16341 401378 566545 363150 -1039 104617 343838 436827 353654 573747 534764 274226
16331 274226 470957 103055 358070 418304 541895 296714 196864 418413 296295 267689
16321 267689 560598 -14636 352898 206879 350056 352164 603198 28861 422456 432438 302028
16310 302028 316274 281661 271680 410237 420828 390907 220429 -8887 374016 19844 405910
16299 405910 189165 148238 162048 158318 252847 216165 5112 486435 111678 33694 481693
16288 481693 68437 490569 507707 -17156 302069 372019 551236 286028 158602 54111
16277 309066 168485 414782 -115336 371421 235686 18343 160094 422432 382580 414048
16267 414048 250861 209586 149883 79259 324408 401759 344119 350780 51140 368098 272052
16256 272052 373595 419733 83878 128541 425782 315624 319919 182902 28235 168387 303546
16245 303546 384212 162856 -182641 224011 146591 439613 482455 547462 164065 325678
16235 325678 261199 92743 -48270 217924 403549 238517 453563 196074 -54983 9416 149178
16224 149178 420867 248362 166239 219569 101666 -23408 364580 349429 548288 51008
16213 -49777 268654 263994 430402 388326 233028 243687 126103 400611 135035 254434
16203 254434 54231 239882 308691 221172 -41694 265017 446930 16118 120001 197893 243111
16192 243111 309103 511468 97471 248995 42194 246859 126880 55302 305206 -1215 360399
16180 180296 159303 -56094 7500 -176342 51663 -61579 -49867 115679 102831 144610 325050
16169 325050 54315 211276 16974 272044 308179 -180104 310326 161934 110264 347488
16159 347488 -138755 -153982 -81677 60914 68249 -96517 149502 -126070 134467 329047 -221357
16147 -1055 10059 284710 -86514 118297 -35500 -464290 315205 256506 155216 -330438 213626
16135 340251 72160 295843 10076 199788 165387 133252 -1909 165157 98681 -77759 -38933
16124 -38933 145184 195043 263277 -1829 -18264 -75268 144749 226546 192622 30333 9871 7513
16112 7513 93105 -19037 62016 204288 -136724 69437 5212 80399 123114 320359 -123854
16100 47686 -121822 130549 -263892 298978 172788 264855 -121479 -207867 122515 4885
16089 -281975 88348 21055 287824 352828 -295966 95289 321841 -197456 176032 257485
16079 257485 27084 122683 261619 104829 -26702 388684 -141641 4621 -163537 414995
16068 -124912 -85986 -106847 -31420 151124 -151441 -91501 86301 -142761 363095 -309951
16057 63063 -234428 -214963 79974 -4005 234097 -99804 275240 55779 -144160 -87444 -28353
16045 -611 -193688 -149693 81597 -76739 -15313 98069 -58384 113312 241713 114098 -84237
16033 208923 -110325 -15475 -327755 -135657 185706 -140133 -6797 -198837 -113661 -27408
16022 178719 -111555 -88839 113225 154739 -187221 -25811 -141384 -72016 21668 -248189
16011 94925 -62490 89146 149856 233485 -157188 -76801 -127042 81685 -210126 113189 -171178
15999 315551 -178215 -15998 86190 -75786 -170144 -79849 -431739 150880 -53366 19588 331622
15988 331622 -54891 -40424 -250007 152864 127174 49736 -1508 341942 473492 11975 -94003
15976 250690 -293329 19226 -199000 122072 252054 32973 -110199 217834 -3685 156118
15965 -79556 -37068 -359719 81588 122479 133541 -3614 -225201 515380 -302331 41735 -39903
15953 -54149 -271268 -321311 87856 2418 -323866 -295985 -133648 -41764 -255739 13738 65743
15942 65743 -15514 98305 -213126 -160196 -62970 -227104 -87024 -208010 -44093 -64698 -10345
15930 -134385 -950 177487 -70020 83553 59953 -249701 -177857 -455261 -296991 -2345 -313368
15919 -313368 132995 -406704 131244 10502 -66969 -91536 68613 198434 -101432 -266353
15909 -266353 77907 232008 -337464 -100290 -69710 -436838 252916 276471 -127886 280773
15898 19678 -281342 -90613 -249504 -171191 210413 -116379 -193016 -255679 98444 85022 38610
15886 -258053 58228 -319744 11807 -7399 -121594 97039 -171752 81234 -71074 19280 -228640
15874 10923 -184859 -168412 -20497 150937 -178224 210335 -354781 241894 257008 124787
15863 181769 82953 -143048 -381639 375467 -83641 -125475 9176 112908 -134992 723 -23226
15851 -250017 -361318 -335401 15751 157798 -100898 78875 213458 181516 -119692 78920
15840 -40513 -3289 -120309 -12203 -281467 -44340 106941 -48672 -70616 134108 109082 -97402
15828 -301719 53651 53176 26335 -228317 -310142 -184999 240800 -14279 -120729 -492513 53531
15816 -86834 11433 -162342 -195487 -46949 -121907 -44050 49240 -153203 46014 -169146 -100403
15805 -100403 -67989 208682 -283164 -229906 144481 -139841 -63223 -78325 -330075 127784
15794 -261224 -54928 138293 202442 -312611 -488388 -118450 130825 -114025 -65514 102998
15783 32588 -30526 -339282 -376335 250406 242975 -71755 185943 93933 -317568 -324896 81196
15771 -293428 -3002 37906 153891 239428 -92282 82903 -104170 208598 -78052 -325421 111439
15759 -118984 -53237 215086 -43462 195755 113199 -180708 13323 -108196 -317427 312445
15748 -45855 -102909 142699 198209 -83236 -285106 198502 105282 -79000 -132410 -42498 -296356
15737 -296356 169191 -414369 1351 -340015 -130635 158532 281624 -93098 274810 -326350
15726 194342 275703 -137699 -203375 -139790 -149772 88677 31148 208831 -118760 -121010 224446
15714 384006 100163 -249419 -136439 -455737 -38118 -117275 -241561 -62167 -28662 -527687
15704 -527687 -133900 23235 -225875 -218886 -198085 56423 -308610 174790 -158025 -164131 -104414
15693 -104414 -34106 -59738 -88895 -154612 110999 3301 140194 91249 -120712 -205869 -402
15681 -230444 -25895 -39690 -112728 76599 -317319 -59970 56577 57679 -50191 -142474 212839
15669 -47995 163254 -201808 65471 -167786 -158835 -21308 26250 39015 -104473 -157761 -145046
15658 -145046 268694 70497 -279766 -23307 -47780 2659 -86068 227480 -210056 265668 -232414
15646 112452 382599 -76688 14386 -40330 376585 85699 -82356 -280783 -61617 -252873 -48594
15634 -342324 -44922 38753 -133515 -63890 240500 153748 -110451 -223888 -184439 134511
15623 -107941 75454 171446 226654 -209991 -146510 201674 208502 -138826 202199 65143 -46123
15611 -54140 12169 -164937 -45483 -13279 437907 -66053 -35938 -85404 -13777 -84753 -66392
15600 -66392 -1696 -245174 -134899 132762 -64187 -321629 165045 -241960 -17651 -150739
15590 -150739 45281 -153064 118829 2540 217965 -197329 191723 -47613 135198 34293
15579 -89871 152530 -236968 -35532 -203982 -45891 -163927 -258596 307299 -217223 -361851
15569 -361851 284746 -3995 -227593 -43127 -33403 9277 -193142 51536 45940 -30585 -92052 -10865
15556 166664 118300 -74109 -24542 -206256 165439 209842 -54857 -216837 -89261 -142293 -110892
15545 -110892 196636 -158646 -301943 -223084 -132011 -95574 179194 11772 -301607 157049
15534 55656 130727 -122474 21737 12561 15835 -123687 -421643 -9185 293064 163222 111591
15523 111591 -161935 45072 -222676 48836 124291 -432063 334731 322164 -63334 176478
15512 57721 175726 132116 -12987 -62776 -54965 338983 -40182 -68974 135225 -213824 68573
15500 103492 108325 -209718 56461 209902 -180014 -127377 56355 -384052 -160910 148732
15489 182151 -209191 -36892 93270 -157047 20175 -54822 -86887 -176502 91603 78400 -7914
15477 -256283 234222 -99554 -195893 210764 77596 64012 -292243 118375 -108324 291773
15466 -325276 -245427 33048 262124 -87953 -83590 -228938 165595 157150 -172641 166869 165789
15455 165789 -68693 -42602 -162866 -105592 271883 11602 -183197 23026 -182206 89174 -106397
15443 -159702 35315 68890 -146542 -171004 -21872 19030 -58900 123414 -128181 83866 238095
15432 238095 -122639 -119296 356875 -13490 296912 -79485 106357 243440 -62522 341032
15421 220710 9745 271860 -88103 62755 107827 11141 -250785 26697 -339012 -238501 -179136
15410 -179136 -197759 125214 6881 142681 2364 -222315 176688 -84945 203041 224938 2837
15398 -145921 93544 65557 -163306 79702 145086 -123279 -21213 93042 -211263 270995 27952
15386 -285715 -82861 -240426 -26964 -44261 -232051 -111445 -175794 155491 -162469 -140959
15376 -140959 -568758 111418 -138051 -277414 141060 -264766 -55742 338406 1242 131771
15366 131771 143471 -116750 -414600 88692 -272368 153387 -330613 110330 -288365 -38156
15355 163332 -14462 500967 -243734 222595 207574 27742 255089 -106793 -450721 -196335
15344 47881 551735 182936 -106769 260926 -147071 122270 -222483 181532 10383 -38580
15333 148437 -12462 -120348 6045 1746 111225 97637 290709 84896 218327 -37715 -45666
15322 -45666 -24743 294279 120970 -22876 146641 2856 -58375 -255447 237263 -140661 205140
15310 -61326 61837 152404 271747 88082 179752 68591 -46335 351701 -317456 168831 -57281
15298 68203 163065 292933 -246875 -211153 -149104 -46636 238640 -276606 -15544 74442 -47981
15286 -48675 109458 60248 6084 -28246 184476 146287 49883 -28394 122447 444945 31243
15274 157050 -15889 -95497 -3369 32730 161969 183168 55476 275203 315363 345201 55286
15262 188905 -1361 85683 -136670 66479 157696 93573 203346 -92317 333252 364188 -117022
15250 87616 420681 604167 641508 1804241 1847176 1390566 2138187 971257 740154 431921
15240 431921 49048 183750 153951 81379 -299561 -63719 395507 156628 -87473 199471
15229 225542 349408 39541 -43259 -143366 329712 -38404 141091 85797 249595 275676
15219 275676 -320801 162205 -275947 18633 16315 255953 31719 58364 -281985 113061
15208 147803 196405 245957 162300 540866 495487 -57772 32156 206328 443862 174217 15850
15196 -139464 -13179 151097 -38450 -308677 85165 -2415 125583 232521 -782 156898 552194
15185 552194 253125 -88218 131669 85485 130878 -115465 42791 -134140 45487 69178 -46305
15173 87761 174711 -12068 277627 193002 -175214 143989 347779 57437 -182179 -173267 229923
15161 -179879 -196957 -292560 -87986 245236 214614 16839 28154 136828 246083 175119 229937
15150 229937 145687 5084 -128356 -131108 17687 403280 105432 127840 139526 144397 582304
15139 582304 77483 484507 209094 143864 337528 78350 293994 61757 165580 12117
15128 40064 345611 168680 115341 196625 1353 253525 7541 365067 -25369 173931 -33210
15116 124795 107387 335547 468321 40404 232893 -248704 -222793 158403 100858 93198 148001
15105 148001 163332 -104564 21282 -62917 59481 -31630 44348 16332 53956 245867 102207
15093 -164177 17226 59157 157080 115712 354385 -36278 -223053 244569 50815 108079 331043
15082 331043 2741 129622 233098 341295 -78078 174275 4310 -134625 572490 290171
15072 290171 326900 227372 161107 -284414 451307 -205250 100269 -31231 23020 373168
15062 373168 129100 55585 168259 228325 220029 195089 296999 140786 -278744 727019
15051 355076 202163 311678 285229 86097 381402 191679 223967 494320 192167 252236
15041 252236 241088 143823 336530 -247771 159068 -23147 502473 216459 300156 195526
15031 195526 166622 150569 268732 178870 -56498 193352 369765 84010 226122 -5730 60227
15019 42321 17286 38402 396836 120687 -99741 194383 190051 273652 287202 297343 153234
15008 153234 100587 90896 -59914 186015 213152 168228 411935 -25724 296441 178368 397820
14997 397820 104364 158513 345314 332799 341006 232500 271952 248688 91891 4504 267259
14986 267259 186268 -13694 114435 53059 280692 352917 414446 237432 288781 648166 108706
14974 139814 94247 403852 93297 352159 -41641 342988 128457 310044 317318 128628
14963 336438 300768 460772 292912 177403 281960 -167733 398573 304931 251430 350245
14953 350245 509004 270406 342412 219150 61650 209758 220561 217291 623504 305917
14942 222146 311502 423107 221716 460588 68386 557091 187810 352741 657142 465261
14932 465261 352130 172126 559888 513964 198820 254202 104807 352073 37979 140452
14922 140452 419814 250114 535743 165266 221289 386037 358531 436856 208175 374256
14912 374256 310876 707882 264536 251042 350916 393338 336978 562620 209063 457989
14902 457989 414562 264913 274929 236819 -13787 21866 492232 302031 618500 226018
14891 310106 581723 523822 5421 178296 328359 503055 139683 493164 701991 623804
14881 623804 552127 575117 517665 343686 66579 480795 533216 368248 219558 477539
14871 477539 137099 519430 292874 313862 524805 894906 418668 316663 638270 339495
14861 339495 26800 399013 180557 262749 483725 443262 330098 342522 608313 559414
14851 559414 527982 309354 523648 463807 420027 517480 315845 448568 315532 374677
14841 374677 645418 766249 366651 767950 757063 49143 191467 628395 683713 427734
14831 427734 549094 578022 555124 396617 447130 184567 518227 568964 249614 803872
14821 803872 505786 185959 369160 425333 487728 630206 624013 617226 683241 552286 608091
14810 608091 664244 489797 599827 803587 528656 449804 329343 692176 337764 394637
14800 394637 474776 625251 381692 508156 566332 475783 669987 536685 428926 649785
14790 649785 740916 461711 511402 657788 511427 561679 872690 610427 804608 594082
14780 594082 962806 336493 591874 362120 727988 787357 651107 845328 670524 465263
14770 465263 464540 419893 732029 517752 478525 659457 489944 1003034 697975 852953
14760 852953 581309 552219 542870 841781 726900 713775 1057395 734748 656680 803161
14750 803161 682766 919325 495466 589687 822756 662706 562585 612521 880300 840497
14740 840497 772459 464122 956778 528327 917284 710491 781797 844314 524718 772521
14730 772521 689630 437649 934381 861199 868183 725911 776018 786233 848469 997619 1173413
14719 1173413 1065019 696975 947597 671326 729985 1067864 782144 959068 1231658 723886
14709 723886 860653 1001876 799989 834553 853521 745267 799598 812510 1065381 779435
14699 779435 789794 716747 577339 1276752 820567 963771 1145463 1012050 1136965 1120424
14689 1120424 836067 927913 712763 1197692 1219346 866481 965541 930748 1204541 1206098
14679 1206098 1207969 816607 639758 1042157 1176725 1193426 884166 827718 1015341 1121220
14669 1121220 888749 843183 1464732 1170240 1313418 858333 1251724 1126654 1168884 1063096
14659 1063096 1198080 1367884 1268187 1220850 1375635 1257894 1243967 1098334 1243373 824607
14649 824607 1095674 1397569 1129354 1050647 1425942 1365574 1176042 1639399 1378530 1468691
14639 1468691 1374387 1329992 1218873 1677967 1673043 1341162 1249359 1262776 1543455 1398300
14629 1398300 1553603 1728546 1226684 1775615 1513724 1350092 1563754 1518513 1494840 1238914
14619 1238914 1722398 1496749 1558743 1822529 1720803 1464621 1672269 1631850 1838643 1781688
14609 1781688 1786644 1755387 1855589 1723032 1523772 1672769 1766657 2006544 1886004 1977003
14599 1977003 1854732 1983507 1536512 2108461 1756750 2269301 1981121 1773978 1662263
14590 1662263 2080212 2046186 2005701 1884741 1921686 2131126 2214084 2184730 1885022 2485296
14580 2485296 2199986 2262748 2198638 2489439 2242097 2562017 2550112 2634932 2185466 2378857
14570 2378857 2442424 2791275 2736357 2480467 2831374 2914540 3091727 3033183 3125287 3384682
14560 3384682 3160043 3072658 3178431 3322018 3864163 4220079 4142753 4558038 5057371 5793169
14550 5793169 7141144 9467503 14054492 22194385 35719163 41085416 21669123 11921014
14542 11921014 7989698 4257176 2988258 2528607 2915071 2334512 2114375 2584100 2443574
14533 2443574 2232510 2312306 2274558 2529628 2477800 2594624 2600901 2416107 2221511 2999762
14523 2999762 2656555 2760533 2647883 2651458 2855979 2823521 2872224 2560219 3005346 3271619
14513 3271619 3152346 2991848 2872412 2969362 3489400 3130707 3285253 3189714 2888947 3265577
14503 3265577 3468440 2832407 3708920 3333814 3310139 3696990 3720521 3831167 3709401 3903644
14493 3903644 3456151 3733668 3634396 3723597 4184287 3793789 4046068 4021243 4178378 4073144
14483 4073144 4063558 4422962 3805093 4131654 4413059 4407343 4463148 4481158 4543567 4517725 4150472
14472 4150472 4768748 4785215 5073687 4956387 5117135 5262642 5269598 4948406 5179111 5066467
14462 5066467 5231183 5409762 5131295 5271285 5437646 5741894 5589377 5845864 5743937
14453 5743937 5588972 6110174 5877460 6167556 6246082 5937373 6436322 6367503 6460265 6568064
14443 6568064 6480952 7056575 6940887 6751511 6769661 7266285 7299145 7005416 7367876 7433129
14433 7433129 7429243 7650413 7809136 7524758 7815280 7762242 8348226 8093023 8186589 8301505
14423 8301505 8536232 8601750 8831675 9278052 8971225 9285866 9395883 9576897 9605859 9703298
14413 9703298 9503679 10085080 10323619 10540682 10267926 10724783 10593540 10919735 10908571 11311387
14403 11311387 11245443 11651036 11582779 11943477 12447089 12159284 12838665 12503344 12982708 13123126
14393 13123126 13336725 13108827 13877237 13846748 14385923 14410174 14893251 15072305 15366936 15745400
14383 15745400 16065260 16421743 16549402 17097478 16901830 17889404 17882107 17890170 18607284 19031471
14373 19031471 19343318 20080573 20190992 20438317 20887010 21104764 21835730 22368922 22830175
14364 22830175 23285478 23928021 24423228 24800304 25376215 25917786 26278858 26960319 27452150
14355 27452150 28384589 28850302 29978136 30658030 31292658 31883888 32919227 33409731 34065525
14346 34065525 35296361 36123897 37011823 37885500 39141950 40094598 40973614 42324821 43146230
14337 43146230 44490055 45930435 47468094 48452309 49966836 51350676 53116740 54272442
14329 54272442 56343768 57754898 59875985 61794053 63836819 65883360 67941956 70367833
14321 70367833 72870530 75548394 77652796 80982807 83946360 87091653 89907489 93226207
14313 93226207 96849892 100967062 104460614 108846352 113308334 117844821 122469805 127527360
14305 127527360 133073350 138713131 144437264 150975272 157503432 164436073 171648100 179788154
14297 179788154 187558779 196260588 205616044 215125377 225147594 235847518 246886045
14290 246886045 258332755 270220761 282756408 295485705 308800690 322533953 336664012
14283 336664012 350836319 364769072 378826481 392757521 406199044 419044194 431084255
14276 431084255 442128890 451383542 458839371 462723174 463793930 463435359 463644569 464675952
14268 464675952 461560781 456600857 448832112 438710802 427699258 415140226 401034470
14261 401034470 386452555 371181513 356013043 340779173 325506077 310935627 296272243
14254 296272243 282234348 269855773 256920931 244470617 232732942 221752654 210939901
14247 210939901 200998361 191688258 182800038 174319093 166519649 158676298 151601709 144808777
14239 144808777 138375700 132901220 127190034 121506958 116756493 111938776 107431925 103154135
14231 103154135 99311385 95655308 91644865 88117141 84963186 81757032 79161295 75885932
14223 75885932 73322192 70842625 68547209 66257062 64067053 62106563 59738621 57613118
14215 57613118 56088430 54669988 52940814 51654727 49453818 47982262 46693196 45761913
14207 45761913 44830855 43406378 42204105 40968806 39567486 38597686 37379152 37254635
14199 37254635 35925957 34905699 33959177 32866832 32061146 31462465 30788350 30026814 29644633
14190 29644633 28543134 27995741 26894756 26693063 25600928 25359073 24675575 24378561 23941037
14181 23941037 23348139 22644099 22361270 21609046 21355779 21031595 20887563 20467703 19856289
14172 19856289 19309399 18904023 18455910 18398356 18049108 17623662 17418087 17178901 16641305
14163 16641305 16149575 16265931 15829634 16051752 15462030 15208056 14557734 14452292 14380378
14154 14380378 14050416 13715508 13359675 13828820 13283916 13140893 12883300 12867983 12393930
14145 12393930 12237125 12212102 11699388 11581298 11438626 11306778 11110770 11103496 11005766 10992500
14135 10992500 10385663 10617103 10224332 9993798 9922461 9745690 9899459 9495340 9213135
14126 9213135 9498349 8994839 9086195 8929087 8870994 8829264 8527035 8536284 8131158 8131907 8086725
14115 8086725 8282501 7790297 7848077 7638969 7823518 7486031 7388815 7460145 7092704 7197661
14105 7197661 6935556 6782319 6546036 6710852 6989639 6792329 6623353 6314318 6210976
14096 6210976 6058699 6468740 6175870 5922558 6202971 5882927 6054174 5909355 5506035
14087 5506035 5662005 5572169 5537311 5737312 5656503 5251936 5428163 5258747 5351932 5516921
14077 5516921 5173312 5330099 4882628 4724309 5000791 4989684 4960814 4800761 4531276 4454927
14067 4454927 4485728 4654303 4707113 4546595 4800065 4477342 4322602 4200330 3889536 4090509
14057 4090509 4136067 4197992 4102963 3922413 3579951 4226350 3846966 4003822 3934951 3771784
14047 3771784 3711157 3720141 3583449 3957859 3601014 3870524 3859547 3424844 3717051 3700655
14037 3700655 3610036 3465986 3293042 3341538 3315160 3334546 3025935 2975579 3502599 3101517
14027 3101517 3132499 3025904 3322499 2974574 3220029 3113571 3030107 2854319 3011851 2689286
14017 2689286 2956350 3074434 2307852 2728431 2395264 2703565 3165075 2373258 2334149 2457214
14007 2457214 2678989 2504644 2596017 2441123 2741019 2296984 2425895 2458276 2061950 2257236
13997 2257236 2483323 2260789 2459273 2666853 2683853 2682188 3314606 3848371 5256081 8830416
13987 8830416 16375663 29897183 41586378 26453509 13877598 8778858 6708130 5159255
13979 5159255 4077947 4404616 3748764 3584674 3247591 2962068 3063082 3007428 2997063 2801733
13969 2801733 2741618 2769022 2836744 2813301 2480410 2582852 2546379 2243133 2039262 2667950
13959 2667950 2220148 2359793 2112213 2378519 1862094 2025153 1948934 2002050 2265402 2212801
13949 2212801 1808338 2187268 2056479 2199946 2073274 2210530 1984503 1797934 2086208
13940 2086208 2025097 1990494 1662125 1986645 1688251 1682197 2012695 1927245 1516758 2137060
13930 2137060 1841351 1877166 2053486 1648476 1672499 1827661 1697316 1950191 1367466 1669438
13920 1669438 1576509 1716564 1862611 1912171 1914001 1819516 1776958 1451491 1722869 1310479
13910 1310479 1801532 1404561 1624576 1215724 1497322 1713097 1812683 1193335 1393335 1406933
13900 1406933 1610843 1580995 1628300 1527016 1745442 1450983 1791840 1352636 1648431 1575981
13890 1575981 1803491 1482088 1374708 1502801 1080669 1381746 1313294 1453150 1327003 1612590
13880 1612590 1348834 1398313 1009254 984194 1276224 1009339 1643967 1168456 1223720 1154776
13870 1154776 1268250 1089391 1449455 1426122 1150080 1501565 1383906 1307857 1325878 1198983
13860 1198983 1200580 1133315 1173524 966457 931150 876755 1224856 1072484 1370007 1116142
13850 1116142 1048987 1017878 940959 1074859 908896 1193013 1000269 1019016 973079 1051955
13840 1051955 1021141 1121560 1099440 1166338 904232 927574 1127842 1048224 1336732 957115
13830 957115 912291 985835 971522 898042 1175706 878812 1130151 1172103 961297 773448
13820 773448 643504 910731 1213597 1062828 940327 1025222 1213316 1054097 890271 1059093
13810 1059093 970580 733008 920472 942303 851068 842925 949584 963720 892870 1037327 791133
13799 791133 1102978 902640 940299 604099 919462 624342 768371 874488 601201 863268
13789 863268 725859 902869 778913 472701 939523 673384 739104 680752 910779 386260
13778 840471 721926 889170 845968 748682 745141 823260 891188 821794 743109 1073239 860227
13767 860227 605495 859789 797555 426226 803248 496133 704120 888709 501140 858131
13757 858131 422721 1165159 1041136 684360 1182011 581544 656260 1003100 456167 497562
13747 497562 612393 728449 439740 541045 1058233 499484 706786 753534 1003456 589127
13737 589127 982797 754574 679945 676800 364358 719332 1110496 305570 382724 502276
13727 502276 722817 495384 645039 211603 898086 320231 748069 749074 611543 453074
13717 453074 819765 457020 472126 548754 543003 738820 568676 439230 94681 707969
13707 707969 777484 456292 597675 516825 797984 696223 766022 413608 542595 481375
13697 481375 394269 586489 525162 257324 265238 646291 447618 545407 590275 190837 447204
13686 447204 533842 497661 832160 435836 236734 206686 664075 746876 684635 373301
13676 373301 565228 243608 775523 245048 575967 275735 898098 693650 240539 132981
13666 132981 359895 440840 726308 479895 381880 579223 153426 508318 718278 866227
13656 866227 435194 226096 678053 498507 469982 769746 407234 705851 63557 667544
13646 667544 326725 475243 138999 631867 357972 580913 -184275 341832 245231 608002
13636 608002 636743 523220 566210 577953 702995 358384 886868 496826 355554 539990
13626 539990 479647 583946 327087 488529 372468 777884 448011 245157 522852 404955
13616 404955 215847 606022 476437 259741 297172 639944 619422 476104 766032 127952
13605 560437 277497 389073 231343 261086 332884 549809 670289 491288 536264 491356
13595 491356 378029 337955 790198 198558 330755 330887 447421 595015 854244 240407
13584 437763 307167 237460 578947 280280 153935 410502 367750 330499 393492 305817
13574 305817 353059 497286 409366 143569 191871 421694 182090 254507 260412 431476 665254
13563 665254 437020 293616 454834 121002 322885 173537 419717 414167 467709 264574
13553 264574 165310 202345 474392 349813 234592 520984 427090 206610 339284 450070
13543 450070 346922 326115 372854 413406 165620 181954 -52491 511962 78204 20456 385543
13532 385543 415116 122835 120231 246927 125933 207609 20271 6749 386930 556128 297541
13521 297541 -26045 338169 352797 406436 298746 150631 161986 218655 168681 -135784 307023
13509 95397 116797 699694 420811 262280 161155 589448 424877 349279 311075 263426
13499 263426 301896 225785 390939 433492 343671 379337 822840 -168808 306624 163930
13489 163930 427868 186220 166899 426280 318321 505662 255848 422692 225988 105322
13478 323028 26870 249552 466701 81531 15436 225781 209309 211748 185594 300938 220602
13467 220602 358143 280599 378026 -113394 119942 299300 168895 287418 327433 9376
13456 391052 123954 357234 -15719 19441 231581 296405 69353 247256 268897 530422
13446 530422 -15381 647508 246943 388868 22799 76274 34299 134183 479625 -70128 179694
13434 -122574 247874 107743 445264 512979 442763 442303 -81049 314587 301282 275370 287578
13423 287578 319572 321086 -104945 450041 245547 420894 110701 15617 208591 24757
13412 284199 -124200 60356 483736 217985 66049 281538 39862 13966 411938 45320
13401 346390 195391 171311 407920 13673 177433 140383 253082 209029 179368 382626
13391 382626 266564 236632 219140 146156 313428 6016 241735 242030 -24286 308466 -129074
13379 243741 284783 97477 365805 103182 214952 226108 27870 15121 251279 541718
13369 541718 47049 119329 336991 286365 122496 322428 -26909 138674 317507 410017
13359 410017 263832 82901 -44135 379255 199551 417741 230311 323750 55468 516647
13349 516647 2696 426285 354321 325503 471029 267620 377069 295674 147710 -119312
13338 253470 253752 -101158 145503 -29365 81033 -3354 367137 220893 327389 278335 206599
13327 206599 304709 173094 -110941 126609 403080 211026 129712 63036 156571 174539
13317 174539 440404 -66255 20255 157643 183050 139336 433599 -16371 358894 -80810 -9405
13305 -18591 303308 259568 289170 -142519 316809 -132192 300535 248907 132859 260828
13295 260828 41434 -77503 330788 -1685 18703 52682 253258 136555 135756 197381 420771
13284 420771 115916 -15232 253489 232245 409065 295419 154201 79450 223757 167630
13274 167630 315462 201316 83992 -50977 378800 322552 -99418 157118 -11981 194839
13263 -10694 259460 377530 314555 170442 41469 279372 597697 140267 5410 361193
13253 361193 153627 -267690 -20234 317339 -77883 -46740 304638 284392 190658 34410 252406
13242 252406 265667 62901 -114942 279280 17226 147249 267229 51411 179798 221068
13232 221068 146612 263467 78969 235820 -219204 -162599 181119 -37926 -93062 360155
13221 -75659 150844 135858 15071 272261 -94776 144526 239682 234706 40261 40928 71889 -64983
13208 81063 279082 -32211 213560 322751 246388 186655 -105842 -210726 -223958 169827
13197 359998 -149549 164807 128156 -147504 257840 -54559 -30078 208688 9309 169874
13187 169874 298081 214764 146423 185552 27201 34960 320542 -97888 -264900 238567 402582
13176 402582 -257164 286643 102767 101309 304935 -25122 34829 141110 264003 133397
13166 133397 25272 150420 95422 181282 212406 140368 23041 -216224 -73820 -149267 -5820
13154 353063 224752 47048 128191 -216187 -200 185839 80271 127218 177029 258777 -105061
13142 218757 86558 376995 356257 -152446 -61666 151568 77668 202112 51419 122797 -103475
13130 142010 234249 89057 -94881 147113 243605 214457 191724 -116774 214785 17156 41064
13119 41064 -92868 16485 244668 90398 32153 18647 25799 84835 -225939 165849 -69360
13107 79892 -239380 85971 -46662 75949 -55607 3933 85625 220364 87999 304074 214248
13096 214248 -20298 194136 1108 217104 88277 1216 72225 336583 434047 266716 285787
13085 285787 -58322 266602 196844 -28223 267099 40787 -24626 -101603 -9457 51861 -361456
13073 102786 112556 38887 155640 -19545 358297 28203 -61797 178385 147485 255794 -24250
13061 476144 148505 41746 194852 162820 154588 -48669 168797 241844 342849 -50558 616101
13049 88305 217936 286707 157025 44469 84106 -19701 290808 44801 47954 220069 70294
13037 103609 149586 322146 93861 -67441 110241 250821 50835 206946 140529 124231 103341
13026 103341 -56595 153475 67783 311906 118525 -90940 9326 218648 237743 -32644 428205
13014 137848 224575 -43583 -275130 244976 -89057 -229090 112779 31978 -133781 399701
13003 -359393 -88670 135183 287541 166044 572809 131897 102306 25979 68129 -34392
12992 66717 199675 -388688 -44371 112740 147826 -58506 181956 68186 -227397 -166793 111750
12980 -58917 73272 46534 49650 124186 297746 118121 -67538 20019 -59690 111054 -319684
12968 254157 293446 -87243 266040 19207 98039 115412 -170849 125853 -62193 -63680 422217
12956 -40571 -369087 -163391 262521 -76794 -91807 305817 -115830 -114825 213606 149483 8330
12944 90375 -226491 586259 -211230 90734 221000 84662 131682 -339567 -14634 154873
12933 -141190 177847 321786 517647 141963 351140 -806 -180310 202915 207712 -51994 -155187
12922 -155187 -183680 -108300 -257104 54061 -25915 -81254 506362 157388 197862 320922 -178575
12910 163806 22429 253997 153586 -223132 43636 271671 -280312 -92567 246849 -82520
12899 177334 41674 197825 -161325 16193 204336 122345 -137112 -50978 71676 -93670 182
12887 345529 146549 366991 166411 67391 97167 436480 48233 166868 201767 283874
12877 283874 -153030 -59268 92276 -142583 105273 -457550 -44067 -185532 156448 -150519
12866 -38480 -66448 71577 134499 -118456 -230745 -54300 67864 -97171 218958 305806 136744
12854 -19303 -337779 -170924 50677 46009 198977 141303 72660 149357 64140 -286851 276100
12842 -232239 45111 359484 35842 284348 -72155 -92722 -78742 208729 -247625 -5282 -26846
12831 -26846 -105791 -386553 61200 39436 -177799 153851 -85675 64764 -17480 203059 -45392
12819 119895 -27937 -191319 -55537 48326 -142085 198613 79299 17253 180565 108847 -52548
12807 -40303 67770 250377 423207 323519 297832 59133 112780 6311 64144 -45985 83112
12795 -172802 -279892 -45515 300919 270807 182972 33146 -100898 683 235935 -123211 442175
12783 57332 97495 304834 168363 87487 -204059 -376310 205931 279166 -9811 186989 -46694
12771 18606 -81270 136237 219679 -55718 328302 100113 -281555 300061 85469 175841 38162
12759 108640 41924 -223303 -46582 -216125 -105202 -164862 295966 49514 131004 17558 262883
12748 262883 -96439 -177021 -356503 137626 -45055 35646 43206 -179735 -192980 9944 -176690
12736 91417 5414 104532 -112878 51651 -8047 248859 -21877 44191 78761 161850 -6939 210471
12723 315866 244664 43259 -110002 135202 -66201 120461 -3137 -316824 73666 145001 33942
12711 -39515 -53069 -140460 -93586 -64450 394291 -134974 25956 59161 -32454 87449 195342
12700 195342 146920 189963 253156 178828 151104 146542 127745 -59880 50568 45645 -71821 252515
12687 -46632 -42553 -11200 182028 5875 274169 -120724 -343553 445569 273354 -31969 50070
12675 111511 -213613 90905 -9378 284933 288708 -144228 -137335 61027 321763 -62675 -202245
12664 -202245 -40990 -253296 174111 -125532 129455 140444 158725 135863 -318183 106375
12653 167325 27276 247513 184182 109971 296869 144686 -10351 137 -96847 198317 97571
12641 195056 -83576 161439 239854 -61055 -189581 55773 232949 125593 -331343 -262999
12631 -262999 -30647 554769 507157 145056 310452 24656 82537 -330079 430120 -129943
12620 80114 259268 14292 216676 261792 33586 -322146 275580 -77041 -56473 187506 181570
12609 181570 235872 -96068 -306517 256215 -253821 -218200 43734 79460 182885 -176100
12598 260253 95347 207448 -133125 280367 117151 283848 -1116 123521 188031 -208155
12587 -326888 215757 -306988 -130063 159804 -39491 -9358 202874 103976 -324148 87042
12576 287853 -18044 -86084 101497 -36270 173395 -60264 281484 -87129 -59442 30572 52917
12565 52917 -124513 -20300 298570 130468 96155 41623 236470 145496 -44394 76373 258692
12554 258692 271146 -37154 -92201 -245243 -158418 -200099 -285719 93182 82982 53479 44044
12543 44044 -67688 -30676 56530 182450 87630 -16997 168473 47807 -87086 53254 -111767
12531 -55078 -40691 49320 7651 -114867 -488582 25750 142914 98142 -132257 39848 63987
12520 63987 47008 237531 168662 148816 -104114 125585 -207830 133540 -41383 239433
12509 37542 159570 257162 142335 143772 25994 197359 -35177 -136887 55424 70298 201684
12498 201684 -49683 -17336 -90911 74557 192140 181569 -227059 78067 131901 -96136 171562
12486 -67187 133558 -185114 -8477 177021 246099 -425105 -52185 -46822 -172714 -196829 198321
12474 25824 151322 -145050 104222 73011 39850 83746 -66009 143930 -95725 -139425 156628
12462 317663 -55838 -1978 96771 92996 189866 -4181 279249 157818 -58738 56397 -146811
12450 60684 127399 53207 -47138 -127379 5527 -236617 -358836 -62781 164376 29043 94979
12439 94979 -47491 -184812 150489 -376469 23147 -279351 -284200 -119385 241431 369874
12429 369874 -121865 135925 178921 247520 257757 -434053 -164666 96951 -260062 127347
12418 -186140 -93532 -150693 -4321 -70531 218461 132552 -90500 57239 -203292 18545 -105646
12406 -223099 -58464 89843 -42031 -96020 -38149 182382 119343 114067 13103 -73559 -134064
12395 -134064 -148703 122829 -172020 -28539 -198917 -100473 272718 270690 -55488 40780 266053
12384 266053 -119285 18596 181911 -16702 167597 -30888 -374269 227848 -59912 -125173
12374 -125173 108200 227027 310364 41159 161149 -79740 391396 -208916 -382875 -131800
12363 56109 40156 89860 -43546 89592 -315371 67237 -195094 -93056 -42133 187993 217106
12352 217106 -233 -67658 78202 -59064 -136987 56956 -195809 57154 -98847 -143353 50648 -252316
12339 -240444 90871 -160566 -16011 -187117 297925 -53657 -178200 156734 -77393 -71007 46933
12327 -24589 -22250 -16004 166104 265868 -211790 111326 -21724 155880 147674 -90525 146511
12315 25851 -103452 209150 303603 27380 243532 51946 8890 -263829 200704 -318729 -299345
12304 -299345 56410 68781 131003 -82386 -213268 -39638 -352435 34748 -99587 220937 -47447
12292 -150613 43755 58576 127794 -86401 71344 222084 -391462 -158861 211718 -65650 -187224
12281 -187224 152993 12807 285807 -355 -71406 330560 -46756 -2078 -161315 -105573 93668
12269 -65643 334500 -127763 -61766 -70559 -135200 -81425 141314 137084 108705 112019 -91238 329178
12256 363258 -79944 80803 -175591 142597 116016 9761 96022 173541 -66701 21093 277211
12245 277211 82957 -84451 -12941 119596 -56183 43015 15293 339446 -160166 150396 59642
12233 182220 37033 174056 333910 390024 403475 496317 -40017 147453 192741 345710 417971
12222 417971 236524 221295 101557 47299 160774 60453 113311 250446 16639 98521 77721
12211 77721 188359 31127 222102 196752 195511 29599 183761 181876 174924 78420 10171 119202
12199 119202 159973 -192421 25594 -168427 207497 348066 326979 142623 50676 123309
12189 123309 95531 166347 135460 91072 414717 119916 141629 -71725 -118106 59616 -212169
12177 156286 90964 325961 103766 283461 -78850 231453 17597 78034 -70633 22823 335661
12166 335661 254673 311016 127157 -305357 238374 165723 -185515 402550 166529 -229059
12155 131131 -43782 -278391 154204 83629 194206 204916 -50256 112863 -37865 -153652
12145 -153652 238781 33785 -155797 -260253 209157 -153642 184905 -268921 188447 110849
12135 110849 205183 275621 254525 -117668 -128564 -110390 -60217 523913 151638 4496 99260
12124 99260 487513 62854 -87254 -320723 247241 273518 69469 -125360 -148626 -114695 70188
12112 104700 106348 70076 -307708 185751 310094 130563 164964 192416 19291 95349 124
12100 -41736 129847 62689 -286495 -248419 60511 -407807 120135 303266 222049 -238386
12089 -26249 -19674 4025 7812 -232274 221700 -68939 -7589 -43421 75774 189508 205113 -187112
12076 -85350 232984 63257 125059 -238843 42708 150135 -263029 -37343 259722 3653 -62225
12064 418387 -195688 -48376 -3667 179233 -81470 252186 80974 -58139 -34368 213837 -173530
12052 205903 12990 255894 -22828 189967 85406 182647 -170751 -109490 -51918 -104651 -144328
12041 -144328 425748 964591 430689 114454 458055 -376716 52576 186067 302896 -105241
12030 -40886 19301 138497 278127 -247333 30900 -92597 -61201 -164057 269625 8921 -189325
12018 153114 278642 -371677 -50290 -127641 -222605 -78374 9383 5254 -62484 191367 -98524
12006 -106570 9355 84535 45635 -279719 -338804 50395 -139819 -160367 107647 -351370 -26781
11994 -293084 -15123 -279740 -161555 -151478 21326 -223429 99077 166219 118913 -127546 118258
11982 169929 20666 -25843 -43468 49610 -259031 -98501 48551 -578781 29454 -227176 251290
11970 -148228 -220285 233050 -132556 153534 55438 314 249654 -236087 -215362 152352 -3417
11958 68747 -165068 209586 -27934 -14795 41259 -39036 164209 -362695 -18188 -205401 169215
11946 -68134 99429 250875 -299646 114506 71718 23910 161161 -247273 147915 45692
11935 -60287 -228320 32555 166296 269887 -451765 285850 9741 -171081 -366527 -147657
11924 -126282 31545 -282910 86460 18244 139711 -168387 -111415 174486 -217512 -289278
11914 -289278 123331 -123847 70929 -205977 -228160 -169658 248858 284957 117809 109610 -335826
11902 -160076 120015 308783 22416 29524 -15283 -27631 26648 -142290 200084 -48286 -103807
11891 -103807 146062 -138826 -346050 -250004 480102 -398074 -196964 96918 299089 -135341
11880 38549 -143777 9885 10238 41977 -4841 111484 27335 38590 -153111 208323 -181163
11868 178331 -141269 61330 69739 85236 220078 42917 247473 -125326 -99655 29123 125988
11857 125988 149343 -85201 210983 426698 119055 -13595 -233290 32411 -55293 -43226 -94296
11846 -94296 -229990 177340 -102133 -457558 293306 -164509 71387 -169770 -214584 -102228
11835 144667 50178 -332999 -12658 243205 130571 193538 81431 -151249 -137393 120033
11824 76708 -360764 -110847 -233429 -302174 35574 -50554 14710 113461 -78669 206990 342423
11813 342423 63002 -143658 -114961 257839 -13919 -91665 -266567 25237 -401082 -136842
11802 -69744 27214 175610 -175836 -194223 93444 231856 -279552 -86905 45602 164305 -140694
11790 131119 -57991 108581 -282089 34751 175230 -175759 253581 -186994 55793 174754
11780 174754 -129219 -315284 321690 4006 4762 -8653 -77559 -3834 -9294 -84633 93821 -140668
11767 37455 84496 -15083 -244375 -102516 31177 241386 -134649 181306 -120960 193064
11756 152199 172818 -234610 -118665 -85311 2047 -14002 -276104 -95973 63803 -85786 38319
11744 48801 474766 143796 -284739 23432 91325 -36801 -148165 -80962 -207045 217961
11733 -163312 35537 125922 74059 25468 -224675 -33444 -19079 21183 -93641 37404 -322275
11721 -366513 152961 -172113 -30437 -21323 184899 -40143 262598 -276250 76651 -266774
11710 -324586 -77391 -9553 68866 84734 -127140 201649 15457 17741 49288 84094 116205
11699 116205 259691 -365600 -160406 140733 158255 -268358 39255 273115 146918 54263
11688 -167697 215267 -232254 137658 94665 44901 -48805 -48366 -109098 34848 -112654 48604
11676 -74796 -142846 114250 134267 12800 -160041 -3823 -34490 199500 -205841 -142536 -375555
11665 -375555 -162432 96194 -54970 58490 -269705 -323459 -233366 -73535 -88437 132507 -2257
11653 398264 -92587 172933 -122222 -206035 66359 42756 -28996 271896 10949 194715 4033
11641 33425 140241 189907 -270065 72730 -203304 238504 55270 -241233 62995 197001
11631 197001 159106 76005 18467 68888 -235933 255786 -28127 -105822 69259 93575 -93727
11619 -40075 -58836 -54962 59897 -55182 -211259 -85109 -146813 45291 -164588 277327 -116550
11607 78239 -117883 -48968 325452 -351781 -16652 -70856 -10604 -153274 -85938 59318 24485
11595 40886 -8490 -30382 99267 -173078 -376663 -3101 23117 -130711 168793 -178303 214485
11583 196637 262805 34027 -64194 -130495 -18927 -224983 -26471 125569 -195540 314509 -148545
11571 275087 305232 -150718 48880 353444 -136588 -92881 241495 99775 116820 -80080 -121936
11560 -121936 -124905 183020 33436 -115901 -58394 255244 159051 94263 -117434 -221439 -142047
11549 -142047 -23725 -42873 -33928 48488 -20311 172583 -80008 175931 99067 108671 139769
11538 139769 -81773 -23760 123758 -10823 30539 -275820 -47308 -98524 -66283 284551 -287031
11526 -118100 -67778 229837 304053 -235346 -61351 65752 281017 389115 132595 58341
11515 263804 34436 -19046 -106853 -265578 -34981 166706 398261 3553 -95305 390521 -149308
11503 86079 129305 -70136 14017 14876 181644 -97066 32629 -97601 -71312 -71565 56938 389794
11491 389794 -154110 254423 79354 291692 202212 373275 181960 310286 -273500 -61030
11480 122789 -23252 9311 161606 275082 423437 83137 214853 239926 255528 362619 -205172
11468 -241273 137011 276669 218055 128902 -139776 -275906 158063 -197986 -44766 100805
11457 -102229 93704 134290 -56290 434924 87472 60025 276670 -152979 182423 291040
11447 291040 -28883 -31264 -13593 36518 8276 29757 -83534 57433 3344 34504 48219 141685
11435 141685 -145758 106068 -177656 262300 67144 39464 262800 291107 70928 65804 -160324
11423 7923 -95504 -35236 -3043 -212456 21017 113191 418151 234244 140003 132409 12441 287600
11411 287600 149503 -18090 115284 -40449 71296 91108 -76155 -33804 -156492 -195321 -276303
11400 -276303 221943 112999 -129295 -66280 231870 118813 -96884 -32223 -248786 87274
11389 91127 343162 -242157 -63699 85974 422919 44777 -316676 -20843 -49955 226867 201199
11378 201199 271237 -72689 113670 83692 123220 51341 70385 -41566 142742 9483 157406
11367 157406 -323695 -53620 -82360 -231339 -334659 230450 -72184 265975 -157124 -133232
11357 -133232 192551 278454 -17443 -72133 -174825 -151661 -140732 152943 -181150 -85803 -91459
11346 -91459 234288 118490 138161 69618 -63266 -49881 217969 54355 180066 -172718 -88570
11335 -88570 -99686 185310 62305 -107755 14146 -148397 -283354 -297078 88988 49969 4750
11323 -48753 -390901 -141610 155226 -232835 -44189 -138758 76655 371384 -178092 222008
11312 -39583 -452025 155430 89584 -191364 99087 -47840 -198555 -77380 -182219 -85300 97033
11300 126429 -94996 99095 154475 379631 427545 -149414 -130423 -479448 -141358 8316 -178695
11288 -3143 -17390 182516 212407 25564 126681 -56944 -250673 -77532 65318 140911 -171001
11276 -276518 -178002 -177248 -315898 -333073 -99059 87396 -65866 -15060 48704 -21256 213627
11264 -135784 -185666 115716 32728 90497 58286 33959 -137151 -425331 -204668 -349545
11254 -349545 -309824 354963 -87667 318380 -196735 -139518 -16882 132227 -105871 219753
11243 -129918 -407587 -591814 -187111 -196870 -220819 23696 -229317 107937 -40357 302051
11232 340391 -224405 94365 468985 -33759 -107755 198359 -27698 -90417 -31575 -236221 5700
11220 192064 47208 109816 -134216 41066 -225818 20494 1119 -328991 -111547 12601 -148671
11208 11988 42272 -72673 130177 261201 147426 297564 -19449 77129 126610 59562 71418
11197 71418 135177 124525 77138 -145594 6759 -18432 4550 -116480 -178956 -211861 167801
11185 -287445 -139921 -430348 -153771 -78213 -132325 -274568 -447517 -436496 -71184 -80362 -134472
11174 -134472 131107 -362939 4925 -147400 75843 -278917 150340 -30031 -168360 -68258
11163 -3448 345294 26974 197274 50876 -120125 -96269 69840 -113920 14120 -116444 380468
11151 -139235 115850 -111701 -162762 237679 -170103 -33166 -77843 17538 -196049 -214327
11141 -214327 51852 -11866 121823 389678 -127881 102507 214457 -18973 -31623 297019
11130 -223051 227117 -229057 -14118 384759 -19906 73859 42007 203408 32499 102604 -63848
11118 -143990 140859 -42348 -93173 -130555 -51968 134725 -304468 -22084 233448 333804
11108 333804 -151697 -238086 438208 88290 -1874 68319 86493 348835 264784 -51100 203713
11096 258496 -22091 -81769 -36217 70240 143833 21323 -47329 321659 6112 442906 82612
11084 -65874 158243 -12224 184654 182078 186361 451135 127972 128345 49029 197772 89620
11072 225417 409014 154511 280177 276398 613568 176724 542216 148030 432259 393997
11062 393997 -2556 276275 592192 691323 375476 543529 623907 309612 561963 310611
11052 310611 620999 558587 646293 625437 856884 626638 518096 535493 556138 690646
11042 690646 388370 660546 655741 554435 445850 842587 585339 632469 631927 623980 455224
11031 455224 833781 572667 479100 586605 818846 720704 699819 605710 485198 324159
11021 324159 428329 268087 173510 327065 468444 444513 457712 569702 421789 886394
11011 886394 603693 932695 688150 344685 385482 719659 590091 736529 272865 630424
11001 630424 514806 603547 864907 722959 491734 218701 447521 824172 687424 383875
10991 383875 440162 312229 579436 528155 651020 734793 803897 981788 1097611 669420
10981 669420 867296 960218 1372617 1245754 1416854 1243272 1860223 2070165 2326924 2555427
10971 2555427 2535732 2406128 2149384 2318489 2012101 2188273 2057168 1556180 1212696 1346111
10961 1346111 1198867 1541497 1680034 1470702 988495 914342 972115 867243 574403 842447
10951 842447 625061 322612 270204 142202 228729 446297 96314 490386 306876 90085
10940 217592 -61461 126847 225580 -112673 599995 95736 -330320 53314 -186479 212538
10929 -23896 236624 181311 52077 319882 12379 -15668 -46711 53625 99919 64681 -247534
10917 -196518 -136439 194253 -204919 142073 169703 415460 91847 -124340 119122 97502
10907 97502 -219541 -40241 22060 -197720 -340909 139754 -66991 -70879 -146197 -23827 -116017
10896 -116017 270898 98716 7560 -222641 180873 -322664 -229567 189140 21847 -52497 -121857
10885 -121857 177077 69414 -260273 56408 23999 82157 -310299 -105958 -110311 34588 120371
10874 120371 -92152 180608 -60027 -159446 253899 186912 22975 -346921 -211602 -110523
10864 -110523 120711 277053 66149 -109305 106959 -10435 -71646 -108183 915 -342752 -238935
10853 -238935 10488 28329 -141050 -136245 -114845 -200841 59161 -211468 45627 106636 23287
10841 220408 -334592 152473 10154 -156959 -121886 -152578 160274 62270 -22226 68010 -168424
10829 70361 -299866 116916 69109 -222443 144071 -16102 139611 -504349 116831 -25480
10818 -150243 124895 -210194 -104701 -297324 -75032 99991 -287954 -67578 -236742 37266
10807 85249 -33228 -51089 -2424 -18042 3228 94873 96249 -77858 -71273 -302892 257180 -50243
10794 108816 -52145 -166822 -371996 -292533 -280165 31441 239055 -119062 -92940 -16120 -73636
10783 -73636 55360 175158 -94150 12410 127561 -14669 20075 -39806 -118086 50731 -309706
10771 -118941 84902 50050 445704 107377 -204546 60370 -28478 -285604 -91951 46674 44151
10760 44151 -93682 -168357 -170451 -85730 121481 71460 -23983 51965 -169419 33271 -44518
10748 191886 203978 23811 -153327 133665 -162939 99175 77185 65304 -131132 -311437
10738 -311437 -215099 -217073 22652 -9199 188159 -95167 -49298 -93359 -10624 -255197 -155278
10727 -155278 -20732 -14184 -21884 113299 146065 -187308 250960 40136 -281558 -52333 -183558
10716 -183558 78024 -195117 4867 -207550 -100778 -122139 -78360 -389529 32409 -241688 27945
10704 -57577 221951 194601 104924 -36361 77541 104144 -259954 123578 -6247 -237385 -84581
10692 -377512 -417174 -41867 -327445 190188 42300 130145 -207811 16791 225621 -244267
10681 -124622 -109591 -231076 149812 26789 -104140 85385 -26934 92056 213575 -279759
10670 -36679 -92688 -318155 -127972 -225070 155614 65424 -228213 -329963 176286 -88661
10659 -48591 -204970 110240 132387 -43006 83996 -183400 93204 -26961 -298704 -92274 -99240
10648 -99240 -85837 -325480 37273 -382928 -73147 53697 -327729 89648 85050 33022 51022
10637 51022 111333 1981 53390 33940 -26391 -81168 111404 -98050 187039 -5973 -385212
10626 -385212 -169551 -225039 256083 108755 -36541 -80555 -158589 -171232 104667 -235826
10615 -159166 -258630 -234132 -166352 -102005 -256173 -260443 220152 -7185 80308 -250790 125861
10603 -47569 -36746 2293 -63311 143952 23984 186448 236878 -34392 10868 -55281 -117050
10592 -117050 -20370 122706 38410 56361 134517 -152248 -150143 292428 13079 -71239 -40742
10581 -40742 -59084 113511 -388128 22046 -81907 -51005 -318995 -123635 -179670 -90390 -217803
10570 -217803 30029 -110246 -232013 265460 -163112 116045 -327187 123053 -321721 55443
10559 -86835 -91332 -21704 322027 -18723 75059 1247 -132968 -95461 149753 -240982 -313855
10548 -313855 -98482 110294 -46242 -263412 160690 217817 287103 -212618 -26232 -152354
10538 -152354 -26690 -108913 -180266 91385 169737 -175620 -74467 67500 36062 87004 -138322
10526 -321544 -150688 -328565 -11623 -273799 -169400 81442 -141313 346296 7983 -237778
10515 -307264 204036 -180413 -48183 -321366 -362901 210595 -208615 -11361 266212 -97006
10504 -71843 -18735 -171657 30092 34031 37653 -152355 161031 -209943 204408 14578 9297
10493 9297 -59721 -246501 -65986 285692 112961 -1592 32628 -176654 -48135 -111169 66902
10481 18935 246616 -214009 111448 211327 -136877 -358685 -69124 -55767 -200675 -275801
10471 -275801 79516 -106310 -135965 -260114 -12090 48666 -25597 -102774 -189970 -122433 -235279
10460 -235279 74579 -128958 -45623 -208388 -331661 -284015 250513 -84737 35550 -93520 -251669
10449 -251669 285125 34288 93517 -240524 -41677 190714 -125601 -192050 -23979 88357 -336202
10437 -242414 -108839 320066 -296574 47072 80086 -82868 14598 230617 -356453 -137643
10426 202753 64422 -105182 -218671 -43470 -296090 -182351 731 29372 -116196 40353 -1918
10414 9379 -240301 -49476 79516 174935 -4485 220841 -195797 163773 181000 15924 -106202
10402 128535 -126276 -49316 -253684 220634 -220232 33841 -234713 -232067 -119094 473607
10391 172376 212894 235824 61223 -151818 -56336 -115535 16501 124118 -117169 180497 54523
10379 -323172 42605 813912 356374 -154524 269366 176610 181063 -66933 221187 369830
10369 369830 544194 168665 12070 618464 49398 313096 199371 338649 85901 308313
10359 308313 -128481 251788 61525 124584 -262349 308939 35736 354715 463172 733571
10349 733571 418926 312758 41763 305070 306970 127867 381629 -43003 119624 -261776
10338 349460 -150809 372123 248015 226967 201995 129284 -94241 -97418 278976 -19951 -43319
10327 -43319 -54194 311632 -94830 303435 -2826 61642 36616 92239 -70824 118940 10012
10315 -100715 -165977 -161547 -237351 -24078 161287 -165400 34629 -124672 -88705 -17046 103972
10303 181998 -182835 -3498 129802 -228975 212648 154297 141107 28588 14383 149939 -225225
10291 153223 -356679 176192 -27090 -9539 146873 166499 31267 -223766 -33406 -44942 83238
10279 -34596 102375 168565 203770 80702 -160882 83624 -87788 -125734 41729 286620 395445
10268 395445 35475 -59792 -217153 94148 -9225 -66436 324731 102683 177438 435009 389311
10257 389311 385944 232189 240424 270624 -52563 63633 27143 165544 327617 47463 -112741
10245 95699 -220543 62645 6818 318751 -103153 100467 159852 -52874 172516 189121 30308
10233 -86948 -66557 144571 -11464 -48252 -178113 151910 -69353 -216073 64947 322859 -142482
10221 -22471 42427 1487 141207 162898 -294881 -171179 228239 94932 -230207 -276602 318842
10209 208657 -82438 6089 -204634 -253698 -69363 21307 81301 -48720 -27252 -82177 109814
10197 360100 9914 -188515 -306566 130522 11139 -13891 -205514 171146 -60077 -332757
10187 -332757 -185558 -183892 -32806 -6866 -405795 47441 -274302 -154229 184577 130573 -12838
10175 -330970 -17312 -149339 97782 102339 -48712 -46836 -114186 -363778 -52267 -38736 -310538
10164 -310538 282307 -252369 108604 -106415 90361 -168013 -284612 54160 197346 -96605
10153 -24522 347826 142688 362834 -148539 73723 -157934 -286398 -129765 3940 -370242
10142 163301 104004 -157076 -320011 -235166 -165731 -315875 242309 28429 -271780 370128
10131 -25982 26748 -272909 -90397 216491 -139353 -118411 -361623 150393 -71991 -69378 -199364
10120 -199364 -155307 83714 -62427 -4495 99679 -94220 -520235 -114496 -40244 -45522 -64009
10109 -64009 46565 -142020 -68938 -79314 -14493 179136 -157456 -416941 -133414 -137553 354508
10097 73171 -255328 77824 -81241 -123101 37765 -131326 -205073 -58269 -309874 -402172 -54150
10085 -447354 -251497 -177019 97565 -213466 -59927 -365575 -6401 59661 -16720 122805 -48074
10073 -28481 -217560 -49090 120291 -238068 -72526 113112 64553 -98917 -168119 -63352 -474134
10062 -474134 12790 305821 -126539 -14013 -145101 -199375 207063 -128258 -125546 -47379 -256085
10051 -256085 57533 38685 218278 -35003 -224488 114622 7257 117126 233399 105845
10040 -115915 -100439 60458 225847 -233423 -34386 51722 78711 -20424 46951 127563 -288337
10028 -79124 40639 103503 -129873 6693 23879 -364788 -3927 -138202 -325028 -11083 222965
10016 -221877 -190509 -221835 -77000 -181681 -140467 -282307 -406644 7481 -190441 -68031 394555
10004 221404 150025 -107885 -95707 -166932 -247764 -221100 -105224 84833 -57602 -20075 -241851
9993 -241851 39413 75844 132798 78412 -185250 -245629 -8996 13689 56039 -3386 54948 93994
9981 93994 -271506 -49808 -211490 242631 -111313 -53905 -172650 -37206 88652 2898 -241767
9969 -227077 -78949 -276266 -39800 139969 -245667 -243186 146195 -167569 52985 -404973 307754
9957 -3861 212103 92690 -400957 -1091 62481 283432 234975 -42666 31435 -100680 -31521
9945 -252399 -216066 -178518 107233 -128312 307343 28142 122937 -102844 -360178 -207158
9935 -207158 15720 -100499 -29873 163860 249809 -116065 -91228 186595 46405 -139267 37249
9923 -73097 74919 -66682 171822 -67672 -233761 247526 76170 207676 -175522 182533 41116
9911 -27707 415611 23084 -147000 250316 94761 -74440 144231 -19273 -228367 -50542 -178616
9900 -178616 52949 71511 103760 -4840 101288 49899 -204227 -294362 -75512 -429339 165531
9888 -33165 -74495 -232395 -40916 224478 -9673 -7690 234668 -334873 -124025 -402856 106016
9876 -51280 3314 -131659 -293 149176 222553 -219841 -190149 -105309 2432 -140066 19494 -35959
9863 -419977 -72547 232865 29449 -153692 -21103 135386 -150242 -123531 -403560 -329712 -227512
9852 -227512 160231 265621 -203661 -92568 225532 -33431 -133018 -143938 18365 78386 357
9840 292399 -237678 -249089 -109842 161595 -259368 -145263 -280448 -114620 446105 -96552
9829 -182599 -47891 -396513 -302338 -393784 119748 -59048 -49142 138767 79932 -214736 -191986
9818 -191986 -294438 131028 -266813 176320 -70745 -38246 -173984 7408 211453 -103313
9807 -188343 -183594 -459382 -52149 -134070 -83208 181258 -423605 -464776 -231881 -79980 108281
9795 -373152 55447 -218436 -100097 192272 -302480 146616 96227 117695 -161052 309289
9784 -58709 -52373 106459 -325539 -7775 -18949 -234016 226154 -187807 143911 -211348 -178297
9773 -178297 -65971 -49466 -355366 -103569 -472442 -421142 -127756 338614 -212883 -66867
9762 260606 23302 67867 -97869 193549 -203273 146365 15471 -179862 -183342 -15571 -339573
9751 -339573 112088 -338031 -243431 -32038 -163586 -77876 -121822 -90225 98887 -227650 31042
9739 -28360 261238 -118793 -24538 -162191 -176948 17082 -152848 -57139 -20645 -146484 -33774
9727 252977 114456 81657 40959 56827 98531 278531 -154138 276546 -366152 -291204 406640
9715 102969 -42505 -400821 -152113 244165 -270534 -77503 4942 100693 105200 -139110 83562
9703 -257824 -391187 85405 -249519 26861 -13821 43991 -51782 184021 94258 63898 -383927
9691 -208281 22648 -109941 -320355 -133907 125785 -73799 -293552 -15357 245865 -413627
9680 -141121 -37855 133558 247758 -202879 -222428 -127010 -197587 87067 -241936 91172 -117774
9668 -39543 160054 4675 -245833 120941 -154613 124619 274900 11020 -357456 -366697 -27011
9656 121139 -52720 66041 -182640 -179072 -73706 94601 -236408 -242841 -140784 87600 193819
9645 193819 138978 214581 166395 -224503 -88230 -88925 63002 3379 169032 27840 70584 -59802
9632 -196609 -36750 -325118 -205579 203548 -235536 277081 -206494 -115587 -157258 21992
9621 -362959 -57579 -28464 -319144 142522 9746 -24471 59714 405862 95905 -195674 73326
9609 -253080 -154764 79004 -120426 -59675 72429 -135900 -157241 105047 -154600 -53056 -230016
9598 -230016 144066 52322 114240 2514 -339663 223698 -158134 -117756 -263398 -44147 -30727
9587 -30727 84528 -110493 -36291 -114943 17847 149198 -14967 66955 -239206 -244839 44182
9575 3309 161615 -100748 7587 213253 -17244 -14439 -366670 39767 48795 -419346 -117259
9563 -29598 -168113 -99998 -27803 33516 -268900 256540 133482 -340375 84330 -359628 59883
9551 -143954 -154381 -290251 -251248 -172303 -41098 186396 107463 134362 -184085 -40900 1171
9539 1230 29962 53650 -171317 20630 7255 -69160 63939 -180054 -290028 -213223 -25502 -7644
9526 -364692 -289706 33141 -229114 -343572 61605 87734 -116265 -26464 105929 29729 -122142
9514 -296482 -235851 -410066 -53538 -131471 186250 26514 -191346 -62751 46180 -35911 -64139
9503 -64139 130886 -140673 -83049 -94592 179567 104138 -52599 -220310 -73462 -194502 2696
9491 -51645 482561 175445 42856 -180022 -95730 -10863 -180394 -241789 -112942 54069 -302113
9479 112361 -116235 143569 -44570 -185778 4017 84858 -61667 -316553 292526 -308657 -57327
9467 -78697 -153214 -47901 -103357 -44112 -138558 -109260 122640 -109195 -71528 -44293 103135
9455 97541 -55039 -307911 -71232 -111152 283385 -473343 -50139 32353 -290662 -83684 -205696
9444 -205696 -111759 -269682 -56513 -968 -265049 -84952 -19948 -199567 -4705 27700 -179951
9432 -121140 54318 205367 -135385 -293810 186151 -186849 585130 -322054 16631 -130194
9421 -174265 270861 -47457 13425 -215149 -315008 -92661 133159 -308043 -88942 -130572 -251421
9410 -251421 116695 58768 69116 -50262 26591 -10645 -201400 -266325 34068 410202 63701
9398 11188 -239610 -155033 -21995 -407926 125331 16266 192641 99085 56978 -284364 -41498
9386 -127225 -200207 46986 -85864 -279229 -242511 308212 -26916 -122189 -271764 -280459 -336480
9375 -336480 -17787 248937 86646 -91081 -31248 -92942 132877 -143834 -51624 -129033 22776
9363 -26541 47274 -38079 -11353 -141830 141429 252861 111907 66585 -12817 14587 -76266
9351 360360 -100418 146251 -177947 144753 -53407 102731 -104385 -128560 -341080 -219612
9341 -219612 -43046 -79371 71158 -136430 -8431 -382274 -174526 -180761 -234000 -3709 -145656
9330 -145656 180193 50024 -104869 -291606 -99214 23279 13433 179397 121357 86579 182467
9319 182467 -250090 -140166 -478944 -159428 -120345 -102200 48309 -154444 -194999 -36815 -66341
9308 -66341 111822 -81659 26289 -94600 -224856 99286 -150223 -205261 -184306 -142759 177060
9296 64554 12263 -79072 13626 -177072 139789 224329 -229516 220012 -127974 -173986 -275073
9285 -275073 -469140 58009 32090 92449 -206698 -204531 25498 47375 -132726 -81187 197871
9273 141115 -452421 253788 -35566 -198978 -245182 -75121 -80794 -168796 183972 -406501 11468
9261 23184 -151488 86306 108132 56197 -71977 -144179 20693 -121137 58906 71643 -340426
9249 -93542 149006 78240 444243 40674 -149642 -184738 -314075 252565 -76108 45308 -116613
9237 89099 -55378 -262918 -16036 -45113 281005 -154737 277151 -56363 -169580 -193361 -187845
9226 -187845 -194071 -87595 93781 -14955 84256 -213846 -103993 102365 88509 129093 -142073
9214 142722 84832 -23401 48014 -409113 -99262 -55298 -348648 228931 -123287 -402565 -213632
9203 -213632 172827 -45339 -73765 -354646 252525 102551 -356066 -197428 89901 -171957
9192 134535 58328 -263866 -122927 -423545 -147722 139333 221108 -264296 119546 372998
9182 372998 -262404 120818 99058 -124205 -145554 -146144 -124200 -32459 -140058 180118 -101429
9170 170023 65439 -168851 -437083 -95576 -2 95365 -7701 -186041 -141177 177179 45041 -45618
9157 -517611 42599 -168621 97782 131321 102520 -282583 -235822 1754 297418 -210960 7758
9145 -34188 -320200 -56001 76570 212508 -353360 -147213 -355189 2109 -262875 -106670 177319
9133 44005 88830 -111960 113601 -227882 -136627 79468 72359 -238397 9651 123184 120362
9122 120362 -76771 41152 190954 -129695 -168626 103420 -198599 -280269 -302096 -105174 15028
9110 -17034 -129685 -173288 -350518 -92386 -75463 118082 -78318 -333896 -27122 -181548 -99668
9099 -99668 -218059 -173894 -241528 -224338 -181592 -102385 -33160 -229343 109557 39452 133705
9088 133705 149845 -78160 46660 215941 119268 -49472 -107204 -195281 -122997 32529 -93094
9076 -356545 39279 -33579 -407204 -14704 243374 124097 -119775 -177744 -89358 59337 83121
9065 83121 -7990 16266 -229992 -249112 142845 82873 -439026 -334877 230953 -152752 21418
9053 -147362 63655 -439122 -9510 161572 -132737 -10924 -4352 -115249 16061 -85944 -47550
9042 -47550 -15379 -16558 -103397 48347 -262133 173871 40509 -189316 71824 -200379 174323
9030 57448 -6889 -24543 -12268 -189866 -63317 -63135 83138 -125225 -18542 30978 -60096 -1925
9017 -41797 256128 30675 -182160 -69532 -342175 42010 174039 -235058 121187 -202277
9006 123936 -163681 -208106 -84765 -23706 -10906 -133036 -74615 -251302 -31961 -79928 97766
8994 -248343 39095 -167174 26916 275484 -61366 -232415 105226 -152457 -215621 44745 117875
8983 117875 -303521 119625 118370 13495 201363 -105270 -261020 362758 135875 -54146
8972 63418 -31111 -263572 -170912 -371504 33162 -200531 33719 -90072 -181775 -223974 -125097
8961 -125097 87348 102885 -67712 -224386 -202996 -58260 126121 244063 -177165 5120 -53876
8949 -150091 -177467 -22864 -318018 -48355 -129611 43135 -107789 -69475 187738 -178973 -93058
8938 -93058 89463 -41998 -123691 -71729 20479 227172 410395 493078 -249896 136582 91508
8927 91508 -103496 224499 394157 1269446 1908100 6560182 9327398 2012083 601800
8917 536342 -187246 98779 -389913 178638 114271 231092 -144791 -50543 119503 -6673 215533
8905 -63236 -54876 -329327 -21459 -354445 -99053 -83315 28598 -42907 54313 25907 -217985
8893 -80650 95420 -107161 185520 -89079 -202953 -241618 -182173 197382 35798 -315560 -214942
8882 -214942 -178980 523777 -163352 314151 -60412 68589 -200113 186151 -292222 -367653
8872 -367653 -82379 -16886 11067 206661 -59682 134063 -221493 -64981 -42339 -128967 -1019
8860 127337 -8534 -82449 -223025 -133159 109359 -126773 -33857 -152779 139393 199688 -231024
8848 114867 25744 -270175 -164424 46779 -107828 -78780 94377 -49591 105292 165428 -268714
8836 251680 -99525 -487088 86558 -62781 21327 -392449 61840 -63862 52786 -92560 -139036
8825 -139036 9309 26205 -33727 -365068 -110094 -170257 -65005 -75772 -16865 -161119 379723
8813 265969 251210 -227678 -119580 93836 -145181 -217012 -20422 -26129 -125838 84434 -11648
8801 -100328 -557 190313 94128 -519622 -187952 -254311 -129598 -339654 -231991 5114 -193706
8789 -97112 14674 135885 -116632 -127357 -106152 227477 -172327 80137 -145068 -326864 126131
8777 -265108 384260 155637 122408 -360110 91888 -98614 117398 88576 122996 -483500 301129
8765 186945 141348 -413922 -246959 -8772 270449 74300 -183650 148253 -60520 -36012 -99967
8754 -99967 -216619 108516 -8631 88307 -313324 -181403 -221238 30006 -219945 162944 -230885
8742 -230889 -23968 -7938 -126793 201611 -189231 31151 -105088 199743 113341 107194 -199360
8730 86102 -90782 -165296 -120410 119813 164381 -94721 -328751 -44377 215083 17870 86102
8719 86102 -174999 -108909 -169027 -69028 52860 128891 -326755 -54174 -71485 -121531 116604
8707 17906 -243673 -70993 385764 -58622 -163681 -7298 2015 -290181 -218722 -23195 -72150
8696 -72150 -161709 -325156 68804 -351227 143739 189799 -64386 -152286 10422 132090 219707
8685 219707 168461 -222650 97726 -139938 91921 -81227 -401999 173223 -264365 -189101 -312684
8674 -312684 -649082 61086 93796 -152228 -155471 -220097 -180052 -136792 -59096 -209379 -180158
8663 -180158 -43885 -204473 52498 11431 163747 314016 -299956 -1356 170642 132078 -901
8651 -299722 300947 -149743 -77119 127861 193325 -81940 -160513 43049 -28020 126416 247766
8640 247766 1158 131213 -185779 -316847 -172090 -423703 -17168 189715 -52576 -290894
8630 -290894 -64433 391420 293364 4236 38958 -64136 15540 67141 -185264 -219736 -78553
8618 -238613 -381175 -205231 78065 -62618 22361 65877 186134 -52392 -122236 -43925 255071
8606 58231 -130774 222426 -381908 -187236 -210175 234238 -26433 -167336 72100 161740 -79690
8594 280823 -75453 29748 207055 -433864 -117378 -86919 -203321 79847 -38771 -194737 -82380
8582 -178589 22092 -187870 160995 -214131 124424 208124 -48313 -219041 -153287 -34711 -27960
8571 -27960 -76970 -102821 -120679 -390803 100769 -40159 -385456 -327100 191818 -174717 182258
8559 82627 -220927 195038 -76783 -100038 -140725 104328 -110800 73096 -229838 9801 55486
8548 55486 -17803 143773 -11895 4499 -242000 -74862 81518 -165812 -144105 123695 -76594
8536 -125342 -307973 119434 -68759 -213689 17031 92884 13139 104861 -26744 79721 248569
8525 248569 70229 -15372 -415434 47005 -152277 -362563 -84849 -244497 262125 152644
8515 152644 282530 213439 244848 -4359 -373682 -12926 -363449 -165032 -125268 -207583 -249853
8504 -249853 -316275 9889 230860 5787 -334429 -326073 115213 -291681 -136346 97138 -222222
8492 154968 19955 275826 -198698 91408 51427 -158750 -230328 58366 -110187 -290245 74971
8480 30704 -204885 -204064 36122 144046 28159 190563 -68295 132732 -48039 -147091 93787
8468 -164150 163287 -231833 -313663 -157888 121508 -87547 -200600 -113540 36493 -54827 -190126
8457 -190126 132540 13444 -182495 -73522 303028 5877 -2198 26337 -60327 -55954 -56267 -114553
8445 -114553 8665 85623 252465 -325743 224379 -50961 -33517 -168428 -71485 -222849 -110120
8433 -282458 -156286 -229233 324587 -116299 -100648 35777 -86207 31636 -243320 -306811 192526
8421 -23573 304999 129803 -112847 274153 37102 -436230 -288121 50470 61604 -158656
8410 232237 -180173 -299867 -96338 141475 -319968 -78959 -147574 -62428 99033 18405 -86906
8398 114010 -458568 -93665 -331303 -19748 -294476 -250281 -89060 -3263 -45325 19303 420323
8387 420323 -394468 -64201 -95111 -313417 230227 82489 65441 -206956 62931 -54837 221225
8375 108162 -75813 -252623 146067 -30900 97289 124447 150071 129909 -133206 48103 -309577
8363 -50882 180520 -227652 256472 -117929 94341 81294 279605 150639 -171747 164921
8352 -242002 -216502 154139 -418029 188514 -42733 -157595 79824 -205110 -359317 206068
8341 -66667 349159 585755 -236868 430811 295957 -99138 26667 169628 -7617 -182017 -37699
8329 -135477 72705 -269743 -104420 -96733 -276546 210297 -49198 59743 -369934 93319 -74599
8317 -7388 -40604 94187 -362761 93806 97960 -368219 -241702 -83703 467412 -158505 -149103
8306 -149103 -100700 -10523 -199392 -135299 32281 -219660 51315 -26038 113494 -207950 -10626
8294 -307199 -66949 -225047 84647 -84094 84344 -219504 -256590 55986 -143322 -17393 -42902
8283 -42902 -27395 -213450 18379 66908 55684 -30433 -332605 -158889 -32137 -184084 -102057
8272 -102057 -76696 34874 -34402 -151533 -163849 -232497 -202943 -117386 -19557 -95993 -149697
8261 -149697 -190979 59603 -178711 -179534 -163725 174631 5396 -85282 -130841 -4526 -566495 -333543
8249 -333543 159880 -71557 -49160 98821 349278 150209 -170732 -9730 -262700 175513 61324
8237 -305527 45043 33296 -538132 -34218 247998 27606 145931 102562 74066 280667 44462
8225 42842 135523 -10156 332081 9953 -198715 93752 20057 190392 -246647 -68430 -13328
8213 318223 -126973 118232 795 48522 -68151 -81721 -264698 -196461 -167840 283234 253765
8202 253765 -232556 219597 15818 -281694 141232 -160321 -183910 10734 -194811 98405
8191 158976 -393862 21087 1993 36345 -117852 123653 213834 35206 -136755 27663 -214719
8179 -274742 123940 -290466 -72841 81818 -283922 -111816 229700 -123395 -177536 62129
8168 -38584 36961 61208 -17363 175540 121519 -42284 -237663 56400 -413237 -150936 98559
8156 -98200 401896 117548 34338 22070 328282 -41867 -17398 -87417 16575 -209932 -2724
8144 -81902 -71357 150475 65088 -165542 -254269 51185 87716 38666 236412 211451 94838
8132 -167226 67263 -143563 -33697 27715 -295125 136795 -421079 253522 -570683 53894
8121 122239 70357 -235668 194481 -234368 -56369 -520741 -124523 -14015 133362 147873
8111 147873 -459968 -131334 -93918 -144839 -39908 -175900 147639 17692 -35501 -208342 -51809
8099 -48629 23319 -334322 54116 44292 131842 17678 -242976 -300870 149681 70979 356981
8088 356981 -95088 164481 -217705 -225690 -196610 220991 -125854 -87950 60420 20618 -64087
8076 -180038 -191340 206342 -18250 -212625 138646 -95473 -7349 -240208 164013 -153436 9611
8064 251339 -142210 -615948 142770 98739 43216 -67247 16662 41479 61309 -40270 12776
8052 -51590 63128 8847 12481 -193173 -136781 -31415 79091 -410709 -81020 39707 11162 175819
8040 175819 -56343 -106900 -84785 -172678 381996 69075 41189 69012 -277676 -128806 -110149
8029 -110149 -149600 -388208 -47995 -241918 -199253 -19772 -159401 -17273 -257431 105132 -183470
8017 -57299 -383764 100394 -132071 31465 -63033 215475 -65310 -362829 118017 18589 34799
8006 34799 45022 -248173 -49011 9950 -423057 99776 28098 -263284 453285 219963 -24280
7994 133716 -205645 106903 250452 401483 149035 -196900 -412012 -79294 30368 -287649
7983 61043 -324154 74008 -188657 -138476 -127337 -214198 54771 -200548 98758 -199039 36884
7971 27870 105162 -179492 -30886 -220985 195492 55342 157004 -236689 -229760 -171671 -154072
7960 -154072 -143940 210183 -356386 -125945 -77306 -262884 -19162 219691 -282982 -279524 -63255
7948 -58410 197294 -152218 -63190 79113 -189919 -14554 14941 -209897 -7638 -180013 -193482
7937 -193482 223195 61911 53521 -31301 71244 -107711 236433 -55248 -191438 -170289 -367572
7926 -367572 -105251 288994 -169604 211056 -60631 -322722 213241 -94970 198994 -100988
7915 -2268 122337 -152577 246181 44004 -19567 169712 274580 79297 196544 -6630 -61627
7904 -61627 -372288 245078 -39618 140335 -348464 48798 -56798 -174132 182006 -208918
7893 -217440 112414 -97002 107844 191218 281521 -60027 -32827 163454 -47218 59048 -111925
7881 334236 31153 -40748 -83839 -152686 -271389 92557 -92658 7357 144598 109262 -39547
7869 33707 -187568 -176204 -432640 -137190 -98733 -82354 -29317 1334 629788 -24456 -165402
7858 -165402 161796 177362 -44301 259934 -349055 -87750 -172467 154955 -20655 -106293 20013
7846 -59347 -264017 -85462 -258672 165876 241245 -94753 -285137 25176 206380 18522 376518
7835 376518 12260 -231789 -150393 163449 11069 -1738 39926 -29819 7602 260678 34574
7823 -4426 308216 -8416 -17600 -134202 56620 59413 -8228 -257111 -261308 186982 -196194 -262238
7811 -262238 108377 -77244 84231 -155646 -239456 -224676 -229790 333084 184358 -244830 -46024
7799 -74410 90405 35503 -173169 109025 157325 -109039 216015 153523 86227 -43333 -188449
7788 -188449 -141894 263923 -119728 -26517 21854 -106346 65962 -160461 53997 -3575 -20159
7777 -20159 -241787 -247324 -92889 -261177 -46574 -72663 -221211 72228 -250017 -75458 5694
7765 67079 105164 195351 -254856 -78484 31691 -16947 134062 145135 -116755 -110138 -215435
7754 -215435 -300659 -69650 -66732 -109798 -108133 130383 -286370 214342 -47282 38180 -253962
7742 16278 -292569 195192 25231 -92885 -33626 58678 -110738 -294522 -21241 -335742 -78737
7730 1089 237828 -56417 -296788 108829 -411050 -178061 251529 97694 -365166 275194
7719 -199776 -18222 22038 -66464 93225 289736 69609 -317154 -105132 152426 86942 33428
7707 -32225 -210678 -13837 -8021 -167540 -12865 -47263 -105841 83719 265155 -10001 -235550
7696 -235550 30312 26778 61216 -59194 224428 125905 -238664 58061 -358150 -101661 -120411
7685 -120411 8463 -121986 -40537 -371134 -141112 64881 -168499 96863 240356 -114489 153559
7673 118448 66772 -184292 -250208 -24714 -65068 -125109 -159124 -19240 -153842 -104304 -142791
7662 -142791 51883 77952 265788 -33443 -339892 -268132 -25632 -155196 93958 3708 272383
7651 272383 -85134 75589 -132952 -115597 -367546 -241266 -72313 234375 -21742 -111840 224059
7639 -11378 280449 342139 112780 175141 -383016 -230580 -124288 136819 264907 -225393
7628 157021 -202533 -2647 49884 91016 -74787 -205571 -22048 32663 195286 -158123 -169565
7617 -169565 141155 124528 99896 30904 -26659 10662 -250744 145223 23636 -57055 -91022
7606 -91022 281564 -85751 145962 470150 -154126 -114488 -132646 -105822 -258541 -81755 205325
7594 -90774 -44336 56116 -24624 -188900 -213330 31815 -143801 -149472 -118640 -16727 -50472 39162
7581 -150607 -243543 -310738 24771 -20029 -37240 -177739 49557 -51329 78015 -242781 -143037
7570 -143037 -386926 210228 -216534 -113453 -383079 18109 -380475 -288169 -97733 -284683
7560 -284683 -29002 -138005 163780 -222873 -202581 -280431 -297175 -298922 -47465 -44752 295761
7548 -163217 -30408 152880 -48429 -90489 69070 -206100 47949 -396688 -69317 179010 -23865
7536 -348867 119311 274914 -131275 33459 74804 -84369 -600265 266648 95575 125207 -259062
7524 -4825 -37595 43392 21553 24930 66994 -361410 -219189 -97211 -61826 69816 -71059 -97276
7512 -97276 -110221 -342007 -59820 -250761 -91980 -13297 64922 9709 84070 56992 196463
7501 196463 60939 -228374 -88320 -29770 140485 -19859 -237796 -126938 -226249 135700 -76771
7489 -81643 -278942 -238492 -12736 179343 220558 -22583 -61187 71407 130533 -89768 121211
7477 95817 129878 -128478 99464 -160026 -213416 -220466 -299539 -200776 157830 24541 322531
7466 322531 -351793 -83073 -88316 -41274 315680 -64393 896 -118977 62549 53952 404720 238733
7454 238733 -38961 82479 -45932 77105 93544 471360 285024 80626 -255935 -70539 178562
7442 -38554 46692 125598 -141353 -141243 37144 169923 -257904 15990 -43878 62025 -181852
7430 -43828 107030 -215641 -300799 48091 -205528 -128625 172413 63614 198536 4981 409199
7419 409199 190400 -122144 34773 -92251 -140109 432223 -175763 30479 214069 144862 9069
7407 -196312 254957 -77308 -223097 -18493 199897 -296981 -333559 -186849 159876 54259
7396 -17585 -71191 -112475 -3087 -112063 93733 32163 -173156 164155 -182182 -24932 -1638
7384 -33775 -66113 -480603 -76426 -36988 -41912 237462 4157 -20916 9826 -49836 -116992 179905
7371 263476 16902 -227283 19096 -8622 -229293 -305993 129567 29266 -12318 63434 235948
7360 235948 55194 -195662 129482 -110111 232616 28156 -131149 -107397 -240836 -92009
7349 138340 112959 315099 398062 -353207 -152492 17856 -213254 177767 -21670 -240161
7339 -240161 -23009 60895 -489743 -21816 -97663 -3905 15607 266441 -128500 -289265 -28231
7327 22437 244878 -254147 -173334 -172338 -202743 -207719 -160437 186565 49447 29963 206087 -188437
7314 187290 90975 19150 -307942 -113768 9506 -65786 -94701 2191 -109099 294818 59669
7302 -228774 247527 -138122 60169 107927 90667 188520 -196360 -117952 -90008 2529 -136106
7290 109144 -164685 -251325 -238077 202211 2101 199202 -314865 -64617 -354403 -183874 -69074
7278 -204212 -119352 -31794 -86154 -492427 -28278 102036 145854 95833 69096 123965 20321
7266 -181717 12048 -29411 96686 436268 -165193 -738708 -67170 -29408 -20920 20221 -22849
7254 -152768 123588 -209108 -6583 -9649 -57536 120929 93404 -206805 -163507 -95282 265861
7242 -62781 -65934 467980 -129018 -324949 -19199 -234434 29907 -245233 -48597 -274604 -179784
7231 -179784 -296628 -175574 -87421 3497 -184574 -30909 -119445 -32650 -221920 -210145 31237
7219 -164826 134160 -71095 68835 82323 66488 -353258 -190941 -80482 -411020 -79185 35259
7207 201451 -147236 203840 82645 -36914 65596 -280141 263176 -1413 -250038 149480 51735
7195 126433 -146465 -940 341949 -40511 -130044 14593 -172794 -74679 148657 -493871 250883
7183 -82325 163725 -230013 23423 61939 -144598 -188933 61802 -102093 -339461 -59081 -66696
7172 -66696 -181446 -31797 -53972 -131695 98944 -4841 120193 39453 -175944 -147443 206364
7160 66193 -51365 108244 -102713 293454 -171302 305365 -58738 116599 266511 81060
7149 172787 62771 -78344 -172951 117344 5135 173819 92651 234017 23257 -227009 84316
7137 177147 15300 210575 242887 -19640 10792 269877 32198 -54627 -79661 -231086 -315264
7126 -315264 77868 -47695 -38063 -9802 197850 141190 53603 -58107 97445 -117796 348199
7114 -10682 -66505 44834 -190005 -249087 186419 -96766 56706 192595 -222115 228004 27525
7102 68755 104560 -37898 -54842 259822 -239671 -54062 -178212 -2947 432490 186334 -32270
7090 -37734 -34577 -191606 229071 347 165419 41939 121329 42522 -119944 -136533 -34300 -379116
7078 -379116 162547 -36808 -357857 -445728 377456 32323 100468 -198773 178186 -487202
7067 -27356 112525 318906 3613 35507 -115008 -105739 -251320 71997 4947 -90631 -95719 51512
7054 -22052 148904 227649 -69856 195418 251471 149826 -84938 -372791 54350 208169 -119128
7042 -418003 -151327 -86750 104001 -258300 -263048 -167766 -159498 20809 -139972 -292796 -270759
7031 -270759 132651 325586 -108589 196404 -154356 -105901 78296 4050 -34646 43703 51255
7020 51255 -161405 113636 322270 29216 180152 -184633 -145636 -147278 -14385 12512 4221
7008 -321647 -104246 131348 -188110 7638 -2707 275132 -147988 -56016 -335322 -179246 -83620
6996 -304359 -283200 68393 -333886 -42469 -214063 37050 84520 -84391 -331291 39583 200204
6985 200204 225574 -279134 -224415 29226 -475732 4163 103527 51799 44455 11133 178117
6974 178117 241514 106315 112099 -217494 -221308 -116156 -53798 30842 -136118 -2892 150705
6962 -6092 437936 -343300 -33506 84484 95817 -332291 133241 -55224 209754 -99296 267904
6950 153297 195846 -270131 -99066 135807 -61297 142782 33097 -437672 87226 -37644 -80170
6939 -80170 -255885 47124 -87233 -171073 -139714 210282 -327001 -32960 33220 170041 -299423
6927 81475 -89350 -53382 -140838 -208869 -8811 16540 -191192 91806 -104897 -37045 26698 107295
6915 107295 -28911 -118245 24795 288479 160164 141646 50769 99382 230353 -273136 -241617
6904 -241617 -30327 179646 -147886 -136115 70450 129018 -155130 -415541 -94948 -252269 52292
6892 -30219 204028 434404 -62697 -30995 -268717 -131319 184495 -79330 -81376 -168186 -129545
6881 -129545 -360262 3507 -126644 82692 -131675 -53348 -106911 -242240 -271123 16856 -300612
6869 -28341 -270207 -140536 -115250 186817 -180479 -38136 -33658 -94154 37046 -41275 132406
6857 283862 -216538 -153307 -889 63635 -77901 157087 -99747 -339432 28998 -138375 -43668
6845 397242 -26840 513376 -116873 -137160 -159258 -311269 -187365 -223378 124208 66434 -126532
6833 -191959 87680 55338 -88780 132703 -30138 -265953 22113 315098 112094 -43100 -95758
6822 -95758 146723 -127089 25945 -65917 119962 23013 7530 -138060 122601 -98067 103361
6810 -40885 59701 81801 -84315 -16756 251020 129130 48839 -144551 143334 -12528 202047
6798 332034 64886 117528 293125 250369 29339 258923 -87753 -97148 -113829 -129628 -125339 -126677
6786 -126677 99333 -153742 -119490 -228896 59549 76824 20099 143509 -13331 287742 17583
6774 43668 168373 -124730 -95213 -83100 -49155 -45349 -113818 -88539 -223760 -18868 34593
6762 -184965 -216152 -18059 -91829 -114592 -83162 -172654 -117461 17857 43054 -148946 81093
6750 216283 -189792 28496 -457612 32383 -129572 -75126 -515 157621 -398536 -92975 37591
6738 -56050 -282156 -27781 172438 23592 71189 238004 -188269 63883 -244534 151866 -139156
6726 -181740 -143293 -148173 -113323 -305849 244090 -318079 -123171 292818 42057 145208 -412635
6714 -76527 -484802 -35794 368732 3071 -48892 22550 41650 -9186 -153515 -123140 -182222 67938
6701 -438027 77365 -318590 307533 -65967 -112124 -176153 61394 85304 -192071 -6156 -196665
6690 -196665 -184578 -53027 88996 45445 -47543 -275283 -247517 -138939 -199858 -56173 -59593
6679 -59593 144347 122145 79995 -30177 15273 12939 10959 6323 -112105 -129489 -219326 -19086
6666 -40375 -155126 -120042 -91874 -7024 -405571 419636 185547 2617 -114874 79347 40760
6655 40760 -147979 -150037 -33325 -188555 -180366 -190525 23481 44003 2630 68432 237287 -147449
6642 30548 -160359 -191637 -306158 -212084 -100079 370017 174304 302580 -105485 -54106
6632 -54106 91762 -227901 -7731 321496 88471 135692 157242 -426913 238808 -114640 -119652
6621 -119652 23083 -30600 -352515 115665 209004 -256888 -58766 109486 252463 -31349 24741
6609 194716 -112653 204486 216158 120798 58576 -76746 38379 214816 -204317 125225 65268
6598 65268 95779 -44460 -251588 -342919 32032 -208046 -25660 -166662 -360216 -22463 -42032
6587 -42032 -402521 -370679 209436 197602 121388 -125132 -78211 6306 199448 -11564 84506
6575 148987 -127033 409836 -17415 27722 -202788 -129093 90399 45566 -222493 -242997 255001
6563 -111504 -136442 235691 -46741 136777 45855 82631 219747 -56787 61554 -208190 -225800
6552 -225800 -5225 18030 70499 -114983 -504410 242512 -23626 -161069 -170644 -66011 87110
6540 206913 -147828 208154 22157 -67970 210545 -3620 -142431 -124365 -41170 150387 -361787
6528 -49674 -99338 124522 23572 -60863 174123 317620 158148 48832 -135646 208500 91343
6516 128996 -288438 173033 -150572 152615 -130896 -58465 156534 255766 -19125 196803
6505 144444 302416 88814 173670 -89995 -146695 -382668 -85758 -142650 -65458 -244015 48379
6493 128972 -63885 125467 401429 -189900 -79446 -176739 -78244 -366181 -60130 267940 -80427
6481 76719 -158448 102462 -167777 -294386 212144 -17564 -10777 -39012 13360 -55060 -135523
6470 -135523 -51562 63020 -31763 -490614 984 -388539 -302323 -131424 143326 182032 148289
6459 148289 -391993 9138 -327879 35139 -137400 -498 204128 -81281 -134925 193770 178700
6448 178700 164917 121316 281916 -92550 -295472 51392 40829 -159059 30859 146086 18724
6436 87606 483674 -5741 94013 23265 286819 262910 44762 86199 -397072 48896 112144
6425 112144 -136379 -162938 52968 -139321 64214 -74689 -105863 -24635 32192 153678 109794
6414 109794 -49714 18752 85803 -371423 382911 121761 77073 -52424 41028 65845 240859
6403 240859 -169297 85767 -451343 71452 -156631 -72810 79941 381407 -143027 81596 27834
6391 -57423 218376 -77605 -266552 -81425 131971 -56501 -105731 156611 -132999 -371434 137844
6379 -26481 36775 143684 261239 211339 88071 -29115 -52283 -289373 -311191 -98391 174800
6367 -10314 5360 54102 -199381 435323 -251052 -159229 -14194 -491932 219145 19865 80233
6356 80233 -218322 -82520 -52027 -52265 -2364 -88661 -143199 120726 20654 -53598 -117159 71558
6343 116680 -261379 206127 223611 134971 54329 4130 -124879 -76319 115821 -1964 -100938
6332 -100938 177542 129718 -77781 4210 39300 -211535 -250201 -316664 -162237 42243 -84068
6320 -57052 -143653 69297 -427651 -88157 -75563 2187 -34936 -21301 113904 -44894 9874 263284
6308 263284 -100862 -33516 24089 328348 -21557 -42191 196959 -17580 -269012 -53009 -145229
6297 -145229 -262530 -92814 -194819 269815 -97694 -121461 -72574 -104849 -2360 -94838 -228782
6286 -228782 65813 166025 -143336 -13973 103409 -34908 -255493 243011 -202848 -76689
6275 215401 197388 69720 156856 174098 -89144 61959 82374 294194 170283 293490 -82953
6263 -1471 -177363 -61722 -372255 -131667 -35383 15693 -187358 -100107 154599 -204062 -102224
6252 -102224 40291 -84021 -323010 105196 -107700 -163837 10940 139992 -394109 -28811 222553
6240 -226538 -40927 -365460 156129 -151158 -23029 29280 17932 60137 865 -318800 -62028
6228 31824 89622 147902 -265570 -204292 198086 70222 -216992 -74469 -177782 11314 309605
6217 309605 -136857 189833 84795 -176078 23934 -307788 -40477 -49385 -306056 2200 3737
6206 3737 -23380 -152338 -94929 -126120 -19753 53006 242350 -297074 110938 -96042 -8733
6194 47545 205068 -249519 213298 -163224 16784 150161 -412166 -439147 -84237 12496 -106967
6182 149390 129772 188043 117272 18746 160943 -31960 18017 -264034 -369397 -191119 75173
6170 243394 1750 125785 -105803 -167041 158199 -110194 -145147 194530 -149428 -260927
6160 -260927 270869 72642 376716 62750 -102151 82417 -82879 -126057 -226804 -120238 122261
6148 -148655 -167267 67644 89306 -316425 -116230 225107 24148 44721 -158610 -4568 57739
6136 155421 126773 39561 -69337 -873 -9547 -81259 82905 -160510 85172 118810 -363462 -82828
6123 -106706 362300 -86941 113492 137251 219198 175276 17485 -386512 -191989 75707 -91078
6111 -178338 -253985 267291 -203389 -21311 -192386 -7221 -169159 -9275 92462 -49186 12268
6099 13692 228632 123009 333353 160166 -75661 33482 193265 -82903 268658 363901 -35466
6087 267680 223441 -44675 -116458 8447 141179 275053 -153174 -250409 -178363 -167517 -77939
6075 128859 22749 -297915 37136 -191750 140520 -117789 65236 201955 420413 -105595
6064 -180527 166445 -28022 94711 -173761 -360000 105727 -142524 -76839 164306 383000
6054 383000 -122098 90047 -202136 -106261 -89246 -68024 -164001 -209259 -236282 -26436 -113162
6043 -113162 -206265 -122402 13635 2660 372691 -25002 -36260 210929 164044 -145635 35010
6031 157911 -72298 -28093 -366346 25495 -153687 535399 -22913 107389 44140 -25890 34748
6019 17158 63891 -98798 -194020 350495 -28886 -276409 156155 -141535 -61497 74480 119526
6008 119526 491872 -195573 77493 -288549 -327695 -123154 154233 165403 51485 -84190 -60691
5997 -60691 -308851 -153651 47261 197037 -18995 42946 -233178 52315 -77297 -27089 526727
5985 123533 284277 -296185 73442 -66695 262666 -192775 -81752 -86718 -27627 -134860 -309798
5974 -309798 59524 -213684 -234271 107447 50010 -51276 113070 -182534 119191 -165725
5963 172254 14473 371405 17725 -33323 -83078 282389 44579 -162681 -50292 -105128 -28055
5951 261540 -25520 149370 208090 31126 118210 34954 96793 207125 -67769 -75742 -162201
5940 -162201 -53217 -7809 133000 -370048 167586 142074 258532 200266 -51721 -289971 -78230
5928 -3717 -65890 17989 266843 323531 244762 -41230 -5364 179879 151332 99991 197799 -261236
5915 -57995 2250 44799 16449 -97338 3434 113303 -29699 -156201 111342 -101972 77498
5903 150594 -122281 155106 -13734 -15028 -170341 491462 -64036 9270 75798 169740 -153107
5891 -206440 -14144 -41667 -189369 9066 100223 2881 -208709 -234476 86550 -32674 281202
5879 -62616 153642 -23321 -2349 -109280 35151 -76546 -143226 4136 18376 -89376 44036 62153
5867 62153 -304195 108872 227265 -41145 167083 43722 168426 62533 -430 99859 130977
5856 130977 282843 -248963 181396 285018 31248 -85768 -150962 88710 -2009 215903 129895
5845 129895 391597 175234 -27958 -86708 198057 -139297 -293923 183189 -5893 -231055
5835 -231055 -314049 -459641 -25373 102079 143912 -197110 106973 -295552 -24967 200147
5824 -219512 -78190 -97572 -34422 48938 -53708 363025 204230 63757 23612 -60542 176104
5812 -212724 -108510 100003 45727 -421031 -65895 -60308 -125504 105268 -159175 -68430 -52127
5801 -52127 141853 620930 189547 110006 -173244 42509 32409 -56511 119527 45258 -160215
5789 174941 9681 -149911 -158113 15858 -33986 95723 244096 -137136 -146812 141731 -265912
5777 185992 -198411 -80115 -16445 147273 -103877 5668 -240357 -155828 -282509 132822 -264459
5765 262871 66826 -284959 146746 278644 -145900 -90308 105505 -103060 279141 -229903
5754 -54736 281406 138503 -5229 -36187 165707 -197314 -173749 -147844 30527 -179095 -143129
5743 -143129 -476627 -66116 -372200 52209 173472 24635 40456 4141 36121 52300 -127382
5731 -10371 50475 -54329 80892 161304 109233 -83290 -23700 -207103 -340173 153279 96027
5720 96027 -99322 -7438 43232 -20841 181618 -119642 -11289 -156614 -6486 196810 263857
5709 263857 -213420 29933 -197970 -189744 388910 127966 -200801 47163 10779 105560 -16964
5697 220872 25661 -170685 126987 37207 269981 33636 105625 341648 341922 -325401 -186578
5686 -186578 106340 -177173 426659 -233535 -27427 -135282 66978 -31148 -7689 -18785 27720
5674 -70439 -52675 -195913 2917 -98766 81281 150703 91742 36969 187050 223629 7936 -9433
5661 3985 59317 -6067 -157327 181659 110858 327457 140795 71715 -301242 -184829 -102581
5650 -102581 36798 320442 -240507 -112832 -48545 -91364 -96849 -246334 -38839 -201535 -276158
5639 -276158 50983 21231 67 -42315 -397775 -161989 -75785 -51400 -222190 -39904 -114814 265101
5626 47853 -44649 93840 214272 256582 55863 181967 20268 157591 121147 64410 -41638
5614 165712 -12858 21702 100825 -427709 -44823 -112349 -299448 9407 -43788 83554 244093
5603 244093 57385 135786 -333804 -3040 -92192 2678 238756 229424 91893 52055 -86288 -52159
5591 -52159 -98995 -160491 188466 153514 101287 55547 130569 5788 -72146 151092 191617 50521
5578 -212907 -311438 145034 256625 202825 -232783 73428 -439102 47702 25419 -95008 343257
5566 312612 90705 226252 -19320 -47997 -106041 -201100 32898 -61670 210591 -50609 -26839
5555 -26839 287480 -45492 168762 -151950 -11047 -120340 73905 182020 -149493 382618
5544 -99817 -13025 15245 -96146 180488 -87363 6712 -235582 -148432 116645 212561 -137769
5532 117024 -48845 -24664 -208733 184315 -194080 -150491 -254865 -133076 23754 -79164 121715
5520 89260 135599 -221948 -137154 -15135 68776 -112109 107958 -92430 -58269 -155077 -190810
5509 -190810 32920 160070 30915 -106778 -125090 34743 -138546 -112479 -44460 -394299 85101
5497 219104 -156212 66248 277537 189053 205233 125774 -276626 60571 62905 176915 169553
5486 169553 -145793 -230382 24714 5427 335934 -32092 30218 155622 70242 335502 -95372
5474 -301321 -82987 240947 -107786 -79749 -168373 -175604 -114526 -254949 -32471 172577 -9323
5462 -361585 -11540 215508 -296357 -352637 -3783 6571 -48821 -49264 205882 -635134 31552 186511
5450 186511 -88069 56132 -47391 181393 -246490 -7404 -167683 -134659 6282 -123069 172526
5438 -85010 -48835 346219 67647 -221093 -42596 -10564 149167 202313 -110828 96831 222100
5427 222100 -69499 -113279 -25137 109127 908 79039 160811 -114572 131148 255510 -251621
5415 -251404 216712 7855 91487 333055 38735 41262 235376 -30544 -46371 -49176 67739 224436
5403 224436 62842 65234 1813 -353933 -147389 141530 -19252 156547 -124711 525871 -180128
5391 -397272 -38085 251937 -131640 66124 -95980 -274684 163720 -30576 138231 196482 51515
5379 128113 39090 37573 119208 -66761 -109497 -282996 -69196 -42124 107106 289555 -119164
5367 43590 186653 -158487 -138669 -350956 104532 -274018 173890 -55538 -316066 -48259
5356 161781 334868 41095 -10452 -172197 -334029 324952 -108253 21053 14314 -41687 -9774
5344 -398049 -72666 -111253 210069 -177239 -194599 214520 7968 -191503 -4032 -65691 83499
5332 -18510 1229 488188 192727 -96406 -326535 45507 226822 -145748 19697 94458 178823
5321 178823 -51845 234977 148071 36022 28794 -527089 -96472 207160 -41389 -73970 -69965
5310 -69965 -129865 294279 -295241 -114778 -138355 20598 52547 -105033 -3470 109606 -26558
5298 263360 125747 48431 -405 96455 -265472 -5954 229586 67770 -222377 236137 389055
5287 389055 232672 124001 -426491 -123099 78979 311945 81735 -217802 39203 -292255
5276 90950 42473 -120307 6685 44573 -73304 -27173 -123554 -21827 27333 2588 -149813 -104534
5264 -104534 35631 -49281 86640 164253 -42788 231862 -8760 -59811 -18145 -50746 -174550
5253 -174550 6000 -242414 8903 -160348 28789 -127223 -145806 217591 -69279 -116459 -186531
5242 -186531 176326 -128990 15116 -3150 -82653 489775 287685 -691983 15362 -22476 384079
5230 124842 120294 102141 -160781 -137911 129932 -190000 -25575 80051 166761 68157 -131029
5218 6989 198294 -303148 110230 283660 11166 237000 93517 140828 -72829 -124606 -67579
5207 -67579 76264 187941 28359 -133804 142258 -259617 -127919 24067 -242099 -6412 -103985
5196 -103985 -160103 124915 159023 -126078 -331283 307961 36142 131412 407378 -129784
5185 -45925 88565 42050 189433 -262113 159309 238952 -198891 -353806 -216123 -15280 -196684
5174 -196684 244939 66146 -49891 -29892 -102799 -65993 -122186 -43224 -139788 32618 -267923
5162 -17339 -40945 -97011 15813 225803 123360 -12613 165879 -208989 -172876 -445816 3648
5150 151515 10642 -41315 60496 78644 -42566 -125964 40851 68023 -88992 22275 -22727 -37257
5138 -37257 56457 -7896 143431 112964 -24040 -83361 -37981 -133429 459892 -172140 11937
5126 -148063 -27308 -11307 74020 61252 494130 78209 -53646 336086 -191328 2399 -139575
5114 -348661 165076 132334 75522 -48853 -217511 19589 135469 -100288 86663 -21753 -155819
5103 -155819 -46860 -61215 231753 464293 -352024 109396 -66660 -256602 -57528 138176
5092 213254 -72158 -255782 -167377 -120522 290521 40983 -367834 152601 -71834 18539 -197067
5080 -67787 183106 -189068 -12687 -181854 294772 -25667 -181707 148203 -98172 -96738 110004
5068 -103865 -346575 -60061 198447 -290917 95848 44650 -91721 235883 -181703 -165008 -154152
5057 -154152 -319340 -98726 -242628 175940 71351 -77634 -211031 78908 -164764 -84686 141331
5045 270098 11342 -616179 6617 189226 -25970 157489 165128 68021 -228707 211503 176196
5034 176196 -18398 -61144 -39227 -48882 165758 240361 -62357 100226 -185703 267720 -140975
5022 165141 -128372 -344458 53046 3026 338053 -95746 178547 83726 -194879 102453 -233113
5010 -99774 33573 8455 124214 -95716 -88678 -212212 357574 -72073 -103162 188310 190047 282951
4998 282951 173163 154415 125681 -17077 219998 177515 -66662 -65260 104568 -136249 33014
4986 -148014 -147691 -54930 -73611 123896 -128261 12597 7891 183534 111872 -305343 225521
4974 126046 -177248 -39264 -81200 185032 161091 -144249 202491 -36148 -210186 -289789 17094
4962 1860 119434 186541 25563 -222467 44227 19798 5634 -22047 -165509 -71891 -77593 -205001
4950 -205001 297371 -142016 161303 255194 -225527 -65408 -224439 -145634 337 107208 -25103
4938 156152 -83693 -15198 340372 -204396 100130 43076 -130088 93153 431147 202704
4927 241320 -166385 228713 -45867 195572 77091 174356 170709 -57110 -229933 61135 124878
4916 124878 101074 -195470 38377 54875 -58024 -314175 56251 53195 98203 22979 -224906
4904 61711 134775 360209 -306796 290269 202371 248741 -58942 107987 -15057 97265 111445
4893 111445 -445702 -56108 -69175 -5628 -196580 88057 -150166 -145482 13996 160078 -2902
4881 -310046 -62319 139624 -307686 45172 12380 95977 25218 -255354 -82927 274289 175142
4870 175142 67250 124626 265487 -190369 -170980 -86764 -150457 92034 -121832 20748 35183
4859 35183 52339 9949 -161334 -259042 -60836 -353945 -12264 207497 -199733 78958 287515
4848 287515 -212062 -289718 -41129 -99766 26542 243187 144726 169933 -49227 109148 -20360
4836 -185387 49264 200361 -44817 254566 -127190 193392 -106641 105160 450 -135639 -344387
4825 -344387 -80252 -219648 357705 58626 -204673 29535 -262230 -69018 -23737 188655 182234
4814 182234 103614 128770 -143193 -22815 -37298 61620 108562 310596 -110442 -84153 262097
4802 306937 228186 88698 148037 -143987 74627 -46110 -152599 325133 345330 -139471 83377
4790 -205361 -66040 -67958 295805 -30802 144530 121373 8543 -56146 209855 311050 52603
4778 -75925 -26939 95216 -184742 -358153 -128521 72242 -51837 -25195 3019 -312813 24787
4766 283562 -64243 -105155 211972 13926 64674 -177973 -133857 178819 334916 173654 -133720
4754 294366 191193 192139 341611 -69176 202830 -92015 -136751 373791 -162215 -163228 38116
4742 -5344 -242454 117538 -16716 -33523 383570 -225201 29192 -90354 79914 203150 -241326
4730 262375 -15914 -144758 57841 125795 -112400 -30578 55515 -69299 176447 205651 -214965
4718 423715 -200076 59824 357310 167075 -150305 24592 5289 64465 355445 -302178 -95811
4706 -175409 108266 -105011 -16170 -64773 93525 -226429 -171415 -101712 132496 143327 -30695
4694 195117 182743 288454 -154521 -109988 -98523 -236445 -151062 -317960 -179159 88818 -129584
4682 34284 -149117 40126 -142439 -304970 -12392 219323 -431840 -118220 -105281 -130134 -219611
4671 -219611 -42174 -144834 213719 224012 72366 -32934 176664 -45781 -53769 -4098 -81688
4660 -81688 -127503 298426 108882 -170203 -8131 -47830 -129343 147079 62922 -200978 -260893
4649 -260893 -236688 180673 29992 -226619 304834 21982 -29121 -129668 188315 -41595 106953
4637 -60300 145681 -152245 22259 -176845 165061 -89017 -83632 -237585 359886 -67181 -17154
4625 437251 -190253 -40372 -21982 359655 -23492 111227 -103539 -203292 76434 196686 137696
4614 137696 104099 -67946 -122521 153295 108442 -20848 163442 -43679 89931 44213 -13147
4602 -91759 -15499 21943 -88574 -28994 -47165 211286 -136743 -292464 37563 163178 53130
4590 -170727 20966 -70365 108545 120744 32638 94743 -295309 51608 -46056 328357 -41769
4578 -194044 -13555 -73910 127752 45016 174074 371446 -77473 -34777 5867 147164 -133173
4566 -270327 142454 166753 -69103 104188 58606 35961 17974 -80375 -29004 179880 119287
4555 119287 7629 328405 -150637 -277779 -248430 106072 211076 -15042 -85156 129545 -296701
4543 146000 26330 148912 125570 151713 -56785 -255241 193170 189408 153843 250460 9705
4531 420853 391274 353217 14119 15441 -1053 30916 -249572 213193 70262 -49458 117648
4519 311662 251446 -61470 -5265 -131038 -57416 130543 -78283 172808 -203054 494601 -270930
4507 -4196 127797 140274 -64729 126089 262392 -100889 -112297 -48705 320487 -312911 -25909
$$ [...]
##END NTUPLES=NMR SPECTRUM
##END=
