
##TITLE=AC1261_BRARS10079_6641703_r9cxuoHe3Q
##JCAMPDX= 6.0         $$ Bruker NMR JCAMP-DX V2.0
##DATA TYPE= NMR SPECTRUM
##DATA CLASS= NTUPLES
##ORIGIN= BRUKER
##OWNER= Administrator
$$ 1.72 TOPSPIN		Version 2.1
$$ 2012-08-08 21:12:24.296 -0500  Administrator@TOPSPIN
$$ Compression mode = diff/dup
##.OBSERVE FREQUENCY= 400.02188249412
##.OBSERVE NUCLEUS= ^1H
##.ACQUISITION MODE= SIMULTANEOUS (DQD)
##.ACQUISITION SCHEME= undefined
##.AVERAGES= 8
##.DIGITISER RES= 22
##SPECTROMETER/DATA SYSTEM= spect
##.PULSE SEQUENCE= zg30
##.SOLVENT NAME= COFFEE_meoh
##.SHIFT REFERENCE= INTERNAL, COFFEE_meoh, 1, 14.98509
##AUDIT TRAIL= $$ (NUMBER, WHEN, WHO, WHERE, PROCESS, VERSION, WHAT)
$$ ##TITLE= Audit trail, TOPSPIN		Version 2.1
$$ ##JCAMPDX= 5.01
$$ ##ORIGIN= Bruker BioSpin GmbH
$$ ##OWNER= Administrator
$$ $$ C:\Bruker\TOPSPIN/data/COFFEE/nmr/AC1261_BRARS10079_6641703_r9cxuoHe3Q/10/pdata/1/auditp.txt
$$ ##AUDIT TRAIL=  $$ (NUMBER, WHEN, WHO, WHERE, PROCESS, VERSION, WHAT)
(   1,<2012-08-08 21:12:16.375 -0500>,<Administrator>,<TOPSPIN>,<go>,<TOPSPIN 2.1>,
      <created by zg
	started at 2012-08-08 21:11:09.890 -0500,
	POWCHK enabled, PULCHK disabled,
       configuration hash MD5:
       6B 1B 68 BB D9 2E 58 E2 7F 35 AD 54 07 DF 0E 41
       data hash MD5: 64K
       B0 1E 49 A5 80 8E E3 78 29 BE C3 F0 0F 6A B0 8F>)
(   2,<2012-08-08 21:12:19.984 -0500>,<Administrator>,<TOPSPIN>,<proc1d>,<TOPSPIN 2.1>,
      <Start of raw data processing
       efp LB = 0 FT_mod = 6 PKNL = 1 PHC0 = 0 PHC1 = 0 SI = 32K 
       data hash MD5: 32K
       A9 AB 1D 1E 85 DC F3 D6 0F B0 ED 90 0C 5B 0D AB>)
(   3,<2012-08-08 21:12:20.375 -0500>,<Administrator>,<TOPSPIN>,<proc1d>,<TOPSPIN 2.1>,
      <pk PHC0 = 176.6382 PHC1 = 0 
       data hash MD5: 32K
       47 7E 45 20 8F FB 2E BD 3A 8D 6A AA AA A8 DD 33>)
(   4,<2012-08-08 21:12:20.453 -0500>,<Administrator>,<TOPSPIN>,<proc1d>,<TOPSPIN 2.1>,
      <abs ABSG = 1 
       data hash MD5: 32K
       1A A4 2D D6 5E C2 2C FB F9 79 18 C8 B9 7A 92 6C>)
(   5,<2012-08-08 21:12:20.468 -0500>,<Administrator>,<TOPSPIN>,<proc1d>,<TOPSPIN 2.1>,
      <abs ABSG = 2 
       data hash MD5: 32K
       63 52 FB 0B 26 4A 3E 16 98 5C AA 76 08 D8 FA 78>)
(   6,<2012-08-08 21:12:20.500 -0500>,<Administrator>,<TOPSPIN>,<proc1d>,<TOPSPIN 2.1>,
      <abs ABSG = 3 
       data hash MD5: 32K
       50 27 10 31 C4 12 A1 73 D8 A8 5A 9B 46 3C 8F 80>)
(   7,<2012-08-08 21:12:20.531 -0500>,<Administrator>,<TOPSPIN>,<proc1d>,<TOPSPIN 2.1>,
      <abs ABSG = 4 
       data hash MD5: 32K
       93 16 0E 5E A1 93 0B 98 06 3D F7 35 D5 CC A3 CB>)
(   8,<2012-08-08 21:12:20.562 -0500>,<Administrator>,<TOPSPIN>,<proc1d>,<TOPSPIN 2.1>,
      <abs ABSG = 5 
       data hash MD5: 32K
       1D C2 69 90 BE 63 CE 27 9B F8 55 BD 36 B0 45 11>)
$$ ##END=
$$ 
$$ $$ hash MD5
$$ $$ 80 91 82 A7 42 19 26 F2 B0 40 61 F4 88 74 41 F0
##$RELAX= 
##$RELAX= 
##$RELAX= 
##$RELAX= 
##$RELAX= 
##$RELAX= 
##$RELAX= 
$$ Bruker specific parameters
$$ --------------------------
$$ [...]
##$TP= (0..7)
150 150 150 150 150 150 150 150
##$TP07= 0
##$TPNAME0= <>
##$TPNAME1= <>
##$TPNAME2= <>
##$TPNAME3= <>
##$TPNAME4= <>
##$TPNAME5= <>
##$TPNAME6= <>
##$TPNAME7= <>
##$TPOAL= (0..7)
0.5 0.5 0.5 0.5 0.5 0.5 0.5 0.5
##$TPOFFS= (0..7)
0 0 0 0 0 0 0 0
##$TUNHIN= 0
##$TUNHOUT= 0
##$TUNXOUT= 0
##$USERA1= <user>
##$USERA2= <user>
##$USERA3= <user>
##$USERA4= <user>
##$USERA5= <user>
##$V9= 5
##$VALIST= <valist>
##$VCLIST= <CCCCCCCCCCCCCCC>
##$VD= 0
##$VDLIST= <DDDDDDDDDDDDDDD>
##$VPLIST= <PPPPPPPPPPPPPPP>
##$VTLIST= <TTTTTTTTTTTTTTT>
##$WBST= 1024
##$WBSW= 4
##$XGAIN= (0..3)
0 0 0 0
##$XL= 0
##$YL= 0
##$YMAX_a= 472938
##$YMIN_a= -617204
##$ZGOPTNS= <>
##$ZL1= 120
##$ZL2= 120
##$ZL3= 120
##$ZL4= 120
##$ABSF1= 14.98509
##$ABSF2= -5.573092
##$ABSG= 5
##$ABSL= 3
##$ALPHA= 0
##$AQORDER= 0
##$ASSFAC= 0
##$ASSFACI= 0
##$ASSFACX= 0
##$ASSWID= 0
##$AUNMP= <proc_prof1d_extract_pilot.lims>
##$AXLEFT= 0
##$AXNAME= <>
##$AXNUC= <1H>
##$AXRIGHT= 0
##$AXTYPE= 0
##$AXUNIT= <>
##$AZFE= 0.1
##$AZFW= 0.1
##$BCFW= 0
##$BC_mod= 0
##$BYTORDP= 0
##$COROFFS= 0
##$CY= 15
##$DATMOD= 1
##$DC= 0
##$DFILT= <>
##$DTYPP= 0
##$F1P= 0
##$F2P= 0
##$FCOR= 0.5
##$FTSIZE= 32768
##$FT_mod= 6
##$GAMMA= 0
##$GB= 0
##$INTBC= 1
##$INTSCL= 1
##$ISEN= 128
##$LB= 0
##$LEV0= 0
##$LPBIN= 0
##$MAXI= 10000
##$MC2= 0
##$MEAN= 0
##$ME_mod= 0
##$MI= 0
##$NCOEF= 0
##$NC_proc= -8
##$NLEV= 6
##$NOISF1= 0
##$NOISF2= 0
##$NSP= 0
##$NTH_PI= 0
##$NZP= 0
##$OFFSET= 14.98509
##$PC= 1
##$PHC0= 176.6382
##$PHC1= 0
##$PH_mod= 1
##$PKNL= yes
##$PPARMOD= 0
##$PPDIAG= 0
##$PPIPTYP= 0
##$PPMPNUM= 2147483647
##$PPRESOL= 1
##$PSCAL= 4
##$PSIGN= 0
##$PYNMP= <proc.py>
##$REVERSE= no
##$SF= 400.02
##$SI= 32768
##$SIGF1= 0
##$SIGF2= 0
##$SINO= 400
##$SIOLD= 32768
##$SPECTYP= <>
##$SREGLST= <1H.CDCl3>
##$SSB= 0
##$STSI= 32768
##$STSR= 0
##$SW_p= 8223.68421052631
##$SYMM= 0
##$S_DEV= 0
##$TDeff= 65536
##$TDoff= 0
##$TI= <>
##$TILT= no
##$TM1= 0
##$TM2= 0
##$TOPLEV= 0
##$USERP1= <user>
##$USERP2= <user>
##$USERP3= <user>
##$USERP4= <user>
##$USERP5= <user>
##$WDW= 1
##$XDIM= 32768
##$YMAX_p= 448405350
##$YMIN_p= -675550
##$CURPLOT= <Network HP LaserJet P1505>
##$CURPRIN= <$Network HP LaserJet P1505>
##$DFORMAT= <normdp>
##$LAYOUT= <+/1D_H.xwp>
##$LFORMAT= <normlp>
##$PFORMAT= <normpl>
##$SURQMSG= 1
$$ End of Bruker specific parameters
$$ ---------------------------------
##NTUPLES= NMR SPECTRUM
##VAR_NAME=  FREQUENCY,     SPECTRUM/REAL,   SPECTRUM/IMAG
##SYMBOL=    X,             R,               I
##VAR_TYPE=  INDEPENDENT,   DEPENDENT,       DEPENDENT
##VAR_FORM=  AFFN,          ASDF,            ASDF
##VAR_DIM=   32768,         32768,           32768
##UNITS=     HZ,            ARBITRARY UNITS, ARBITRARY UNITS
##FACTOR=    0.250966925370066, 1,           1
##FIRST=     8223.43324360094, -67983,       -37001
##LAST=      0,             -290483,         14025
##MIN=       0,             -675550,         0
##MAX=       8223.43324360094, 448405350,    0
$$ Real data points
##PAGE= N=1
##DATA TABLE= (X++(R..R)), XYDATA
$$ [...]
23756 -266613 68905 99880 130593 -369516 -231244 279067 -37286 131221 -197784 -92161
23745 -205656 11852 -155818 294122 -228862 -8971 183926 200223 -341856 28157 36454 -130866
23733 156993 -192526 79019 340475 -169319 88639 -145341 -329606 -399120 -34570 -156611
23723 -156611 -268170 43653 124366 -255251 51772 36031 177958 139852 -12743 149644 -107543
23711 243190 129580 30249 146792 -245859 305621 65565 34799 -168787 -161077 -1760 122998
23699 102699 -30853 -165159 -249466 252379 416319 139861 5971 49325 43914 -267577 285644
23687 -72657 -105049 59482 441593 62244 -257456 212212 116757 -85688 -422458 -169350 55057
23675 4085 -326488 -131971 1889 50134 -135873 -300481 -94200 134622 106719 -157655 -295410
23664 -295410 76645 -18432 21744 -94387 -160343 110694 127764 -231157 -279547 43019 -212691
23652 -1099 42283 91372 1623 -38584 252766 -97398 -74409 -491465 -366205 65560 -192380
23640 -28557 37204 76684 114987 244299 13839 -191685 -222983 8985 65075 102474 41649
23628 -115124 216128 -337312 17194 -279869 79217 -27435 -22912 -142733 173475 -250847
23617 87667 36010 126181 33029 144502 -235968 -108678 -48210 -146303 -42571 -170102 -105339
23606 -105339 129642 67822 -165201 185808 30949 -135465 42634 -26985 22616 178666
23596 178666 181960 -3107 132481 -51720 51450 396265 22663 82159 127652 449295 266026
23585 266026 205452 35169 176053 14054 160141 223054 30441 179266 -32618 -119300 38002
23573 43340 -195179 -51241 -136775 -51440 60339 -209526 68130 -75236 -13832 31028 -189052
23561 -517 -29237 11361 45319 114065 116300 8686 369343 81666 122745 236945 -38817 -73720
23549 -73720 444342 63374 -128784 190227 31896 79952 313118 30154 -165021 60303 -182736
23537 118291 63046 -225346 209024 -51433 97785 262218 61332 -13550 63548 138052 -16289
23525 17068 -186718 -207781 181814 -334712 124994 -128428 86268 284214 -71697 -158257
23515 -158257 -14641 32490 92894 268237 -353768 66326 35626 775 48534 222381 -124092
23503 -146510 127771 -199955 -73847 50799 -43798 88079 -52474 230630 -9669 -68945 -35123
23492 -35123 -297566 -317948 -282880 -20724 -114059 -269853 -16839 31777 -83440 154261 163271
23481 163271 213226 236623 -65627 -166703 -212804 155124 -20331 156834 96683 -168769 -114893
23470 -114893 -114790 -299363 -1131 102266 -169120 -230093 191899 40989 27558 93122 121724
23459 121724 154391 -40416 403884 158176 -94207 49300 -277853 -274120 -297756 -15747 -309632
23448 -309632 206764 -4149 -418577 191216 -126178 68167 -53271 -73390 -259526 -176575 -102866
23437 -102866 68164 94486 24621 -228366 44816 -109884 72508 -163214 294251 245035 23022
23425 28126 -84704 -67581 413308 -12429 200963 184551 -277014 55815 83642 117369 80179
23414 80179 -14228 97253 -547722 3448 19344 -107249 -300758 -161550 -44779 41559 -68563
23402 80960 104638 -109764 -48817 150440 85158 -94345 -5630 249465 12814 -49225 -229451
23391 -229451 191463 170429 4864 171667 -121509 139151 -351720 52378 23724 -91938 -283048
23380 -283048 -274948 -220977 -287051 -25712 54840 -133053 -27488 3648 279653 -333779 195136
23368 160561 -301452 18262 -79899 -93370 120609 24881 -39607 249465 -298928 234563
23357 -179984 143578 -461468 -116947 62608 -113814 -148207 -24288 -35099 22537 -27165 -4183
23345 -184186 -36475 281783 225305 -4919 -202596 87337 -145019 -278627 -139401 -53078 -341060
23334 -341060 29931 76809 -138113 91361 -155094 -1438 33054 67261 -166585 208220 97029
23322 277868 -76971 229649 15499 -197651 24326 192160 -165667 74069 -277757 -17392
23311 210826 -283650 -163465 -44808 -2318 -83451 176654 -225550 266643 67719 -318398
23300 -126058 -166347 -18843 -228138 -53663 189801 -86380 -56288 -70769 226186 17582 205383
23289 205383 -3984 -92175 -69434 -262755 83611 103240 72180 -5472 -444429 -145973 20734
23277 -134767 -78277 143896 -309957 -178105 44737 281474 83730 -13155 -853 49460 -111181
23265 145081 -39730 -131332 155429 -129043 -307435 117599 137672 109374 100331 -196499 -251097
23254 -251097 -85145 -349097 -86595 -306762 -40637 253428 -268701 -159604 -87045 -21660
23243 -44954 -102918 151944 -3782 -95122 -519567 78091 170983 -179262 28715 -368389 -93006
23231 12754 -205266 148664 -27860 126856 270226 336637 -68688 -62220 -7667 -36240 -226382
23220 -226382 -177764 -69125 8482 -60641 197827 -175536 103776 -271153 -116582 70350 -85969
23208 128820 19118 -96940 -216167 -28741 -274338 3504 -66265 54406 93826 -250953 -227185
23197 -227185 25181 -281043 151882 -245779 -15133 53030 -83748 -12784 92524 -62022 -198446
23186 -198446 -118381 222115 -75201 -72809 -194666 64074 -156776 41961 -52263 36496 60820
23175 60820 -177549 100874 352971 -30186 -123242 -84315 160968 -321557 -200163 123087
23164 121140 46747 -96024 -146156 -320204 -108341 -264864 267582 148658 275022 -68182
23153 51117 -15606 -47783 357003 -214124 60608 89342 -143747 10576 -43596 -206305 -141671
23142 -141671 -92169 9202 -118285 -77675 -112914 -31002 -60217 -63630 136891 28853 136775
23131 136775 -292084 74753 -154533 93894 -148263 286169 -98192 -98616 131570 78105 49794
23120 49794 -201492 -101119 -125052 -90193 189756 -104251 -129403 209382 33300 -114920
23109 120303 -104063 299627 208681 -3147 302728 -136396 48168 186601 -65883 243204
23098 105798 61583 90285 -111090 -233405 84267 194146 16235 -11320 -13212 85419 -139474
23086 60362 19823 -111796 -106659 109531 -186011 79025 31767 -137896 153104 30218 -44917
23074 70975 -308562 -270300 -322847 69014 -272533 94337 592 25378 -213158 -270703 199210
23062 -81925 28815 -19706 -44665 12357 147443 -116632 166016 -90345 160301 301466 17845
23050 124327 38224 123921 42236 -418802 177047 74902 -174372 -128223 -10267 -252638 -72805
23038 54338 64705 -22066 -83836 173108 24962 72311 221990 330478 36467 -124405 231016
23026 137272 16542 -4398 100105 -30488 -126791 -161061 -3202 -188393 90371 -121809 -194813
23015 -194813 -42295 -176791 153039 -99497 81111 73015 -246950 -86585 129618 -162710 45512
23003 -151437 -152264 -263295 -44785 -208393 183248 -203246 -21263 -79952 -232506 -13091 -31114
22992 -31114 -114036 -44958 -248904 55147 -57568 -55633 -60077 -245730 77909 -139958 -164273
22981 -164273 140070 -233490 176650 -300588 25295 131920 173335 -92902 -30349 45995
22970 289582 12045 -137067 108747 -201992 -276997 374753 -76794 -296488 31114 74991
22960 74991 -118735 163301 31410 -74293 60697 207005 -103678 230547 -48538 54424 89249
22949 89249 20323 -63744 -289332 -159875 37301 19365 -143819 20951 -145369 102708 66889
22938 66889 -14733 4469 224799 -19118 101818 15493 -282127 -209406 76596 -157465 64461
22926 -83574 229614 84907 -122431 288793 -130897 37038 -69248 8663 -67758 -55877 61005
22914 63077 -46759 4117 -99716 -133375 21470 76962 266273 35981 51466 -67488 135881
22902 -133974 -46304 -24081 -165674 64042 91217 -206586 -99739 -32553 11557 -470775 208369
22890 -168706 -68431 -47455 108890 -398046 26642 206681 -191327 2750 5485 26267 35646
22879 35646 157282 -74700 -124713 -172561 134383 -159756 324102 -33730 -225685 -261067 -228074
22868 -228074 192504 -17307 86559 -472775 -257229 165086 -210344 384749 210929 337234
22858 337234 -172986 -271937 186852 -109214 -103417 -161955 58158 -147023 -214604 122339 -249940
22846 -93178 173161 119009 34243 -30197 61698 -111207 23385 282730 -222487 -94672 -163120
22835 -163120 251188 160225 -70806 -91420 -244327 39692 55275 -236079 91775 41008 -63305
22823 -41339 52057 4204 -182015 -85970 -135089 130816 247494 103219 -140963 -44962 41096
22811 30961 201938 -81970 -168934 -274021 168617 -303134 307724 147825 -236704 124850
22800 -151581 90679 27927 -49065 -59262 15839 116768 -192019 34347 265193 -348774 66540
22788 68553 -87569 146779 3010 60817 211864 -141884 11076 -56103 134379 -113005 -14284
22776 -263383 88075 -37368 16028 -79523 258138 -23551 151989 -47493 -19330 -62551 166690
22764 242492 6739 -234023 -393004 -223503 244579 74291 -235071 126561 130218 147367 -42374
22752 -231797 3413 -173237 288466 -328073 78352 -156728 -56330 -55023 74164 -175489 -140608
22741 -140608 -249332 35261 -78931 201091 -192325 68185 -110511 -62333 -216643 12214
22730 211307 -50830 -34306 -249731 -95449 173936 -113348 112985 -74470 101456 194660
22720 194660 -13705 -294643 16680 -246332 -332802 -158824 -37059 -156311 -134692 -53497 -493508
22709 -493508 64496 385255 263536 317101 -32041 -381795 26667 -5613 -11469 -119790 -56302
22697 -106000 60139 283862 45295 43325 265262 -42542 14167 66258 71914 110332 -15878
22685 92898 -412484 128055 -5630 23872 -168453 -202681 26576 220666 126464 58291 117045
22674 117045 -54709 24451 161518 -35304 -147207 88372 416888 -87822 17918 -253027 -276066
22663 -276066 225786 46392 -236267 -52731 3546 13603 103227 200945 -18827 -124290 -103669
22652 -103669 268350 309415 124542 51339 -181565 11278 -166862 154742 -70779 -17393
22641 -301002 -101302 326569 79249 112438 -196741 -131774 13422 -475596 -156372 -344232
22631 -344232 -61089 -89578 -240678 -55907 -10654 -79344 16457 -274451 136571 10937 476556
22620 476556 70105 193238 -240686 -126215 -93395 -12404 -35314 -4351 -73862 40612 283002
22609 283002 137611 -191331 -181144 -83717 -313215 69784 -74848 226642 -169083 44788
22598 -43843 -99808 -158129 115039 162808 178493 129231 -40809 -23691 -137080 -59092 207722
22586 39634 23149 100566 -15422 -12925 -133539 16834 -32090 -274594 162209 -96553 -7908
22574 -230585 -220081 12462 -70972 188305 74791 -154 -44387 -220355 353187 34252 -220787
22562 74808 -181211 70766 65211 74505 -109907 -100106 265314 -206592 274724 -50772 90853
22550 -46679 242150 144758 -297879 -268368 -85602 218105 305881 22403 339691 -224647 -147145
22539 -147145 -78362 -107949 173103 56688 238243 -217561 -192652 -225592 -236922 196656 67380
22527 -107850 125637 -187549 -122302 -19266 -181828 -304026 213141 -39899 -2383 -437451
22517 -437451 -266995 154774 -363347 45600 23778 266406 30249 -139674 -89849 121443
22506 157398 -194736 327241 -98173 -204454 -197548 -159599 -15436 7932 -263090 -327358 -6057
22494 176675 20919 -93531 22352 -1664 143692 320421 28352 160634 -177318 -215086 -21707
22482 -163740 68542 -17854 -216449 -238441 -184777 -81461 106540 87970 141337 -188048 92721
22470 -247414 195515 -63279 201255 52697 -19551 -46562 -133359 -104557 -404464 320389 -218890
22458 -230533 -1862 148720 -10226 -141808 152677 37069 -236360 -64399 353154 -168758
22447 8118 -214240 212678 208144 -10569 292333 -135094 -83812 42213 -93270 182830 -176356
22435 -197300 39583 -51730 -183210 18951 96720 -164831 -35744 -10707 -431688 -108759 -148677
22424 -148677 -164298 102152 39452 389713 7082 40666 -13860 -108673 203135 -69255 -113456
22413 -113456 -542255 90561 -104246 57440 -162589 -186170 180734 345858 -210715 139378
22402 -169012 -306030 245706 -57530 355313 117376 140875 -286915 -478653 -78045 -287392
22392 -287392 103602 -139514 -10047 -23471 -26500 78338 57130 -50119 -97841 -334717 -8750
22380 4097 -23965 288742 -177464 20595 -499453 -82604 -375421 65336 -3503 49203 -2389
22368 -97989 -409023 -62233 8845 122164 333227 -146298 -231321 159087 -236561 61588 -71022
22356 -198772 -86889 72030 117184 -151268 118234 -143405 150836 -52903 -156433 -14952
22345 213956 -201537 -161402 170571 364808 -183374 -97798 -297134 -445450 -182303 143160
22334 8214 -57769 -188268 -20360 81083 135301 -344971 -400772 -28950 20760 -433139 -223976
22323 -223976 -187914 245083 1600 87923 66209 53370 -82783 -274162 -161829 -123753 64875
22311 -81448 -33222 206508 31721 -32337 -120981 -127244 -208031 -105531 -120104 -123321 130201
22299 13541 -183700 -226453 85724 -217768 -157830 274654 251095 90547 607791 269296 -77983
22287 -100888 193000 -23823 -306190 -86768 -85262 190359 -59964 -23780 -144307 -200888 -419867
22276 -419867 -286774 78460 -197029 203893 -162035 165860 20724 48756 1062 89615 62625
22265 62625 127313 253877 -5921 -54901 273424 -353011 -10070 43798 3472 -79950 190731
22253 -355115 -153714 -384278 136942 93501 -23387 -328615 21512 -220337 -331140 -70049
22242 -12240 56809 -136016 -304590 57057 -69814 9170 15281 -78949 -283758 -31646 -353042
22231 -353042 -69945 -28562 -245475 -141202 -373345 -1162 -138374 -316744 -48264 -107956 -251815
22220 -251815 -75237 -97358 -96780 181066 -188254 27854 -83790 14941 5916 -55245 -141140 164699
22207 276922 -220951 41282 -269530 -71907 427168 -122112 -69679 9526 337150 -187697
22196 -203228 -314972 -347920 165101 -217484 -27889 -91309 -92905 167818 158675 26132 103027
22185 103027 -55818 224024 73675 65201 225574 25304 -154105 -258844 -9166 -132184 -320344
22174 -320344 -282136 -267593 -307724 -134676 -32 -108093 45726 -54960 -286047 -95221 -143201
22163 -143201 116741 -87305 159561 -170646 153807 149641 43161 -139866 12939 -78036 133276
22151 -249068 -330081 -83393 71964 -91108 21562 175810 -40401 34602 -284432 -111953 -111903
22140 -111903 36937 65037 -465137 -36910 -24505 132348 188240 183280 74706 58376 -136027
22128 -150711 -276037 -494112 14795 -4895 181277 -113173 96139 171039 -62879 105516 -269995
22116 29973 194631 -88772 -315906 -112582 -24983 -7232 -209620 126795 -143139 65956 -142824
22104 68302 -260476 -178286 258044 128161 -5554 163 66738 134357 87456 208346 -230637
22092 -120741 -54686 -93894 106102 -56908 -127224 -14721 -236392 -92871 -331614 -357084 -189680
22081 -189680 -157666 -103718 -246864 -107369 176732 26802 152047 41324 13063 53093 180960
22070 180960 -35618 -244089 -68785 38327 -85733 -249225 -229171 48933 -77440 -295874 48097
22058 13209 -168755 107031 -457931 -63896 -77629 -61342 -218912 -57888 -303242 -17564 -152227
22047 -152227 196310 -108888 -11545 -19019 -263623 -205001 13297 149054 -125948 -136058 -405714
22036 -405714 -368300 -46406 -48588 -111820 256797 58386 231398 -82518 -500404 -46158 -24871
22025 -24871 -490251 -182162 109596 233471 -186803 107337 -110592 99120 -51729 99871
22014 -231803 -68944 -162924 -270349 90926 -331374 191699 227691 57281 31992 36746 -210856
22002 50164 4715 -52096 -38985 227380 -128159 -190721 -47858 -252798 45899 -82634 -82843 17349
21989 -286167 -201756 64763 107451 -256141 1228 -188420 90708 -5957 -183493 -171605 -150014
21978 -150014 -53824 -409842 -49186 -301624 56477 -285833 78947 156792 -39890 -391928 -25072
21966 -284240 -165451 -229564 -28133 8004 -153497 -278683 -216215 150193 1582 -166979 -264888
21955 -264888 -80239 -13856 -144608 -21709 196397 -67864 -40601 67153 319640 16394 -275500
21943 -64464 -186522 -158884 -200314 -236257 -115233 -217781 -154886 -54978 -122163 -207104 -132373
21932 -132373 178400 52288 -169603 32763 -160392 57928 101032 -53437 -141540 -399906 -360987
21921 -360987 3252 342942 -170611 -23387 309807 -219068 -62056 100519 134453 1622 40724
21910 40724 223627 307343 43651 -46373 84548 -150821 70832 -131105 -119260 -116835 -113403
21899 -113403 -45173 -51876 342640 -11825 228324 -101354 -290707 -55999 170814 77377 352096
21888 352096 8306 46845 -125806 187195 135473 96472 5240 1485 75406 -100992 -82709
21877 -82709 66686 110469 -78288 20887 -243468 36163 -145913 5340 -55930 204871 176775
21866 176775 -329826 34356 1802 -176462 95183 -133068 123298 -133899 -164692 -132401 -110291
21855 -110291 -16027 -164552 170046 -89711 -232978 78369 -35414 -238922 9747 -99649 -169675
21844 -169675 -270163 95197 -204537 154644 -36176 22260 97981 206577 12076 -18694 197591
21832 -27351 -114010 78332 -10607 -78830 139615 -318907 -100589 478441 -269053 -156981
21822 -156981 -145025 -237456 -127199 -233408 -123553 9153 -212112 -229119 297813 -132360
21811 -354178 -224524 -189650 -276372 -261038 -67345 127335 -16799 -210022 34946 -165032 -13086
21799 -31499 -342124 -235011 96169 -215107 -266775 -188314 12455 -100648 -173177 -86224 -146281
21788 -146281 173356 154675 -101247 -92763 -437659 -64812 -429907 -42210 -256649 -293130 -305931
21777 -305931 -87752 187456 111124 -78492 -22889 -179007 -81897 -163437 -418996 124366 43041
21765 202248 -79931 173948 73350 355109 -17178 -315332 -114272 94951 75674 -31823 208786
21753 -7995 274964 178197 -177477 -212848 -335763 197947 -13267 -91820 -178080 -136941 91934
21741 -102562 -42894 -35024 -142933 -77645 -218338 102918 107209 43359 -89029 19463 -118150
21729 12958 -317775 -218919 -202004 -317386 287840 -172244 -212910 -130309 205450 319154
21719 319154 69856 89059 14758 -7351 69110 -351086 -76732 -314979 -454269 -133527 -45868
21707 -247611 -93705 -71065 3930 -6945 -233292 -50678 -50371 -376569 153683 11892 -107416
21695 197684 70229 -173865 -176422 -114612 112722 -10843 -60892 -28261 -145867 143571 157339
21684 157339 -145437 39155 456774 -114186 -183123 -67336 316336 224920 -278313 -189447
21674 -189447 105628 232898 24999 93330 -256149 80798 15722 73911 -533163 -506188 -124602
21662 -183688 -90212 -55717 372296 304258 90613 88276 -215200 -200031 -230635 -374900 167703
21650 -213998 -153513 -248996 -134299 90661 -117799 -70495 66617 -143544 -2576 27663 -72174
21638 -198437 -4633 -74980 18893 35195 -24103 -24906 -80419 15811 -187156 108087 -326986
21626 190876 -162028 267803 4126 -112036 -187606 86384 95183 -34179 -288042 -14653 88587
21614 -190738 133812 157144 -180863 52924 67720 -153896 206960 -356081 -249399 -14162
21603 -345077 132328 -110624 -93308 -203996 74076 -372484 102686 105069 134660 -18943 -309482
21592 -309482 -103530 -20020 -109708 197847 108524 -147246 -25625 68901 -63510 26077 -73504
21580 -79701 128812 20358 -179884 213507 266185 -250278 -43931 -45489 -49 -9255 160809 -8017
21567 -309195 -81079 -254424 -94183 112130 155211 -302926 -140835 78981 -21961 -110626 -140967
21556 -140967 -80654 -194929 424742 128428 -189240 -101050 48548 -305321 111966 209084
21546 209084 -591573 309053 41999 -248832 -87348 -31205 -163455 -151931 -301415 11431
21535 129420 70449 -69940 72936 24464 -147849 12900 -46545 -314474 16372 130305 4869
21523 -416786 -16733 -182464 61023 -469437 -37753 228741 -29360 199558 -38250 28920 460439
21512 460439 -223285 19505 128760 -214716 -206664 15802 50221 84493 -325895 -17612 -182569
21501 -182569 -30617 58592 -88391 -312185 -84131 156355 389 -55458 -259092 -331216 -230248
21490 -230248 -50973 419195 -99278 -238055 134105 -73456 -195508 304121 -65834 248663
21479 279620 -161386 28775 120378 -40910 -43165 -99512 -191032 150085 -276607 20458 83074
21468 83074 -287544 -270382 -36200 69849 223786 -27516 -29466 81645 285738 -181680 -258275
21457 -258275 19534 -9695 -82009 -261873 -389393 -152333 24763 -50017 64275 -75477 -698
21445 -62703 44750 -159604 -228968 -299240 123434 96331 40488 409034 235283 272815 -34063
21433 668502 -208751 220511 151924 478777 -58087 189388 -501228 -463259 60410 -125864
21422 84334 -144318 -16222 -199653 -81887 -51384 75495 -391298 64946 -354784 11466 103892
21411 103892 -43704 -126287 -97944 52106 -269674 -142692 78942 111698 -114106 -204163 25513
21399 -52635 -48371 -251978 43675 -177791 110648 -182319 -178042 -427967 24364 225849 114303
21388 114303 -105468 90680 -222894 360461 33427 -269477 114669 -323388 -249636 -307402
21378 -307402 -78858 -70674 -199646 -58807 54422 185574 28413 175024 -130833 49941 -38867
21366 -242431 46028 137763 -20891 -121890 62269 7633 53873 -556668 -96403 154049 -486088
21354 29141 5577 -59835 222595 133161 96112 12718 -23295 -221155 81228 -116917 -335889
21343 -335889 173703 393782 211029 38977 -57925 -142804 115224 -184371 -92420 -288194
21333 -288194 135113 -126061 66371 -28269 -60793 179307 -3692 46579 257986 -456138 -184231
21321 292 -181499 21572 -5232 38667 83622 -333731 -228534 -197595 110975 -185834 -41270
21309 -123398 -244441 405704 -45889 30900 325607 -61879 -192017 -54009 -220302 -608111
21299 -608111 286801 124064 10914 -416713 90555 200647 -342976 59127 -64112 -41113
21289 -41113 -91379 -4743 -86965 87185 -103257 -156262 -219933 94367 147589 57490 -126969
21277 -77791 186617 -77280 2258 -199787 16430 19335 -194728 -110939 -115839 -216258 20383
21265 -15824 -144992 126436 319302 6650 49616 -61985 -88830 -223458 237440 -173035 52670
21253 107051 -193273 -135295 -358952 134045 -120814 -244003 -89760 -236216 -355635 -118030
21242 -467354 24535 -296822 274107 81661 -256233 211274 -101374 -134763 -175959 -167032 84547
21230 -112524 -126864 -94446 66039 33303 -176082 185703 -171761 -110655 -189792 41669 399578
21219 399578 -365731 -55397 -57324 163397 -220726 -3966 -36451 -89962 -194400 -72165 136694
21207 -142781 12745 -118153 -192399 -138273 -278644 -55480 -38093 -498357 -416855 -31418 59992
21195 106609 -95702 187874 -90940 256124 -53386 -37253 -23048 -110113 102258 -70763 -92112
21184 -92112 107972 -11729 259943 -170918 82005 -260954 -214090 31482 -26158 186263 148235
21173 148235 -61906 -176105 50782 25840 -181188 345533 -44595 60630 -257020 12796 -67757
21161 -97552 -28659 105099 58814 -81853 111330 92129 231082 -338955 97224 -218310 53665
21149 -336725 55471 -225837 232355 -25551 -40435 20295 -249705 127949 -232035 -108830
21138 -257985 116367 214960 -118882 13730 -81779 114135 -12036 -61459 169684 -134051
21127 111564 -14336 -171072 104672 251600 -137331 -156519 76127 25155 -147696 175409
21116 101375 66870 -202814 298564 -210328 -108158 -79211 -125337 -164847 26437 -255402
21105 -60940 -63752 150612 313122 -146910 91186 -151436 -219541 -140 18279 -122380 -82335
21094 -82335 -96577 -226412 62812 42790 5809 -192564 -268209 -219531 146321 64194 106292
21083 106292 66151 -282224 -280066 -301669 -162840 182068 144125 155020 -274474 157363 -236041
21071 -186373 -273086 99649 6249 -160834 -111018 4861 -216863 197126 60488 -291501 -232188
21060 -232188 -139086 83282 -147889 103469 87019 -325314 -245799 -127361 36446 -85391 88273
21048 143191 -117007 -21955 -40809 129400 37715 -317077 223158 21056 -35506 -277590
21038 -277590 248784 -2623 -275031 107397 -130990 42661 -366129 353206 19360 108699
21028 108699 -7247 360550 24849 -51968 235796 75957 -32769 241371 -226616 156174 241714
21017 241714 -135915 19711 -283939 42642 89990 25908 41075 10333 61007 -30784 435913
21005 208918 193927 173316 379246 180741 -31655 170686 292157 -146118 81582 -164924
20994 -360414 -100208 -157114 28084 23131 -42833 238784 -119225 -186889 -225682 -59229 -59828
20983 -59828 -17824 -318733 -27696 6647 -156659 -243097 -203911 126716 -50365 144333 339603
20972 339603 -397900 223613 -418461 297852 -46031 -222662 10781 96081 119940 -40314
20961 -286498 162801 -51006 76180 34149 -350532 -117036 108627 9892 -63054 -163203 -89322
20950 -89322 -203646 149818 395491 52030 21568 296601 -276524 253819 329410 209062
20940 209062 67275 124934 44844 418675 187362 -17810 -49079 181624 16075 -196334 -78732
20928 -166849 -262890 -106543 -36507 -18627 -23692 166174 -405121 -282590 57651 55277 -70872
20916 21853 -195734 103800 157703 -213546 -24617 -377427 -188370 146556 -233714 -9145
20905 38335 -277357 -73650 44860 35103 -170706 -160900 -181105 25384 -199968 -277249 -158281
20894 -158281 43756 114871 12036 -158552 -46996 -121080 67692 32122 -23672 -88160 -35743
20882 -173299 -94450 60759 -65503 115551 20764 -897 82822 -77569 -12646 -244950 267007
20870 -29801 82227 60703 -59595 203696 -14627 107211 -186179 32648 246195 -294450 197249
20858 -191465 9669 184243 133422 72321 -311550 242304 -87909 28482 -63974 8032 166196
20847 166196 134354 -101567 159415 -27219 10313 5724 -122699 -98527 -27907 -156345 -64931
20835 248262 -17911 69802 436604 -20270 255416 -37772 81590 127761 119120 -303154 94413
20823 -141649 -126713 38397 131962 -38320 109000 -42597 -317457 15825 5917 -143318 12299
20811 151932 13918 63899 -59880 -139978 -135374 -239858 7927 -263613 196497 175127 194430
20800 194430 -142709 -74219 -114368 -27649 -29277 -131640 -139415 77218 -353668 -255516 -140366
20789 -140366 -274577 -61768 60430 3260 -90904 -243220 -161629 49062 -337027 -171302 -370910
20778 -370910 -266696 -1928 -118093 338029 52659 160492 32190 74598 126552 -6569 -182666
20767 -182666 -122763 -353333 174181 -133486 -76659 8379 131186 -158013 -295654 -141544
20756 155261 -132241 -139484 -43675 -311015 17407 26419 7659 -283671 104628 -215603 -202500
20745 -202500 -26380 -231643 53072 -308706 -353114 -161188 -250826 -33801 -115354 -296189 -33718
20733 -160318 43016 176463 -254596 -90113 -100003 -217527 217507 -133599 -73788 -211316
20723 -211316 -100851 -316707 -212793 65658 86558 -52174 83943 -289510 35188 -148881
20712 8497 -189620 -128940 341121 24698 -122432 84750 -97591 250830 -126141 -267531 17754
20700 -71850 167909 111175 -43321 -235892 -111537 99463 -161453 -283296 82053 -370305
20689 -123992 -147527 -287775 81158 -188028 -300844 -50102 -154231 -167580 96466 9382 -83104
20677 18455 -232751 -151523 18969 103604 -151721 18352 16270 106087 -270583 31150 106300
20666 106300 -9928 164817 -49407 -339222 -100657 130411 -143985 -165151 24933 -191701
20655 21287 171066 -453097 24990 -194716 -341164 -74709 153288 -56749 161010 128276
20645 128276 -192676 -443637 -122588 -71530 306365 -350102 168259 84971 66744 293303
20635 293303 -330315 48770 -22256 55943 -225898 205866 61675 -126857 -266668 -62915
20624 16788 -389785 113784 62679 -124950 97249 -115020 -132610 143936 -70497 -158393 -38292
20612 -30613 -12874 62114 -167805 -119515 -36896 -32940 -32267 -206104 5755 -55342 75509 266953
20600 266953 -217259 -24431 -239968 244634 -14093 82472 -153363 48727 -9524 -301410 -153122
20589 -153122 273628 -96143 238122 -158444 139245 137723 -18758 -4010 76367 -215611 352511
20577 -41963 -45910 69694 134878 -2108 47709 -32716 -52681 -174678 -156615 123688 38664 171863
20565 171863 52178 140152 -347182 -205772 212244 25535 -472837 276032 -213352 -30186
20554 -81009 -125431 -30021 -25812 -76742 -112664 -98069 -314420 -287203 -264313 -60190 -119585 29199
20541 -190613 -105091 207653 -1638 3372 -49346 150904 -257894 -150029 -63448 -214063 -187424
20530 -187424 21241 70010 -4683 -331646 73330 -216818 88578 -368959 35453 84513 -20339
20518 -221836 175211 -40762 -29607 -126745 -152782 -270373 -16587 78358 24660 -10463 216092
20506 -473892 -15749 -60596 -98984 -227731 12285 -46852 -292564 -108755 -192259 41194 -111031
20494 134606 250276 34011 38256 -238372 30295 -19156 -309616 60194 -145140 -305864 52925
20482 -35139 105328 -48202 46762 -58939 -114522 156637 23533 237105 -112100 -114705 43814
20470 -148586 37227 -9434 -290305 -159130 -43220 80133 -40877 -330955 -147130 294302 -104278
20458 173873 -183486 -238816 -105011 -83108 -252807 134272 2912 64222 -77507 -10273 63205
20446 -254427 35899 -39639 -64579 -92642 -360304 -110071 -271681 -230837 -5499 65664 -88260
20434 12635 -110231 51379 -118659 -212130 270121 -95220 45302 103348 22154 71404 -396885
20422 -150427 40196 -34283 -45057 -218089 -281443 -44118 -306619 -122110 107179 -160573
20411 -278647 -80762 -98113 111319 -137687 302778 -58023 -156814 -102948 158119 -179437
20400 261013 -84001 -61417 -179755 -63231 2014 278287 86372 101077 -85371 -90262 -54702
20389 -54702 20071 -169171 -71188 159132 108575 -408419 -55027 -1974 -11527 -146604 74292
20377 -322108 34643 -75999 -332078 -5848 -173303 97261 -43153 -31774 -153314 -284567 16097
20365 -211812 -15324 -192612 7732 215070 165850 -149158 -61133 -180641 185477 -251529
20354 129576 65737 -111447 213513 28124 -152512 -224209 27861 255401 -39673 -175465
20344 -175465 4338 -203551 -88061 5109 -10852 -200629 -13025 -195939 211784 -341594 -147107
20332 -134768 -254163 -248782 -416662 -54447 133354 -194273 -42421 -45197 -5892 108653 303432
20321 303432 347422 6029 -215108 -351907 -32370 55857 -445138 -28935 -102820 294172 -95651
20309 -231402 -36380 -112058 -170220 104483 -149246 -86073 -206074 -212213 -368946 -67608 -235159
20298 -235159 140284 -54985 74368 -181916 17047 -277616 -80486 -42910 -39223 479011 -287651
20286 91882 -225020 -37521 -2028 228837 -392488 -146973 -262053 109199 -101440 -273347
20276 -273347 131205 166063 -155169 -178149 46835 9034 137241 265949 -222764 53057 -101789
20264 -151823 -191394 -16147 227818 -34654 213375 -11573 -46097 48480 15360 -120844 57690
20252 295524 111033 -18995 147295 -522685 9883 15499 -36621 -89246 -24305 230259 -43241
20240 -45038 -252256 -182428 -119200 -239228 196209 -311426 1177 388875 -136970 -50486 -237723
20229 -237723 -212091 -135606 342536 -298477 -57141 -333370 -119274 -230739 -120903 -237864
20219 -237864 174579 47043 -83868 78981 -91837 -55493 -227213 162786 -45600 -331304 -342018
20208 -342018 52173 -376473 -79137 59803 19219 -136445 -74147 -24040 -277110 141761 47107
20196 -31273 -30842 130669 15850 323858 -2659 -303551 -3702 84599 -49941 -60720 -159365 -231222
20184 -231222 -119151 -47311 188503 78083 -290852 -93081 47108 -98832 70964 -342674 -75557
20172 -287727 -230998 -258850 218253 93357 156986 22537 -6878 170526 -132254 -47125 14635
20160 79324 97134 -65872 -58169 -47698 142850 305903 75226 -46043 99000 -142740 246983
20148 310698 206545 338562 160476 192569 127106 331938 270231 314617 205279 92506
20137 434521 243740 437903 254616 217770 -164859 345031 -21892 -173095 -121120 36765
20126 -10968 -218005 -263603 -27034 -256203 -54729 99383 -206788 158885 -186670 12671 114762
20115 114762 -445561 -77642 -24707 -101514 61978 -240533 -213032 -4901 -165927 -179247 -202449
20104 -202449 -94097 -226429 -129880 -43928 70639 -19204 316469 -255795 38956 77183 -44381
20092 -297270 160892 94387 -136302 -212842 42409 138038 78672 -38067 185966 298503 -282167
20080 26815 -125113 -85936 27676 -201489 -251673 8731 -274057 114780 -304742 165340 244229
20069 244229 -26909 -135001 -348548 -106850 -176894 144045 -50415 -80085 177066 228929
20059 228929 -111676 -43248 -8828 -92474 -242857 152817 -223777 -112316 -91653 -296943
20049 -296943 77963 -65501 33123 -85352 -194516 -156564 -440552 -438554 -62983 -218971 59465
20037 12420 -480457 -15427 -82817 -268275 -28666 58869 364242 103048 -135993 13682 61858
20026 61858 -203722 -8805 -120186 -189183 70677 -16062 316080 -263576 -41442 -162939 -69790
20014 57343 -37558 -172672 112698 105987 76784 226357 36111 188356 97119 -114339 -212140
20003 -212140 -160760 -3149 99815 -69818 -331417 146556 -25706 291310 183681 107687 380042
19992 380042 138946 142091 -22513 242291 77376 -44306 -83118 69267 153848 -135875 -272067
19981 -272067 -217319 193487 -43610 -51850 81855 55454 -203960 89024 179824 -37195 241611
19969 -174108 -29700 8927 51736 215244 -4368 -37479 54573 77370 129869 -130654 349398
19957 -204371 -43928 281105 -215312 197074 140423 426877 478869 170285 105458 91982
19947 91982 13525 -79463 179476 6926 -31640 -348231 -100478 48742 -11904 267061 -183565
19935 -46492 254039 -215217 -199815 -89755 -226697 -79192 202877 -34379 386444 -152888
19924 -23521 82248 -49348 -39028 -237432 -88536 13250 -178215 -6627 -165948 -257544 607 -11515
19911 36339 176873 -143865 -200044 -110206 -101758 -207846 59299 -28908 -247181 -110933 -352387
19900 -352387 6960 306265 -23139 11086 -474665 -85427 -4935 -34602 163931 79242 -36859
19888 11868 -34400 9938 -38437 -205769 -423824 -195206 -23301 24470 4393 -269518 -309728
19877 -309728 -436239 -176452 -147683 135621 66832 131932 126303 -202401 -143090 214215 100791
19865 240914 2790 68799 -14707 253843 204442 -313327 -25208 -403334 202537 -161123 77328
19853 -131631 -233100 -52206 -254111 -377418 -33753 -117731 -233831 -267498 241243 22422
19842 151641 -26817 91408 -108702 -386150 -405604 42073 -223707 267463 -42087 -27721 -208063
19831 -208063 48443 -37857 99264 5589 -115831 -164491 -173174 -89173 -399316 58192 82876
19820 82876 -286803 47290 -158526 -78878 -76322 -149847 -205381 14235 246968 39403 -200313
19808 44607 90660 37339 -56150 39044 236389 -23496 -165577 -52156 -8078 -78552 -146319
19797 -146319 -103442 -236798 -87342 -171717 14382 13616 -146675 -32877 -55162 -339659 -69071
19785 -80122 185961 145093 -126639 -149556 123608 56128 -64254 1764 -34563 -153547 24896
19773 -89728 -53726 117393 -242465 -101942 -249509 108534 -37779 4401 -285046 204970
19762 -26364 -164732 -257156 -269293 -250718 115705 -148291 -126080 -83130 -109190 -347302 -59986
19750 -103871 309836 134852 -162045 75794 -242258 -43533 55518 -40471 -308278 -24237
19739 -39501 -96106 -266509 -54937 203207 86040 -135047 159221 324418 271018 451512
19729 451512 236957 515104 712301 416140 151976 78865 105028 60364 281275 226663
19719 226663 -159600 -17296 62684 -60207 -960 -137985 196023 -205066 -121403 -244295 -24761
19707 -150053 203465 36495 192107 -33357 324514 93672 164256 -66459 240582 -28139 385911
19695 509887 582450 176244 -73574 172300 144429 81327 322880 -132608 -55280 -184095
19685 -184095 6488 15359 220668 290375 199635 -216128 -96396 -154021 130043 25509 -226279
19673 38879 -101642 18130 -18777 -229165 -96873 114047 5064 -159934 -233622 -35505 43183
19661 134246 -68370 -163871 -138831 -248918 -276835 -17571 303786 363378 -144328 6841 -104693
19649 -95478 4437 -126877 13262 249346 -66816 232864 4970 -212522 114421 219545 313638
19638 313638 -67436 -126165 -360737 -339783 101215 -269174 -126359 -165556 3697 -3694 24601
19626 -11460 38286 -320684 181005 -246627 -204854 162375 -79238 -219368 226849 69024
19615 -299857 -21466 36275 119240 198084 -1860 -99497 26208 -51765 -37524 -48692 -130146 -36900
19602 -174024 -130719 -146878 -6491 97157 -105954 -142063 -174324 -1659 -59052 -322303 -3771 -48011
19590 -48011 -4730 -95570 -106898 -3330 -70879 -263345 -244769 34044 -33508 -251215 -291458 -48315
19577 -92960 -60663 -272497 94917 4851 87183 -37871 18168 141705 96027 144369 61208
19565 -449868 147648 -159971 -52539 -61086 88111 15622 -122583 -12390 -160760 123638 339692
19554 339692 -310300 -60279 77693 -259467 -237827 54427 -270293 -308220 93482 -196798 44446
19542 -259937 196904 -146397 101772 -173714 -49539 128205 197751 32142 368565 104130
19531 71556 39897 -279844 -384517 151226 -244815 57809 -130918 -141679 290706 -232566
19520 -104780 -41745 22191 -53206 -278650 49219 65542 -48676 106153 67677 148444 -74762
19508 -149920 4184 13369 -132289 -31919 -24655 -70509 -392397 -163010 194835 161722 47926
19496 -63942 75709 -206966 -256859 30834 -32930 2728 -127796 263955 -352678 -103833 -85055
19485 -85055 -312353 -143512 -62555 -122079 -133685 -326830 -300311 -69125 225452 237547 -128570
19473 -366480 -149324 230586 44069 280999 -384660 -150110 -83554 -147218 310648 83735
19462 -192135 -178820 -98026 -18904 -20318 -170816 138039 13984 -248002 -67449 -106441 14204
19450 275763 65441 98988 -277430 -2115 -349152 22974 -232582 -86885 -418468 220306 158351
19439 158351 -20614 234955 10151 112414 -78554 -2053 269025 -118811 -130740 -56866 -231502
19428 -231502 -57315 216240 -350806 -306944 -8531 -113654 -7070 117276 -101769 -70237 -57832
19417 -57832 -137463 286900 -139154 -187711 41027 -207654 214652 -405181 218921 -134910
19406 47971 2368 29333 -220764 -120179 259376 -91236 123479 68805 -206779 100774 57397
19395 57397 77047 11170 -249788 -58455 -48937 15283 33792 221649 -166133 42788 314050
19384 314050 -1233 5133 -237905 -160454 193941 -91307 -290950 -299779 140668 -221208 -158458
19373 -158458 -210005 -86728 -127145 138993 -23839 -130043 -111508 151320 53245 18880 123480
19362 123480 51344 -243265 -188558 20348 -141757 35436 153793 -74172 86031 -164928 172672
19350 -334409 -301420 -58099 -11182 394246 -185070 -279118 -95036 -63712 47668 201330 -191473
19338 -411987 -234646 103223 95808 -14778 -291599 110926 75767 -272424 -78851 -436260
19328 -436260 -186378 -358486 -260653 47113 -197258 65455 -114913 175310 -64622 98666
19317 104351 260863 8218 -154424 -200782 -236768 -127390 -340830 -155192 -234278 -333775 -205091
19306 -205091 -14342 -173310 -133231 -85440 277668 -170333 -208750 -428388 -252387 -70396
19295 -23313 -88489 -176795 -49803 116215 -46978 -198795 -217110 252887 -168835 -67677 22675
19283 104344 -67039 -210076 -71740 -207109 58828 -271883 -40578 -230999 155571 91518
19273 91518 -67913 20014 -251986 -396844 -182612 -114146 -362067 -44450 -334077 -112350
19262 -104266 -7726 -47675 15051 35447 -51632 134630 -178897 187784 -87308 241166 42041
19250 -38331 -54189 -143691 -238653 -194581 -220399 -141705 -128605 -183419 -67348 -255595 -22967
19238 -147214 48852 19191 -211834 -259350 -91031 -178477 138994 -190740 -215205 894 98834
19227 98834 -33347 -114895 69005 196444 -365643 -126565 -183251 -57091 131283 -139351 56112
19215 74353 108612 103831 -111811 -90537 -292175 -48151 -314452 -167021 -374006 -212474 202084
19203 188796 -107039 -159642 -89461 -60953 -65033 -386590 334799 -4343 -312915 -123738 -199283
19192 -199283 152608 -100827 -93073 241557 -107340 -64429 -278436 -120131 127900 -150312
19181 -982 -169698 -34206 40892 -295242 -246981 297837 106171 -81876 -52529 -157381 75432
19169 -91225 -186599 150205 -343866 31724 45190 36483 -385629 39211 124138 -94695 -96451
19158 -96451 -25341 259727 53395 47419 126138 -287172 283798 200371 18127 -100502 -109470
19147 -109470 -56233 -59729 -53069 59415 -133962 -196283 404870 253448 -210111 -13464 -62229
19136 -62229 17622 -25692 -201741 -61626 -359928 6429 -23359 -400142 -233078 96907 17482
19124 -18264 -134261 -175022 233554 112859 -314795 -174007 -122081 50811 297974 430746
19114 430746 101773 -227640 -12886 -135170 -205081 134288 -165000 -293835 200297 -295068
19103 -83081 -84313 182006 308653 -260835 -146081 -140450 -54481 -80734 15830 -116303 -10912
19091 -81885 -15120 17836 308008 173872 -117771 -34294 -7161 8648 -175391 -87231 -344292
19080 -344292 -311655 106815 -330388 169663 38401 62493 -300996 -261200 150854 -129599
19069 -203133 -60371 153312 73821 96280 -36335 -73031 6483 -143305 -166513 -46102 -112121
19058 -112121 -97319 -218676 -56297 -190923 -316296 94123 -322696 -15786 -181492 177014
19047 177048 -197148 -64066 -94901 203860 -196353 -309783 -18420 -41376 -267622 -569758
19037 -569758 -113646 -168624 41064 -303259 -63598 -51880 99354 -108809 -244582 -227200 -69196
19025 -28952 -22311 -30909 76792 -4074 -91990 34031 64443 243998 91185 -20180 -3380 -7377
19013 -7377 -218638 -57276 40551 -104288 -28037 10047 -164149 72650 -161941 247704 50
19001 -329581 -242291 136497 -99635 -190216 -537112 56074 -74210 161738 183592 156700 -325902
18989 -216144 -231079 -183558 -237692 213584 124254 -121712 -22255 -161401 91395 -192213 264234
18977 236952 339015 317357 215581 56559 -33515 401626 152674 541163 483536 452801
18967 452801 525795 -105324 135571 54006 -398053 192942 -116799 -89089 -29107 -325474
18957 -325474 64233 171891 -96989 -159748 -188650 -51375 -139304 -94688 -70587 27016 53782
18946 53782 -209478 35187 46598 -79096 -202233 -109646 -215111 159954 -96547 -225761 -73798
18934 -171733 39147 -93705 -240426 77673 -15640 -131087 72293 -199564 -22604 130150 -157144
18922 77008 -76691 -391551 -411153 -34646 -366211 -7448 -103439 -309111 184237 96206 -260505
18910 573829 196505 500427 372328 890740 300441 222057 -70943 210384 -129419 150703
18899 -22389 154687 46875 -3816 -42262 -38642 341509 -152050 -218166 -96417 -298862 33125
18887 20242 -192775 98316 -36424 -101024 72222 -122302 95433 -40979 -37203 47509 -126134
18875 -116068 -103446 -177081 253625 -111284 -245920 -132926 -194954 -167684 214721 -218403
18864 -205835 -232313 -44492 -95854 -190456 -124505 -209159 95507 -171172 -95380 -22596 -66998
18853 -66998 -22546 -29640 -40798 178642 257680 -28330 171548 -60161 -50635 -84277 105964
18841 156745 64186 313987 29071 -45854 84057 -132285 -87051 -137 439174 -281649 225568
18829 -150322 289835 -4198 47181 22341 -291772 48792 7555 264227 -319561 -150335 -137711
18818 -137711 129201 180072 173644 -18895 -72726 -108185 -347098 -44221 -289281 169047 145667
18807 145667 -106241 134224 -132128 -147193 131234 -97250 -373426 -82619 -254698 -172153
18797 -172153 -147282 -143860 -98627 40501 -239189 -397303 57807 -53791 10530 -110038 -108954
18786 -108954 -17540 77776 -88952 123150 -397602 -13700 -252993 21053 -29359 -7185 -30262
18775 -30262 32217 -153812 -140626 83250 139330 305951 167784 -92610 59634 225638 -351343
18763 -32600 -77007 -38593 -286495 -146812 -80229 -75646 189213 -34490 42863 -122899 -310602
18752 -310602 307251 -186333 205256 366485 -157319 61216 195 -128027 -18549 -206337
18742 -206337 -51709 -47424 -97154 -201012 -194626 149876 63012 115785 -156091 -89431 -11527
18730 -69192 -59837 -252448 -63086 -158620 -194350 -387110 -131450 214391 -261751 86735 -129011
18718 -320128 -29363 140803 -220226 -108415 35115 -221865 -24587 -99260 -115257 -164043 -16472
18706 -311033 -455191 13339 -195618 237387 -45489 51556 -190887 -196920 212712 290352 -162611
18694 -191575 -89103 -37966 -149883 140293 -9880 -11828 43277 -77571 -269732 -95422 -11809
18682 -191312 -12912 -246246 -239288 47430 -273934 28659 250714 -120566 -56861 -50639 -15445
18670 12302 -108544 -224517 -50669 19858 135340 -11993 268529 -89339 81896 139434 -171377
18658 -300098 -186317 18518 -22437 48017 -230219 83566 -123202 63378 398074 -61888 -5327
18646 -364964 15267 -438567 -204327 -131618 19038 141793 140250 -6108 85132 -388119 -122084
18634 -155811 -165761 268817 144656 120537 609206 107092 -11116 65259 -74447 -164100 176122
18622 -52706 13660 -42830 9371 136151 76995 55508 181914 -102135 -254069 158550 -34607
18610 117794 -266815 -111560 -31067 -10349 -42831 -105783 -141251 -466420 -93516 -162517 14135
18598 -269423 68322 -84762 32655 -281652 61708 -153419 -89822 85230 -16532 -48822 -286120
18587 -286120 -198218 -265940 4026 323406 -188017 -222167 -90753 131874 189842 -109986 90965
18575 -124975 37264 -141276 36625 -119322 -60268 387056 146143 119365 71800 200422
18565 200422 -184392 122288 -77773 -143332 255034 -117454 210337 -14239 28354 -55832
18554 41046 -172407 -122438 -331469 250311 89006 -348005 -262793 -205552 -137085 399245 -89489
18542 -134354 15012 -274458 314376 -233008 -116115 136554 -328849 3791 -377688 233280
18531 -140426 55272 -76202 -32733 -432541 -80227 -52998 52073 222933 -9115 53205 -57288
18519 148536 -163320 -89450 77658 41694 -112681 -170246 -192911 -308009 -145049 234839
18508 16625 -178213 70379 -364011 171160 -74131 -233650 -163976 -7322 -65808 61815 -298114
18496 63592 -58185 -56225 98416 20114 -262447 -200340 -149927 -1156 -29500 -92951 61027 -184960
18483 -206790 -87564 -26605 -76336 353032 159519 23813 -64812 -150822 -343821 -238996 -32664
18471 410569 -172009 -66632 -86436 123316 -42367 -139744 246028 -74833 -96790 -243608 -285644
18460 -285644 -107556 -14433 -103758 -329128 -33103 -112641 -173930 -327573 -257208 -119241 -107949
18449 -107949 -186350 3923 -289892 -109592 -109668 -285599 -129267 -273394 146175 -328759 -191440
18438 -191440 -205306 -239415 -66456 15390 -84452 -420929 -241181 -196102 -5821 45213 67601
18427 67601 173636 -135218 -390618 130682 201935 175031 -413151 -56156 607 459 -61772
18415 193604 35946 -319854 -87531 -189320 119650 -134678 382 -126563 10529 -263728 -51038
18403 -9180 -128456 138093 53320 -96647 145286 179451 412700 -80392 -183741 -53366 107504
18391 145153 212585 -169737 3059 364960 34580 -183203 298969 37169 131080 -82756 -2123
18379 -11584 -137127 178232 -20012 -60663 -145668 112588 -82056 -160267 56822 46496 27863
18368 27863 -174815 -17185 159724 -40658 308358 -260181 48066 106008 80193 25421 -3891
18356 7854 51858 -218178 412333 -11629 -29381 -259030 -209202 -27397 -265653 28272 -1721
18344 -332356 -38669 -167645 8448 8450 -134345 -172915 73609 -132677 247444 -95202 90708 -344553
18331 -32845 88512 -378045 64737 -130270 -69775 8676 -53882 -200734 -121324 60157 62473
18320 62473 -152897 161298 -22848 -23134 -39720 27253 -107321 294521 74266 78784 25581
18308 273518 -48774 -200758 -14165 -183111 -93382 47483 1425 225005 83727 80586 -94441
18296 -30386 -75484 96376 -186423 -171829 -475536 73654 275498 65441 46601 84546 -186122
18284 25041 13566 1168 -80075 -20042 398566 -89276 55510 -392470 -16089 162055 -153307
18272 -200391 -125175 -326614 -97340 -83400 -66435 -172958 -108313 -214961 -103641 -2913 -19359
18261 -19359 66516 152203 -25961 131905 53862 193549 -109648 11981 114827 78283 -6924
18249 -69693 -61341 138050 -35125 -325833 62321 -70199 69473 -139503 3673 -8734 -254488
18238 -254488 -270509 -150693 -39791 -167284 -64078 -15235 -242558 -203869 -233040 -4195 82000
18226 -125146 34703 -39152 137898 375520 -252193 -77394 -65375 13796 135085 -183540
18215 -38559 25631 44069 58168 63411 59149 214549 -29273 -139291 -22494 -158585 428188
18203 -169658 -129564 106674 148936 -184448 -118843 -132156 -297587 151986 -88574 -114714 -124877
18192 -124877 -63954 254843 -40028 182100 -13216 -176997 -95441 -348747 -152891 -167984
18182 -167984 12182 -142228 -155986 103746 -230243 -232004 205315 -186667 -209477 -17127 -221899
18171 -221899 23932 -66557 -82481 79636 -72444 -124393 302275 110296 1821 138905 -190488
18159 -21843 53019 73833 -126776 -38356 205306 160396 23718 -290712 -211402 -152888 461513
18147 -208876 -110619 -23983 166389 225836 -81117 -352546 -4369 170196 1326 290574 210079
18136 210079 -17585 169467 87526 -227721 215641 247710 61767 -14763 -184552 -296508
18126 -296508 -139556 -53308 71584 -140579 -151295 295489 123466 272468 -200195 243880
18115 237165 198035 130831 281681 -133879 33757 -206512 -464924 37239 184737 -90616
18104 186022 -229907 15036 87988 -280075 158408 250177 -199217 -356749 -86330 -107687
18094 -107687 -7774 132146 182834 51162 143939 -97056 -366825 -253524 -84984 281730 -115378
18082 -80673 -237825 79239 -182666 -115748 212722 125181 91673 -222254 -26173 311727 -254867
18070 -81020 222155 109751 -45194 -52637 310672 -240399 28829 -263011 -349740 66586 -283971
18058 243685 -98683 260808 -49193 -156277 242175 -79051 54601 -108014 -360744 286243
18047 -66050 19393 121647 130645 -35706 284077 202327 57801 -25820 -128892 61098 -42709
18035 -269702 -145974 399528 226707 187588 141265 32008 -58284 -212641 -62888 -197100
18025 -197100 -100544 263951 -34674 -316051 72832 117592 -308776 255760 27861 104827 -24599
18013 -112406 -89503 -352186 -6523 172946 -53113 256492 10943 -23881 -108057 -3511 -199166
18002 -199166 -107600 36272 161258 -263411 -27178 -160748 -164319 -116625 182676 -22091 110127
17990 -41422 -96950 -111124 -98784 23620 -172302 316242 178663 -127694 185003 -135442
17979 -64588 60633 -144701 41594 -307260 261571 -42922 -133929 -137051 82834 74068 23946
17967 91688 364759 -5129 -108766 356905 193616 -183354 -187580 406749 -27589 97470 171313
17956 171313 -91743 25445 -304019 20250 -221839 78579 65141 -195523 193198 48813 211281
17945 211281 119229 -188618 -108954 605482 37664 90919 123418 133100 199250 -242606 75581
17933 116262 45270 -117114 192384 80608 79383 -34075 -211383 18668 202132 -163425 138641
17921 -80346 -162591 -123477 -309436 286109 319992 125022 53020 -31650 236857 187483 97968
17910 97968 -46320 62580 -171477 154452 23268 -36431 -25778 -172739 94248 3009 -147421
17898 224880 111907 8309 74912 -131234 67649 -180946 -30219 155448 228374 -86202 -158693
17887 -158693 -730 -231172 64926 -10105 -193612 37023 183616 66372 -252989 -95037 -67132
17876 -67132 102110 -29711 203479 226694 -16764 208307 86409 284990 229907 248730 186984
17865 186984 -295201 -12431 194821 192752 67677 25045 17628 473824 248716 222759 -45897
17853 -13721 -222302 -203128 89918 -205528 239361 151887 48441 -221610 211396 87402 256109
17842 256109 134638 25979 7891 174026 -191917 -132123 -78152 -227216 -124816 -200900 -127991
17831 -127991 55593 172837 -385881 -198973 -162069 88922 -93670 303516 69846 133520 186570
17820 186570 41831 -230231 170593 45239 243799 161105 -91083 186029 179614 164066 -102909
17808 626 24654 -139536 -152067 -97964 9185 229342 133598 173714 63590 -60442 68996 72680
17796 72680 66011 -316237 183263 256596 20741 80008 -245500 127401 34274 83657 -214345
17784 -203892 257508 -137442 -181631 136866 5780 116031 -83484 292925 -121535 131951
17773 160498 -207597 141968 399830 -130934 468985 -38479 -215091 -38073 -81823 -54245
17763 -54245 225605 -129805 -99415 -46961 -45829 79388 -98578 -57047 -12598 -23253 -228936
17752 -228936 -17555 -26464 -158654 71429 479456 49280 -243982 -271908 76560 -5737 -22267
17741 -22267 115267 -17278 -68360 112336 48423 259037 78065 -22709 38777 -144959 21575
17729 -24336 75 69467 -1274 296145 -35690 -240214 -31703 -22033 190599 116671 244521 272162
17717 272162 -78030 508742 -110130 268551 199624 56275 205869 -1317 -216841 327828
17706 -28893 -236367 69214 129957 160668 -125232 130998 -67875 73124 288350 83698 47772
17695 47772 123803 30497 409448 14876 129363 -189290 165343 343344 -170299 430403
17684 11885 78780 206122 61517 308085 -168476 40326 168763 386760 -116559 -3508 91461
17672 152539 -35589 37489 40820 6030 181031 59230 -84329 -61770 283950 -36153 76172
17660 126993 34409 61423 95746 379524 -114043 50069 353217 402074 466544 85828 -58566
17648 379425 241336 405669 96133 150480 219775 354072 -42358 351235 90240 593979
17638 593979 -16777 241811 -191291 409745 260685 -229789 55176 -92176 141885 367852
17628 367852 -160589 -79128 36399 538449 -53425 -117098 -79771 69808 55086 117578 22724
17616 315945 87748 35656 76485 -126542 -215580 -89335 -216911 -22657 150113 -68620 160118
17604 432687 196081 186727 166124 62995 172605 246032 39094 209113 164331 54044 328660
17593 328660 229228 9808 105121 358725 124358 -10268 -18418 102432 52308 -55083 -305395
17582 -305395 176353 471224 184708 -97090 142341 297012 81258 274219 209821 129888
17572 129888 149093 -30942 41051 105018 43004 155040 258037 -111789 403939 -56705 98651
17560 211675 624830 10272 255792 15760 388071 43003 211807 194510 15788 43663 150879
17549 150879 124798 228067 351258 141013 127793 -10991 -84548 195082 280194 344982 66588
17537 550527 131107 301675 614859 200059 88004 631438 326679 223240 336161 641639
17527 641639 319625 689271 915383 1077635 1271745 906181 1060956 726207 852585 411428
17516 327049 473160 698833 529214 645280 684893 628123 709190 866791 1090565 930963
17506 930963 948611 791008 738780 377315 -213856 486389 291814 584872 122375 665885
17496 665885 392164 328688 28499 444182 114759 217826 248148 315132 224415 737901
17486 737901 275773 10983 437517 144668 90224 607856 366765 180280 -97405 75686
17475 479765 318499 240224 367454 310058 -71735 177189 328423 198075 517254 632013
17465 632013 280783 449087 236276 193496 410854 312533 270603 155139 378211 471942
17455 471942 159816 44394 368327 -1645 376034 260294 224440 524874 279635 64044
17444 135021 300466 302545 556406 -73712 562477 328665 -111242 336470 324866 490712
17434 490712 176863 528365 338931 326623 332436 220928 489875 214051 228696 143646
17424 143646 412695 640495 473560 546902 538437 274467 377888 422253 327608 361135 281630
17413 281630 280545 508699 227712 550076 301299 544626 298229 197701 540398 250141
17402 184311 200187 279299 15721 -276290 466037 276406 390070 334521 283241 54038 241626
17391 241626 70393 357485 368410 289986 436179 -138606 167443 225903 362128 308367
17381 308367 259972 246225 228232 166752 389969 54357 63080 383671 -63428 484082 -45376
17369 172222 167719 397145 -42922 80317 151242 357242 279390 312851 284824 204094 294676
17358 294676 -22266 -59335 70009 267368 409374 -99590 468010 17155 269286 400734
17348 400734 460762 105326 408512 200968 444384 323255 320656 257578 189373 257699 254136
17337 254136 319227 656913 210324 660940 512153 296838 450419 457102 195758 203934
17327 203934 -45849 194265 436374 235484 439474 248985 95805 -57886 137840 63748
17316 484272 227829 193358 301022 503521 222883 131391 523004 368439 641646 488049
17306 488049 170605 78426 501826 152843 424103 362496 161975 90395 245297 345521
17296 345521 217590 185196 136626 466786 549884 107352 115206 281913 15805 619679 6054
17284 790 470092 470841 -141340 293869 293751 323536 828457 420662 456917 297774 397404 -90288
17271 516597 167687 255235 281065 486202 256969 454857 549990 22244 307878 71853
17260 447194 434866 579939 268743 -38990 391499 301224 403417 246142 135665 380394
17250 380394 552978 264708 298314 425287 607437 195638 306784 -23396 348331 329374
17240 329374 573635 16291 193714 232842 274200 178513 489897 298993 265425 456931
17230 456931 480250 533475 460996 77658 169699 333414 187882 646113 271968 331085 455099
17219 455099 786619 463817 400412 481061 568805 378814 421713 481162 298375 315206 523120
17208 523120 10272 539869 689855 471666 504667 588015 525408 227896 374901 142428
17197 -4391 4637 415373 -83002 424988 444684 207776 141536 449199 517432 389051 336984
17186 336984 146839 714994 504752 511033 507223 262715 328546 457515 552859 421122 553536
17175 553536 453141 577531 10707 542896 695326 614801 309947 648287 713740 464081
17165 464081 491171 263238 552566 421012 644519 288602 548074 743486 680513 664051
17155 664051 458848 793950 568218 464329 323587 333244 469926 755791 -801 635123
17144 349930 629677 490862 506261 491904 438106 711020 633767 668092 731409 522057 609719
17133 609719 652172 367133 365866 302958 553486 414072 666365 683231 638917 287924 493971
17122 493971 666725 414351 854655 455289 673316 570796 663640 534304 603543 826029
17112 826029 725096 629074 636249 649255 666002 873009 749598 752706 811339 796972 598889
17101 598889 685860 375654 394259 760727 734461 541897 872146 695968 762632 865755
17091 865755 712306 1019858 518305 731962 540389 790828 480101 633674 440166 696421
17081 696421 752675 705688 637146 750049 738609 622303 878562 1043428 870046 654642
17071 654642 903212 624387 645801 831184 889159 778727 611012 386547 628583 755966
17061 755966 599959 996751 824694 677795 790663 1141364 900803 917019 880989 962113
17051 962113 434004 947375 703786 974959 744932 838654 579824 760110 797348 1062955
17041 1062955 665759 987109 917459 905315 1010504 740934 1027918 1077262 874219 1069598
17031 1069598 902541 982756 711729 1124788 1085683 882898 821035 1108692 1022957 1019215
17021 1019215 1126074 958467 969462 1188144 1411807 760625 1305997 1238428 1410501 1239316
17011 1239316 1455023 1045016 1129376 1152127 1103749 1042572 906538 1217857 1193258 1147594
17001 1147594 1222687 1109221 1048771 1392429 1257921 1251047 1177329 1268663 1425792 1667115
16991 1667115 1330207 1431191 1158187 1534740 1430598 1399840 1412721 1452604 1438904 1507038
16981 1507038 1403412 1622935 1380138 1629597 1270952 1541503 1324623 1376789 1286247 1974832
16971 1974832 1016015 1514784 1480916 1190441 1887045 1696619 1580207 1832016 1356104 1556420
16961 1556420 1624498 1681793 1888319 1962953 1815624 1736021 1626358 1986629 1970698 1640445
16951 1640445 1868390 1578905 1633955 1938197 2217889 1993434 1852673 1949957 1967297 1815782
16941 1815782 1925337 2087762 1898631 2139919 1875330 1860131 1968071 2330826 2080867 2271488
16931 2271488 1927784 2145268 2055347 2307534 2048535 2192832 2702573 2386989 2387905 2589421
16921 2589421 2395613 2561010 2098090 2370284 2396988 2326130 2440553 2675958 2338344 2773119
16911 2773119 2435438 2583043 2682291 2516920 2218844 2879616 2560017 2955710 3160542 2858734
16901 2858734 2656240 2754120 3224616 3234452 2856451 3198379 3167255 3375339 2973621 3342669
16891 3342669 3150665 3284248 3062031 3416445 3268933 3493514 3642319 3740754 3277608 3730546
16881 3730546 3797009 3500237 3939877 4013580 3946519 3872758 4079895 3976518 3695822 4181028
16871 4181028 4200674 4558053 4218981 4420453 4602455 4806347 4236795 4432518 4858076 4921616
16861 4921616 5131375 4699572 4638164 4711455 4990315 5423254 5205412 5138863 5226156 5575950
16851 5575950 5681677 5625831 5646580 6113805 5894882 6128025 5989343 6192293 6705572 6554274
16841 6554274 6082294 6591390 6768085 6963014 7027004 7090263 7147673 7400739 7487641 7652569
16831 7652569 7676771 7838087 7995238 8249241 8110820 8384595 8502957 8993691 8928002 8746814
16821 8746814 9504203 9449158 9585881 10072868 10022675 10307388 10423370 10872001 11046693 10727023
16811 10727023 11345151 11443383 11743926 11920781 12296625 12245847 12507844 12844861 13232812 13359331
16801 13359331 14142120 14230687 14590385 14968239 15063418 15441181 15801898 16213837 16659176 17012659
16791 17012659 17232003 17737952 18119494 18829837 19193429 19597066 19917771 20686415 21367705
16782 21367705 21703339 22427915 22966203 23404670 24388888 25144245 25908184 26687512 27177893
16773 27177893 27940900 28913373 29641079 30400593 31496192 32346236 33647201 34703942 35791246
16764 35791246 37021609 37975422 39465767 40838530 41581886 43176599 44394282 46181702
16756 46181702 47483384 49007188 51324829 52753510 54482700 56513351 58029423 60106064
16748 60106064 62199852 64655308 66401938 69353569 71502222 73850649 76342789 78536492
16740 78536492 81191846 83520567 86256446 88876032 91505125 94061949 96417142 98825958
16732 98825958 101361103 103481487 105755223 107207979 109466537 111088188 112299379 113330726
16724 113330726 113931246 114564797 114718320 115111065 115073616 114220174 113532845 112769601 111359175
16715 111359175 109401356 107798008 105737627 103695218 101796463 99184048 96721371 94354384
16707 94354384 91064147 88689767 86411746 83602721 80474147 78053085 75311042 73272878
16699 73272878 70742697 67900827 65740479 63603106 60797894 58629776 56986757 54757134
16691 54757134 52949251 51046281 49274542 47581819 45724521 44028946 42402367 41122415
16683 41122415 40003710 38553423 37092215 36187866 34605297 33655777 32837898 31608619
16675 31608619 30459265 29418618 28567938 27887744 27023550 26199942 25305540 24658681 23876546
16666 23876546 23163250 22500081 21588689 21334850 20513872 20222735 19636829 19271388 18282138
16657 18282138 18216362 17746679 17280854 16693279 16206237 15975499 15542702 15237327 14836117
16648 14836117 14718073 13622526 13915813 13409649 13123815 12550177 12656137 12216079 11909378
16639 11909378 12024033 11476913 11490257 10889174 10695936 10443422 10208764 10138050 9969204 9585784
16629 9585784 9230174 9322031 8915020 8968762 8933686 8398026 8662333 8122118 7990468 8047754
16619 8047754 7787218 7997004 7449557 7543673 6937344 7153460 7123114 6749838 6701072 6664281
16609 6664281 6600665 6954524 6480952 6088338 6175628 5954704 5942221 6042885 5682470 5806714
16599 5806714 5433716 5582802 5632796 5623508 5407416 5241303 5023599 5102386 5030209 5079302
16589 5079302 4888584 4902071 4843160 4316033 4644142 4464464 4931013 4306322 4008910 4234794
16579 4234794 4108769 4090972 4431681 4137201 4103995 4122788 3895037 3993785 4029707 3655336
16569 3655336 3562409 3339675 3639924 3682022 3599829 3373647 3509519 3070260 3464448 3421150
16559 3421150 3017591 3161177 3173832 3109943 3206270 3044779 2888932 2900423 2725390 2742377
16549 2742377 3037903 2970054 2774037 2955467 2474662 2744460 2820134 2676729 2932580 2501459
16539 2501459 2596156 2584081 2683455 2511946 2233592 2528661 2590564 2270171 2337771 2412495
16529 2412495 2459099 2286998 2239275 2158509 1975910 2336373 2413701 1896017 2360263 2133989
16519 2133989 2258973 2313112 1948670 1941981 2060856 2019574 2010789 2204353 1706433 2144009
16509 2144009 1722497 2006870 1593598 1689626 1752082 1799325 1653739 1982592 2003390 1633683
16499 1633683 2121078 1622158 1963208 1930270 1877232 1942893 1862954 1746634 1579259 1590899
16489 1590899 1459712 1587525 1662804 1801674 1821564 1528559 1574654 1460497 1639666 1368638
16479 1368638 1371896 1480144 1355761 1905161 1663382 1663680 1424507 1151859 1409784 1444315
16469 1444315 1605684 1497890 1365333 1332425 1615748 1266686 953607 1280336 1410681 1415605
16459 1415605 1634779 1213185 1400757 1662368 1648817 1379332 1273019 1116998 786023 578415
16449 578415 1237881 1068511 1329480 1293125 1025105 1486318 1244459 1350253 1095319 1142483
16439 1142483 917119 968669 955464 1114896 1037132 969975 1388968 904913 1075033 1112364
16429 1112364 1155433 1227765 1143403 847276 1034673 1181478 972309 1016072 999051 970589
16419 970589 1248468 975491 956306 1002263 1032378 1243360 993727 1081594 751345 646011
16409 646011 719269 1024996 581593 1289809 763015 871900 1026566 952668 1001891 944451
16399 944451 901062 1185086 955146 674132 865974 834128 741832 1039225 1071414 995538
16389 995538 904452 866897 624183 789506 473535 687098 712648 872410 935720 1104532
16379 1104532 719524 680623 604123 601637 286540 766193 857466 813454 594305 960757
16369 960757 628512 848768 837946 97470 706435 241240 779329 671640 848301 910864
16359 910864 523248 732749 458958 706361 725970 778705 400594 888406 453331 583394
16349 583394 627654 440638 749076 616680 603150 813939 633502 817716 848760 509074
16339 509074 666183 544520 466621 609108 397414 608115 640446 377613 479667 629745
16329 629745 670992 442684 546846 518166 773882 620350 412360 490282 805503 507871
16319 507871 604184 803186 429430 504116 228768 451767 417412 713524 263388 390813
16309 390813 725787 438482 467211 497099 490965 408649 707417 536380 737107 475921
16299 475921 493341 257417 527001 552938 519201 204634 445688 683100 373081 357252
16289 357252 717543 557171 508872 370699 626941 485800 223381 -87097 298313 447003
16279 447003 178714 625411 268730 403252 475840 522151 360076 512811 408706 533293
16269 533293 480691 591060 829610 301197 129516 190375 433300 442177 253908 593144
16259 593144 464509 249785 539164 570939 593628 160168 383457 431561 562398 266019
16248 281182 237431 496171 496388 185077 409454 244308 392543 329151 422783 62830 220487
16237 220487 106233 461659 256111 319554 399342 584552 383533 -221855 713023 356249
16226 352460 424203 295260 341048 279636 426371 251111 80382 431559 579336 401175
16216 401175 622283 280072 125361 442121 482410 86039 116126 368046 465161 268085
16206 268085 95286 379892 100320 264124 488558 257508 209994 553017 87107 195895
16196 195895 133220 175518 154755 276755 180871 46711 401890 306761 189010 54471 21816
16184 177358 258822 332131 598347 411215 357347 306499 -17221 361383 31898 -4119 378984
16172 236437 575481 78118 118591 146456 162250 9821 331662 351026 178184 344537 -108689
16160 177149 301993 373375 361556 120725 11388 143491 361784 160856 81449 -44185
16149 168939 151992 -26948 203698 -139998 246166 377476 386071 143546 270680 195245
16139 195245 -45945 90470 481655 172524 105910 367732 2919 308355 160964 -28771 177838
16127 41633 347161 176555 -186779 -34781 -121901 -155465 -173767 136640 -55123 117254 334649
16116 334649 189809 276210 276402 240579 63809 147570 61041 329230 176866 35800 360344
16105 360344 266335 -93449 -120554 81608 409806 164682 -93410 -9639 219406 11768 -256968
16093 201741 429093 97086 123289 316881 280140 201562 480176 453010 126294 142803 -206147
16081 176949 142223 131577 101195 125867 2989 279729 65860 -151775 -167099 120298 -55128
16069 -18765 -45451 42892 73868 85587 193722 131431 -106712 37249 29142 285469 -105730
16057 -314290 290848 249167 295712 157321 -48977 168172 168702 -37965 -184643 156078 351269
16046 351269 104250 168745 356298 426067 -4344 -182929 -16298 -290250 190206 269074 -13831
16034 217626 111467 82722 74655 282385 45069 -75139 106532 -67845 424981 111843 -42919
16022 109542 -66062 55261 -118849 -93107 -140647 -109253 -220037 -222402 125194 25658 -20511
16010 -24519 -202245 158515 -203396 275635 214270 185118 289065 -131213 -46742 287844
15999 199472 137347 195734 42634 398550 194469 105231 -107913 247742 128007 533524
15989 533524 141716 436974 534443 719536 1073263 1219624 922311 929830 550598 521441
15979 521441 78864 1264 275755 261204 134266 135671 49766 252959 -319457 233628 -40031
15967 46611 4138 144563 288830 -83617 -46976 19937 -376342 110655 50562 -76685 197903
15955 -22081 258974 116865 87270 -8311 176784 100774 17838 -20022 -200638 143413 -151363
15943 123378 -57192 -151390 108448 -271617 108485 394046 10475 -72086 187227 -108660
15932 26946 -124505 -134577 -419255 -112037 -313570 168901 -281578 -148314 147721 102369
15922 102369 225632 62910 128225 -6176 18272 -172171 -120484 -89893 134603 -57056 -292391
15911 -292391 -132684 -42733 -231245 138612 -124133 177987 -153805 -113025 -54942 -34543
15901 -34543 -83796 -127025 76633 -138899 -193688 94251 187366 -90855 -132652 -317505 144498
15889 66623 337736 -222163 -111357 125343 -163216 -104317 -57427 -90863 154647 68339
15878 43450 381951 6940 -367413 -144316 206629 103395 -32946 248443 -225215 49658
15867 -111795 -162650 259758 -166758 21149 -187461 -83325 -125934 -117404 -92575 332798 17426
15855 89640 -191951 -17782 107059 -390186 -51357 -122743 -116347 -238224 -28956 -60448 -306679
15844 -306679 -110308 -3051 129997 -206100 191372 100055 86602 42796 104884 13634 -226363
15832 -113702 -15456 193175 -75501 -333759 -17035 -119273 50558 -181361 77435 92520 -97569
15820 -239672 159446 -188203 -320433 -169711 -211563 -31567 -8819 224040 123775 218055
15810 218055 -103613 244059 -9150 -188114 -200114 -66554 -140394 75727 59652 -29455 -36691
15799 -36691 -91101 -210362 -103378 180769 -163224 31159 2254 352914 -70543 126104 -118152
15787 82621 125252 -295838 -184398 -138089 238782 -1390 26150 154918 113395 107767 -49730
15775 -52452 -168974 -150819 -39909 84900 286016 190287 -204494 117252 -246339 -291969 -88613
15763 -85804 -83618 255252 59673 100607 14156 18227 -313705 -81771 31010 43651 190376
15752 190376 39391 284129 278508 223372 33191 71737 74912 116763 -14181 23413 200680
15741 200680 22263 91543 -132519 202809 104138 143801 -159796 -21549 26535 -230610 -258674
15730 -258674 -72417 -78983 -155086 194817 242062 226409 16781 -116251 80038 54873 -181019
15718 48328 -163387 188281 -252140 -214474 20282 25522 379195 -35358 -16183 112330 -222273
15706 -128768 -122147 164268 305245 -304347 -172137 -310907 242423 171122 -45672 -448013
15696 -448013 -125083 -20657 -221792 -70282 -121748 -117716 166566 -47661 132950 95792 162315
15685 162315 -55501 250657 -10484 222250 -191155 87836 -145814 221945 178918 137273
15675 137273 401764 86973 -207622 249257 88288 95146 123311 -118237 71042 -182396 -88820
15663 -7656 -130751 -127310 -211788 -55650 -25515 164673 4123 -105517 -76158 186511 -171459
15651 -55627 -122777 3746 -128601 -475203 329831 -128629 -168929 -250764 106534 -99109 -161612
15640 -161612 -2444 137900 215097 -263332 -14291 -97819 81357 -239120 -96323 -27983 -78432
15629 -78432 115806 84855 -333560 269349 -281563 -18191 46672 125960 -4032 112084 -104157
15617 -245996 -63021 -74854 -13053 140631 -167868 -201465 -263691 93538 106071 -91016 -250341
15606 -250341 -201157 -67656 12086 62363 -86789 -235073 -137863 -103318 5820 -39669 100793
15594 -113982 -47901 251939 -165068 -36624 27942 -109433 -248520 60646 -78307 3901 -211581
15582 -108110 -54515 -60762 -185533 -166907 -37704 95326 45326 -82231 74141 -86902 -239406
15571 -239406 131359 292454 200446 156882 53517 -42292 7251 157568 -246944 129246 48356
15559 -159676 167153 147709 309863 310801 -124414 179462 24312 222763 44832 -39204 599
15547 236057 -135017 180526 151619 -75084 359330 -71721 8583 4678 -182803 -73715 287526
15535 -139368 -221636 -33595 -4940 104580 -86845 -35898 -6997 47401 236290 -17076 70853
15523 101774 239583 9990 80999 63031 -42317 -1129 49693 177272 517819 204326 -231684
15511 144807 44893 50591 341964 171573 -118599 125335 -96452 137433 -88018 165525
15500 263007 -16693 190266 155535 -265332 37436 264665 -19750 -4246 -91998 -60529 59469
15488 -27218 148316 -16216 15178 237628 -64638 319310 303316 30663 -247275 392019 153185
15476 286883 557151 343745 608158 538042 492410 553430 131276 174893 52821 163212
15466 163212 -171369 27950 -55304 71596 134306 -102417 -145325 92042 -124467 -151280 73670
15454 171549 159123 356704 -66932 -200098 -164717 99252 363720 64770 337927 -91478 316663
15442 397274 919232 949954 913670 648940 568752 429658 211358 254926 236730 151825 268626
15431 268626 139808 183528 -140472 134114 -57238 -25418 306933 311551 20367 -52294 358112
15419 31203 -67220 -50094 -74468 188359 -102847 -97978 72643 -353556 -15960 -298211 85158
15407 -51157 -26160 122010 72271 38830 -54193 -76517 53461 -253856 94675 120925 -47299
15395 -97365 -162480 -296901 -232985 -89745 -543237 42985 30499 -32014 -221914 130899 251600
15384 251600 57076 23632 75645 -101818 273177 223601 194390 -139386 322665 -39059 477684
15372 186955 241708 585956 -8396 -19023 237922 328241 217437 35377 -30928 438438 62301
15360 311338 -47753 428449 117681 431508 118525 97292 534396 217958 390987 31084
15349 449837 233775 26399 397044 82676 385390 -93501 275193 419534 254813 462508
15339 462508 459236 232569 310965 173575 224483 167563 68541 59581 137969 3580 297738
15328 297738 191863 -176242 453469 110198 118739 13519 119850 463688 -21808 50556
15317 108482 65624 -21096 -316480 132240 610959 35645 89397 371814 235933 120154
15307 120154 352199 9204 -13957 253562 30788 36500 221078 84550 197659 42937 114121
15296 114121 205617 104933 57498 33817 20935 -226065 -122412 59531 -26792 192923 218296
15285 218296 139104 -191648 162409 179677 -280263 21987 -82855 -19702 58615 29545 -172967
15273 11573 213424 119131 -12107 -162954 109921 74890 -181679 239659 -108116 -316642
15263 -316642 144261 -61331 135179 -260405 133577 -127677 103188 -219645 -397918 -167334
15252 97488 291958 119817 -15190 253128 193916 11865 239303 139642 332716 952598
15242 952598 1456892 1259094 1471752 1606181 1182775 697556 534107 387545 234004 -80693
15231 206358 -13256 -253539 62124 14374 -138224 91418 -196120 181631 101091 239001
15221 239001 -34716 -59724 -69617 106055 263260 115403 232625 172007 -162263 102715
15210 -106087 -358427 79881 -155498 61538 52329 268682 -44322 15076 -77693 -252640 232342
15198 178015 134803 83362 -141498 104726 -4066 -108471 -215383 -77357 178827 396846
15188 396846 243959 -98006 135089 7839 23202 129458 411888 -88078 299763 24821 260163
15177 260163 -66711 198733 100016 -101115 -140095 104635 -122462 43796 45995 -329488 4988
15165 423152 28624 130696 -172182 193238 194027 389707 313824 16730 69883 163044 471531
15154 471531 371993 93723 59870 -167828 91876 102227 -29830 -57090 11421 142322 48644
15142 -106167 -24101 -89759 371102 6779 326357 358007 84052 34044 140258 367061 326825
15131 326825 265153 26686 -66111 110984 32309 418580 359415 16614 -46539 -89318 -183803
15120 -183803 136471 103896 328137 196026 303254 416453 261263 282880 -94861 98045
15109 37381 9814 38737 -71625 -158667 -264172 229805 -12792 200142 -74397 13768 308933
15098 308933 11943 52798 62646 -87769 68883 159058 145739 -18251 23898 143246 44056
15086 274147 207877 18536 509188 297537 281713 165660 377571 349079 -98692 -18153 467538
15074 300879 -101418 76838 180550 118553 542791 9153 -38254 -117967 224355 112422 469753
15063 469753 -11774 110098 408881 154326 461053 -87910 557950 220901 314825 94983
15052 181640 -1643 379073 260941 614574 227759 342903 266935 -93824 -104842 185740
15041 192603 553564 516856 353101 470814 258024 274562 245361 387794 247124 411089
15031 411089 580440 803634 771369 888414 674708 622715 413088 607390 504960 468649
15021 468649 375928 503202 329258 384884 548276 619551 369053 78269 432334 365257
15011 365257 344331 487020 654903 373817 654378 359062 447498 293858 57401 667526
15001 667526 267776 435287 555862 602499 273538 710006 419543 358384 407173 560381
14991 560381 277155 161865 841368 253067 297100 450616 570424 658150 904887 737317
14981 737317 872337 843799 777144 681364 455803 688821 746575 539029 688049 633135
14971 633135 487934 664492 338327 552193 319594 271357 124601 583026 468731 377184
14961 377184 507516 387497 350126 495639 21310 273888 682845 430519 552197 596606
14951 596606 276275 411742 213315 353914 290778 510736 525919 547341 546673 448225 565406
14940 565406 478343 585036 571917 577276 778798 300085 631494 605929 765814 1150657
14930 1150657 1299336 1187426 1371663 1272394 1512583 1768543 1521930 1682761 1636473 1738605
14920 1738605 1260382 1633805 1850247 2109415 2341522 2238052 2011982 1490945 1242256
14911 1242256 1158173 875333 945333 701318 663655 247371 437733 -105969 444921 582733
14901 582733 103962 266503 357543 321710 407886 690494 487615 577397 474991 379115
14891 379115 538834 728640 442607 630677 840295 837785 368421 1187244 818526 665726
14881 665726 721360 971579 602653 696436 740246 426542 515221 843566 637270 442552
14871 442552 490504 749793 186165 578971 818057 656938 693021 789851 720816 611885
14861 611885 541575 415123 614742 681922 518784 583680 617619 127324 438244 176369
14850 644251 821773 851504 894455 610998 677481 963260 764477 684527 1115843 1339342
14840 1339342 1000126 1008694 1054719 1058453 833547 891952 417215 614994 727001 601112
14830 601112 360298 506064 647437 595959 632978 681316 521784 536634 497572 656850
14820 656850 888185 790342 559729 671009 651770 1012456 248976 799438 504110 453595
14810 453595 675599 599104 819034 907897 621334 957230 984050 1078792 709075 759889
14800 759889 823129 370684 721230 369367 557561 494627 702911 591279 800979 438732
14790 438732 818236 655032 945779 218264 804892 462675 474659 351431 617060 437417
14780 437417 1073035 397782 747852 738061 879403 792083 1146743 798634 1124438 442765
14769 976040 751168 311673 416202 533302 542216 437666 504983 511241 513205 526198 888408
14758 888408 596499 626445 666195 548719 717262 499187 546815 578635 607198 714801
14748 714801 694534 536699 796965 788382 458898 623361 641916 528744 665389 458043
14738 458043 697488 684533 939447 788307 971828 812667 935334 1214804 1161302 1308316
14728 1308316 1409859 1435249 1727052 1667154 1746584 1345354 1529142 969119 839148 915901
14718 915901 1029986 982917 1049304 864888 780094 692205 814115 854667 758567 727112 1046470
14707 1046470 968772 1011477 938543 1344597 906196 1290411 1866587 1754376 1876784 1678751
14697 1678751 1545687 1414651 1102838 1086545 930982 970966 1192129 990813 775236 912757
14687 912757 934738 920842 1113396 1148516 994208 976639 890821 956926 675058 885338 1231482
14676 1231482 840611 1037632 747762 952847 656030 847010 969907 1029036 1099051 1068176
14666 1068176 1152318 848428 1082580 895758 967567 1075767 1055101 1257897 1039185 1148474
14656 1148474 1027014 995282 1438804 1102651 1659146 1616834 1115741 1234073 1093466 1079226
14646 1079226 1070481 1127703 1017118 931405 1069271 1020106 1194134 921728 1211549 1256554
14636 1256554 1093773 1033041 1443328 1225978 1375509 1129278 1318118 1048192 1329212 1433549
14626 1433549 1177106 1124545 1192295 1150439 1242695 1158256 1261401 1362231 1469116 1237983
14616 1237983 1159240 1783062 1519517 1306887 1234765 1327851 1347960 1396732 1239979 1698840
14606 1698840 1528350 1837857 1518177 1519874 1377402 1503312 1569052 1802140 1449492 1494429
14596 1494429 1816283 2010755 1389393 1657553 1641213 1798359 1439087 1690013 1673959 1468971
14586 1468971 1682224 1911723 1730777 2036532 2186191 1725274 1889322 1961895 2033105 2125492
14576 2125492 1829318 2081288 1924121 1911722 2151687 1981713 2363073 2402941 2453417 2610871
14566 2610871 2575644 2258065 2669696 2324499 2543336 2418086 3123761 2797241 3098961 3394136
14556 3394136 3126335 3430088 3611196 4005611 4643950 5716336 7006143 8412836 11793464
14547 11793464 19581641 29959762 28132810 18713787 14056192 9767782 5903316 3987827
14539 3987827 3437692 3742090 4285733 3432672 2914856 2496005 2448858 2169604 1768197 1901308
14529 1901308 2005229 2005026 2004157 2172692 2372299 2520283 2605168 2193548 2230558 2458934 2488201
14518 2488201 2333086 2181197 2435768 2691469 2357407 2314668 2851034 2465425 2578144 2745737
14508 2745737 2986776 2689995 3038114 2903143 3118608 2862584 2838621 3082747 2873788 3174942
14498 3174942 3362368 3121336 3303668 3010138 3222601 3347375 3386021 3238331 3460067 3391393
14488 3391393 3497093 3346097 3795660 3459500 3798954 3910771 4019036 3721358 3952136
14479 3952136 3669091 3985844 4199294 4117446 4131267 4100707 4043023 4019685 4258054 4569055
14469 4569055 4207517 4366378 4417643 4626021 4753144 4821363 4762840 4579257 4439517 5367593
14459 5367593 5128041 4872233 5212791 5178344 5348388 5308614 5212835 5353251 5467375 5362018
14449 5362018 5622392 5765243 5703953 5547134 5730920 5766595 6295502 5966681 6076398 6234330
14439 6234330 6488606 6172532 6480735 6765074 6789699 6694670 6858367 6746232 6818462 7162552
14429 7162552 7473789 7376835 7665764 7333808 7773696 7725305 7884473 8351323 8161570 8554938
14419 8554938 8993247 8866315 8920046 9055303 9320035 9107300 9449330 9538911 9492460 9656268
14409 9656268 9689047 10081490 10340560 10250342 10905125 11132118 11325673 10982939 10938600 11218873
14399 11218873 11666096 11407817 11756266 11814232 12094822 12372703 12746555 12899167 13221948
14390 13221948 13420577 13692758 14163798 14098987 14289035 14593832 14731622 15106369 15357400
14381 15357400 15674573 16190178 16464134 16888069 16920638 17338434 17697153 17678060 18067845 18503930
14371 18503930 18795561 19470661 20013115 20169060 20805909 21102208 21443371 21942144 22506838
14362 22506838 22714334 23363683 23699869 24302173 24918930 25338434 25826602 26636961 27186112
14353 27186112 27838493 28147246 29118886 30189675 30513001 31569279 32341736 32945176 33965730
14344 33965730 34912089 35383971 36880036 37868737 38680932 39522919 40851876 42050314 42806292
14335 42806292 43820381 45538787 46766959 47923628 49604638 51178686 52714644 54628465
14327 54628465 56147094 57837986 59661212 61487422 63626414 65889978 68110101 70440332
14319 70440332 72780035 75197597 78052858 80740080 83602560 86547457 89996238 93150255
14311 93150255 96429806 100431036 104469371 108566134 113416021 117593610 122663448 127715902
14303 127715902 133361220 139031301 145399896 151858075 158629283 165875574 173198327 181192767
14295 181192767 190018742 198571768 208026025 217817359 227865367 238911784 250252761
14288 250252761 261989731 274448385 287343477 300618234 314495615 328682317 343115006
14281 343115006 357882237 372619218 387382970 402038180 415263756 425252358 431583836
14274 431583836 436838725 442003115 446395455 448405350 445048816 439703032 428751933 421714028
14266 421714028 419423383 420695527 416622515 406573257 392926552 377361559 361666577
14259 361666577 345799257 330121797 313867771 298279239 283356238 268754783 254925369
14252 254925369 241513428 228761534 217216920 206101225 196053880 186889154 177573954
14245 177573954 168720761 160589954 153301315 146168077 138743080 132571925 126272304 121135253
14237 121135253 115892188 110953386 105926553 101425566 96959258 93224691 89936308 86058287
14229 86058287 82774185 79451088 76382137 73694695 70998657 68203308 65922385 63687454
14221 63687454 61357855 59631108 57082480 55428157 53903829 52060796 50060421 48757838
14213 48757838 47573158 46204520 44768017 43332687 42059249 41095827 40123966 39006103
14205 39006103 37927652 36701429 35722111 34761101 34030449 33114937 32220294 31389981 30519782
14196 30519782 29961834 28750968 28750501 27369940 26995047 26466281 26102739 25144236 24778650
14187 24778650 23921705 23257066 23030934 22473545 21694260 21643394 20721036 20548822 20000115
14178 20000115 19811146 19359238 19070335 18447205 18193382 17592387 17264482 17245682 16896305
14169 16896305 16606729 16126529 15860892 15330474 15389140 14934679 14735736 14488225 14168384
14160 14168384 14278275 13238111 13462536 13331791 12911300 12895619 12408386 12277633 12128775
14151 12128775 12095159 11933042 11587446 11491764 11166444 10933166 10838441 10743469 10828166 10754875
14141 10754875 10377744 10031191 10189428 9735780 9736244 9906412 9331461 9140151 9267017 8929140
14131 8929140 8814308 8660159 8600478 8454019 8148089 8364053 8220367 7995815 8450884 7474112
14121 7474112 7808657 7918127 7444290 7578201 7296125 7321048 7160809 7216305 6780678 6823784
14111 6823784 6911036 6996548 7135943 6507945 6598289 6574880 6405698 6416449 6379456 6387002 6099358
14100 6099358 5948368 5972197 6106006 5907399 6166265 5606810 5699115 5337952 5677095 5510793
14090 5510793 5444225 5245743 5225850 5254619 5357872 5142550 5041479 4932383 4757006 4813628
14080 4813628 4720426 4912729 4548531 4742147 4928370 4834726 4457640 4479727 4427427 4374916
14070 4374916 4288241 4390076 4432309 4107414 4215936 4140106 4103672 4292375 4466364 4147340
14060 4147340 4033050 4153887 4420751 4168819 4126091 3621015 3724855 3771392 3775042 3516863
14050 3516863 3527372 3830295 3469613 3716041 3440577 3369451 3450257 3450444 3405998 3187410 3387849
14039 3387849 2822777 2825746 3126967 3203442 3351371 3402560 3139498 3048878 2970751 3311204
14029 3311204 2973420 3242989 3227474 2867709 3147687 3076785 2432563 2973931 2837038 2665470
14019 2665470 2711884 2456601 2803381 2685711 2874030 2681102 2730658 2596584 2474172 2376560
14009 2376560 2184680 2530839 2532446 2576082 2435905 2289117 2710274 2190659 2540396 2482247
13999 2482247 2715780 2392124 2561656 2223679 2446340 2206263 2606987 2869508 3141927
13990 3141927 4280362 5556627 7636653 14092425 25387737 29279765 22045539 17209248
13982 17209248 13118338 8768531 5973789 4789520 3687373 3388478 3399119 3100690 2826215
13973 2826215 2655015 2686254 2677862 2719875 2669579 2616644 2876225 2350955 2656452 2208872
13963 2208872 2070865 2444952 2505244 2168611 1696383 2067801 2185777 1962960 1979371 2104423
13953 2104423 2055757 2232401 2192165 1801733 2068904 1727319 1981532 1920821 2282006 1667092
13943 1667092 1717574 1931585 1951740 2074175 1529853 1432108 1783724 1659974 2164314 1811850
13933 1811850 1736731 1691089 1566051 1808302 1675804 1252749 1689368 1633864 1482734 1530808
13923 1530808 1716337 1699254 1238543 1649363 1466478 1622195 1372681 1667098 1170299 1587136
13913 1587136 1681257 1446127 1441909 1282600 1684896 1879303 1215501 1292368 1190385 1362583
13903 1362583 1307243 1544323 1515136 1620167 1404602 1053034 1183361 1488196 1050183 1328047
13893 1328047 1101526 1251668 1125839 1536357 1428781 1153075 1268152 998202 1250630
13884 1250630 1001952 1080239 1068451 1297570 1325955 932649 909332 1294563 1067326 1412377
13874 1412377 1017146 1141067 1379267 837875 1271309 1264150 1002357 1295135 1038809 920317
13864 920317 1369173 933278 1288397 994724 1205475 1245416 908470 989584 1102068 1372915
13854 1372915 752220 892000 1018292 1218457 1320170 1101220 937166 1039638 1210134
13845 1210134 1210143 1359486 1305060 1059610 1117903 801864 1086508 729577 858743 1028737 1005887
13834 1005887 766201 916311 1027410 862776 854407 999661 1026856 572870 948398 1384276
13824 1384276 1147376 935413 1111347 1116873 1027639 1052875 816936 915337 911715 933889 770053
13813 770053 1174789 771857 800743 633915 667667 1048480 1093215 757576 538384 871925
13803 871925 780766 672152 1014154 911081 520898 699305 731961 777332 872161 908230
13793 908230 734165 621361 640792 849548 535135 736151 873536 885641 593283 629401
13783 629401 562319 1006255 698738 558279 522037 745233 789176 781716 591010 868113
13773 868113 718260 566713 986873 829137 678616 902263 660517 787186 963135 807773
13763 807773 489571 657984 807850 777322 565259 802908 789532 757840 623199 873627
13753 873627 635571 625873 429104 598811 811200 795937 634114 586862 887736 708417
13743 708417 517230 480143 851629 593581 355605 385639 771317 530719 350588 469823
13733 469823 700333 474432 692835 456569 611198 741282 706199 698733 696441 602055 673752
13722 673752 370514 315472 597772 476159 653996 498600 516922 739118 81683 711629
13712 711629 591811 652589 679310 487363 460058 960739 477029 436958 532523 404087
13702 404087 315145 761275 487352 699143 743641 732901 378059 328909 671018 419220
13692 419220 339471 745266 501420 306214 462964 483733 418080 407616 427119 434841 644898
13681 644898 619093 543936 231139 376923 664859 528512 78533 174080 726795 975538
13671 975538 445655 328984 469724 484502 232387 411318 543868 450544 446140 406077
13661 406077 761327 308259 570042 726883 675590 469100 389266 258343 685988 554644
13651 554644 405044 904612 486063 328167 513514 564871 331120 477504 558334 263676
13640 205727 418880 426606 392721 293479 280900 312565 506979 438313 342856 413874 119758
13628 472891 588129 379941 369276 -345638 337678 224829 201075 396268 670761 604464
13618 604464 407926 497259 429831 330152 469482 481727 594995 340895 93053 587719
13608 587719 397229 601054 538181 373137 366769 262504 193432 616189 305398 450249
13598 450249 274573 218268 157919 313846 625082 124015 191831 575837 355473 504067
13588 504067 362163 202184 83541 454104 323916 453645 390496 302608 283286 530892
13578 530892 424702 356115 314510 415369 226533 193302 480222 195578 225091 174503
13568 174503 319656 199981 190287 368766 -9638 313697 374801 351879 283797 -11105 408436
13556 393141 308054 107139 482190 243202 -47972 548760 289024 333075 -87215 452782
13545 531037 331189 257741 270668 593655 394410 326289 464996 622405 -148978 733 407562
13534 407562 435537 400672 348025 496583 6535 575148 371788 73131 342526 161777 403926
13523 403926 341223 -45670 281514 418672 488622 -115628 504040 83584 152630 212949 467211
13512 467211 287750 104497 34715 552670 184754 113603 193506 404286 280845 193411
13502 193411 59998 229523 -4846 345653 171234 118407 252897 424082 546011 163335
13491 56689 -29051 416014 117605 244993 255809 67782 361933 202446 102709 172039 585561
13480 585561 235144 184013 132670 367770 196372 355881 231623 202257 182160 358141
13470 358141 38653 161183 238219 47942 528648 356802 457587 139173 369876 -219805
13459 77220 141927 412034 23185 574778 449805 223250 259988 170527 90785 424474 354248
13448 354248 181482 250774 591271 254562 48480 521741 58823 445378 136063 183452
13438 183452 363728 298263 445129 229046 219005 -77611 176805 251520 362031 163314
13427 241595 137247 64444 192907 149167 276836 246090 150750 96713 70566 354353 140105
13415 296591 512725 -58045 200859 237268 441952 287635 279811 195167 -208414 303293
13404 417002 53948 362725 114934 325518 246405 39766 378066 35989 161524 332042
13394 332042 171694 87367 -134923 111267 207660 304638 116110 82668 -114117 146359
13383 247617 14587 315174 218288 268002 141501 289942 392300 610179 -11480 65292
13372 -56238 431567 95425 80386 333991 302887 213143 276389 13336 293564 333939 124212
13360 446857 440003 258250 370301 372262 168591 193502 19427 42071 288369 160795 413733
13349 413733 197143 425719 50129 215933 330966 322757 393792 182629 197436 273268 429215
13338 429215 208193 283548 367146 416303 167274 31194 -114792 503509 441757 76390 348004
13327 348004 -137888 206788 500622 204250 283468 -283509 153153 159069 18976 132149
13317 132149 589950 196003 -50415 426092 468516 20600 515354 11504 206349 -84644
13306 165976 246053 -95679 313467 100165 50646 186764 -106200 168372 256017 180110
13296 180110 116950 189954 140059 204341 422240 50457 157614 342396 74692 403666 137394
13284 173845 -3547 92342 348897 312689 -94004 105210 301459 -142967 261923 32948 81184
13273 81184 351850 27328 -111699 -6923 -108931 386557 243799 375552 489103 -14492
13262 386812 204747 -76445 145668 71155 -225114 280629 34196 36873 -110815 -68666 -84540
13251 -84540 66386 60119 -29635 35555 222045 194884 114955 257066 -55212 -183275 -161889
13240 -161889 -85855 -164562 14517 92408 -23358 -40260 -253594 223525 57588 277745 17620
13228 223920 126247 199800 230864 86932 -71753 131970 -84422 505289 -78019 81628 374733
13217 374733 360899 -137023 -25094 -108173 -5228 80738 116832 26594 63905 -201390 282674
13205 -122801 246896 158595 50009 -171097 161670 -34172 -2305 281299 325188 -41928 108772
13193 45520 403319 -111375 106625 5742 -80402 151880 37031 313429 354298 142594 -97390
13181 323719 -51744 610710 -41734 -168821 144548 317777 -212706 -19222 50144 326128
13171 326128 -151294 103003 154543 151487 164962 179243 18414 173510 -199273 201070 60949
13159 -25963 250510 153470 107065 56532 146037 -67103 136877 184399 354434 138101 -140928
13147 -104846 260900 324979 387658 100282 133000 310372 440753 193565 -122712 101977
13136 39015 191155 -203188 -135150 -52679 -211427 318297 100595 190786 91255 -90078 269823
13124 73186 -40354 -169536 -145903 45736 -236897 -271374 -165258 129162 115811 253922 95777
13112 -174193 -32662 -197074 138272 -21586 113038 32401 196441 -40265 61890 84031 265844
13101 265844 69468 381043 13210 71932 486918 -36749 55444 -157461 -144010 188305 104165
13090 104165 335120 359156 19937 284112 136098 -116250 112462 -116986 109561 -145306
13079 -169467 285351 61692 365587 -35776 468768 156210 99827 542043 217760 361264
13069 361264 36868 300489 188401 309000 -48208 45071 330337 -31162 272493 290670
13059 290670 -61051 47942 199712 186360 158667 118131 36295 311434 503317 108177 49660
13047 -381167 -336709 9892 381258 193637 164461 -191462 203192 314744 -198456 80981
13036 447848 -20587 166844 -394601 6237 -161177 45620 -105578 76647 -16256 -33729 160603
13024 18784 252406 -76965 -118116 268663 144095 88778 83423 230856 171277 -235819 17335
13012 -3499 192509 61971 13435 227084 -142118 64401 6306 204264 323254 109701 92423
13001 92423 26479 43783 116920 509383 -13755 -104198 137899 46515 -54291 -336847 104231
12989 151306 -258090 131847 132882 -73601 240913 96546 343552 -96952 16317 -28480 -63362
12978 -63362 -222673 -190500 -286425 -24432 240377 -310106 142365 -97022 285303 135532
12967 16353 -256325 117648 49180 1257 -90341 172801 -57949 -243887 56986 -158683 99175
12955 -57221 -29674 354988 251546 9132 312170 113725 125501 -22627 29848 -90501 238263
12943 70144 -366801 -84499 18422 -160740 -13956 57081 -315164 96417 139885 -61813 278888
12931 -111458 -192138 182167 328242 -64999 -19840 -52764 87589 -40832 77404 263821 -719
12919 201096 -222570 137234 145904 -46255 70482 -308731 20132 -129619 188848 -119581
12908 18221 210512 -191255 98905 -119556 136599 257845 399896 -180808 199552 130597
12898 130597 28783 -54344 -342374 -171022 92401 -256720 -126685 183909 -328401 72855
12887 -120574 -101239 123335 153845 301408 312014 -15326 -105137 -116013 20918 112887 87747
12876 87747 219285 297319 -231226 92143 48265 5166 125950 66174 -68213 -46203 170135
12864 -183479 -47474 5862 364659 259181 117639 148898 315392 -97867 125661 182967 25706
12852 115955 -171992 -37108 265824 286181 111534 22563 -97935 68812 64586 -270066 112424
12840 -73305 -74586 -83823 304769 156907 41247 261358 -42948 -164435 61079 179818 184765
12829 184765 258053 -29683 23494 -6144 -133090 369306 -235817 -375171 -4184 97757 181220
12818 181220 -255092 -41686 52811 213223 629925 -116771 113385 -89868 -19501 368979
12807 -171575 42801 -115762 -12838 -33731 -41825 -162995 2683 609416 27634 -115412 -14063
12795 -106072 259426 250746 179223 139419 200721 56360 -160517 -171655 -130534 126972 -171334
12783 -196832 196189 190362 229585 -140392 -55321 165645 82165 47087 56064 -86690 -68417
12772 -68417 104674 -88928 -101361 239564 -36571 -16939 -43056 -348073 231191 135433 172062
12761 172062 -380820 109322 -75773 20294 -191507 -111101 68000 -150291 -96464 34090 88813
12750 88813 -145773 -35247 -206407 169656 138032 278932 -235366 -95162 50692 -41657 149907
12738 239417 -48538 167159 -21783 -135656 56290 38498 -316555 180026 -175126 -69543
12727 -145979 135157 48655 151372 141097 -67986 -175189 -3246 -182159 -224566 28265 92697
12716 92697 20141 50292 231473 -30074 94257 357722 65105 -19715 178446 87068 28762
12704 333167 229826 -63906 66421 364031 209806 -196133 137961 218253 -57915 56910
12693 -242232 245236 -26478 333331 335094 1311 288794 -168735 -149632 112122 168344 36714
12681 32366 179887 160245 249561 32520 343578 464457 117886 -62101 36088 38810 -14819
12669 221550 129797 -23866 274703 18845 33299 -148272 -147968 64852 15221 -45199 -10422
12657 118153 157643 146531 489782 -93257 248968 113244 280069 192003 265691 221628 76591
12645 94066 -129160 -236237 -45413 -89792 186388 -257587 65222 25218 348821 100065
12634 266255 231102 -95849 -55177 258694 104120 27895 183079 270740 -35093 -45115 395281
12622 296770 79396 134207 276712 -177824 35059 161201 -169543 170718 -15962 -101424
12612 -101424 255130 176041 243684 356388 -30790 223756 -76073 -59200 -25471 -172372 328194
12600 -30620 -29323 54236 -83841 30558 321544 290061 -95286 64631 -2916 -220862 82499 146088
12588 146088 119700 -332115 173633 -204884 -40639 116832 -232875 -21816 177762 -212603
12577 -77964 -293485 -23776 -118994 286555 -220770 253490 134520 450853 1748 -206875
12566 133397 111948 -114188 165199 -57973 -16887 -156191 76409 -315240 175843 -32604
12555 191375 -20272 216212 -1159 -16520 378054 170491 81465 76123 -37638 -99951 203739
12543 230495 -424784 -54264 -91455 14723 -84581 -62763 -154130 94921 130771 94861 -76242
12531 57571 -28977 117990 -22409 6151 109525 68525 -27894 147214 -65319 226230 -59666
12519 -80522 269504 -306135 -93111 154274 -14195 -39598 44562 208711 130582 229006 -200641
12507 -156805 -108161 -256574 58027 -94627 136167 -68363 -292565 76425 -255544 13783 69071
12496 69071 40070 -39234 -163144 -425767 339889 46453 -37510 -102475 -150818 -270818 71302
12484 -82410 -151600 -191123 5912 -184049 146484 -117407 93955 -15582 -101394 -80710 -270757
12473 -270757 -249010 86365 -28201 117381 51616 -11931 126479 248640 -360089 -394829 183999
12461 -233315 -138836 -341009 45924 -9781 -71557 -416114 -15909 -58741 122950 23734 -225448
12449 -199226 -206041 6561 139891 194473 -85471 342022 24040 224454 -494639 -135435 -149341
12438 -149341 201868 -233444 -91422 -25541 233602 128761 424296 -127666 50030 -452957
12427 8334 38603 263580 106745 78284 -130714 333186 -70916 -42966 75718 -129460 -222614
12416 -222614 -191606 -92843 168358 -446684 -57503 -42125 118232 6013 132330 -210056 109371
12404 188809 -15326 -135452 -64907 347149 -292264 -59025 -149993 105029 -62391 301963
12393 -86707 -107421 5174 168895 232471 110166 200076 302314 116071 478008 103823 137184
12382 137184 356131 -57393 81520 256399 -105729 101835 -22594 380855 271529 73199
12371 234009 99553 -120954 -79352 95651 -175960 -139309 111994 66139 262346 -95907 -200636
12360 -200636 -58000 166183 27019 -82921 -169652 -161779 338106 -289031 -84211 80962 -159015
12348 -82527 -74702 575499 -166690 199141 43819 19447 -39881 60852 52578 205930 -206640
12336 136982 103279 378361 170400 183974 113447 167142 160714 97773 297311 124077 96582
12325 96582 195850 304712 -41602 341375 75467 443568 121751 -91860 496454 158131
12314 106692 341773 -88762 227412 472149 -68602 -68800 -118873 52915 -17016 -191314 103953
12302 114813 169728 70792 2759 262437 -78331 355226 190946 63249 -8185 -5130 -124373
12291 -124373 4168 348654 -156935 12279 -36379 115971 180210 327570 37284 -140947 43160
12279 168009 127473 -244651 234293 313097 267475 301008 404025 18655 357735 420448 195622
12267 -14683 244253 136799 -1741 110811 49068 -109534 -50575 206003 -57789 -88041 -42291
12255 -185320 413 -24620 56297 -256880 201391 -137469 -54586 -176708 127675 227806 47850
12243 219405 118892 -73612 -10045 103224 124992 154969 145471 -1763 113586 -6564 -109797
12232 -109797 -289727 146935 -43826 335125 57625 185481 90484 -45564 277390 29845
12221 -54600 74558 177245 255665 -38944 -25498 -148131 130101 363821 84413 177717 -27071
12209 -20157 -12796 56339 369696 201107 261439 32040 420444 -78812 154924 344290 -63671
12197 4396 189774 301304 272288 211336 286398 32140 302866 340883 -162383 45842 203926
12186 203926 14930 364711 402132 106436 118120 352585 308076 39577 108843 113974 94794
12175 94794 126283 -68952 273609 361 180629 12206 705547 238651 265613 -174624 424334
12163 179079 29718 259848 181839 40080 226998 376172 -190632 314771 149653 146127
12153 146127 279632 91690 133966 -237454 180621 -87963 -115213 117569 -107227 151873
12142 -204468 320525 402364 295806 139427 55392 95053 184248 265012 -166377 198569
12131 97946 75303 123668 -114743 70502 90448 252610 126332 146013 160557 229008 373838
12120 373838 250387 126630 149723 263078 354056 -3568 99413 290263 303525 -64221 43005
12108 -306046 183669 -46709 -63163 260374 37965 -224120 -199864 314132 256529 76705 209855
12097 209855 390514 168349 -216915 275087 240441 -28363 -35848 171481 231905 89576 67752
12086 67752 240767 -45302 309431 143162 -145696 131508 354362 104432 101459 224066
12076 224066 268903 -141943 38949 105320 273232 -227205 243864 190496 204314 300066 -95932
12064 12580 97305 -17442 18477 -306026 115955 127120 6506 6818 129799 112107 -4566 170005
12051 68298 78195 -41887 107785 -26260 16861 114460 11393 129673 26115 -184286 -126055
12040 -126055 102210 117063 109252 249136 -54097 204887 -93075 355004 -12670 114410 -231451
12028 166437 -30763 96091 -181684 -83404 88064 89540 298606 56615 -4511 -260184 97444
12016 233970 -72408 120838 -23590 21668 -141948 218157 -259254 -32295 -76604 -105836 268591
12004 2805 -956 -111581 -116841 37752 154093 -94660 223905 -147787 -33244 165650 -65750
11992 -99067 -171051 -213000 -3430 -193188 -92268 -434194 29168 49500 39300 -89041 405994
11980 37426 -100951 -62231 -112793 -25548 226594 227014 -96983 334617 156714 228151 -186002
11968 35983 113247 216793 -72570 -350027 -113969 -114370 340973 -79873 433604 17983 -214735
11956 61378 -277672 179312 156186 -146339 -76641 -82548 152661 49713 -94764 193243 219356
11945 219356 197590 -116888 -97450 391194 255338 -50823 -79421 102029 -61 124380 -249635
11933 38536 -8241 -18855 6604 78187 178067 167525 236964 183659 -126422 128916 179493 -243094
11920 27559 401641 135700 95739 -174280 -184045 -137698 150203 -362319 66396 28468 71696
11909 71696 111326 65588 38451 -318107 214833 174076 -304443 76787 37633 147026 -180769
11897 220518 54428 -169092 245734 88044 161701 159102 -51927 -257249 -48688 -162581 -130806
11886 -130806 328319 -17712 -160282 -48982 -107766 -193329 -179306 174257 -241990 135354
11875 112433 155276 -158931 -237790 78411 -344858 -242916 -149229 97701 -146970 -83132 -180163
11864 -180163 54349 -57616 -278238 -7730 77660 -2409 -59384 -179327 -293928 -24211 -74165
11853 -74165 145156 -322214 -60367 -148085 -230608 -151061 -146103 86225 -106592 -172643 -321294
11842 -321294 248799 215726 -114885 -72488 50055 68581 -6111 -38863 7059 80519 57013
11831 57013 -152256 -81867 -216966 -33862 -75433 100258 -369745 134700 -12770 269913
11820 113135 -80442 114157 -63570 -95425 -8293 -176983 131816 14877 -265173 -109360 -13096
11808 -4673 291763 -269867 72388 166586 -108007 135310 102640 41557 -255685 -304982 -87406
11796 -219537 -262796 244227 -314482 -115238 101504 -155753 -18960 -60547 -46491 3413 -217396
11784 168104 -165957 -185585 14239 -157386 160156 138566 -228333 -47102 -466705 55204
11773 -132076 -124727 74821 289528 -33561 59564 -84457 409978 221623 -553304 160095 -5301
11761 -34424 -40640 2281 409000 -57120 67108 24695 25253 78858 65912 -63706 196645 192547
11749 192547 -181136 13230 -192794 164724 68702 -21345 84922 19405 21768 -79641 15468
11737 -220159 -10027 19082 103403 27448 -111398 -109343 -15303 202438 -263377 263079 -137100
11725 33863 61179 40957 35024 181289 -157797 -126208 128874 -229150 -424567 159128 318305
11714 318305 -20858 -104166 -116376 -217224 -1185 248763 -19000 160322 -29878 -11722 -125201
11703 -125201 -1472 93407 -56754 73318 145516 142009 -74861 -213253 82666 282743 -62064
11691 29824 69565 93307 -38063 235639 156517 266164 -245600 92177 -116072 -114217 -41567
11679 -294713 16534 11505 -20624 82823 -242864 -91940 313327 -217185 117866 -55333 -386
11667 259814 -222263 -114618 -187924 55540 -207953 51075 145996 -142591 223948 -216289
11656 214473 89956 143735 -20833 316640 149425 -91686 16542 -145914 269998 -411092
11645 329354 131582 91896 -182270 -59313 103534 148994 84666 60411 -3353 -46072 -96283
11634 -96283 78935 101309 -54614 269230 67506 -255999 -283390 38081 50025 408380 -127103
11622 -113669 74250 -175771 69021 151339 221295 73586 142566 147248 142488 -23406 -194748
11611 -194748 98157 125241 -38298 39084 150474 271184 185149 185957 217216 -40114 35296
11599 58270 -161280 7461 257037 -228332 -77262 531 422726 165780 -108963 107474 85568
11588 85568 261585 149296 -54898 -16702 -282819 25924 275562 54952 237290 -23028 -44531
11577 -44531 348245 55581 204405 128541 292229 157152 -179310 168609 -97225 56835
11566 253410 153581 107432 -155689 37802 125940 68250 -6916 -46295 -158061 -128066 228485
11554 237802 40831 221774 226290 -63926 6320 106877 180064 -54431 300015 194069 176484
11543 176484 308603 60331 245656 108127 51526 190639 -3059 -50964 288852 60766 173907
11532 173907 142006 94710 -63574 40057 -95324 229366 -14695 172665 279022 45983 229624
11521 229624 32944 -72908 29660 -35459 11796 -41644 285031 -161164 232136 -225318 -37235
11509 126185 -37714 -144735 212805 123900 -4097 304542 45906 -106692 -2665 -198430 -95064
11497 70521 349818 299775 -35344 -163150 109076 -116298 115372 52502 176152 -42523
11486 -10875 117114 -29477 210293 87441 -79603 128606 23146 -35022 -267737 238939 -183559
11474 416575 491973 112496 -65442 -79644 239874 268323 -77582 251585 -97428 184006 -5992
11462 4896 -1244 -40291 324266 123470 339113 240774 318607 174856 -315350 -135531 179146
11450 183832 187538 341683 159783 -6701 48788 -377955 248960 296842 -79057 390784 381009
11439 381009 188157 56524 -51845 -128369 47120 47711 74903 246047 -15080 -15654 -43576 -129119
11427 -129119 91439 -180047 109589 303386 -267034 212461 328825 48662 -199546 34432
11416 255147 62258 235955 -8655 -89810 -196745 69362 -61402 -142031 -65856 241095 -251421
11404 -128637 -39465 8029 263198 206493 297857 48057 77990 88719 -47765 -66789 5927 -321029
11391 156005 -10994 -437 -318795 20648 -193118 -178156 -252417 146610 -55097 -383546 225122
11379 -154493 -278096 226217 200155 -350303 -170276 -158399 -100175 -21315 -70951 55369 211670
11368 211670 -4700 -196855 -82386 -158942 -167632 35643 -232597 -199764 -12303 -107147 -414818
11357 -414818 -1228 64876 105316 -242333 -87833 13329 286981 75350 -187524 110954 -164737
11345 136385 -133419 17095 -86439 -24238 -92246 -217584 -160193 -4886 84137 40015 -11892
11333 34910 -309267 -78704 -158690 -271936 -209139 130199 197272 -81158 113951 -22402 239090
11321 46418 -140870 126812 105475 -118268 23791 63379 12009 -81779 -252754 -4059 -90190
11310 -90190 202920 -61759 -255741 -87090 324444 -81810 -51657 -145896 1368 -331 -14273 102488
11297 -137744 147704 164981 -46826 -109887 -200162 71648 -99612 -44492 -23294 -257960 40797
11285 -132373 63588 252651 225951 229872 -116586 -29766 -142301 56338 -193585 -141342 -355639
11274 -355639 -192365 -182812 -297279 174625 -144077 -2292 -150460 337075 152087 199089
11264 199089 115582 -143576 156583 -296029 -404323 19033 -292336 -144481 -84539 -155573
11254 -155573 -3674 -59283 -399295 -150673 30589 59123 -444317 -240470 -372504 -203093
11244 -203093 51653 30320 -81295 208408 -282053 288767 31959 -244997 85582 126559 227078
11233 227078 -77462 89293 -89516 64337 43491 -195251 179560 -296630 65580 -153510 -50446
11221 98444 75946 -7559 -259635 86341 -42653 -106412 -259296 85378 -101036 -4203 -199226
11210 -199226 -213746 23161 24828 5438 -51665 -152433 -80170 8584 -221480 -49799 -221630
11199 -221630 -229681 -263219 -197870 -69623 161271 -132454 -21060 -38248 122025 -75264 60247
11187 7206 317288 80893 -406044 35619 -88634 68248 -147156 -258843 188021 135497 157867
11176 157867 -108787 37273 45943 -80882 118108 -3684 -261993 -100791 -398217 -152724 27764
11164 -277526 -106462 -25212 -28472 150829 -206938 179325 -73259 -167178 -59703 -135135 183215
11152 -302479 92906 83343 -102526 75745 -139341 -545 -239632 164832 -281156 115474 -188234
11140 22290 -138857 35643 -36377 -294157 -180060 42638 111444 69577 -134229 -24981 219887
11128 -37543 245638 -167307 35346 243288 253236 97895 -212699 374803 -144078 113949
11117 241887 -187672 38165 63038 107361 -422060 71756 130252 -123143 80130 -81284 120629
11105 345079 -165067 -63276 -193096 -129236 -47181 227552 -329501 11377 470571 -92787
11094 34104 154890 421738 152821 120298 146664 183850 441340 56197 366455 -306358
11083 147880 301778 413242 269884 303556 626143 62833 75959 150316 366792 346769
11073 346769 72420 243068 270340 297954 -205481 416132 127621 248498 377505 376565 594084
11062 594084 339396 651141 508667 352312 465792 340605 373568 303174 532599 305815
11052 305815 353554 494712 617470 417048 333691 829773 1086332 851733 562576 655736
11042 655736 786199 431813 439760 569057 514582 454221 294597 224527 382804 549832
11032 549832 543999 483229 668221 548930 474033 359534 512186 745732 637293 174752
11021 552439 454512 497841 812165 343981 616680 633800 470734 457569 597703 693145
11011 693145 416853 416560 629096 476489 293979 657404 435338 246411 921858 395814
11000 329466 639773 626322 506257 483498 708673 618706 486308 370735 568663 805163
10990 805163 561388 662207 479309 511003 624577 836533 532809 794866 724994 581828
10980 581828 533768 871695 1005989 998251 913672 1218042 1137581 1602395 1393167 1320670 1859615
10969 1859615 1901923 2046857 1980414 2047521 2173076 1991737 1727029 1432099 1504096 1125935
10959 1125935 1520226 1334300 1140586 1374957 1282095 1258708 1708006 1151696 1304753 1239997
10949 1239997 1186382 1007047 1080158 1065276 617710 524015 527037 287368 73783 423356 175921
10937 286268 -242353 139886 23694 95824 396889 333302 -51786 99059 260816 525479
10927 525479 -35820 -10734 -159 133555 31483 139622 43240 469566 40590 18857 -64233
10915 -15979 238582 112658 74608 121034 -122909 106683 -202296 172248 251205 90746
10904 39651 -12435 2434 -75047 -83700 289350 185789 401234 -157659 77904 -125122 -122995
10893 -122995 -25020 -1808 -9638 -47389 -180719 94681 64249 -299880 -115730 -59428 115543
10881 87549 13525 -172714 55570 -14203 -54884 -43935 -55662 -78803 4970 56734 104432 -217786
10868 -67331 16672 101040 246308 26663 146528 -175584 120980 309075 -106527 -140855
10858 -140855 22362 -95999 291243 -45373 -214957 180117 -167835 -23384 -62019 57872 157670
10847 157670 -152113 127738 -371081 -298298 95835 117002 -298319 18411 -207025 -51994
10836 -297156 -8657 -332441 -7472 -9825 -216811 -428238 -160754 -372624 -75502 -6329 179488
10824 283880 106930 -309502 -47579 46255 -450995 -280666 -171510 253666 123022 -220737
10813 -64831 -18424 -90069 -27553 -220378 132817 -28833 181868 -24964 -237162 111634 302763
10802 302763 -191853 32063 -19623 -92698 -41360 145231 -6525 98009 -36250 -14785 68397
10790 -200302 -69733 -90319 317380 89841 -188432 150016 127285 -5100 61216 42953 190372
10779 190372 -298526 -159615 -217308 77465 -209445 219143 17247 84571 18245 -18543 -263861
10768 -263861 -312533 -65009 -50310 -97333 145833 -207708 29044 -163644 -161838 -324895 -108300
10756 7089 -60245 -145609 455904 124578 -85816 38462 -100669 27769 450355 123063 -52355
10744 73063 349561 165850 188185 -327930 -80153 212908 -72474 -466031 200551 -134627
10733 66456 21666 -113627 -269493 -344983 61033 -314910 -44984 -43308 -64376 26722 59308
10722 59308 85268 -92134 24412 -52681 -19895 -387445 -294836 80354 -306879 140010 -159796
10710 -82727 266295 -137063 -40998 8663 -161399 -368478 86649 -25978 -103719 149296 -176471
10698 -25381 91479 -2507 371826 -73370 -64848 -17793 -34727 -95017 79343 -142888 -67737 -125897
10686 -125897 -114699 -26100 373927 -124853 231000 43341 262814 29054 -88481 102276
10675 69228 79348 -50016 -194889 -344055 30706 -143506 -82829 -10809 8076 -199878 140129
10663 199588 6862 -203743 178329 -11082 -260506 137685 -267168 -287208 -124680 -40067
10652 -53488 -16472 -244999 -104367 119611 37425 133254 -21433 -27721 -111764 -46313 -145656
10641 -145656 -281709 -125777 118167 -21169 -285299 74799 218051 30418 -23063 150513
10630 -162918 -274886 -29814 -249559 -168185 16478 -64875 177698 -399231 -337788 -16069 99854
10618 112380 -174800 -9959 -384017 -232913 -167690 295373 -87600 -178521 143079 -217174
10607 -90996 -181464 -34684 -51913 53391 221037 -262324 -206261 -160662 -46321 93276 -251099
10595 -78262 31516 5433 16787 183446 -256700 221021 -118359 -54839 363140 -256686 -273526
10584 -273526 97084 191450 -163451 122410 70406 137752 96753 120502 -226004 -150677 -221027
10573 -221027 -12908 133225 -118230 -137141 -85542 -2265 178297 -320459 -204992 36904 -95
10561 -267619 -67201 -255289 420606 133520 -77849 37658 -139502 -93488 -296779 -61098
10550 -164873 -130420 78984 -249042 -35240 24362 -309232 -87155 -108091 122689 20345 47747
10539 47747 215960 -102207 -131219 -249007 -142348 183030 -244865 201672 -161594 107090
10528 386808 -34273 3342 -35421 -219726 -329511 -327806 -128453 -258017 -22540 50272 -205547
10516 -134469 -203428 153998 -190750 -179156 -21250 -181310 -156427 -16173 98558 22829 363339
10505 363339 -248543 127756 37627 39338 161709 63346 -161767 80346 157189 -238924 97881
10493 212492 -5149 65479 100144 137195 -44762 -148649 -136647 -247104 113251 -142395 -35503
10481 -324819 -209137 -179867 109705 331559 363698 712910 467896 350286 526583 552181
10471 552181 351164 202630 355177 -23249 309511 -18537 231616 108746 251317 157990
10461 157990 -230872 -127359 94136 117345 9865 107399 -19370 -1760 -193297 15323 -41574
10449 77613 192105 -354737 339309 66020 -239277 249955 -378207 -158190 -9074 -194496
10439 -194496 259682 260537 -269569 39348 59609 31762 -175844 -89152 21431 -85063 235176
10427 8139 -152314 -43563 88414 310594 -535002 -49122 -417630 -3880 51613 141922 -51926
10415 70762 -81477 382674 -375254 -144162 -70333 -295981 -68661 -13840 182321 -31156 219534
10403 101454 179258 -75819 -232392 124336 -26277 -135046 -113244 -68982 -313363 -162337
10393 -162337 6143 -268236 -1634 -62326 -292662 44185 115756 57912 -86474 73627 68141 8976
10380 12051 334143 98378 -107868 -166466 216998 -93981 245132 472973 356267 135825
10369 72255 166681 292095 144966 215209 282460 -48896 340510 42674 541530 257036 207930
10358 207930 359247 169452 168356 38097 316730 659593 555345 532171 -35269 314091
10347 350337 130427 381980 164677 431115 230443 249801 250475 386672 451876 220060
10336 221225 431705 120909 187300 150383 70961 -9352 207914 187407 -81284 28912 267623
10325 267623 52308 57146 54422 325116 268086 45567 147197 163217 113600 55080 -1343 280079
10312 159882 35214 -250589 159173 60857 113877 220967 -93238 -90061 83975 230999 -106087
10300 10654 85628 167244 -109643 -129176 181949 72722 -23438 -2870 74986 -189960 -165541
10289 -165541 88930 -281590 16789 -334004 -159811 39517 -209013 -13372 23203 -29984 -303363
10278 -303363 -286732 -306203 -127004 -28566 -313350 -95329 46914 -167127 45336 -109441 -26425
10266 -14908 -128269 44338 15009 2753 -125720 -50725 95004 -114621 16595 222614 170469
10255 170469 -89570 73491 -343623 127923 23277 55063 122379 27326 135230 -4293 -54907
10244 -54907 -293556 -17895 -152609 -122805 107533 183980 -45085 -96423 -316766 126784 116268
10233 116268 31640 330579 126092 23481 -74114 14250 -29019 -230499 -227890 -252189 277124
10221 -351626 260200 133693 -276962 -271270 19715 -139794 -114101 124927 -262278 -188239
10211 -188239 -67811 -55562 70777 211110 -54830 -192585 -259026 -56537 -26814 215796 -400068
10199 7020 -406615 -53165 -82602 27162 191732 -129399 -159885 -55673 20459 -197994 -283822
10188 -283822 -28974 70894 -362041 39016 95717 6142 81761 -70094 -94429 46094 32132
10177 32132 -178906 -273814 -204659 -66904 7917 -356725 -189949 174395 -42592 -265312 -43051
10165 -55616 -89025 39709 14989 -71690 -196840 -102192 122138 240152 30273 23231 -132053
10153 207972 63121 -233460 -186365 204803 -254325 88373 -133949 -152621 125588 -69890
10142 118650 112432 428049 25309 -54186 -196521 -114687 -57644 -143401 -144189 96658 254685
10131 254685 87899 13754 -244549 197181 -78747 -125033 319417 181037 -396168 -236169
10121 -236169 -22079 -323682 978 46475 76259 133096 181771 7690 -144441 -59207 -331136
10110 -331136 -24267 -211925 132862 102214 145535 143766 -123560 67551 158688 -21914 307332
10098 -245861 -283581 -41201 34341 85157 72771 220070 -167077 117876 68119 -189631 88964
10086 -183321 -313987 395065 297967 -72663 108769 -96529 -286516 182564 -244949 -42584
10075 -407999 9880 159961 190804 35911 134709 -116568 50081 -226341 58926 -746 223253
10063 -206265 -56180 -365026 -285484 -23557 20216 33509 299501 -220843 -173933 -335692 -33502
10051 -131603 -85215 -344088 -40561 158777 -342347 -253810 91754 -110512 -215042 -101042
10040 -84442 118329 19280 267612 -73117 -223893 -297920 -232381 -53050 -124560 19869 -28076
10028 -177809 -135117 -275251 -243167 -147481 -51021 8692 -31897 338991 -204467 -206266 -365407
10017 -365407 -234627 119565 92060 42684 -12599 -35476 -432874 -165269 -129177 204896
10006 -201784 -47546 19518 183529 -205920 22553 472 235262 37133 196242 -129959 -186094
9995 -186094 -4557 132739 -360383 -417906 -467818 -415828 -235012 66642 -13597 -59107 132607
9983 -62264 -298240 -36907 -216366 35785 56855 -53683 -54186 -109369 -188771 -158449 -8039 -153305
9971 -153305 423831 -197327 -152510 -90452 135588 -55282 -279178 -165975 316819 -272897
9960 -281609 -214118 89636 328808 -103258 -215341 -17318 -311319 -115749 77597 -230488
9949 -155515 -130020 -40579 -66634 55874 -44069 -6705 -187978 -61859 -51915 68791 28816 -142033
9936 -4872 -11065 56311 11941 208954 -217618 -76665 149054 33464 82990 82105 -47684 -351669
9924 -351669 -252510 113789 -707 76249 -314158 -169776 116103 -304544 -187380 -76064 -203556
9913 -203556 -184816 135996 -31308 -277742 24772 -90123 -42186 189339 -224630 8000 -69365
9901 -351043 -299997 -271981 125456 -81989 -127904 -262923 -294056 293876 -3617 25256 -132135
9889 -249117 -35812 -57511 129206 -94299 -170351 125486 -96962 -78273 -11184 -330648 -12002
9877 364459 -139548 -145758 -40005 -171495 246015 -104598 -314980 217864 98370 26092 -146917
9865 -60776 -119206 -269516 103736 36426 178028 48596 86487 -191885 158964 -268492 121338
9853 138225 -118082 238022 -5436 226567 195557 264244 -454230 18510 -61106 -71783 216166
9841 -341214 -24674 -180422 -464845 -23509 71059 186949 104935 167021 -108803 -80231 -453085
9830 -453085 -185697 -56551 -402479 -261457 -179055 -18427 -97438 197913 38338 -83618 109643
9818 -89360 53528 -185911 -201151 -195563 -241044 -108051 198132 75241 -8526 30804 -68914 94593
9805 277189 -51383 -17575 186896 -423791 -207534 -369450 206167 -10939 -222689 -98449
9794 173751 4656 -1744 -197927 -157270 -100418 -65978 -74061 -300082 -378323 -50114 66151 -22336
9781 -377886 -180602 103495 98104 -546076 20070 -403362 168109 -320616 -252049 -334515 -109716
9769 -55212 182102 39661 -2439 -367350 -113239 -135283 -23614 -34732 237467 -243427 -116272
9757 -34707 -408893 -378454 -238159 -154837 -80414 -109295 -102040 -7474 -62561 -17337 -269918 67527
9744 -333664 -70069 5706 -84535 -68974 -149356 -277249 -13500 86758 4363 -162717 55307 -6739
9731 -216650 -147417 192125 91304 -261009 41096 188902 -228669 12513 -415374 104963
9720 9028 -269756 -204465 210181 -67743 -131609 -168454 -589751 229519 -183630 -675550 -350266
9709 -350266 -317945 -235123 3427 -210452 -60186 -119569 -86074 136905 -116639 -311117 -73880
9697 341373 -25502 -88 -315241 -78473 -55837 221220 -204275 -270415 203538 -188905 -83613
9685 -263866 -90092 -408797 -51850 239662 11370 224155 43792 87357 129940 145899 -192387
9673 -237459 -290055 51669 -71766 31884 106303 -225808 124349 -234906 -77488 -30492 -151055
9662 -151055 51064 -252333 133346 47777 -36039 -334617 -80224 -459745 234598 156752 42534
9650 173052 48305 -136507 -354125 -98027 108689 115883 -162558 149394 -185329 56944 -335302
9638 -153621 83438 3768 -81373 -159022 -306557 -150796 -192812 -41155 -174680 -26593 321176
9626 -283944 -168456 366299 -54814 -217773 -37668 -139029 -219169 -236015 100557 137730 257824
9615 257824 103688 181347 -195445 90432 -38011 77288 42148 -15986 31835 -116 -134738
9604 -134738 15919 32681 -123980 -132625 -42850 -22687 151925 -118360 21185 -363095 121699
9592 -146839 31104 -280880 -155352 -302335 27451 50260 -390230 -3544 -53086 113943 -348600
9580 21852 -8199 -61166 93039 154208 101900 128553 126206 176772 -530058 -18631 12410 -260312
9567 44031 -192440 -176025 -101743 -87612 259461 7794 81242 -89575 -194607 -50739 -144305
9556 -144305 37414 -35151 159582 -112877 -155454 136160 -220141 76579 -1730 119207 28049
9544 -242121 -209162 -112025 -92445 132579 -846 -214795 -72562 -105394 76237 -299837 31129
9532 -330416 168052 346730 -14655 104886 -60179 249671 1780 -121139 -283898 128980
9521 -51507 36824 -99714 -188822 103208 -11321 231972 -226625 162374 -359629 94984 -301571
9509 -131789 8823 11443 -94419 208783 309970 -18986 -161789 26092 164912 -54282 -98676
9498 -98676 401914 64784 156173 -247596 -46868 426331 -110726 136826 -100163 -156907 -98892
9487 -98892 -59286 219633 -275704 -12037 131529 -28740 -211339 48643 -119602 -104374 31889
9475 -204339 267571 10565 -281569 -71677 57237 192225 71945 78444 -63073 -92544 -435653
9464 -435653 -25742 -220975 -52984 -36960 -200627 19444 -52493 -112529 -173994 -58561 -395955
9453 -395955 -6864 -365526 -124076 -198315 -106280 -140704 44710 105580 -52584 6409 -226909
9441 129357 -392702 -183994 -103363 88589 -366473 118422 112905 235583 373710 44949 -56500
9429 114964 -155298 -218037 -44284 -359997 -81737 -93517 -125229 -55651 188232 211463 137504
9418 137504 3739 63931 -191798 21456 -18583 -41175 -152688 220977 -2830 -85257 280005
9406 -70161 -258025 132644 -166003 40217 -193928 -140970 4231 -5389 210639 -124605 -277954
9395 -277954 -277746 29612 1266 -106590 303589 -276677 357623 -79906 -231398 33885 8127
9383 -229833 62656 -188937 63551 -299440 -230633 -178498 68452 158018 12823 -386642 -91724
9371 -75976 116940 -156584 280576 -14250 -19946 -86121 -286687 -65490 -152227 -111966 98619
9359 343336 -86581 74164 142686 201668 405924 68710 -28044 -184659 -104763 -129336 -391057
9348 -391057 -77156 -56673 504803 -428949 87192 182349 -545282 236223 -120278 -118396 -48103
9336 -63012 -17741 17629 -57116 -184254 -362946 168196 -228775 -72467 -56190 -700 -177582
9325 -177582 9833 -163143 -97965 4554 -83836 -64040 129506 5207 -163355 105410 313002
9314 313002 18250 50329 -345574 -128362 60744 -57672 269740 -373667 -289342 27435 270226
9303 270226 -272412 -259587 -72116 -99709 -223312 228218 -31406 -231684 -189127 -16341 -441658
9292 -441658 -138416 26854 -268219 -226755 248885 -8524 50793 -5679 84106 -224848 -240220
9281 -240220 -249167 -146142 -6978 -51176 -139896 90683 -96854 -306640 104898 -139366 -63606
9269 -51729 428521 49282 298033 212236 -30158 168862 -57928 -188445 -16312 77265 -127757
9257 -40227 -343131 143159 -230598 -77246 142840 -57716 -124840 82275 -94913 -8351 -94733
9246 -94733 144411 234340 -185554 305400 -2485 267401 22143 -111984 -200214 -218059 18977
9234 -310609 -121365 13260 49216 69410 -247452 -217812 -148788 108516 -229689 -119658 980
9222 -50137 31348 -105788 -75320 -77855 216167 329812 -90102 -129552 -50259 18243 -175801
9210 -29590 -338527 272021 31404 -182742 -24346 211720 -140573 181081 118280 -166345
9199 -74949 -223816 -57994 -90759 -108513 245255 215909 -274029 46427 -308523 -98173 142964
9187 -158290 70466 -159482 106768 -47866 -141844 -326690 -2615 37334 135219 -248642 90464
9175 -109297 35381 -244559 -108022 -2684 -97364 10183 -226428 -63919 145390 51299 -177753
9163 -489110 84080 -41310 -233411 71837 -52843 133747 118315 -29556 64585 -70491 -162990
9152 -162990 183278 -219162 -29642 -78074 65886 -13324 -288210 120815 -227066 -62648 -168915
9141 -168915 -175881 -147235 74593 -93835 772 75711 -316497 -159660 -16665 -49316 -177982 -105569
9129 -105569 -44245 190466 -73301 -6001 -95122 191869 -139101 -96222 -284940 -58910 -210465
9118 -210465 55242 -339686 96703 -78960 -454109 -76436 -94502 -80413 338202 -100042 -46006
9106 110244 -153504 -66419 205706 -51163 56683 114486 -206580 -103414 -346454 95793 84514
9095 84514 -257663 -157975 -74747 118461 -51165 137088 50971 155423 -263348 -176835 -300646
9084 -300646 -229340 -94938 -24846 -320001 -31932 -129961 26761 -205439 133812 -31058 227241
9072 136230 19830 -52176 -136277 96259 -25819 43770 -393930 -163195 70143 -5260 116794
9060 -121267 55019 56892 -300608 -34280 -212507 86082 275946 -340826 -128753 303564 298618
9049 298618 -351473 122980 -64203 51744 -208020 8168 186849 46263 -34512 -67971 -113074
9038 -113074 138023 -112140 16342 -331949 132620 -55057 -336200 -106188 56828 -41626
9027 -116912 -218301 -364192 -51152 -26644 -201965 -283171 -11920 -116579 -69369 -115755 13529
9015 -54409 -58823 100989 -134991 -343326 -305348 -318463 81626 341247 110794 -480020 -200922
9003 -198034 -343015 81850 -119151 -84692 -68937 -164860 36220 64765 135321 -126375 -254050
8992 -254050 -4983 -291758 -96386 -126581 -195425 -125805 175410 -70216 -148219 -94652 -194110
8981 -194110 -211651 -3075 -117685 -60282 -362291 -4757 45571 -207717 -197071 -181369 27437
8969 -8539 -227016 -286850 107713 -68574 -273051 20512 -159508 13610 26275 -33317 -324188
8958 -324188 -25718 469088 129252 -73980 140036 -44818 495643 -279528 -189246 118330
8947 68100 139606 72735 -79247 226586 -96723 423008 -280575 -353261 -9850 -214085 119117
8935 -113363 -81697 280966 -19348 164844 -195347 138369 -103069 -148512 42557 77899 -71415
8923 165629 606946 276802 819699 2187503 2874999 1720337 1155033 636066 164143
8913 304388 -148678 71174 -303884 143460 -109876 -259401 227921 100249 -74112 325403
8902 -44212 276377 -266081 238777 -157581 -192191 -89311 -180840 -85681 -97879 -128502 -17769
8890 306 -101367 -124363 290304 55008 -396549 -44799 -95133 79744 -153773 228732 68944
8878 -57902 -1935 -108889 -211073 -232002 544 -208768 221002 244822 -159705 169877 -108932
8866 -147978 -190368 -65344 89331 -154465 -171145 -72143 -38453 -226126 57807 -141235 -117009
8855 -117009 -324027 -114365 137018 120583 -14396 76480 20431 -83904 -34059 237682 -99210
8843 -159807 -277983 -140132 -25532 -383516 -42747 -373543 -108725 -35923 -47418 -42893 132124
8831 -31777 306208 -204443 22191 5650 -225384 118079 29389 8374 -288956 -206610 -67874
8819 -14447 -37270 -115657 -20257 -146714 -71273 277954 -316269 -50306 345619 -168834 173523
8807 -266745 -113559 -94781 -140957 -75116 -113623 224905 -400528 -250969 -174488 236917 153485
8796 153485 21806 -298524 124678 -8218 -328697 -152562 -1809 301066 141634 52824 -177783
8784 -138795 -101964 -65991 -103259 120355 -190575 -73024 -160290 103422 -293686 87156 -46201
8772 -155209 144013 -265510 52313 -118039 183382 318449 -147901 -504721 138146 -264317
8761 145331 -37632 243654 -190131 -484 -286869 148840 399665 -221454 68397 -179971 -65285
8749 142850 -245855 -92764 -78475 -291747 -43533 98276 -72214 22110 -145866 16420 -124575
8737 -178809 76675 -222568 8874 -185073 -177655 -392090 -198436 -314803 59350 -160656 -158660
8726 -158660 64505 98593 -239648 -40521 -244594 92613 -151776 -74660 -208927 -309190 44900
8714 46315 -33997 -281677 15135 121238 -130826 -376111 11164 -29336 340522 -299445 92615
8702 -101406 78410 267006 -253087 -272654 -102680 -40783 -102233 45897 109229 -455909 154470
8690 -44972 174605 46074 -46789 -309717 41868 136127 2153 303866 -227701 150683 -77086
8678 -89464 241790 -108689 -89225 -29200 252098 -5577 -227059 -127163 38773 -91698 -66672
8667 -66672 -507973 -102493 -9724 -30961 -204975 189499 316951 172153 -279685 -151708
8657 -151708 329242 23026 -70928 33702 -59383 -237190 -32018 53355 -107945 19959 322360
8646 322360 -152195 -46392 152216 -255971 -198857 -167051 -26188 -290437 -34409 102150 -182547
8634 -69896 90683 40747 17645 -121371 -85239 30620 96137 -163109 -26098 -150079 36912
8622 35638 -109221 -151254 -78926 68365 -272849 -57062 160727 -251330 37044 81776 -304239
8610 -233468 52549 -171113 3752 47889 128078 129153 136401 -338067 -67437 318604 -44757 -287769
8598 -287769 -195970 -147792 -230451 79474 -47417 -276585 -50173 -102090 -65111 36658 -26801
8586 -133559 84317 198368 -12036 -199325 327021 -197563 -146325 271629 -73924 -352870
8576 -352870 -27380 -158925 -73893 28319 137526 -106900 -132042 -82943 -280409 190423 30502
8564 -178075 -274871 -175867 -137128 143171 70358 258880 76664 77139 14288 -218437 29131
8552 -247625 104778 -101446 315112 -429761 -102568 -59333 -130511 -166967 160989 -185177
8541 -109266 -321709 313977 -52330 -128545 -5816 134153 -5873 -205852 -385707 -27836 -66804
8530 -66804 -85944 -1922 -185141 -105898 59267 82425 152781 -47149 41781 -146022 -191543 -365057
8518 -365057 124962 -303505 -129741 -1179 -155852 -208124 -104457 -65183 -23287 53647 103264
8507 103264 -273412 -199007 -127169 -93451 -233519 -119820 289523 -71597 -197566 -254161 238523
8495 -122601 102947 -211714 54731 -122781 -330919 77051 158893 -138576 53148 117491 60566
8484 60566 279414 -86730 -392758 61727 270030 -54164 -270987 -12198 184113 143613 -71717
8472 -52003 -210457 -190041 42864 48972 -224953 71157 -42717 -283421 28953 11238 -134627
8460 -126442 43209 -203169 -93085 25283 -362456 -354099 73873 -129348 -163738 -169495 332292
8448 -197555 67374 120982 -236263 41582 -231314 80265 47521 -81985 22602 -17397 -157637
8437 -157637 -135076 -241283 178323 -27299 -6827 -222440 26231 -44872 -46439 47857 -181977
8425 -231076 -61939 -64004 -217971 512237 2230 -232326 -135452 -7237 -18908 -163606 84975
8413 206183 -84987 -359650 85331 121699 -132764 -43492 -260074 261974 -224008 -33226 -145082
8402 -145082 140362 192465 -220517 -553489 109554 -217940 -157584 -36541 -201628 94240
8391 -33146 -97539 286593 -121704 -62608 -383000 98272 -301898 -100035 59179 -188534 -197345
8380 -197345 90221 340122 -72767 213815 376187 -308337 -10518 -137658 174546 193090
8370 193090 144622 -282170 23329 -24133 -105901 276273 -111505 -341619 63085 -122472 20785
8358 89097 48101 -269619 95948 -169271 -305784 -192148 -162242 -295271 -157695 -199600 -292170
8347 -292170 -170513 -219676 -413127 -136471 253531 135195 10378 -94018 132809 41610
8336 -29847 -78278 84115 18578 -144290 19621 249080 12636 -31816 -189863 24152 -127705
8324 108290 137024 139356 -31575 -117716 1764 -259490 87578 -103119 -131892 -137577 -492667 -267167
8312 -267167 -55616 49382 -75722 198470 -78266 -115949 195594 49714 -273225 -246777 -122506
8300 -10794 280551 45922 48367 240334 311161 173835 -17606 -203198 -122583 -8674 273857
8288 95660 93029 42260 32221 163436 123744 -267522 75397 138087 124034 -12543 134492
8276 40037 139455 126077 -221581 61926 -598324 -93835 -371851 -14530 270407 -314945 -63156
8264 148224 -125866 -146068 -99332 -71646 -17757 -153119 -256146 208654 -56436 68228 537802
8253 537802 -171064 37254 82796 -353299 -96219 36603 64188 46523 -277534 -247905 57583
8241 57528 -43759 -242592 -72420 -170478 104461 166565 27773 -108288 81955 295582 5720
8229 -100367 179137 -186952 -96731 -64317 62737 -189833 -188855 -48581 359227 -182882 -127876
8218 -127876 -65036 129173 101895 239209 -164821 -279822 -230407 7164 1253 -51858 -2729
8206 122515 -71058 -54045 204363 -30621 174711 -340023 229731 79291 149196 -97930 -229506
8195 -229506 50960 -24955 -403162 -122406 -127417 -475913 -480993 -176609 28666 -382545 106509
8183 94329 238772 145449 1732 -18984 19789 -150795 -275817 -194616 12664 -48557 -97431
8172 -97431 109620 5080 -94291 -74442 -173103 -250816 -147953 -193383 -220053 -114520 -293320
8161 -293320 114338 -30305 104048 62834 132919 -13659 -42636 -36432 56136 9818 -99901 131196
8148 46052 -138770 19424 -180336 -28356 59255 160818 57431 -90547 -153578 -151410 149132
8136 -33797 -151341 -309000 211010 -98713 -147122 -45822 275830 -137781 87490 -189156 179754
8124 24330 -12933 -19756 -3055 -15193 -293504 -111494 -45920 2560 79503 105974 9492 143956
8112 143956 29835 13018 199604 -100511 75045 -198745 116495 -3779 -18396 -113094 -103050
8101 -103050 28561 -426216 -155308 23045 200160 -95019 394945 82959 -89925 -50800 23827
8089 -187948 -41325 -58261 -61149 -67029 -127881 -91054 17220 -406935 95620 98775 242803 -183974
8076 6233 -289025 -239598 -93179 -200778 -24923 436154 -168299 -179727 154238 -160201 -88786
8065 -88786 -116866 -217833 22031 107378 -170868 -120024 -160886 110427 -161055 41188 -125682
8053 -282363 -252892 86460 18082 -17218 222 149759 -163666 -111257 61071 106212 -88819 167158
8040 -203466 -213497 200127 -94257 -95470 -16861 105676 168154 -380273 -276476 -42803 1024
8028 78484 21992 77698 -297846 70228 -118102 214456 -209069 -67191 137050 -198471 125821
8016 -60403 -318960 -229485 12483 -168497 -42287 120186 -81005 68844 -53218 148275 -48734
8004 226730 243082 16063 -134130 325273 153161 -333870 16833 -235132 210040 -29159
7993 402145 100339 -144657 331416 -123778 -168999 98927 44341 -78305 -22778 185002 12828
7981 -274814 124052 53347 -206978 50823 -147311 -104842 -119976 -211283 -297640 25279 -191695
7969 -111810 -132326 -219502 24359 33031 -253896 76691 181498 -36107 100524 85162 -169626
7957 392030 -135481 -179247 93020 -183791 -267687 -43243 -230253 51749 -295893 -225344 21700
7945 -141280 -57646 296411 -35036 234699 -206860 -5475 -25975 -51978 60037 -59892 -5637
7933 -282005 8389 40891 -137444 9380 -156658 -17330 213216 -239490 49479 -128377 478
7921 238160 5976 -33141 228169 18388 162658 12101 -74814 -117043 61079 -136045 -248499
7910 -248499 228505 -155827 -28828 -112657 -83054 -243552 -152825 -8111 -51390 -182752 -47324
7898 -143995 457908 914 -37598 -201474 116625 -36923 -21587 49451 -33959 9892 -407582
7886 -126873 -307877 -47980 -63251 156031 -65578 130014 -136849 270712 224910 1097 -92012
7874 -19752 183116 -150792 -305130 -187323 169646 -214178 -121511 36762 11044 62965 -136992
7862 249868 -74192 109089 -31016 -18277 -38540 -32487 104560 81200 259426 31997 8970
7850 -189493 -28165 -13397 -52819 -12813 152436 170308 -374956 -277027 -202199 65331 -75715
7838 -266072 18615 264625 -375166 275376 92756 -139798 27699 -94295 -284002 263084
7827 36502 51050 -183061 -125967 180122 90431 118546 -10797 49942 99165 384531 28835
7815 162431 37576 107311 28030 -188762 183394 -321518 64348 -180887 -152760 70009 -115425
7803 -41249 210103 50663 113366 -7409 -64469 -30963 172590 -95180 -167883 348333 -167200
7791 92959 -216080 -47317 -104178 -207147 4527 263590 -270563 -90406 128321 -45903 -310053
7780 -310053 -36310 -294901 -391771 62534 187163 -108823 -99436 -117292 209218 -145877 157047
7768 95831 14828 102610 171965 118941 -478942 30409 116956 -10541 -256094 -305334 -183284
7757 -183284 -80704 -78556 -109510 -128661 -189409 163602 -59047 -3663 -110091 -212263 19834
7745 -509687 34106 -83121 -108535 -198744 -303747 -15779 -203294 35812 103339 -97756 -188503
7734 -188503 -440289 147224 77589 420626 139106 -362668 58623 11553 -4629 98871 -120612
7722 -1534 -165794 -283440 9177 -57957 114603 91960 -150871 -53724 382156 -29937 -353782
7711 -353782 167298 -26909 -151328 -45233 -57056 35993 -263188 84000 -269773 -389392 -144873
7699 -321350 254660 -61481 287764 -308341 -124462 36141 -421455 99148 50665 2963 54590
7688 54590 125807 -36005 -382417 -430896 -132123 74233 -31236 98394 -183219 -262413 -184367
7677 -184367 -168207 -117603 -268193 -130580 -256508 81523 -58557 16223 -127061 -81968 -318736
7666 -318736 -93331 220675 -159686 -117866 77344 -71248 -207811 -28534 -216592 -10367 188148
7654 -54874 -339811 -108876 126266 -3162 -91331 49310 -108826 52919 -36736 -146823 -255369
7643 -255369 35637 55202 299695 26165 -397002 109722 -138391 70347 3082 -160251 -248595
7632 -248595 294425 52050 -166974 -367350 -43449 -170081 16393 -23787 -51421 -166940 -203306
7621 -203306 38580 -286729 52575 -131245 -205872 361271 -190594 -29315 102887 111939 -193252
7609 140730 240890 185629 3887 81788 84706 -310268 -80283 -13035 -174082 212218 63202
7597 349721 71463 224992 -251291 259516 5400 -71654 98714 -163408 91483 397760 -155016
7585 259173 43234 -147995 199137 294209 -339218 -114392 89530 -272051 167550 8754 75556
7574 75556 263016 82443 118269 81256 -111902 -85382 -125449 -73415 10230 131156 97012
7563 97012 16107 -148815 -88426 70962 -22825 -120063 -41898 -230907 -349852 -263273 -39157
7551 -44250 58919 -595577 -92162 -57294 -248802 -89638 -29479 14262 -76574 245427 -151269
7539 165680 -289490 -71316 135111 -290952 -271543 44056 -35638 250436 -55803 -47527 -303467
7528 -303467 -346963 8857 19903 146968 -404937 -285221 -107656 -126969 226798 -42184 -105111
7517 -105111 -11507 16939 -162925 262973 -74362 162221 223392 -90098 -129564 -123618 614010
7505 22129 -63569 107128 -137517 326233 -127956 -221510 -150536 542064 -39 -148672 22201
7493 135766 129098 -63679 57290 -24293 52328 -298073 -77183 -229342 90287 -343842 200015
7481 -48846 -112875 -223238 -194431 255835 23648 93284 180831 46757 -4058 45875 -132698
7469 3885 122165 -73101 119566 34170 192104 38203 178803 -85006 -32525 -15480 258375
7457 110419 -503632 343771 -235456 91203 -52833 -107562 -56989 133726 70229 -194034 -94570
7445 52529 -408145 103173 -152294 219739 -205852 -68666 -234497 -342026 20834 -128554
7434 -169596 -35495 85295 239373 -250591 13339 -227872 24549 -170722 -122006 -39593 115258
7422 90459 -165505 -218088 -203684 -87991 130960 -112593 -62439 118625 130318 -98771 26700
7410 -124547 -193261 -90025 30014 265299 -189165 30460 -126320 -260485 -259879 119728 12695
7398 170573 -400256 -19704 27599 -7311 30710 -174418 -66356 140833 -129694 -57595 -163656
7387 -163656 -60483 -73095 -169976 -188487 -39516 -353667 44465 -50919 -113373 407739 -118822
7375 60364 96282 -266446 105784 150479 183212 -105638 -79435 -73866 195740 -169650 28863
7363 118416 28885 -120618 -21425 -79764 -172169 288386 314592 3477 170516 -53366 30711
7351 116206 -209474 -56312 -355240 -21841 -296608 174457 140469 43148 -211958 -139057 -240553
7340 -240553 -212969 141053 58292 215880 -445460 69383 193619 -76210 -440543 1197 -180073
7328 -196603 -78273 -215960 20353 110290 5084 116654 -65104 87771 237834 -10098 -123632
7317 -123632 -379290 -92308 -39579 -163022 -102347 -124506 -424712 -345602 329969 -269715 -122306
7305 -230001 -8260 164322 39928 401737 -112033 98690 76969 7389 60426 -81726 59500
7293 -5600 18507 -23088 15542 107752 86336 -262730 312760 9477 -73434 -119226 -12544 19100
7280 342119 100884 -239029 -396214 55139 -149245 146706 -114351 -298880 215538 -125288
7269 -73992 -75664 -439592 -383593 -206070 219179 269901 8926 721 89650 34532 230086 175890
7257 175890 -209692 165396 -242071 -146055 -415845 77174 12842 -64582 -124210 11799 -241425
7245 301803 178856 79941 -108299 45796 194248 89401 248177 -313437 -203558 -123113
7235 -123113 -25142 169064 62872 25864 -131968 -41406 -408835 -240652 -185056 -14686 -89977
7224 -89977 251340 122972 -123368 -149879 70738 -157381 -283645 -299645 153793 45138 478479
7213 478479 -82934 -147937 -107913 -63192 -1320 34668 135255 -127227 -154606 192731 -270174
7201 -17258 -57379 -151158 -357665 -69562 -180910 -24433 20970 -307789 146073 32994 -82998
7189 127729 -61203 -40234 141718 -126515 83806 -117239 136126 27049 -255461 242564
7178 92583 -54205 -116645 69486 -27632 8939 -257664 112444 33948 18463 31954 -85346 -192660
7166 -192660 30120 -448039 -266901 -195835 199952 -67466 -220524 27906 -34742 -225749 -122578
7155 -122578 -161356 -59495 -66933 -42398 -152041 11142 -416874 -532074 214075 -33461 -87149
7144 -87149 174864 -90234 -163256 -281208 34700 123998 -42584 318907 270641 173209 33664
7132 -5350 112492 70512 -134533 -20568 -9329 34690 143610 -12241 -20877 -111266 360273 411678
7120 411678 -226944 -222768 -113955 -34068 80694 152311 -321966 -6614 -81896 -36204 90353
7108 -55429 -486790 93979 -210934 -208933 74708 63557 273892 -411863 215699 -61687 -160048
7097 -160048 -156631 144080 -238073 283468 -105224 58910 195327 202920 74834 194104 -304229
7085 39090 -204326 67825 -87121 28950 88937 -226006 -39911 -224479 -158731 -143414 -100227
7074 -100227 61788 102341 35194 -458314 -526035 -70813 -227581 -16531 -141573 -9829 188112
7062 45546 115616 153751 -165806 -290687 226143 79669 210536 194859 -48827 240222 -134948
7050 173225 366521 -208053 -27466 -48589 67452 -112022 -57923 -96011 -84747 252634 -78329
7038 49688 -24652 85703 194541 264756 -268731 -91559 168326 -5084 -26523 4277 -99710 -31762
7025 6929 -46704 -164017 -42564 25567 11416 47455 -25532 21411 -460213 343245 141818
7013 229057 247165 14811 -106806 -303028 -78878 37843 -67849 17132 -359798 2255 -118231
7001 133770 52558 112860 35784 -39176 -63245 65466 -9162 74265 218707 -136276 134105
6989 -92514 -57475 22797 -175205 -277839 -13435 -248316 -306951 -128127 100894 -211610 -385419
6978 -385419 -16202 6005 -126614 -164182 -131387 22280 74164 -192779 -38042 341644 -57680
6966 -53334 -49390 295268 -22051 507920 -105820 1994 -296019 120006 -413942 153501 -123396
6954 -72655 -71370 -116652 228613 72398 39764 95432 157513 -152701 134325 47167 -154068
6942 208128 254897 88144 188677 -195360 -48723 -157746 28379 -427698 -336922 -113680 -40028
6930 -101773 -217853 309496 -172823 -74541 64783 192061 -92974 -226288 144842 -128419
6919 148176 78633 -173887 154853 174203 -138338 -346328 -143546 82761 -126667 -9809 -185214
6908 -185214 -94540 -106402 -165722 -440879 -25394 -38150 -23441 260597 -91744 43105 205096
6897 205096 64806 -141968 -238567 -13465 -118886 -245471 -50991 -49138 191728 -61559 -2809
6885 74378 -166022 -51159 40500 32576 282065 -59646 -237211 -23970 -120543 -111364 -200949 -163901
6873 -163901 -50714 -56812 59814 84688 25178 -32137 -159735 -70643 -58734 -86167 -76602 271276
6860 326992 -13125 41955 -133155 98546 -47147 -293150 200487 -4935 2247 219649 -314791
6848 31564 106831 -99545 -58163 -10519 -192949 -63467 -91709 -211836 109570 41449 367061
6837 367061 204736 53316 -2958 354709 -153702 -249629 31062 272704 -63300 43175 223108
6826 223108 -393381 215268 -276715 -66029 66559 -207573 -409775 274348 -41367 146226
6815 -86142 -64953 233676 121035 151528 41411 -25358 -261764 28043 46959 283853 165760
6804 165760 -268065 -117254 -194956 -198375 102059 -92393 -119732 -195174 -230506 199389 -61971
6792 -148632 205277 -56680 -65761 -435021 -51423 -52887 10176 -38158 -246309 137755 130404
6781 130404 -82164 209140 -123579 -347722 -174604 -339230 4596 342913 -57325 -142202 -211223
6770 -211223 149919 -112844 15817 -13291 78349 -80206 -10575 111041 -135403 -56794 78153
6758 74406 34020 -125334 -260742 -66990 353646 -67792 -44418 256162 22525 -206043 216528
6746 17114 -203009 20067 -3445 -137858 133086 -394507 -345928 36933 -205950 -223986 53458
6734 -287240 182828 120860 -105059 -167650 143239 228241 -380989 53888 151260 -91638 133130
6722 -198714 -25432 169656 -35527 136074 56291 -70315 -284873 -34506 -5142 108040 340258
6711 340258 -4992 -299107 173896 19463 -71372 137979 -110700 -77515 -160808 339844 52986
6699 262040 60865 -109264 -110092 -58438 57158 -52460 58050 -99563 -126489 -198571 133179 -299209
6686 270015 -5957 -113970 -108920 14818 -28022 60463 250914 -336984 -184606 -15793 -3276
6674 170971 -247233 -364906 -98973 -121415 39473 -123225 28195 -79359 -189377 247962 78859
6662 -182811 -130182 117019 246230 238841 48489 55975 -49139 -59674 239915 -77274 51595
6650 137361 247766 -234353 -232284 -150094 284794 106189 277462 -228968 -102193 -290025
6640 -290025 -55758 -45049 94160 159 -14536 89933 101212 -29199 17169 6348 -239168 -138316
6628 -138316 -177639 -170567 -198121 -210643 -350968 258184 320510 114717 38600 -386394 156043
6616 -284105 -169181 67749 48325 -120762 -176937 141990 12758 40512 -99553 18391 63511
6605 63511 -216438 83305 467937 40210 -59746 -358756 -54535 -61616 -112871 -226877 138536
6593 58760 -214432 187686 23519 -145315 -124889 -12641 -12179 45771 -201165 -114185 -230925
6582 -230925 -156461 -215733 -202747 76005 -365483 141140 -209956 -192422 -334565 57128 -339676
6570 107547 -267352 202171 28252 -104644 67874 -134547 83360 -169975 14682 71270 -262774
6558 93039 438840 41060 -125872 119781 -64605 100024 107139 -111944 -85883 283064 118955
6546 65118 -75326 134901 -69077 103121 -115464 71074 -226288 -227479 -179892 -453971 225081
6534 38910 -260201 207107 112112 200631 80002 -198717 -240349 -116736 -6849 139971 84920
6523 84920 -158572 84308 169238 166021 -202607 -91928 -213299 130681 -86661 342039 135778
6511 -112974 18602 -66642 -91222 -232007 -85453 -106694 488725 -9023 -62116 148238 -253650
6499 16406 -38761 -27779 -293365 71451 -22681 129851 -112088 -115393 12295 -34746 -54507
6488 -54507 144310 -45524 261493 396768 -76416 -109709 -268871 -228282 -115651 -73228 146922
6476 329891 -73797 -87658 231098 15080 -7737 -84279 226271 -390704 -319424 -163154 -474670
6465 -474670 119003 -341610 139173 238898 107432 -2601 124241 134940 -120119 99673 58007
6454 58007 84325 -24552 -217380 153480 -9159 9389 -67534 -56709 -184729 -204272 -196919 -384902
6442 -384902 -198251 82988 -92348 -160786 282931 -184761 23757 -101840 131785 -182425
6431 -112004 139184 -118414 50109 349568 -161598 73913 116142 68709 -52226 81656 69011
6420 69011 161976 -60922 5862 -127165 70817 -137963 -74015 148674 -349717 87434 -304073
6408 -358597 -1418 -121772 -145929 -26371 -296 164473 182190 9167 172964 -19566 172042 121174
6396 121174 -236125 55663 85759 -5201 -129780 -174499 30765 -56485 -380959 -55190 31965
6384 27665 -278290 114999 -78107 -300094 -142693 -306361 -51419 -88871 44647 174653 128572
6373 128572 49786 -7582 68804 -69456 168674 -75501 166183 212102 -116480 -155639 85168
6361 10958 -84052 56620 122987 -50039 -7165 64937 142902 -172198 14505 -45131 179214 133115
6349 133115 9704 44297 -240377 -30712 -96652 21899 -169591 84415 225776 141890 164169
6338 164169 -87228 -248815 -112262 -306238 231630 384753 -48802 -86475 -451991 69257
6327 42204 -87824 94536 -31918 -391781 -232249 206757 113762 -39506 -225471 39887 -55215
6315 39551 -201377 157128 40892 -258649 -285629 46545 14679 -159561 -58464 76626 -304142
6303 -443574 27710 -346339 69832 226376 145323 53082 25653 -50705 89594 -304220 -198297
6292 -198297 155854 -213731 110144 258474 -144806 -60072 119987 49849 -51110 -103447
6282 -103447 138756 81171 -545359 -308321 -60549 -257731 -338796 -217564 43826 -121932
6271 -238546 -307355 143436 -74126 108306 92353 111799 142693 -29358 126681 -383507 -65960
6259 95644 -115355 -62122 395056 -93106 -118570 -11895 115063 156505 -146425 95908 28526
6247 -215044 -35322 38497 -277141 -315465 -162820 -119089 777 -50988 76047 -66916 -65787 -13447
6234 -278605 -36085 25360 58181 260798 92776 -81953 -169487 12166 -237765 -110337 -177006
6223 -177006 75399 -169 -100352 -115446 111165 -98224 -190970 17897 -51553 -135409 165334
6211 -27548 10372 345627 46886 -167985 17413 315536 -160715 -79398 170 41583 -56614
6199 -77855 78955 -113890 -26750 -167209 132523 -42054 -373824 -191996 -262637 257850 -412167
6187 -113826 -23029 216051 62415 -6017 -168194 1707 49424 293597 269997 38384 -75616
6175 47971 95853 -409145 64187 196802 89464 -56589 -127915 -80271 254249 -15651 -694 188492
6162 -30084 -125310 411170 -221924 55548 3274 165235 89993 -29262 -283142 -20344 -16065
6151 -16065 37641 -114959 -195748 92197 -266086 352527 103507 -61735 -35436 241362 -68608
6139 -285705 359189 187744 -233301 -724 124227 65023 -59179 136714 -72718 127357 -163516
6127 33712 186119 -134300 -81782 53139 -93678 62623 -221713 267714 305280 -79185 -125568
6116 -125568 -96452 17981 -70516 -105930 138618 -133925 -32787 217022 -13887 -47274 -65720
6105 -65720 -88885 241444 -203620 169323 -57915 130662 91574 -270985 -128053 53109 -176096
6093 -40934 -17967 -54662 4402 22052 -141752 -207456 194728 307792 271576 -120152 -34566
6081 213375 122596 18477 -69531 261934 9620 -159171 165897 242573 -23932 -181729 261778
6069 69001 -41937 -139390 -71725 -45388 76676 80729 319367 -151834 29570 311436 -11360
6057 -36631 115047 -8232 -83789 -345974 -171077 1939 165943 -3755 -65450 51773 93994 -47137
6044 87231 195458 -82519 50919 266593 84135 -84851 169341 502795 -12405 -178424 283959
6032 -408329 252257 -195185 -38304 -263864 103802 156557 -13305 -114495 -97131 -59138 210362
6020 58970 66321 -89009 63241 -504638 -335725 -91375 21278 -66184 27416 267590 -37297
6008 -14247 -328104 174498 122906 -46602 163214 111705 -34066 -162083 -110297 -65514 4668
5996 263107 -265438 206230 -29583 -370267 194201 256436 31045 -364729 112437 -19709
5985 109180 29429 -71453 -2464 260916 -169764 -38130 -64758 201787 -142276 164464 218944
5974 218944 -10964 5342 52147 153548 20571 11199 151469 -350482 29614 -112621 23504
5962 -33688 39343 34691 -324308 41623 -11279 91601 -119680 146864 97463 -73242 327759
5950 100225 -35267 -19252 195795 -192208 -236216 46092 207499 -154134 -131875 -159482 -106190
5939 -106190 -65309 134005 -80842 -21266 128342 -14785 -37355 156209 -105225 92527 -338014
5927 -208210 21907 70299 -46414 -63623 -81811 -174930 -120078 69748 202028 269188 -157559
5915 -140483 70762 115095 -312779 -20253 239853 151205 -3787 43229 119219 -181766 116385
5903 80708 -66086 -379627 105335 32150 -148426 20889 -386924 -51998 9512 119328 31951
5891 -63905 -287709 -183995 -90914 74564 425914 162883 143917 -80448 140782 -55687 39669
5879 -201982 58147 110928 81180 -153713 -244435 -163878 -301034 -147793 47056 -141618 -331162
5868 -331162 254629 29175 46989 -31245 75836 -135515 187764 -346226 -199679 -164352 -60135
5856 24992 -239582 -37851 52949 -15657 -61113 -446689 -216550 214331 -436620 -42191 -99202
5845 -99202 -112115 -172158 -85796 361589 -75988 251689 -155979 68136 115709 -45107 48591
5833 134595 159949 139448 -288907 -72868 87665 353298 -181260 -84737 339814 52265 28777
5822 28777 197836 189976 205004 -209284 84251 123548 239062 -92728 -83480 -218013 2428 111299
5810 111299 -53043 -234370 -136996 -400387 139944 -130778 116008 194163 8335 69906 -282141
5798 290218 267799 -124964 223281 161774 87758 164264 147346 128664 -48960 -368591 129969
5786 20278 -277476 -72955 107199 303739 229346 334233 -209781 -50708 -271820 98185 -56741
5774 65653 319628 205388 -1352 37861 140935 -143837 187667 -121821 -85262 -7559 -359656
5763 -359656 -7352 -22463 -125068 -309471 -189268 129971 -67989 -167136 -140765 196277 83255
5751 -233866 -24707 -220953 246095 -41657 -30884 -135379 20635 65387 -87847 -95925 31025
5739 177562 -121958 199789 -19169 -5085 202193 233103 66908 -83316 -142487 -49928 -31255
5728 -31255 241987 83208 -242107 -36925 -123971 204793 -26368 -59938 31070 253930 11137
5716 -227311 10957 234046 59148 -150045 -2200 211849 199588 7665 -125233 -255863 129008
5704 -35178 -155846 107249 11617 141498 -156204 118024 27252 284811 -8231 -22271 -70891
5693 -70891 74113 105579 -41876 211412 -55569 135642 -6744 48162 -236594 -386373 40962
5681 -20726 -53707 58666 -164822 -394569 -128195 133440 -128022 403744 16909 69715 57060
5670 57060 62848 -52864 -7218 43820 -16743 15734 146860 12382 105383 9343 -27318 -215733
5658 -215733 -205383 38981 -140394 -249521 209459 -17153 11689 220514 236030 24199 318234
5647 318234 -289529 -122861 117678 92931 73754 127251 35228 37267 65524 -15402 -121194
5636 -121194 22851 90071 141760 54843 -536 -110951 -199736 107316 41847 -212315 201154
5624 -344474 416617 -146401 -167589 -72807 -72215 216454 -185192 -320394 -163277 -35518 45601
5612 33510 109376 35293 -264220 -29130 27371 172024 22606 -21470 146724 -255936 48177
5600 224113 37377 -44716 105575 28515 -332023 351864 201999 -22046 232257 -8503 -120277
5589 -120277 -200300 318847 -79342 176405 -58951 -3919 123537 -158458 -136221 -392737 -52744
5577 -184914 -38100 -400689 -203652 229666 -333837 -268669 276972 -173089 -26974 -49974
5567 -49974 -9571 -178449 -117072 -8742 -363510 -128407 177229 -147261 100904 -359602 178589
5555 221701 -10780 -247270 41095 10586 54529 -41660 288964 -39582 -437070 148509 -3841
5543 11858 186432 -308532 104874 -98092 -72589 -258925 118204 -181535 -116746 -1533 -36881
5532 -36881 -24845 51325 78448 -64861 220684 -100654 135134 180043 3902 -69737 79235
5520 368035 -194331 -55967 -228572 -134751 -203998 -118637 94072 180268 19433 -286996 -44343
5508 45868 44182 -80421 70850 -9420 97665 15190 -61178 -180032 -159269 -274815 209494 -284991
5495 43156 294608 -48383 121965 299284 -88270 -47332 215374 61240 153313 -103849 23404
5483 -284969 -195069 81050 -25432 159518 -51779 -144041 113611 90565 -171574 27047 242788
5472 242788 36302 -63504 72098 -158051 -34847 -139355 -4819 -93505 54433 -218107 -128159
5461 -128159 176117 86183 -219631 55531 -310497 191252 -131307 -81937 -83325 -6316 -70386
5450 -70386 170472 210137 -85105 -58424 -136547 -99619 -17625 75624 135877 -60597 9856 -181266
5437 72089 -91527 -521486 32250 196619 147088 -178798 38370 177577 -336482 80743 244958
5426 244958 -192103 -130219 121156 -79273 -95480 -1477 8041 -373562 -61127 8585 31113 -132135
5413 174781 117283 324717 46447 102060 -96102 209975 110330 133463 -86988 89133 240992
5402 240992 -324989 -174302 -15027 16812 60555 366371 -21081 196345 6038 -36884 56845
5390 30990 121352 53669 12953 -116553 267486 189219 -56700 -109131 -76911 -228947 -114446
5378 -37305 -41639 -167913 -200414 42724 108147 126575 61256 111870 5627 131633 32577 -330682
5365 210453 300077 -63105 399723 462115 -58022 190615 173744 -120255 -112926 -61815 94874
5353 -101706 -29297 241096 41522 125555 -383454 371865 -84253 65110 561996 60541 85424
5342 85424 445261 103652 -10679 89803 99456 -238999 -124075 -47464 -231273 92288 -17678
5330 -41249 -17128 -456195 163927 -142804 -113673 64372 -570 55354 56134 -21731 436563 187817
5317 363932 -94380 137789 84408 -34898 796 161240 210252 48978 4177 -133378 -40023 -37219
5305 -37219 -240038 169778 -79893 16673 -102383 171250 79930 -366843 -241227 73681 -219788
5293 160089 -123266 -215664 252911 -130586 -96388 -124558 42118 88359 80799 -437534 159190
5281 24306 194735 92551 -284741 -175067 -345609 196543 212884 -69266 -295342 15817 220907
5270 220907 39756 95841 -170815 -51796 86477 58022 41389 -7872 154735 144070 153663 -61024
5257 -96761 -23918 -104026 380562 -124274 67376 315696 118848 -87283 204839 -72004 -136595
5246 -136595 84005 33461 267277 -5495 34055 -159917 185434 -32897 99693 13265 -516232
5234 325298 -297809 -301031 -117105 177135 -45119 -25595 -43974 -244150 28762 -39754 -155004
5223 -155004 -307875 71836 -193674 -45451 62218 86352 -98669 29095 -252076 -51201 -222737
5212 -222737 161337 -353253 155818 34215 -72364 201589 -152412 109221 -13432 -19056 210462
5200 61843 -145546 -130021 36004 92397 138574 -143424 -64549 -32479 -150347 90219 -166627
5188 169749 207372 -32327 12944 35591 75995 39709 -11052 -82718 -65968 -254425 216578
5176 -131106 -21000 99523 265746 -18534 87986 -205557 227574 -177354 68651 247724 101678
5164 3917 21982 17345 -41752 308481 326308 -213821 26415 187830 30026 -30521 92295 -144776
5151 241543 -59571 118673 125786 273466 -374302 -225396 -18153 171317 -166845 237487
5140 264126 -34994 209610 -264422 539256 -83927 30593 102945 185442 21500 142744 -13176
5128 -129747 -212904 -155136 -5922 -49521 85606 -17420 103271 -210573 189695 76991 -178041
5116 -70018 266058 306553 111479 110548 -133376 -286387 -72395 154354 3273 -269392 -217185
5105 -217185 123814 143651 -180375 -110751 -133032 -179934 295395 32548 -44466 -134314 145315
5093 36102 270325 204592 -169304 -251086 -192326 -108675 102996 281582 -160105 -151851 111356
5081 -79173 42443 -36487 125525 -59348 60744 -142814 -239836 87677 16688 46342 317534
5070 317534 36401 55765 -87683 -291387 -321440 -179719 101871 -62357 83811 41995 348411
5059 348411 150664 277423 -305191 245882 2133 147023 135701 212389 34483 246117 -10944
5047 191330 -179791 -216571 -148444 -4084 -112795 -212933 37884 84131 221008 19465 18601
5036 18601 146601 142302 85967 147192 -51158 -161252 -325289 -101850 -13913 78523 147956
5025 147956 -17716 -33804 -20072 215209 -98373 114314 -56434 39892 133797 -193811 -180943
5014 -180943 -27673 261553 -210766 -187486 -195996 -9263 84799 375140 277494 33301 28550 -224184
5001 202731 166654 -173105 -107808 -123314 12963 -29059 -306642 -3175 -279792 54723 -246545
4989 -32396 214896 309527 78802 -244558 -271524 42885 -240731 -73677 206909 -222712 -185088
4978 -185088 -156879 19255 4867 -166115 245656 181022 -70136 -211201 42445 147595 -229522
4966 229360 73322 -22535 -193493 5393 -64807 -144888 235486 -94619 206701 -422601 236496
4954 266024 52425 -38631 -47622 -47520 -230485 -113122 138219 -13897 207157 73890 -62506
4942 106939 37000 -126009 38687 88375 -130675 -149602 -48184 77661 105215 160856 85660
4931 85660 -1918 155219 103520 212473 18078 -79706 55655 97130 123149 156853 -41817 44361
4918 306101 55948 -34181 326955 201900 -155790 -390252 -121267 178505 355853 -39526
4907 134793 105233 -272524 79737 8549 366493 -216634 28601 115930 -235646 170243 -52835
4895 -184800 -351777 115314 -144946 -134158 -38295 400018 -176727 133334 -95675 236795
4884 116691 25167 -27647 64319 54601 115215 167099 204564 234473 60937 32119 6146 -20924
4871 218809 152648 -134057 -139713 45417 -142360 260912 -211243 200 -44708 33875 -262696
4859 -5888 247526 -27661 -83842 -126025 -41422 -216359 39561 15001 -115904 30221 301200
4848 301200 220458 -20930 -42259 36106 257206 166749 7210 500220 -92313 193300 -11581
4836 324077 -29162 35957 -55510 45919 80055 -384408 -106041 -44707 149635 155584 -296506
4824 -217271 -113736 -279449 -281057 129574 63120 -272763 -4033 -99019 76415 -123976 -144457
4813 -144457 -271172 117518 116136 -118740 -144728 -13947 13292 66154 11041 196602 -138711
4801 42665 -164948 132448 232157 -19811 -254580 -5828 61742 48039 47132 199706 -60622 165341
4788 -5285 23013 -5534 -188610 262798 -142864 21166 -89864 -188842 -25601 -57146 14499 45861
4776 45861 -122204 168929 -38536 -184346 49738 201734 188467 -250325 -286232 197512 25622
4764 -141436 193019 -160942 133137 -65777 90131 -256458 25236 69758 282669 102102
4753 -165694 186609 113022 -275488 550627 -107839 129534 -142287 -107472 74064 -80514
4742 -53478 -4203 97589 -35886 -35418 -159633 100723 -80514 113275 -9314 226853 115603 194691
4730 194691 263901 -252789 2962 145862 -61561 35094 138470 16825 229823 -146285 -284337
4719 -284337 70497 -348844 -316174 -98319 -189944 20243 -310292 -28754 38188 -16308 314935
4707 174316 -41432 136849 74751 -74938 -399 -16772 -16806 -70668 369541 -65168 80021 67208
4695 67208 154320 198773 -74702 271676 168892 118248 202601 -170485 55934 17703 133849
4684 133849 -27725 -86502 40777 -225851 -413798 -11586 520139 -53018 -36243 253640 -3900
4672 363013 -154519 -368514 -134844 -32141 -242608 121971 -120264 291139 -413383 58244
4661 198715 -295407 -289724 96048 127346 -244374 -255121 -117531 299353 56634 -184692 -203084
4650 -203084 92968 -142610 174194 302427 -8854 234938 -324817 177037 -82062 -33688 133118
4638 61743 553025 -25614 52936 274784 140134 80295 219552 20498 167049 52118 -128663
4626 -80400 206321 -167476 -481117 -42307 112354 275264 36697 -128571 144339 169709
4616 169709 90336 146233 25657 88012 25124 -25063 -246934 195386 -28435 -203319 116817
4604 215042 135652 -328642 -116068 88933 183516 123253 201421 89303 -207123 -159854 -59799
4592 228531 198862 172471 -251406 263520 195740 -282344 161193 -72138 158252 74914 -12367
4580 216493 216962 -166844 -99113 -197322 36097 -33635 -82166 -83685 51199 67558 -97366 39233
4567 180401 -176536 197371 -402278 -261979 7786 327526 225230 121048 135320 12718
4556 11367 -213393 -22120 218116 150097 -174711 -172798 40754 -61111 -25862 59924 -63995
4544 -1354 17078 354158 97626 -275203 -282445 -17114 9131 -124930 -1751 -7438 238292 214937
4532 214937 -39189 -79605 -121548 166862 -201223 86634 118996 -74551 -35003 -70325 271092
4520 -15479 -8808 9015 -168172 57493 -159084 211959 229865 -4757 118246 -46646 -211498
4509 -211498 -14379 293962 -22703 -248314 53917 65927 535029 54151 -70600 56957 -532646
4497 -265538 144680 -259663 56948 207056 155614 -29576 15963 159180 25850 54508 -115904
4485 303927 126258 -89310 346515 47354 187618 212550 61130 -173130 258354 -153501
4474 150020 33811 -271599 -248568 -131078 388441 -82074 12556 -286877 118455 40452 -53932
$$ [...]
##END NTUPLES=NMR SPECTRUM
##END=
