
##TITLE=AC1266_CTIAH12084_6642311_Rj1SJilo9T
##JCAMPDX= 6.0         $$ Bruker NMR JCAMP-DX V2.0
##DATA TYPE= NMR SPECTRUM
##DATA CLASS= NTUPLES
##ORIGIN= BRUKER
##OWNER= Administrator
$$ 1.72 TOPSPIN		Version 2.1
$$ 2012-08-08 18:06:55.562 -0500  Administrator@TOPSPIN
$$ Compression mode = diff/dup
##.OBSERVE FREQUENCY= 400.02188249412
##.OBSERVE NUCLEUS= ^1H
##.ACQUISITION MODE= SIMULTANEOUS (DQD)
##.ACQUISITION SCHEME= undefined
##.AVERAGES= 8
##.DIGITISER RES= 22
##SPECTROMETER/DATA SYSTEM= spect
##.PULSE SEQUENCE= zg30
##.SOLVENT NAME= COFFEE_meoh
##.SHIFT REFERENCE= INTERNAL, COFFEE_meoh, 1, 14.98509
##AUDIT TRAIL= $$ (NUMBER, WHEN, WHO, WHERE, PROCESS, VERSION, WHAT)
$$ ##TITLE= Audit trail, TOPSPIN		Version 2.1
$$ ##JCAMPDX= 5.01
$$ ##ORIGIN= Bruker BioSpin GmbH
$$ ##OWNER= Administrator
$$ $$ C:\Bruker\TOPSPIN/data/COFFEE/nmr/AC1266_CTIAH12084_6642311_Rj1SJilo9T/10/pdata/1/auditp.txt
$$ ##AUDIT TRAIL=  $$ (NUMBER, WHEN, WHO, WHERE, PROCESS, VERSION, WHAT)
(   1,<2012-08-08 18:06:48.828 -0500>,<Administrator>,<TOPSPIN>,<go>,<TOPSPIN 2.1>,
      <created by zg
	started at 2012-08-08 18:05:42.312 -0500,
	POWCHK enabled, PULCHK disabled,
       configuration hash MD5:
       6B 1B 68 BB D9 2E 58 E2 7F 35 AD 54 07 DF 0E 41
       data hash MD5: 64K
       42 FD 68 0D 56 90 1B C0 D2 D1 12 61 AB 68 62 C0>)
(   2,<2012-08-08 18:06:51.406 -0500>,<Administrator>,<TOPSPIN>,<proc1d>,<TOPSPIN 2.1>,
      <Start of raw data processing
       efp LB = 0 FT_mod = 6 PKNL = 1 PHC0 = 0 PHC1 = 0 SI = 32K 
       data hash MD5: 32K
       8F 44 86 08 37 40 19 8B 49 AC 2F 36 CE 13 50 E3>)
(   3,<2012-08-08 18:06:51.828 -0500>,<Administrator>,<TOPSPIN>,<proc1d>,<TOPSPIN 2.1>,
      <pk PHC0 = 174.809 PHC1 = 0 
       data hash MD5: 32K
       7C 03 D4 65 E5 C3 EE 6A 87 C1 7F 55 E0 08 F1 E9>)
(   4,<2012-08-08 18:06:51.968 -0500>,<Administrator>,<TOPSPIN>,<proc1d>,<TOPSPIN 2.1>,
      <abs ABSG = 1 
       data hash MD5: 32K
       D5 51 76 F4 C4 8B E1 7B 41 34 94 94 D1 53 30 71>)
(   5,<2012-08-08 18:06:52.015 -0500>,<Administrator>,<TOPSPIN>,<proc1d>,<TOPSPIN 2.1>,
      <abs ABSG = 2 
       data hash MD5: 32K
       3F F9 1E A5 C0 0E 38 90 A8 AF B2 00 7F F2 E7 AA>)
(   6,<2012-08-08 18:06:52.031 -0500>,<Administrator>,<TOPSPIN>,<proc1d>,<TOPSPIN 2.1>,
      <abs ABSG = 3 
       data hash MD5: 32K
       C0 4C EF 02 45 DF B1 D6 12 40 72 1D FB 36 5C 5A>)
(   7,<2012-08-08 18:06:52.062 -0500>,<Administrator>,<TOPSPIN>,<proc1d>,<TOPSPIN 2.1>,
      <abs ABSG = 4 
       data hash MD5: 32K
       B7 EC 1B 70 6C 26 56 E8 80 EA DD DE 49 69 7A DC>)
(   8,<2012-08-08 18:06:52.093 -0500>,<Administrator>,<TOPSPIN>,<proc1d>,<TOPSPIN 2.1>,
      <abs ABSG = 5 
       data hash MD5: 32K
       A6 C6 ED 18 99 1D C8 38 C0 F1 36 B4 D0 4C 52 9E>)
$$ ##END=
$$ 
$$ $$ hash MD5
$$ $$ F2 E9 B2 CF 9B 9C 90 7B CE 46 59 63 65 5C 8E C9
##$RELAX= 
##$RELAX= 
##$RELAX= 
##$RELAX= 
##$RELAX= 
##$RELAX= 
##$RELAX= 
$$ Bruker specific parameters
$$ --------------------------
$$ [...]
##$TP= (0..7)
150 150 150 150 150 150 150 150
##$TP07= 0
##$TPNAME0= <>
##$TPNAME1= <>
##$TPNAME2= <>
##$TPNAME3= <>
##$TPNAME4= <>
##$TPNAME5= <>
##$TPNAME6= <>
##$TPNAME7= <>
##$TPOAL= (0..7)
0.5 0.5 0.5 0.5 0.5 0.5 0.5 0.5
##$TPOFFS= (0..7)
0 0 0 0 0 0 0 0
##$TUNHIN= 0
##$TUNHOUT= 0
##$TUNXOUT= 0
##$USERA1= <user>
##$USERA2= <user>
##$USERA3= <user>
##$USERA4= <user>
##$USERA5= <user>
##$V9= 5
##$VALIST= <valist>
##$VCLIST= <CCCCCCCCCCCCCCC>
##$VD= 0
##$VDLIST= <DDDDDDDDDDDDDDD>
##$VPLIST= <PPPPPPPPPPPPPPP>
##$VTLIST= <TTTTTTTTTTTTTTT>
##$WBST= 1024
##$WBSW= 4
##$XGAIN= (0..3)
0 0 0 0
##$XL= 0
##$YL= 0
##$YMAX_a= 468558
##$YMIN_a= -608492
##$ZGOPTNS= <>
##$ZL1= 120
##$ZL2= 120
##$ZL3= 120
##$ZL4= 120
##$ABSF1= 14.98509
##$ABSF2= -5.573092
##$ABSG= 5
##$ABSL= 3
##$ALPHA= 0
##$AQORDER= 0
##$ASSFAC= 0
##$ASSFACI= 0
##$ASSFACX= 0
##$ASSWID= 0
##$AUNMP= <proc_prof1d_extract_pilot.lims>
##$AXLEFT= 0
##$AXNAME= <>
##$AXNUC= <1H>
##$AXRIGHT= 0
##$AXTYPE= 0
##$AXUNIT= <>
##$AZFE= 0.1
##$AZFW= 0.1
##$BCFW= 0
##$BC_mod= 0
##$BYTORDP= 0
##$COROFFS= 0
##$CY= 15
##$DATMOD= 1
##$DC= 0
##$DFILT= <>
##$DTYPP= 0
##$F1P= 0
##$F2P= 0
##$FCOR= 0.5
##$FTSIZE= 32768
##$FT_mod= 6
##$GAMMA= 0
##$GB= 0
##$INTBC= 1
##$INTSCL= 1
##$ISEN= 128
##$LB= 0
##$LEV0= 0
##$LPBIN= 0
##$MAXI= 10000
##$MC2= 0
##$MEAN= 0
##$ME_mod= 0
##$MI= 0
##$NCOEF= 0
##$NC_proc= -8
##$NLEV= 6
##$NOISF1= 0
##$NOISF2= 0
##$NSP= 0
##$NTH_PI= 0
##$NZP= 0
##$OFFSET= 14.98509
##$PC= 1
##$PHC0= 174.809
##$PHC1= 0
##$PH_mod= 1
##$PKNL= yes
##$PPARMOD= 0
##$PPDIAG= 0
##$PPIPTYP= 0
##$PPMPNUM= 2147483647
##$PPRESOL= 1
##$PSCAL= 4
##$PSIGN= 0
##$PYNMP= <proc.py>
##$REVERSE= no
##$SF= 400.02
##$SI= 32768
##$SIGF1= 0
##$SIGF2= 0
##$SINO= 400
##$SIOLD= 32768
##$SPECTYP= <>
##$SREGLST= <1H.CDCl3>
##$SSB= 0
##$STSI= 32768
##$STSR= 0
##$SW_p= 8223.68421052631
##$SYMM= 0
##$S_DEV= 0
##$TDeff= 65536
##$TDoff= 0
##$TI= <>
##$TILT= no
##$TM1= 0
##$TM2= 0
##$TOPLEV= 0
##$USERP1= <user>
##$USERP2= <user>
##$USERP3= <user>
##$USERP4= <user>
##$USERP5= <user>
##$WDW= 1
##$XDIM= 32768
##$YMAX_p= 447803032
##$YMIN_p= -660931
##$CURPLOT= <Network HP LaserJet P1505>
##$CURPRIN= <$Network HP LaserJet P1505>
##$DFORMAT= <normdp>
##$LAYOUT= <+/1D_H.xwp>
##$LFORMAT= <normlp>
##$PFORMAT= <normpl>
##$SURQMSG= 1
$$ End of Bruker specific parameters
$$ ---------------------------------
##NTUPLES= NMR SPECTRUM
##VAR_NAME=  FREQUENCY,     SPECTRUM/REAL,   SPECTRUM/IMAG
##SYMBOL=    X,             R,               I
##VAR_TYPE=  INDEPENDENT,   DEPENDENT,       DEPENDENT
##VAR_FORM=  AFFN,          ASDF,            ASDF
##VAR_DIM=   32768,         32768,           32768
##UNITS=     HZ,            ARBITRARY UNITS, ARBITRARY UNITS
##FACTOR=    0.250966925370066, 1,           1
##FIRST=     8223.43324360094, -152875,      -42131
##LAST=      0,             50445,           248204
##MIN=       0,             -660931,         0
##MAX=       8223.43324360094, 447803032,    0
$$ Real data points
##PAGE= N=1
##DATA TABLE= (X++(R..R)), XYDATA
$$ [...]
23782 158145 -316343 -211032 -161394 146163 35973 -68049 -113430 -217946 -96881 21949 -33005
23770 -82412 -4491 269620 3819 126825 35878 13259 249206 226096 -51816 -54763 -13830 -131467
23758 -131467 -176411 132711 85749 -15948 325006 141255 163799 89099 170961 -38056 284152
23746 10796 57556 148212 -53804 375083 -181213 211150 301762 79810 -177119 131258 -24171
23734 233741 -119197 160224 -4077 -25733 82734 208339 -16119 -56950 332618 4249 148151
23723 148151 -140681 -86246 -126022 146579 9896 -5500 -169384 27008 -65518 -181492 204571
23711 68282 -187855 -108280 -193170 -19602 11223 18734 137095 7589 -135574 395547 -39302
23699 187450 85919 81017 -48956 -90083 -248013 245262 106638 -78117 140504 31415 224428
23688 224428 20045 -223039 -141688 149064 -70296 4424 -401065 16132 20062 -163967 -92872
23677 -92872 -66770 -117139 -144015 -343866 -213239 -103420 -392847 359542 -97559 -75578 11591
23665 -252954 175466 177140 -13358 130279 -67465 27247 -180809 -259841 132186 86090 -128327
23653 44829 241307 -78104 -160464 193029 216291 160767 128512 -72761 405 -322870 141425
23641 -163052 24476 -226104 -423713 -17204 -132275 -91959 -5265 -78481 -400288 -56930 184371
23629 -346868 158352 -81347 40269 -360516 -244164 -141783 -224051 -308045 194511 -163158
23618 -219858 253205 30600 141913 -183422 52522 8475 260197 181004 144348 63985 -120214
23606 -33464 81811 -213 205982 -64099 114363 -326918 -14824 67351 -198818 234359 54179
23594 279477 354119 270497 -53243 464484 44868 144425 145944 179981 40785 90748 -90350
23582 64797 -139651 -100693 171010 -163763 -238357 -118863 -46161 -321165 -216112 -77706
23571 -223801 37715 66647 -265762 -37650 552193 70105 -127634 -340745 219043 157153
23561 157153 211870 103268 90349 29785 168272 137541 113663 139796 -108050 -23679 52555
23549 -144369 -175011 31069 -8740 219709 -28871 -220265 -168824 96837 -345948 5521 -228584
23537 -59891 168254 -166832 -253777 383465 160669 -184355 -343648 257673 -227953 4912
23526 -72964 -194873 461041 180609 145848 32416 -262248 -113072 186428 78452 -10229
23515 -110880 106879 170595 -45375 67328 46781 -612593 -199778 -211757 -40883 -18236 -6480
23503 -113173 -52885 85514 122706 -206822 65341 -41997 52558 -52482 203064 -279895 -151429
23492 -151429 -45603 86505 -136233 80461 56259 -93116 59241 -21766 209867 115169 293400
23481 293400 343547 -82955 -115346 -202351 112818 -289503 31341 77170 41932 -120039 87102
23469 -81483 -174054 35589 -69471 -118554 -57097 56091 198640 -127105 171557 -49456 159553
23457 -39873 17784 -59961 92388 -93954 117226 -206211 9083 26863 -64131 398159 -214918
23445 -244432 -36554 282777 -17334 171738 -165456 1498 -4954 -212688 164371 -137606 63143
23433 -146095 322876 18373 -308514 -119342 -55863 100686 -102293 -10235 144819 -380174
23422 -338789 -205007 -436327 97087 -35513 -161131 -230607 261267 65287 73184 364219 17252
23410 -301003 -106074 515681 -63725 108135 -138395 -62964 -47404 315038 -49184 108847
23399 -16147 -73897 -367031 170769 -433905 194869 -62058 -69029 -89323 78768 -251612 28546
23387 -291211 -13535 -120729 -136217 -146653 174899 -89027 -211405 72034 -179108 33077 -22086
23375 -85199 -230737 -139455 -117732 -243859 18094 -96970 -133113 49905 43548 267168 35320
23363 -205710 -158118 86223 62624 -29248 166043 -4413 -34694 55508 -43771 -38719 -28835 82572
23350 19524 152046 -153135 198369 -69699 159819 145544 209667 -9401 -168759 249724 -295427
23338 -231257 -273774 82308 -50319 -68663 -217918 129065 -558812 58281 271061 78441 100144
23327 100144 -225824 -47586 51582 173732 217573 -128024 -181188 -148843 8369 -127692 -55758
23315 -262974 -13601 -410840 -43885 218939 11961 -37439 -293202 121891 42577 76130 240907
23304 240907 -292264 -284689 -116529 8648 104990 -247005 84986 143987 -2933 181908 -76200
23292 -249742 -199028 -74782 114859 223043 42300 -223251 230468 -247247 -29244 773 99231
23281 99231 -209720 -4735 -235338 -267724 -70771 -312691 -396750 -8898 -269156 -183479 24119
23269 -293155 -132 -184590 -226008 193876 77103 194828 -93390 69256 240599 28296 -299948
23257 -173461 59687 4201 -109157 272129 -290438 45393 -209174 -32066 155956 46084 -207729
23245 258974 -5821 46248 -136089 133846 -255218 -36127 -29957 -109151 -198436 -159651 -266399
23234 -266399 -239763 2733 -69331 -2391 186622 -438109 -67495 48729 -2748 43171 -189652
23222 270307 19231 -107474 -182326 -199873 204716 162457 88132 153201 -68504 64801 -120337
23210 -284667 203934 180688 -68878 1322 126685 -140400 142150 -490439 23740 134473
23200 134473 -52020 226502 -29175 -170321 -77078 -69426 230899 28524 -32196 208060 -41230
23188 -270525 154317 163745 28445 -118648 -188528 161872 -89798 -40080 169473 -365737 -51745
23176 -317614 160077 59368 229158 -175277 209298 169586 80411 20218 -134372 -476649
23166 -476649 -289269 -285503 92810 14452 -182383 -120119 -41951 -71210 -94363 145476 -48084
23154 34736 -279125 15511 -61144 -160420 66649 108275 31414 72540 -138559 -171085 97792
23142 -4217 63258 56423 -171832 -252127 -23490 141014 13793 105525 -87398 -63514 129418
23130 -75345 217176 352386 239163 258376 -152943 10808 197383 50030 135331 260099
23120 260099 -260760 201933 237591 296185 -271293 -70437 -50699 115438 322341 -111281
23109 117429 259155 -118442 -185046 76212 97157 -226332 -23429 367403 -331845 143000
23098 49717 201878 -37453 116982 196417 420062 157443 44070 86068 37653 16266 231897
23087 231897 -311381 56239 -212526 95317 -35850 73536 85568 -80216 -85531 -89513 -4129 -241371
23075 -241371 -244764 44449 83629 -75656 214237 -244203 276735 -87160 -306716 -131686 -55792
23063 -26808 117347 264068 -140848 -50479 -12740 -251150 182490 200029 223346 289787 -122491
23051 -29625 146651 268462 -96700 326223 130091 54961 -195848 141903 197838 46470
23040 98936 129851 -89391 152942 214734 -15102 -49919 139472 -22861 94948 -72049 -367049
23029 -367049 5540 409308 152125 96076 83831 38212 -163282 -172659 2403 36849 -117441
23017 102496 29827 -153223 -26522 -4759 5137 -262038 -155920 -25619 -36855 236863 89355
23005 -159423 -142874 -79483 79565 -2379 -173072 -9805 94287 -5150 66259 -202797 9471 -12657
22992 97858 -26619 -62628 -82251 -19243 -25767 -183041 -280915 27881 -89701 -152669 -75385 -189501
22980 -189501 -60641 -92634 54490 69691 202014 90640 79199 -120819 -199749 -84849 146390
22968 -167091 -126448 -256722 -58917 -115872 -71653 -164091 -35026 -344458 -227711 -166674 -69645
22956 184675 -220136 193920 174945 222942 -7069 -71236 51349 57683 -192623 -52914 124106
22944 -150647 90177 -78566 -182024 -46157 -94606 8311 103371 -122999 -23779 -341105 8830
22932 11782 39947 -45289 -44893 -453539 83823 -114605 -315536 -460590 138781 -185108 152782
22920 -132319 -76066 -168951 5808 -165101 138415 231994 162186 33647 190770 -190590 -151446
22909 -151446 -506485 15236 227319 48511 -209161 -59913 -14224 -69113 295284 -152637
22898 176356 -333872 136450 -43337 242283 324704 -346521 -26549 -50863 -159461 249235
22887 63338 -139290 173581 19039 114429 317186 34874 -120464 -84990 241055 49731 -222026
22875 -347068 -107606 -485145 112516 7667 -75671 10073 -151010 60721 146192 -143692 -105001
22864 -105001 79298 45879 -159665 89659 -147193 -20686 316865 -54085 -159108 -277816
22854 -277816 -197513 -154808 -225620 156241 193063 -345555 -31104 62770 -151002 -305529 -226793
22843 -226793 -234431 229292 47454 222242 75754 -338981 335721 229106 -23416 183507
22832 -154536 -6590 -25952 -234010 163796 -119620 91648 58782 -161889 -108446 123641 -241281
22820 -122034 -80030 172273 -160687 -273718 34239 -229684 30480 -200655 317507 31712
22809 328713 -95214 31667 -302704 -238570 61708 -108113 -87321 -157762 -327969 3789 371809
22798 371809 -20898 -32486 301568 -89490 171674 50348 -222936 48489 -138970 -250713
22788 -250713 -242801 -102792 871 -102969 -58979 38594 -25416 -183573 39133 -26799 -115341
22777 -115341 -27988 158335 -46073 -279582 131354 41785 78464 55661 54653 233631 72428
22765 -115954 -26775 -191144 118748 28788 97465 421335 -141136 -84295 73684 -58533 -202099
22754 -202099 118905 -34968 95414 -77302 -385909 287592 -203487 42930 -67928 -181243
22744 -181243 -107945 55305 -280841 -106303 47893 47634 122803 -110755 238149 -37816 -130958
22733 -130958 246813 42783 -253163 -132673 60837 -37459 92769 -274205 -200069 -121822 -143339
22722 -143339 186588 30769 -186170 219672 -20828 -84688 -283952 195103 -138366 97979
22711 51790 -184810 -58965 -192236 -330807 45064 -317656 -201095 -373387 -21206 -171020
22701 -171020 -129721 -100206 -143586 86425 -303977 176876 -18767 -32962 -99618 38702 -176156
22689 -84569 -108812 -147889 -25339 252194 33033 67312 -161260 226562 182087 28043 73899
22678 73899 89917 109964 221418 -200129 49051 -119146 120178 -274880 2271 107324 63734
22667 63734 317605 -63165 -330870 14953 33944 245922 -50610 -144786 -10800 6910 79990
22656 79990 -233844 76780 -59810 -299981 -225402 -313113 64174 116362 -76484 -310755 148162
22644 60209 -291201 185186 373033 -84498 -153505 -169664 227511 -258468 25768 -154405
22633 -122447 122653 -28712 80336 -139949 -344190 -174042 -184429 50601 38331 -232316
22622 -118062 -43726 -162981 223827 -65659 270814 137986 219586 130186 134798 125433 -185121
22610 -217366 -77102 -377817 -172077 52807 37472 -312953 83460 73046 9505 205400 150985
22599 150985 48116 153255 259395 85645 -138986 -68462 -53349 -89959 -152046 -12 101049
22587 -536055 -23506 329397 101648 -235236 -42785 254286 -148991 -31291 -261249 -34138
22576 149207 -4439 -272430 74159 -159364 -264579 131298 -125067 89835 -255903 29648
22565 191574 -179865 279363 180244 -64915 126470 57444 141296 46268 -144550 -170067 17156
22553 -127050 112157 -241131 -5427 -94635 220051 -82927 -210156 -54395 64886 -77834 -146265
22542 -146265 12129 140708 2865 41654 -53439 276179 -281877 68734 -140466 402391 35180
22530 118881 -192109 -81386 -48987 -186072 -80356 -7802 263056 221184 202705 294120 -25652
22518 -216977 -41913 85745 -190029 102426 -38119 -265928 -33808 -313180 195660 -196585
22507 -160491 -16664 -304300 -133628 -4648 -91871 -65184 5490 75314 99625 -269906 119884
22495 -55700 350617 109400 -38908 105742 5509 -171584 -229888 -3211 -16209 22820 -123702
22483 -41151 -6510 79372 -104891 -41977 -44716 -266922 67395 252722 2144 -83241 -90673 103174
22470 214668 -81416 -57256 -117946 30113 -143296 -87917 -139047 -184679 -8402 -214588 40383
22458 -287918 -68438 114947 -95761 -183454 -2906 -168109 104360 -167060 -150346 -54323 -325930
22447 -325930 -77528 19361 -167947 70204 212879 -37876 5381 37731 -117503 -57271 -385112
22436 -385112 -41001 -120601 -214340 -51897 -68395 -554707 -151872 -113380 9969 -81865 121028
22424 182454 222214 287011 -77512 -186013 -78302 105207 93780 -131563 -67001 -148088 51913
22412 -19623 34557 -63180 317994 -133812 126948 -3599 187653 68030 25964 -102849 32772
22400 185571 36837 -11793 247234 -50981 212135 -26794 -374825 -164866 -35666 -551225
22390 -551225 296693 -252246 -226659 262043 -85965 94364 -311265 -18259 -205254 -82762
22379 125138 -226721 -113349 147659 33042 -97964 196691 190277 169720 -78931 136499 154995
22368 154995 -304954 -189439 20528 -117243 164042 -49678 265706 183191 135464 -253112
22357 -138326 -182637 92024 -235192 185158 -107897 -263959 -181732 -311208 -7779 -90854 230123
22345 212002 11030 -428659 -111317 -399116 -15035 -139627 84194 -127125 -171107 189599
22334 -55025 -40385 -220249 -125031 171723 -91272 54306 -43984 23802 288176 -105318 -22611
22322 93637 -132 3623 319762 99397 67635 -134310 235833 -204768 84487 264641 -196413
22310 -100382 -156813 109623 -16151 -159207 -202739 36731 -311785 83692 71287 252205 -102939
22298 -201768 65140 41717 129040 -10572 -330883 93033 174058 -3099 -114947 337369 -111735
22286 -346389 -30266 -5250 51685 -111821 100207 -189670 -191516 412508 -376668 -69670 18990
22274 -177380 155903 -106187 192355 -157759 -97106 115316 115599 46950 105693 -299780 -173628
22263 -173628 -156548 24001 191499 -423676 -244665 -528152 -248368 -28374 222828 172134
22253 172134 -190322 -56099 15146 79091 -104681 65284 -134872 171584 -287251 -86564
22242 -296382 -226732 201176 95899 485883 -69467 109731 -32669 -224614 178608 -80651
22231 19709 -11637 5416 -370246 -288748 55291 -42124 -164557 -130579 303063 -160497 -120590
22220 -120590 182647 -114463 78768 57195 -408151 -235647 -42461 110821 132208 -7781 70701
22208 -166327 -97665 -52514 202016 10364 150591 158797 -95714 189206 -264462 -350917 -50235
22196 272108 -19240 -136308 -30282 16103 22555 35603 -127174 6261 -114947 -100975 67101
22184 -286581 96365 274948 -21754 -7692 -33290 112595 -98444 -39190 -11091 -78729 -83267
22173 -83267 -81740 -38024 -145866 183294 -161046 -51007 -52099 46223 -230979 90221 79331
22162 79331 228170 -278965 60150 -9726 -192034 -214975 127287 -26735 7270 -314536 56153
22150 -26454 -121470 -253022 -225881 164809 42870 -277252 -189174 142195 -95066 -110350 111177
22138 -116824 102439 -270844 151858 -162573 -220983 -181928 -93440 32903 -158188 -74476
22127 26291 -74201 -75522 -139728 101335 163800 165649 104913 -162402 -235893 97477 -145103
22115 104398 117299 -7294 -199145 -32814 -69815 -51151 -127586 40294 239370 216697 191377
22104 191377 27873 -331572 99106 -56685 99163 140980 128533 -92664 147977 -180107 -219976
22093 -219976 62267 278117 -109393 38186 -209992 -55915 -195032 -321652 -107275 -118129
22083 -118129 71385 110392 43989 -224286 -195 194193 -220223 -318602 -33219 -569635 -106521
22071 -33242 -17027 -29819 -16614 -66271 -28717 127922 -32906 151234 34785 349079 14101
22059 73687 113130 195734 -304276 -74672 -11042 -246282 -160487 77613 -254094 58857 173221
22048 173221 -82536 170043 -104640 -253305 -5440 57165 36468 -66090 195922 102246 -247054
22036 -190825 -226543 -206476 -100156 -68027 -163577 63435 -32030 -110611 -27295 147093 -236790
22024 120495 108648 105367 63743 223610 -225758 -346719 -115047 -24325 -228933 116750
22013 25158 -57875 -100345 -82925 -287692 24523 -81435 7023 -297586 147065 -69405 -150444
22002 -150444 -4486 1675 152132 111270 68259 -197447 29165 -88913 -92904 -209473 114730
21990 129300 -29853 -147773 -206371 -87347 449764 -133374 -126763 -68891 -3625 -122656 -275551
21979 -275551 -141848 -228076 -172637 -40317 52239 -230636 381117 44361 -57437 63642 -397757
21967 116026 221203 -109439 -163755 -3852 208215 37170 105885 -113113 -109400 359001 -243215
21955 -47732 8039 -27842 -33154 94433 8599 43139 277092 -103622 -305376 270585 -282883
21943 -81405 -48556 -60047 -73074 61040 90629 -100676 -255518 -259067 204309 -11907 -145893
21932 -145893 -71802 -16178 -263064 -131363 -240419 -172199 -56363 -81285 112666 164122 124773
21921 124773 57951 -35279 -22994 -57071 -23480 -42161 -382433 -78186 114032 82528 96869
21910 96869 -109363 30346 -53942 -298652 -53641 -199726 150340 -16218 52679 49686 -25218
21898 -79832 -99161 216945 38181 214682 140830 281828 -232682 -102087 -52869 40900 -39132
21886 -160653 -296411 -296798 -189728 177523 -49557 -137976 -114538 -158034 109333 272413 280069
21875 280069 -51702 -242318 -191318 46720 -43905 -76349 143177 -81956 -315792 -156153 176726
21863 25601 -302661 76955 -68992 33029 -170411 -298950 302984 -284091 58234 -222537
21852 -351301 -151578 -56181 120216 -538934 41097 203700 -220569 84358 -189484 -165142
21842 -165142 -28771 148292 158157 -251517 -52266 98762 38385 -32711 -350921 -42560 -161227
21831 -161227 -106867 -234600 -356958 76254 -49410 -165312 -268675 -147637 -276439 -468709
21821 -468709 -72862 -24515 245580 91479 106653 -20148 59514 -188546 -2269 -297841 294571
21809 -90419 82672 -76159 60295 -272303 -251106 -215778 -167228 268930 -14394 13656 -108744
21797 -47203 220432 144807 98000 -15229 -177258 -45138 257209 -323582 111433 -216670
21786 327928 -52040 70213 -402329 -3549 131893 47926 -364417 -18616 -243876 -127643 132184
21774 -301402 280287 -243331 -193244 -55877 167820 132433 -167446 -36033 140561 -87561
21763 136161 -172861 279575 161321 198912 -461985 45240 -204391 -70620 66925 134210
21753 134210 64885 187373 -51775 53934 103302 150332 -26484 126016 -37099 -166051 -100928
21742 -100928 -18977 53155 -128286 -293107 -24547 -193649 40765 -48942 152290 14305 -184354
21730 -159082 -86150 -46470 -122930 -247129 74623 -135030 -94299 18185 -262322 -53468 -246457
21719 -246457 95533 187732 54631 -17225 -67091 84948 54628 203191 -210357 57763 -9517
21707 180473 -1331 116711 285740 -49356 -181039 -73008 -189292 -139534 -173197 314625 191368
21696 191368 -11155 -49113 172552 107089 167077 -171184 -184335 127623 -16492 75165 -45517
21684 103842 -304288 -73717 439705 141247 -239964 -108628 -88993 109692 -219351 -192120
21674 -192120 230053 -57451 -18737 -161226 173105 144394 -91824 -21908 279970 -46076 123783
21662 -207214 1971 -20016 -120933 141410 -248503 -282907 -3594 84465 116219 -117463 -345883
21651 -345883 -213021 402691 186141 -88612 -127598 -270921 276356 -212111 -100435 134264
21640 198828 -135314 -112811 219635 183388 68049 -108070 -215556 -134260 -102665 -261871
21630 -261871 38460 208227 222821 97374 51478 -400183 -235410 -224668 58323 -63572 -152512
21619 -152512 -12319 -69500 -100074 -39140 -39756 -30852 -175854 -255929 312212 -113458 -123567
21608 -123567 16286 -191832 104137 -105562 -25987 88687 18261 -273865 123888 -81740
21597 29099 -135251 -48984 96031 -52737 -94765 -59470 -290004 -188225 -135867 161881 -3719
21585 -67474 312427 232690 -179635 129422 -115881 -142624 -354800 -262560 -48470 -165823
21575 -165823 -185568 -494923 -270317 39402 -241537 -73139 -185645 45931 -12936 84832 -241065
21563 -248969 -381356 26299 -181298 11607 160200 -249956 -68031 -41250 147316 -133922
21552 -59949 -116543 83830 -235251 -52839 -222525 -132837 -39095 92606 -24428 114077 -33743
21540 324188 -206205 -53685 138255 86111 -452738 -274257 -144847 -174238 -606 88702 -148179
21528 -30521 217715 -102991 216548 -113418 -123965 57113 19266 -246281 158999 -21884
21517 7311 97455 -181118 -99758 99441 150999 -85532 -3432 -274159 -241831 343049 -242612
21505 14128 -225324 21569 92889 127634 11449 131050 -26343 221208 188407 -68316 -219381
21494 -219381 71006 -70033 -124788 -88599 -213280 -88369 -104135 185916 257694 -70288 -240270
21483 -240270 151533 -18612 -43738 -272397 -241482 85311 -114945 21201 108088 -256254 -221926
21472 -221926 38887 19248 -146354 -38937 165530 -421713 -64265 156005 -233109 142804
21461 -201283 -43812 65581 -260851 95391 -187765 -22949 39557 7003 -236817 18242 -28584
21449 31279 281890 -113403 -9794 -2201 63872 32558 -225626 19077 87675 25830 239166
21438 239166 501766 290538 237924 327775 145330 62762 -225495 101861 -248650 -96550
21427 -64359 -21530 -45574 -69850 -111403 249676 -182512 44003 -291677 -322341 11755 -92558
21415 -76584 80006 -35230 313082 -144769 -144891 -214346 -80967 -102495 -154964 231342 -188328
21403 72243 -365403 -135482 106076 41106 -47957 -127593 -65583 -378378 231301 152053 -114200
21391 -247103 -8276 -75197 -65733 29272 -207813 245976 -51106 -214154 -29766 -61856 -166447
21380 -166447 -6672 -219751 226410 -159690 -130259 -59556 -61414 62413 41364 -189071 57762
21368 -243317 -10088 -248983 -94155 -154766 -93738 -110265 -111072 14053 -92502 -153759 -80995 -386881
21356 -386881 60003 -9374 -48201 -383119 107588 -15001 -181019 -155383 363274 289031 -208020
21344 149542 -196215 -12604 -57074 -40342 -54105 -111930 -4739 -43694 143668 278092 -4389
21332 56285 -56505 -163300 -660931 175605 -188700 14727 -179831 -262325 -343184 35074 -243043
21320 -24479 -2445 -80587 -225328 -118618 -21224 -48379 136977 -24400 10362 122635 -52332
21308 -315164 82133 -199615 -13242 52198 -170073 155041 -62219 110969 -18455 198920
21297 -945 -99887 -277917 -2645 68114 -126310 -239649 -311202 47206 -276661 126861 179992
21286 179992 -105066 -60541 -251668 -7086 -124577 -305600 -6975 -295239 -137223 -42544 -136682
21275 -136682 109960 -198791 -37817 -183929 29788 54563 -379962 -56284 83478 -248375
21264 -76886 451425 25320 272053 -287022 -213638 75724 -58425 -133895 -129764 -46041 253018
21252 197430 -274236 -64489 52222 -228046 -153085 -214098 -182315 224274 270619 -153799 153161
21240 -44709 -11125 178561 -306104 -183735 188218 -10895 132052 -159411 42122 -6005 -95769
21229 -95769 -143665 223823 -14706 236660 101070 17524 -198661 -574507 -70573 -114790 -350133
21218 -350133 270008 -70103 -140583 -254590 -127869 165583 -205784 5814 -288150 -130593
21207 -150404 -318035 -333636 -86406 -332907 96788 79265 -117427 -217598 133618 162698
21197 162698 51437 45253 -14001 -29323 -94045 131281 -20766 158430 168982 -41898 293395
21185 -271644 281145 -158492 -133879 -84110 -136567 -140549 -94494 -23389 -168819 61371 -182993
21173 -170779 100876 -187416 33974 -407418 -200221 -162380 46516 -178510 72630 -250188
21162 -95212 -403496 275133 -130927 -34587 149396 -171358 -78430 -401211 -413928 96907
21151 -136019 45937 -171596 58128 -49009 -197244 28546 -171543 307911 -293435 -130999
21140 -112388 -42790 24027 -93282 -12116 -195757 -40710 -130470 215184 -203613 -394023 -306671
21129 -306671 -30558 197701 194245 -354803 -288441 -69611 201207 22916 130846 -137128 109903
21117 -5700 471264 -314950 -143241 69646 -39810 214214 -38700 44639 14447 -170229 32524
21105 -124847 110716 -100357 -54132 -48728 11618 9903 -180416 -29799 258271 -136119 210356
21093 -316834 -253843 223676 89146 -102715 -197160 2123 -421945 -214373 -431526 -142989
21082 -58563 246916 10301 35527 453212 -99207 -6806 -191019 -73788 122100 166434 128895
21071 128895 26498 -236107 -124775 73796 -45529 16470 11283 -101586 -51538 -123751 -165088
21060 -165088 -51035 67461 -336756 -153478 317403 -80134 -98064 -24107 -319335 192501
21049 -205028 -23373 58748 -169121 36716 61310 -159803 -72987 -156638 182824 52178 300159
21038 300159 -108921 155442 61506 69833 82874 299682 294541 244080 -8705 -120468 -63229
21027 -63229 75001 -71149 79221 344666 -139211 48109 -32030 -362228 -36583 153178 -141382
21015 -94821 -253937 128644 72330 -204411 133243 -9860 -72812 -224589 263233 519035
21005 519035 130878 250167 432043 86753 33172 245523 -355144 22759 -32819 -146800
20995 -146800 35633 -241599 98806 -106315 -154077 212526 13492 -40037 -194120 -212119 1842
20983 34591 -49078 -357177 -126966 -95088 259317 144583 -201687 -30573 -342088 -114058
20972 66426 -53859 53908 -178320 173313 -20736 78039 -308636 -141113 -103855 -255620 -293306
20961 -293306 -293003 191426 2507 -130558 190286 -108290 -46557 -83385 -111971 -91041 -13024
20949 -413737 -267118 15079 178701 -19077 -143296 63489 20086 380327 165404 257658
20939 257658 -4197 172037 64510 275750 297956 -243423 -115978 1086 53884 60691 -166734
20927 -124044 67488 413778 -19179 -202108 -99864 -294949 185688 -137224 -6561 -9814 -115353
20916 -115353 207419 -58340 28280 -136449 6891 71192 -164148 33482 -237930 -164795 153989
20904 -248576 51680 -196275 -21861 391232 50733 109315 -100681 212449 -16080 -310826
20894 -310826 -23563 -126563 -12655 171321 47881 -98295 -78703 194017 512340 -274082
20883 -137779 -34818 366793 -111462 56160 -159762 7898 66346 243257 174386 41517 31759
20872 31759 -185039 -116969 -309800 74335 -45884 22957 179379 -225853 75624 201875 -317169
20860 -86256 -152942 -34797 88010 17988 -92802 -230270 -363119 177736 -169860 43224 -12172
20848 -139207 49736 -179605 -333758 -130222 -216310 -224753 -195282 37845 20521 -64315 1815
20836 177130 89541 117464 -55993 -7282 -69971 248301 -233370 -244800 -322343 -212589 -66456
20824 12744 -96262 -109845 42437 -199933 38116 -125860 -191961 263268 79649 -238356 -108305
20812 166377 22289 -205283 76491 -117 -12116 106808 106847 -78706 157135 -344 -156485 -144248
20800 -144248 -169705 23135 -6546 -103971 195085 -19501 -79313 -34587 -362722 86156 -18036
20788 -245109 330698 -92453 154663 153809 -96345 -326100 -146324 430637 -95506 -174511 16613
20776 -128623 204083 -201973 -50601 -84072 -52013 -94750 -139459 -49666 88964 -288299 118784
20764 -196187 -3313 -42208 -75875 108145 268626 -245563 -103376 176519 174684 -269465 -54720
20752 -128779 83556 125070 -273875 -39097 -53689 -159090 -124041 -8125 44959 -295646 244596
20740 -246285 -77307 -53019 -51335 -91157 -236226 -184386 -71624 -342906 -176901 -215724 218802
20728 -265007 -30939 -71946 43202 88098 -127367 -112007 -193548 -16096 -181357 -298401 -156373
20717 -156373 242208 -78526 -253576 -123815 -458236 170589 -21220 49597 -124203 266842
20706 -20085 -195327 -153616 -10525 -178504 -117256 211276 -5448 -54800 56207 -90083 -68240
20695 -68240 -288122 136593 -127197 -113797 -99300 -65338 263476 96863 -248280 34962 -25277
20683 141764 -84419 185140 -138851 262307 -266835 -63470 -9053 143613 25224 -299602
20672 2945 -253062 125775 156582 178336 -36563 -240423 -123748 -272055 -293789 -263794 -221393
20661 -221393 224734 16614 -173953 -330733 410304 28281 138667 -141312 -102807 -263950
20651 -263950 215117 -132209 224072 -156016 -242144 -200250 -273611 -154127 -120209 -9819 -56999
20640 -56999 -12949 81458 143710 306772 13466 -197844 -98881 301593 68189 -134266 148748
20628 44423 -390715 -132328 -81732 167962 -198984 39503 -202144 -330433 8049 127254
20618 127254 -182108 -106398 -121893 216565 -53754 196447 207897 -89672 343601 -174445
20607 85208 242366 -126202 -56501 -80861 136043 55778 -134360 264914 86131 184656 145111
20596 145111 -20509 -319467 -49904 -160626 -175804 80306 -125485 -174301 -9682 -350022 -209806
20585 -209806 7279 30865 -340231 63611 196089 159117 -129612 -140510 -78229 122066 74618
20574 74618 -34029 -9289 -104500 -54493 80295 -73728 -299499 -319318 -367097 1883 117236 182797
20562 182797 6667 330442 107715 -248913 165085 -271238 -199296 -256204 -267287 119916
20551 6518 -195024 -51851 28197 -210397 86960 -416550 5203 -144446 -95286 -179267 36939
20539 154504 -75291 -73131 -282180 46793 -150888 -362726 -302016 207017 -178264 -241528 -166032
20528 -166032 140972 -27682 -334148 -192570 185053 220294 184514 -52322 -68069 -61494 -145176
20517 -145176 -321938 -179210 35299 227008 202952 -63488 -29199 -281712 151878 -58288
20506 -134561 -107094 -405614 -364615 120289 -129993 83248 -117484 124383 261650 29477
20495 -58541 19898 40755 36904 26111 -33949 -90129 -166090 -92271 -309814 -247889 -34244 -111832
20483 -111832 82699 -209228 -54795 112890 -95768 14492 -257889 -251434 -280945 -252632 -162254
20472 -162254 -68084 -25024 69753 -37510 347986 -22747 93452 -33136 -203823 394869 -35565
20460 -401534 -256695 29611 -207492 17998 38778 -43464 102661 -95798 67379 -376389 63194
20448 145875 107072 -313487 -308313 165262 -21078 -19194 -85059 -157868 -252070 -274686 53830
20436 -48211 -114509 -82018 1927 -129213 -177309 -173704 -30259 53081 -89980 50446 -46559 -108898
20424 -108898 416160 -80021 69671 70960 -236727 -435552 -73432 176885 -170111 -90486 -143217
20413 -143217 -204774 -114753 -156830 -446639 68634 -60781 -99534 108054 -131636 -228720 -26540
20401 -42474 -12174 281734 -107993 -286165 199172 -272887 -121761 -276222 233175 75964
20390 -79313 -131139 -36687 204558 112410 -73217 -66867 -132053 -113327 94357 -166939 59296
20378 -24198 186931 53660 55820 -288453 -118600 -235757 -166083 68930 24397 152780 20113
20366 -197102 124832 131141 -131429 -415321 36193 203476 -464558 -187797 -18938 191554
20355 128253 -189562 -118196 214053 -142091 95932 20613 18489 24649 -138492 2391 -144891
20343 -9940 -295190 -9062 88766 -174228 39301 32780 88925 -12656 65808 -9027 -226814 -317542
20331 -317542 -107112 182754 -251825 -178950 410929 -199204 -53709 -124965 86579 -59573
20320 355835 -214117 -157953 51512 139325 13248 -59690 -35751 -64667 -254677 -72930 46772
20308 -182831 -198377 40725 31698 71613 128029 -44619 934 -98349 21464 -44791 209042 170174
20296 170174 27919 -51438 -431195 -5811 -223756 -155576 -14464 -27143 -171503 22663 133541
20285 133541 -233298 -59523 -65956 26895 -29852 20790 237070 75442 29273 -21726 29981
20273 96843 -29532 -107620 325005 -276378 87137 199550 -5827 -157284 -43579 -136659 -143242
20262 -143242 -330611 -31488 -162778 -48639 -186988 253095 -202159 115131 -351144 -26675
20251 73557 -299748 -271367 2601 -208404 -107833 124481 -78729 330556 -344964 262224
20240 -153958 101576 -292397 -198985 267514 22480 -157148 50105 105934 302562 -2727 -79957
20229 -79957 -150375 43691 17482 -515641 -314278 82851 -171811 -336426 17360 38757 -77347
20217 -180494 256665 -124194 -341769 202527 -26297 173253 150106 65717 45276 -224904
20206 312671 -71912 190974 62801 -166360 -238153 -301023 106335 -293831 -215997 77271 245425
20195 245425 18559 -53280 174433 -507828 -71536 178582 30310 -120820 -54808 -289948
20185 -289948 -141709 265226 132951 5704 -34698 -273671 21902 -22730 -157485 67439 -140882
20173 70786 -195588 64620 -237579 321706 -261071 246754 14807 187350 412746 29381
20162 6772 60705 -44572 -91401 26293 103090 294186 -118460 87009 -83152 -194174 -52793
20150 126245 41013 -71598 156239 234227 165434 187178 -1450 627213 -248704 43797 -35876
20138 64338 801603 469303 47366 321813 -160194 37081 54162 -47920 -45230 -256024 -142362
20127 -142362 -194654 177458 -87990 272073 -207943 -62556 -236217 -206458 -199795 78752 -39301
20115 -109821 -74751 -2867 -21786 -42944 -330760 -158220 17928 -260532 7937 -312146 -336706
20104 -336706 -231926 -217978 80150 81699 -139201 -21841 -68190 -69532 -398823 73907 123756
20093 123756 131014 -197896 -139681 -263249 -272397 210139 224941 -553982 30710 -58344 221041
20081 -114967 -148890 178178 -229741 54845 145706 41457 169046 -38919 -201265 300465
20070 -111038 32983 52873 180520 182440 -15926 -108112 76246 120913 -53801 -9501 177847
20058 119238 -296329 -138755 -204019 15345 -396583 -59223 24277 -104985 -310245 -133984
20047 -78432 -351356 8394 23468 -257452 -31608 249419 -79555 -11436 144815 360458 99668
20035 -27956 -16447 50269 -243353 86582 -235413 -299846 -140532 47052 12536 -70912 -121095
20024 -121095 99747 -230299 -117771 -272651 -7231 -288544 -14144 77477 -3859 -280902 -52704
20012 137359 -55075 170265 63516 26868 -178315 -240493 60016 -24395 173619 -205152 -33374
20000 83929 -301725 -276288 62025 34591 329726 239369 -81093 -2642 384890 -121585 181436
19988 250959 -267431 121096 -113986 -7713 -10039 84672 -4946 85429 501423 29905 4869
19976 124520 56627 111914 196169 62090 -120131 -43590 35802 -56276 212371 237730 -161212
19964 287997 264972 459383 56166 227 150940 179936 73758 -68459 39094 -55447 143456
19952 72007 57915 136758 -88302 -85715 102283 -327702 -107567 -278973 36260 -77757 46735
19940 -366604 117400 -34638 -157646 -138527 -248764 190877 7735 57277 -256399 110648
19929 26844 -91055 -181656 183964 -143372 -112311 -62885 27915 -99453 -74778 52670 -106573
19917 70216 -380875 82730 -5830 -305773 -581020 15896 -111311 53481 31605 46179 -177420
19905 194882 -372299 -180669 -402282 -347710 -224449 70645 -245073 97434 -330998 -243053
19895 -243053 2467 -116178 373161 -285144 -176728 100179 34872 -139176 76743 -244077
19884 179979 -24463 -75887 195398 80037 34901 -79511 64782 -2072 71122 179148 -438445
19872 146531 73578 -218754 -174713 73903 119738 16580 118303 -347476 82645 82427 -56166
19860 283002 -184996 -129536 178012 246107 -267613 -388367 -72200 -12717 -13711 324953 -290811
19848 -160779 81150 -122521 -222699 873 -73123 -143125 -235518 -120877 128572 43299 -271797
19836 -124602 150316 -162659 -396338 69122 -7663 60897 -44904 -213131 -215325 -310987 -158367
19825 -158367 -97621 196860 140235 -34491 -31554 -22718 -70141 -67464 131800 -85686 -87417 110352
19812 -327734 195283 -290739 138373 -64871 -205083 -45390 -8333 106338 79901 112326 -3690
19800 120005 -144413 -378067 -227295 58678 -98754 -85308 -124306 7178 -208686 133357 -360387
19788 -158306 -25627 -99525 -257492 -82770 -285096 -111589 -424957 -112591 543642 -84257
19777 -245837 -386543 100893 -109041 -108843 253243 647 -176782 -3202 90444 -284736 -204161
19766 -204161 -31585 -203416 289979 -255757 -37139 127932 19921 -346268 -283304 -122262
19755 112643 -107562 298721 153376 113746 -141569 -145374 -61052 -48329 129503 -419913
19744 -471485 20440 142203 -46969 -53124 162201 162964 -225214 63878 55607 61847 334327 219660
19732 219660 36320 60697 104888 107938 392352 472138 419564 205386 -68312 5418 -269683
19720 -446207 -15895 -121390 58095 -2612 89336 -253722 343935 -149167 67020 119563 -38643
19708 275007 -377020 118710 -123269 136085 92715 131802 58181 128592 -69827 262297
19697 -72606 239322 169797 304916 306599 107220 141229 -326902 -112218 137435 -66593 43916
19685 -435142 -59161 -103656 -371219 -87714 232359 27583 -195240 -70659 10631 -204943 48986
19673 79269 -20184 -17867 24358 -84125 -48480 -12523 141943 -12825 -269974 -104616 65846
19661 -63675 -78551 175692 225643 -391804 106091 -6294 127026 35197 94717 26488 -127215
19649 225989 -174801 -350014 59073 -173054 -288854 175058 83191 -196809 9226 -48644
19638 -312893 -172264 -233545 -330050 257522 -216691 -279204 -443942 -223005 -180648 171499
19627 64718 -12501 -128983 -447157 -180097 -61784 -175725 -387955 -103989 -64331 -43462
19617 -43462 224997 -400485 30812 -73750 -124411 285137 -338818 -49274 -309554 379 -189301
19605 -154659 -101139 -235545 -212413 -222004 -232777 226161 49501 83383 167550 -121997 46206
19593 -19121 97739 -87895 -249831 -135909 64824 -313155 -59071 45831 97340 -299837 -187747
19582 -187747 -82230 175777 -142750 23544 -105488 -35415 -323743 -264890 158995 60758
19571 -415122 -235156 75661 -188486 -76745 62528 75725 319151 61486 126433 -185335 203579
19559 21055 112691 40546 257557 -279797 -27550 491814 -132360 -45978 30622 115596 -42160
19547 -269362 -91526 108493 -72873 -24182 -338312 -105009 -80601 268757 -82861 204077
19536 -206626 -104204 -406070 -208697 111839 143522 -67672 -101455 15529 197334 12137
19525 -58635 20816 57854 -240953 -150312 -104777 15467 1623 46835 -59188 64655 -9288 -205102
19513 -205102 87699 6928 -154925 236590 -85605 -346306 74077 -31128 -24781 -44473 267316
19501 -232916 -142416 -165665 75376 -88243 160871 -171488 196611 -291350 165411 57452
19490 -250005 271174 31622 -180194 -249977 53698 298002 15587 -230393 -54614 132070
19479 -608547 -499331 146131 -223014 -60198 -329902 -170508 72791 -38586 -134556 81693
19468 -87243 -453420 78364 193081 -191762 -87742 -239514 -108227 145864 -168811 101259
19457 -61479 62957 12614 -347137 43525 210177 -5745 -371931 -80570 -167190 -20774 -59640
19446 -59640 -185568 36440 168039 -235801 -14571 57550 139882 -513457 5918 -116731 46054
19434 -283395 42844 -69582 146834 -212423 -267746 -138343 -159664 44619 -177193 -433770
19424 -433770 -178137 128949 51664 -109061 54746 -50832 -97175 17208 16998 -226592 -410039
19413 -410039 138164 192073 -134470 10613 -49721 14486 -230475 95452 -216617 -174227 117
19401 -109333 123166 -33723 -198183 -49670 -20013 -200398 -69189 119445 -400522 -176768
19390 -45321 72873 -164346 -112412 -73666 -222691 -2296 121500 -19364 -210556 148729 -33374
19378 -151423 -272974 -260934 2544 -84259 -52988 -26873 -23446 -274065 -100087 -217464 -26954
19366 -404023 -131325 -386872 -55934 -132679 20022 -84533 -128283 -120000 -169957 -127358 180026
19354 14949 -49730 -34462 -127224 121713 117324 -159480 71684 7059 -224 40237 333930 -253932
19341 -252777 335289 74411 -21194 -166763 63501 -160659 -213050 44887 -269963 -157043
19331 -157043 -281787 -98566 -161691 26238 -198683 109887 -51173 -7616 -156878 14844 -159622
19319 174398 -33656 -169486 281911 -234264 -28624 39751 -233359 -122865 -253386 70020
19308 -66768 192261 120816 -85334 -216861 -50816 -208850 248495 -10100 22179 -165354 -40744
19296 13701 -60277 133872 45875 177484 -4934 -115121 -24293 -61800 188169 -31047 -227120
19285 -227120 -94791 -210675 -42775 -144248 -372719 87660 -134556 -15035 -130071 -326701
19275 -326701 -245155 224459 -152450 -103914 -81476 -214634 -169833 327921 -265456 58556
19264 211066 -60057 91840 -145851 -297325 -98687 -87739 -8964 -34396 2735 72243 379278
19253 379278 206279 -145830 -128270 -173622 174977 -76254 -89285 -274053 161632 109807
19243 109807 -65963 -101708 -118544 -102576 -33724 -131987 150263 -340205 75082 -115812 -400188
19232 -400188 -64754 -67159 -54851 75660 233406 2596 135768 -207920 -250703 -52101 39578
19220 274499 -35276 112222 -29984 110713 162030 -244183 -396221 15103 -149782 -145750 -75111
19209 -75111 -20730 -81029 -288527 -114648 39785 -299993 -67459 32126 -42610 258877 23963
19197 -29840 73426 20849 -338199 -206719 283152 50629 -232375 85488 -363942 -14725 -109376
19186 -109376 -78285 -333504 -248091 -140545 -12693 -266668 155400 -138202 -271508 153714
19175 203680 -44494 5104 -162215 -139983 -45632 -274523 134322 -72691 -6771 15285 -48937
19163 -290372 -86074 131927 24792 199032 -98280 -27867 -13791 -101181 70347 -87495 -121190
19152 -121190 -145732 -284287 -47589 182474 -222464 63186 -289889 14523 270089 -27516
19141 -315045 7739 -3309 -321172 -96466 -74431 121065 -311888 137688 -385011 257849 -45660
19129 -425322 -54423 85210 -97379 -27986 284671 -332818 -99913 -56351 6712 71014 122634
19118 122634 -19222 55063 -128441 -197979 34982 -138493 280725 -196635 87979 -199723
19107 -138131 260538 350659 54206 420414 -11162 -311904 206260 -192109 -54214 -174232
19097 -174232 203953 -37455 -262838 -34479 -59045 54797 66459 -81805 126072 -219877 -142165
19086 -142165 -215233 -259304 -16829 -149971 -66535 -215910 148762 22550 -153015 193359
19075 226482 69522 -1753 -160696 -292258 272384 260129 -130740 -316579 -139429 19888
19064 -64459 -94705 -77474 -208992 289379 -56448 -17634 -69389 -144372 106398 43876 -43477
19052 -46006 -391039 -171852 -65255 123425 -97861 -118173 -151877 -173623 249293 108498 -457375
19040 -44986 403434 35373 -289001 -102235 -195028 -351366 196924 -68251 42029 9831 -188427
19028 -189753 228129 -9046 -65923 93190 79314 -16684 -131553 -337927 -56632 87707 499746
19017 499746 -135512 275334 106495 -231651 -259776 119799 -131329 -250037 104247 68293
19007 68293 404494 122667 213935 179754 -209020 67194 234057 -46833 6689 39164 32047
18996 32047 270840 -242394 -1910 -185525 -355826 -39086 -157106 221703 100519 -160665
18985 267064 16315 -28364 -54387 112448 -158104 288048 -160854 219088 36841 -441645
18974 -50685 -27176 -99511 -106154 138774 455074 240381 275475 198077 -153970 108690 -146284
18962 -80189 -40216 -448230 -305170 -205916 -241440 -131566 -76516 -85018 103052 -273184 53330
18950 131822 30704 -243934 13354 58658 -97422 19592 -323878 163550 35089 177085 -39406
18938 300091 -67757 345457 101633 -96688 -120469 -102370 42043 146964 220812 -110187 -371221
18927 -371221 -234890 -251690 -149421 -72400 -221173 -61037 -46979 -151656 -202784 12974 -279865
18915 14206 -18404 -105456 185735 -32960 -108414 -35861 -58698 253986 225963 521561 386020
18904 386020 259443 -78496 -173180 -103314 251193 -68321 84179 52433 -135730 -94750 -185304
18893 -185304 314161 -168000 -74381 -232979 -323837 102604 -6100 122987 267512 310679
18883 310679 -130420 -194148 34146 -148180 31787 149097 -67087 -187317 54307 -130079
18872 160260 -120720 130937 -275123 139027 124506 -50753 80719 3830 291529 -6438 163234
18860 145370 69820 117314 69792 -156441 -164480 159418 44669 -99914 155636 23758 -34977
18848 107339 -160089 328853 200535 20574 -131159 153294 396037 -173693 147859 -26538
18837 -70769 -205396 -256032 -114100 37223 53089 -229481 85420 207111 4191 47561 -210492
18825 -139673 68546 181722 -166342 -382658 -266114 -77529 152813 130385 31118 17069
18815 17069 -37588 -338788 188538 116860 84564 143582 -90378 520118 19038 -45110 81056
18803 129218 48374 -52295 -73065 -47244 -51656 -254017 -145376 40021 103611 -51002 -352687
18792 -352687 39035 -94810 -19526 -118150 273001 138173 -26981 -32215 63846 -302957 28778
18780 -200577 65346 261896 -171036 61415 -13152 -151411 -131100 -140628 -256690 -24777 -27175
18769 -27175 -173951 -38981 29097 203837 -18849 71537 32042 18938 77575 198500 60471
18757 -106385 -218514 -113675 -201652 -227977 72628 79654 183047 145027 113398 -24750 -359212
18746 -359212 -453499 -369453 126587 -130095 -43087 -177977 -175575 -237482 52933 51593 -12013
18734 -249320 70294 11363 -310902 -167251 -107702 -186070 -157523 -134029 110844 -281928 -189027
18723 -189027 -94573 131702 381840 -272657 -4532 -144889 -279010 -87582 -112086 -461689
18713 -461689 -332462 -94072 -78767 -265575 -218106 -143107 47132 28195 -266816 33143 -108754
18701 142738 -42981 -228151 253129 149983 88139 -88095 -228949 -66858 269608 -129181
18690 -81410 -27127 -85441 -189406 127841 -152643 103983 133021 294413 460962 106836
18679 5020 -205241 -106874 255553 -144072 103976 123491 1797 -27136 -8522 -102777 128224
18667 -71445 8365 -119611 123765 -529019 -252825 -130763 -407693 -40044 -452054 45238
18656 -52851 3024 -403029 141920 -98280 -50495 22469 64155 -37696 -224991 109603 86983
18645 86983 -87336 129813 -15436 55049 149699 -44421 -198925 -102863 -129952 -290976 -53525
18633 -235499 -302308 -19188 70044 127366 -101060 112397 179849 -108369 33130 -220679 178284
18621 -113260 23329 -249778 -74486 -19199 21548 161190 -48781 -158794 -104502 -170293 41038
18609 -86839 9265 124126 -61631 -170650 -52500 8231 -188798 -190032 29619 -303293 -41450
18597 -132750 -241812 99042 411831 9343 -309383 -25168 -345166 385892 -13354 -256904
18587 -256904 -77118 -8325 -273495 69724 33743 -240874 286181 16152 -273893 -71699 42421
18575 -55692 -233052 -88534 -299563 -192156 -25653 465489 -39077 -141668 -98366 -8523 42053
18563 159062 -219958 -183206 -6835 -288457 -164072 -167828 17084 -326646 -489973 -234332 -46963
18551 127135 -193748 -350712 -263258 -20898 -56176 -111579 96100 -122957 -26926 179506 134468
18540 134468 -31653 -284125 390725 -74637 93396 -88474 11546 78430 -310 -235944 -46690
18528 -272090 155365 141359 187928 240695 121711 -101472 -57591 -148090 361056 -309063
18517 -111448 -239117 -126888 -69367 -120902 58609 114808 -103970 -160910 -66120 -75238 30995
18505 -33438 113661 24934 -175815 17774 -43249 -224973 352415 91551 -120707 -66831 -296398
18494 -296398 184608 15415 -120482 -103792 -58031 -224280 -18655 -91293 -159290 -175041 222502
18482 -236313 -283019 -134940 57428 168651 -163934 192664 -177077 -223511 -21083 -167378
18472 -167378 -174710 206423 292283 -49098 -83876 -18124 69844 -87670 -30011 -110640 184776
18460 -125659 -241793 165148 -109350 38873 151959 -276816 32514 -105656 -120741 -129049
18450 -129049 -204187 -11126 88014 -234990 106214 345570 178131 47141 64359 -110249
18439 204795 -141106 -92240 77970 173045 -55896 132006 65646 -247778 32151 -79048 43591
18427 89718 99896 -37137 -43231 20408 -25760 15521 -109592 -135813 -471715 140186 -131446
18415 -148486 -266021 -298586 174567 -137469 39336 -146068 -81840 -151698 -102171 -62300 87306
18403 -43740 -205374 27534 266152 -187012 166060 -3252 -301789 -178626 177340 -26466
18392 -21470 160570 -162581 -322141 -198894 -75598 -295277 170316 103210 -129694 -127597
18382 -127597 -150515 311618 206521 -40137 121476 -319673 -39966 87580 -46298 -102451 187297
18370 -61204 11181 -216757 -204663 -215054 -130034 33599 -141168 -51366 321934 69145 -39141
18358 -204804 -48025 366603 -93118 -34191 49434 21729 -161943 -127398 -30034 71296 -38510
18346 186366 -28024 -52746 -373831 39674 290628 -216744 -186272 -313855 -179657 -53088
18335 85356 407477 330438 145100 39389 -329894 -21503 -132175 175465 173706 -103659 71221
18323 203060 67354 -143047 53256 -63460 -138832 -43040 -255591 -94443 -29035 -14628 -158201
18312 -158201 74596 292331 -265444 259362 103687 -173086 117466 117028 -30795 -316436
18302 -316436 -78467 -40907 94954 -68734 139493 -207641 95917 -15263 188711 135894 252487
18291 252487 128949 204660 -77473 134645 -17664 -68947 138598 23449 -341751 -310027 -267880
18280 -267880 -106150 -24516 -269000 259132 299682 191169 -35526 25374 -100142 -217968
18270 -217968 218332 14392 125601 -107034 -235550 76988 361255 -41284 -331553 969 -38351
18258 -83946 -156271 -48917 -4949 -163866 -175772 -14108 273138 137865 44809 -3757 -25096
18247 -25096 41144 -165347 -238295 -3622 -47750 -17064 -59023 65903 -209824 -266595 -142949
18236 -142949 -97006 -224760 -289918 -25934 283021 -79335 -48504 -15977 50315 80647 31397
18224 -20373 42329 201614 55584 4069 173600 -97220 -102375 -21073 -207732 -254269 10561
18212 -300574 -278116 -157715 218020 -113163 -250361 48716 -306122 -132997 64839 65263 75937
18201 75937 170628 249932 -206123 44494 147699 482478 -86381 213180 168630 289744 -30114
18189 -35203 42768 198981 -227002 245826 -9675 -90315 108354 307761 116545 -108234
18178 227539 -88024 -34620 33953 -74980 -172414 47701 -162000 -64546 -109943 17883 -185910
18166 85611 161376 -172290 11648 -132672 255038 -22806 313173 74232 -367683 208420
18155 66561 -148033 -479701 139111 12134 -376978 14256 115747 34460 24586 -96070 -220162
18144 -220162 -401362 -208852 -18960 -250952 -116436 59736 154717 86907 65597 -50188 -37446
18133 -37446 -12025 22101 -22991 -270614 35591 -323992 -121455 -43671 162277 -328149 43753
18121 -26170 -145160 4294 -245454 63212 185193 -97411 -110184 -78745 -71184 -231826 141938
18109 -91994 246970 61989 77416 36300 -65728 -58339 43177 -59104 214028 75343 131420
18098 131420 18074 -241764 -94510 -174851 50344 41081 -83222 -46025 -9488 111742 26355
18086 75056 -76197 -212593 51696 -42731 -246163 112740 -8978 283723 -86901 226604 -15888
18074 -129954 -103663 -202823 132195 248870 -326547 -2121 187883 171461 -25393 -72460 394892
18062 115630 -102264 -50610 -172709 141560 -68023 -22342 -80740 123609 -51208 164805
18051 -31695 213471 271578 57561 67097 -103817 234078 32448 -6917 -193301 -194072 221331
18039 -324513 178061 233606 -163513 291018 291331 -174203 -115063 56652 -122570 2862 -74784
18027 175059 88591 66404 -196441 85318 64387 -91757 89965 -14665 -273797 6906 242598
18016 242598 66220 -86326 211261 -357774 -193125 279583 -380350 -30444 -116001 -73581
18006 -73581 64627 -188789 -24353 -291581 129466 -40530 -150113 37377 -132123 29063 328305
17995 328305 200099 436392 -6401 -106284 -130414 -264223 66199 257284 172205 -263630 -149948
17984 -149948 -168592 -55640 -56873 -124953 -123341 174485 93712 1189 416231 -134425 34401
17972 -80549 7047 -7437 1301 125884 50655 -159027 -323456 289919 163006 149656 -31125
17960 -25767 4168 -61823 -153893 -91677 73546 145154 102025 264762 305601 -27360 -31089 -447988
17948 -447988 -38021 156861 -41294 89876 -115290 -26941 283960 10712 -250663 -86809 -113804
17937 -113804 -282788 154772 165981 30655 82182 308801 565636 2653 222716 14701 60979
17926 60979 76191 80642 114132 103477 -237413 -187288 19517 -86209 -41676 126685 74240
17915 74240 74255 185869 67138 -142246 235557 431163 -20836 -44970 6707 -209872 -84733
17903 -242013 -237666 296047 -235886 -8787 -179016 358771 60573 -202767 -120920 80358 110732
17892 110732 35405 -51030 -150972 -134103 18790 -109053 76924 130651 134193 281448 9969
17880 -36360 -124910 251590 6283 -99074 40932 -268978 -52723 136101 165391 227780 -153648
17868 172118 106217 -298865 19245 -20699 18504 334683 145665 212350 176987 -93269 56992
17856 -20128 467638 364712 -73297 -150017 -2237 -89333 34189 3874 -105690 23233 -14927
17844 107596 191569 138658 166851 285961 -58326 385474 244810 -217862 79593 235999
17834 235999 -218122 2866 61878 33282 233051 171735 -159921 -24641 73273 100032 -74571
17822 -74342 -138082 -180958 -77697 -32814 -155151 338323 41221 168447 30442 237995 -116569
17810 -20377 145238 -72754 -6557 309897 218421 -151788 57028 -119407 63412 -34269 -278435
17799 -278435 -68776 179442 -23751 33161 257840 198689 -29347 23140 -178179 -202410 -170840
17788 -170840 166669 236807 70307 156638 134711 128382 356806 63602 281862 -4708 178476
17776 222019 -230799 -22349 -156920 177759 17684 -18648 158030 53815 -46561 29619 110752
17765 110752 -473595 -4187 14532 -222840 34676 37291 -37433 -318478 119808 -76195 -46352
17754 -46352 5960 119255 49655 253646 217391 47879 57405 51421 -151617 -29616 77009 -101691
17741 -19144 155520 202567 306288 55759 29638 20273 73752 243356 -11199 345812 30887
17729 14406 122169 131769 32643 113359 62102 -56532 357149 140992 335296 204989 257328
17718 257328 110795 61751 236086 -28228 256137 -65187 41014 -128202 85246 -300055
17707 130148 5891 -117591 -186117 15567 177355 230724 79009 215010 59420 44974 -161014
17695 91273 209372 54414 540103 -16857 315383 -229379 47050 289508 114217 137807
17685 137807 384619 -78898 458112 115329 -22787 -169099 75161 191916 90519 238832
17675 238832 125827 -325388 -47785 338121 301265 378079 -44166 -532 -82184 203721 315377
17664 315377 -32156 -40181 159562 18959 189354 -300674 454625 306078 82634 347677
17654 347677 41386 -145470 -67329 524007 118261 -135411 -246052 236350 496787 42381
17643 11382 -330289 355902 -36066 97984 4120 -62663 -31219 -80072 -139137 -138271 8215 292375
17631 292375 48646 137975 102722 -282884 -138288 -45685 1737 -68266 26204 44089 -80349
17619 293868 146197 234874 412901 -65232 52092 464602 -222013 4126 11670 -58684 322197
17607 -202249 80556 209682 182029 285950 10649 187657 156279 -17304 258553 352509 160131
17595 -75678 90134 123906 209373 194695 223101 -15584 111330 -254251 311908 -24772 219040
17583 103121 141462 -35769 -6583 -264311 478018 285894 112451 -60777 89745 64371 372873
17572 372873 52378 252812 -220806 172009 388719 252606 217360 193726 101213 203720
17562 203720 342731 104326 71278 -8557 196619 156178 -73088 7131 247238 226377 -90036
17550 -7495 467 -34520 -29918 33826 293631 483123 -90763 112148 -50812 -370036 367128
17538 367692 159836 126156 497978 66080 152648 569349 276355 -79280 281484 532131
17528 532131 357793 369778 162051 398904 734549 584398 961197 779806 918805 581911
17518 581911 401516 259504 344220 593802 208658 435373 784304 327039 675507 623579
17508 623579 608373 1467442 975652 806079 594454 478493 222737 118935 449133 550598
17498 550598 471137 279692 476086 262214 174743 322951 206658 315868 198303 374876
17488 374876 319221 414394 162031 49840 366015 606447 612722 219939 156337 356962 48986
17476 527170 103784 438070 365291 263172 150107 82124 530029 168264 142979 135134
17466 135134 102674 237931 433578 40273 299376 104339 569817 98458 290675 392524
17456 392524 81080 165235 67149 9977 259860 328976 27609 175655 829260 447343 393938
17445 393938 -19884 311804 383717 421648 384950 409612 325197 184359 206922 779122 143516
17433 225238 264141 174731 141577 370743 211622 309743 677755 425152 201392 -192773
17422 463294 438445 294594 468898 526506 492582 474644 440858 514048 310192 475324 179564
17410 346899 282698 -6311 302659 470490 256555 157939 -96969 329844 388006 231170 420944
17399 420944 172551 141829 268685 306194 330635 245028 181645 446397 281693 120362
17388 85168 98431 447565 229089 398286 321765 454444 413307 -104204 376863 385305 300845
17377 300845 295146 215138 426283 320436 115359 575801 161397 154078 193550 243547 316778
17366 316778 501138 616166 265054 320594 82090 77885 -191459 216840 150698 215343 413127
17355 413127 506276 256998 -26806 234805 158461 441689 394617 -15195 225445 256612 412630
17344 412630 409099 212438 86336 144188 257134 138256 282183 217073 297239 88063 469982
17333 469982 413271 282779 148097 85075 -137140 286958 87668 366335 424816 417600 100233
17321 84346 334288 54888 345591 90804 33343 335788 471771 273706 312327 24474 320225
17310 320225 174290 372972 111785 64226 262094 414985 372967 424240 288814 368801
17300 368801 271556 -16664 84859 59232 422539 172118 266205 448856 480925 418969 45160
17288 36548 310598 75455 328739 251804 312339 336098 260818 30663 454126 39783 245126
17277 245126 373194 209837 90558 273827 228837 131391 100470 368305 390419 222401
17267 222401 281596 254230 31363 204913 366042 160889 322414 191155 471415 39709
17256 212934 457532 131963 145064 -51226 -153122 414671 428216 575897 -85543 -56649
17246 -56649 346673 425527 588383 259477 458530 230139 553299 341752 -42236 28034
17235 344346 384230 395624 453114 -40216 438457 304577 557062 -5529 99653 -104676 618679
17223 165954 547489 308652 541533 353108 527307 -10275 201942 13516 361266 584745
17213 584745 242232 223591 158426 554385 179418 -172884 546923 160011 683711 148350
17202 375371 181583 490156 32481 489972 483224 664971 506206 263947 470816 340809
17192 340809 323175 520918 303917 226041 448993 426314 689318 187446 546645 375089
17182 375089 565338 395439 217302 651056 105103 466794 583506 259207 625157 401139
17172 401139 574773 48489 614792 584482 695281 745961 660560 664134 356736 277254 268590
17161 268590 514549 380615 580380 192249 517615 239016 319046 450908 334780 691785
17151 691785 731755 311071 429873 332135 528129 154442 469011 88149 216558 486279
17141 486279 451894 571555 551981 329552 383018 389093 380308 501791 563295 339349 265025
17130 265025 450633 413141 587823 444584 376027 94398 526875 540096 330845 388521
17120 388521 743305 320132 568574 331751 726286 597880 452094 348963 496590 836209
17110 836209 687672 639938 466169 832863 443497 782627 398900 382863 762233 639172
17100 639172 539443 618763 1059708 924817 682032 532862 860527 572553 732714 682812
17090 682812 750626 582302 766379 638107 661281 249485 786165 498721 596191 750595
17080 750595 530394 538630 690773 756127 456577 1006516 476609 596107 830274 739780
17070 739780 1005108 653691 929854 745868 307461 530968 817559 843365 627070 692852
17060 692852 1076276 890579 772954 687186 781960 852725 653767 769257 423052 704835
17050 704835 776643 777150 688703 794166 708980 911005 811553 733023 686662 766797 796133
17039 796133 756057 878453 723523 851010 831074 766457 889118 982856 936995 1063454
17029 1063454 618632 975534 1049722 1132647 524945 824521 1087317 811335 709250 1064112
17019 1064112 745705 914896 892936 974512 724752 1120194 717570 1029273 994470 921132
17009 921132 1266665 691679 989600 1158272 915718 1367226 853857 1442213 767181 999346
16999 999346 880032 1096853 1102445 1135893 986954 1383154 1389392 1012531 1035219 1452758 988343
16988 988343 1168359 945561 1264899 1045680 1477562 1179301 1331661 1335307 1211045 1414152
16978 1414152 1396147 1333423 1218044 1555375 1407112 1641066 1361439 1135633 1084614 1683843
16968 1683843 1154440 1571115 1574135 1388451 1158367 1607904 1469941 1483739 1575718 1615746
16958 1615746 1590417 1830283 1195829 1713939 1726275 1533331 1621773 1520962 1704582 1951525
16948 1951525 1848054 1982737 1715846 1758019 1815897 1756673 1555947 1956515 1604874 1569224
16938 1569224 1878219 1738816 1781127 1953498 1939626 2088262 1831035 2179355 1751698 2387593
16928 2387593 2230215 2016303 1928437 1739970 2268089 2409009 2271209 2293085 2221466 2158944
16918 2158944 2005235 2336998 2381811 2149432 2367280 2555044 2568869 2587675 2670712 2664342
16908 2664342 2388258 2628793 2743020 2582178 2552318 2746676 2478114 2686619 3069356 2766250
16898 2766250 2660371 3018362 2868210 2857962 2748242 3040441 3159414 3290938 2942169 3078187
16888 3078187 3236827 3288929 3019429 3233354 3306738 3349102 3685184 3518470 3284519 3362482
16878 3362482 3881416 3614506 3824086 3763653 3850488 3705607 3627013 4159988 3894571 3917773
16868 3917773 4134860 3972573 4260001 4175676 4409130 4366146 4496427 4601204 4869888 4387764
16858 4387764 4868472 4944336 4845965 4858543 4857837 5039972 5002482 5473499 5316470 5588167 5524590
16847 5524590 5698371 5429792 5745815 5864054 5712547 5751936 6231914 6082491 6269374 6491369
16837 6491369 6662033 6569428 6841933 6966899 6860880 7079355 7103768 7249860 7369974 7544111
16827 7544111 7637416 8218114 8134632 8198848 8506485 8517670 8737900 8964464 8676549 9129835
16817 9129835 9110254 9576840 9668141 9688157 10403391 10265130 10264865 10715633 10785310 11324252 11490420
16806 11490420 11771120 11704699 12219380 12456263 12706131 13165136 13443001 13783439 13785315 14153544
16796 14153544 14715280 15132734 15429600 15952768 15814303 16158043 16827658 17344942 17823510
16787 17823510 17884952 18667467 19352973 19667002 19940336 20793218 21099129 21754812 22402654
16778 22402654 22932310 23421107 24441876 25002837 25761016 26783394 27426521 28095879 28992169
16769 28992169 29895103 30505041 31677271 32660379 33927630 35004951 35756045 37196017 38797467
16760 38797467 39552815 41174921 42559453 44026347 45574448 47197640 48758511 50614441
16752 50614441 52355558 54389041 56454886 58326400 60427220 62370414 64877468 67282655
16744 67282655 69776372 72414771 74882876 77667777 80280637 83322254 86250190 89134681
16736 89134681 92212370 94892267 97910077 100644730 103665662 106358333 109229106 111643400
16728 111643400 114208858 116511462 117988490 120106132 121330272 122426626 123391308 123525476
16720 123525476 123786057 123201865 122374840 121475152 120368005 118699488 117073101 114697610
16712 114697610 112103868 109501439 106344245 103568711 101022591 97960761 94601250 91616651
16704 91616651 88325698 85321200 81997456 79364211 76396596 73621151 70633602 68029766
16696 68029766 65214213 62737091 60161686 58163995 55971312 53777589 51505233 49684892
16688 49684892 48063491 46096898 44317130 42491699 41274318 39967531 38468985 36670817
16680 36670817 35780261 34338488 33110541 32325231 31068832 29990408 28921153 28295560
16672 28295560 27252096 26100850 25713932 24862472 23788594 23097403 22624643 21676473 21380075
16663 21380075 20746829 19910602 19431170 18746176 18015261 17867646 17545249 16887350 16559412
16654 16559412 15625965 15656180 15311450 14743660 14390691 13962031 13771647 13609858 13161395
16645 13161395 13052536 12547693 12378988 12015426 11497953 11452196 11207590 11152612 10797175 10688014
16635 10688014 10199896 9903462 9902304 9605531 9484264 9095270 8873981 8751630 8597309 8571782
16625 8571782 8138325 8521000 7858652 7658726 7733476 7651088 7771055 7290636 7168287 7183333
16615 7183333 7057682 6832846 6865584 6612223 6285475 6517564 6370228 6166397 5976281 6106476
16605 6106476 5658203 5824140 5840359 5519774 5398499 5635870 5569089 5413297 5189803 5336575
16595 5336575 5293208 4962214 5091625 4561660 4566696 4603392 4380548 4644288 4509049 4569304
16585 4569304 4325035 4251094 4172210 4154773 4012330 3919288 3993284 4018238 3904839 3817952 3859294
16574 3859294 3707320 3975814 3524645 3236543 3523071 3574161 3500292 3600446 3414498 3319920
16564 3319920 3169736 3072092 3086430 3056080 3203090 3026208 2971787 3112605 3261852 3091113
16554 3091113 2780512 2786595 2708279 2769378 2961519 2728991 2686216 2789093 2563830 2373794
16544 2373794 2617574 2715029 2600721 2449574 3110115 2194306 2658480 2538811 2361734 2427106
16534 2427106 2483062 2396700 2228756 2518619 2390355 2333271 2453765 2478426 1972383 2284728
16524 2284728 2497941 1936715 2190157 2118592 2119736 1900447 1848214 2211639 2240878 1724966
16514 1724966 1844017 1806239 1730365 1781760 1790680 1816775 1842225 1803281 1705505 1947688 1774212
16503 1774212 1912890 1573023 1842297 1658412 1752346 1732413 1591121 1693979 1538566 1659851
16493 1659851 1718025 1548787 1771311 1564479 1569462 1598189 1654878 1325295 1287469 1427340
16483 1427340 1442280 1641792 1479665 1562868 1634470 1778538 1669853 1471570 1591750 1470152
16473 1470152 1606866 1299747 1614551 1521738 1358929 1399213 901062 1013189 1436638 1516788
16463 1516788 1245457 1189063 1420022 1120924 1373413 1507062 906688 1108370 1296536 1474174
16453 1474174 1186312 1132630 976099 1363805 1166630 1137970 1341456 1339861 946990 1064261
16443 1064261 1109681 1195847 822261 1137904 1155554 1015625 1155381 1285863 994502 1055028
16433 1055028 862976 1044048 1062180 929874 1007029 1086094 1149149 996757 982539 1207031
16423 1207031 979258 966728 812797 1073045 1159586 858213 570176 810299 985031 683073
16413 683073 694005 1094080 870936 857119 650987 986307 850277 687746 731114 1222636
16403 1222636 1364983 898782 811989 503687 839324 770888 800997 854534 676334 648853
16393 648853 804489 602927 926762 910724 523434 945307 799934 699672 1020217 924609
16383 924609 629760 1017694 671298 599901 775626 804100 965623 783260 805629 720498
16373 720498 1039197 820270 889734 923343 570738 808731 646696 784884 661215 758445
16363 758445 949910 674344 756225 460390 613868 866869 652021 479999 390589 543481
16353 543481 742019 1061907 580794 571250 412217 749691 531127 677651 711597 801386
16343 801386 622748 350081 576442 477515 356873 688257 716120 725861 835080 885736
16333 885736 408829 811954 746754 604280 457960 523739 819671 725934 441916 703692
16323 703692 520544 771846 702198 440286 488886 537483 627336 393811 806092 613467
16313 613467 708247 633242 833449 523141 596909 556636 656640 531541 629828 526101
16303 526101 279082 905439 611619 483056 564865 596612 441729 740388 733565 263625
16292 469522 556293 199534 523359 683866 354770 313500 435257 196557 412751 1007571
16282 1007571 624132 554013 418652 632877 506473 352782 251030 333522 7373 486377
16272 486377 47844 476425 145241 400361 716555 187928 606263 527078 762763 270096
16261 203288 503928 253635 144009 399971 528362 476373 122189 404038 657285 479506
16251 479506 577127 610099 554700 358125 502825 447012 550849 229877 378626 253953
16241 253953 332013 398548 593213 381041 145446 455234 342647 450883 259340 468044
16231 468044 200515 281900 646368 318138 341046 81425 432713 326086 440095 161637
16220 381667 551447 309099 91171 201282 378377 369355 241912 100148 384627 132689
16209 291154 248799 120802 620586 320469 374924 131052 37152 398526 313252 20115
16198 253166 219689 288421 332316 201668 109491 180241 231298 173466 355676 367413 486932
16187 486932 -94536 188338 191446 163705 234747 335361 480979 363615 136256 299467
16177 299467 225994 161927 6082 401761 -105061 55635 350860 303466 316446 -402405 35421
16165 380659 226625 -110848 29562 162377 268419 253219 462230 187555 217557 318116
16155 318116 331961 -43724 212053 53687 282687 66914 -175279 300166 -47631 170009
16144 12290 474727 11677 337123 391621 144225 91962 479533 407314 285066 332144 -210110
16132 208940 27661 206981 148367 245496 117082 182502 5937 143953 366220 -26429 328358
16120 399709 4085 59856 -15441 252151 203234 9081 268481 297833 -77960 -44592 11647
16108 381250 -139798 102902 134927 -30006 -82125 327915 240869 156653 -55688 490825 85906
16096 101880 50464 -214403 165213 549572 77598 190273 370384 45159 163750 177457
16086 177457 -53730 21500 212739 308461 196496 -105029 2397 263070 8184 136046 108876
16075 108876 230183 105941 97939 263249 127189 337654 -53499 41473 -55080 -84815 -234686
16064 -234686 257201 340479 35334 -80925 305749 263429 152068 187796 155302 131682 283404
16053 283404 -84717 207041 -113960 223996 61763 69275 -12290 283351 -73616 -8615 207219
16041 -85227 214082 -7589 197474 110665 186607 63483 14562 262279 160036 -99199 -118021
16030 -118021 286303 127735 406654 249985 -277972 270203 207427 125271 96207 -412757
16019 130982 47924 64954 110818 315953 -5215 -33853 168820 -145979 -310540 -120978 -300448
16008 -300448 -76879 41716 122880 35432 -15296 232635 6845 288542 -36090 -162760 -129770
15997 -129770 -143827 233567 161624 202974 -103558 68224 221844 100421 -13112 789569
15986 557903 379358 831305 944355 697595 639049 484079 711594 17535 583167 482449
15976 482449 -13919 434684 34885 437864 109998 148942 -77712 3389 -24020 10431 9712
15965 9712 54073 252495 -132324 82878 140620 5316 101616 -62021 -142472 51755 -59367 -5777
15952 340783 5087 71645 -113260 266968 -94791 -83132 92833 141446 123417 267864 253391
15941 253391 330322 -117692 -254194 -135953 251842 -24426 214408 212016 177407 35867 208460
15930 208460 -452084 107303 -229997 -274000 256659 -72127 -145016 85694 -125336 -5338 -114134
15919 -114134 -105128 48326 -125315 317159 -107600 -61259 -212670 -81398 -99421 -230168 -297641
15908 -297641 -27332 252942 -68978 62126 -99696 -81832 254878 143121 -52930 -260270 -151771
15897 -151771 -198460 -75834 167115 -34199 -85223 -110919 135448 -194054 -134071 -81160 -94299
15886 -94299 -12546 10081 19778 185231 155609 -18004 -43897 -5959 98183 -210917 166063
15874 234813 234863 -114141 232845 -140023 135312 -154208 153523 -4088 111477 116819 146105
15863 146105 -420743 68912 88125 -248127 -127353 222508 175866 204069 236176 -34623 44306
15851 -235815 125308 56751 103570 15606 -179465 211242 49639 -100514 198563 57133
15840 -62403 316978 7887 -154608 246662 -11401 -216645 -43687 -123480 65368 -461041 -311185
15829 -311185 -138647 -99328 55513 -79194 -32307 -140108 -144662 -172583 -163218 -49078 -354993
15818 -354993 150096 -241098 246753 -254628 -200419 -195039 73233 -33030 -115222 21276 386497
15807 386497 -224770 92693 -219733 -197986 18417 88172 1753 98799 -90691 90252 168710
15796 168710 290681 -178438 17769 -59665 204875 88349 -80549 -104454 -156824 -144134 216603
15784 -45038 -220589 19958 -334213 -394302 -121756 62054 -308322 220852 -88987 74449 -49293
15772 61725 337519 -97453 119159 -149830 -123854 -76416 -143983 61143 -207771 -24159 -175071
15761 -175071 48117 -13026 79401 -28279 159266 45150 -81269 -198664 92602 -257482 -41063
15749 113459 -262116 137207 111776 7748 37348 -49889 130322 -180498 103793 130463 12465
15737 -5960 -396668 131570 -9645 53285 263822 -152888 -235162 17164 -16686 -65857 -43909
15726 -43909 21574 17041 -29942 -13333 -261539 -104959 -72341 -94607 -41864 -204717 152166
15714 -210839 224052 12147 -312635 -33215 218901 -204255 -11247 13037 216153 -336744
15703 -20793 219282 -92490 19100 289977 238760 11692 35309 14633 -105090 -30954 172458
15691 -30201 179225 67975 -137712 -72159 35921 68457 -85536 68083 -126066 68906 15348
15679 463 -108877 61252 224017 -39190 58738 149736 114952 -398649 -381374 211546 292 303332
15667 303332 169845 41864 9026 -59981 9515 -206436 -36360 -227728 -215908 -281738 -171355
15656 -171355 105694 -171469 -81067 -86603 -170844 -66168 -139366 -141356 98080 193501 333927
15645 333927 -143002 22096 74781 42919 261285 -152675 -315904 -68288 -28957 158064
15634 117624 -105036 -131157 -433085 -26144 -302294 -121876 153116 -236946 179327 -56415
15623 -207423 -244592 65774 142189 -269645 -32773 42314 230239 244418 -83328 -60477 1199
15611 -67874 -171836 156355 10371 396195 44102 386570 435873 100149 -147426 -394192
15601 -394192 79704 -92015 -53141 95491 113245 -14510 12370 12493 -43990 -335038 -33774 -20834
15589 -20834 156367 -301405 177282 -39804 91413 226285 403620 -41539 36494 11857 172408
15578 172408 51816 -325086 -162036 -126365 -73848 119455 48810 -206329 -110366 -350505
15568 -350505 47735 269 10537 12360 233052 128640 61136 -100895 206011 136092 -291270
15556 201214 28249 -64799 -358342 226624 135774 -2085 139226 119636 -158231 209739 -62913
15544 258087 -92927 27106 -154993 -105581 -2524 -287967 -154266 90350 44236 -233353 75359
15532 -181848 222070 -262477 164862 -129181 129592 51534 -27951 -212487 169828 177449
15522 177449 138087 -169783 332101 210653 -40326 -83921 109167 163002 218548 45541 28233
15511 28233 382326 -18978 274031 -129315 112026 -375361 297504 -141918 -65520 187154
15500 264586 285248 -133124 -143840 -212074 81748 188223 -55490 -266331 108583 -27289 -49549
15489 -49549 -118961 -275412 -341531 50972 266056 -35153 92515 221238 21327 54615 396955
15478 396955 -59198 176697 123956 251023 549715 423627 413500 438188 300255 169779
15468 169779 340158 -77235 -5168 122122 103254 39556 85704 45255 89026 120440 347555
15457 347555 -30747 130471 -92702 -255915 317617 160431 475577 -24899 -40758 -46953 -71209
15446 -71209 157631 167863 -246777 372693 132628 749116 495484 672799 366405 277266
15436 277266 481574 -170083 247349 112093 -223245 48652 114417 -41425 -347027 100300
15425 351419 247170 -161300 -297476 14191 -2456 132921 -62284 354619 229732 -109959
15414 37495 70900 116840 107607 -277013 77832 -161312 -84490 -305738 -358058 318623 195894
15403 195894 -235581 -28743 -162156 182300 202993 -337000 -73106 395727 -42906 -222028
15393 -222028 -82377 50918 256177 -64382 -2319 5529 50347 -44944 -31739 159138 -100625
15381 158330 219742 173615 -167638 161793 -18301 106980 -49466 223607 308582 1835 145799
15370 145799 179431 -21326 146812 226124 -48791 -190932 -214106 149106 168300 393692 125543
15358 411191 241844 143620 257471 366746 227853 -14248 212218 162434 355702 184312
15348 184312 393408 37118 22346 179497 99570 198565 404890 228761 349498 273093
15338 273093 326553 12550 -250917 -158368 53498 41320 211459 109355 193907 245930 -57208
15326 172018 20902 28815 100134 208881 115083 -203036 195884 42902 41485 216897 -86493
15314 200619 33383 37679 56327 116699 288910 102752 282578 -24832 -204241 165857 60308
15302 219227 428048 18821 79519 182536 -2839 259965 312201 25143 -15766 86090 14981
15290 360346 -77549 432033 -42303 -17247 350659 32890 10359 -118215 -184433 10721 22065
15279 22065 284908 372236 168668 31678 112100 91155 -56424 322542 -6719 138250 -45470
15267 -10039 -140892 18352 41388 -33202 50964 49806 180540 217703 -14444 114477 137771
15256 137771 150860 49011 295933 29388 283730 291472 401839 298459 148161 430212
15246 430212 588100 1094418 1296274 1655627 1301781 1120684 535669 -1248 213054 398788
15236 398788 147842 -60318 59447 -213155 333870 102287 103373 232704 -240731 35039
15225 254532 176549 -122792 -81637 -3110 -99596 -13299 -257334 -108709 10502 254797 -136048
15213 67871 148530 -43989 -78441 5185 195603 132587 -295448 152317 -101614 157717 7241
15201 -166159 -93280 239791 -34359 8284 140084 -106033 100425 -62129 213745 50124 -88464
15189 -27923 221246 560567 -60935 361073 -15466 155923 4740 59915 412792 372253 74628
15177 -3230 158847 249358 -62412 400131 404896 185391 97406 118864 114207 245067 -373396
15165 -75353 22865 42040 264036 57032 121797 270026 85258 -20326 -145342 222629 473774
15154 473774 54826 -158401 34839 -156335 147009 192378 -130799 -7853 158863 340331
15144 340331 131018 82855 189395 107467 103407 -93447 344251 176532 161506 191417 71550
15132 407239 36394 431562 148150 241284 339733 84478 75702 -163981 -34517 171089 438714
15121 438714 32504 466878 457690 306768 515240 271741 241957 186744 -157734 191762
15110 26566 43844 -105179 218433 345845 176533 358828 450260 -73173 172411 180619 446108
15099 446108 278376 -360049 162516 72508 138598 88809 106189 78854 110602 17630 -16664
15087 27286 -260293 36936 -153472 -273660 320769 356397 520365 -34145 -35841 141958 362084
15076 362084 278024 36193 -4325 290542 451371 208640 49410 250600 430841 58807 -151703
15064 55009 664405 206688 -138008 14499 348699 272374 290118 325759 220327 66242 138422
15053 138422 170942 -192019 179544 253258 405496 491769 122956 199502 392334 242743
15043 242743 300592 406790 573292 369493 155024 239160 293357 378542 487354 193345
15032 34363 465627 282200 347847 431061 575883 499986 742574 728999 652584 641322 245579
15020 652905 178522 367140 500289 275373 292112 459796 588392 542925 413755 336769
15010 336769 375588 572461 512708 397881 630382 395918 550728 243919 326375 509569
15000 509569 288713 183482 396691 325999 58662 424910 784628 578547 308435 252001
14990 252001 428432 322680 593775 169995 163504 715571 661840 263422 650284 599937
14980 599937 543966 896141 498510 750989 639212 446047 643326 625486 513298 861830
14970 861830 656029 679817 290646 393795 435670 815098 243509 473923 303094 479215
14960 479215 441162 187313 291481 638257 380190 577195 313321 465705 510612 211318
14949 379084 178994 609749 90793 511374 419922 571407 568687 503563 333991 496787
14939 496787 484480 278194 699244 432731 241784 424287 544855 525289 410358 608226
14929 608226 1022077 865242 1066664 1193244 1440889 1196393 1182905 1628872 1250962 1542973
14919 1542973 1308990 1219601 1391377 1875519 1787619 1587034 1383976 1299126 1218795 1065407
14909 1065407 1114797 653579 567572 262874 562319 592145 223182 742530 535010 478119
14899 478119 221867 368495 211733 598213 -210041 -46196 383690 441639 73595 431137
14889 431137 529958 338554 257269 419654 637001 625339 674419 513557 869889 667164
14879 667164 556008 740018 554102 551320 690911 517555 799309 659607 711876 270030
14868 403540 330510 636465 722128 427627 986471 605865 497696 667909 332059 609523
14858 609523 253945 376973 328309 450742 772021 553530 97710 277519 468140 118568
14847 182977 417719 773216 625214 851791 654585 635326 898647 1141101 921919 1131500
14837 1131500 1182824 1132193 1106341 952628 637757 546606 524656 837874 473553 946798
14827 946798 368101 558829 886411 318202 656279 494305 635995 659818 602444 520502
14817 520502 1036872 777701 748146 665426 813147 517223 911509 676276 184737 757648
14807 757648 606577 756210 369144 796145 981746 773180 694770 955734 630838 715405
14797 715405 611484 783067 363099 722646 501295 729457 337187 391634 546048 923213
14787 923213 392549 389992 721402 599315 838787 617118 621652 753061 724710 601330
14777 601330 862325 939982 774462 1030876 814342 710770 777498 767072 732248 572269
14767 572269 575591 431714 558958 613226 707205 544359 444730 552150 795429 814582 535628
14756 535628 853559 1008890 464847 732960 839420 941193 772057 937548 405771 671349
14746 671349 603093 617462 887463 671943 823971 629020 656641 734180 690158 497367
14736 497367 689798 805195 818658 1051976 1050223 997317 1201413 944218 1119030 1244693
14726 1244693 1005962 1475205 1780334 1679709 1540376 1195564 1362016 1226909 1380801
14717 1380801 1019393 898805 1155559 1081022 757602 1046793 834451 1122775 1038770 961359
14707 961359 685210 937876 809312 1099666 1035287 882922 935815 1223227 1295272 1658037
14697 1658037 1344041 1878792 1417997 1301554 946630 1150327 698451 843427 1111000
14688 1111000 914689 1186715 1223205 1060482 1070677 776970 987620 704143 811050 764780
14678 764780 1099909 1161410 837621 1183596 1011845 1108969 1072862 956643 1161121 863079
14668 863079 1105534 1096379 861201 1481862 963323 981704 1006970 1128582 1105653 1186319 1162933
14657 1162933 1156304 968109 1102001 879946 945089 1269713 1167188 1299511 1334740 1540670
14647 1540670 1104126 1063626 1308495 1160876 1391654 1229600 1011964 1337506 1196556 1285514
14637 1285514 1131081 1133656 1245992 1492265 1272888 1072285 1398621 1223628 1025209 1446575
14627 1446575 1180773 1431396 1269693 1465028 1469642 1335262 1118701 1419540 1370676 1489240
14617 1489240 1522798 1298522 1293701 1222276 1401367 1740835 1418566 1708350 1788643 1971910
14607 1971910 1515756 1365581 1760157 1661341 1630148 1678994 1570959 1678558 1822364 1830365
14597 1830365 1575513 1871733 1877410 2021824 1867865 1954260 1847993 1722146 2160896 1944689
14587 1944689 1915001 1967067 2051970 1955218 1782807 1994043 2098041 2306300 2266860 1953773
14577 1953773 2189125 2313699 1923192 2072528 2295479 2580089 2266429 2628712 2500518
14568 2500518 2197552 2598670 2473151 2739458 2845162 2784777 2916838 2738062 3001711 3033304
14558 3033304 3285314 3436878 3373872 3522754 3906863 4712067 4783376 5683228 6873235 8810493
14548 8810493 13040526 21683563 28705966 27238094 19879352 13769439 8250616 6000639
14540 6000639 5009039 4210750 3419274 2707339 2483784 2453600 2427441 2392687 1949461 1959692
14530 1959692 2311139 2331094 2222188 2273578 2181040 2211575 2562002 2569184 2662140 2674033 2584666
14519 2584666 2822146 2878525 2655737 2863178 2922568 2660391 2750478 3179657 3118184 2965223
14509 2965223 2641364 3056981 3067678 2963963 3351047 3366388 3514862 3609168 3566516 3493072
14499 3493072 3638007 3553519 3646869 3507931 3330110 3614762 3469869 3699396 3593604 4071411
14489 4071411 3885461 3892404 4027488 3994194 4130020 4036280 3986617 4581585 4218619 4005676
14479 4005676 4229444 4747758 4251819 4367432 4570498 4450659 4564568 4285873 4862364
14470 4862364 4524402 4658837 4625556 4740462 5152342 4830863 5293562 4913277 5220378 5365079
14460 5365079 5423623 5552969 5627399 5474731 5574581 5506627 5413417 5235100 5689349 5881702
14450 5881702 6211887 5858771 5855065 6055611 6196314 6430046 6557177 6462638 6480815 6845757
14440 6845757 6618021 6645929 6660766 6965993 7065300 7281418 7473229 7741390 7515460 7685692
14430 7685692 7840167 7747159 7879009 8041956 8344585 8021367 8669771 8727320 8735112 8773688
14420 8773688 9307250 9300805 9386637 9814394 10057559 9810920 9922588 9793673 10332254 10214307
14410 10214307 10334099 10263543 10672555 10666019 10887145 11205721 11440195 11883075 12001841 11684893
14400 11684893 12213119 12472362 12968013 12923587 12595556 12954218 13662635 13374649 13867444
14391 13867444 13768367 14273009 14487175 14851239 15017384 15273215 15572873 15770446 16025515
14382 16025515 16730450 16954695 16880758 17662461 18077700 18331623 18690033 18729873 19192588 19452446
14372 19452446 19838756 20377138 20538076 21202482 21434692 21899512 22460450 22960118 23687312
14363 23687312 23954378 24457041 24961654 25497373 25743413 26882021 27250999 27676082 28136772
14354 28136772 28978475 29833438 30478662 31046530 32111954 32376550 33807782 34500734 35424981
14345 35424981 36008694 37188049 37861020 38946357 39904561 40849573 42175013 43370107 44445021
14336 44445021 45384516 46786248 48645331 49358268 51174168 52504246 53782780 55867313
14328 55867313 57280348 59293240 61075893 62754914 64772567 66790727 69039680 71617458
14320 71617458 73944617 76184342 78851460 81716861 84732058 87389829 90966246 93886586
14312 93886586 97771436 101389651 105255856 109034396 113547852 118190869 122864168 127741073
14304 127741073 132636487 138199709 143807226 149791421 156183967 163252167 170353518 177528956
14296 177528956 185454742 194047004 202685620 211725661 221331135 231486708 242059188 252740734
14288 252740734 264561364 276726520 289044781 301767837 315268021 329492270 343518463
14281 343518463 358436408 372846910 387210329 401713556 415201899 427021154 434619312
14274 434619312 440220777 445031372 447803032 447307838 443545013 429614279 425327637 422138300
14266 422138300 420006475 417944976 408638422 394883062 379532887 363737869 347675695
14259 347675695 331824431 316147756 300324107 285358708 270960531 256272441 243080914
14252 243080914 230568639 219212938 208205974 197697182 187625562 177945794 169181757
14245 169181757 161161422 153392460 146083461 139031038 132846865 126932336 121231346 115606212
14237 115606212 110748114 106249429 101429549 97246129 93009004 89381768 86022369 82572547
14229 82572547 79284873 76195033 73302095 70634094 68222823 65724985 63264948 61437916
14221 61437916 59150717 57393761 55329889 53653418 51580825 49969455 48565624 47481018
14213 47481018 45665483 44529441 43211141 41592841 40320073 39678903 38512992 37705933
14205 37705933 36220407 35533353 34424163 33672715 32761865 31989773 31482919 30272730 29508975
14196 29508975 28430565 28412316 27592114 26816614 26188183 25452420 24965539 24307306 23291087
14187 23291087 23018923 22993670 22155997 21887043 21091033 20748313 20473408 19907026 19407646
14178 19407646 18973681 18912108 18341948 18161563 17687134 17195765 16783826 16418201 16347796 16195142
14168 16195142 15822900 15466674 15256600 14887725 14756218 14283740 14121793 13824987 13596664
14159 13596664 13262343 12858651 12666375 12779940 12583769 12211200 11786643 12077359 11556100
14150 11556100 11367637 11289248 10880113 11218181 10557283 10602793 10733496 10230307 9855022 9938331
14140 9938331 9370422 9624197 9518226 9370754 9192393 9077015 9205094 8949834 8819471
14131 8819471 8595852 8334012 8260530 8499934 8306173 8220590 8142663 8061165 7599723 7571501
14121 7571501 7707999 7183810 7525375 7239004 7236601 6806023 6766960 7003543 6645132 6426469
14111 6426469 6587532 6512439 6227570 6581310 6347111 6247041 6275247 5864014 6036976 5914272
14101 5914272 5964069 5892866 5711752 5971435 5681695 5637938 5247507 5355853 5350844 5263091
14091 5263091 5086612 5115449 4818634 4908257 4568251 4798088 5049138 4687041 4713278 4781321
14081 4781321 4912320 4666681 4335484 4260318 4545386 4352835 4184184 4616374 4558552 3967563
14071 3967563 3795319 3830461 4493051 4072645 4056675 3954658 3786673 3878722 4146543 3994068
14061 3994068 3983426 3831381 3857443 3729448 4024623 3596635 3575088 3543008 3758015 3439017
14051 3439017 3493885 3625052 3221803 3140853 3512788 3385798 3074836 3057851 3073547 2946015
14041 2946015 3069538 3188461 3375388 2919539 3173776 3164352 3004089 3103820 3297103 3246189
14031 3246189 3025739 2732758 3081555 3193587 2728509 3021451 2511331 2396987 3035717
14022 3035717 2779742 2534462 2590790 2783054 2645401 2466378 2535668 2462479 2267577 2518366
14012 2518366 2433991 2491920 2403087 2495100 2563645 2467159 2346043 2440079 2546380 2381317 2237115
14001 2237115 2420234 2196830 2084000 2455642 2142407 2293834 2418088 2563650 2397198
13992 2397198 2378276 3053825 4192321 5226787 8533293 15856163 25336602 27348233 22016060
13983 22016060 16776794 11406276 7484683 5022717 4259260 3659167 3442092 3200118 2678597
13974 2678597 2702534 2494143 2459984 2376572 2357527 2350893 2290806 2248107 2400395 2195436 2028428
13963 2028428 1937092 2473603 2206454 1787670 2077359 2189199 2084427 2010033 1907849 1976073
13953 1976073 1652417 1870889 1739419 1689036 1805188 2041662 1860473 1739508 1622809 1718359
13943 1718359 1501491 1900775 1846066 1607138 1712395 1764917 1481212 1464177 1762011 1389196
13933 1389196 1265582 1744022 1820074 1471718 1523974 1644364 1381739 1280450 1454680 1512346
13923 1512346 1813517 1462816 1366977 1634430 1402454 1469549 1344466 1296524 1691924 1348366
13913 1348366 1512896 1424059 1391591 1766324 1338697 1282111 1024804 1264095 1355431 1416950
13903 1416950 1414729 1542664 1486744 1154819 1649287 1680799 1396238 1413504 919505 1396373
13893 1396373 1493852 896620 976076 1179686 1345157 1169430 1090702 1172535 970137 1330099
13883 1330099 1185254 952913 883592 1407414 1099115 1310842 951972 904201 1243128 957225
13873 957225 1035271 1402949 1177573 976318 1303430 1071639 1299634 1050562 978642 820800
13863 820800 1174654 953337 1097544 1329730 1104764 948058 1076365 1000076 800106 1332140
13853 1332140 1028568 994605 1212288 861700 928870 1001809 1220538 842899 686205 747455
13843 747455 1028455 1038133 865252 1089962 1095531 1054301 963129 1087304 782276 613066 943618
13832 943618 990258 1086185 925741 1043036 645228 726477 798435 999274 1223538 849883
13822 849883 754695 937265 834336 1031799 1227658 730618 750814 1122238 732287 960163
13812 960163 500610 903523 854961 829005 875697 620184 938667 853938 616043 647922
13802 647922 616893 860984 473590 653904 574357 554023 875119 756856 644866 1093387
13792 1093387 749987 761040 793376 630232 617516 438688 798777 706803 812583 706390
13782 706390 668484 990516 790754 466816 778504 767020 776088 642678 349611 760632
13772 760632 598950 740541 739229 720632 575538 850698 677037 958186 448672 691624
13762 691624 567993 733599 924045 500778 431771 732104 826812 378297 794214 309692
13751 698463 472039 353224 518417 560588 375277 591355 572257 692176 451007 727034
13741 727034 507077 772160 460312 598340 719788 416694 570662 477259 628160 707809
13731 707809 765165 572645 663879 692706 589662 513384 401568 668903 872842 264578
13720 612632 473087 730498 620517 411292 616888 753897 444933 416705 449287 858845
13710 858845 408580 300181 389246 195717 557249 289125 467374 222982 386461 567327
13700 567327 467489 623974 344453 625571 267159 483240 564639 690623 345195 569399
13690 569399 610623 365910 420667 325936 222524 636478 946341 566008 566435 519189 307893
13679 307893 550066 198259 560795 521104 120469 794114 604642 343862 412883 630829
13669 630829 538809 360667 438712 252797 617795 520559 545978 546503 286122 328571 359878
13658 359878 348479 463199 658093 304434 496512 108671 444320 357817 291740 377048
13648 377048 800273 26812 426326 393041 518341 461993 583290 324475 347105 431012
13638 431012 529050 507447 228954 401910 412140 500103 268665 173898 412132 333149 321107
13627 321107 314341 432867 169240 305117 511584 132406 257698 186375 514083 476476
13617 476476 405967 177034 518215 327690 268802 352113 291158 399512 573909 12945
13606 274068 280881 318301 361125 272566 353984 565810 485470 224924 447211 137831 549841
13595 549841 585920 400798 417453 301644 165839 338696 329527 451247 402932 235904
13585 235904 140086 359791 345460 592639 291963 549654 273404 139933 187096 363408
13575 363408 418500 554340 262744 285264 594014 267394 372780 254837 292393 393628
13565 393628 105889 429830 87775 331650 -77037 197803 691489 58994 190724 -26828
13554 240211 376855 410618 384138 165812 280508 579021 258062 195052 336299 413986
13544 413986 95812 409745 284609 122780 143768 25739 228216 141746 219180 373129
13534 373129 109241 491325 483869 -8070 -106388 460094 210043 -3924 303709 -305335 268580
13522 306766 514250 328524 64686 6622 253275 219620 59376 304307 482380 136608
13511 330883 231751 622316 180395 402749 39859 118995 207358 378341 272064 -96469
13500 155681 280918 309254 250860 339787 -82 233062 426795 151769 243227 446295 288666
13489 288666 203438 250763 61770 214737 291157 -46689 409376 125722 -62910 296503 463852
13478 463852 346790 210120 393662 192161 -20357 198275 502108 402711 437663 136383
13467 185608 493030 80884 495038 227570 -107683 98917 180403 139710 37620 246778
13457 246778 319798 186216 143606 330859 268221 28471 301835 347056 133133 272205
13447 272205 144809 222068 10271 278501 200559 84983 66882 322286 152436 264494
13437 264494 301209 475081 358899 257318 164330 -65343 380252 254698 237252 261901
13427 261901 484873 164451 239203 153920 153558 -4713 54115 178774 274146 278769 358938 -134342
13414 174961 429743 230132 280451 93951 522553 99687 -91830 -63599 390595 320098 229828
13403 229828 28940 256762 99220 182225 -23095 52230 130387 114202 412436 284383 291470
13392 291470 312270 349406 168842 211479 222302 454848 -260599 202182 121103 -42776 203106
13380 311329 -44344 57696 384778 -77339 131383 178065 134725 363430 87231 167188 556847
13369 556847 33453 204374 254568 -4622 37964 146779 176908 498920 408927 7255 103523
13358 103523 252720 122875 101988 382330 -53516 86223 251510 341028 -206311 -36811
13347 -65692 188668 527876 81779 387351 363594 179349 363516 260083 369490 83725
13336 527104 489597 10519 390942 85556 109494 394906 178604 103667 -57449 199432 337658
13325 337658 114159 -28957 174899 131986 128513 110861 -6580 -113592 370713 127909 348817
13314 348817 284967 -36247 413066 195458 264849 -179098 -24792 48967 287351 300127 -22260
13302 57558 52284 420062 576903 145872 52842 -20699 -85024 -172268 57554 116859 299200
13291 299200 161685 -56792 -24190 8144 176989 -175152 111629 76919 226839 -123579
13280 132690 -64953 67786 334132 164149 16695 47059 -43083 116201 -48476 -32048 -196005
13269 -196005 -38823 -70822 189631 -118086 -103134 -142312 250986 168543 -62373 -99407 187857
13257 132659 365322 -112015 293419 204689 -11624 227780 -19741 159122 -84576 59423
13246 408822 227138 162473 -36823 60318 437870 -285 344352 -63746 230656 -299832 213784
13234 -253200 -89060 189387 27297 -93857 92271 46043 -118119 451261 225524 424544
13224 424544 230518 333812 -205144 -74223 26557 -119135 171825 142664 -34205 60153
13213 957 -42441 -15800 -53827 62796 346877 242202 1364 118057 252502 154181 211462
13202 211462 520571 -187170 189214 187308 14239 -9542 131542 -46088 -34481 -157637 -49529
13190 147708 -36899 172604 -188090 47489 -37146 274220 90160 131689 -111204 330151
13179 359 -101437 -205223 -54668 39348 -88516 202515 -199624 163721 259579 -155694 483071
13167 -272009 79941 92422 -64190 128614 266610 25486 -138601 168076 125361 -6428 -73022
13156 -73022 -58429 -61304 304236 86516 274070 336696 -66007 -40737 98572 438981 128995
13144 -97428 125939 238087 -75501 -27674 310760 130375 307605 -146337 108996 35834
13133 411805 241078 -74269 39012 -15368 -47716 -109835 371323 15870 -198824 713054 -62540
13121 307915 -25316 -86296 112384 -331282 -213434 212941 -44429 119251 207237 121184
13111 121184 70172 151725 194480 19593 41054 90456 -80037 209452 -63899 286181 95032
13099 -150251 -215224 233672 73651 102255 182264 228007 266509 -311827 -133732 7371 -118596
13087 91646 -72502 130705 63077 -26373 61969 17978 -178877 155010 195072 -108193 -27548
13075 -52634 42753 265165 -214204 -20151 120088 127227 -374965 183216 319904 92610 -16025
13063 80269 99690 -179628 -51650 -42160 156860 199075 143715 -78045 14016 -35742 196414
13051 245258 45181 120443 343455 36633 -42895 29403 63152 -124813 118113 114342 98864
13040 98864 -64724 -53694 55381 207178 100094 -69517 196964 60772 -17758 176109 38433
13028 195679 23164 149766 122543 -67269 69349 -543 297533 144998 -136765 -187616 170575
13016 296221 215859 6456 219350 105376 249702 -19920 -136101 359340 108170 -274881
13005 -244110 -141313 328285 239091 289659 102401 33411 153686 34701 85487 260969
12995 260969 -101799 -18400 123852 34841 256341 -1086 120532 51655 197418 67496 -37686
12983 4138 -166524 131868 346953 55270 -203616 -294447 85609 16439 -179292 -107721 -16668
12971 -123452 90642 46230 9228 -204248 177055 266287 -21895 11813 -152596 -57453 -68011
12960 -68011 -112932 118647 -281676 -229953 -229836 109676 199177 108472 19416 184458 252208
12949 252208 78388 -249814 -246185 189409 474516 -167645 -277359 83973 -137144 65883
12938 191588 186182 -130186 393297 52266 -80631 -268322 -51084 -193746 -28115 332450 -223460
12926 -298142 22869 26122 -79978 277517 -55469 14968 209113 352749 -280325 -270573 31063
12914 234882 -541802 43068 277042 -34068 478470 193595 183023 -101072 98208 22572
12903 98725 -89439 -30794 41649 4795 20448 -370671 -123559 51961 144101 -301865 26274
12891 274864 260914 132971 -50717 313556 -186080 -134885 302845 -11893 -257231 -55293
12880 -59872 194322 11888 192524 -387542 26866 -22189 -80437 31891 132329 44410 348480
12869 348480 102854 144584 155275 75557 -180872 -132511 -18122 156986 18760 12518 -251869
12857 49690 36384 -185789 -162893 154048 151390 -92606 274986 139852 242586 27918 88824
12846 88824 72349 173272 170263 2 -96739 -155873 -177278 172797 274184 -101277 -281227 73977
12833 -80981 -209023 -197640 27852 -98483 -167108 128636 -64343 -9511 131101 191675 213448
12822 213448 -46552 -107841 -47691 193403 -193772 227372 358546 53741 -116881 -130866
12812 -130866 172662 -167011 260668 -93562 -303510 -21664 -51141 -266755 60690 -133483
12801 39541 151372 -129172 -193309 166674 -340458 -189302 69322 -53169 353807 -176948
12790 18017 242061 42819 97645 -146522 3949 19916 -39348 -151257 52972 164664 -207668
12778 266432 -286288 2919 -181416 -103551 26555 -261939 -33650 -94388 -83187 67749 -52822
12766 7060 -153430 143981 -387369 -86070 -25042 98860 -330493 343133 -121355 -187737 10721
12754 -62426 -355466 66748 7759 76455 62860 96960 3340 -169374 14836 11993 229695 -227593
12741 -142073 58511 208091 -392201 7948 55195 -294885 312407 231948 246328 9562 -133644
12729 -284664 -173392 130710 182355 -128852 -8944 202194 -84673 -97518 -101124 227526 221528
12718 221528 453928 -384379 82715 -23261 68677 347828 20299 199719 71176 368076
12708 368076 29432 -94838 -26769 78488 70998 123944 155134 295959 93319 227525 9300
12696 29200 49256 -1019 133602 97774 -129540 -232609 -119538 368620 -216388 99613 -87785
12684 -295842 111914 42416 255423 -254525 -21005 135771 352430 -174204 -228895 227294
12673 2666 178745 213061 352179 28159 147081 5751 -171109 224468 238164 302022 118207
12661 48573 -182534 -102817 -176403 26264 168202 -5018 58184 105660 241457 152751 46611
12649 108385 144670 -417760 242742 209930 492288 146754 83791 -39079 -17255 208019
12638 -265784 -89224 -235620 50818 189398 83667 114459 -93273 -51892 202680 160390 29925
12626 -32925 181360 -124463 111517 21798 5774 63567 60426 206713 -138259 98715 -116836
12614 57605 668272 39783 178447 162414 142652 25721 -5854 99458 91143 315673 59193
12602 -17045 95861 173089 117870 47425 -12385 152800 -26014 -91982 196893 223724 37019
12590 11487 -186048 163656 -164423 228715 -29304 4229 -124004 -223634 -101864 -203158
12580 -203158 100108 182730 123023 -22786 52674 -53235 103959 100711 202797 -25400 357006
12568 -53406 -366543 132204 -188995 -76470 -40563 27070 312160 6581 -138457 188696 207673
12557 207673 -244606 250170 48327 4273 -42213 825 -262317 29641 -32228 253529 -145322
12545 -191779 146784 -194840 160723 -123340 -120213 123823 -90825 -125671 64381 -262280
12534 189099 123218 135064 112266 85653 -147352 116617 -221799 -122797 -91089 -184813 215129
12522 -21570 -44317 310543 -240693 12845 75637 191227 143343 54302 -76913 11135 78600
12511 78600 -26156 -274718 114305 -216994 -74389 -39680 -68221 66405 241534 138855 111717
12500 111717 -354841 -223206 -49604 -34326 -18870 166977 168372 -320254 124475 15273 -314150
12488 51427 -89591 114902 123109 261554 262178 3057 -851 124033 338408 300744 -226612 42126
12475 -479203 -87258 31486 53135 -144993 205411 -589 -107559 488490 -240325 36924 -37261
12463 -172008 6781 183183 -121165 46128 -125729 -63207 -175265 -92379 -95182 79464 166892
12452 166892 24850 -117477 -217147 233169 -158742 186419 -132972 23399 -26555 -362642
12442 -362642 -32085 -191147 -32290 9172 -181451 167892 -111551 321815 -266934 -73026
12431 -78929 52050 -56577 -98433 -4524 164778 -42015 -41383 -524322 202616 84258 75454 202190
12419 202190 -122155 -88368 -9774 37343 -409155 -321251 151355 -395333 143722 -12606 -238222
12408 -238222 -72332 -219621 84637 -172283 29053 -64249 -179414 66701 -167314 35621 122252
12397 122252 259877 -214165 -340199 -112308 -131018 118483 150722 -66967 256097 -8145
12386 97058 -80222 372157 -295383 147485 -240217 131304 -151930 79650 43698 99942
12376 99942 107324 -183130 -312874 469158 -155944 -133847 -83878 13112 -3972 -48158 87494
12364 90441 -187706 78800 24729 -223909 -62300 96726 27435 99838 227312 -47973 102503
12352 174872 -140520 -110249 100822 -49423 -31152 63869 -43947 -10028 101179 254769 232820
12341 232820 82064 -51721 -22064 13205 64009 168532 -203711 71266 -126167 140969 295541
12330 295541 119652 78035 2981 4804 240953 145353 30213 62895 119490 -33430 141080
12318 230067 -29309 156057 -60853 278025 458532 97924 112361 -122959 246784 150370
12308 150370 133177 -40174 -188988 264751 221360 112637 261580 137006 -128811 -119638
12298 -119638 168417 110929 330126 48909 48731 179376 -359733 140376 -154792 -15421 -33181
12287 -33181 248942 345018 -163946 -104155 114174 90141 426347 300355 -187162 -113237
12277 -113237 -67014 569403 147877 230455 68290 210186 -151935 181285 -181674 291528
12266 230018 151015 -89677 -99348 183613 -46576 210901 92254 258168 -88099 367860 301584
12255 301584 -107 223587 102459 79051 -46101 9175 -138029 73059 -8871 224426 -161361
12243 -128965 -96362 448843 -38629 264950 74847 306617 477702 88396 -108208 -157848
12233 -157848 174791 -98441 -8696 111242 -200669 -203242 220345 -24434 202825 376210 327168
12222 327168 119064 533600 344278 208289 209269 216650 42515 286614 -32060 186176 -57359
12210 128576 -14826 229828 173469 220165 321508 283244 329590 -49841 461624 479871 255343
12199 255343 328944 157135 498938 453177 478825 106799 204519 140093 347187 428908 -43110
12187 456349 266553 -67547 358255 347137 434380 213631 430719 -18345 -46705 336897
12176 199601 113471 114920 455346 59812 -155612 180069 91272 198728 198271 328241 293935
12165 293935 150987 123777 283839 149897 290914 45806 249099 366479 -119921 330093
12154 -51702 172852 26686 117671 40763 26216 78998 20740 47457 -104330 205368 164709
12143 164709 -57006 69481 -205118 287864 84071 174381 66422 240963 105357 -21778 14893
12131 177415 24011 -280964 31954 -91152 338649 194081 52167 200647 96963 272542
12121 272542 57906 429698 141345 -9016 58098 339182 -1746 392748 -130586 -119328 -314078
12110 -314078 -24571 -149858 90891 -34600 487758 -158673 239172 190752 108662 217 39233
12099 39233 128662 -17687 -70264 -204018 13254 -498542 -98660 23180 -5397 -301436 399728
12087 21132 -24186 292558 -62877 25795 16519 126061 99429 -71173 83523 70675 125095
12076 125095 -117250 285566 43734 134617 114961 -265091 122518 86783 -177064 94728
12065 120112 173990 -104925 -87172 217933 290561 -238035 119805 -7365 -160432 -179380 235239
12053 126974 77661 -61063 163361 -164717 141764 -212602 -144621 -331469 -144171 33511
12042 26913 281358 66268 -258715 -205605 -70379 108924 -228354 -10789 246620 -163796
12031 38753 -212286 224304 -46543 9669 405029 27307 -117607 115208 26154 -262847 -99742
12019 -173244 -438666 144594 -196016 -85234 -109232 -187751 389945 300955 203940 159171 -35259
12007 -191345 -192752 69167 -108232 55310 -51120 -77896 -85665 -199439 -13247 182002 245040
11996 245040 -148146 169474 -102631 -228740 119212 -264740 -66799 -95155 -38022 -125163
11986 -125163 -153672 -242524 -76085 54097 -95145 -246734 109410 -58068 218256 165966 251636
11975 251636 165872 -76999 19825 -152009 116913 -250306 -190413 -123846 -289540 38622 27458
11964 27458 -43721 -254990 -185438 171833 -52095 207995 92213 135241 -225185 -76770 -296616
11953 -296616 -152354 -29850 164013 221102 121365 -35821 10777 -13501 196707 118474 36888
11941 35952 -224234 221431 86232 265972 -91081 185245 -776 -244998 -148139 -291248 -27885
11929 -222115 -110708 62459 -242086 -116471 109590 -96111 -88171 -124152 -153360 15065 4053
11917 -206391 210227 132307 -140152 -406584 115972 12047 144058 34583 88548 -57558
11906 -28267 -19071 -10343 234181 18785 94662 -15062 -142131 -157433 -376978 -177316 185558
11894 -403109 -40598 265849 -228480 -114782 -129000 57750 96039 -70172 113570 112311 170768
11883 170768 -46768 -148161 219814 -3968 208469 -234135 -95346 -55463 90178 -59610 89243
11871 239313 -209825 -31536 -227202 141939 -345926 -245713 121606 493247 -144978 96004
11860 -196561 -91875 -91390 -365627 187399 348968 29183 -398450 -112827 -195202 12010 -205778
11848 -18163 -292642 -36231 -52345 -100400 -867 200717 -28423 -202047 -84509 -46255 185227
11836 -19364 -249975 -39685 -204501 85249 199708 -46426 -81311 20342 -48950 5114 -143883
11824 -93305 82385 -160992 -22404 -99700 -3153 -11491 163620 93979 153977 -224337 -284475
11813 -284475 6220 -128948 -48543 -276284 -52056 -240216 30341 -25644 -126627 -67244 -89843
11802 -89843 -148098 167223 -222258 46231 -5511 48274 -116166 -148523 -243695 -195106 58448
11790 87834 213635 -350617 -133563 -175771 -18859 -248719 -25588 -154 -263838 -129044 315914
11778 -278551 107873 80896 -71840 -49333 23387 89516 -161559 -118372 -230376 51877 194679
11767 194679 119525 22636 -62670 -296325 -171535 -114498 192348 222870 -165421 29596 398909
11756 398909 -70937 63829 -312041 -152 -192654 43202 18532 53425 -50067 233521 -227038
11744 80837 4316 214555 -70605 -130164 215943 221738 -133521 -200775 -227570 -183593 -229401
11733 -229401 -441700 77266 50228 106261 148344 -88776 -52440 -250890 170251 -100856 -21004
11721 17096 -160622 -156521 175304 -10148 -102666 -211547 -199217 347065 -121895 121886 -311287
11709 -25616 -363058 26498 -9527 118742 -154868 -228771 -338857 175388 150 2756 -261393
11697 -100185 -66351 -190391 -7204 -3045 -187015 -15982 -5445 360921 -279351 -25295 -205519
11686 -205519 380970 6542 149106 -69163 12702 -197915 -106935 259223 -188086 94942 -15150
11674 -400516 138204 10761 -16338 -31007 -48891 46618 43015 152973 -83301 211099 81547
11662 117290 -180543 160462 186504 -133023 -174658 175919 -12551 -102769 -243062 207894
11651 166593 49004 121385 -107455 10073 -7396 88575 108880 -120167 165805 124486 -16731
11639 -335045 -355151 -30371 -74300 -31408 -129075 253681 141492 55075 2812 -268778 139797
11627 154081 -124812 -60796 33597 -26281 259255 -103197 212952 362420 124586 82813
11617 82813 -52545 -38453 64225 70337 -52450 -19793 -63103 188302 -161399 -362123 82502
11605 336866 -32354 -129906 -202361 -156429 -85794 304470 365008 8994 157573 14177 241698
11594 241698 -83079 362027 230897 67745 -117483 -221399 -242500 -289645 -14938 34274 -174594
11582 -65176 -117010 81947 -12437 147903 -283468 -33337 234469 75407 -97531 478630 -122025
11570 101974 -150855 248348 78608 -87667 38904 281532 29239 165561 231337 155320 -90234
11558 -206874 69192 84003 -204473 102100 152123 171346 330771 67285 -213674 100941
11547 235087 27273 394466 -301030 125477 222200 31829 -61570 33088 13767 17289 207811
11536 207811 238462 -57495 -68183 191455 155409 209174 127595 71285 -21484 74334 -39270
11524 27835 -6097 294910 -94015 50323 177878 -33973 -45903 240320 210690 74048 -41948
11512 -36645 -8099 -311860 158910 203659 166304 -12065 202041 -55228 -47772 234389 194430
11501 194430 -58548 134610 50716 20971 -78951 10797 106911 -40659 258905 202068 -191135
11489 -99512 132442 180642 -164656 63989 -48351 207832 168353 217727 175989 -13035 315472
11477 -65186 223898 187693 9231 -108093 130139 97650 208504 81969 267869 193522 -133957
11465 155375 -73772 -83759 207748 -245450 73425 -98638 54134 16200 5404 -5442 216516
11453 357404 128241 27210 154230 -154708 71579 70811 -109680 22883 186414 408803 177514
11441 142976 -61157 -33103 -67753 24673 -24164 111548 475254 56310 -227436 61519 112286
11430 112286 162722 -6103 126 -182663 53028 -75242 -47582 -100630 -137489 -245721 27870 196491
11418 196491 106517 -43805 54840 -94055 -176549 -143190 -270613 -77816 245256 -431281 -4355
11406 -225037 230234 -271723 20411 37051 332957 -132129 174382 306753 -290812 -137967
11395 -85480 -218005 93793 273016 -223118 44758 217555 13228 -1490 17833 144706 293747
11384 293747 -142949 -155606 -292926 220270 317861 -238314 5531 -22504 223321 -143543
11373 8 125221 -2713 -305060 -5367 97089 -137065 -28550 -12198 175440 -286595 211460 -185410
11360 -132731 164244 108475 89906 254963 60894 4295 121609 -147113 71027 84796 -6662
11348 25594 -29392 94484 -183934 59890 85807 -2295 -511918 101430 106859 -23933 361921
11336 41123 -8468 -82366 -206317 41975 -289642 -83938 -148507 100308 -139951 176109 -151685
11324 -188825 -103851 115473 89785 12753 -432297 -5244 134906 119558 -412808 -140019 -147814
11313 -147814 -215963 203986 -203299 -27059 -152078 92738 -237228 -218233 -322546 81887
11302 -49781 54009 -186767 -124898 -6084 86638 -40675 188237 20605 -130972 -227430 -123256
11291 -123256 -238165 -73418 40473 -77952 -34799 -102213 -196682 235978 -56525 855 -70344
11279 132545 -81319 -50742 64019 -99020 207501 -321345 119957 67536 -277673 -67709 -335324
11268 -335324 125384 177464 -46544 316991 -51251 -105375 208714 -156893 -239321 -191166 110877
11256 21561 144214 -302981 72330 362384 -38130 -277717 -279437 -70549 -145147 -311551 350244
11244 -24443 -276599 247074 -158886 237678 59000 -123457 -18012 -140285 -234284 -199394
11234 -199394 -23844 -61037 222251 95959 -312819 -94860 69769 49515 89015 27349 41553
11223 41553 -53627 104680 -379579 14058 -154439 -270266 -128520 -366756 -6586 -220723
11213 -220723 69403 -83246 7005 -303223 -26163 264701 101337 13040 -172965 -374128 -363678
11202 -363678 -200979 -291177 266489 -198632 15249 100474 -301010 172657 -76930 -88006
11192 -88006 -102469 -236639 -306777 -225924 -52204 309149 -84832 28643 -346955 111934 160336
11181 160336 302810 179334 -182564 -184632 -110899 85160 -196206 -160830 24786 2587 25494
11170 25494 -274908 -27467 249825 -169450 -315068 -178999 -33338 -182240 67666 196373
11160 196373 -74075 -103101 179557 150826 -48531 -102255 -105805 25648 109356 393500 227871
11149 227871 -97488 -327861 19630 -120228 -74804 63058 -167226 235341 9520 -225728 41308
11137 56432 -92135 195823 133588 -122588 167101 98832 -72977 51776 -44504 -65754 152029
11125 175897 207343 169137 284755 274741 329120 47221 271097 26149 -263650 114647 -198193
11113 123542 -168428 263244 -19549 -161808 -1323 401780 -165790 186653 37825 91895
11103 91895 190411 425950 325813 106493 56044 204383 -44802 308852 182876 105692
11093 105692 74383 243988 217253 81661 -247434 139955 618170 358277 247444 199819
11083 199819 367986 -193588 587012 425457 216992 379925 182404 384332 568013 259870
11072 254895 341306 289201 147608 450199 191298 237229 493279 522811 319753 480224
11062 480224 655391 597429 229277 209238 631637 868909 523149 380947 788646 636561
11052 636561 765393 695510 877431 725059 546673 1145916 1064018 779362 1087139 878488
11042 878488 934051 858927 837143 961171 743137 723194 844831 1123826 724771 1035202
11032 1035202 898925 597827 699903 925462 691408 833351 963314 848965 670243
11023 670243 838067 423623 954495 694330 629863 684847 715489 687476 763376 818191 742990
11012 742990 615514 688699 855582 580939 570809 759863 535165 713917 602910 503607
11002 503607 607679 549034 584364 502338 761141 550120 457512 644762 596807 889813
10992 889813 551952 499128 639504 788190 543438 701467 800823 1039527 1021695 962448
10982 962448 1248304 1032675 1203139 852477 922795 1204425 1056838 1319485 1812004 1611331
10972 1611331 2028342 2387265 2372753 2593969 2609527 2571646 2602709 2506620 2103344 2030742
10962 2030742 2241047 1855464 1466730 1433709 1611105 1121753 1457241 1263724 1510633 1491012
10952 1491012 894346 820447 996169 827683 1272698 660304 618677 513459 511639 121007
10941 373279 515146 142539 -320127 -42442 275606 126780 130824 166748 -229383 55557
10930 363245 188604 -283534 168549 56063 -270032 14672 -167499 18616 -60181 -171744
10920 -171744 256913 335668 -269173 -282787 28833 43498 162417 -85935 -280237 18270 -16612
10908 46844 261284 253736 -139439 -214348 -252320 106641 43802 9285 -163614 -19120 -41508
10897 -41508 -269318 135873 -166307 23709 66103 -37159 -430144 219353 10833 -111346
10886 -131459 -424906 -35553 4268 -300030 316261 -259635 -251403 -413100 -133689 -115029 -107626
10875 -107626 76925 -157514 -217827 -186688 -10571 62113 -251725 -236693 -18559 31447 -177102
10863 302207 355859 117022 53693 -275445 96712 -40119 42672 -167455 18371 -215272 18421
10851 45454 -99595 55733 245548 -218698 -170757 -133803 -64855 -124991 107971 -45405 253571
10839 14717 -192763 24197 -33463 166085 57393 74405 61370 -132251 7504 -124513 -50309
10827 -180953 -277259 48617 45931 -209693 117720 -305920 45794 193268 54952 153761 -297807
10815 58760 101118 234461 92510 -38544 268626 -317445 -318309 33883 -116982 -169820 -105658
10804 -105658 -145664 -64073 -302219 -4583 113695 -216687 -168485 -95531 54720 -39164 216833
10792 5860 117022 -30204 142969 -179811 -147650 186151 68136 -53002 -73095 -40583 -31320
10781 -31320 -252203 48473 155875 -269302 155868 -105150 -66074 -145145 -15827 390173
10770 -307098 18708 108222 -34645 -19097 -135025 70728 -218667 284483 240658 -229468 -132121
10759 -132121 -2447 -136545 197012 -82253 -61206 -135994 -140155 -105301 157457 -389032 -4437
10747 25146 124929 -454494 -159069 -272182 -19120 -470948 -40666 -89813 -210431 102168
10736 -418892 -108661 190675 46060 142272 237353 257527 -77874 -150462 194182 -104834 49365
10724 -148487 -107719 100207 111730 52341 -200452 -135795 -56344 -25988 -240416 26786 55850
10713 55850 -47896 -94228 -231439 -32516 -48325 -328287 -50195 -326687 -41132 -259693 64759
10701 -109792 178671 70636 -61783 143710 103961 159673 -22115 90082 266698 14346 -212366
10689 -274485 83542 -235753 -49429 -64713 86444 92574 175500 -8945 6735 -263283 -182627 -62010
10676 -236954 -326749 8243 -99155 18836 323704 -107485 22203 76430 -216972 290763 393659
10665 393659 -254780 149876 -2762 -137697 -5680 17342 174890 -123235 -256284 -23155 48331
10653 -73423 -345970 -242850 81715 -212549 -247323 -73142 9614 -20797 -84780 160879 48209
10641 -152228 84461 -456756 -395606 -25824 184707 -330387 -62819 -64741 -316997 -28525 -114708
10630 -114708 -279450 -29855 21668 -55968 -299224 52218 -82234 -190875 -565279 93452 -193575
10618 -62178 -82077 -23393 -94190 -242102 -129971 126356 -70115 -199146 -114036 -172721 20428
10606 188030 -149077 -38741 156391 112742 -64147 -17672 36315 285715 112187 -85392 63050
10594 -155328 -12473 -197345 35206 -265604 -227005 -318843 -79960 -26655 -358607 76264 -101641
10582 -129910 88190 -214851 -84002 -25021 -139006 -145051 -112111 -61821 -1244 -138363 209214
10570 157261 -352674 -17529 -182834 159031 -81441 155632 143274 -138449 -140393 -251155
10560 -251155 -207281 -94939 -128752 -52573 -289766 102174 -194315 108020 -73880 233293
10549 154369 -92062 -33759 -161083 74164 190689 64250 -294266 -212272 25336 -13972 110410
10537 -143992 -19813 -149273 144704 86123 261588 -135120 -161440 5612 -129204 -21750 80523
10525 114095 8818 166973 -29059 67436 5052 -147951 -346672 68229 -11270 -59916 266810
10513 -15568 17962 -379341 -411538 -334293 -250456 -53641 9967 246237 288967 -119809 197241
10501 43492 92836 -46175 -59108 -251440 81169 -90019 -79344 -195063 116517 -241018 126889
10489 -239206 117990 217984 177292 9180 80511 115846 -189749 -92933 179987 -35800 190958
10477 663630 -28996 122538 242637 68752 164794 81906 38943 3956 104091 269378 141086
10466 141086 25871 17072 163745 -119341 343112 252554 -205177 -82418 85332 -119102 261610
10454 -95464 -124906 -94761 23217 -67923 235844 -51688 -61902 -42457 -82733 -236906 78826
10442 122759 -67116 -182658 15585 -102735 -74395 -65434 -213234 -4609 -116952 146834 213634
10431 213634 153865 -165851 20778 -121978 -38033 69210 57887 39941 -80536 11933 -149667
10419 12350 60240 92376 -269141 9643 167325 -90940 -28903 54375 -42541 -150258 303774
10407 10278 -214261 155367 -112069 9615 236568 -214835 -151222 -60399 -343881 -124728
10396 208599 -9251 -43002 92664 -12492 194033 11630 -48437 -226336 200321 134649 180530
10385 180530 118479 -48068 130173 287727 142253 89326 190565 189241 206685 -35666 -43520
10374 -43520 469142 158338 443198 273770 208719 172855 105336 220501 230913 360948
10364 360948 466997 339709 320852 162064 427408 106121 394735 210006 490558 174978
10353 225429 309857 145185 162665 53758 497163 120132 363429 338874 557895 419985
10343 419985 467513 284309 431365 395696 796819 182727 289808 558749 169525 160568
10333 160568 -60601 271445 202774 118010 68562 -32575 12573 166505 276430 96353 353350
10322 353350 89265 400309 -8539 -14845 5264 244584 155484 289490 -85274 111627 17407
10310 101944 206409 96176 15704 -143964 6795 -251142 -25213 145198 -96797 58301 -190669
10298 101286 -256500 83981 -90951 297618 -551186 -341217 67218 -267086 62816 -52449
10287 121684 15588 -63097 -146998 113718 32543 -64287 25421 -67011 -36736 -13845 112459
10275 -91634 -171793 -188577 -223629 140902 79461 -63856 123702 -313809 -13515 -236149 52407
10263 -253606 -24667 -65686 -226031 10026 33284 -316412 19404 381770 169124 403891
10253 403891 279057 171345 171794 -139210 -14790 -85140 115462 -242088 181196 209677 86744
10241 24481 102562 -313288 55734 -182806 -195920 143185 -211338 -31414 -49187 92320 -266280
10229 -213738 232367 141397 -112738 -129640 -115422 63546 -104194 -25060 -27674 13925 -188820
10217 -97665 165284 105218 -23242 -96695 171548 61767 -152032 -64569 -175771 15807 116023
10206 116023 142520 199397 -65181 95446 -56899 -214847 190436 -232256 140806 136546 -14504
10194 -364656 -231331 -363607 36033 70995 -112930 -163971 -20516 203313 -325370 -6874 28501
10182 201404 -264085 -24411 50376 6765 -166407 -231841 -9621 78429 -149700 138161 80170
10171 80170 41513 296702 251258 -356240 45305 225459 131524 -22014 222129 -22760 -40023
10160 -40023 363871 -156140 -110812 -29901 156928 37728 290231 -239902 240800 133152
10150 133152 141356 -350852 63725 -8865 46201 -150519 -171694 145746 -52424 89215 47671
10139 47671 -64982 -58333 248990 -148289 -136818 -159929 -69212 -339274 -169358 -692 -189669
10128 -189669 157682 1342 195725 -62978 126198 -126993 -45450 204004 -284115 331688
10117 77442 48010 -209649 -103951 -323600 -43349 -5249 -36334 -200717 83765 -273382 -251958
10106 -251958 -357529 5324 -57653 124151 138146 26099 38614 112199 -324877 -44266 -237171
10095 -237171 -262964 191524 -59730 -209218 -38883 -88061 -271624 -303160 103765 -160516
10084 113779 25974 -99145 29030 -225061 -98770 -180222 179928 -219538 -287650 -140228 -12270
10072 113324 110891 156784 -294295 -189259 -165092 -83195 79790 -151585 -212075 -499318 -126968
10060 262256 87295 -231973 152745 -54969 197137 -442 25110 152867 -61077 241206 -175791
10048 -65181 -356925 -113612 215998 45438 -215461 41601 -323817 40102 -87258 -70178 -256314
10037 -256314 -265278 -8602 -49571 -119670 145946 -115959 -209999 117424 -36122 -208874 27582
10025 125335 -37657 -61740 55441 -77074 -394110 45500 -60258 -418079 -114699 39976 -269914
10013 167844 1473 4968 75990 24973 -175151 -133582 263242 -125133 5902 -30415 60837
10001 -7015 -121930 123191 -66210 -112606 -119880 -302597 25175 30884 -1885 149502 28550 -230108
9988 161189 -117408 -121370 338858 11776 18962 1899 -290186 -114750 61755 -27388 62326
9976 149059 -82656 -127625 103553 -132177 54044 -93442 -114249 2479 29120 -91067 -60526
9965 -60526 -148381 -153099 -145363 -103360 63931 54000 -85750 -52656 58834 103268 -224826 14767
9952 161431 225289 84609 -179245 36840 127976 -126343 -512520 -250176 -279231 -295653 -275126
9941 -275126 -457947 82735 98649 -131320 -139592 -45545 225318 36552 -248640 148323 -178384
9929 249654 20381 -123628 -159873 -259668 -129718 -148967 149204 -46797 101667 -140378 -198752
9918 -198752 209347 382858 -345742 -56801 -232839 -40541 146364 -295381 112168 -241953
9907 60099 -301649 -63160 -442464 84938 -130021 -271458 -15352 -322014 -111775 -58057 -122801
9896 -122801 -304501 326504 -19189 -121767 -84913 -31903 -393884 137932 -178605 116664
9885 -68752 -176665 58854 -141408 -53005 -97628 -92033 20492 33283 -17771 -207673 -26881
9873 -5337 -104499 -71683 -207332 -16001 -255329 69430 -192219 -121987 57317 -106225 -53081
9861 206700 83571 -22862 -167490 -392121 100869 34589 63283 149902 205854 158713 -40159
9849 -214010 -321841 36617 103847 -144251 -268574 -88632 149868 79736 -213262 -151653 -87458
9838 -87458 53760 34418 -6252 423002 20309 -80190 -137094 161154 -239975 -88434 123975
9826 249222 -67188 46669 -497264 -91527 -78692 62243 -156864 -130727 -89738 -245827 94436
9814 286487 -375549 38989 121337 -375133 -69883 -13181 91476 109903 102519 78081 -39034
9802 202002 -152105 -218450 -94456 13350 -148750 46634 -106608 18909 -521097 -105603 -225797
9791 -225797 -39583 219150 118974 143302 -228162 -171946 -168074 266423 -60000 -268724 57422
9779 -64186 -117814 -2152 35309 -41589 87224 41917 87368 -153264 98223 222618 71261 253540
9767 253540 -111054 26158 -99257 -80850 -145772 -437394 -68930 -326525 -152235 32399 -92315
9755 -131942 -65879 -67005 -39575 -82839 -301866 36506 -345197 -372502 91350 136519 -267863
9743 -367881 316516 2054 95903 41084 -224468 61761 245584 -137459 338082 -81333 93141
9731 -241252 145460 -271523 142919 -212542 -40377 -475798 214765 201424 57576 52743 -43828
9719 -154595 60194 384636 -315751 180244 -203931 -245472 -163269 -293645 234710 18683
9708 -75327 -63461 -68902 2777 75733 -318019 -400543 -185966 158131 48842 91967 -87355 -323086
9696 -323086 138778 -202360 -28064 -299964 -42959 77739 -31812 24953 -75860 -157279 445505
9684 3559 -46761 -326084 -20059 -259103 -13538 54411 -135642 99850 167008 281942 154954
9673 154954 31568 -228521 -192083 -551436 -274048 -22830 -117563 -350310 -59817 -109407 -354595
9662 -354595 420657 64128 -56404 -116421 -107813 -241265 83371 -50262 -169575 -186675 22588
9650 143904 -226754 -285535 373518 -429497 -56730 -30927 -257025 122795 109267 58104 -76848
9638 284607 -263747 71446 -307386 -296621 14006 124518 10627 -56605 -174967 64210 -16147
9626 -91416 -34252 -21384 195832 121726 103985 273066 -27753 59808 8169 28335 200251
9615 200251 -4 -54728 -252889 -378618 -253233 14920 -230113 -108113 -231615 126639 190426
9604 190426 144586 -151436 -254528 -329440 -172097 -330110 15319 106711 120547 121647 -202962
9592 -15715 21491 -86087 -145967 -161760 -120431 -76421 -255351 42176 -91746 -129841 -288323
9581 -288323 -208549 164223 -160562 -33955 -176501 -49625 -107394 -170851 -256709 -169243 47461
9569 214649 -117327 149755 -70093 -14326 -176472 -173785 341090 163700 -68760 -26518 9622
9557 -131705 343125 -52924 -265938 288658 79138 -19065 -150788 164138 -185783 189609
9546 28884 -348956 -485978 -3526 -281034 149836 -371949 80488 -76364 -88920 -128435 -241733
9535 -241733 -58232 -33237 24125 -53186 -104392 -344092 -117384 -137699 56162 -85667 6414
9523 -204072 359092 236375 -150855 -35195 -206825 -278444 -197617 17654 69260 -84419 13015
9511 -426086 -205216 -179263 -85423 -107018 -207204 -216724 125145 17123 -310096 -470384 8087
9499 -337964 -241537 95276 -195667 -81319 12057 -475710 -111325 116277 143766 277552 -103734
9487 -24371 -188765 268489 74201 -73507 -168832 -438736 22708 126331 -7587 -131681 -78980
9476 -78980 -16820 -470243 270239 -67983 -261986 98356 146789 23334 -27721 -227368 -155842
9465 -155842 -298767 53229 147731 185107 73290 -106067 51661 -145141 -353627 70699 7114
9453 68562 -71245 688 -37710 -274629 198983 -188116 -348031 -183659 -127568 -226596 -170102
9442 -170102 87931 -93063 -257150 333152 -43587 -184437 -448154 -163628 -171723 -790 24869
9430 -162 -97767 90107 -130259 164602 -129778 -170644 -166041 -214690 -1460 95236 62525 40726
9418 40726 78076 118598 -150640 43842 3767 226422 -259466 123432 -188048 -270945 306161
9406 -112911 136638 -51970 -219968 30025 -10641 -143642 83715 -4231 -111920 -217601 124700
9394 130547 -144815 -24321 96714 -79430 22705 52442 -68661 33334 -106347 -32957 -61314
9383 -61314 -234051 139800 -164119 22464 87067 -161375 -282638 -12011 13221 127080 -141678
9371 370485 52864 346915 -169450 -103122 -5686 -143465 5008 338607 -203179 -206377 -11013
9359 103908 38464 105298 50386 349623 -27428 104494 -96789 -7217 -130274 -129793 -107998 -96303
9347 -96303 8996 39473 45462 -142009 -240799 -41 113915 -98823 -178275 -134825 -158953 -242415
9335 -242415 -202240 -204165 -63832 255310 -50283 -185029 -52205 52794 -230809 -236274 -78187
9323 -241470 40556 -409471 -361846 80011 117356 -42915 -123270 -157131 148967 -364952 265047
9311 -135761 -40233 89183 77090 -151908 -52162 -2437 28539 25767 249152 41247 98453 -46028
9298 11798 -140028 217813 -74190 14736 121610 -164222 -83533 -305183 -32276 68826 -227162
9286 243061 -65728 -209636 21136 -121554 52548 -152643 -221911 -119143 -51750 -66486 -390952
9275 -390952 107182 158305 -142875 287450 61755 -300481 -196261 -54514 -64952 -23173 131549
9263 -14423 137551 -200065 80654 -75746 -33867 217049 -90414 95615 -34543 327349 102558
9251 -354040 113088 112602 -221436 140180 -138796 -50178 -172604 -252618 -126550 -212015 129763
9239 32315 -29353 -23807 -158970 -89418 -73754 180572 -272705 70112 -83230 -87925 -105753 155412
9226 -602849 -74590 -346900 216607 1909 -248434 -138215 -17985 -53679 94828 -120744 -177001
9215 -177001 346580 8997 -194728 235630 -60387 -131746 2878 5246 57403 -89010 -1584 114674
9202 -240579 -221188 -228486 -54850 -112820 -77029 4940 -155521 154315 32613 -18120 -116475 31494
9189 -150987 -136175 22637 -30615 76505 -142196 81565 -48008 -144499 29893 -172824 -217887
9178 -217887 -42972 -157260 -216995 125635 -19592 -120127 -98648 113124 7682 464603 27316
9166 5679 -247376 154925 54775 -10670 -103758 -258655 41757 42418 167645 -131314 -295112
9155 -295112 -162815 -204852 21851 -185631 353045 -98641 -78344 92959 97762 24941 -23094
9143 -160540 -113605 30796 -132671 -279883 -156917 -20752 -20988 -136096 -252970 81859 176986
9132 176986 -194493 -179057 -223275 -284211 -24438 -353486 -134215 -50051 165742 607 -8940
9120 89707 -96913 53030 -403149 -209445 -33526 -8228 162879 149806 -290270 181101 -19806
9108 94197 -111573 118377 -59467 80370 -177412 47985 33924 6972 -147556 -64934 46965
9096 -184880 221343 31711 -194745 50139 52971 -372187 -378236 -61933 -75102 -55950 -128834
9085 -128834 -120572 89099 -277044 115159 -202314 -13769 -237730 33852 145203 -84128 11838
9073 130093 -1569 -2932 631 -178967 24303 -60870 -306294 79674 -24732 -32046 19022 -92218
9060 226235 -173025 123516 -89947 40327 206304 -48898 216992 255152 -1500 -157330 -73739
9048 -267880 197048 -320682 -241795 225591 -23817 105119 -379349 9699 -53463 42942 -292515
9036 74422 -27930 153633 129693 -137806 -268925 -315731 140473 -330633 53367 13250 427526
9025 427526 -142002 -297586 118842 102911 19487 -53683 -205530 -258096 19211 -171422 -145361
9014 -145361 -297826 -235193 -212365 -129424 16151 411064 55596 49351 -133818 -58815 -182657
9003 -182657 -263280 -128068 -58428 54811 24087 36613 -47031 -89467 -398559 137433 282531
8992 282531 228445 87964 -125939 39611 -174690 -521437 -35559 -142193 118188 -246700
8981 4215 2357 41029 -50378 168508 -55912 -48154 -7577 125806 -78294 -2326 -285181 -272342
8969 -272342 -223171 -330276 52032 -96855 -198900 -249760 -80473 -108046 227394 -109871 215548
8957 -32092 89731 157000 -183178 12913 -185019 256333 -127171 -130093 27867 -54875 -251646
8946 -251646 -79478 143288 -923 7644 -183034 -246443 13492 182786 245909 -121330 -178339
8935 -178339 -75057 318922 -310589 -175904 239310 181584 -260874 -63415 -69482 51824 8123
8923 -52039 304283 646465 1125609 2190487 1509742 1091900 533702 222580 -115007 98514
8912 -227094 84123 -66482 -39813 -50784 -138026 -207510 72619 -83527 177747 -382927 162946
8900 119680 -114992 339897 -27337 -366413 -350702 -360372 -273943 162198 49916 183074 -112262
8888 43368 -18935 -285726 -216603 -294817 13215 -167796 -156392 208285 -186912 101412 -61345
8876 -14208 -99095 -96742 -13058 172386 -147893 83816 -88689 -186680 -212054 161899 -293275
8864 161639 -95305 -135717 -14475 -456290 -168087 84589 -151988 -122151 -227737 254288 -148721
8852 182953 -379191 -63391 -186107 60475 193971 -139145 -71213 -110714 -177997 -265041 -287025
8841 -287025 72518 86434 -82854 -23503 -73265 -85817 -128221 281977 -14849 -36140 -218377
8830 -218377 -346796 181861 -71293 -93753 27084 41249 84970 29110 -58094 139158 -94835
8818 -214728 209009 -73123 -112779 2874 12752 -21031 -61080 -221648 -87445 196173 -138612
8806 48452 97537 -228030 -48565 -513189 65049 201792 -66691 69940 -5502 -16936 -379429
8795 -379429 -187320 209568 -40168 -89156 -13009 32831 -123795 -37499 -166830 -153166 -203674
8784 -203674 49490 -236742 -104361 81839 -6891 281847 34051 96850 164273 179854 -157132
8772 115865 32077 -226801 -9631 -193814 270770 -172388 258290 15314 -272615 -213238 44064
8760 -21269 75216 -24640 305208 -30426 -71309 -154339 -93491 30896 -177295 262954 -236709
8748 238193 5730 -197573 176549 -313750 -49081 -70979 -198960 -219257 -10582 -102799 -160466
8737 -160466 -28960 -47607 102916 135951 55492 -175578 -91430 -177039 -217131 36866 -109373
8725 75012 -35922 368038 109446 -43010 -30023 300818 -172763 148603 -368037 -268529 -79482
8713 143610 29369 -160848 -128389 -6908 115655 38020 -83880 -194336 -346239 4536 -373942
8701 401165 193070 -1039 -61890 -273315 -199372 110328 47658 45018 260719 -30189 -82542
8690 -82542 101831 -108469 16733 164360 18778 -565106 15376 214738 -37431 -89440 148862
8678 -174272 31791 -1352 -339142 -216018 8747 124138 -52820 -203954 39206 -180046 95720
8666 141821 167832 -291579 -65208 -58587 -112759 -122162 -421409 193958 70479 63177 159622 203523
8654 203523 -169201 -47429 -383810 -276484 -186637 -220139 -26747 205549 -134619 391099
8643 -72668 240442 -80910 -124005 254165 -157458 -91252 36591 -104345 -225046 -253026 24483
8631 -273163 -119602 -238292 98295 -89729 -187661 18963 -104975 -80353 -111533 63161 -79319
8619 -309328 -81335 -126481 -13496 -24486 -162024 -193813 97964 -149409 133717 110315 88823
8608 88823 -207092 -101414 -243038 107627 22702 -198815 -6515 -33669 151872 3259 106488
8597 106488 362 141982 -115906 -176927 -171365 -43622 46580 -68840 84104 -175744 -128449 -160982
8585 -160982 62255 108976 -417706 299490 135965 20962 19578 313007 37590 -506586 -30927
8573 -210042 -262743 -85247 -138987 1998 176408 147690 24686 320870 -59527 105621 -271519
8561 615385 -250452 -29253 81045 -18632 -22840 -1298 321395 3463 -273008 120426 -117976
8549 -19502 -105669 24104 -46354 -60761 133435 142898 -119079 167525 103579 -260381 -272177
8538 -272177 70931 -188153 97641 -152488 -215658 -284131 46814 -92851 -366528 -32952 -428295
8527 -428295 84852 -41799 -219256 -53083 53840 -253492 150696 -21939 166109 -527760 -142867
8515 -166507 -164135 23106 -338489 109982 -13628 -289911 35647 -392545 -122420 121466 -183124
8503 19684 -128751 59168 54922 207909 -27860 10030 307951 -54494 159772 -6048 77283
8491 -459387 9237 -129961 -138162 -171132 -183107 -217894 -64206 347391 109592 -175306 -233723
8480 -233723 -123972 -140787 -129431 -169315 -256408 -327691 -182364 -15523 -84876 -185761 -211757
8469 -211757 139339 28969 -157742 -223155 -225216 -242075 187497 185142 -145148 3868 121146
8458 121146 10593 -61068 54044 -36799 -11245 -186553 -67651 -49735 278206 62154 -149018
8446 -85883 -53667 201156 -286854 314357 -188076 -257414 30901 -476294 282860 171269
8436 171269 10479 -112005 38554 406315 73820 -265141 -351596 87961 34230 41936 90049
8425 90049 -197018 -42711 73175 -11447 -78920 -129880 122155 143218 -40532 195571 -189373
8413 -220064 191768 106091 207794 -147058 16376 -17234 14875 10488 -142412 -295463 -206983
8402 -206983 -205081 -107931 -225967 -25612 -110487 189600 -225246 186732 -297451 142 -130901
8390 -39462 -209770 192898 341919 163207 -205629 57896 19810 21811 -197010 17398 157000
8379 157000 128681 160111 230395 46190 -428203 -7204 -462544 199845 -38120 326564 84836
8367 -201249 85670 -83178 -473939 -345647 -153495 -272768 -126704 -81163 -282945 -153382
8357 -153382 -52375 -150659 10595 30676 38296 -145349 213941 -96414 -74256 42895 164765
8346 164765 -122045 -57391 134694 -51618 -130495 -223208 -78402 77822 -92983 113486 -19327
8334 -266324 -172205 19680 -140654 -255052 111769 -21555 26532 -358808 133343 -283596
8323 -343969 -205754 -42462 53388 -42277 -35516 -92404 232623 95622 13190 165495 23086
8311 48972 -186006 -18056 91045 107078 -229409 -116753 -69823 21511 -54338 42158 20676
8299 75942 -315273 -28010 153312 259460 381495 37526 20847 -150300 142676 21880 -290631
8287 93725 42235 -140850 -251574 20333 116985 -11839 -68275 42093 -102023 119844 -475432
8275 95509 86460 -65106 184856 -86473 -68107 -254801 -17293 -144108 -21296 -328062 77659
8263 -338516 26063 -180928 -236285 -224968 -48337 356193 83816 324946 -145624 -22509 -65040
8252 -65040 -268547 -99274 -147562 134426 -130607 -161251 155557 -431498 1798 125962 -228994
8240 -68337 -67563 -83773 -121662 274152 -134388 66967 414502 -129810 -190372 -190692 -60397 147288
8227 -19724 -29610 -318923 -293430 88711 -80107 -98827 4361 -1771 -43687 115782 -9205 -98190
8215 -98190 -135635 47335 -413581 -238376 134849 116438 -204992 -59896 113307 -60075 161826
8203 -147446 17834 -157773 138727 -74047 8229 79848 63093 14475 15270 213665 -107273
8191 -324068 72595 48733 -185471 241712 -398471 -8278 -193459 -193837 -53561 -61865 -214937
8180 -214937 180397 84695 49008 47404 -15046 74690 -210983 -112271 59898 -6750 68839 168628
8168 168628 -34623 -113806 -167792 -269128 -313061 94101 -68384 -128785 3274 79857 16591 -154743
8155 246716 -370396 -304986 -233732 47167 11744 -161549 64071 74454 74490 -285359 -137212
8143 -53414 156831 204972 69021 -57281 -197930 -229052 87467 -227198 -162255 -149885 -136794
8132 -136794 261007 -151711 90481 -82117 -74087 -155559 -357742 -97814 -293380 -46558 -108357
8121 -108357 -449267 -34330 67000 -287166 -121184 246249 -195023 -348808 -113808 -145787
8111 -145787 7160 64619 325150 -267394 -151491 -128879 12786 139539 206594 -33313 -12561
8099 162908 196855 -49076 38365 56112 -156243 174747 -242586 -11051 -167189 -233449 321524
8087 13137 31031 -337543 -217552 -218862 -51022 134160 -30544 155357 -125505 -149284 178315
8075 -160538 7714 20481 -216457 -418589 85881 41732 -7619 -350372 72044 124051 202490
8064 202490 263450 75608 -20874 -57726 -197020 13327 -41904 -153 -382075 -283103 -35262 197918
8051 -258449 -61063 -39883 -42014 148542 -212390 122891 -90943 -131098 123830 -57034 56493
8039 120038 49755 -265600 -1130 224399 -38112 -224301 -91664 -99986 -74985 -133757 197886
8027 94168 -11210 -150623 170699 -2988 -69822 567142 505 -22279 -107414 1772 65629 -7899
8014 67171 -120209 336457 174790 -124924 181171 259155 112702 -1083 -135563 126762
8003 48448 -15880 -227608 84051 -171230 26104 358326 -306286 126716 332473 -71920 -174519
7992 -174519 -1508 -22285 -89237 143739 44016 -152221 24830 -7338 12734 -153760 -11705
7980 -301479 80952 -231965 -97570 -168399 -195018 -115126 -275701 -261718 15243 -86370 -250870
7969 -250870 -97574 272234 83736 138322 16171 210546 -93577 -173470 189786 -65578 -32723
7957 148001 -113826 -34119 -62689 -157742 190613 -78707 107192 -65727 -43212 -231232 86631
7945 82185 70148 -191231 -44526 -290408 -31265 -164805 -155688 51466 -55787 -270289 -57508
7933 -86375 193026 -74261 4572 142310 13921 -132459 -50481 -15466 154924 -237467 31326
7921 273398 -48823 218985 -18512 61536 192697 -37731 130593 -130165 57271 38025 -66454
7909 -207671 89561 -257771 -178801 -77402 115016 -180194 -5569 -143532 -33412 232958 -130691
7897 -481857 -63124 -17445 138065 -120969 31661 -138631 -127470 28301 -121194 -232536 -208393
7886 -208393 9407 -113194 274474 -31525 -151066 -21267 198261 350092 -27472 -95799 -8355
7874 80143 -308838 -154703 15917 103545 16232 -86868 -267871 -66371 15303 -15993 -145066
7863 -145066 -219149 -366798 2948 277663 -58887 216131 -25896 -106600 -73266 -212963 -121322
7852 -121322 -128687 -214790 -78498 162789 -24016 4366 84487 6550 -25204 -44718 183091 -371492
7839 19338 -105682 -142979 -170734 -80294 229566 101472 70174 -166900 -217646 -22366 -181450
7828 -181450 -12229 -26882 179809 52176 -17314 -60010 -37609 -182751 35166 145637 -285102
7816 18290 -131624 -313122 189236 74280 -200982 -164374 98294 -29031 104939 -346221 153925
7804 -129151 -262078 -269444 -204138 171896 57393 -330391 136029 -211531 86338 179444 156391
7793 156391 19560 53853 153282 154797 -18307 117793 48457 -360841 -66200 44103 47202 -150120
7780 -17338 233156 -129997 296268 367179 68826 44008 98635 29054 -46253 -115064 -102751
7769 -102751 -117576 -189070 45433 -196313 -21584 -156223 -361738 44266 -331866 88134 -140309
7757 -80538 -339306 -187036 -85764 -273152 27901 82445 25727 -167194 -109926 46368 -66348
7745 76559 8212 -215134 92671 -105099 -189270 -134230 -74806 -243639 88069 207010 -131467
7733 -146788 54325 -33935 -64843 -6805 157963 -41581 -63236 -19834 -47088 -185181 129759
7721 -77340 289291 -384964 -225042 192858 -287858 -254266 103769 -135604 -197064 -90233
7710 -40167 72152 40349 -360729 -251985 179495 -65260 72878 -176028 84434 107766 -220824
7698 -127133 22257 -232273 -9859 104881 149244 -13524 -156583 -27083 -97582 -117348 -24889
7686 7220 116788 -39001 -273742 171912 128388 -50096 18138 -300065 -7932 162369 202227
7675 202227 -144705 164649 178899 14782 162526 -79965 -21084 -66364 248973 -112180 61299
7663 188212 23572 -197303 50727 -25757 -46046 176615 -99720 -201969 -119095 64700 -227154
7651 -250930 -131350 376312 -2980 -193727 -315380 76760 95898 72308 -116622 -36323 87717
7639 -50570 173523 183562 -155513 7812 -21842 -139031 -62424 -295035 -470258 339665 -197131
7627 137580 -180935 135910 -100151 38929 -49627 -219388 -52336 48532 7649 5109 71867
7616 71867 20956 57753 346100 -197494 -166627 55484 -166611 166065 -181507 235978 125576
7605 125576 -202141 -229853 -90477 -213839 -106807 -300087 9598 -62096 -48508 189173 48607
7593 -44324 135302 -10060 10319 -159318 -133725 -74812 -287137 -110810 -233365 -27083 99395
7581 92292 102137 -118869 -119464 -103865 95978 -129634 -272325 11486 138802 -252397 78469
7569 -42029 -172517 -157463 339 -81726 -293112 -59306 164693 -270624 6324 -78863 16389 -148416
7556 -120980 123454 293383 116208 115121 -13392 2989 -53801 -30454 -131736 287731 -95765
7544 -40024 -152852 46965 -157513 60947 -130710 -440991 335608 55154 -104260 -273766
7534 -273766 183276 -164391 -219810 119666 240147 -213430 350089 -319184 41809 -187893
7523 -54528 -93667 219690 27200 188878 104160 131669 105892 47729 10179 -98639 -307193
7512 -307193 65157 6142 78521 244441 -67459 52249 291889 -47849 13735 -15731 -61779
7501 -61779 -155755 318353 21365 -1042 -69515 -34195 106851 118124 17014 -128789 4499 147719
7489 147719 134044 532410 -146156 -827 -200511 99619 -26870 -154201 -182793 -203034 -32257
7477 -70287 -6111 -120109 215216 89471 -120864 -35882 101775 -215410 196438 55022 -63899
7465 -175464 176168 5869 89987 197815 -208879 89009 -94701 56470 35096 -176519 73116
7453 -62766 -247986 -179949 -34626 -194231 -16234 202765 -157290 -17381 -159291 -38679 -67550
7442 -67550 16280 200857 -53945 37406 87093 -13906 2761 156699 51945 -34169 -38057 538385
7429 192198 -204073 123066 125871 84901 54419 26370 -69724 -73667 -153467 128239 103443
7418 103443 -284719 -52465 -502199 -122710 -17451 -186643 146076 -78179 -165882 -86300 -42477
7406 -35223 -95405 53690 105794 88490 -330906 33354 120548 -147743 -93055 25698 423472
7395 423472 5926 125174 11947 -126277 -27284 -94607 -253538 -31126 -82043 15397 29808
7384 29808 341552 -127450 -42764 216773 -305823 -104387 -274061 -195792 -6212 -384567 16226
7372 469454 -246206 115063 151797 -180554 -213977 140192 119799 -392842 -184444 -77888
7361 -261758 217290 -65493 -156011 -43103 164811 -89075 -13807 -198780 23419 -302162 -50031
7349 150456 -136115 -123756 132381 -167955 -18033 259467 185792 -125327 -18723 319976
7338 -223156 -97884 -104163 -49389 -118008 142781 86216 -311933 -285442 62295 42942 -183151
7326 137480 -72252 314707 126968 -254349 -169387 62295 -133231 65772 -161865 251323
7315 -190580 169946 -171560 -226599 -280679 5686 180558 -20128 37611 -160602 -251942 84677
7303 -184988 -4966 -140105 234091 -289006 379415 1209 140389 218159 44089 -156393 -61168
7291 14673 -11712 -30995 -306110 -191787 -67344 71308 10775 -36810 66875 111513 305444
7280 305444 -4713 -23389 -71 -218961 48822 -113904 1151 -162551 132942 -17813 2818 27439
7268 27439 -204430 -36846 -121491 225539 296634 230125 -9321 67023 -182928 -54284 40917
7256 -125340 39200 -131723 380181 -344222 67702 120910 -91142 -208491 97559 -337891 15818
7244 8408 -3456 108891 1749 150592 314710 135601 83961 -16151 132995 224593 -68068
7232 -32297 -219017 174091 188412 -11328 -238379 460160 79136 97789 -13704 -147453 -85014
7221 -85014 -155307 341025 -40267 -17922 -220182 -84736 -67837 -376372 -136347 24071 -64257
7209 434334 -135296 -193200 110579 -128388 60241 65 -184525 -163546 223179 -40798 -205128
7198 -205128 -499838 -498845 35992 2080 65941 29205 330358 -164710 32349 -103803 167606
7186 -245887 -78841 21370 -48458 292131 -310683 -141878 -99957 -59691 -409992 -241397 -32134
7174 -191938 -202537 90074 209931 107104 -564837 6803 -129336 -229900 -256429 -69653 -193923
7163 -193923 96885 16279 -393842 659796 37036 318021 -30871 275942 -19935 183706 174083
7152 174083 90356 -10613 134437 -116774 -120577 200123 -273877 -16995 121599 181181 -338475
7140 -62740 97097 70670 -1550 -225395 53361 35336 -129379 220468 -163323 -260354 117898
7128 -205105 -236466 131482 -125127 -79712 -25098 123980 -45342 -13198 -107771 -5141 259273
7116 -92110 -270763 182619 146319 -72485 6918 52420 90999 -47116 38458 88708 154656 -71238
7103 14794 -209621 -26293 -145501 196892 50597 190251 250461 176100 -97491 -275610 -163137
7092 -163137 130613 -308314 199891 32429 -374289 -49090 -335009 -219679 -182002 -20247
7081 18518 -45232 41 -103348 -72508 -3102 255144 -349781 252606 48578 -73270 193089 68145
7068 -249937 79689 -51506 -83244 29465 -138145 42894 -35703 129332 -165173 -24632 155963
7056 -84516 328628 90254 -58858 -134986 139423 -84352 11193 -164988 115030 -72522 -104345
7045 -104345 34783 198846 15838 -110699 -277969 -135813 -56215 -107716 226668 -204267
7034 203027 -48215 -6486 322675 290290 75689 337538 -8708 -110151 433094 131071 -35640
7022 -8960 48653 -130511 144976 -165535 -165679 54960 -122244 198961 222291 -3117 -5089 71027
7009 445823 -129500 129584 -317118 -226506 75847 -81328 -43835 111494 276478 -197286
6998 -126068 133688 277109 -46469 5982 56128 336988 -236374 -240119 136707 126330 -103524
6986 3907 63754 7762 363219 182894 129382 -56996 -104583 -290809 -103936 60684 -70855
6974 25577 -40227 -64573 -81853 -49828 151113 -79130 14214 -160018 280498 -93792 23913
6962 6600 39168 -194140 409718 101449 46266 206758 -271466 56906 -6491 -28034 -66690
6951 -66690 -31184 52046 8232 77987 -134745 6982 -34139 -24650 435976 -159795 -300336 63689
6938 36125 -28596 -63332 -12063 70295 -171770 -16971 15476 -11049 -15670 -71075 -99191 90013
6925 -263055 109704 93186 -225294 -226578 -175372 -251184 229218 -31745 -108972 -23356 55986
6913 179012 -285395 -227536 84295 -176733 -263069 -377100 -72410 -172812 -100730 -17328 104899
6901 -63703 -120164 -357104 60307 -278987 138503 330332 51109 -353417 -333054 290100 -221299
6889 -240059 180140 -97055 33145 -405792 -230404 150528 -58902 149158 71771 -93289 -167949
6878 -167949 -106634 85187 96859 -88513 -247998 299953 188284 195619 -230653 398571 50034
6866 181094 304245 -293010 109234 -152135 -67762 -78180 -26051 85052 -64306 18775 -225786
6854 -55092 -207841 -3405 124617 43892 -187677 -180318 66212 34927 93058 -127578 71311
6842 116610 119672 -57569 69223 38578 63072 -125234 350301 140439 16399 -198731 218943
6830 81956 189107 -109700 141991 217689 93746 -117715 -96095 7281 -61507 129864 -174146
6818 62064 -105564 55695 -61366 357899 95092 -187507 5648 123228 86978 82894 130007
6807 130007 -1530 136945 66984 -209351 29947 -17404 40577 170152 -288479 178571 13098
6795 -324536 86477 47097 -281360 -23099 130242 67976 -142906 13323 -693 188923 -4443
6783 4747 116860 -256705 -246423 -3265 -469946 -113302 24447 -235324 217738 21165 3237
6771 -430 -154887 83126 148623 69244 -90695 -163095 -83417 211897 -107100 -74559 -90066 -3975
6758 -193107 95885 28478 -1565 109569 -84886 374671 78563 -90585 289586 -52367 185686
6746 -147515 -140046 -198133 -98103 -244313 151236 262716 87582 69001 -21318 32130 -28968
6734 4737 -140708 -151468 151814 160185 220405 109979 -66586 -100888 -62904 417344 -64008
6722 -258482 -284928 -27166 -163676 -30312 -79052 14237 165146 -169788 -218529 34789 -209270
6710 -57027 84566 100782 100428 56897 163246 -251298 -286638 -256413 233 -138904 96781 338561
6698 338561 120498 -251229 -1603 42438 347813 310598 124533 46219 -157004 -27870 -33649
6687 -33649 108908 -69172 258972 -370381 -168123 -130591 -205958 305754 -19453 25392 201181
6676 201181 534857 -144935 -176817 -103400 -262999 110354 -79026 141903 98912 192806 -64181
6664 16275 -249396 76934 83520 -135455 -108292 123428 181865 55050 -172618 -540785 45950
6652 -34707 -32603 -164501 138145 -114384 99621 -246217 -24121 -153587 -97008 -156467 -325121
6641 -325121 -55517 -62754 -247986 -160610 258670 -73726 -302 120461 393306 -18921 -93710
6630 -93710 -260431 -93999 -133481 255998 -462344 35789 -167434 108463 113751 131656 -236643
6618 -61391 105404 138616 66931 -507 -302388 -254232 100867 -20735 -82350 -260166 260955
6606 -52957 -6959 188786 -67294 -479479 -211256 -154037 -99337 105563 -269197 19609 -226787
6594 -26669 31812 27661 18920 314795 200667 99256 -166737 214271 -10040 -277524 192556
6582 33216 338638 32113 -182453 -35696 -230692 165652 191106 100243 -200760 9721 109349
6571 109349 -35852 304770 276242 -29248 212744 -78178 39112 -36444 -157467 8105 -65069
6559 -98969 -169385 232586 -214356 -157345 -146275 -170289 -91419 -62609 296126 -167492 -39143
6547 233780 80483 -135292 -155988 -60662 270394 -156629 177743 -86832 -87230 -55267 181604
6535 -28203 -219075 -98050 -191305 13785 385987 11553 1555 30144 -206880 -138925 24573
6523 7830 -267971 262934 65494 -154724 -63926 -266418 -29169 43176 -126270 -128619 -83955
6512 -83955 74616 21192 8797 -72004 -17925 105513 98164 -464696 -120835 197044 220275
6501 220275 -66994 -283179 -147906 90506 -30647 -218635 387712 -110564 -41546 260802
6490 -213765 -144954 20355 179272 42208 -270029 -237725 -119112 145721 141224 -12770 11588
6478 276857 -161604 325326 -134847 -14599 201645 -42314 87868 232785 -81016 117336
6467 175892 29989 -143356 149817 126447 -199623 -73463 -65751 -46272 129218 124079 33157
6455 85545 -27791 129766 -150420 -71362 131642 -148863 -22791 -255238 -70283 -78842 -171017
6444 -171017 -500814 -4136 223761 -40635 -406548 33585 -384862 -3634 -265426 -29253 -174178
6433 -174178 -12687 173449 61278 -116729 119849 75046 73948 -35878 9811 -103274 309683
6421 -78338 -3720 41157 -284086 392868 301915 -556 130724 297313 -297566 -79114 516158
6409 -168684 66681 263939 14996 272929 -38141 -101011 146569 -24495 -400312 -294854 108916
6397 -55997 -280122 62986 -305522 18695 83290 -298780 107055 -279544 98811 -156224 -63531
6385 74109 -274762 109429 -143797 -84874 159220 -156869 -177380 -28086 114570 20512 935
6373 185897 -283190 31000 -162262 -195931 -121622 -53015 80280 -128656 59476 -122327 318126
6361 -70486 100375 -123552 -180590 96826 -248939 213162 124177 50906 -251025 100142 -29923
6349 46842 -312590 34590 -333894 -223096 -614504 21545 -278480 -121456 206829 125420
6339 125420 -181638 80783 -146622 -112938 -366461 290185 -234434 277117 195443 -160967
6328 -25338 223071 123227 47851 -103385 24131 174593 -106019 134820 274843 -22090 -94735
6317 -94735 326330 -148154 -19258 73672 170518 -145994 28958 250776 -233675 -310019 -139466
6305 -52639 -153088 -124675 -326097 -181315 -293175 -336359 -55186 -296976 144672 101595 -461615
6293 -142931 36690 376818 -61927 -128077 -87785 -38183 167455 64984 -283791 -187272 -29782
6281 94160 309685 134165 -310085 -36935 121784 -128004 -65225 82896 -223695 57756 223044
6270 223044 -225551 308661 -17136 -87943 10969 254029 106441 40418 -180557 -181916 -7388
6258 32352 112824 90469 -335367 145743 -110139 280952 -963 -38317 -444775 144085 161455
6247 161455 -189439 122726 8137 121962 -180893 -67363 241266 171252 -24314 -70560 284565
6235 -112206 -56256 -49431 -179122 -436666 96578 -113189 -122351 -80919 -60908 44221 -327795
6223 -54509 186288 106981 191253 14029 208250 56516 -51609 14911 304407 38643 118486
6212 118486 -258093 97684 -37530 -180572 -168703 -9901 82756 -176362 -54657 -73703 13777
6200 61471 -252202 -91273 27498 -109394 -270408 -134081 186131 -348465 56636 13391 -205724
6188 151875 -9444 -91996 -33947 142897 9556 454551 4077 260300 5270 384029 -241258
6176 -40219 -187751 -326396 266283 -200767 47374 -258521 199579 -102393 -10159 -164299
6166 -164299 92380 -224153 -145059 310278 217064 287677 239741 214046 -29965 218928 130172
6155 130172 192713 -74297 1194 -103256 17448 3518 -102842 -16095 8462 -20473 65260 1237
6142 -246267 -142647 146513 -456193 -169702 163426 316920 -79670 -241827 -428074 207131
6131 -178996 167407 3628 -45157 -168087 -57655 -257131 -310677 -54780 151869 349543 275047
6120 275047 285139 88465 21727 300526 -27534 -428319 229650 226137 274541 228241 294021
6109 294021 127164 -160027 118881 -30974 227025 -120608 -293631 163366 253847 -351125
6098 85418 -71706 -253745 -35793 -126224 101050 -26293 -215927 341163 -13252 209061 -360278
6086 -60468 -105106 -123965 113671 9563 -49026 -159410 17922 82785 39111 -60446 14802 8023
6074 8023 152853 -47361 -60028 63746 226821 -48571 -100933 438019 53212 67173 -95943
6062 27253 -42243 120215 -59073 -305937 57531 392485 6460 -101048 64784 41300 -121298
6050 -213578 -85444 -211706 46620 -67663 -30924 135234 112078 67932 -180164 9190 114734
6039 114734 -208757 18360 29183 95760 -114357 -250547 46919 -252743 -273840 85386 165575
6028 165575 -28239 48533 -309091 129294 -53898 -273310 6865 -56334 255650 -160333 121757
6016 -144918 59321 194125 -240216 -322261 139677 -164174 41037 18486 202298 -338824
6005 -386100 -222252 -102913 -17957 -40893 -122179 -381732 -271361 -9627 -149071 -233466 20823
5993 264167 278550 -221470 73945 -37206 4112 -262759 79121 92553 28261 -12010 -46716
5982 -46716 258616 163632 -71694 125302 -285204 130285 -361266 -73877 -337671 -45364 -274429
5971 -274429 253733 1901 119078 -170044 -187581 -39136 36017 3876 -137960 39805 -14297
5959 110038 -145638 -307502 -183090 32155 -24396 237655 -73654 -110659 197581 3897 75495
5948 75495 -78925 28837 -198383 -133251 -242624 194580 -61173 38690 192895 138594 -80351
5936 116559 23762 -311284 -97156 8894 -49686 281140 293733 -49518 118102 -136640 -62499
5924 -90269 -244410 29111 -26635 85234 -230087 63177 70226 -185773 -174696 -350137 18883
5912 61149 99482 -80888 49583 -320583 -129356 -142321 -377064 37688 -371719 321322 85646
5900 29906 -221314 -132583 -40336 -191280 221082 196652 174587 -137660 177626 54594 -10882
5888 -85177 -147741 97235 154302 -195734 141117 -307303 135016 283957 -101283 119954
5877 191645 -110544 20349 -12807 -78566 280475 231270 -396519 146353 -104352 -77957 55788
5865 259408 29699 -76578 50389 -443513 219389 4138 49277 141856 75024 -20172 529 181352
5853 181352 219025 36463 69428 -195990 222764 188204 -149433 -26278 -57523 221384 235161
5842 235161 21286 -136596 -3773 208012 21842 82368 -146438 -50285 -15662 140086 -55326
5830 -6341 -3268 -13220 139820 -85932 -71446 -98945 -185380 119405 -30558 65064 90675 130682
5818 130682 -111494 31382 -53813 62666 -81125 -111386 -95564 -372200 -4755 85900 142185
5807 142185 -56277 -5027 -64955 -82476 4729 -164657 9318 -209108 154034 -76786 -85901 -203963
5795 -203963 -144798 -179212 105211 60918 -129843 -86616 96802 -121105 120056 33965 125734
5784 125734 -146253 -106696 344919 236519 -499910 -122802 -5777 225961 158356 261368
5774 261368 -49841 62012 43104 10280 -185142 -111394 -87244 14510 229825 -98910 -38496
5762 -384981 -78754 -194770 -107056 261614 82976 -92339 62897 -10095 -205726 229817 -167316
5750 -270076 -92922 -3964 187362 -388852 252546 46744 22051 280122 15787 -12157 -187976
5739 -187976 11509 351413 -226397 -10237 115959 -5555 -248623 22066 -105734 113748 -26140
5727 255046 -167024 -75612 -42313 55719 234169 -148208 -102796 -186093 -56913 -79981 -63092
5716 -63092 -279054 -322020 -83208 18423 261844 158268 213836 -116885 -206293 100107 -125783
5704 -73455 -30205 76388 -145262 -229253 -61545 -19127 -25413 160177 101258 -46337 -24578 -119316
5692 -119316 93840 -212131 -261731 -54015 -123167 51479 267566 -282653 101398 34777 152903
5681 152903 272687 91113 186073 113985 243632 -25973 -127317 -143486 128961 -30962 183942
5669 -49157 177746 108341 195245 -84463 195611 -76549 -112671 -144531 88878 -40175 -181330
5658 -181330 -190133 -213875 -189539 56167 55073 -87363 -106880 -136887 -129333 -206943 -6148 107024
5645 -79373 212651 -94032 -26253 222587 139251 -127640 203896 68444 27949 -95314 66011
5633 -72275 -42038 -142586 336644 220410 -20934 142698 -183392 89925 87817 -74507 -18586
5621 282400 629 47592 207489 -107675 98327 23410 107797 104388 170354 -111420 129708
5609 -39528 -125357 39531 59890 180396 -223970 -54756 -245360 129648 2687 -137650 14349
5597 -1285 11018 -207666 -120788 47931 -61686 -148696 -176615 185572 227621 24753 -43498 -318025
5585 -318025 -46475 -226834 24969 -8975 -145543 83874 77465 -118509 -253797 76436 -58095
5573 3007 -49358 83428 -252504 -131235 24116 -158018 -158656 -64426 384695 155443 92274
5562 92274 -164088 68662 -122561 -228332 -26708 107293 -42456 -135919 -118983 41600 23382
5551 23382 -105569 57353 163744 -35349 -111685 225022 34878 -10765 -82461 191321 170512
5540 170512 326339 -20088 73026 -44711 21471 51386 -354933 72220 -114450 65485 218802
5529 218802 -194280 70125 -155615 178053 98396 128672 -118414 146218 -49508 35921 -6345
5517 -169058 34887 87965 -26970 6801 55711 1813 6502 67964 62004 45360 109365 52255
5504 -267019 132484 -365029 -56883 -44012 74676 105359 -132561 132754 -84283 72548 -33203
5492 308106 71321 -104350 -322459 -133081 257026 23028 44240 -231741 196428 -257193
5481 -30142 -128273 73127 -77006 -281949 -204225 -65258 53814 -245466 156411 176316 222943
5470 222943 -319326 369204 -30423 75419 -15045 225611 -75667 -187812 533337 -10370 -119571
5459 -119571 292313 -120121 -147640 268306 106499 134241 -35518 310847 -177455 -110564
5449 -110564 40725 -28870 144316 -123520 84558 30858 155236 -88075 -248554 -137034 -278862
5438 -278862 148232 148222 -183620 -114816 -99548 -233847 93535 -100776 113162 -110752 210842
5426 -105045 29582 -8760 -110152 3371 -116660 -100301 -46183 -52208 227009 -142148 -76643
5415 -76643 -165393 463728 -32397 81965 -94534 -152564 257022 -13055 -87954 66802 -49196
5403 -72456 32806 40146 -285491 175816 -200922 -24128 -232312 -50612 97004 -141593 -57547
5391 136045 133894 -18700 -69715 -71467 99624 -41739 97348 293795 79742 -60045 130500 101931
5379 101931 58286 -149982 -216885 35293 -28281 -82674 10233 38330 90614 -83737 -40431
5367 186715 160810 255209 234965 -43028 322120 71881 139861 1286 -85525 -141949 -4573 -180081
5355 -180081 -275801 54270 25982 -132333 -153924 -51891 149596 64876 -80781 317736 163820
5344 163820 44578 -77466 107818 84169 122382 -401792 -41854 -144182 -107149 127866 232586
5333 232586 -180714 -147990 -172548 267940 14396 -167062 31384 41202 -133680 -47681 -65036
5322 -65036 -441678 -230195 77641 167817 204152 158684 287562 76205 -180552 -14915 196418
5310 42470 84187 -103312 32986 128057 218910 -74285 49095 -172411 -342621 -110550 32795
5298 123243 115778 -27379 9242 49840 7031 115199 99357 108463 228284 -86253 262831 -165090
5285 110311 -57642 -149264 148641 158559 -222613 -142280 -26659 131815 110804 212412 -23577
5273 281164 -67133 -88172 112254 4136 -308150 -66653 170415 79583 50653 173871 148432
5262 148432 95199 209207 151922 -161230 -26277 -56513 349830 -196586 239262 -213893
5251 -410716 107705 121954 -209842 126302 196292 138084 -100595 -355866 -203800 30113
5240 50425 178228 8267 -206520 -135706 -90626 40331 -135964 -195380 -286375 129524 41800
5228 149563 298159 48139 94530 143755 -20808 -194241 -7978 193956 81893 -599 -17687 9507
5215 176384 345403 93803 -23073 -149075 191745 -12794 -183595 -276163 171124 217643 301478
5204 301478 16754 149203 -193116 176397 -159766 -65497 29867 -132202 -13887 73726 -181714
5192 136805 184312 127198 250568 -5939 -125962 -242101 -328965 61563 -124952 -74972 -141715
5181 -141715 -165674 -182887 -205994 72988 147624 -308084 -16945 -274264 -151375 97666 -135428
5169 92419 193191 -25147 234364 -159924 -59574 -265577 -39882 -84108 171375 95169 202182
5158 202182 -173988 65316 436319 -132150 75942 -43496 -40704 78589 -15817 287185 -250306
5146 -5181 -37524 -44557 43032 170627 480716 13007 134860 289426 156910 -276807 -160864
5135 -160864 -219419 144924 235359 -227204 85282 50349 205957 227093 -72256 -59127 -14062
5123 66265 -252833 -152567 35512 -32538 125668 257901 274636 54107 227120 253321 43447
5111 -126719 238588 -84188 167729 152375 -44662 -194650 144975 -105483 66432 90254 -66138
5099 -222136 82257 -155936 39445 295309 -148559 -35526 -161280 -28878 89489 107416 36399
5087 -57622 223689 374991 284264 -175051 86366 -61421 -86385 -140502 -26204 24598 105493
5076 105493 89102 -187387 114414 135719 -130222 -37322 125880 59131 161216 105538 113044
5065 113044 9974 176196 316117 -116712 -11399 73067 189553 246721 6070 146918 -265632
5053 -230923 -36756 262171 -199771 118525 -54202 -37958 177878 -118378 48145 66471 -228085
5041 50832 111672 141303 40819 -11410 -173100 -179472 -259795 -62972 -59999 -66680 16912 116236
5029 116236 86263 -172090 15205 42677 257231 -293834 46120 164511 -204372 117509
5018 60318 201028 -221553 -279411 136361 -351625 33809 -131544 -73601 296397 -66800 -52394
5007 -52394 59785 94141 -70386 240377 -42933 84668 187091 -161565 -154796 -242006 -272165
4996 -272165 105150 94980 42010 -11471 124740 76514 37929 -201930 -469822 -119726 -49035
4984 233754 3998 -37589 363529 63577 28529 2587 -266992 -42125 -99231 74545 301037
4973 301037 -172014 145730 89751 200014 -71194 270771 50333 333751 -56182 77244 28987
4961 29501 -312988 -183440 -102516 16478 211232 -133430 -33590 44180 3740 92970 -143262
4949 437572 94506 174392 254577 4562 230434 -29159 59299 -105344 73070 -299834 41930
4937 113498 -20572 82577 6059 -187153 45406 -470744 -139246 132304 -85251 -55334 127284
4925 -221742 82698 -288511 153525 -30204 27379 -175359 -36687 86997 71686 52527 264108
4914 264108 419087 -61200 -63376 212694 -172626 -152321 73851 197218 -138669 -86220 4301
4902 259364 -85638 -2286 2420 -20866 104761 64112 -85157 -165015 107250 177512 -18680 -127365
4890 -127365 -93412 -180433 161010 112119 186736 -21728 -89445 -7723 -37 -65816 -243693 24434
4877 -47738 97392 -19489 74486 58738 47064 -116642 106973 209190 -174487 48687 66600
4866 66600 -1021 -263484 -158020 170208 -37639 -137567 -33484 210914 258618 25568 342044
4855 342044 49349 -557945 -30219 170468 -239160 -108031 -87299 -23346 100414 -398067
4844 -117305 -74796 253780 -41185 361506 75952 103876 -15401 -59295 -64501 187207 -33587
4832 -105110 -239179 119041 -116577 45627 -170654 187549 150560 -61536 60672 143978 77408
4821 77408 -19125 -361807 343193 -177535 86026 112433 33481 364198 386580 183392 -158673
4809 61676 -259752 89878 -7974 -145626 272884 -212719 -217239 -162458 -57511 127177 60885
4797 182493 -188455 476095 128033 76147 351206 470 -53476 -15534 325543 117723 -317832
4785 -182468 64753 415205 -92954 167622 55204 -117160 -245778 116971 -39009 126585
4774 -111795 121534 185154 51441 185131 -149078 93924 177959 145568 -189786 -98812 129480
4762 -160827 262375 2573 -168921 -168762 -229388 302017 -123279 -184595 -108191 91421 212827
4751 212827 171343 -123191 124497 -66133 93880 -62257 -27612 -209262 -129533 223343 -151378
4739 181400 18514 201590 -64267 267137 28505 238911 26644 -25367 -85771 -142172 122957
4727 -86172 -52882 -91743 -206929 -140083 -219258 -271651 117011 -379635 -52927 -123723 123632
4715 -184686 55578 -421347 1407 -80356 169726 -11331 133554 -157917 -200520 74818 29788
4703 87525 214640 -291031 65168 114379 130837 19162 -110945 48724 -235080 -59867 -35045
4692 -35045 343541 -148927 -171047 -21721 317290 39187 151802 -128555 -78585 -108342 76900
4680 21428 -128542 -237570 -63230 240252 34883 130512 121531 8612 -147788 280797 263651
4669 263651 165534 390415 16878 555645 -69405 -98282 -65848 203909 -41379 63650 129903
4658 129903 -61757 -322090 271875 127742 -28739 -46031 -197851 159957 223815 -23565 -179204
4647 -179204 -56426 93136 112435 -149414 195602 167377 -16044 -45299 123769 -382012 -23835
4635 181352 -141136 -55837 183700 -214576 -290691 172464 196151 102772 61847 53364 -113539
4623 -96835 -236205 233016 -37366 -127084 -184542 -342518 89888 -144217 46364 29739 -19372
4611 146196 178000 -165990 47269 -23074 168240 -315044 131336 -31420 -54688 220085 309839
4600 309839 -162817 -159049 -389670 200829 44595 57270 -146424 -61515 246846 93694 272742
4589 272742 -103007 -39939 210621 -13471 -186377 294888 -255211 107494 67213 88730
4579 88730 -123423 150989 230227 -165852 231683 -100203 -72512 77301 -57417 106343 38135
4567 13665 110821 -37045 224870 31890 122113 28254 -117992 26095 -21718 -72109 72686
4555 90130 -21896 44579 224916 -80367 48626 261232 143044 320509 312390 -255511 -46582
4543 -220692 110754 -16067 86285 164937 122086 -234598 -64035 198095 -11632 32554 -173617
4531 -92134 36982 -226251 -61065 228976 116889 -54477 195719 -23378 70909 -124225 201384
4519 23029 -42169 165927 46846 237933 -99945 -43155 -424537 171790 250925 177938 -63630
4507 -35271 212212 -261598 48487 52136 45555 -61553 -70189 -352563 114681 -46541 108560
4495 -264325 -77967 117227 71720 -63198 93707 33018 -47643 -18127 -110738 -158255 -227882
4484 -227882 120868 -49764 27368 143080 22913 -226975 -160615 233361 -53251 -45072 -121890
4473 -121890 -112350 218066 235070 -338989 28329 72711 -67840 -108521 294349 205639 43122
$$ [...]
##END NTUPLES=NMR SPECTRUM
##END=
