
##TITLE=AC1267_CTIAH12085_6647440_FoAI34keot
##JCAMPDX= 6.0         $$ Bruker NMR JCAMP-DX V2.0
##DATA TYPE= NMR SPECTRUM
##DATA CLASS= NTUPLES
##ORIGIN= BRUKER
##OWNER= Administrator
$$ 1.72 TOPSPIN		Version 2.1
$$ 2012-08-09 15:18:40.640 -0500  Administrator@TOPSPIN
$$ Compression mode = diff/dup
##.OBSERVE FREQUENCY= 400.02188249412
##.OBSERVE NUCLEUS= ^1H
##.ACQUISITION MODE= SIMULTANEOUS (DQD)
##.ACQUISITION SCHEME= undefined
##.AVERAGES= 8
##.DIGITISER RES= 22
##SPECTROMETER/DATA SYSTEM= spect
##.PULSE SEQUENCE= zg30
##.SOLVENT NAME= COFFEE_meoh
##.SHIFT REFERENCE= INTERNAL, COFFEE_meoh, 1, 14.98509
##AUDIT TRAIL= $$ (NUMBER, WHEN, WHO, WHERE, PROCESS, VERSION, WHAT)
$$ ##TITLE= Audit trail, TOPSPIN		Version 2.1
$$ ##JCAMPDX= 5.01
$$ ##ORIGIN= Bruker BioSpin GmbH
$$ ##OWNER= Administrator
$$ $$ C:\Bruker\TOPSPIN/data/COFFEE/nmr/AC1267_CTIAH12085_6647440_FoAI34keot/10/pdata/1/auditp.txt
$$ ##AUDIT TRAIL=  $$ (NUMBER, WHEN, WHO, WHERE, PROCESS, VERSION, WHAT)
(   1,<2012-08-09 15:18:14.031 -0500>,<Administrator>,<TOPSPIN>,<go>,<TOPSPIN 2.1>,
      <created by zg
	started at 2012-08-09 15:17:05.593 -0500,
	POWCHK enabled, PULCHK disabled,
       configuration hash MD5:
       6B 1B 68 BB D9 2E 58 E2 7F 35 AD 54 07 DF 0E 41
       data hash MD5: 64K
       BE 6D 53 FB B2 85 AB B3 5A 59 CA 4E B0 B9 12 FD>)
(   2,<2012-08-09 15:18:26.812 -0500>,<Administrator>,<TOPSPIN>,<proc1d>,<TOPSPIN 2.1>,
      <Start of raw data processing
       efp LB = 0 FT_mod = 6 PKNL = 1 PHC0 = 0 PHC1 = 0 SI = 32K 
       data hash MD5: 32K
       3D 6F 9C D9 9E 94 41 11 FB 05 99 E1 A9 7D F4 7B>)
(   3,<2012-08-09 15:18:27.687 -0500>,<Administrator>,<TOPSPIN>,<proc1d>,<TOPSPIN 2.1>,
      <pk PHC0 = 174.6771 PHC1 = 0 
       data hash MD5: 32K
       AC 94 65 1A A0 83 1D F7 A1 15 74 8F FA CB BA AB>)
(   4,<2012-08-09 15:18:28.140 -0500>,<Administrator>,<TOPSPIN>,<proc1d>,<TOPSPIN 2.1>,
      <abs ABSG = 1 
       data hash MD5: 32K
       F8 E4 D0 82 3D A2 40 26 D2 31 18 76 3D 6E A1 97>)
(   5,<2012-08-09 15:18:28.453 -0500>,<Administrator>,<TOPSPIN>,<proc1d>,<TOPSPIN 2.1>,
      <abs ABSG = 2 
       data hash MD5: 32K
       AB E6 8D 03 D0 2C C7 64 58 FF CE 64 45 14 CE F8>)
(   6,<2012-08-09 15:18:28.734 -0500>,<Administrator>,<TOPSPIN>,<proc1d>,<TOPSPIN 2.1>,
      <abs ABSG = 3 
       data hash MD5: 32K
       58 E2 9A 10 49 DA E7 2D F3 C4 34 C6 0F E8 79 F8>)
(   7,<2012-08-09 15:18:29.109 -0500>,<Administrator>,<TOPSPIN>,<proc1d>,<TOPSPIN 2.1>,
      <abs ABSG = 4 
       data hash MD5: 32K
       6C 2B 59 C8 A1 C3 B8 43 1D 08 15 D4 03 54 5D 40>)
(   8,<2012-08-09 15:18:29.468 -0500>,<Administrator>,<TOPSPIN>,<proc1d>,<TOPSPIN 2.1>,
      <abs ABSG = 5 
       data hash MD5: 32K
       39 7E C4 43 4D CB EE 31 17 69 92 36 E6 75 39 4C>)
$$ ##END=
$$ 
$$ $$ hash MD5
$$ $$ F8 07 EC 4F 96 BF 75 76 C9 5C 65 A8 7E 46 AB 98
##$RELAX= 
##$RELAX= 
##$RELAX= 
##$RELAX= 
##$RELAX= 
##$RELAX= 
##$RELAX= 
$$ Bruker specific parameters
$$ --------------------------
$$ [...]
##$TP= (0..7)
150 150 150 150 150 150 150 150
##$TP07= 0
##$TPNAME0= <>
##$TPNAME1= <>
##$TPNAME2= <>
##$TPNAME3= <>
##$TPNAME4= <>
##$TPNAME5= <>
##$TPNAME6= <>
##$TPNAME7= <>
##$TPOAL= (0..7)
0.5 0.5 0.5 0.5 0.5 0.5 0.5 0.5
##$TPOFFS= (0..7)
0 0 0 0 0 0 0 0
##$TUNHIN= 0
##$TUNHOUT= 0
##$TUNXOUT= 0
##$USERA1= <user>
##$USERA2= <user>
##$USERA3= <user>
##$USERA4= <user>
##$USERA5= <user>
##$V9= 5
##$VALIST= <valist>
##$VCLIST= <CCCCCCCCCCCCCCC>
##$VD= 0
##$VDLIST= <DDDDDDDDDDDDDDD>
##$VPLIST= <PPPPPPPPPPPPPPP>
##$VTLIST= <TTTTTTTTTTTTTTT>
##$WBST= 1024
##$WBSW= 4
##$XGAIN= (0..3)
0 0 0 0
##$XL= 0
##$YL= 0
##$YMAX_a= 473579
##$YMIN_a= -618792
##$ZGOPTNS= <>
##$ZL1= 120
##$ZL2= 120
##$ZL3= 120
##$ZL4= 120
##$ABSF1= 14.98509
##$ABSF2= -5.573092
##$ABSG= 5
##$ABSL= 3
##$ALPHA= 0
##$AQORDER= 0
##$ASSFAC= 0
##$ASSFACI= 0
##$ASSFACX= 0
##$ASSWID= 0
##$AUNMP= <proc_prof1d_extract_pilot.lims>
##$AXLEFT= 0
##$AXNAME= <>
##$AXNUC= <1H>
##$AXRIGHT= 0
##$AXTYPE= 0
##$AXUNIT= <>
##$AZFE= 0.1
##$AZFW= 0.1
##$BCFW= 0
##$BC_mod= 0
##$BYTORDP= 0
##$COROFFS= 0
##$CY= 15
##$DATMOD= 1
##$DC= 0
##$DFILT= <>
##$DTYPP= 0
##$F1P= 0
##$F2P= 0
##$FCOR= 0.5
##$FTSIZE= 32768
##$FT_mod= 6
##$GAMMA= 0
##$GB= 0
##$INTBC= 1
##$INTSCL= 1
##$ISEN= 128
##$LB= 0
##$LEV0= 0
##$LPBIN= 0
##$MAXI= 10000
##$MC2= 0
##$MEAN= 0
##$ME_mod= 0
##$MI= 0
##$NCOEF= 0
##$NC_proc= -8
##$NLEV= 6
##$NOISF1= 0
##$NOISF2= 0
##$NSP= 0
##$NTH_PI= 0
##$NZP= 0
##$OFFSET= 14.98509
##$PC= 1
##$PHC0= 174.6771
##$PHC1= 0
##$PH_mod= 1
##$PKNL= yes
##$PPARMOD= 0
##$PPDIAG= 0
##$PPIPTYP= 0
##$PPMPNUM= 2147483647
##$PPRESOL= 1
##$PSCAL= 4
##$PSIGN= 0
##$PYNMP= <proc.py>
##$REVERSE= no
##$SF= 400.02
##$SI= 32768
##$SIGF1= 0
##$SIGF2= 0
##$SINO= 400
##$SIOLD= 32768
##$SPECTYP= <>
##$SREGLST= <1H.CDCl3>
##$SSB= 0
##$STSI= 32768
##$STSR= 0
##$SW_p= 8223.68421052631
##$SYMM= 0
##$S_DEV= 0
##$TDeff= 65536
##$TDoff= 0
##$TI= <>
##$TILT= no
##$TM1= 0
##$TM2= 0
##$TOPLEV= 0
##$USERP1= <user>
##$USERP2= <user>
##$USERP3= <user>
##$USERP4= <user>
##$USERP5= <user>
##$WDW= 1
##$XDIM= 32768
##$YMAX_p= 460457881
##$YMIN_p= -666691
##$CURPLOT= <Network HP LaserJet P1505>
##$CURPRIN= <$Network HP LaserJet P1505>
##$DFORMAT= <normdp>
##$LAYOUT= <+/1D_H.xwp>
##$LFORMAT= <normlp>
##$PFORMAT= <normpl>
##$SURQMSG= 1
$$ End of Bruker specific parameters
$$ ---------------------------------
##NTUPLES= NMR SPECTRUM
##VAR_NAME=  FREQUENCY,     SPECTRUM/REAL,   SPECTRUM/IMAG
##SYMBOL=    X,             R,               I
##VAR_TYPE=  INDEPENDENT,   DEPENDENT,       DEPENDENT
##VAR_FORM=  AFFN,          ASDF,            ASDF
##VAR_DIM=   32768,         32768,           32768
##UNITS=     HZ,            ARBITRARY UNITS, ARBITRARY UNITS
##FACTOR=    0.250966925370066, 1,           1
##FIRST=     8223.43324360094, 43452,        116883
##LAST=      0,             -15464,          77370
##MIN=       0,             -666691,         0
##MAX=       8223.43324360094, 460457881,    0
$$ Real data points
##PAGE= N=1
##DATA TABLE= (X++(R..R)), XYDATA
32767D3452A5674i6975K5451m8549K2553r6209f6909n9954L7363j3214k5017a1607
32754d7714A87910C939a15462D2204a98695G6999l2136b38206c2388n3858l1623
32743a17869B3493b39135g524j37075H5573a01495k7186D6454a81233O1908K7005
32732i2320A45887a61436d5938c543j10442A26466b0726F457b61880i5090a5079
32720G6241l6359h8575G0217b77808J21975F7441c90905a29331M8609k14235h5338
32708E1504c23053J06300l9248a06093B19435b54293B3889a61790f0318A67763
32697A14878m3711g7960A32814A2334f0070j92807C2197O8857D2660b39929c7132
32685f1574r1456j17080J13077f7308A04276a95922d3503F9980O4873f7489H9168
$$ y = [43452, 15674, -96975, -71524, -120073, -97520, -193729, -66909, -126863, -89500, -102714, -127731, -11607, -47714, 187910, 3939, -115462, 42204, -198695, 76999, 44863, -238206, -32388, -86246, -117869, 23493, -239135, -7524, -144599, 85573, -101495, -128681, 46454, -181233, -119325, -92320, 145887, -161436, -45938, -3543, -113985, 126466, -20726, 6457, -261880, -95090, -15079, 76241, 39882, -88575, 70217, -277808, -155833, 67441, -390905, -129331, -80722, -294957, -85338, 51504, -323053, -216753, -256001, -106093, 219435, -254293, 23889, -161790, -60318, 167763, 114878, 71167, -77960, 132814, 12334, -60070, -252877, 32197, 101054, 42660, -239929, -37132, -61574, -153030, -270110, -157033, -67308, 104276, -195922, -43503, 69980, 134853, -67489, 89168]
32673a07989n0725C6467K33116f6386n5748j53891a01998K2446F500b25232R6186
32662a29046a1828B4440a75731d2479D6463N5481G311i2561I3099q90b372l08312
32650c10684J7200C08J5780a60335c5415Q382I1044g2380o7893e1161j09886K6203
32638a34844F3870k8178b63376N7001B13944c2848H5859d6548F319a16912F5204
32626e1579j60864m3830J07921e8747F9305b3143j54029A11311b60291Q8460G7101
32614i4378A56109D613a74960K6285n2792a8507o0910J7241B26378c14564A06506
32602C2198b29531d9632A39425a5050m624k8542k66812R7541j347C1587P2054
32591A03641d1055A03285a2162j7545k43680A62306b41387j4256F5309K15609
$$ y = [-107989, -158714, 36467, 269583, -66386, -122134, -276025, -101998, -79552, 6500, -225232, -129046, -11828, 24440, -175731, -42479, 46463, 101944, 7311, -92561, 93099, 92209, -2372, -310684, -293484, 308, 16088, -160335, -35415, -27033, 91044, -72380, -140273, -51161, -161047, -134844, 63870, 35692, -263376, -206375, 213944, -32848, 85859, -46548, 6319, -116912, 65204, -51579, -212443, -256273, -148352, -58747, 69305, -23143, -177172, 111311, -260291, -171831, 77101, -94378, 156109, 4613, -174960, -148675, -201467, -18507, -79417, -62176, 226378, -314564, 106506, 32198, -229531, -49632, 139425, -15050, -19674, -48216, -315028, -217487, -218834, 31587, 103641, -41055, 103285, -12162, -29707, -273387, 162306, -241387, -255643, 65309, 280918]
32581B80918g0985a6978A64495D3646b51424g1942O855j8635A45448C1513M9771
32570H1284g8814G7807J9219i3766k2076l37037a37330A5730d8994j45890A35130
32558a99356E4492b16584E6035B0916c80506f0762A62890a94023P9472j48882
32548b63433h3649B26422b56164i9985E8907a05034A87199b59604B57104c4834
32537c5096j88978A11396g9996p3081B5664b21770K2935c1772A05066A8168c9806
32525a02140J7915C1186L053k206J11124G0781l784b81271m1737A46300a28089
32513a68789r057P1816F1445a86178k0701a6984k14715a6938A54708D1690K42495
32502B84185i2760A74589a02951A39444h3016p9765L7634c0822E6717J0720i2028
$$ y = [280918, -70985, -16978, 164495, 43646, -251424, -71942, -65087, -83722, 145448, 31513, 81284, -78814, 77807, 97026, -93766, -115842, -452879, -137330, 15730, -48994, -194884, 135130, -199356, 54492, -216584, 56035, 20916, -380506, -60762, 162890, -194023, -114551, -263433, -83649, 226422, -256164, -99985, 58907, -105034, 187199, -259604, 257104, -34834, -35096, -224074, 111396, -79996, -153077, 25664, -221770, -198835, -31772, 105066, 18168, -39806, -102140, -84225, 31186, 34239, 32033, 143157, 70781, 66997, -281271, -323008, 146300, -128089, -168789, -177846, -106030, 61445, -186178, -206879, -16984, -231699, -16938, 154708, 41690, 284185, -92760, 174589, -102951, 139444, -83016, -162781, -125147, -30822, 56717, 67437, -92028]
32490a46367H8123C5337J40822a82091j6201B65566a1811E1602a97138k3994i0341
32478A18090M7766c5943A60479b13793B57908K4439I7372o382J76652e7767l3875
32467i1642k6353j12209b6352A8946b12607C3932g8498B24224N1952a76163M1317
32456a34846F8602k8235Q8120a01749m1006L0929a7954k01960O9495B8824a28594
32444A578i8226j580m0458r4329n200i6622B73099M5931i8446j3762M8142B8584
32431a7058j32627d7901q2513j94262A55565n9860d5272j96108l6980F2121a35299
32419a75587C3638a66973B46131a73465L6781r0486e0008k22714a04501j73176
32409b77677B22255d9831E675J01732h2677q6375B2523J5523p746a04130A30715
$$ y = [-146367, 88123, 35337, 176159, -182091, -198292, 265566, -11811, 51602, -197138, -221132, -90341, 118090, 165856, -35943, 160479, -213793, 257908, 282347, 97372, 90990, 267642, -57767, -91642, -117995, -230204, -26352, 18946, -212607, 33932, -78498, 224224, 276176, -176163, -134846, 68602, 40367, 128487, -101749, -142755, -111826, -17954, -219914, -150419, 28824, -128594, 1578, -98226, -99806, -140264, -234593, -239793, -96622, 273099, 319030, -98446, -112208, -64066, 28584, -17058, -149685, -47901, -130414, -324676, 155565, 95705, -45272, -241380, -278360, 62121, -135299, -175587, 33638, -166973, 246131, -173465, -136684, -227170, -50008, -272722, -104501, -277677, 222255, -49831, 5675, 107407, -82677, -169052, 22523, 38046, 30300, -104130, 130715]
32397b27504C6936d5657F227b10657F0542j3295b52778E6749f8007j08029d049
32385g1164m997B3953b32048i0769k7463B88665b31253h5253l51956E4799a42155
32373A13025b23121l1150A9950c27515L5488f5218E8732B363D56i9642A03473
32361d4818E4682c11471a24440j30563A60472d10528G7774b09558c7580n6423
32351i4003L6595b5906k75716a00751A83544b0519l0029A09854J09626E9644b87958
32339C7902J64309b02500f6256A44626D4762J03846c6116h933D8618J30749K4439
32328B03806f6387A40692c18144J54928j10152R9283A14636h5154j57387g688
32317b24604O830P5978A87793G077Q7621j9339j2301a70414r757B7980J6103c4113
$$ y = [-227504, 36936, -45657, 6227, -210657, 60542, 47247, -252778, 56749, -68007, -176036, -4049, -71164, -76161, 23953, -232048, -90769, -118232, 288665, -231253, -85253, -437209, 54799, -142155, 113025, -223121, -254271, 19950, -327515, -292027, -65218, 58732, 2363, 456, -99642, 103473, -44818, 54682, -311471, -124440, -255003, 160472, -410528, 77774, -209558, -37580, -94003, -57408, -25906, -301622, -100751, 183544, -20519, -50548, 109854, 219480, 59644, -287958, 37902, 202211, -202500, -66256, 144626, 44762, 148608, -36116, -8933, 48618, 179367, 203806, -66387, 140692, -318144, -163216, -273368, -174085, 114636, -85154, -242541, -7688, -224604, -217774, -141796, 187793, 7077, 94698, 75359, 63058, -170414, -180171, 27980, 44083, -34113]
32304d497P68C77280i6456M3451G8595f2172j64728B13069a97277O5136O4518
32293f7623A87192a87001a8524j96783K7411K733K3480i561j32584C5025b34589
32281H0551J3060a42836A34732D3371K0823a11438I2722a00837d7483B87146G7208
32269B1963a56797A0252c23865L4342D7189J05981e8688G558a32649A67532O697
32258A74229d6902m552j37485D4668c69224A40632a03986j5259C11273h560A39485
32246a01159F3345a29612B69313a68146M164P9630f517k98461A04753a01148b1781
32234A12641d2019k91109a65066N3361A44893B2800f7296j61969A56004b1587
32223a12647l9776N8838c7782o6557j53844k71081d1145j07226a3658m5641m9504
$$ y = [-4497, -3729, 377280, -96456, -53005, 78595, -62172, -226900, 213069, -197277, -132141, -67623, 187192, -187001, -18524, -215307, -187896, -185163, -161683, -9561, -142145, 35025, -234589, 80551, 93611, -142836, 134732, 43371, 64194, -111438, 92722, -100837, -47483, 287146, 77208, 21963, -156797, 10252, -323865, -289523, 47189, 153170, -58688, 7558, -132649, 167532, 174229, -46902, -51454, -188939, 44668, -369224, 140632, -103986, -119245, 311273, -8560, 139485, -101159, 63345, -129612, 269313, -168146, -163982, -84352, -6517, -304978, 104753, -101148, -21781, 112641, -42019, -333128, -165066, -111705, 144893, 22800, -67296, -229265, 156004, -21587, -112647, -152423, -93585, -37782, -104339, -258183, -529264, -41145, -148371, -13658, -59299, -108803]
32212a08803J0723k48891b3344A16648a74231A5413N784N3530A1445P2984Q0270
32201A64699A2774a12047J2551e113o0477l1284B83279a26145C4007K23705l4493
32190B23219n7286b15824A4252h2201D4267h2665F1384g2565H9665b19541J2700
32179b06841j16507H5426e8952K1232k72489h5070c7532a2497j9496C2538c14888
32167a3738j25552c7909G1858c55252a00226b4095M592A51192J91656b12762C5964
32155e81633a15819q0240A51486j9698K2812J12358F0186E360J87377n5857k3999
32144A12881O0901j6434a16427n7865I4144B9789J48015H1945a7180m0712j14979
32133a72871c7530A87348i0499j1114A70055a4502G21f8271L0427j1088j91252
$$ y = [-108803, -98080, -346971, -23344, 116648, -174231, 15413, 21197, 74727, 11445, 84429, 164699, 12774, -112047, -99496, -5113, -65590, -96874, 283279, -126145, 34007, 257712, 223219, 165933, -215824, 14252, -82201, 44267, -82665, 61384, -72565, 89665, -219541, -206841, -323348, 85426, -58952, -37720, -310209, -85070, -37532, -12497, -31993, 32538, -314888, -13738, -139290, -37909, 71858, -355252, -100226, -24095, -19503, 151192, 342848, -212762, 35964, -581633, -115819, -196059, 151486, 131788, 154600, 266958, 60186, 5360, 192737, 136880, 112881, 173782, 157348, -116427, -174292, 94144, 29789, 177804, 81945, -17180, -57892, -172871, -37530, 187348, -90499, -101613, 170055, -14502, 721, -68271, -37844, -48932, -240184]
32122b40184B03888d7831B10314j03047Q7711e2101a4899C6241P4514d9789E5769
32110E6731J9811K34832G9874K5803a6254A55021c02080a24881N7121l599k49617
32099c20976l7765a25949L498j29011A17393C6449a74888j31711K9997H7619J01637
32088A89256P6303d9800o4620A32459K8434c01497a31006A14157i3655j69712
32078b63367d3589j46764D3279L01676B1407a821q3913B70704E2469M03J53979
32067B06851H0052a26668q0444c3117F2526a9397C32023a73650C035P2058m607
32056G0486i4675B0322b2880A00704b07429d1181p6166A69966J7826c25986a24278
32044i9831q3139L4204A20418a26490q3560d6385j8361k9516E5738b67206n066
$$ y = [-240184, 203888, -47831, 210314, 107267, 194978, -52101, -14899, 36241, 110755, -49789, 55769, 56731, 76542, 311374, 79874, 105677, -16254, 155021, -302080, -124881, -67760, -71359, -320976, -358741, -125949, -122451, -251462, 117393, 36449, -174888, -306599, -276602, 87619, 189256, 265559, -49800, -114420, 132459, 160893, -301497, -131006, 114157, -93655, -263367, -43589, -190353, 43279, 344955, 21407, -1821, -85734, 270704, 52469, 52872, 206851, 80052, -126668, -207112, -33117, 62526, -19397, 332023, -173650, 3035, 75093, 70486, -94675, 20322, -22880, 100704, -207429, -41181, -117347, 169966, 187792, -325986, -124278, -99831, -182970, -148766, 120418, -126490, -210050, -46385, -64746, -94262, 55738, -267206, -272272]
32033b72272B36282q1883c07528c0707C3347c7177j27877A13424l3909a48873
32022a6420o7975r1855j04113A55966K05012a21106K2673l30157a5211B68987
32011E1333O3506c6771m57817c472j30184B19217H4433Q3502b71213C1695a40121
31999B8178c43064A15977g7066j41750J4515A3421K49458G4593k5893O1774a51502
31987a18077A4544J00809a29621A6200b32796f8684j17378A70435k2321a13013
31976B85813b11710m4446J04362D1420g6671L2319B62046a38337A05165c8743
31965a80114A5806f4565K305C01120H2466b79905C45541a32221B35533i0917C37136
31953A93993a44310B88458a34694a0353C3182e7836r6777O8348b1737D095K25427
$$ y = [-272272, 236282, 154399, -307528, -30707, 33347, -37177, -165054, 113424, 79515, -148873, -16420, -84395, -176250, -280363, 155966, 360978, -121106, -98433, -428590, -15211, 268987, 51333, 114839, -36771, -494588, -3472, -133656, 219217, 84433, 167935, -271213, 31695, -140121, 28178, -343064, 115977, -77066, -218816, -204301, 13421, 262879, 74593, 48700, 110474, -151502, -118077, 14544, 115353, -129621, 16200, -232796, -68684, -186062, 170435, 148114, -113013, 285813, -211710, -256156, -151794, 41420, -76671, -44352, 262046, -138337, 105165, -38743, -180114, 15806, -64565, -62260, 301120, 82466, -279905, 345541, -132221, 235533, -90917, 337136, 193993, -144310, 288458, -134694, -10353, 33182, -57836, -154613, -86265, -21737, 4095, 229522]
31942B29522G5784j1905b6206j11580a9350e418A08168l2671a50254L0102M808
31931a15344A972J05251D6748Q4082n801K24627h1456G4589b3561q3113A1271
31919a20808j19531H6137M8633a96270l21337a33810A1994K60828p3739a29277
31908i7686j81751A4952K737Q141J02070J6286a76373B2425J23636g5119j050
31897g6169F5468K2390e1345j28043c0829C9398h2655j9169J6220A11337M7693
31886A59030a37142k5414A04634N3350C0468h2894B93704b26997A5141J03674
31876A18815a43086A0411M501K25155e0751B3594f4282A04855M320O1151O3679
31865B34005a55887A48754a72265M4562I0984J89270C4731P9242A2376J16890
$$ y = [229522, 75784, 63879, -26206, -137786, -19350, -5418, 108168, 75497, -150254, -120152, -115344, 1972, 107223, 46748, 130830, 125029, 349656, -81456, 74589, -23561, -106674, 11271, -120808, -240339, 86137, 134770, -196270, -517607, -133810, 11994, 272822, 199083, -129277, -97686, -279437, 14952, 17689, 25830, 127900, 144186, -176373, 22425, 146061, -75119, -76169, 65468, 87858, -51345, -179388, -30829, 39398, -82655, -101824, -85604, 111337, 159030, -137142, -162556, 104634, 157984, 30468, -82894, 293704, -226997, 15141, 118815, -143086, 10411, 14912, 240067, -50751, 23594, -64282, 104855, 109175, 170326, 234005, -155887, 148754, -172265, -127703, 90984, 280254, 34731, 113973, 12376, 129266]
31855A29266a40741o7187E41a62305k53397i0817G7372Q4014C7505P4620d8477
31843C5065a04725q6148M8384l8924B01635b6504C48478f6403A39904c5357m39
31832c5796J4218k07216h4280A79552R8796I0185J34273K46705i8011j92556B66706
31820B93359I8705b421k1995j35762P6594E7656a90843E1003a87247P1235M1877
31809g4135A14396d3407A23238b90727e7437j42984a581n8049F506f7894j16933
31798a84827F7935N1388i8457A20721L90096a21483J8281N0512c864C2901a38926
31786C60044A6792K5725a19281J515r4947Q5231d161A76025b28922A02834a32700
31774h3183K8907r8878o2819j26229N3352C5233L8882p892K23503F8420R7735
$$ y = [129266, -140741, -207928, 541, -162305, -415702, -90817, 77372, 161386, 37505, 112125, -48477, 35065, -104725, -190873, -142489, -181413, 201635, -26504, 348478, -66403, 139904, -35357, -35796, -21578, -228794, -84280, 179552, 278348, 90185, 224458, 471163, -98011, -290567, 266706, 293359, 98705, -2421, -24416, -160178, -83584, 57656, -190843, 51003, -187247, -116012, -74135, 114396, -43407, 123238, -290727, -57437, -200421, -1581, -59630, 6506, -67894, -184827, 67935, 119323, -98457, 120721, 510817, -121483, -103202, -52690, -3864, 32901, -138926, 360044, 16792, 42517, -119281, -117766, -212713, -127482, -4161, 176025, -228922, 102834, -132700, -83183, -54276, -153154, -215973, -342202, -288850, 35233, 74115, 66223, 289726, 68420, 166155]
31763A66155Q7300C4909J49738f1402j08396A68993e2848j45858G6930a45763
31752A49795a88995g1492A5230e55509a47027c6757k8179m50904F7817b93650
31741B17378a67032e4686a2824M361B94121F8457b4021a1719j19183E3446R001
31730F2447b5088j4136C72489A62006G0985M0013j4359a62475B09241I8616a69846
31718h5532C11027C4388a5888H2808a61104B4438c98207a9316k09071k8242b2709
31706a75885A68719J09725H0508a0091j13227A89430a24859l23e3650k19641G25
31694E8888d10009A20363n7494d6281N485C663b2971M797n305A31222b03248O5275
31682a37973k54168J29351f0742A30785n1290a43565k1412A39982e664E2956f4086
$$ y = [166155, 253455, 34909, 184647, -61402, -169798, 168993, -52848, -198706, 76930, -145763, 149795, -188995, -71492, 15230, -555509, -147027, -36757, -64936, -515840, 67817, -293650, 217378, -167032, -54686, -12824, -8463, 294121, 68457, -24021, -11719, -130902, 53446, 62447, -25088, -39224, 372489, 162006, 70985, 110998, 96639, -162475, 209241, 98616, -169846, -85532, 311027, 34388, -15888, 82808, -161104, 24438, -398207, -19316, -228387, -256629, -22709, -175885, 168719, 278444, 80508, -10091, -123318, 189430, -124859, -125182, -53650, -273291, 725, 58888, -410009, 120363, 62869, -46281, -40796, 3663, -22971, -18174, -23479, 131222, -203248, -137973, -392141, -262790, -60742, 130785, 79495, -143565, -164977, 139982, -5664, 52956, -64086]
31670a54735L5737A63306b11342o2211N4889G1665a65106A28981n4254P723J03957
31659A86407b79158N4211A58761d2647Q853A95899b01144l1917l1142H8603k7408
31648F1195b23616P83M9611G8482b31589O5686H4489k7609c8233A85567b61156
31636C6508M2629a35116C9385M135a20127D7643J18461J79574C0152K37293h8711
31624a37519D0343P5244D0003a61735c2732p9336j65132f1288G4602l0499J84598
31613B28701j9122l3795D9939J45121b90849a27179I3338A9256J55052b70375
31602b27545h3651b5546q1863A31904d352B18508b40131A07027b17230i2340b0604
31590a92985k48106b16774A14062K7010d4696l42460E6350K5084A5773K0969c8005
$$ y = [-154735, -118998, 163306, -211342, -273553, -218664, 71665, -165106, 128981, 74727, 82450, 186407, -279158, -224947, 158761, -42647, -33794, 195899, -201144, -233061, -264203, 88603, 61195, -223616, -222833, -173222, 78482, -231589, -165903, 84489, 56880, -38233, 185567, -261156, 36508, 79137, -135116, 39385, 43520, -120127, 47643, 166104, 345678, 30152, 267445, -88711, -137519, 40343, 115587, 40003, -161735, -32732, -112068, -277200, -61288, 74602, 44103, 228701, 209579, 175784, 49939, 195060, -290849, -127179, 93338, 19256, 174308, -270375, -227545, -83651, -25546, -107409, 131904, -4352, 218508, -240131, 107027, -217230, -92340, -20604, -192985, -441091, -216774, 114062, 141072, -44696, -387156, 56350, 81434, 15773, 36742, -38005]
31578a27941H1895h7799A28134c0952F3860J78642M329a7954m9388A27534d766
31566d1764B7675b86069q3271g2188A15977d7990A33132E526b1615H0646A3508
31554b64578B25088b91357J27994B8067J96561a75542C18507j52242q1123K6102
31544A11244M0808C0143K92942a8384I3109f0416L42j6755n1134h796A04897B8626
31531a9694j40250E3603k6305a75033K3593E8755b43850A14545d57269a62776
31520c87082g3512E6619b10588k57772I9251b56313I2908b39372a6810B95499
31509b64231a11150B62116f9774A46833K16708j74709l5811a73616g4231B15797
31498A65606j159J56333a00768q3602q9987d2769B17599F5152J0452a40466A37415
$$ y = [-127941, 81895, -87799, 128134, -30952, 63860, 242502, 246831, -17954, -67342, 127534, -4766, -41764, 27675, -286069, -369340, -72188, 115977, -47990, 133132, 5526, -21615, 80646, 13508, -264578, 225088, -291357, -163363, 28067, 224628, -175542, 318507, 166265, 85142, 111244, 152052, 30143, 323085, -18384, 93109, -60416, -60074, -76829, -127963, -8796, 104897, 28626, -19694, -159944, 53603, 27298, -175033, -151440, 58755, -243850, 114545, -457269, -162776, -387082, -73512, 56619, -210588, -468360, 99251, -256313, 92908, -239372, -16810, 295499, -264231, -111150, 262116, -69774, 146833, 363541, 188832, 153021, -173616, -74231, 215797, 165606, 164447, 320780, -100768, -184370, -274357, -42769, 217599, 65152, 75604, -140466, 137415]
31486A60141N4726J60687A59596i9776l133l8545b1839B03648A4591a85316A56197
31474H7777D0032K54442i2596a8654B47427a21223A93345C6811a34615I5356b5022
31462a75782B43890q2938b7918A40203h15j59184P3704A8110e7537C330a06241
31450b02421f8341D1468a25565n7266f1664I8064a75652j2952K2754n0710E2103
31438a29889c200C4382L4760K6913H078a90168C5199a54728H5587a08257C2368
31426d6589C08243d4980D1741J3058b75736l4289R9850J04369A08008E2754g017
31414e4024j56604G6408A0897c39365a07077j43453C43322a38567G1153a84541
31403a59687a7781q0481A54706f6545C54566E0589K79200j39435b0137C9020a72334
$$ y = [160141, 214867, 375554, 159596, -99776, -102909, -141454, -21839, 203648, 14591, -185316, 156197, 87777, 40032, 294474, -92596, -18654, 247427, -121223, 193345, 36811, -134615, 95356, -25022, -175782, 243890, 160952, -27918, 140203, -815, -159999, -86295, 18110, -57537, 3330, -106241, -202421, -68341, 41468, -125565, -182831, -61664, 98064, -175652, -188604, -165850, -216560, 52103, -129889, -3200, 34382, 69142, 96055, 8078, -190168, 35199, -154728, 85587, -108257, 32368, -46589, 308243, -44980, 41741, 54799, -275736, -310025, -210175, -105806, 108008, 52754, -7017, -54024, -210628, 76408, 10897, -339365, -107077, -250530, 343322, -138567, 71153, -184541, -159687, -17781, -98262, 154706, -66545, 354566, 50589, 329789, 190354, -20137, 39020, -172334]
31391a65272h2048q29c4774B42872b37353B18724a96018A43170c61668D6236J98891
31380B45127E3639J85343g4964J2351c0141p6240j9165a5005I0905M4049c6032
31368a47602F2726K92383A26139a16305a5021m4606B96117A33071c2411j09153
31358a41564M2243j10574g8939A95014K04334j21849h3572A43266E6911R6502
31348A53413J21739b31114I8421a41978m5232j55471A31483a8811m7706A59080
31337B70912a36280m1417N5875n8157j13959B5912J22167b2913f795k43754A34700
31325d2465B62658a84683H2817a93551H7469a30619A55373f7949p4137m4849G1297
31313G5261h4030d477q295j08234d4530o626J7269B5845a5033k11874h419o5222
$$ y = [-165272, -82048, -82877, -34774, 242872, -237353, 218724, -196018, 143170, -361668, 46236, 245127, 53639, 238982, -74964, -62613, -30141, -106381, -125546, -15005, 90905, 134954, -36032, -147602, 62726, 355109, 126139, -116305, -15021, -59627, 296117, 133071, -32411, -141564, -99321, -209895, -78939, 195014, 399348, 277499, -83572, 143266, 56911, 153413, 275152, -231114, 98421, -141978, -187210, -342681, 131483, -18811, -66517, 159080, 270912, -136280, -177697, -121822, -179979, -293938, 25912, 148079, -22913, -6795, -250549, 134700, -42465, 262658, -184683, 82817, -193551, 87469, -130619, 155373, -67949, -142086, -186935, 71297, 75261, -84030, -4477, -12772, -121006, -44530, -51156, -33887, 25845, -15033, -226907, -8419, -73641]
31301g3641r414E2974J83932C0298a22721c678F1893h6067j21381A56689Q2645
31290B39334i7236d1254a928l97770C30068q4506H8428J77439A32759m5825a99921
31278b4108k38440B76871b25182D4079K5213N0675b56898A51808D9998P6425B2914
31266A06050Q7279O9876M4072b59513f8702A96483D999K92567g5789m1353a6897
31254a1008M824A62905b22359G8897k6150b74059I6907P8620p9974J17363a73849
31242A9824K39389A8138g547A75462b88130A94739a60182d4543C3727M1775J11077
31231A86579J695b7751A4228a82558A14976J51063a60282d4843l0277m25195b40166
31219h6290H6381P4291c0945k02967M8794d3563A07612l8370J72760b04202e9640
$$ y = [-73641, -83055, 52974, 236906, 30298, -122721, -3678, 61893, -86067, -207448, 156689, 239334, -97236, -41254, -1928, -399698, 330068, 245562, 88428, 265867, 132759, 86934, -199921, -24108, -262548, 276871, -225182, 44079, 69292, 119967, -256898, 151808, 49998, 126423, 22914, 106050, 193329, 263205, 307277, -259513, -68702, 196483, 4999, 297566, -75789, -117142, -16897, -11008, -6184, 162905, -222359, 78897, 52747, -274059, 96907, 175527, 95553, 212916, -173849, 19824, 259213, 18138, -7547, 175462, -288130, 194739, -160182, -44543, 33727, 75502, 186579, 188274, -27751, 14228, -182558, 114976, 266039, -160282, -44843, -75120, -500315, -240166, -86290, 86381, 160672, -30945, -233912, -185118, -43563, 107612, 69242, 242002, -204202, -59640]
31207d17860A02254P639K7886b8931C01411b6930E0945j6280K51715A2251L63257
31196C75508c9803j18015A50711a58066H121a7404n7118I0186P0716h7089G9987
31184D8564a74925Q4216j56699C24252E0290e2937K0643m8334A46731C9000a32018
31172b32842B0877f7525r9367j02134J31973L516N9144k0091K4882B89936b06800
31160a31332L8172M4099a4763o8638k7092K3221A10661b08761J0319n4986B4356
31148b3972j9616B62748a14157j27063J02351B11170r4814O4863a56454M7738
31138a08716A21977K35543j04820E3304b70248B00760j7208C4892c66805A59865
31127F0424K11820a78235g8276C37525e1043D25221a83623j26074J6264A6178
$$ y = [-417860, 102254, 109893, 137779, -28931, 301411, -26930, 50945, 34665, 286380, 12251, 375508, -39803, -157818, 150711, -158066, 8121, -17404, -74522, 90186, 160902, -87089, 79987, 48564, -174925, -90709, -247408, 324252, 50290, -52937, -32294, -80628, 146731, 39000, -132018, -232842, 20877, -67525, -166892, -269026, -137053, -133537, -74393, -94484, -69602, 289936, -206800, -131332, -93160, -49061, -14763, -83401, -110493, -87272, 110661, -208761, -198442, -253428, 24356, -23972, -43588, 262748, -114157, -241220, -138869, 211170, 116356, 181219, -156454, -108716, 121977, 357520, 252700, 53304, -270248, 200760, 183552, 34892, -366805, 159865, 60424, 272244, -178235, -78276, 337525, -51043, 425221, -183623, -309697, -293433, 16178]
31116C19008b11265c2973k0835H6245f877j85805A10722c96613a97042A99731
31105d1868r3482n1996m2027A06227J25876L9791F5212M0203i2464B67048b69782
31093b16928N6906p3773e8403A1174f5386k5663K0793G9350a64469C85688a17757
31081d9446j95465J20882L6758A02037D4397L3914f0874a5919A65987j5841i9135
31069C15621f8310C955b08j54015A02535a6826E9543a66235C49824b76766Q4308
31058a92458h9428C31003a43151j6373A6302b3449A32841K1605B5387a62576C09297
31046b91648H138c9834B2044e2081F7858B8634J3780g5407c0559p6423B36778
31034D8936J9834e6675A27895A7319J1160g3487G4568D764J75379f7218C8445
$$ y = [319008, -211265, -32973, -53808, 86245, -6877, -192682, 110722, -396613, -197042, 199731, -41868, -135350, -187346, -229373, 106227, 232103, 271894, 65212, 105415, -92464, 267048, -269782, -216928, -160022, -233795, -58403, 11174, -65386, -91049, -70256, 79350, -164469, 385688, -117757, -49446, -244911, -124029, -87271, 102037, 44397, 78311, -60874, -15919, 165987, 150146, -99135, 315621, -68310, 3955, -208, -154223, 102535, -16826, 59543, -166235, 349824, -276766, -192458, -89428, 331003, -143151, -159524, 16302, -23449, 132841, 154446, 25387, -162576, 309297, -291648, 8138, -39834, 22044, -52081, 67858, 28634, 42414, -75407, -30559, -106982, 236778, 48936, 68770, -56675, 127895, 17319, 28479, -73487, 74568, 4764, 180143, -67218, 38445]
31022i0182A51285a34781D40654b63499a04300E19471d40160F1295a45423F3117
31011a03725B11520n6720d7551A6594a17148B26106B4002a89486A86182a7092
31000B78912D2735J01252a98023A70922h7579B0674e6179o7062R432A41113a79273
30988I6497M5354Q4191a82119A81479g6556G5533d9586D5467b13066P4354l56866
30977d95578b658A50529d6909B18852a05278A51012a38861n3996P1743G3758K4168
30966I7926i3499k32038B31935r9598a6560k33418c0692l4776B4339A0096a72324
30954I772L3171J53015l3377J34306A09400d3476f699j67550F0328c710a408n3102
30942e4510f742F0805K1325J5263C9143a92366A8440b81629f6382C2792K55045
$$ y = [-90182, 151285, -134781, 440654, -263499, -104300, 519471, -440160, 61295, -145423, 63117, -103725, 211520, 154800, -47551, 16594, -117148, 226106, 24002, -189486, 186182, -17092, 278912, 42735, 143987, -198023, 170922, -87579, 20674, -56179, -123241, -113809, 141113, -179273, 96497, 141851, 226042, -182119, 181479, -76556, 75533, -49586, 45467, -213066, -138712, -495578, -2658, 150529, -46909, 218852, -105278, 151012, -138861, -192857, -121114, 73758, 97926, -93499, -325537, 231935, 132337, -16560, -249978, -30692, -65468, 24339, 10096, -172324, 9772, 42943, 195958, 162581, 296887, 109400, -43476, -6699, -174249, 60328, -3710, -1408, -54510, -6742, 60805, 82130, 97393, 39143, -192366, 18440, -281629, -66382, 32792, 287837]
30931B87837a8752I906b986j80542e1190A7571J33821J99194F8494O9659c37462
30919A34925c74765a9632j59216k73236b02941A86411D6923i4999b7197j20536
30909a47733K0519A58797K32447j55250a51477A21130K0263K40773I5416c02535
30898e6188B33428i8373J8093h028E7236h9309A1289J24667f3150I7515b65020
30886B12164I1916J48072j04690b2467l02614A44158B907K82144j17938B0380
30875G844a14543j92058A17417a28623A6196J80975M1939o6401b4879k09128O7902
30864a66105m2885D9039J53873A7898J30997l4245a98577A2763g9806A07717b1471
30852h6360b5423A00945i5166I615e117D577h0212A07031d820k53685m3856a36352
$$ y = [287837, -18752, 9906, -2986, -183528, -51190, 17571, 151392, 350586, 68494, 138153, -337462, 134925, -374765, -19632, -178848, -452084, -202941, 186411, 46923, -94999, -27197, -147733, -127214, 158797, 391244, 235994, -151477, 121130, 141393, 382166, 95416, -302535, -56188, 233428, -98373, -80280, -8028, 57236, -89309, 11289, 135956, -63150, 97515, -265020, 212164, 91916, 239988, 135298, -22467, -325081, 144158, 2907, 285051, 167113, 20380, 7844, -114543, -306601, 117417, -128623, 16196, 197171, 239110, 172709, -24879, -234007, -166105, -208990, 49039, 202912, 17898, 148895, 114650, -198577, 12763, -79806, 107717, -21471, -86360, -25423, 100945, -95166, 9615, -5117, 4577, -80212, 107031, -4820, -258505, -302361, -136352]
30839a8014m27897B45896L7457q1194Q0634M7031L2930a713k23950f4533E14427
30827F4172J5373a77065A02987A240g0230A99407o6867a04986A47688J7419a42617
30815E5551j4761K9599M066M4517I939K56752C6253h4793j19964E4380c4404D4330
30802A97923E1067L716K265Q2585a17895C36243A32630c35429A42031b31773J14119
30791a17654a9087k83811I7463K1598b72907B49452D7709m294j1059J27742N3755
30780B13853H5633J51500a18199M9565o3761B8179a9225Q443B12005H7319a88309
30768a1084m3080A01522K2883l2461L9089a00282A4899K02083E4519a40623h654
30756a91915c9047A3090K83462n8492I5671C9747b97657A39908a36503B86976
$$ y = [-18014, -445911, 245896, 283353, 202159, 282793, 329824, 362754, -1713, -225663, -64533, 514427, 64172, 79545, -177065, 102987, 1240, -70230, 199407, 132540, -104986, 147688, 165107, -142617, 55551, 40790, 70389, 74455, 118972, 9939, 266691, 36253, -84793, -204757, 54380, -34404, 44330, 197923, 51067, 54783, 57048, 139633, -117895, 336243, 132630, -335429, 142031, -231773, -117654, -19087, -302898, 97463, 119061, -272907, 249452, 47709, 43415, 32356, 160098, 213853, 85633, 237133, -118199, -68634, -132395, 28179, -19225, -10782, 212005, 87319, -188309, -11084, -54164, 101522, 124405, 91944, 131033, -100282, 14899, 216982, 54519, -140623, -8654, -191915, -39047, 13090, 296552, 238060, 95671, 39747, -297657, 139908, -136503, 286976]
30745e1543b2533o0798r1927j3685A140b5156C3243j085i6990a9119n4613A60206
30732C4438a19699A27289K24183A45873M3771i987B05776c27577a36102j8437
30722a54539I5399l7660B6601j0469b6165C14179J0055i3210M061A41290i9672
30710I6059M1132P056a04976K754B33177D4229b18130C68785D1352k287b29890
30698A22059i9170l0561I5607a88952A29918f0648H2605J70236c20864a19272
30687H2585a14403E7035a04629m460B04224C0039J41552a86146p4117d6260q0326
30676a26586C5078c49571C77831g2162a8575A05005c23555H786a29594B2333a70215
30664D1967L1506j1254K65622A57537k2378e1125j0109a8195B42269c96485A89984
$$ y = [-51543, -22533, -83331, -175258, -188943, 1140, -25156, 33243, 32158, -96990, -19119, -73732, 160206, 34438, -119699, 127289, 351472, 145873, 189644, -9987, 205776, -327577, -136102, -154539, 95399, 57739, 26601, 16132, -26165, 314179, 324234, -93210, -89149, 141290, -99672, 96059, 137191, 144247, -104976, -102222, 233177, 44229, -218130, 368785, 41352, 39065, -229890, 122059, -99170, -129731, 95607, -188952, 129918, -60648, 82605, 252841, -320864, -119272, 82585, -114403, 57035, -104629, -109089, 204224, 30039, 171591, -186146, -260263, -46260, -126586, 35078, -349571, 377831, -72162, -18575, 105005, -323555, 8786, -129594, 22333, -170215, 41967, 73473, 62219, 327841, 157537, 135159, -51125, -61234, -18195, 242269, -396485, 189984]
30652A20199J41597H1216b84869N8106Q209D4662A1940a58203F5813a94041D18154
30640B67275g0264k39519A26863a29014A13600b78771A7018a73229E9900j8074
30630D1826a03125C085M6485b26053A8789f9725I387Q6029b91401a00330L4394
30619f5936C33379b02731l9043C25060c33441H4875B1150h2869E3511K48202c44356
30607E2063J4182a94742A50667g9215G6501d2888k34908B41393G2679P1707k6205
30596A18181a5794I6055J31346J33180a24156A04359j6750L8645A8735p07K88107
30585C06135G7753J1835J36586J3527a34550E26M8913H606M059P793a33637A40907
30572a97981j46958A21729a83629C87584g9411l13051M5918J29621C7585g5760
$$ y = [120199, 261796, 81216, -284869, -226763, -218554, 44662, 11940, -158203, 65813, -194041, 418154, 267275, -70264, -309783, 126863, -129014, 113600, -278771, 17018, -173229, 59900, 41826, -103125, 3085, 49570, -226053, 18789, -69725, 9387, 95416, -291401, -100330, -65936, 333379, -202731, -241774, 325060, -333441, 84875, 21150, -82869, 53511, 301713, -344356, 52063, 66245, -194742, 150667, -79215, 76501, -42888, -277796, 241393, 72679, 144386, 118181, -15794, 96055, 227401, 360581, -124156, 104359, 87609, 126254, 18735, 18028, 306135, 77753, 89588, 226174, 239701, -134550, 526, 49439, 8606, 12665, 20458, -133637, 140907, -197981, -344939, 121729, -183629, 387584, -79411, -392462, -346544, -216923, 37585, -75760]
30561B38826G2883L3615c7126j51541d9731o833A09406b0680F3264c49906A71077
30549g4264j26428a5424A16661a90289D41707A08031O5744D1537b23384A22216
30538a06924A50538K9420m4584K7879a01573b5525B1960M36738a05861k699B5638
30526B8985K82346a2398A09729E2270a38842F6524J67198a28220m7693k0669j7524
30515b14106G7397K50315O1415b55688a24521M0487m8063A19684E5422e3118m176
30504e7294j3760b8965B07765a14925M0348I1427k0778j875a01160k363c2787
30492a74958e4565E9346K7358a02050k07445A84580J6907b80822g8193d762r6931
30481a01693J5754B13552f3456l221n6637m822j70038A40180a39713K6586B2623
$$ y = [238826, 72883, 106498, -37126, -188667, -49731, -56564, 109406, -20680, 63264, -349906, 171077, -74264, -200692, -15424, 116661, -190289, 441707, 108031, 173775, 41537, -223384, 122216, -106924, 150538, 179958, 135374, 163253, -101573, -25525, 21960, 458698, -105861, -108560, 25638, 28985, 311331, -12398, 109729, 52270, -138842, 66524, 233722, -128220, -175913, -196582, -214106, 77397, 327712, 389127, -255688, -124521, -84034, -132097, 119684, 55422, -53118, -57294, -71054, -28965, 207765, -114925, -74577, 91427, 70649, 68774, -101160, -103523, -32787, -174958, -54565, 59346, 86704, -102050, -309495, 184580, 201487, -280822, -78193, -4762, -101693, -85939, 213552, -63456, -66677, -123314, -128136, -298174, 140180, -139713, -113127, 22623]
30469C7818h929G3074K2906h2088j89707D9977J54502a05263C9269a60733A5875
30457A6475J71504n4691m5751a48065A00007K32744a12270k6823d4769B55388
30446A50579J05479b22506O7114d8861B22551o0354b1481B700J73041c02684B62142
30434b3183F26639H9274K36046E1696a48948F5a91974n024K9544A98741d681D0061
30421B46088i5337G8507l3121M2910b21942B37395o2665n5322l7991J33740E6547
30409B0013c68489A77425m2802M9146g3423C10297A20805a1933B12277g626k13939
30398b21565A73170d6919A0344J28834b6157j19767M153C6286b90106H0251n150
30387G5101J05966H925c2043B12536c52718C14901F5093e3427K1753B13004I8810
$$ y = [37818, -8929, 73074, 95980, -82088, -271795, 49977, 204479, -105263, 39269, -160733, 15875, 16475, 187979, 133288, 87537, -148065, 100007, 332751, -112270, -139093, -44769, 255388, 150579, 256058, -222506, -155392, -48861, 222551, 162197, -21481, 2700, 175741, -302684, 262142, -23183, 626639, 89274, 325320, 51696, -148948, 65, -191974, -196998, -167454, 198741, -4681, 40061, 246088, -95337, 78507, 45386, 88296, -221942, 237395, 174730, 119408, 81417, 215157, 56547, 20013, -368489, 177425, 134623, 183769, -73423, 310297, 120805, -11933, 212277, -7626, -221565, 173170, -46919, 10344, 139178, -26157, -145924, -141771, 36286, -290106, 80251, 75101, 181067, 8925, -32043, 212536, -352718, 314901, 65093, -53427, -31674, 213004, 98810]
30375C24390j55204b40112P0434a6388L279j60005B60140q3055K00036a04992
30364c36334F1363N9327h6134B43634l5926E9228N1659e3822k09877A88264i771
30352f6212j48890K7384a7456j31824b3342E0300a45910f5881m6515k3802F6367
30340E4635M6996D2906J12695b37631I2097e4508G9812a02598B03902K2336a18523
30328A01396e6013A8088R4757L6315a44018C8788J33719g5996D842J1539J26744
30317A43125B2070K4623a82058e8616C9806A5612b0641A564c5714K594B0036b124
30304a17462A01136M3285B340K74966j25074g2349D10121e9804q3126C47146a71985
30292c46133A75657a93853a9691l79910g8196B21993F4780h5218L3892G6824n188
$$ y = [324390, 169186, -240112, -169678, -16388, -13109, -173114, 260140, 177085, 377121, -104992, -336334, 61363, 120690, -86134, 243634, 207708, 59228, 110887, -53822, -263699, 188264, -9771, -66212, -215102, -187718, -17456, -149280, -23342, 50300, -145910, -65881, -112396, -136198, 66367, 54635, 101631, 42906, 155601, -237631, 92097, -54508, 79812, -102598, 203902, 226238, -118523, 101396, -56013, 18088, 112845, 149160, -144018, 38788, 172507, -75996, 4842, 16381, 143125, 22070, 46693, -182058, -58616, 39806, 15612, -20641, 1564, -35714, -33120, 20036, -2124, -117462, 101136, 144421, 2340, 277306, 152232, -72349, 410121, -59804, -142930, 347146, -171985, -346133, 175657, -193853, -19691, -399601, -78196, 221993, 64780, -85218, -51326, 76824, 71636]
30281G1636d36358A04087g9582A55498a97514A7294J02392a32346C08821F0067
30270a82234G6866k9548J61646J89703a37371b1453o2812A98J73824g0329F4525
30258A35125a45217H1958J1258b0326A07609b56513D37907k06952F3397k0658
30248D2739K18182h4236A65389a07698j08651m2220F2395h8181j37199A18208
30237c620p832H0999P7225l9923e1926C13014A41825M7880a42839C55576I9646
30225A8307K5808b44190E5425c77567a36344j84690D9075K75012A51814c62168
30214d8673B67467h386C6093J88657a7845k29392B00641l4482a1925r9207o481
30203a17613r5221C61571b71517F6438N2378l0202J347L8581i1814A6392O9576
$$ y = [71636, -436358, 104087, -79582, 155498, -197514, 17294, 119686, -132346, 308821, 60067, -182234, 76866, 47318, 208964, 398667, -137371, -21453, -84265, 198, 174022, -70329, 64525, 135125, -145217, 81958, 93216, -20326, 107609, -256513, 437907, 230955, 63397, 42739, 260921, -84236, 165389, -107698, -216349, -258569, 62395, -88181, -225380, 118208, -3620, -11452, 80999, 158224, 118301, -51926, 313014, 141825, 189705, -142839, 355576, 99646, 18307, 44115, -244190, 55425, -377567, -136344, -321034, 49075, 324087, 151814, -362168, -48673, 267467, -8386, 36093, 224750, -17845, -247237, 200641, 166159, -11925, -111132, -117613, -212834, 361571, -271517, 66438, 118816, 88614, 89961, 128542, -91814, 16392, 85968]
30192H5968K17019h3521A67207P7914j18383d6010a2861j55338b0995H9823c55509
30180B14551o3378a42794J5311L2452B56332e1738j74229B85411c08871c7543
30169A67382E6831R2001c65264A05236k8739J97839a52137f2507B01527L6708
30159B38235b16522B55079A25716a56970B4434J1593c0533l81249d7429B06840
30148f8674D62609k18275j07643J83006a2207B2945H783a70767A63704e644G0568
30136a04712n1669P6712K6837k10791Q8287h5375E9084A384K82396M5866b20515
30124A60363p2641a0372H5917i884A87982e6010F7291J8847K0764d5801A63647
30112a91391j90520B35135J76845J28416a69181P0042K5205I7220O2812c0002
$$ y = [85968, 302987, -83521, 167207, 245121, 126738, -46010, -12861, -168199, -20995, 89823, -355509, 214551, 151173, -142794, -127483, -95031, 256332, -51738, -225967, 285411, -308871, -37543, 167382, 56831, 148832, -365264, 105236, 76497, 274336, -152137, -62507, 201527, 238235, -216522, 255079, 125716, -156970, 24434, 36027, -30533, -411782, -47429, 206840, -68674, 462609, 244334, 136691, 319697, -12207, 22945, 8783, -170767, 163704, -5644, 70568, -104712, -156381, -79669, -52832, -263623, -175336, -85375, 59084, 1384, 283780, 329646, -220515, 160363, 87722, -10372, 85917, -9884, 187982, -56010, 67291, 86138, 106902, -45801, 163647, -191391, -381911, 235135, 411980, 540396, -169181, -99139, -73934, 97220, 160032, -30002]
30101C693i0887B56562c2770A84957A2429f1935m3524B13983D4544L2005
$$ y = [3693, -90887, 256562, -32770, 184957, 12429, -61935, -105459, 213983, 44544, 76549]