
##TITLE=AC1267_CTIAH12085_6647440_FoAI34keot
##JCAMPDX= 6.0         $$ Bruker NMR JCAMP-DX V2.0
##DATA TYPE= NMR SPECTRUM
##DATA CLASS= NTUPLES
##ORIGIN= BRUKER
##OWNER= Administrator
$$ 1.72 TOPSPIN		Version 2.1
$$ 2012-08-09 15:36:52.359 -0500  Administrator@TOPSPIN
$$ Compression mode = diff/dup
##.OBSERVE FREQUENCY= 400.02188249412
##.OBSERVE NUCLEUS= ^1H
##.ACQUISITION MODE= SIMULTANEOUS (DQD)
##.ACQUISITION SCHEME= undefined
##.AVERAGES= 8
##.DIGITISER RES= 22
##SPECTROMETER/DATA SYSTEM= spect
##.PULSE SEQUENCE= zg30
##.SOLVENT NAME= COFFEE_meoh
##.SHIFT REFERENCE= INTERNAL, COFFEE_meoh, 1, 14.98509
##AUDIT TRAIL= $$ (NUMBER, WHEN, WHO, WHERE, PROCESS, VERSION, WHAT)
$$ ##TITLE= Audit trail, TOPSPIN		Version 2.1
$$ ##JCAMPDX= 5.01
$$ ##ORIGIN= Bruker BioSpin GmbH
$$ ##OWNER= Administrator
$$ $$ C:\Bruker\TOPSPIN/data/COFFEE/nmr/AC1267_CTIAH12085_6647440_FoAI34keot/10/pdata/1/auditp.txt
$$ ##AUDIT TRAIL=  $$ (NUMBER, WHEN, WHO, WHERE, PROCESS, VERSION, WHAT)
(   1,<2012-08-09 15:36:28.328 -0500>,<Administrator>,<TOPSPIN>,<go>,<TOPSPIN 2.1>,
      <created by zg
	started at 2012-08-09 15:35:20.078 -0500,
	POWCHK enabled, PULCHK disabled,
       configuration hash MD5:
       6B 1B 68 BB D9 2E 58 E2 7F 35 AD 54 07 DF 0E 41
       data hash MD5: 64K
       C6 B8 3C 75 B8 72 6E 8D 69 F8 60 DB B7 A7 4D 58>)
(   2,<2012-08-09 15:36:38.062 -0500>,<Administrator>,<TOPSPIN>,<proc1d>,<TOPSPIN 2.1>,
      <Start of raw data processing
       efp LB = 0 FT_mod = 6 PKNL = 1 PHC0 = 0 PHC1 = 0 SI = 32K 
       data hash MD5: 32K
       70 33 FD 91 CF 82 CD 2A 13 9A A9 CA 26 F8 5A BC>)
(   3,<2012-08-09 15:36:38.890 -0500>,<Administrator>,<TOPSPIN>,<proc1d>,<TOPSPIN 2.1>,
      <pk PHC0 = 175.188 PHC1 = 0 
       data hash MD5: 32K
       A6 4F 33 11 5F 0F 77 BC D0 55 2A 5C 7E 32 BC B4>)
(   4,<2012-08-09 15:36:39.281 -0500>,<Administrator>,<TOPSPIN>,<proc1d>,<TOPSPIN 2.1>,
      <abs ABSG = 1 
       data hash MD5: 32K
       29 09 1B 98 18 0D B3 E4 EF 13 0B 0E 54 07 62 06>)
(   5,<2012-08-09 15:36:39.625 -0500>,<Administrator>,<TOPSPIN>,<proc1d>,<TOPSPIN 2.1>,
      <abs ABSG = 2 
       data hash MD5: 32K
       FD 49 6E C4 7B 02 EB 06 ED 93 CA 82 BB 3F CC 38>)
(   6,<2012-08-09 15:36:39.937 -0500>,<Administrator>,<TOPSPIN>,<proc1d>,<TOPSPIN 2.1>,
      <abs ABSG = 3 
       data hash MD5: 32K
       73 B4 95 79 F6 C0 35 35 CB A7 63 EC 38 34 1A 9B>)
(   7,<2012-08-09 15:36:40.218 -0500>,<Administrator>,<TOPSPIN>,<proc1d>,<TOPSPIN 2.1>,
      <abs ABSG = 4 
       data hash MD5: 32K
       38 E7 A7 17 BC 1A C7 ED BE E8 1D BF A4 44 8C 1A>)
(   8,<2012-08-09 15:36:40.593 -0500>,<Administrator>,<TOPSPIN>,<proc1d>,<TOPSPIN 2.1>,
      <abs ABSG = 5 
       data hash MD5: 32K
       2D 21 ED 65 CB 74 E7 02 3F 3F 20 0F 15 FF FE 34>)
$$ ##END=
$$ 
$$ $$ hash MD5
$$ $$ B6 76 0B F0 3B AC 9E C6 EF 6F 4E 40 6C 57 31 C2
##$RELAX= 
##$RELAX= 
##$RELAX= 
##$RELAX= 
##$RELAX= 
##$RELAX= 
##$RELAX= 
$$ Bruker specific parameters
$$ --------------------------
$$ [...]
##$TP= (0..7)
150 150 150 150 150 150 150 150
##$TP07= 0
##$TPNAME0= <>
##$TPNAME1= <>
##$TPNAME2= <>
##$TPNAME3= <>
##$TPNAME4= <>
##$TPNAME5= <>
##$TPNAME6= <>
##$TPNAME7= <>
##$TPOAL= (0..7)
0.5 0.5 0.5 0.5 0.5 0.5 0.5 0.5
##$TPOFFS= (0..7)
0 0 0 0 0 0 0 0
##$TUNHIN= 0
##$TUNHOUT= 0
##$TUNXOUT= 0
##$USERA1= <user>
##$USERA2= <user>
##$USERA3= <user>
##$USERA4= <user>
##$USERA5= <user>
##$V9= 5
##$VALIST= <valist>
##$VCLIST= <CCCCCCCCCCCCCCC>
##$VD= 0
##$VDLIST= <DDDDDDDDDDDDDDD>
##$VPLIST= <PPPPPPPPPPPPPPP>
##$VTLIST= <TTTTTTTTTTTTTTT>
##$WBST= 1024
##$WBSW= 4
##$XGAIN= (0..3)
0 0 0 0
##$XL= 0
##$YL= 0
##$YMAX_a= 471542
##$YMIN_a= -617908
##$ZGOPTNS= <>
##$ZL1= 120
##$ZL2= 120
##$ZL3= 120
##$ZL4= 120
##$ABSF1= 14.98509
##$ABSF2= -5.573092
##$ABSG= 5
##$ABSL= 3
##$ALPHA= 0
##$AQORDER= 0
##$ASSFAC= 0
##$ASSFACI= 0
##$ASSFACX= 0
##$ASSWID= 0
##$AUNMP= <proc_prof1d_extract_pilot.lims>
##$AXLEFT= 0
##$AXNAME= <>
##$AXNUC= <1H>
##$AXRIGHT= 0
##$AXTYPE= 0
##$AXUNIT= <>
##$AZFE= 0.1
##$AZFW= 0.1
##$BCFW= 0
##$BC_mod= 0
##$BYTORDP= 0
##$COROFFS= 0
##$CY= 15
##$DATMOD= 1
##$DC= 0
##$DFILT= <>
##$DTYPP= 0
##$F1P= 0
##$F2P= 0
##$FCOR= 0.5
##$FTSIZE= 32768
##$FT_mod= 6
##$GAMMA= 0
##$GB= 0
##$INTBC= 1
##$INTSCL= 1
##$ISEN= 128
##$LB= 0
##$LEV0= 0
##$LPBIN= 0
##$MAXI= 10000
##$MC2= 0
##$MEAN= 0
##$ME_mod= 0
##$MI= 0
##$NCOEF= 0
##$NC_proc= -8
##$NLEV= 6
##$NOISF1= 0
##$NOISF2= 0
##$NSP= 0
##$NTH_PI= 0
##$NZP= 0
##$OFFSET= 14.98509
##$PC= 1
##$PHC0= 175.188
##$PHC1= 0
##$PH_mod= 1
##$PKNL= yes
##$PPARMOD= 0
##$PPDIAG= 0
##$PPIPTYP= 0
##$PPMPNUM= 2147483647
##$PPRESOL= 1
##$PSCAL= 4
##$PSIGN= 0
##$PYNMP= <proc.py>
##$REVERSE= no
##$SF= 400.02
##$SI= 32768
##$SIGF1= 0
##$SIGF2= 0
##$SINO= 400
##$SIOLD= 32768
##$SPECTYP= <>
##$SREGLST= <1H.CDCl3>
##$SSB= 0
##$STSI= 32768
##$STSR= 0
##$SW_p= 8223.68421052631
##$SYMM= 0
##$S_DEV= 0
##$TDeff= 65536
##$TDoff= 0
##$TI= <>
##$TILT= no
##$TM1= 0
##$TM2= 0
##$TOPLEV= 0
##$USERP1= <user>
##$USERP2= <user>
##$USERP3= <user>
##$USERP4= <user>
##$USERP5= <user>
##$WDW= 1
##$XDIM= 32768
##$YMAX_p= 458128673
##$YMIN_p= -664476
##$CURPLOT= <Network HP LaserJet P1505>
##$CURPRIN= <$Network HP LaserJet P1505>
##$DFORMAT= <normdp>
##$LAYOUT= <+/1D_H.xwp>
##$LFORMAT= <normlp>
##$PFORMAT= <normpl>
##$SURQMSG= 1
$$ End of Bruker specific parameters
$$ ---------------------------------
##NTUPLES= NMR SPECTRUM
##VAR_NAME=  FREQUENCY,     SPECTRUM/REAL,   SPECTRUM/IMAG
##SYMBOL=    X,             R,               I
##VAR_TYPE=  INDEPENDENT,   DEPENDENT,       DEPENDENT
##VAR_FORM=  AFFN,          ASDF,            ASDF
##VAR_DIM=   32768,         32768,           32768
##UNITS=     HZ,            ARBITRARY UNITS, ARBITRARY UNITS
##FACTOR=    0.250966925370066, 1,           1
##FIRST=     8223.43324360094, -157911,      -221889
##LAST=      0,             -18205,          -50262
##MIN=       0,             -664476,         0
##MAX=       8223.43324360094, 458128673,    0
$$ Real data points
##PAGE= N=1
##DATA TABLE= (X++(R..R)), XYDATA
$$ [...]
19486F0302b73797C08761a97172q2911E5560e0840j17159e3510j15512F9173a35511
19474a40990M2465k95266a4466k95057J672L2509g8074J7978p1091j23705c7311
19462B1321J74013J30188A56991a03631E4308K4483a46935n6984B36625b85635
19451G2772a03927i032B34956G2934a58831K653B43027b01282j21238J36092A40017
19439d10586j74115b05882r6056a00649A69282a08342n9235G1373J6097C8373
19428a55847D9309A8128a26985E8400b15292I8373a76327m4053g4792j83090B00676
19416a18287A55975a40056j24003g5458B55860A8074e9079j05064b2630G5675
19405A77244a59627C46983E6962K0941b24570A00633m7290a66476j7834e9791
$$ plain form
19486 60302 -273797 308761 -197172 -280083 55560 -50840 -167999 -53510 -169022 69173 -135511
19474 -140990 -98525 -393791 -14466 -309523 -307851 -275342 -78074 -60096 -131187 -254892 -37311
19462 21321 195334 325522 156991 -103631 54308 78791 -146935 -203919 236625 -285635
19451 72772 -103927 -9032 234956 72934 -158831 -156178 243027 -201282 -322520 -186428 140017
19439 -410586 -584701 -205882 -301938 -100649 169282 -108342 -167577 71373 87470 38373
19428 -155847 49309 18128 -126985 58400 -215292 98373 -176327 -220380 -74792 -257882 200676
19416 -118287 155975 -140056 -264059 -75458 255860 18074 -59079 -164143 -22630 75675
19405 177244 -159627 346983 56962 77903 -224570 100633 53343 -166476 -184310 -59791
19394a35425n1358q199A96825a21437a2635j3711A19931a99427A01822C4324J21336
19383A55660a46607L7311l5816p7387j28504J734J71734J7818m3956C28901H2599
19371B1162e1780C6589K3259g3786G1837C1177M321A5654d7872j1895A71069i3691
19358a53336A09863k121i3540I7597b88018d946j71300A10601a10032D5865e51761
19346A07245M4316c7286B09370a58165M5978n4997j30786h8212k41664A51830
19335a36822k0539a0992B3835J41420M6256i1740j90750F1550a12169n8786p7147
19324b48102A284h3265A416J29496b28528i3817j71157j649I658a93797a68l28409
19312c28577a01560q1486j75638g4016H8162e3330b6290A8917L84543C8186a52695
$$ plain form
19394 -135425 -186783 -194982 196825 -121437 -12635 -26346 119931 -199427 101822 34324 155660
19383 155660 -146607 -109296 -145112 -222499 -351003 -349269 -177535 -159717 -203673 328901 82599
19371 21162 -51780 36589 59848 -73786 71837 31177 35498 15654 -47872 -59767 171069 -93691
19358 -153336 109863 107742 -93540 97597 -288018 -4946 -176246 110601 -110032 45865 -551761
19346 107245 151561 -37286 209370 -158165 -112187 -167184 -297970 -88212 -329876 151830
19335 -136822 -157361 -10992 23835 165255 211511 -91740 -282490 61550 -112169 -170955 -248102
19324 -248102 1284 -83265 1416 130912 -228528 -93817 -264974 -266623 9658 -193797 -168 -328577
19312 -328577 -101560 -183046 -358684 -74016 88162 -53330 -26290 18917 403460 38186 -152695
19300a60175k33298B49186g8012j21677B66249A15681l2643c25576f0696k5642
19290h6338p0100b7517D985J8775M9023b52835M8591A996K08857m7207h1296A04743
19277c58434b8213P954p1187B32431A0822K863f9468k57578d9721j4520m4843
19266a09084F5527a54829A54921l1237a18551E8237a89182f2716l35265a7929
19255a46545b6654n4847I1557a2247D9361J03215d4553B26948c02647a396k03722
19244b05118J1454I5545h2473B1142a14777m8461I6775c71585J40828H7387d8320
19232a67291p4815I9141m6281c29352a10152k04024a22114k69575a30985D3329
19221a65971a9142j3486k30621D7720b57107L3424A18736a3382k32830D6987f7847
$$ plain form
19300 -160175 -393473 249186 -78012 -199689 266249 115681 83038 -325576 -60696 -86338
19290 -86338 -156438 -27517 4985 23760 72783 -252835 -204244 1996 210853 163646 -81296 104743
19277 -358434 -28213 -20259 -91446 232431 10822 13685 -69468 -327046 -49721 -64241 -109084
19266 -109084 65527 -154829 154921 123684 -118551 58237 -189182 -62716 -397981 -17929
19255 -146545 -26654 -81501 91557 -12247 49361 152576 -44553 226948 -302647 -1396 -205118
19244 -205118 -193664 95545 -82473 21142 -114777 -163238 96775 -371585 -230757 87387 -48320
19232 -167291 -242106 99141 52860 -329352 -110152 -314176 -122114 -391689 -130985 43329
19221 -165971 -19142 -32628 -263249 47720 -257107 -223683 118736 -13382 -246212 46987 -67847
19209b15815B49095D2646a39000B18275H1817A4310a09282G4947e7591A9363h657
19197a42639r0327J13631r3351j02890f212k37554B9356a08376O318A89875c7196
19185A44397E5245a50097H7248c3174l0085B47680a11572I9477J2290B9289L5537
19174F4826R3620K47389a19744l6451a6195j44990k5570q6194j86609d9040k9125
19163g8165A2615b32015C22446b28189a0140A20276j6044g6261b7577j05538C859
19151F563R4579a66469a3148q8572k93438J78937g0308C03214A5721b42211A5203
19139h3682j75787k6824a04494C4562i8914A81289q5682L0614e9281R662P877
19128d1742l8973b1464A84247b31745c8309n932C0710b582A8132a54939C9992
$$ plain form
19209 -215815 249095 42646 -139000 218275 81817 14310 -109282 74947 -57591 19363 -8657
19197 -142639 -232966 -119335 -212686 -315576 -6212 -243766 29356 -108376 -102058 189875 -37196
19185 144397 55245 -150097 87248 -33174 -63259 247680 -111572 99477 111767 29289 64826
19174 64826 158446 405835 -119744 -156195 -16195 -161185 -186755 -272949 -459558 -49040 -78165
19163 -78165 12615 -232015 322446 -228189 -10140 120276 104232 -76261 -27577 -133115 3859
19151 6563 101142 -166469 -13148 -101720 -395158 -216221 -70308 303214 15721 -242211 15203
19139 -83682 -259469 -286293 -104494 34562 -98914 181289 95607 126221 -59281 -49619 -41742
19128 -41742 -80715 -21464 184247 -231745 -38309 -44241 30710 -2582 18132 -154939 39992
19116C2447J76265A2398J27865b17001I9463a37634E2464b5045A5304L71073b0745
19104c4754r4527a0824D20131b11777J4163J8410Q8824o350A0094K6528e9596
19092a62737C13512a01047a7292g62B76681a08918n2A37044b77524o316A52947
19080a23258n156D2668a82995j68710E3699j1131f2260k58455J40482H4180P0267
19069A54447a44507G0091c98199d0506F1752a34494C99626e3425j2353A00826
19058d52089J83433a0975j74020A63782M2576c02471E6854d2808A41284K4912
19048A66196h2628j05778P7013E5093a53104A44356c24531J44986k53127J32892
19038b99780d1782A84586c0029k42519M6777c0457j36923M9580A53155c29579
$$ plain form
19116 32447 208712 12398 140263 -217001 99463 -137634 52464 -25045 15304 386377 -20745
19104 -34754 -129281 -10824 420131 -211777 -197614 -179204 -90380 -96730 10094 36622 -59596
19092 -162737 313512 -101047 -17292 -762 276681 -108918 -108970 137044 -277524 -283840 152947
19080 -123258 -128414 42668 -182995 -351705 53699 42568 -62260 -320715 -180233 84180 154447
19069 154447 -144507 70091 -398199 -40506 61752 -134494 399626 -53425 -65778 100826
19058 -452089 -268656 -10975 -184995 163782 206358 -302471 56854 -42808 141284 166196
19048 166196 -82628 -188406 -111393 55093 -153104 144356 -324531 -179545 -432672 -299780
19038 -299780 -41782 184586 -30029 -272548 -225771 -30457 -167380 -117800 153155 -329579
19027G1384c52181a43613A33938G438a00084k0410J0323p9750A26532l4427c37151
19015b34461J00808A59556a30701j05504G4873c48641a01679p8683h4200A96921
19004B24574a48712L6825b6393k51483B8351a32451a9899j62226B05710E9519
18993A76562o2379d4787A64166c49145A52446a81226a1609B26873B9633n184i4803
18981a51433A20994j5091b86105A39321o3170h7577p5144L2688B39314B3255L43875
18970C67130L40876C48262a8192D56822B8151a11125J4618c5146h864p8180j14996
18959b02040Q0479E1527a4212j89099d0486j69344A74635b44828b4013E5880b18258
18947A03086L2845b26653f2777k74245A4589M6544j7628h7787k72410J43631j00662
$$ plain form
19027 71384 -352181 -143613 133938 7438 -100084 -120494 -110171 -189921 126532 92105 -337151
19015 -234461 -133653 159556 -130701 -236205 74873 -348641 -101679 -180362 -84200 196921
19004 224574 -148712 -111887 -26393 -277876 28351 -132451 -19899 -182125 205710 59519
18993 176562 114183 -44787 164166 -349145 152446 -181226 -11609 226873 29633 24449 -94803
18981 -151433 120994 105903 -286105 139321 76151 -87577 -162721 -130033 239314 23255 367130
18970 367130 708006 348262 -18192 456822 28151 -111125 -96507 -35146 -8864 -87044 -202040
18959 -202040 -121561 51527 -14212 -203311 -40486 -209830 174635 -244828 -24013 55880 -218258
18947 103086 135931 -226653 -62777 -337022 14589 61133 43505 -87787 -360197 -216566 -317228
18936c17228h7989D05496c55489D7562G320K14474m9596b93979a33455r3006A27739
18924C7679a14304l3044J3211C1463M8464J42009I0991a67627B01961E8784I467
18912A46448N8799I0236d5357C61871A41967J83430R5265J35915H1329a7523E5038
18900C63220A73038e37471j23490i2885E360g2417j78066p7667J50605c632G2651
18888B35009J7387K9021I935J46470e06588i4743A7350L1669B250K0281b03151
18876b58213B30152m144b43720A02539J12399c58077C30858k0314a15943e1797
18865b14292A2679a08063a3818j28345m1351C9114a86329n0187a00208r1889j26608
18854c18705J26278E9422e29351A70437m0464k5303j4011a25937j05544A49307
$$ plain form
18936 -317228 -87989 405496 -355489 47562 7320 221794 172198 -293979 -133455 -226461 127739
18924 37679 -114304 -147348 -134137 31463 79927 221936 90991 -167627 201961 58784 9467
18912 146448 205247 90236 -45357 361871 141967 325397 420662 556577 81329 -17523 55038
18900 363220 173038 -537471 -660961 -92885 5360 -72417 -250483 -328150 -177545 -3632 72651
18888 235009 252396 281417 9935 156405 -506588 -94743 17350 49019 2250 22531 -203151
18876 -258213 230152 226008 -243720 102539 214938 -358077 330858 310544 -115943 -51797
18865 -214292 12679 -108063 -13818 -142163 -183514 39114 -186329 -236516 -100208 -192097 -318705
18854 -318705 -192427 59422 -529351 170437 129973 104670 90659 -125937 -231481 149307
18843f2568G512N6781b32361O558O3627L8675d3723J3211A47287b36437b9788
18831I1862b57490A73545c99531a43759D890N580J58806J16946g0829B28680p3985
18820A54695c0107A53100a70680p8157A04680h7539A27146a99707i2359F2028
18809D24869A04390B4126G778M7650c0689D52804f0909r8183o9881e8604j62686
18798b21290A35122E416a56848e5102B27334b71256K5970e4461F0907J87058g9548
18786c87187f1587q4548M6097j17054q828b5242m627C8078h2413K5350m77072
18775e34135E2754b5991G000c34868C74601j19326A09868a87331J3046h031n20
18764h551k49012N8845G5225g9726C6548b96649H3024P9190C9360J32514f4459
$$ plain form
18843 -62568 7512 64293 -232361 -225803 -162176 -123501 -43723 -30512 147287 -236437 -29788
18831 91862 -257490 173545 -399531 -143759 4890 10470 169276 286222 -70829 228680 154695
18820 154695 -30107 153100 -170680 -248837 104680 -87539 127146 -199707 -92359 62028
18809 424869 104390 24126 7778 55428 -30689 452804 -60909 -159092 -228973 -58604 -221290
18798 -221290 135122 5416 -156848 -55102 227334 -271256 -245286 -54461 60907 247965 -79548
18786 -387187 -61587 -146135 -100038 -217092 -225920 -25242 -29869 38078 -82413 -57063 -534135
18775 -534135 52754 -25991 7000 -334868 374601 255275 109868 -187331 -174285 -8031 -8551
18764 -8551 -257563 -198718 75225 -79726 36548 -296649 83024 162214 39360 171874 -64459
18752c26202e2110A02457e7046j09652B15704C3943J34008a73199d3798E8814
18741f8200j21114a6682k87861a16376L2725B61718A00499b2922j73981J0327
18731a86576i0251A06419K4964R945O6250h9191r1110r6531C1965K2514d8540
18719b6685F2263D582a73894h878I8338b94125f4826E9264c26611D1338d8234
18707F8142e62346J19515c4042g930j81334e9306o5158B95206a30875A31809i1481
18695b59907h4422l1473b5515j30638a9396M350q0816E5047a62468e5202l3642
18684h8844a1462l20862h6655k44186a02723o6720J2100A09528a26595N3632B8013
18672a6783l01360C366a90011f3827E1807a11825q8786e1686A3455J68416b72057
$$ plain form
18752 -326202 -52110 102457 -57046 -166698 215704 33943 167951 -173199 -43798 58814
18741 -68200 -189314 -16682 -304543 -116376 -83651 261718 100499 -22922 -196903 -186576
18731 -186576 -90251 106419 131383 141328 207578 -89191 -180301 -276832 31965 54479 -48540
18719 -26685 62263 4582 -173894 -8878 98338 -294125 -64826 59264 -326611 41338 -48234
18707 68142 -562346 -442831 -34042 -7930 -189264 -59306 -124464 295206 -130875 131809 -91481
18695 -259907 -84422 -115895 -25515 -156153 -19396 -15046 -95862 55047 -162468 -55202 -88844
18684 -88844 -11462 -332324 -86655 -330841 -102723 -169443 -157343 109528 -126595 -72963 28013
18672 -16783 -318143 3366 -190011 -63827 51807 -111825 -200611 -51686 13455 181871 -272057
18660g8866m4740A52547b22877d578p6478K3222n6470H4352K25134G2564J11562
18649A84126a51457c0866E0706a66884A27746a36726a0459D0820a73694A29860
18638a96669G7135h2547H4135b54184A5442a28048A41139b61897f3178j49744
18628b12922B7589b23919A36315J16423E6583b81469A10650a20877j24827b6054
18617b16586O4617P4420j85823e7031O616G1844b08391a6825k43037B41107b8859
18605a53214j1289A33382J7262L8278a45279C18475H8594a52525A4431a61851
18594A80583a04579a997l527q8088l089G5124a64096L8252E3283g5983j71957
18583b47940B27778a36565O3639a0316D4834b43651e2254j21148c1052B68093
$$ plain form
18660 -78866 -123606 152547 -222877 -4578 -81056 -57834 -114304 84352 309486 72564 184126
18649 184126 -151457 -30866 50706 -166884 127746 -136726 -10459 40820 -173694 129860
18638 -196669 77135 -82547 84135 -254184 15442 -128048 141139 -261897 -63178 -212922
18628 -212922 27589 -223919 136315 252738 56583 -281469 110650 -120877 -245704 -26054
18617 -216586 -151969 -77549 -263372 -57031 -50415 71844 -208391 -16825 -259862 241107 -28859
18605 -153214 -164503 133382 150644 188922 -145279 318475 88594 -152525 14431 -161851
18594 180583 -104579 -1997 -5524 -93612 -96701 75124 -164096 -125844 53283 -75983 -247940
18583 -247940 227778 -136565 -72926 -10316 44834 -243651 -52254 -173402 -31052 268093
18572a09691A25262b19850F84a85346k31049J85595B01046b7944A03536d0325
18561a13602j49242R6994D981d7843A12530d2271B53143b24170f7740j24159F5871
18549b64145d6219j2006A29677A8192d44974J16821R0812e5876E5092O475j5224
18538D6343f5464A52783L9867b5057B10434h2863G2290K5466e8717C6897M439
18527D1336a02777B61864a10116n1188A17913d9676A2529a90320B9786d4346J210
18516d3136k4132H4481b10122G9267l6230b95266J17096A33728Q8523m5241H7117
18504A17980C3167P4091M1723J50219p8187a92867a1815l72870J90635B64274
18493d0480A78372m4089n411b97337E2894A4513a2371B02284p5860f3088b740
$$ plain form
18572 -109691 125262 -219850 684 -185346 -416395 -230800 201046 -27944 103536 -40325
18561 -113602 -262844 -165850 4981 -47843 112530 -42271 253143 -224170 -67740 -191899 65871
18549 -264145 -46219 -58225 129677 18192 -444974 -328153 -237341 -55876 55092 61567 46343
18538 46343 -65464 152783 192650 -25057 210434 -82863 72290 97756 -58717 36897 41336
18527 41336 -102777 261864 -110116 -161304 117913 -49676 12529 -190320 29786 -44346 -43136
18516 -43136 -67268 84481 -210122 79267 43037 -295266 -178170 133728 222251 177010 87117
18504 117980 33167 107258 148981 299200 221013 -192867 -11815 -384685 -194050 264274
18493 -40480 178372 134283 128872 -297337 52894 14513 -12371 202284 126424 -63088 -2740
18481c7781k51802Q1403A07105a61041B0119M5651j9003Q6483a92334j74171I7807
18469a85508D83744f3684B50201a06240c4852j01793D8412M1139b9614A81318
18458a44383d9458K4042n4117q9981g6123A3801a22086p3863D1168j5064a20003
18446a28532k95716e8115D4480a5787r927B66653b55716O1062d3281j9035B55302
18434e250j02657k24187a52312b3776I5753g4600j28793B1487a82049e0973G7925
18422b01202d1781r9338A92005q5835N9820c4043k47549g3408D10620a33717B76656
18410E0591a66331A38053M0042F6252h6600J4406C05798f2066J1586m27010c2195
18398i3431B30643b5315C12950A35251N4413b29832R5438A55767c52052a48628
$$ plain form
18481 -37781 -289583 -208180 107105 -161041 20119 65770 46767 133250 -192334 -366505 97807
18469 -185508 483744 -63684 250201 -106240 -34852 -136645 48412 89551 -29614 181318
18458 -144383 -49458 -25416 -79533 -169514 -76123 13801 -122086 -195949 41168 26104 -120003
18446 -128532 -424248 -58115 44480 -15787 -25714 266653 -255716 -194654 -43281 -62316 255302
18434 -5250 -107907 -332094 -152312 -23776 95753 -74600 -203393 21487 -182049 -50973 77925
18422 -201202 -41781 -141119 192005 106170 165990 -34043 -281592 -73408 410620 -133717 276656
18410 50591 -166331 138053 178095 66252 -86600 -72194 305798 -62066 -50480 -477490 -32195
18398 -93431 230643 -25315 312950 135251 189664 -229832 -134394 155767 -352052 -148628
18387f4768k37328J37035A59481a44068M606A94000g5021I6613a04131j16711
18377b20842k597r931A43462i5977k058A33530a7714q8564d4356k74551A68581
18365A62534B2812J05075f4114K5340B78d153D2183b3692j2309A35044K00579
18354C35623c24853L4178M561b7367k31001B56947L2530A8227a23580d1732A16932
18342h2909b4110F412a75429O1076K6773B41937G785J6208J31373J54581f4286
18330a21746d6577k26579I080a37698L4388D29763j95037B7142L24539F4860a02969
18318H3228K76060e9542r413A53174a95674g6020A67393h0194I4465d3380j7527
18307f0907H8729B6442b6678n1776m9882G489a19075F8127J09493L7318b91066
$$ plain form
18387 -64768 -302096 -165061 159481 -144068 -139462 194000 -75021 96613 -104131 -220842
18377 -220842 -223439 -233370 143462 -95977 -98035 133530 -17714 -106278 -44356 -318907 168581
18365 162534 22812 127887 -64114 -38774 278 -4153 42183 -23692 -36001 135044 335623
18354 335623 -324853 -290675 -286114 -27367 -258368 256947 289477 18227 -123580 -41732 116932
18342 -82909 -24110 6412 -175429 -114353 -87580 241937 7785 23993 155366 309947 -64286
18330 -121746 -46577 -273156 9080 -137698 -103310 429763 234726 27142 351681 64860 -102969
18318 83228 359288 -59542 -68955 153174 -195674 -76020 167393 -80194 94465 -43380 -60907
18307 -60907 88729 26442 -26678 -78454 -128336 7489 -119075 68127 177620 214938 -291066
18295A2514K51479j6293H6278a86697M2462o0266h6370A85300a25689F9454g2355
18283d0347C37764D2795e1446D0944K3978k5581K47633B2148a07978C13441j24846
18272A88595c3133l9419A49544K4213a74370B44849A5406O7649j5015a28202a8383
18260F0909b83619A05066b46380e2094l19167i0115j56345g9294A16519a55493
18249a95678d4779o1348G5809a25629F6938e0268J5949e213B48291j01503G1284
18237A36456K9532a67299k53990a16595N4051A12729B878g8997E9777Q9803J34347
18226B83927m3157b3091j09742I6781O3418o7398O793l4606c3445a2800H1996
18214A28004J11885d8297m73423A41016g2830H4509c8809B2531a34680j62818
$$ plain form
18295 12514 263993 247700 86278 -186697 -144235 -204501 -86370 185300 -125689 69454 -72355
18283 -40347 337764 42795 -51446 40944 64922 39341 286974 22148 -107978 313441 188595
18272 188595 -33133 -72552 149544 173757 -174370 244849 15406 83055 68040 -128202 -18383
18260 60909 -283619 105066 -246380 -52094 -371261 -90115 -246460 -79294 116519 -155493
18249 -195678 -44779 -106127 75809 -125629 66938 -50268 -34319 -5213 248291 146788 71284
18237 136456 165988 -167299 -421289 -116595 -62544 112729 2878 -78997 59777 149580 283927
18226 283927 240770 -23091 -132833 96781 160199 92801 99594 64988 -33445 -12800 81996
18214 128004 239889 -48297 -521720 141016 -72830 84509 -38809 22531 -134680 -297498
18204b97498M7687f9332a8702B9180i4275H2739b6516A43154h6601k60530B5396
18192F7999L7358b29803f9113k29337C78168b48475B71990c9956k5037Q530F5644
18180a1454k2862D6369i6295m1033I9689i4191j20848E0262c30816A51901a7070
18168B59297a92243A43084a93939L6473B07752a1087l37236a55736q8606A9210
18157A60151b4435C1431b28133a04695q6659B50858I0942c07647C38298F1538
18146d8456B1250G342a22201j46991F6746i2076k16928f2675A39159m6537f8556
18134b50127A3040L0557a47986A16408f6457H2370m0488B0941p107J27715G0215
18122b28881m635A25913P1726A533a37963A53436E8977A390K0359J7245h5692
$$ plain form
18204 -297498 -249811 -69332 -18702 29180 -94275 82739 -26516 143154 -86601 -347131 25396
18192 67999 105357 -229803 -69113 -298450 378168 -248475 271990 -39956 -64993 -56463 65644
18180 -11454 -34316 46369 -96295 -137328 99689 -94191 -215039 50262 -330816 151901 -17070
18168 259297 -192243 143084 -193939 -157466 207752 -11087 -348323 -155736 -244342 19210
18157 160151 -24435 31431 -228133 -104695 -191354 250858 90942 -307647 338298 61538
18146 -48456 21250 7342 -122201 -269192 66746 -92076 -309004 -62675 139159 92622 -68556
18134 -250127 13040 43597 -147986 116408 -66457 82370 41882 20941 13834 141549 70215
18122 -228881 -233516 125913 197639 1533 -137963 153436 58977 1390 21749 38994 -85692
18110C74356a46717C0208O8398a26011b7649m24886a50077C09772b03488e4718
18099h615A30396m7124K66101a15020j07470C057J08014i4777A67356R1846C0804
18087d4970j80323B36674H969b99655a3268l7512P97A32639n113a46039i575B9201
18074d1124I4517l8831K04359a30129C23159A49311b5929A73764C8605a01329
18063F1635d2664a3176j35316m4068O1598A97798a08264N2415K6782k05135J11211
18052a22991k27447A99460b51028E0600A77b2218n2676A46033Q693J640a8947
18040a91507L4673G1311P7520m7556j1060c9233B51551r9159o5547d54976C05744
18028F041J84365g8827j49569L2672c769C7575L10579j00624e5668l08001I978
$$ plain form
18110 374356 -146717 30208 98606 -126011 -27649 -452535 -150077 309772 -203488 -54718
18099 -8615 130396 83272 349373 -115020 -222490 3057 111071 -94777 167356 259202 30804
18087 -44970 -225293 236674 8969 -299655 -13268 -50780 -49983 132639 127526 -146039 -9575 29201
18074 -41124 94517 55686 260045 -130129 323159 149311 -25929 173764 38605 -101329
18063 61635 -42664 -13176 -148492 -192560 -130962 197798 -108264 -55849 -29067 -234202 -122991
18052 -122991 -350438 199460 -251028 50600 177 -22218 -74894 146033 154726 156366 -18947
18040 -191507 -156834 71311 148831 101275 90215 -39233 251551 152392 86845 -454976 305744
18028 6041 190406 -78827 -228396 -195724 -3769 37575 348154 247530 -55668 -363669 9978
18016A22894a08596A89157a60043N7579B25853d6144B26987c2332J872A72808
18005D9970K98390A67785a76371d1548A7416K2752J11283K2634i8064K3018A54641
17993a14754G9926J07177r2237c1121A70716g1429A5016d644j00429A78891F3078
17981a71750J1958c1415A10627g1769A85012o9994Q288E1655e3674a8252D2672
17969B53584a70706A7436c48646A54207O647h5800p3369B87870D6980a0446H4261
17957A48363a39743f0437D5311a7810C54616B7215j3255L68711E7516K23151H3278
17945a03640G0662h25H0764c4872D1860f0183C18602j37661Q731E3968c7957l09590
17933c47547H3678i7718I7230k1776h7291M1659j7621C32195I9544a16300B95152
$$ plain form
18016 122894 -108596 189157 -160043 -102464 225853 -46144 226987 -32332 -30460 172808
18005 49970 348360 167785 -176371 -41548 17416 40168 151451 174085 -98064 -75046 154641
17993 -114754 79926 187103 94866 -31121 170716 -71429 15016 -4644 -105073 178891 63078
17981 -171750 -159792 -31415 110627 -71769 185012 115018 123306 51655 -53674 -18252 42672
17969 253584 -170706 17436 -348646 154207 160854 -85800 -159169 287870 46980 -10446 84261
17957 148363 -139743 -60437 45311 -17810 354616 27215 13960 382671 57516 280667 83278
17945 -103640 70662 -825 80764 -34872 41860 -60183 318602 180941 189672 53968 -37957 -347547
17933 -347547 83678 -97718 97230 75454 -87291 -45632 -63253 332195 99544 -116300 295152
17921A1720Q6855i5781A53690p4176b59749P2217A09559R5916g7169A25150h6892
17909b52377A87863P6825C3999b25493O1439n1963l262A6369K87385a6552D3298
17897F3915b27038H6213K30475c15448a50725B23380g3763k13245i6535m3962
17887a40497F1623d7426E8033a93373D8312b51815f6769A97702K00766A56800
17876A44779c4568C35858A05058J73104c3921p2324L2334b2258B04558b21312
17865d7846K3545B80753n6241g7142C5120K8243Q6363J8896n7408K3975b23935
17853B33045a26746N5627I1309i7683B48991b8536D01280a9627j12924J4518J0252
17842a07781m0431f6867A38256K70334j46391b18096C901f0984k56590a9049D06771
$$ plain form
17921 11720 98575 -95781 153690 79514 -259749 -187532 109559 205475 -77169 125150 -86892
17909 -252377 187863 264688 33999 -225493 -164054 -216017 -219279 16369 303754 -16552 43298
17897 63915 -227038 86213 316688 -315448 -150725 223380 -73763 -287008 -96535 -140497
17887 -140497 61623 -47426 58033 -193373 48312 -251815 -66769 197702 398468 156800
17876 144779 -34568 335858 105058 278162 -33921 -106245 -73911 -22258 204558 -221312
17865 -47846 -24301 280753 224512 -77142 35120 63363 149726 168622 111214 135189 -223935
17853 233045 -126746 -71119 91309 -97683 248991 -28536 401280 -19627 -132551 -118033 -107781
17842 -107781 -148212 -66867 138256 408590 262199 -218096 3901 -60984 -317574 -19049 406771
17830A672g9356D9791Q8523J61120b5070B24725a1276D87031k38762q0919Q2149
17819B49499M4243A10219D3058a06462E04799i3483A86452J12619f0452h931C50206
17807A46636L4963a29553f3471I4617J08009b04277A85856K2751J808o4932a55170
17795B65224g6419A58536C4061J59496J7116I7069L10389j58939j9887C9770L4146
17784G3916h8274E2162b53661B86792c9105r038l179A28735Q1420a29532B11046
17772B9040K1971b04324k8450e5073j03200B54719a68418p0879C34035g824A80602
17760A62116b2025C30158C9188R7343a60608B95533H026a44123H8686b25450a12099
17748A05959J74003E4019h8348c7475o4743k75196A13641J69393M7311A18537
$$ plain form
17830 1672 -79356 49791 138314 299434 -25070 224725 -11276 487031 248269 167350 249499
17819 249499 293742 110219 43058 -106462 504799 -93483 186452 299071 -60452 -8931 350206
17807 146636 181599 -129553 -63471 94617 202626 -204277 185856 208607 210415 145483 -155170
17795 265224 -76419 158536 34061 193557 210673 97069 407458 248519 228632 39770 73916
17784 73916 -88274 52162 -253661 286792 -39105 -48143 -51322 128735 210155 -129532 211046
17772 29040 51011 -204324 -232774 -55073 -158273 254719 -168418 -239297 334035 -7824 180602
17760 162116 -22025 330158 39188 136531 -160608 295533 8026 -144123 88686 -225450 -112099
17748 105959 279962 54019 -88348 -37475 -102218 -377414 113641 283034 330345 118537
17737A12259D8206K33862f1175E4973L21512C8932c3632d724r2811k24156D2640
17725B53132p3204a48068A71665a11604B55058J11540A57973J3616a89761E0956
17714A04209m4265b70545i1928c2988E1269J10339K52965k5549B2544K13607o2418
17703A73733k6561a00145L3815i977A87130E6958a0294m2832C27387B2013L16420
17692C38433f9574I5001J6404P2190c07918F8210O8095n2886K65803j36006a20938
17680E7684J78572F5175P3732R8666L993O3851H8449r881j781m736a13190F8706
17667B69192j08398a9617A51545a04207D44014A59123K73041B03429m202J75628
17657C74855r3805c1939a5915A72365K349h2534c3094C23367l7420E9770o718
$$ plain form
17737 112259 48206 282068 -61175 54973 376485 38932 -33632 -4724 -97535 -321691 42640
17725 253132 179928 -148068 171665 -111604 255058 366598 157973 171589 -189761 50956
17714 104209 59944 -270545 -91928 -32988 51269 161608 414573 389024 22544 236151 173733
17703 173733 147172 -100145 -66330 -9977 187130 56958 -10294 -53126 327387 22013 338433
17692 338433 -69574 95001 111405 183595 -307918 68210 136305 83419 349222 213216 -120938
17680 57684 236256 65175 138907 237573 241566 305417 88449 78568 76787 72051 -113190 68706
17667 269192 160794 -19617 151545 -104207 444014 159123 432164 203429 199227 374855
17657 374855 281050 -31939 -15915 172365 174714 -82534 -33094 323367 285947 59770 53052
17646E3052a29395E836a2637D7915M3632J38884q1612m2123K1916J35193I1068
17634C75838A47124Q1528n1807E2417K72288D8000a55093A0250J34045O3433d4865
17622C16700k3980g8120B58172j21938J04604J7452a66367e9799i443C04551j10389
17611A94162q0562O4505h3687A15499N8991C7073P2530a05841B86465o601a14260
17599F02703B50602c16829C09414a07585B85212B3341Q4777R2037B4241M15024
17589D39265D4943Q1330M5716D6666K01882A13382R1301O4138l1684l9089G2305
17577D26366a00046B03407a12192A46401b88385C64628A67618a75136A96294g559
17566B82029A07440b6585C09117j8302b88179B07949F3687K7106m2888J40949
$$ plain form
17646 53052 -129395 5836 -12637 47915 91547 230431 148819 106696 128612 263805 91068
17634 375838 147124 228652 176845 52417 324705 48000 -155093 10250 144295 207728 -44865
17622 316700 292720 -78120 258172 136234 240838 258290 -166367 -59799 -9443 304551 194162
17611 194162 113600 178105 -83687 115499 174490 37073 109603 -105841 286465 279864 -114260
17599 602703 250602 -316829 309414 -107585 285212 23341 108118 200155 24241 439265
17589 439265 44943 126273 171989 46666 248548 113382 204683 268821 237137 198048 72305
17577 426366 -100046 203407 -112192 146401 -288385 364628 167618 -175136 196294 -7559
17566 282029 107440 -26585 309117 290815 -288179 207949 63687 90793 47905 188854
17556A88854K44170c0716B47299n1520e4414D66311A16598a00111B1472K29752
17546B51224L2528R5300o267q6702P0921A00087K61805J26827A07805P6905K5486
17535B10196A02663N1140Q6464p3814G2702P74759A39884O21629j42675M35998
17525A054836m4244J18993K60775l48582k16486j62317R363j90402J42642M1988
17515F66566A81254J37675L64143J59632j75905K51354N88368j63893q4673k24466
17505A033489l62292j33844J3253j40925j47867J28858r7908K71373p0299j93177
17495C00661j49033L54702m7234A66670O2620K18254j58764L564J73124q4108
17485C81360q9706I5552c0856C80017j18570K36613a94D11087Q5455o3923m6849
$$ plain form
17556 188854 433024 -30716 247299 195779 -54414 466311 116598 -100111 21472 251224
17546 251224 283752 379052 372785 286083 357004 100087 361892 488719 107805 184710 210196
17535 210196 102663 153803 240267 166453 72702 847461 139884 761513 618838 1054836
17525 1054836 1010592 1129585 1390360 1041778 825292 662975 672338 481936 624578 666566
17515 666566 181254 318929 683072 842704 666799 918153 1506521 1342628 1257955 1033489
17505 1033489 671197 537353 550606 409681 261814 390672 292764 564137 493838 300661
17495 300661 151628 506330 459096 166670 229290 447544 288780 292344 465468 381360
17485 381360 291654 95552 -30856 380017 261447 498060 -194 411087 496542 432619 385770
17474C85770A05943J77090j6459o0845O691K24125d8297C96813j33907O7763j13102
17463B17567J34335l2130o9950J9615J2944A17550Q4379k3404K45441j58465r9690
17452A65811L48934C2982L13526K69184I5538O01757D8111M17785r5545K94735
17442F65086k59782l7169j8615A42626O72514B33117L18755A79173l4976L31702
17432D75899l7117m948j11482j12754K5239j6699K89888j60492j19258Q6373K13494
17421E28143m2591c347F35575e0026D25031m3885K53607A37749n3244J16220J34744
17410C35469J14952R1241j59804q6953J31417j25800d2854C16153j7708J78001
17400D76446A95550q7252K9222J27843p0545L0345a575C22661J36121k05370A9113
$$ plain form
17474 385770 105943 283033 266574 205729 212420 436545 -48297 396813 262906 330669 217567
17463 217567 351902 319772 249822 269437 282381 117550 201929 178525 423966 265501 165811
17452 165811 514745 32982 346508 615692 95538 697295 48111 465896 370351 665086
17442 665086 405304 368135 349520 142626 815140 233117 551872 179173 144197 475899
17432 475899 438782 433834 322352 209598 234837 218138 508026 347534 228276 314649 528143
17421 528143 485552 -3347 635575 -50026 425031 381146 634753 137749 84505 200725 335469
17410 335469 450421 541662 381858 294905 426322 300522 -42854 316153 298445 476446
17400 476446 195550 108298 137520 265363 194818 225163 -1575 322661 458782 253412 19113
17388D00895G7483M43801k18200J08227B3619M8479J35000J09960o6641A21803
17377C59163b7276C29676J2452j02103l0637B7355j0648J90791M3529J62353B03166
17365A59332J29945O989n7843a54698F21621B78216n2508P7024n827J07543O8164
17354D72612n1949j28264b368D29350j72819K87470A13275L59563j89713j31011
17344A52114K46064A46549J0676K28609j68150A5358K18393K00719j89221J79731
17334D24980P874k2894J3484j58951J23701o1234G8135K48987A22470J93246q6078
17323B29638K25489E7411L17908O7197k03605J48390J65871k57843G7888L20208
17313C98096K3437A35073K42432H1507P2013K63827j73025j4716K49559j27172
$$ plain form
17388 400895 77483 521284 303084 411311 23619 72098 207098 317058 250417 121803
17377 359163 -27276 329676 342128 240025 209388 27355 16707 207498 251027 413380 203166
17365 159332 289277 296266 238423 -154698 621621 278216 225708 302732 296905 404448 472612
17354 472612 420663 292399 -2368 429350 256531 544001 113275 472838 283125 152114
17344 152114 398178 146549 157225 385834 217684 15358 233751 434470 245249 424980
17334 424980 432854 409960 423444 264493 388194 326960 78135 327122 122470 315716 229638
17323 229638 455127 57411 375319 442516 238911 387301 553172 295329 77888 398096
17313 398096 421533 135073 377505 81507 153520 417347 244322 229606 479165 351993
17303C51993L8815H6105N80940j15968k06377j34053N7033O2423K25980A66863
17292D23248m2513J60695A33843N3823p4929E4802M42852B14924L57828J17635
17282F90387j84395N6813k29054M6510j15076P7932A35556R9939J31682K32983
17272F00160j89611j3324R5600A77563a1002C31377J72439B22822K54649k11303
17262B66168K33956k05939K20601l8532k557j62714J14585K35605k88635l2022
17252C40516j61116J30588Q2893k8274j60163L82878L730B38264F2087P6420N06416
17241F44923B35990J21940K71556K27264j97428o7121j50410j0538j75278j22340
17231A33635P1021M01850k24939p9329K26620k01621J86589Q7606l8408k00516
$$ plain form
17303 351993 390808 86105 667045 551077 344700 210647 267680 330103 556083 166863
17292 423248 380735 541430 133843 187666 112737 54802 497654 214924 572752 690387
17282 690387 505992 562805 333751 380261 265185 343117 135556 235495 367177 600160
17272 600160 410549 397225 492825 177563 -11002 331377 503816 222822 477471 266168
17262 266168 500124 294185 514786 476254 473697 310983 425568 661173 372538 340516
17252 340516 179400 309988 392881 364607 204444 587322 591052 238264 62087 138507 644923
17241 644923 235990 357930 629486 856750 659322 592201 441791 431253 255975 133635
17231 133635 204656 606506 381567 302238 528858 327237 513826 601432 563024 362508
17221C62508L9358k4145m2031J7179A10957M52900j97706J27310A38695N02653
17211F41348j82082J82693j16485J09490j03943p2571j99950J35875r1941J61773
17201D64207L3559K49136j31737k06528j06886O7614p4048J59241K75381B44501
17190D96827B15658L94621A73349K12404J79234j95153K34914p8846K39631j70287
17180E95246k55246n1740L22063j89498l4983J71500J18605l21167K03509k26617
17170C31672K55620j67920K52306O7576l46806J18229L87565k82087O1152k08986
17160D68321L99565l92570J85653j6199j28792J04406q609L2581A79197O24490
17150H03687l68437J45745K16783A83928J18242J38683K87631j66323j62802N55476
$$ plain form
17221 362508 401866 377721 335690 352869 110957 563857 366151 493461 138695 641348
17211 641348 459266 641959 525474 634964 531021 458450 258500 394375 302434 464207
17201 464207 497766 746902 615165 408637 301751 369365 295317 454558 729939 244501
17190 496827 215658 610279 173349 385753 564987 369834 604748 525902 765533 595246
17180 595246 340000 288260 610323 420825 385842 557342 675947 354780 558289 331672
17170 331672 587292 419372 671678 739254 392448 510677 898242 616155 677307 468321
17160 468321 867886 475316 660969 644770 515978 620384 611775 644356 179197 803687
17150 803687 435250 580995 797778 183928 302170 440853 728484 562161 399359 954835
17140I54835l10190l03682L55479J92415C86033L58974j61676j64031n1150K15318
17130E83468k04770L68580j69108J72294P1299k65342K0095L36644l74253q6436
17120D52471R7270j41668K53732j13576J54619j3474j3461j42249K91070l68241
17110D56493Q0565J1848P4680n3060j99845L00496q3699K17616j75578O7523j84344
17099E12695K62946k18644P2893K12309p4910j57233J78166n6421R3103J51443
17089I76347k58086k82306K89737L582k63539J97274J5482J79087K01531j74575
17079H84534M4623j57724K4363k02087K43085P2529K0733j54607K44161j87544
17069H32066N6521l08245M96428D79050K71926L88086m83486L1348M71733l30071
$$ plain form
17140 954835 644645 340963 696442 888857 386033 745007 583331 419300 368150 583468
17130 583468 378698 747278 578170 750464 821763 556421 576516 913160 538907 452471
17120 452471 549741 408073 661805 548229 702848 689374 675913 533664 824734 456493
17110 456493 537058 548906 623586 570526 370681 671177 587478 805094 629516 697039 512695
17099 512695 775641 556997 629890 842199 767289 610056 788222 731801 824904 976347
17089 976347 718261 435955 725692 729274 465735 663009 678491 857578 1059109 884534
17079 884534 929157 771433 795796 593709 836794 909323 930056 775449 1019610 832066
17069 832066 888587 580342 1076770 479050 750976 1139062 655576 686924 1158657 828586
17059H28586J28177j4043j42168R025J83184J631j49151L78970j40463m06697
17049F77051L09499M6285j74586J05188R0978j67543J11840j25741M64785m30201
17039I07555o9916j9588L40578j66696K46847n78859L90188L9008L6262r8559
17029A026820j25531J79137J29354k62919K52681j61319K09626k03030J51084
17020A195903l46303L66384r2399Q7557j65225J8074J85658P2694k11860L36004
17010A446487j93019k60915R1699K99969j48837j88292l06194N21916K17685r0223
17000A390276j76813K48137L8017k08685L54069M258j89584l2946Q8128j77480
16990A337377N6896J71508q8547L37447p5390j20900k77295J4688q6481R00Q5865
$$ plain form
17059 828586 956763 942720 800552 809577 992761 994392 845241 1224211 1083748 677051
17049 677051 986550 1032835 858249 963437 1054415 886872 998712 872971 1337756 907555
17039 907555 837639 818051 1158629 991933 1238780 659921 1050109 1089117 1125379 1026820
17029 1026820 901289 1080426 1209780 946861 1199542 1038223 1247849 1044819 1195903
17020 1195903 849600 1215984 1123585 1211142 1045917 1063991 1249649 1322343 1110483 1446487
17010 1446487 1253468 992553 1084252 1384221 1235384 1047092 740898 1262814 1480499 1390276
17000 1390276 1213463 1461600 1499617 1290932 1645001 1649259 1459675 1426729 1514857 1337377
16990 1337377 1394273 1565781 1477234 1814681 1739291 1618391 1341096 1355784 1269303 1270203 1356068
16979A356068J64285j38733J01540L01347r6293m53875L59618J57251J42949m12134
16969A482023J76025j10220L11752k5151K17164o91254L81476Q8838k24734N4288
16959A660207r437j55529L70481O6921l46773J20002P3947p2888K35931j02167
16949A840695M2396j01685O1570J6927J96473o01986M57646K18142j44443J04963
16939B090698k90076L74302j27698j5632K71502j40633O4609K67170k51106O7731
16929B310867m7699l95320K47819L02561j64275J26700J5747K42852l52351J72541
16919B459442J40476q681K86695m05107j46175j20550K47050L61141L0109m0254
16909B804146k52678K57964J11125Q1193j72276k52818M60306j49991O0180J48378
$$ plain form
16979 1356068 1520353 1381620 1483160 1784507 1688214 1234339 1593957 1751208 1894157 1482023
16969 1482023 1658048 1547828 1859580 1834429 2051593 1360339 1741815 1830653 1605919 1660207
16959 1660207 1650770 1495241 1865722 1932643 1585870 1705872 1779819 1706931 1942862 1840695
16949 1840695 1883091 1781406 1842976 1859903 2056376 1454390 1912036 2130178 1985735 2090698
16939 2090698 1800622 2174924 2047226 2031594 2303096 2162463 2227072 2494242 2243136 2310867
16929 2310867 2263168 1867848 2115667 2418228 2253953 2380653 2396400 2639252 2286901 2459442
16919 2459442 2599918 2591237 2877932 2472825 2326650 2206100 2453150 2814291 2844400 2804146
16909 2804146 2551468 2809432 2920557 3001750 2829474 2576656 3036962 2886971 2947151 3095529
16899C095529n4544q3860O1125j83199J09553L40318l00436K20218J96860k15244
16889C186320K01425L04670j36264k49973M72420j59137L5869j7363k1885L6421
16879C652503K80599j72898K08905J06872k59855L64154j11858K04362l88213
16870C884571N11493j40525K16927j70754M6256L24764j10826K62920k402k40726
16860D581698J28752L34058R6952j07017j80716O49097r4120J47858N6012j38962
16850E473612M16939j26534j23340Q8336K76807O3130l13700K40980K08464Q6312
16840F291006K49824J83861k30447M35834N3897J30571j34216O3085O89339j31643
16830G601111l17393L10156J57052J75985P53781k26693j53913J31019K31235
$$ plain form
16899 3095529 3040985 2957125 3018250 2835051 2944604 3284922 2984486 3204704 3401564 3186320
16889 3186320 3387745 3692415 3556151 3306178 3778598 3619461 3655330 3637967 3616082 3652503
16879 3652503 3933102 3760204 3969109 4075981 3816126 4180280 4068422 4272784 3884571
16870 3884571 4396064 4255539 4472466 4301712 4347968 4672732 4561906 4824826 4822424 4581698
16860 4581698 4710450 5044508 5141460 5034443 4853727 5502824 5408704 5556562 5612574 5473612
16850 5473612 5890551 5764017 5640677 5729013 6005820 6068950 5755250 5996230 6204694 6291006
16840 6291006 6540830 6724691 6494244 6930078 6983975 7114546 6980330 7043415 7732754 7601111
16830 7601111 7283718 7593874 7750926 7926911 8680692 8453999 8300086 8431105 8662340
16821H662340K99286K22597K1520j02507N40540K55856j71247O43185R3668J62772
16811A0628010L45846K96116O7414J55478M21618N0377M03300J47465L33855J5192
16801A2864671N44007L59504J32558K05904M01280L90105M1453N20257M30970
16792A5890709M28196K37553N05745L56039N75339K59381N13550Q82975J27626
16783A9777113N54649N76258O70148M64179M10317N02468J146859M31866P12040
16774B5245897J015593P31148O49330Q24107Q52579Q92057J171622Q43279R17933
16765C3143545J177083P97036J204970J022216J465129J061788J749871J621368
16757D3243006R19093J751002J255927K026709J649819J876400J613031J792760
$$ plain form
16821 8662340 8961626 9184223 9205743 9103236 9643776 9899632 9728385 10371570 10465238 10628010
16811 10628010 10973856 11269972 11337386 11492864 11914482 11964859 12368159 12515624 12849479 12864671
16801 12864671 13408678 13768182 13900740 14106644 14507924 14898029 14939482 15459739 15890709
16792 15890709 16318905 16556458 17062203 17418242 17993581 18252962 18766512 19649487 19777113
16783 19777113 20331762 20908020 21578168 22042347 22452664 22955132 24101991 24533857 25245897
16774 25245897 26261490 26992638 27641968 28466075 29318654 30210711 31382333 32225612 33143545
16765 33143545 34320628 35117664 36322634 37344850 38809979 39871767 41621638 43243006
16757 43243006 44162099 45913101 47169028 49195737 50845556 52721956 54334987 56127747
16749E6127747K118943K181805J544821K501196K300623K225320K257393K273447
16741G3531295K878227K542565K696176K303048K635926K308470K857535K546357
16733I4299599K345898K610672K083956K394735K137492K052876J610047J427183
16725A10962458J567732R66816J160442M68369M21528r6329J22701q31692n85383
16716A14156642j101966j311467j065638k140488j848689j906185k063663k454681
16708A00263865k590181k332679k633070k547617k678074k864522k406869k620465
16700G9590388k877376j970987k726421k475121k418933k673760k151100k224768
16692F0071922k217434j860115j929113j759505j815573k202833j192560j599923
$$ plain form
16749 56127747 58246690 60428495 61973316 64474512 66775135 69000455 71257848 73531295
16741 73531295 76409522 78952087 81648263 83951311 86587237 88895707 91753242 94299599
16733 94299599 96645497 99256169 101340125 103734860 105872352 107925228 109535275 110962458
16725 110962458 112530190 113497006 114657448 115125817 115547345 115451016 115573717 114742025 114156642
16716 114156642 113054676 111743209 110677571 108537083 106688394 104782209 102718546 100263865
16708 100263865 97673684 95341005 92707935 90160318 87482244 84617722 82210853 79590388
16700 79590388 76713012 74742025 72015604 69540483 67121550 64447790 62296690 60071922
16692 60071922 57854488 55994373 54065260 52305755 50490182 48287349 47094789 45494866
16684D5494866j691555j629662j266229j442096j192137j442196q95615j559561
16676C4375815j200004r05165o85354j427244o94290j004493p91667r77019o32327
16667B6058252p13739o39817o79426r03121o24667q18734k21417q47412m89816
16658B0120103k0576j101093j92903p38112o71499j80001n08044n02647k04472
16649A6000756m93381n10048k64866k91686l14200k93210k42026o27021N3515
16640A3017833m70911l68641j23821j17486k68293m52687j20594k34428j26480
16631A0734492l35858n45260R4959n4582j20083l42075k81690k15347L7703m10386
16621H561873N5727l73679j62792j37291m9432k76375r5332j53938k34773J99704
$$ plain form
16684 45494866 43803311 42173649 40907420 39465324 38273187 36830991 35935376 34375815
16676 34375815 33175811 32270646 31585292 30158048 29463758 28459265 27667598 26690579 26058252
16667 26058252 25344513 24704696 24025270 23122149 22497482 21678748 21457331 20609919 20120103
16658 20120103 20099527 18998434 18805531 18067419 17395920 17215919 16707875 16205228 16000756
16649 16000756 15507375 14997327 14732461 14440775 14126575 13833365 13591339 12964318 13017833
16640 13017833 12546922 12178281 12054460 11936974 11668681 11215994 11095400 10860972 10734492
16631 10734492 10398634 9853374 9948333 9893751 9773668 9431593 9149903 8934556 8972259 8561873
16621 8561873 8617600 8243921 8081129 7943838 7894406 7618031 7522699 7368761 7133988 7333692
16611G333692l98278k6094j06810J98112n01142r0441J26838l76788J94827j17372
16601F236544j39863j81282K11180o18306K64424m750p85759K32839j27992M7960
16591E134995k25262J41149o3315J6621l08442M21756o66105k18622M5272M63180
16581D741227l13982l45245R0017K76797k09042M8456l12347L62306j73582l41945
16571C822660j14121L01399j32931k69889J25885k9994j26027L890m6892K99515
16561C833495j88800m73740K24594n49732M74810K18384n26014K93463k87307
16552C019153J00810Q9819r6884l23702J19600r9817j80139l5651J8877K56803
16542B868869k14188l0215Q3650M5166j84458O9382M1253r7832J13606j37082
$$ plain form
16611 7333692 6935414 6909320 6802510 7000622 6499480 6409039 6535877 6159089 6353916 6236544
16601 6236544 6096681 5915399 6126579 5508273 5772697 5767947 4982188 5215027 5087035 5134995
16591 5134995 4909733 5050882 4987567 5004188 4695746 5117502 4451397 4232775 4278047 4741227
16581 4741227 4427245 4082000 4172017 4448814 4239772 4288228 3975881 4338187 4164605 3822660
16571 3822660 3708539 4009938 3877007 3607118 3733003 3703009 3576982 3580872 3533980 3833495
16561 3833495 3644695 3170955 3395549 2845817 3320627 3539011 3012997 3306460 3019153
16552 3019153 3119963 3209782 3112898 2789196 2908796 2808979 2628840 2593189 2612066 2868869
16542 2868869 2654681 2624466 2708116 2753282 2568824 2638206 2679459 2581627 2695233 2558151
16532B558151r094l0949J20932n24830J99731j51005J81665m27126J6645L97235
16522B331355j17200K01007j02893j25514J28421l70552J15568K2977P7169k19229
16512A941109J27110j04964o7137K31652k9565j02545j31004j09161k4955Q9024
16502A819564p1190o6748P1271J63207l70041N50137m61643m6500K41148l33862
16492A495343J2054K66246k00830P8574K67656l10555j21924k96054K09298r727
16482A390081J1337k4653J90133j13829P7617J18877l50429k7052L13504l15759
16472A269827K12904j04169k01493J09942K8481J36317j50444J00754N4312l25363
16462A131068L95833k41605K0081r0182j57587N02716m41686J37322n937j9076
$$ plain form
16532 2558151 2549057 2518108 2639040 2114210 2313941 2162936 2344601 1917475 1934120 2331355
16522 2331355 2214155 2415162 2312269 2186755 2315176 1944624 2060192 2083169 2160338 1941109
16512 1941109 2068219 1963255 1896118 2127770 2098205 1995660 1864656 1755495 1730540 1819564
16502 1819564 1748374 1681626 1752897 1916104 1546063 2096200 1634557 1588057 1829205 1495343
16492 1495343 1507397 1773643 1572813 1651387 1919043 1608488 1486564 1190510 1399808 1390081
16482 1390081 1401418 1376765 1566898 1453069 1530686 1649563 1299134 1272082 1585586 1269827
16472 1269827 1482731 1378562 1177069 1287011 1315492 1451809 1301365 1402119 1456431 1131068
16462 1131068 1526901 1285296 1305377 1215195 1057608 1560324 1118638 1255960 1250023 1230947
16452A230947Q9599n82043O67941k22532j89635J62954J48155j13148j77902K28012
16442A242348l05751k5488J92075j0956l66405K70796n0613K82151j25989J23020
16432A225188m56939J25622k9243K49776j59713n4711j51955K49547K3363j44148
16422H76787j10149K9694K15698M8576j38606M1571J33200r0028l04324L90934
16412A093353j32507k51664J44778O1146j61240k83917M28545q2591q0634P5148
16402H10417m1403L37836l63755J69470K29981m92468M22561k00009l59078K92696
16392H06248L0520m1329K4561m1579R7309M1099j22109o4485J28364l34849M91845
16381A015595j98940R530m7434k6100j25731O6930m540J11655j18923J86908j46286
$$ plain form
16452 1230947 1320546 738503 1406444 1183912 994277 1157231 1305386 1192238 1014336 1242348
16442 1242348 936597 911109 1103184 1092228 725823 996619 946006 1228157 1102168 1225188
16432 1225188 768249 893871 864628 1114404 954691 899980 748025 997572 1020935 876787
16422 876787 766638 796332 1012030 1060606 922000 963571 1096771 1006743 702419 1093353
16412 1093353 960846 709182 853960 915106 753866 469949 898494 815903 735269 810417
16402 810417 769014 1106850 743095 912565 1142546 650078 1072639 872630 513552 806248
16392 806248 836768 795439 820000 778421 875730 916829 794720 730235 858599 523750 1015595
16381 1015595 816655 826185 778751 752651 626920 693850 689310 800965 682042 868950 722664
16370G22664K86152l52372k84766O20245l54716n3675K38301L5438N5647D41613
16359F03008l8797j38881R5329J392L49699j05819K6602A29355N15024j25921
16349E18458K5750J10989R0950k42574K08702K07010l87553n2851K3247l3793
16339D68335j8346A87121M02069R7874k97577K22450n8251B67809p3357N3900
16329B48352L05031r6429L1707m1816J98483A80466J81321j44416L17057O9211
16319F03639k54873r2318J04809J4380K59395Q2780B63573P4101K43216j33465
16309D47425P8532j37254K10747F7771N44558R3504J82P6352l53983J92436j52205
16298D68615J83499k53396m8302L20166K07319C77091A74119K79661j82872m090
$$ plain form
16370 722664 1008816 656444 371678 991923 637207 583532 821833 857271 912918 441613
16359 603008 564211 425330 520659 522051 871750 765931 792533 129355 644379 518458
16349 518458 544208 655197 746147 503573 712275 919285 531732 478881 502128 468335
16339 468335 449989 187121 589190 687064 389487 611937 553686 267809 194452 248352
16329 248352 553383 456954 488661 446845 645328 180466 361787 217371 534428 603639
16319 603639 348766 256448 361257 375637 635032 717812 263573 337674 580890 447425
16309 447425 525957 388703 599450 67771 612329 705833 706015 782367 428384 620820 468615
16298 468615 652114 398718 350416 670582 877901 377091 174119 453780 270908 266818
16288B66818A14349N39637B18085J37447J57729j75305r8124K09697B17038M09450
16278F26488k17883l0712M6491m6117O8391m3403L10545j08058Q7426B25275N37087
16267G62362B91501J55753k127A19922K72278j25869j10193K78675A50246K13296
16257C63542K78000l08386R5602j62324J90885j27221J84698k01798j03986K26163
16247D35175B12219J36663K1318K19214q1078B25313J28814J09930J843k23338
16237B42562J44384j71906K77501E4253L21490K9150K00527k26328Q2429A38045
16226B74912B9386N01360A35352J5487a38485C67781E010K72276l9343K11285
16216D49228j79085j17001J98818A19242K75750h2754L7791A04548f6065F35689
$$ plain form
16288 266818 114349 653986 218085 355532 513261 337956 239832 449529 217038 626488
16278 626488 408605 377893 424384 378267 446658 403255 713800 605742 693168 225275 762362
16267 762362 291501 447254 445127 119922 392200 266331 156138 434813 150246 363542
16257 363542 641542 333156 428758 266434 457319 330098 514796 312998 209012 435175
16247 435175 212219 348882 370200 589414 508336 225313 354127 464057 465900 242562
16237 242562 386946 215040 492541 54253 375743 404893 605420 379092 461521 138045
16226 274912 29386 530746 135352 150839 -138485 367781 5010 277286 237943 449228
16216 449228 270143 153142 351960 119242 394992 -82754 -44963 104548 -66065 635689
16205B13570R5950o2969J65610q7763j1425J75003j88906m7573K28168k36977
16195B42688j9065K08925O9533p3167O433l7331A73400O8756D9112K17172a20387
16183E1304K58051C0668L86072j82697i5442C99955C0575N2640L04894A50759
16172C47842H7390K04020C7441O8426L38281L2029l6027A51648p1511J43560b7931
16160D15884j72692j17868J49016D0561J805j6912J96100R5798k7419L8948F7948
16148A67353B430J0288O5469k3673K07145g5743C62247k1377j47624h9363G279
16136A01542L09782I561J32850e5515o6970B07309L6904p3850m7295R4292K96128
16125E13488F0134a43968C53095K5522f9665D37057C3158O5884K32746q9770l0423
$$ plain form
16205 213570 309520 246551 412161 324398 312973 487976 299070 251497 479665 242688
16195 242688 223623 432548 502081 428914 435347 398016 173400 242156 49112 266284 -120387
16183 51304 309355 30668 416740 234043 -95442 399955 30575 83215 388109 150759
16172 347842 87390 291410 37441 105867 444148 476177 440150 151648 80137 223697 -27931
16160 415884 243192 125324 274340 40561 42366 25454 221554 317352 289933 328881 67948
16148 167353 2430 12718 78187 54514 261659 -75743 362247 340870 193246 -89363 7279
16136 101542 411324 9561 142411 -55515 -122485 207309 244213 170363 123068 217360 513488
16125 513488 60134 -143968 353095 378617 -69665 437057 33158 99042 331788 242018 211595
16114B11595N7009H9464J43943I1357R9738P772Q823n5423a78804a623k62123
16103b63746J22847E21779K9213H8753J9574O9853a91148j03986i9589C8321b0805
16091B88928A6402N1791J00360E8500L1458K5106c35093C2758A3487R2408f8765
16079B55864r5676b47380g5872I249J24570b03758I8985K0578a38858G9742J53930
16068B33672O1594D9997d7157B84288J27090a04568j845D6889a66243h151C6678
16056A56001Q2986A05279e8544C76508j65693C4446c41529C95193j68449g925
16045a1135A58093O2530f5494K7072a7663B10153k2256a46128f0086C40553j42995
16034A97558J34750b01832J3585P0012K2260l2590C90250A46874D0387a9875R594
$$ plain form
16114 211595 268604 89464 233407 91357 191095 198867 207690 152267 -178804 -1623 -263746
16103 -263746 -140899 521779 550992 88753 108327 178180 -191148 -295134 -99589 38321 -20805
16091 288928 16402 68193 168553 58500 89958 115064 -335093 32758 13487 105895 -68765
16079 255864 160188 -247380 -75872 9249 133819 -203758 98985 119563 -138858 79742 233672
16068 233672 295266 49997 -47157 284288 411378 -104568 -106413 46889 -166243 -8151 36678
16056 156001 238987 105279 -58544 376508 210815 34446 -341529 395193 226744 -7925
16045 -11135 158093 220623 -65494 -38422 -17663 210153 187897 -146128 -60086 340553 197558
16034 197558 332308 -201832 -188247 -118235 -95975 -128565 390250 146874 40387 -19875 -10281
16023a0281C07120q0057a14347D9599a23685f0543B92274C2545a5590j04660B43268
16011I7882J57675c56821a28950B30012D8414K46506k2548J73062A35006m5542
16001H9464a89229E3254N7148d087H5398k1334d3464k32772b895A22801M2655
15990A65456o5469i5204B63818K10987K39832L20035O46366l50762k69249j56136
15980I04891m19842A60212K41152K2282l987e9928A21473M1030G1849c30498g4729
15968c7578l9738l09227A89722d4672j49322P8537c8388J9009l07044B57023q5794
15957A71229P1827A05179M21368a10018a3588k94372A9553a00854F2950N7111
15947A20061a6247H6671C2963N9193R3167a12562F371b96408J2755J08611h7493
$$ plain form
16023 -10281 307120 227063 -114347 49599 -123685 -60543 292274 32545 -15590 -120250 243268
16011 97882 255557 -356821 -128950 230012 48414 294920 272372 445434 135006 89464
16001 89464 -189229 53254 110402 -4087 85398 64064 -43464 -276236 -2895 122801 165456
15990 165456 99987 -95204 263818 474805 714637 1034672 1681038 1330276 1061027 904891
15980 904891 485049 160212 401364 423646 419659 -59928 121473 162503 71849 -330498 -74729
15968 -37578 -77316 -386543 189722 -44672 -193994 -115457 -38388 -19379 -326423 257023 171229
15957 171229 243056 105179 526547 -110018 -13588 -307960 19553 -100854 62950 120061
15947 120061 -16247 86671 32963 92156 185323 -112562 6371 -296408 -283653 -175042 -87493
15935b61934M4301c7341H9954j3091A4938J26633A0594b13541A31072j6837J00822
15924B15057I2375e1743F5055i2183A04260A9643k203b70825f4055J2546G5431
15912A10335J49175p3768Q4728j16898p1188C4949c8088C65378A63936b61211
15901I2238g468j29009A73977P4796B8354O4336a83248K5614A29224K4972P8634
15890B32830c5412o0572A11476b27439a9496n3938B38133k5932b46553B43945
15879a60434L2528B007f2094k9091I1509a34379B062L1475e8284a6845j51003
15868a67848A25347D757a29279f0297C10868A18203n5596e9489q5167K2058I0431
15856g7506A08537K49704H7063j8463L0693B0236f4856j76734R9197q4883o5689
$$ plain form
15935 -261934 -217633 -37341 89954 76863 14938 141571 10594 -213541 131072 114235 215057
15924 215057 92375 -51743 65055 -92183 104260 19643 17440 -270825 -64055 -51509 75431
15912 110335 259510 185742 270470 153572 82384 34949 -38088 365378 163936 -261211
15901 92238 -7468 -136477 173977 248773 28354 92690 -183248 -157634 129224 154196 232830
15890 232830 -35412 -95984 111476 -227439 -19496 -73434 238133 212201 -246553 243945
15879 -160434 -127906 2007 -62094 -91185 91509 -134379 2062 33537 -58284 -16845 -167848
15868 -167848 125347 4757 -129279 -60297 310868 118203 62607 -59489 -144656 -122598 90431
15856 -77506 108537 358241 87063 68600 99293 20236 -64856 -241590 -142393 -227276 -292965
15845b92965G212b958A5286J06318c9402j17855C1144b58327M2941j86385G7760
15833g4268c0512D8429b4077o850m86349b53575P142A13616a13350e0433j08825
15822a59258a7851A42198J3476a36151H8867k6349c18425A69507c9825j30075
15812a69900K7505L1157k23489L2524a50756A22154a18397k7512B46300a43510
15801a08755B41844b4818I1230c4474k15678A63433i6776A63009a82967R064N042
15790a68861M5117J0485C5778P2429L593a70034d8293j2347A64863g8848c0170
15778A27646d3861l5818j39181h9001A36835k6915f3387K3984C8591e9755c093
15766A56006J61017a48648A7559q533L46209b28557A27614i875A0487b35363H6970
$$ plain form
15845 -292965 7212 -2958 15286 121604 -39402 -157257 31144 -258327 -215386 -401771 77760
15833 -74268 -30512 48429 -24077 -30927 -517276 -253575 -246433 113616 -113350 -50433 -159258
15822 -159258 -17851 142198 155674 -136151 88867 62518 -318425 169507 -39825 -169900
15812 -169900 -142395 -111238 -334727 -302203 -150756 122154 -118397 -145909 246300 -143510
15801 -108755 241844 -24818 91230 -34474 -250152 163433 -96776 163009 -182967 -173903 -168861
15790 -168861 -123744 -113259 35778 108207 111800 -170034 -48293 -60640 164863 -78848 -30170
15778 127646 -43861 -79679 -218860 -89001 136835 109920 -63387 -39403 38591 -59755 -3093
15766 156006 317023 -148648 17559 9026 355235 -228557 127614 -9875 10487 -235363 86970
15754F9007Q282B8066b19925e3018G6460L03391a22758B45085C3806b54012C6186
15742F0386E972J74296a15701B4086e3467a331B05420q6668c41837B17583a19275
15730B26504B9100K27254M7591a8790j48819B67825A30298a90867j03863g8382
15719C2333a26400A30609D896a44826A13810B1821b16721P6182a8478E1065b98621
15707d19933i280j34565H9918P183c00248E4896d0090A53948m631F4576c57777
15695a64264N3625I5195h6312B43145F5916b08185I4495K28887m7490A06506A1206
15683b09793o9075p5229b2939o7331C01703B6025R573K31493F3628L0928a10238
15671A40392a71679K5777k3195f7711a2457A49870J661F7046L9969L3066b42839
$$ plain form
15754 69007 77289 28066 -219925 -53018 76460 379851 -122758 245085 33806 -254012 36186
15742 60386 5972 180268 -115701 24086 -53467 -1331 205420 118752 -341837 217583 -119275
15730 226504 29100 256354 303945 -18790 -167609 267825 130298 -190867 -294730 -78382
15719 32333 -126400 130609 4896 -144826 113810 21821 -216721 -140539 -18478 51065 -298621
15707 -419933 -9280 -143845 89918 97101 -300248 54896 -40090 153948 149317 64576 -357777
15695 -164264 -110639 95195 -86312 243145 65916 -208185 94495 323382 275892 106506 11206
15683 -209793 -278868 -354097 -22939 -90270 301703 26025 35598 267091 63628 94556 -110238
15671 140392 -171679 -145902 -169097 -67711 -12457 149870 151531 67046 107015 140081 -242839
15659a085k3518A8932J42699Q1468l9358a0940B86834H1855J53967a52379B32011
15647b12435l9319j4697k7978J46642d5260D26150b40035h8561a1863k98036a02865
15635g6619C88493f06825a08229A45368J06405a4889n687p1379J3637k13382C5694
15623A58511j1700n7161h6251A63988K8810a9758A06034a21745k3704b7435j20022
15612a47457A2045a65130A86598q2440a74937H5764g9639A3735a00385L1157j58433
15601b27661k3798i7056n0794j40455f369k5069o0600j1372B54206d6521j22039
15590a68560A7329i8127a3616H2190A9511M3354i1434n1655b7289A50685a8061
15578c48876G8492J858J07248n2598b73549Q8007d4608A6197d0707e046D0239
$$ plain form
15659 -1085 -24603 18932 161631 243099 203741 -10940 286834 81855 235822 -152379 232011
15647 -212435 -251754 -266451 -294429 -147787 -45260 426150 -240035 -88561 -11863 -309899 -102865
15635 -76619 388493 -606825 -108229 145368 251773 -14889 -20576 -91955 -78318 -291700 35694
15623 158511 146811 89650 -86251 163988 192798 -19758 106034 -121745 -145449 -27435 -147457
15612 -147457 12045 -165130 186598 104158 -174937 85764 -79639 13735 -100385 -69228 -227661
15601 -227661 -251459 -97056 -147850 -288305 -6369 -31438 -92038 -103410 254206 -46521 -168560
15590 -168560 17329 -98127 -13616 82190 19511 62865 -91434 -143089 -27289 150685 -18061
15578 -348876 78492 80350 187598 135000 -273549 -185542 -44608 16197 -40707 -5046 40239
15566F631a24753n5726b8609A57595k8159b74475A53588b5737k00981L2922J1049
15555a82747A63767b46455j11314J05802A7996R8474b48505D5112J28100b65889
15544C2652O7873M6214J9317f2522j41426B75309j02578J9273h4480G8935h562
15532e2934F03978B82949a01413B6808K87834A7896g0768A63005B6637J02641
15522A29278J67769n8821a1297A76444b44215A30485J09577J12066A46382K20190
15512C66572O1620c9171A82876c1341C5473L21698j776F1220J02514a74901H7096
15500G0989R0471L08330D4076K12752F0058R4118K301J46084m0293A04221D0950
15488A74415a20862C22438a130A14588B8301L3111a99876C3575c3388C05504j39694
$$ plain form
15566 6631 -124753 -180479 -28609 157595 129436 -274475 153588 -25737 -226718 -193796 -182747
15555 -182747 163767 -246455 -357769 -251967 17996 116470 -248505 45112 173212 -265889
15544 32652 100525 146739 166056 -62522 -203948 275309 172731 192004 -84480 78935 -8562
15532 -52934 603978 282949 -101413 26808 314642 17896 -70768 163005 26637 129278
15522 129278 297047 238226 -11297 176444 -244215 130485 240062 352128 146382 366572
15512 366572 428192 -39171 182876 -31341 35473 357171 355395 61220 163734 -174901 87096
15500 70989 161460 469790 44076 256828 60058 154176 156477 302561 262268 104221 40950
15488 174415 -120862 322438 -1130 114588 28301 61412 -199876 33575 -33388 305504 165810
15477A65810J62155r6912K77589J07800L09675r8646j44751J681B28745o8906
15467A59839a04047L9368A08858D8870A7736b90912a43230A00323K11649F579
15456F9144a89640A9664g9677j93524I9469h9096n453I4058L16419A27463D5177
15444D01707Q4418l4022O96803K33149l9819m6129l56816j51069C76509H2570
15433B59923r6121J40i249A6279M7942e3196b1908G7379h173A54401b05602o7049
15421b72651C17257a26992j6084A47732a19150q019K7112b8495J278k6953j4405
15410f8575A22354P8025f1766J3380r2864j79922B26190a25979B8738P5408c1051
15398a35277A53183e4882k7537o8924A34145b44979B5345b7842B33254d6719l745
$$ plain form
15477 165810 327965 231053 508642 616442 926117 827471 682720 684401 228745 159839
15467 159839 -104047 -64679 108858 48870 17736 -290912 -143230 100323 311972 6579
15456 69144 -189640 19664 -79677 -273201 99469 -89096 -94549 94058 410477 127463 45177
15444 401707 486125 452103 1148906 1382055 1342236 1296107 939291 788222 376509 82570
15433 259923 163802 163942 -9249 16279 64221 -53196 -21908 77379 -8173 154401 -205602 -272651
15421 -272651 317257 -126992 -143076 147732 -119150 -127169 -100057 -28495 -27217 -54170 -68575
15410 -68575 122354 200379 -61766 -48386 -141250 -321172 226190 -125979 28738 104146 -31051
15398 -135277 153183 -54882 -82419 -151343 134145 -244979 25345 -27842 233254 -46719 -50464
15387e0464J9732k3241A77225a96719M8664B01637E4516a54113M3889B85244L2874
15376C18118f8708A18743J34514d4431E58336j19003j09666p8051o7109b21224
15365C16861A02382N7734J52167e9769B84976j12341P7679L05470j40473L47034
15355G62345A50746N4849k8611K6823m9788p1624N57652j00432B17854J21133
15345C38987J63824A16471N53482A37000M00495l7790A60160a6437C02956o2006
15335B40950J07416j37606C4847J5468J06629J53605F5157a08619A80705K1310
15325B02015p3807a99300C51905J09882A90540q7984K83658b12309G0242N7560
15315A27802K40309f6680B60825b56059B94214k6647r8368E0873b74905E14335
$$ plain form
15387 -50464 -30732 -53973 177225 -196719 -148055 201637 54516 -154113 -110224 285244 318118
15376 318118 -68708 118743 253257 -44431 558336 439333 329667 251616 184507 -221224
15365 316861 102382 160116 312283 -59769 284976 172635 250314 555784 415311 762345
15355 762345 150746 205595 176984 203807 154019 82395 640047 539615 217854 338987
15345 338987 502811 116471 669953 137000 537495 499705 160160 -16437 302956 240950
15335 240950 348366 210760 34847 50315 156944 310549 65157 -108619 180705 202015
15325 202015 128208 -199300 351905 461787 190540 102556 386214 -212309 70242 127802
15315 127802 368111 -66680 260825 -256059 294214 267567 169199 50873 -274905 514335
15304D435M08324j57993j08979k9434J49659J2941j01636b6506B85537a28813
15293a88560C25938a81258C3149J82406P6060b33898A7665b2152A21205b5855
15282f5328A5918M007a05047A57768k0791E1350L26701Q813j52764A064J34798
15271A35862d1362A9355J55543E3724K10560b3290j26702d7699A6564K82140A09934
15259A69398N7868b6533j0335j9671a9065C41123A2906K2765M0240J9585B949
15247G1678k7216J51843C79K64232n7859M28186Q97014M3728J77060k2017H23671
15235I98022B76294a8763D25255E6267f1955A95057f6459A33738E4065o371j8386
15224B9308F908a65134o1890B26716c23198e2426A63545j1013a4369B61599r1984
$$ plain form
15304 4435 412759 254766 145787 116353 266012 278953 177317 -26506 285537 -128813
15293 -188560 325938 -181258 33149 215555 291615 -233898 17665 -22152 121205 -25855
15282 -65328 15918 19925 -105047 157768 136977 51350 378051 386864 234100 1064 135862
15271 135862 -41362 19355 174898 53724 264284 -23290 -149992 -47699 16564 298704 109934
15259 169398 227266 -26533 -36868 -56539 -19065 341123 12906 35671 75911 95496 2949
15247 71678 44462 196305 379 264611 206752 634938 1531952 1575680 1752740 1730723 823671
15235 998022 276294 -18763 425255 56267 -61955 195057 -66459 133738 54065 47694 29308
15224 29308 6908 -165134 -227024 226716 -323198 -52426 163545 152532 -14369 261599 169615
15213A69615D8116d7127B36921n9203G7957C629J57696n8606l4314c7161A96635
15201a87733A23915E3700a40698f5249E2823B5297M90870a05985M2684C34595
15190A01017N1912K4219J98475j77327a12859m3437C6248P5625b11211A24775
15179a65028H4715l3902L23427j11220C5771K87415e2800B32891a04363E9877
15168B40098f6751J3628B39538R9021f9605A43989j3139J40388E9550h011k01699
15157b09710B02842g5156B88682A12901J57109j22341L18488B04962a2929m9898
15147f2827D57154j09600Q015h2240B10705m0096K6588h6858C99335j05095J86553
15136D80793A16617j0404O6564F5066h0932G67022d8026C26550j15899b03317
$$ plain form
15213 169615 48116 -47127 236921 177718 77957 3629 161325 102719 68405 -37161 196635
15201 -187733 123915 53700 -140698 -65249 52823 25297 516167 -105985 -63301 334595
15190 101017 152929 177148 375623 198296 -112859 -156296 36248 111873 -211211 124775
15179 -165028 84715 50813 374240 263020 35771 323186 -52800 232891 -104363 59877
15168 240098 -66751 -53123 239538 338559 -69605 143989 130850 271238 59550 -8011 -209710
15157 -209710 202842 -75156 288682 112901 270010 147669 466157 204962 -12929 -62827
15147 -62827 457154 347554 355569 -82240 210705 170609 197197 -86858 399335 294240 480793
15136 480793 116617 106213 172777 65066 -80932 767022 -48026 326550 210651 -203317
15125b1439H5347J1398D3228g4739C61571b41499D04456A86226K13999j03099
15115B97126L4698d2580G8860i4472C3092l978d517A36017B2288O3964J08015
15104A94267o626i9130a8895A11418c13367I3443D1428a22663F0638K57852j30496
15093A87994B0984L36930F2300L6230M39200P6115B15486D7893O830K76248a0884
15081B65696G8140J1796J28689j02527L63877j39820A65867L1621b48543i0136
15070A14022O0208P9053P5658A43431j5714J55948A34492M0469f5360a3795B75499
15058E55000B70430q549L13526B57038Q7421j09357N3391Q3261g2217B35449M96298
15047G31747k44940A76622m7670K97513I2704J37617M1802l6858K77062A96357
$$ plain form
15125 -21439 85347 96745 43228 -74739 361571 -241499 404456 186226 400225 297126
15115 297126 331824 -42580 78860 -94472 33092 29114 -4517 136017 22288 86252 194267
15104 194267 187641 -99130 -18895 111418 -313367 93443 41428 -122663 60638 318490 187994
15093 187994 20984 357914 62300 98530 537730 613845 215486 47893 54723 330971 -10884
15081 265696 78140 89936 218625 116098 479975 340155 165867 197488 -248543 -90136
15070 114022 174230 253283 328941 143431 127717 283665 134492 174961 -65360 -13795 275499
15058 555000 270430 261881 575407 257038 344459 235102 288493 371754 -72217 235449 731747
15047 731747 486807 176622 128952 426465 92704 230321 272123 235265 512327 196357
15036C97686K6816n4321K71750j21980J60745j39856O10198l32990m4967J10730
15026H83811j96019n7415l9266N611P9419q6382j64762M28893o1262C20726J88248
15015E08974j72117k8007K07077j88133O5997L20695j48466k33622L12369j62233
15005D82534k10701j4173J28644j39136K00963j83734M88938L0880C18822K70067
14995E88889J02718q0062j2890l9538p5746o4515K13160O1108j34799K12598l62679
14984D08244L54758k74792K88696m1110M98728m08115k40978M52766E01598J67679
14974F69277k58343K34992M5392r2649J77548B87592L57777B02982O11568l67027
14964D47523q3443P6866n8245j24097L35805B44960K8934J31338j6537n6308k9241
$$ plain form
15036 397686 424502 370181 641931 519951 680696 540840 1151038 818048 773081 883811
15026 883811 687792 630377 591111 596722 676141 589759 424997 853890 792628 320726 508974
15015 508974 336857 308850 515927 327794 393791 714486 566020 332398 644767 482534
15005 482534 271833 257660 386304 247168 448131 264397 753335 784215 318822 588889
14995 588889 691607 611545 598655 559117 483371 418856 632016 693124 558325 770923 408244
14984 408244 763002 488210 776906 735796 1234524 826409 585431 1038197 501598 669277
14974 669277 410934 645926 691318 598669 776217 287592 645369 202982 814550 447523
14964 447523 364080 440946 382701 258604 594409 244960 273894 405232 388695 332387 303146
14953C03146J62777l2410L8937j91029j7193K05735m5884J60782L0257M482P5314
14942F94914o6027B29779L10914K03518l8485R013j41124J09650j82470O02096
14932A102891j91452L18698k29468L83662L32963j47533L32807M4736L82484n84133
14922A745655K62718j28133k57152K32236M97521K37969K21802n99545J3026k46908
14912A979189l76046k84333n64062J66098r1437B44767K35609Q6630R1510j10964
14902E47552k40024K43728m3882P2699P9361B59137J22030N0728K4634K4001Q3394
14891E63924r7904K50278j89559J00177J24148p2905K83715r9474Q9770N32431
14881A484601l20358l92560K55219l38679j07576J80061k67234p0553M72856l96336
$$ plain form
14953 303146 465923 433513 472450 281421 264228 469963 424079 584861 615118 619600 694914
14942 694914 628887 229779 540693 744211 705726 714739 573615 683265 500795 1102891
14932 1102891 911439 1230137 1000669 1384331 1717294 1569761 1902568 1947304 2329788 1745655
14922 1745655 2008373 1880240 1623088 1855324 2352845 2590814 2812616 2213071 2226097 1979189
14912 1979189 1603143 1318810 754748 920846 829409 244767 480376 567006 658516 547552
14902 547552 307528 551256 507374 580073 659434 259137 381167 431895 456529 480530 563924
14891 563924 466020 716298 526739 626916 751064 678159 961874 862400 952170 1484601
14881 1484601 1164243 771683 1026902 688223 580647 760708 493474 422921 895777 499441
14871D99441J4546j92254L04095j64408J38099M51028j62514k33433n0903l0274
14861E73423P4600R7236C31612n2694L15825j76434K12437j7413J37546l17223
14851D33656j19249L71684J12585j95984o1738L62193K04311j21568M78495l85783
14841A078602K58942l26440J10559R4474k21970j19259j87909J49436J2605k1331
14831H27709k26743O9348Q3353j34208J41534n5407k44916q4562N44237l20605
14821E99740M0101q7911K00783K01367j26069j12570l4911L8744j34523K21099
14811H05850l02413K40293k04942M15417N2200q8322j36410N76084k93060l3770
14801A030927m54370L06130l91431J92265j11692j18680M3961J26111M332Q3984
$$ plain form
14871 499441 513987 321733 625828 461420 599519 1050547 888033 654600 603697 573423
14861 573423 648023 745259 331612 278918 594743 418309 630746 613333 750879 433656
14851 433656 314407 686091 798676 602692 540954 903147 1107458 985890 1464385 1078602
14841 1078602 1337544 1011104 1121663 1216137 994167 874908 686999 836435 849040 827709
14831 827709 600966 670314 753667 619459 760993 705586 460670 376108 920345 599740
14821 599740 639841 551930 752713 954080 828011 715441 680530 719274 584751 805850
14811 805850 503437 743730 538788 954205 1006405 918083 781673 1357757 1064697 1030927
14801 1030927 576557 882687 491256 683521 571829 453149 497110 623221 627553 711537
14791G11537q2451L9474k17564J20713K96180L5863j22247l30054J68598Q2105
14781G02154l0057N0979P3382j43051M84094J67161E67937M33253k83399K68418
14771I86209j11831j66255j03523N24246E47663r4458L66813l00191K08147k68638
14761D59336L54716J77441B31838M42260J34887C47379J48929J88922L25084E02057
14750G73460j54087L9618o4513p2186O21203k90985l34319L74200l68683K05723
14740G29431L75995j25347k50010j17172J92273J28451M8859J40033j16120J70329
14730A176722J51764j53846K92240L53734K99796K7456o78579J9063l29369J55075
14720A314056m18021k1435r1643J63471J15947K277j56571l2816J61010k22352
$$ plain form
14791 711537 629086 668560 450996 571709 867889 903752 781505 451451 620049 702154
14781 702154 672097 723076 796458 653407 1137501 1304662 567937 1001190 717791 986209
14771 986209 874378 708123 604600 1128846 547663 453205 820018 519827 727974 459336
14761 459336 814052 991493 231838 674098 808985 347379 496308 685230 1010314 502057
14750 773460 619373 658991 594478 522292 1143495 852510 518191 892391 523708 729431
14740 729431 1105426 980079 730069 612897 805170 933621 982480 1122513 1006393 1176722
14730 1176722 1328486 1174640 1466880 1820614 2120410 2147866 1469287 1488350 1158981 1314056
14720 1314056 896035 874600 782957 946428 1062375 1064652 908081 875265 1036275 813923
14710H13923j38387P11235O4812m48294K42074J0753J87300J02174K23207K24708
14700A993505J40352q9184m55340N6872j79410k65n41795j40967K34746j94571
14690H23943J5586K970M16368k87306j73780K46653j26061O9272K097J3004j22587
14679H80159k17188L05995K45313k34376J00666j09639k3098j1501k8644K65417
14669A173104k07286M20019l05764q8661p1899J40700K73507m47500j8520M43152
14659A310852n5784j81642Q0681J11540j37444L74706m21384K22330L37229P0912
14649A711996l58786K84458l44817j61275K33230r8320J99726J8265j99447N0238
14639A335268L089J81J64018k57618J3196J8990j72063J08045K30331n5661J7387
$$ plain form
14710 813923 675536 1386771 1451583 1003289 1245363 1256116 1443416 1545590 1768797 1993505
14700 1993505 2133857 2044673 1589333 1646205 1466795 1466530 924735 783768 1018514 823943
14690 823943 839529 842499 1258867 971561 797781 1044434 918373 987645 989742 1002746 880159
14679 880159 662971 968966 1214279 979903 1080569 970930 947832 936331 907687 1173104
14669 1173104 965818 1385837 1080073 991412 919513 1060213 1333720 886220 867700 1310852
14659 1310852 1255068 1073426 1154107 1265647 1128203 1502909 1081525 1303855 1641084 1711996
14649 1711996 1353210 1637668 1292851 1131576 1364806 1266486 1466212 1484477 1285030 1335268
14639 1335268 1338357 1338538 1502556 1244938 1258134 1277124 1105061 1213106 1443437 1387776 1405163
14628A405163P8772k00477k20791K78502L26516k25296J03992J32869j94179J99468
14618A684539j84392j51598O97814n09142J43934l9675q3562p8354J56989j24103
14608A512450J10007j12512K34015j0827k78831J73949k33193J25179r1660N80429
14598B009006l08693l2601j77523L75653J7291o3210k63387K30746M7116o3434
14588A770964N4474k11159N0678O9207L92823k08774l9191J58838k7164k2052
14578A988644K02949j90739j75743M22681l96817o2451K83561j77557K10866J78208
14568B283602j88671L24779J70448j89021K53893j47266N3095m3188L46791j78720
14558B685742N093M29984N8440q8926L54574K38355K22467P98779N58128J688208
$$ plain form
14628 1405163 1483935 1283458 1062667 1341169 1667685 1442389 1546381 1679250 1485071 1684539
14618 1684539 1500147 1348549 2046363 1537221 1681155 1641480 1557918 1479564 1636553 1512450
14608 1512450 1622457 1509945 1743960 1733133 1454302 1628251 1395058 1520237 1428577 2009006
14598 2009006 1700313 1667712 1490189 1865842 1883133 1819923 1556536 1787282 1834398 1770964
14588 1770964 1825438 1614279 1664957 1734164 2126987 1918213 1879022 2037860 2010696 1988644
14578 1988644 2191593 2000854 1825111 2247792 1850975 1788524 2072085 1894528 2105394 2283602
14568 2283602 2094931 2419710 2590158 2401137 2655030 2507764 2560859 2517671 2864462 2685742
14558 2685742 2690835 3120819 3179259 3090333 3444907 3683262 3905729 4704508 5262636 6950844
14548F950844L083100Q857642J5851892N687313j9477137r626638m483016j925780
14540D918220j010753m15191L02501N50807J333162k168368p28330k13778p5320
14531B492950n6752k57347j5542l2531L12420k36318J5564K25861L9877p8615
14521B409567R0583p3386J74065k42750L34342l01866N31688j02998K9591k86855
14511B561981K89279L2374l78666N43276k47670J99520J51367J13040k23516K33097
14501C274082j62909o8409k2165L63282m78223N04271J73262j38517p2479k8264
14491C343931J68657p8777M12070k08223J23914k13045M39843k29312n9437M5484
14481C745105K34369J99521J79926n12948K08069p8709K40552q6021R26P6231
$$ plain form
14548 6950844 10033944 18891586 34743478 40430791 20953654 11327016 6844000 4918220
14540 4918220 3907467 3492276 3794777 4345584 5678746 3510378 2782048 2568270 2492950
14531 2492950 2436198 2178851 2163309 2130778 2443198 2206880 2222444 2448305 2488182 2409567
14521 2409567 2500150 2426764 2600829 2358079 2692421 2390555 2922243 2819245 2848836 2561981
14511 2561981 2851260 2883634 2504968 3048244 2800574 3000094 3151461 3264501 3040985 3274082
14501 3274082 3111173 3042764 3020599 3383881 2905658 3409929 3583191 3444674 3372195 3343931
14491 3343931 3512588 3433811 3845881 3637658 3761572 3548527 3988370 3759058 3699621 3745105
14481 3745105 3979474 4178995 4358921 3845973 4054042 3975333 4215885 4129864 4130790 4207021
14471D207021K74392k44667j2753J3224J10825J13198K97862j08568r4410L47038
14461D903162R197q0346l14184P85766r1625j21442K62533l1529K05516L656j02390
14450E428314Q7271K51950J85965m45846K99599k25948L76760m2707J63085k9
14440F078414M19555n87153N75534l26007L67951J7769K88135m32213L14671J16012
14430F832668K00077j78794K90003N16767P918J85484J2318K32015J45722J60554
14420H404732m9044K59505O2864K69539q3026k46327K95515J40292P4471j36174
14410H992347N41270L62167J33192K9486K67328p1547O58130l20931j51007J63868
14400A0604303M17121n6047L01283o3089K66662L2533L81136J96767J96383K69335
$$ plain form
14471 4207021 4481413 4236746 4223993 4237217 4348042 4461240 4759102 4650534 4556124 4903162
14461 4903162 4912359 4832013 4517829 5303595 5211970 5090528 5353061 5321532 5527048 5530704 5428314
14450 5428314 5515585 5767535 5953500 5507654 5807253 5581305 5958065 5915358 6078443 6078414
14440 6078414 6497969 5910816 6486350 6160343 6528294 6546063 6834198 6401985 6716656 6832668
14430 6832668 7032745 6853951 7143954 7660721 7668639 7854123 7866441 8098456 8244178 8404732
14420 8404732 8355688 8615193 8678057 8947596 8864570 8618243 8913758 9054050 9128521 8992347
14410 8992347 9533617 9895784 10028976 10058462 10325790 10254243 10912373 10591442 10440435 10604303
14400 10604303 11021424 10965377 11266660 11203571 11470233 11502766 11883902 12080669 12277052 12546387
14390A2546387M30017l38153L51779M79689J14254J74542L20184N79444K31840
14381A4889983L66119L49932m5218L22261L46727J41828N11185K63924K84255
14372A7430996M64583o320K15210O13801N65001O20663L57514J96382O53237m3945
14362B1067122O77920K65857M59774N05813N26476M31201O64889P09976M43888
14353B5752916K96602J166110M84478P32425M64225Q13382P28644P37222Q71871
14344C2047875Q06014R69328Q93508R83710R45214J049155P65233J128614J111839
14335D0700490J444408J187196J678298Q96974J489899J232686J675690J752370
14327E2058011J226175K189572K031101J780514J729935K791448K053919K271941
$$ plain form
14390 12546387 12976404 12638251 12990030 13469719 13583973 13758515 14078699 14658143 14889983
14381 14889983 15256102 15606034 15560816 15883077 16229804 16371632 16882817 17146741 17430996
14372 17430996 17895579 17889259 18104469 18718270 19283271 19903934 20261448 20457830 21111067 21067122
14362 21067122 21745042 22010899 22470673 22976486 23502962 23934163 24599052 25309028 25752916
14353 25752916 26049518 27215628 27700106 28432531 28896756 29710138 30438782 31176004 32047875
14344 32047875 32853889 33823217 34716725 35700435 36645649 37694804 38460037 39588651 40700490
14335 40700490 42144898 43332094 45010392 45907366 47397265 48629951 50305641 52058011
14327 52058011 53284186 55473758 57504859 59285373 61015308 63806756 65860675 68132616
14319F8132616K416115K466501K376368K604460L257560K792713L422117L681002
14311I1149452L434144M100908M198124M411649M514623M906914M770855N896389
14303A27383058N717974O253325O271706O761177P124986P819611P810476R046591
14295A84188904Q919466R638519J0103995J0581949J1231911J1787670J2663271
14288B59115685J2717967J3147419J4248877J4099530J4739699J4286106J5175247
14281C57530530J4485897J4417924J4113560J3381777J2379625J1027796R088741
14274D46425850P123094M293263K86466k276075m803660l599420p609892p354253
14266D32485373q777374j0790828j0099454j0121405j2450196j2083265j2239117
$$ plain form
14319 68132616 70548731 73015232 75391600 77996060 81253620 84046333 87468450 91149452
14311 91149452 94583596 98684504 102882628 107294277 111808900 116715814 121486669 127383058
14303 127383058 133101032 139354357 145626063 152387240 159512226 167331837 175142313 184188904
14295 184188904 193108370 202746889 212850884 223432833 234664744 246452414 259115685
14288 259115685 271833652 284981071 299229948 313329478 328069177 342355283 357530530
14281 357530530 372016427 386434351 400547911 413929688 426309313 437337109 446425850
14274 446425850 453548944 457842207 458128673 455852598 451048938 447449518 439839626 432485373
14266 432485373 423707999 412917171 402817717 392696312 380246116 368162851 355923734
14259C55923734j3312209j4175665j4357602j4686930j4379003j4360389j3902277
14252B56749659j3473888j2446956j1973022j1244086j0441434q738936r184156
14245A79247181q705664p955480p899058p079503p167143o579159n979272n390580
14237A22491322n248961n081458m818758m409644m509313m102442l239876l727210
14229H7353660l374091l249398l098244k812177k722436k767916k405260k366942
14221F4557196k264644j950168k039308j633056j920850k269273j519643j027388
14213D9932866j647865j394373j638537j224247j485712j113951n64248j039639
14205C9824294j679253p77802j107513j038575o09312o12148j092096r33038j063035
$$ plain form
14259 355923734 342611525 328435860 314078258 299391328 285012325 270651936 256749659
14252 256749659 243275771 230828815 218855793 207611707 197170273 188431337 179247181
14245 179247181 170541517 162586037 154686979 147607476 140440333 133861174 127881902 122491322
14237 122491322 117242361 112160903 107342145 102932501 98423188 94320746 91080870 87353660
14229 87353660 83979569 80730171 77631927 74819750 72097314 69329398 66924138 64557196
14221 64557196 62292552 60342384 58303076 56670020 54749170 52479897 50960254 49932866
14213 49932866 48285001 46890628 45252091 44027844 42542132 41428181 40863933 39824294
14205 39824294 38145041 37367239 36259726 35221151 34611839 33999691 32907595 31974557 30911522
14196C0911522p27619q20887k38533o86505o82347p79557r20628p87204l71196
14187B4897046m90296n10892o44497p54728m03894j95880o80836p8464p05070
14178B0432489m08630n70524m08311m05132j10255k18026n63188l13473l15345
14169A7119605j90298l85031n92614j53604n19391J87567n18615m89487Q1261
14160A4539393j13810m89612m90580M4114l10993k83749j40258k77383j35473
14151A2341649k01301k00465j60296k24143l6709j95949m80434m7808J91120l96407
14141A0589257k23395j54712n00610M82445l41405j77450k23056l14964J58479
14132I294589l22430O0236l69064K05630k59180j48205j85656l3565k4598j5363
$$ plain form
14196 30911522 30183903 29363016 29124483 28437978 27755631 26976074 26055446 25268242 24897046
14187 24897046 24406750 23895858 23251361 22496633 22092739 21896859 21216023 21137559 20432489
14178 20432489 20023859 19453335 19045024 18639892 18529637 18311611 17748423 17434950 17119605
14169 17119605 16929307 16544276 15951662 15798058 15278667 15466234 14947619 14458132 14539393
14160 14539393 14425583 13935971 13445391 13489505 13178512 12894763 12754505 12477122 12341649
14151 12341649 12140348 11939883 11779587 11555444 11518735 11322786 10842352 10794544 10985664 10589257
14141 10589257 10365862 10211150 9710540 10192985 9851580 9674130 9451074 9136110 9294589
14132 9294589 8972159 9032395 8663331 8868961 8609781 8461576 8275920 8242355 8217757 8202394
14122H202394l41766k80393J86865k73897k15445K77104m93399M0339j14373J17763
14112G105192q5679j22802l40355M67462m61037m3430k2811J42621k83806J65598
14102F520953l16793k99805R9422m01250l5438M21421o0501j47963m7745l46984
14092E385317P539l9239l72499O44144j99241k98800K03751j44251m9561j32355
14082E004805k05134r7802R7078j55805p8391K02292l92785J87443J22715k60288
14072D424128J31804k84808R3131j74223J00787K79995m13649n5570j82278J24559
14062D043876J71954k26077K59971k36378J0660M2643P6293l34713m12953K92020
14052C687296q6614K78076n32578j0156L25516l09038J0003K28832j3935k92950
$$ plain form
14122 8202394 7860628 7580235 7767100 7493203 7277758 7554862 7061463 7101802 6987429 7105192
14112 7105192 7019513 6896711 6556356 7023818 6562781 6519351 6496540 6639161 6355355 6520953
14102 6520953 6204160 5904355 6003777 5602527 5567089 5988510 5928009 5780046 5732301 5385317
14092 5385317 5392856 5353617 4981118 5625262 5426021 5127221 5330972 5186721 5137160 5004805
14082 5004805 4799671 4701869 4798947 4643142 4564751 4767043 4374258 4561701 4684416 4424128
14072 4424128 4555932 4271124 4364255 4190032 4290819 4570814 4157165 4101595 3919317 4043876
14062 4043876 4215830 3989753 4249724 4013346 4024006 4066649 4142942 3808229 3395276 3687296
14052 3687296 3600682 3878758 3346180 3336024 3661540 3352502 3362505 3591337 3577402 3284452
14042C284452j02187l287l19305K31211j54889j0653R8730L2457j23265N3919
14032B987183M2797L03521m07609L48123l31789K47196l45200J26004m12143M23657
14022B981740p3118k25651L14267j78959k20453M389J43527m1237O6121l05740
14012B464886j01948K47517J28699k37862L49042n94725k179K38153j67116J68663
14002B493130k87937k3236R5964k69562J12568J11016l29336P7149K87853j71336
13992B096273J7334R9464K82631N95017K150518O273119J5299198J4728816j5503197
13983B6039173j0368219m821354l206017j920618r55619m08701n10186l00940
13975C547519j81114l68970l7126p3459j56820m11544K81694k91885J45526j92439
$$ plain form
14042 3284452 3182265 3178978 2859673 3090884 2935995 2925342 3024072 3056529 2933264 2987183
14032 2987183 3029980 3333501 2925892 3274015 2942226 3189422 2844222 2970226 2558083 2981740
14022 2981740 2908622 2682971 2997238 2818279 2597826 2602215 2745742 2704505 2770626 2464886
14012 2464886 2362938 2610455 2739154 2501292 2850334 2255609 2253430 2491583 2324467 2493130
14002 2493130 2205193 2181957 2277921 2008359 2120927 2231943 1902607 1979756 2267609 2096273
13992 2096273 2113607 2213071 2495702 3090719 5241237 11514356 26813554 41542370 26039173
13983 26039173 15670954 10849600 7643583 5722965 4767346 4358645 3848459 3547519
13975 3547519 3366405 2997435 2960309 2886850 2730030 2318486 2600180 2308295 2453821 2261382
13965B261382j95249N8937O342m77155O09417J2814k77819j2246J88051j62085
13955B012389j35523L36696k01373M9082l18940k72670L68381j03946J49494k4341
13945A859249p8937O1947j41449N3445J79888q4197N9880l8489k9360m3847j54887
13934A643243J35535j62976J51395k07286k76929O09459l94967O6555J27105j05916
13924A585218k43362K86599K50407n23869L71261k38353j34591K30778j26258
13915A457830O0751P077R489m2639M9112k18276R5946j89390J16874K29505k44556
13904A331723k00683L64405l5804M9468O8614l08499j2358p2716L931M16727l23581
13893A281227r0850r4392L3440K70372P8463l34549p3339K69162k75983L50670
$$ plain form
13965 2261382 2066133 2125070 2131412 1654257 2263674 2276488 1998669 1986423 2174474 2012389
13955 2012389 1876866 2213562 2012189 2061271 1742331 1469661 1838042 1734096 1883590 1859249
13945 1859249 1780312 1842259 1700810 1754255 1934143 1849946 1909826 1871337 1841977 1798130 1643243
13934 1643243 1778778 1615802 1767197 1559911 1282982 1892441 1497474 1564029 1691134 1585218
13924 1585218 1341856 1628455 1878862 1354993 1726254 1487901 1353310 1584088 1457830
13915 1457830 1518581 1525658 1535147 1492508 1541620 1323344 1419290 1229900 1346774 1576279 1331723
13904 1331723 1131040 1495445 1459641 1509109 1577723 1269224 1256866 1184150 1188081 1604808 1281227
13893 1281227 1190377 1095985 1129425 1399797 1478260 1143711 1070372 1339534 1063551 1414221
13883A414221l75993K67967l1700k10099O1950k34483L65763j65320k00355L22491
13873A214442l8638N2346k86186J82264n9602L8625n9079r7268J3459K19481R3662
13862A273506l03841J65971n6356k48811l31737K91546M32364m43999L45492k31203
13852H92932mk3512J54523j12882q9157J49016j32424p293J73935J49066j84234
13841I69966J85910l04757M6891k90832K34595J63272j41861L55399k74719j24377
13831H19487L18417j70126L09140n91395K6934J29067J43330k40205J50984j60757
13821G34876L76681n7955l52408K63962q4749l9530j43347L43363l74349K57330
13811I23874j57478j91681N66279n32309j49795L97302j68882O2538J92020l11595
$$ plain form
13883 1414221 1038228 1306195 1274495 1064396 1126346 891863 1257626 1092306 891951 1214442
13873 1214442 1175804 1228150 941964 1124228 1064626 1103251 1044172 946904 960363 1179844 1273506
13862 1273506 969665 1135636 1079280 830469 498732 790278 1222642 778643 1124135 892932
13852 892932 892928 869416 1023939 911057 821900 970916 838492 831199 1005134 1154200 969966
13841 969966 1155876 851119 898010 607178 841773 1005045 863184 1218583 943864 819487
13831 819487 1137904 967778 1276918 685523 712457 841524 984854 744649 895633 734876
13821 734876 1111557 1053602 701194 965156 880407 840877 697530 1040893 666544 923874
13811 923874 766396 574715 1140994 608685 458890 856192 687310 749848 941868 630273
13801F30273L62293l0661k91853J14352j36136J33069j31189L18736o1806L02002
13791A209080k99207r142o9763C69688O17910l07466j98705N8995L52175j59929
13781G32668Q2650j00474p7255q3565J4101J17596K29835l79986J74840q7576
13771F22834P9022n8600k63060J05640L32306J00064C86782K59381m5148k4998
13761E76017J0413K8007J86824j57513C18982M41644j69276J17289C03060K42872
13751E45932J18690o2082j87096K57411l9928j90974O14255C27158L9998N54267
13741I21423j70941N0896B75330N9547J74812J62882o6460p2328J41561k20563
13731D54781J8311K33497j4460n4248j92847K11279K7568k00257n5953J88766
$$ plain form
13801 630273 992566 961905 670052 784404 648268 781337 650148 968884 907078 1209080
13791 1209080 909873 900731 830968 369688 987598 680132 481427 540422 892597 732668
13781 732668 815318 714844 637589 554024 568125 685721 915556 535570 710410 622834
13771 622834 701856 643256 380196 485836 818142 918206 386782 646163 601015 576017
13761 576017 586430 614437 801261 643748 318982 760626 591350 708639 303060 545932
13751 545932 664622 602540 415444 672855 632927 441953 1056208 327158 367156 921423
13741 921423 750482 801378 275330 334877 509689 672571 606111 533783 675344 454781
13731 454781 473092 706589 692129 637881 445034 656313 683881 483624 427671 616437
13721F16437B89212M47913k79710K65745k35928J6259B18343O10533j82511q2918
13711E63447j46216Q5878B14799M02815J86336j93876l03089L09947j79930N9456
13701D96458K63147l15682j68608M97081k47817J41546k44362M2892K27958r2881
13691E99732j11157q4083R3728j39746L55352R1326A23010M78648R8407C00100
13680C40638L47380B03405L22245R2990A44609L93969A97252M16444q4571m4511
13670D84614L66739l18467p4470n1852R4047j93992L66035l30818J24268K7790
13660D93894r6415n7157O0171o2677j4622L96551C35974J62140k26003O8845P0419
13649D11375J32458B65084P7283j2160J78721m1912k4742k3625p6022N8064j30201
$$ plain form
13721 616437 289212 737125 457415 723160 487232 503491 218343 828876 646365 563447
13711 563447 417231 503109 214799 617614 803950 610074 306985 616932 437002 496458
13701 496458 759605 443923 275315 772396 524579 666125 421763 464655 692613 599732
13691 599732 488575 404492 498220 358474 713826 805152 123010 601658 700065 300100
13680 340638 688018 203405 525650 618640 144609 538578 197252 613696 529125 484614
13670 484614 851353 532886 458416 406564 500611 306619 672654 341836 466104 493894
13660 493894 397479 340322 400493 337816 323194 719745 335974 498114 272111 340956 411375
13649 411375 543833 265084 342367 330207 508928 467016 442274 418649 342627 400691 270490
13638B70490K25748O7515k42743N9805j14826O3408O5097J73973j96433C5300
13627A27725n0191M15225J58009C16034n1704K50548A33622J23516P5045E5402
13616C25599J49121L50512l74121j70235K28448r9959J11502k20622K39551B61302
13605B31163L77104J47705k01904p5202B14740M16253A26628N14455A68461Q0718
13595B49179L10103j26230k15027d5445C18320K76276A75093C4773M1655L82192
13585D58620n6252A03693P0652N728o0498K33330K20320B48209j1500K885F1154
13573B27093m4889K66487A87068K06814r6256j982J03375A90271K92133B07895
13562E21026k50352J10984j31508K16063M3643A28300K15892j27422A05552J46338
$$ plain form
13638 270490 496238 563753 321010 380815 265989 329397 394494 568467 372034 35300
13627 127725 77534 492759 650768 316034 264330 514878 133622 257138 332183 55402
13616 325599 474720 825232 451111 280876 509324 409365 520867 300245 539796 261302
13605 231163 608267 755972 554068 478866 214740 630993 126628 641083 168461 249179
13595 249179 559282 433052 218025 -45445 318320 594596 175093 34773 76428 458620
13585 458620 402368 103693 174345 180073 119575 352905 573225 248209 236709 239594 61154
13573 227093 182204 448691 187068 393882 297626 295644 399019 190271 482404 207895
13562 521026 270674 381658 250150 466213 509856 128300 344192 216770 105552 251890
13552B51890J92444l3759j30871L820Q6434O1733o5256j20452L6767J20120j81058
13541B21812J83520J6443K8828N313q1101P3858I8055b967A65571N88316I1728
13529d4038F02578k72568m5192A36339a1098L534D41756j95564P2211m5429A20012
13517D49992C6944K09058o8193K65981j06455q1501K0094D5474k1281L65438i7376
13505D19120A98495K51590j49217H0211K60057D2865K60870J60299d5508B49180
13494A33659J61705M3852L23537p493A79217a12749A44604K98000n5817A78049
13483B52686J758M7392j16169O6016F6699L62565J57352B41675K76816A83369
13472B27538M0956j15868O6733K26646A85635k8136N2330H3179J61375H2720a11552
$$ plain form
13552 251890 444334 410575 279704 283524 369958 431691 366435 245983 282750 402870 221812
13541 221812 405332 421775 450603 455916 374815 448673 98055 -2967 165571 753887 91728
13529 -44038 602578 330010 284818 136339 -11098 -7564 441756 246192 318403 272974 120012
13517 449992 36944 246002 177809 443790 337335 255834 275928 45474 24193 389631 -97376
13505 419120 198495 450085 300868 80211 340268 42865 303735 464034 -45508 249180
13494 133659 295364 339216 662753 655260 179217 -112749 144604 442604 386787 178049
13483 252686 254444 301836 185667 251683 66699 429264 586616 241675 518491 183369
13472 227538 268494 152626 219359 446005 185635 157499 209829 83179 244554 82720 -111552
13460A40623L9241K20098J33068D3212N7514C6804L5013M03835j35227k0056G3573
13448C83489G5585L11514j00160D6234L62547A23639m7768K75786p8035D6394
13437B52586n4255p6100P878O155A048L45055l8871J4995A511M35852A75177a00975
13424H2795f4609A37335P833c19015F8519J73780j19706J0949f0365F1391K73526
13413C34917a65063B82211B8860L85019O7677B14769j2741a99548A77935J9609
13403A97544J58067A8412b74393A70588l2770L1653L301o696D8855K57540J0966
13392C17361q6501r3835K4352E4393a36172D01674A87379D5787b14106J1467B45650
13380E7646K15600a2776j21796b653B38265J98622A81376l9939J31292J61797
$$ plain form
13460 140623 179864 399962 533030 43212 100726 36804 71817 475652 340425 320369 73573
13448 383489 75585 387099 286939 46234 408781 123639 75871 351657 273622 46394
13437 252586 198331 122231 130109 136264 1048 346103 307232 322227 1511 437363 175177 -100975
13424 82795 -64609 137335 145168 -319015 68519 242299 122593 133542 -60365 61391 334917
13413 334917 -165063 282211 28860 413879 481556 214769 202028 -199548 177935 197544
13403 197544 355611 18412 -274393 170588 137818 169471 172772 166076 48855 306395 317361
13392 317361 230860 137025 161377 54393 -136172 401674 187379 45787 -214106 -202639 245650
13380 57646 273246 -12776 -134572 -2653 238265 436887 181376 141437 272729 434526
13370D34526p0691j02450o155p1312h0058B57481A07383J20422I8593a07764C21518
13358A12647L0932B0792K20701M0447J605G6700K35037q4707j12412J00720K70783
13347D86121o9403j06130c1482D37489I1923J75257J9608J63218A20392K53451
13337C73843J02323d3770D00559j97132R5894A25497L10297j1468G9954J405k5613
13326E5746M21711A66354K59100e9029D82200A77593k2558Q188m2367J70917j05822
13315A85951b3274B40419K42280I5535J57450q0380J80585A2463M16393h7059
13304B7034K47067j12502E4591J87084r3206J25673A14051j0349J55897J05608
13294C65207K272J02246a13273A98929I9251J32200k8282Q5128r229O894f792
$$ plain form
13370 434526 363835 261385 255230 183918 -80058 257481 107383 227805 98593 -107764 321518
13358 112647 143579 20792 241493 281940 283545 76700 311737 227030 114618 215338 486121
13347 486121 416718 310588 -31482 437489 91923 267180 286788 450006 120392 373843
13337 373843 476166 -43770 400559 203427 299321 125497 435794 424326 79954 81359 55746
13326 55746 477457 166354 425454 -59029 482200 177593 155035 163223 120856 291773 185951
13315 185951 -23274 240419 482699 95535 252985 172605 353190 12463 428856 -87059
13304 27034 274101 161599 54591 241675 148469 274142 114051 103702 259599 365207
13294 365207 367479 469725 -113273 198929 99251 231451 203169 288297 279068 285962 -6792
13282A01854L54621a59028F9425a32772j15806B93150K896I3540R9377j2620H0480
13270f1653c695o4389I1847a7576F8816J89782a58505F4283J06651J13291a62170
13258C95913N3316A68469R5832d7834l40048A26726E7879N00717a34817b3803
13247A7498L68683j69533F7473O0352l1336J97921A12379O241R8965q5905b74308
13235A00737j0332b68362Q1058f1743B26777r494b13375A25707D4343a40731p799
13224a48530C38506B5273Q2755N4203J9748C8097d1738A73969L2306J2910b13683
13212A45950l884n0550e6888C93469l5748A27032a6956A22065a64067C0016d9104
13200A34652L2858a56288P1505k2028A46202a92105N8041r4919i1966C34124a09076
$$ plain form
13282 101854 456475 -159028 69425 -132772 -248578 293150 296046 93540 192917 180297 80480
13270 -61653 -3695 -68084 91847 -17576 68816 258598 -158505 64283 170934 284225 -162170
13258 395913 449229 168469 264301 -47834 -387882 126726 57879 558596 -134817 -23803
13247 17498 386181 216648 67473 127825 96489 294410 112379 118620 217585 131680 -274308
13235 100737 90405 -268362 -187304 -61743 226777 217283 -213375 125707 44343 -140731 -148530
13224 -148530 338506 25273 108028 162231 181979 38097 -41738 173969 206275 219185 -213683
13212 145950 142066 91516 -56888 393469 357721 127032 -16956 122065 -164067 30016 -49104
13200 134652 167510 -156288 -84783 -106811 146202 -192105 -134064 -228983 -91966 334124 -109076
13188C15431I7234R6659n716a11222B3100K12184q5283J9826D4856J58893k155
13177B01594a53102n8750A32563j3001f6368B40192j1352j10526J32670O7554
13167C18538a14458B40100F0925A958J58330m5164b8684j02474k26697B06066
13156B874P8256c4924j55167A03198R7503k0210a685r2568j18419A08027c37611
13144C44504b29710A43504F0793N5752E4191j4664P0716g1865A18565b689I4645
13132h9074a70j10177c0004A95419a84300C54400e6038D9407b04093F3858J61742
13121B25600l4123P2431f2003A60294o1974K18225O0568j57209b1588o6633o2092
13110a50313A41950l2922M3357K3523f9680C87002j41462f7018j90852F5803k7928
$$ plain form
13188 315431 97234 193893 188177 -111222 23100 235284 150001 169827 44856 203749 201594
13177 201594 -153102 -211852 132563 119562 -66368 240192 228840 118314 250984 318538
13167 318538 -114458 240100 60925 1958 160288 115124 -28684 -131158 -357855 206066
13156 2874 81130 -34924 -190091 103198 200701 180491 -1685 -94253 -212672 108027 -337611
13144 344504 -229710 143504 60793 116545 54191 39527 110243 -71865 118565 -2689 94645
13132 -89074 -170 -110347 -30004 195419 -184300 354400 -56038 49407 -204093 63858 225600
13121 225600 191477 263908 -62003 160294 98320 316545 377113 219904 -21588 -88221 -150313
13110 -150313 141950 109028 152385 175908 -69680 387002 245540 -67018 -257870 65803 37875
13099C7875J71937f0831A28507K3674B5424a06482j4125A02615k5825a29845a5337
13087A14079f1378j514A84952j2021O3228p2484J81079j38580a45457M5210I169
13075b80658d9910j90066A59016J32867j15058K32745J8557i3751A35190i5767
13064E091K29499a42610A01301b45515B9588L05644D6665L97680f9783j66057
13054b35840C6056g138E06178A62705c8171A69941o0319J12692C9513L11014Q2543
13043D33070c02780F6375l1994K92266a80617C07227A06263l58n0840J27179J18856
13032C01100c0741A31115c34599A15674J43923A09177d2446j10031j33966h7181
13021A23770k5501K0993J68572b31508A51267N6821J722a54887L4446D51160N7623
$$ plain form
13099 37875 209812 -60831 128507 152181 25424 -106482 -120607 102615 76790 -129845 -15337
13087 114079 -61378 -62892 184952 172931 236159 163675 344754 206174 -145457 -100247 9169
13075 -280658 -49910 -239976 159016 291883 176825 409570 428127 -93751 135190 -95767
13064 5091 234590 -142610 101301 -245515 29588 335232 46665 444345 -69783 -235840
13054 -235840 36056 -7138 506178 162705 -38171 169941 109622 222314 39513 350527 433070
13043 433070 -302780 66375 34381 326647 -180617 307227 106263 105905 55065 182244 301100
13032 301100 -30741 131115 -334599 115674 259597 109177 -42446 -152477 -286443 -87181
13021 123770 98269 119262 287834 -231508 151267 208088 209810 -154887 -120441 451160 508783
13010E08783f9725b2540j65949I995g2517o5174F0811J42246K4249n8819a5477
12998B72721N2473A44694E3416a60338A91173a05623j34259A04305C8801d8152
12987I370c47966B0748a36885F470M6418i8654L2442j70398f3481k18391C31765
12975i5292k8968N9593I0890a9882k73781G3183k3436K96821g4416R673A68789
12963a23872j70552a7303B99316a21932A50085k2958f2463L737p1933A40313j3505
12952A26808n6377a22665B49214g1062j0043L4072p229B0663e7833k96016d5398
12940a78239A03928c6979A48986d143H5524d1596A73887K83B2114a20379j0482
12929a30861L9206A05637B4659J7837a5191D365a44459O2453A54885f5393J5528
$$ plain form
13010 508783 -69725 -22540 -188489 9995 -72517 -137691 60811 203057 227306 168487 -15477
12998 272721 325194 144694 53416 -160338 191173 -105623 -239882 104305 38801 -48152
12987 9370 -347966 20748 -136885 6470 52888 -98654 -66212 -236610 -63481 -281872 331765
12975 -95292 -124260 -64667 90890 -19882 -293663 73183 49747 346568 -74416 -64743 168789
12963 -123872 -294424 -17303 299316 -121932 150085 127127 -62463 -58726 -130659 140313 126808
12952 126808 70431 -122665 249214 -71062 -81105 -47033 -54262 20663 -57833 -353849 -45398
12940 -178239 103928 -36979 148986 -4143 85524 -41596 173887 174170 22114 -120379 -130861
12929 -130861 -91655 105637 24659 42496 -15191 4365 -144459 -82006 154885 -65393 -49865
12918d9865j68110A9262R4346l3159K5408B1272g0726C8701a07394A21857d4872
12906b18611C04659c2572q9582F330a08679B14961E9416R5785F9988L5290O688
12895A11966I79J4122J01004P7267n6197F5734P969k6043a04057B44797r9829
12884A44968O1622i3837K3730A70710K00938A05465K71690A7309L74056A05736
12873b3605I7232a60640j46948B91844f3773I9180k3222c12851A22831A3866J02645
12862A16511d72651D7981A3705J05224B7160K04989C859P2612a19667H2522e0256
12850c6118A23059N0327H0849K14507F7086J0670J55624i4398k7846j11598A51652
12838b43380k49963b30810B1718J88404b09346i3419H4848c13056H4729m0269
$$ plain form
12918 -49865 -217975 19262 113608 80449 105857 21272 -70726 38701 -107394 121857 -44872
12906 -218611 304659 -32572 -122154 6330 -108679 214961 59416 155201 69988 105278 111966
12895 111966 979 15101 116105 193372 137175 65734 73703 47660 -104057 244797 144968
12884 144968 206590 -93837 -70107 170710 371648 105465 377155 17309 391365 105736
12873 -23605 97232 -160640 -307588 291844 -63773 99180 75958 -312851 122831 13866 116511
12862 116511 -472651 47981 13705 118929 27160 232149 3859 76471 -119667 82522 -50256
12850 -36118 123059 173386 80849 295356 67086 77756 233380 -94398 -122244 -233842 151652
12838 -243380 -493343 -230810 21718 210122 -209346 -93419 84848 -313056 84729 44460
12828D4460L3531J57698a1937A57257a32532A03499i3511n6865E4464k1420j5169
12817A7875a00710b7347A03925Q3975b30289A73064b099j0611A02261a69656j25886
12806b95542G9542O013a4897B23233a06492F5144K06486a15325B16218D5573a56789
12794h8228A37168g0432A36439R6256b24770R8679G0069g8909b9917B38619B8490
12782a04667c9282j43757p8738B50640q9993C5385D315b7567j1501l06258C7673
12770E5518O1690n4267P4473O2976G5747a9291A86100e9375A18059H545a37888
12758b01792B06505a9503j06549b9584A14878N5330j3754c38594i521l81852B6684
12746B13428K81628A33740a08925I5932d3509A30998K28417a8146A87380C0821
$$ plain form
12828 44460 77991 235689 -11937 157257 -132532 103499 -93511 -150376 54464 33044 17875
12817 17875 -100710 -27347 103925 187900 -230289 173064 -2099 -12710 102261 -169656 -295542
12806 -295542 79542 85555 -14897 223233 -106492 65144 271630 -115325 216218 45573 -156789
12794 -88228 137168 -70432 136439 232695 -224770 -126091 70069 -78909 -29917 238619 28490
12782 -104667 -39282 -183039 -261777 250640 160647 35385 4315 -27567 -39068 -345326 37673
12770 55518 117208 62941 137414 200390 75747 -19291 186100 -59375 118059 8545 -137888
12758 -201792 206505 -19503 -126052 -29584 114878 170208 156454 -338594 -9521 -391373 26684
12746 213428 495056 133740 -108925 95932 -43509 130998 359415 -18146 187380 30821
12735h1281l1041A8743e9692B48340I9106K8384l5880e4826A42869a16959j56849
12724b73808b5628l08116A76808A2141J91588g8143L7842B68753g5633j52948
12714b28581d0584j7942A199L44948M7843A93615F4667a06737G2351J63598b9955
12702b62726a08680A79414G2609a8217A02367c1197B18649a56119A53666o9447
12692H4219L3146c1612k4869j52873I236a12259B91036a58236B9847j3722J5210
12681C1335a77869c6689F4583k5711K89123e8399a6606A26613h6600B75796A8967
12669e2634C42352c23287B928M55905I6564K16998A27144Q3587n3984c0562A42601
12657a67639p4024i1474A87480A6679J5753g3924p8090c8387B34403A13890N2195
$$ plain form
12735 -81281 -112322 18743 -59692 248340 99106 127490 91610 -54826 142869 -116959 -273808
12724 -273808 -25628 -333744 176808 12141 203729 -78143 -40301 268753 -75633 -228581
12714 -228581 -40584 -58526 1199 346147 393990 193615 64667 -106737 72351 235949 -29955
12702 -262726 -108680 179414 72609 -18217 102367 -31197 218649 -156119 153666 84219
12692 84219 117365 -31612 -56481 -209354 9236 -112259 291036 -158236 29847 16125 31335
12681 31335 -177869 -36689 64583 38872 327995 -58399 -16606 126613 -86600 275796 18967
12669 -52634 342352 -323287 2928 458833 96564 313562 127144 210731 156747 -30562 142601
12657 -167639 -241663 -91474 187480 16679 32432 -73924 -152014 -38387 234403 113890 166085
12646A66085a05538A76346a1118J995A02194P0016i5310A35373a72849A05916
12635B96284J6357H2901K7785a65542C08340h6511A31205K52638j42968o808n8874
12624A75193E5060i573D4466b54358e7994E03021c7088j87045A07499E2106J10114
12613A62220c54751I0651B3717e9028B23961A1144b85648A722K0393O8240J3538
12602A03893k8992K45367j01106b59629A71720b8578C76373a28552d2529e476
12591B43480F6800J83931a34565B27365j13493c0779p8823J7665B9203e7000q0642
12580a37642L4355D0677K7034A6701a41066F7680l3217J41953G042J7582J07370
12569A31994k1959c6027B31237b28095B81585b01560C1288J925J55900a43517
$$ plain form
12646 166085 -105538 176346 -11118 -9123 102194 172210 -95310 135373 -172849 105916
12635 296284 312641 82901 110686 -165542 308340 -86511 131205 383843 240875 234067 175193
12624 175193 55060 -9573 44466 -254358 -57994 503021 -37088 -224133 107499 52106 162220
12613 162220 -354751 90651 23717 -59028 223961 11144 -285648 1722 22115 90355 103893
12602 103893 74901 320268 219162 -259629 171720 -28578 376373 -128552 -42529 -5476
12591 243480 66800 250731 -134565 227365 113872 -30779 -109602 -91937 29203 -57000 -137642
12580 -137642 -103287 40677 67711 16701 -141066 67680 34463 176416 7042 24624 131994
12569 131994 110035 -36027 231237 -228095 281585 -201560 31288 33213 189113 -143517
12558a73381H4702l9740a81326P026F5241k5317J7279b7055A81156E1311N2908
12547A04219b1956k23162G5354a87002B61633c9642F1821d0495j50297E6136Q5373
12536A41509C6744A0008b4113j99020o743D9210a05947D3128a94867p5679P4985
12525a95561j44113D39262a07010l1557B12127a36552e652E1495b72847F8787
12514a05087A60753a18321E9698j7933Q6242j3094K39015A4729b31633I1790O2906
12503A54696h3848B18959i4534j76518A12043h3420J2589C56562i4001j37744
12493b31745A5419E8a93615d1848B86010D8968a54477R817B40123h9825j52755
12482b42580F7240c29520a43271o3960B5198a1922A95561m2904d2631C00630i262
$$ plain form
12558 -173381 84702 44962 -181326 -174300 65241 39924 57203 -27055 181156 51311 104219
12547 104219 -21956 -245118 75354 -187002 261633 -39642 61821 -40495 -190792 56136 141509
12536 141509 36744 10008 -24113 -223133 -229876 49210 -105947 43128 -194867 -270546 -195561
12525 -195561 -339674 439262 -107010 -138567 212127 -136552 -5652 51495 -272847 68787
12514 -105087 160753 -118321 59698 41765 128007 114913 353928 14729 -231633 91790 154696
12503 154696 -83848 218959 -94534 -271052 112043 -83420 -70831 356562 -94001 -231745
12493 -231745 15419 58 -193615 -41848 286010 48968 -154477 -144660 240123 -89825 -242580
12482 -242580 67240 -329520 -143271 -207231 25198 -11922 195561 152657 -42631 300630 -9262
12470a46608j04693B54878b11187H7304J50682J05339k3245a01766M9045k90248
12460c42969H8207j8511b0339A83713G057g0626C63801C6079i1436j08182j35043
12449c34661A63787N878G698d7591C076O7331b09502B9647J0815J59648H7205
12437A36565c0500k813C3217e8841A01879a07580e0009A32312J58797b3429H088
12425a5742D8775b47329A6441R3928f1715m3987A43950M1677j0374b31474C65127
12413h0321k69319J35638A20696g6725A97237b5920q6743k2099o2725e6708B65224
12401b19948H0058b22805B36551C1138d33536B25131i3506I161b802E1777J84559
12390B36336A0613b36941g9857M258a5723j06389A01970a38570F5951L9243Q2276
$$ plain form
12470 -146608 -251301 254878 -211187 87304 237986 343325 320080 -101766 -52721 -342969
12460 -342969 88207 69696 -20339 183713 7057 -70626 363801 36079 -91436 -199618 -334661
12449 -334661 163787 169665 7698 -47591 3076 70407 -209502 29647 40462 200110 87205
12437 136565 -30500 -33313 33217 -58841 101879 -107580 -50009 132312 291109 -23429 8088
12425 -15742 48775 -247329 16441 110369 -61715 -105702 143950 185627 175253 -231474 365127
12413 -80321 -349640 -214002 120696 -76725 197237 -25920 -112663 -134762 -197487 -56708 265224
12401 -219948 80058 -222805 236551 31138 -433536 225131 -93506 9161 -2802 51777 236336
12390 236336 10613 -236941 -79857 -75599 -15723 -122112 101970 -138570 65951 105194 187470
12379A87470c2454J2866l4582H8541c0483D0983a97787A7839a32929B16469N0171
12368B66640b4741B73161h421m2514B17085a76802j8948B06300l345r5594J81561
12357B88922d5767A14158b77430E0126a1788B15968i5913E6530A8602K4073d8088
12345H8367K21766a5511B19884B4624Q0011C9485K19600j10826E4295K58759A0907
12333b9434B36018J38167H5743L70864A90618c4016C74120C2410f1728E7847E483
12321A00198c9426C48837m8841K25141h24o7740C14233B2026g4168B03806H0300
12309E2218L76171b76421D1307b31760A66968n8089O5619k7111a67118B37319
12298D4937a15684j384j600b1077k16804A65686g4812r1674A98480e858j1784
$$ plain form
12379 187470 -32454 -19588 -54170 88541 -30483 40983 -197787 17839 -132929 216469 266640
12368 266640 -24741 273161 -8421 -50935 217085 -176802 -195750 206300 202955 107361 288922
12357 288922 -45767 114158 -277430 50126 -11788 215968 -95913 56530 18602 42675 -48088
12345 88367 310133 -15511 219884 24624 104635 39485 259085 148259 54295 313054 10907
12333 -29434 236018 374185 85743 456607 190618 -34016 374120 32410 -61728 57847 5483
12321 100198 -39426 348837 299996 525137 -824 -68564 314233 22026 -74168 203806 80300
12309 52218 428389 -276421 41307 -231760 166968 108879 174498 147387 -167118 237319
12298 44937 -115684 -117068 -118668 -21077 -237881 165686 -74812 -166486 198480 -5858 -17642
12287a7642B68322D6496j0819d846C01634Q4389K8304a65247B90773n2446a00174
12275B35264a24170B10278a67409A49589R5391q223A242J76427N4884m9174J43630
12264C27009H3487K80165j76093H3207J47400K55295A44297b9946B8504M03215
12254D31719j38162a02106A06314a26948B85877o5298q0811O2002l146E0679N7070
12243A07749J40494a22233D6820J59719b321A98604l5156h2200A17720b28190
12232B79009E4488c2948r2882c8782A0091J50943J82330d0405D04807g8775B0371
12220C04838r6678j1938M630L79397B36655r3966J05008b0262D01621j68114O5428
12209B98935R036o2408J71495G5918K24155A22099C2759D225J92598K10112j48612
$$ plain form
12287 -17642 268322 46496 35677 -4846 301634 386023 414327 -165247 290773 238327 -100174
12275 235264 -124170 210278 -167409 149589 244980 236757 1242 177669 232553 183379 327009
12264 327009 83487 363652 187559 83207 230607 485902 144297 -29946 28504 431719
12254 431719 293557 -102106 106314 -126948 285877 220579 139768 201770 198624 50679 107749
12243 107749 248243 -122233 46820 206539 -2321 198604 163448 -82200 117720 -228190
12232 279009 54488 -32948 -125830 -38782 10091 161034 343364 -40405 404807 -78775 20371
12220 304838 208160 196222 200852 580249 236655 142689 247697 -20262 401621 233507 298935
12209 298935 307971 245563 417058 75918 300073 122099 32759 4225 196823 406935 258323
12198B58323N066j21301J30512j24560a26423B62631O8669A61594R4349J12097
12188C68040c8739C54552o6841c3741A66404N88f6389B8475L29345J8825a7109
12176C15730l0784a36275C02176o7027j11134J10837j09952l4804M54707A92775
12165D393K62675K2831o1189K22002O2161A45946K52427G3627J78940a1932k65408
12154b77340D15902j55916a05516A97538C2746e468A78703C8698K21022r1194
12144A68526K31053A02821m7868M52130b58937A01853b78941D25526A28692B6827
12133B33276F7137J69110g2291l2991d2717c142A61917h5624B63693j01449l2177
12122A30067k03b7530A49271q752M2838b90836A61802a5443r0103A89999J9534
$$ plain form
12198 258323 263389 142088 272600 148040 -126423 262631 331300 161594 255943 368040
12188 368040 -38739 354552 287711 -33741 166404 166992 -66389 28475 357820 376645 -17109
12176 315730 284946 -136275 302176 235149 124015 234852 124900 90096 544803 192775
12165 4393 267068 289899 228710 450712 512873 145946 398373 73627 252567 -11932 -277340
12154 -277340 415902 259986 -105516 197538 32746 -5468 178703 38698 259720 168526
12144 168526 399579 102821 54953 507083 -258937 101853 -278941 425526 128692 26827
12133 233276 67137 236247 -72291 -105282 -42717 -3142 161917 -85624 263693 162244 130067
12122 130067 129864 -27530 149271 140519 183357 -290836 161802 -15443 -105546 189999 209533
12111B09533L76305A35844a63315B27881K05783j83164A3970L15739b01813B06092
12100a48249j06097B14558a89787B94119J47098C4824J90423J41989f6344j12117
12090a78461P4873B22050J09546m1628j19540b96G530N09237B05887a7888j16807
12079a34695B74578q2914n8342a10447I7130J29227k3807O4194F6784a49949M5038
12068a04911k4814A65703I94b31191D3015M01101A93912b882A94544d71526B50742
12056b38768A75982b93673F3406h7639B19329a94606A14890D8205a00397n4392
12046a54789B61137A20952L1969L61321a31186A26061m7863a08364A13378b46167
12035H8142B6666b8630j96895D1283a94674P2039B04255a97715B70846a98668
$$ plain form
12111 209533 585838 135844 -163315 227881 433664 250500 13970 329709 -201813 206092
12100 -148249 -254346 214558 -189787 294119 441217 34824 225247 367236 -66344 -178461
12090 -178461 -103588 222050 331596 289968 170428 -296 7530 516767 205887 -17888 -134695
12079 -134695 274578 191664 133322 -110447 97130 226357 202550 266744 66784 -149949 -104911
12068 -104911 -129725 165703 994 -231191 43015 444116 193912 -2882 194544 -471526 250742
12056 -238768 175982 -293673 63406 -87639 219329 -194606 114890 48205 -100397 -154789
12046 -154789 261137 120952 152921 514242 -131186 126061 78198 -108364 113378 -246167
12035 88142 26666 -28630 -225525 41283 -194674 -122635 204255 -197715 270846 -198668
12024A3027R0944D5217R4027e7297o415q6069d8463n6008A06866j2584K32140
12013C26422q9768a86206J5608f881F9975A5450L26195j50246O3702b09000C338
12001f0768O972A80119p4247c34216A42618e7664E8914A3457c85636a53218K2051
11990a31167B67157a08894C4490A316c20582f3672A17354a98630D3206K1941P371
11979G2518K9502R0642h2447b5344D8794J90228a79330m0023A69477B599f7981
11967A03979e0961k66025D5403A6738L4740M0369C983a34058B06936C1413J02643
11956A34056b38085A01943L40283H3510a63612o9760G0294c67791j2595a19996
11945a23446A30276a54788j17870L1225h6361G4394R7825A8692L09049a68288
$$ plain form
12024 13027 103971 45217 139244 -57297 -63712 -149781 -48463 -104471 106866 94282 326422
12013 326422 236654 -186206 -170598 -6881 69975 15450 341645 191399 255101 -209000 3338
12001 -60768 -53796 180119 105872 -334216 142618 -57664 58914 13457 -385636 -153218 -131167
11990 -131167 267157 -108894 34490 1316 -320582 -63672 117354 -198630 43206 65147 72518
11979 72518 102020 192662 -82447 -25344 48794 239022 -179330 -219353 169477 2599 -67981
11967 103979 -50961 -316986 45403 16738 51478 91847 3983 -134058 206936 31413 134056
11956 134056 -238085 101943 442226 83510 -163612 -233372 70294 -367791 -380386 -119996
11945 -123446 130276 -154788 -272658 -241433 -86361 74394 172219 18692 327741 -168288
11934b01326A52593a29689C1403a01031C876M3614g1416B36980Q5878F7003B4243
11922a1884o1110B14928a57787H1381d3530G5039b2834k13083j06409h6433l42451
11911d28884h8059D10330a03497H7587N977D4789c32992K6796a4561k04271G9000
11899A42339d813C57600a11081k47068I1762b33503B61116a32144C72414e0721
11888d43490b8472B121b45229A14177d7502B05414h6885B01295a82691g9509A76941
11876A37103M5692E7803a47002r0893A54616B8220K39681C824e4080B1580c21423
11864a15020F3360h5070a9616j29114e6455j06525F0227a39875l99128a80568
11853b23122H2560Q5063b51709A48440h6157j32170C0553A3907e6698B33710c40312
$$ plain form
11934 -201326 152593 -129689 31403 -101031 3876 47490 -71416 236980 322858 67003 24243
11922 -11884 -72994 214928 -157787 81381 -43530 75039 -22834 -235917 -342326 -86433 -428884
11911 -428884 -88059 410330 -103497 87587 93564 44789 -332992 -306196 -14561 -218832 79000
11899 142339 -4813 357600 -111081 -358149 91762 -233503 261116 -132144 372414 -50721
11888 -443490 -28472 2121 -245229 114177 -47502 205414 -86885 201295 -182691 -79509 176941
11876 137103 182795 57803 -147002 -237895 154616 28220 267901 3824 -54080 21580 -321423
11864 -115020 63360 -85070 -19616 -148730 -56455 -162980 60227 -139875 -539003 -180568
11853 -223122 82560 167623 -251709 148440 -86157 -218327 30553 13907 -56698 233710 -340312
11841e0898j44974M5594G6365a34404K3203e2658A7241f3666j92667J25496C20870
11829A79270b16276A66107K7037a48689A91968q0874b70111g8263j07250J0518
11819a74995q6392C9233J05692a05746b073k9626A74356a67121d777l25235H9255
11807h4766B3548a43573d2795D4425J9625a36395A99885R8155b58969j21997I2020
11795a3208j57459k37864F8793a43886O5349j8227h776m80400e6329j03389P7931
11784h1787m0401b7329j58757G323a02022a4535j25819M7075A42892J14547h6932
11772A46615D7487a61619Q0805A38106Q3563b37651D5195a90385A7687b11298
11761d18944E4594a88148F1954Q7159b77867A8552l165a18778r6650D7504c28867
$$ plain form
11841 -50898 -195872 -150278 76365 -134404 -111201 -52658 17241 -63666 -256333 -130837 320870
11829 179270 -216276 166107 193144 -148689 191968 111094 -270111 -78263 -185513 -174995
11819 -174995 -261387 39233 144925 -105746 -2073 -31699 174356 -167121 -4777 -330012 89255
11807 -84766 23548 -143573 -42795 44425 64050 -136395 199885 298040 -258969 -380966 92020
11795 -13208 -170667 -408531 68793 -143886 -78537 -96764 -8776 -489176 -56329 -159718 -81787
11784 -81787 -122188 -27329 -186086 7323 -102022 -14535 -140354 -93279 142892 257439 -86932
11772 146615 47487 -161619 -80814 138106 221669 -237651 45195 -190385 17687 -211298
11761 -418944 54594 -188148 61954 149113 -277867 18552 15387 -118778 -215428 47504 -328867
11749C9505h2702j24432f0047I7775C9229K0911d2674A71644L13727C5471b53932
11737H1921K658K80530j34845C0703Q4869b0607H1126a96799B51131H9116a13313
11725b5000q1156C2266d00057C9812J97594b04521f7978B6846g3238K2486f949
11713A63949A5673N5673M0610b31877A30853J8836j0823a58423A43491F9931K12274
11702B82205q5529f5013p4937C84324b75873J02211a5669j760B66816K9763a54168
11690i6388A43554B8024J30961o0379M09518A85171a3322j49299C48547A27483
11679B32451p3455N411G1586g6039A00293f3131j65199K5967J9462Q0647A59597
11667a03721m335l51209a20598j0077A70908c9380k30477C76638b06660f2413
$$ plain form
11749 39505 -82702 -207134 -60047 97775 39229 60140 -42674 171644 485371 35471 -253932
11737 81921 84579 365109 230264 30703 115572 -20607 81126 -196799 251131 89116 -113313
11725 -25000 -106156 32266 -400057 39812 237406 -204521 -67978 26846 -73238 -50752 -6949
11713 163949 15673 71346 111956 -231877 130853 149689 138866 -158423 143491 69931 282205
11702 282205 196676 -65013 -139950 384324 -275873 -173662 -15669 -17429 266816 296579 -154168
11690 -96388 143554 28024 158985 98606 508124 185171 -13322 -162621 348547 127483
11679 232451 158996 164407 71586 -76039 100293 -63131 -228330 -202363 -182901 -102254 159597
11667 -103721 -108056 -459265 -120598 -130675 170908 -39380 -269857 376638 -206660 -62413
11656e3305A33863l8582D2160A8757i1823A69096a22176A49853a24335b2001k42285
11645b64286f4192c0362n5326E14614b72206A50513a57625A40005a3814A46498
11634A07780B2149L83576a12788e2671p4275A05922j6568a00535L2343m7473A36341
11622b66643C00530j48049p1913c8950m317G0840i900G0372d8097D3713J141b429
11609I382Q2758f6731m457A12064J10216j00492A093J10940b4538B0575c42286
11597a40641A40529J26587E9885j5147P5742P5249K287A8579J01460M2333a88886
11585B2664J97666q0646J67171f5719A52388h6485A02236D4562R7144Q6967D727
11573H0144a56429a0420o2302A13920a85974A37740i1932C22376a71216B2684
$$ plain form
11656 -53305 133863 95281 42160 18757 -91823 169096 -122176 149853 -124335 -22001 -264286
11645 -264286 -64192 -30362 -85688 514614 -272206 150513 -157625 140005 -13814 146498
11634 107780 22149 405725 -112788 -52671 -126946 105922 89354 -100535 -68192 -115665 136341
11622 -266643 300530 152481 80568 -38950 -43267 70840 -9900 70372 -48097 43713 44854 -2429
11609 9382 92140 -66731 -71188 112064 222280 121788 1093 112033 -24538 20575 -342286
11597 -140641 140529 267116 59885 44738 120480 195729 198016 18579 120039 162372 -188886
11585 22664 220330 139684 306855 -65719 152388 -86485 102236 44562 141706 228673 4727
11573 80144 -156429 -10420 -72722 113920 -185974 137740 -91932 322376 -171216 22684
11562A69828b8605B33408I2487a70926C25924f8194p2844J6599A96142a27364
11551A41365a04043j7246c3852C8978Q4296c449k1435k7512k3285B16003I2721
11539a92739g0577k28068B48161a98174A67303B8859O2948d6456j15059N7A3368
11527D0236b64997g386B46011p1503g5670I2213N256E875R3697A646K4659b78478
11514B89057A22019a31842k0187A80110a06451A31034K80397A73200n7645E0702
11503I3367K84329r5203O3370f7749A17901P0809o8459c2477C80731o9415G4378
11491A32939a27248A39705K15c8215G0549J60146I2893l296K41382c5463B52373
11479I7452O8112O0809C2570J06023k940K10908A23455L1644A1848K23993O2949
$$ plain form
11562 169828 -28605 233408 92487 -170926 325924 -68194 -141038 -124439 196142 -127364
11551 141365 -104043 -121289 -33852 38978 123274 -3449 -24884 -52396 -75681 216003 92721
11539 -192739 -70577 -298645 248161 -198174 167303 28859 91807 -46456 -161515 -161458 13368
11527 40236 -264997 -7386 246011 174508 -75670 92213 97469 5875 99572 1646 26305 -278478
11514 289057 122019 -131842 -152029 180110 -106451 131034 411431 173200 115555 50702
11503 93367 377696 282493 345863 -67749 117901 188710 120251 -32477 380731 311316 74378
11491 132939 -127248 139705 139920 -38215 70549 230695 92893 89597 330979 -35463 252373
11479 97452 165564 226373 32570 138593 135653 346561 123455 155099 11848 235841 298790
11468B98790N7844o2677b06059A42560a5454l3466D6606K0395N0570L41912h6916
11456a18108B61299a3826B42318H4756f41k35976J15848G5427d2396G5524c39627
11444a559F2237K02387A1852d0027A4310f1028A01662K4419J12542o5024J22972
11433B96571b70568a16270I8055h320D7191f6141A08563D3649J51462J6712c5078
11421E3167i2796b5714A42857e3081k79903D8171h9027A03291b40347n8511A80929
11409D7823c0051l5305k32294i6352B68516C4070j1014b37758l26193B87101j16313
11398A70788K66840g7091o4603A48112a13349G3210J04048J628P1617B5995L68305
11387C94300d20511K01769C2737I488b09905K9252g4986a0619a40A19857P3038
$$ plain form
11468 298790 356634 293957 -206059 142560 -15454 -48920 46606 67001 117571 459483 -86916
11456 -118108 261299 -13826 242318 84756 -641 -236617 -120769 75427 -42396 75524 -339627
11444 -1559 62237 264624 11852 -40027 14310 -61028 101662 126081 238623 173599 296571
11433 296571 -270568 -116270 98055 -8320 47191 -66141 108563 43649 195111 211823 -35078
11421 53167 -92796 -25714 142857 -53081 -332984 48171 -89027 103291 -240347 -298858 180929
11409 47823 -30051 -65356 -297650 -96352 268516 34070 23056 -237758 -563951 287101 170788
11398 170788 437628 -77091 -141694 148112 -113349 73210 177258 178886 250503 25995 394300
11387 394300 -420511 -218742 32737 9488 -209905 -180653 -74986 -10619 -140 119857 192895
11376A92895d2760A84854D2397J46604l7366J87573j53303A731h9356A69904a57363
11364a39343O8332j78025F6802c3k10583L3624g9398n1622H646M9568b05183a0554
11351A46196h3213L7880A08262K12852b16696G680b23292A5765P8284a69169N2208
11340a16961j69372C09702d68E9571N9933n6842d17406g5494j11057d5805B34744
11328a15690G5410b44948c2578l10992I4679b73536L5397A84453b21275M4271
11318a77004H538M5948N0283J14866g1429m5180K316E0188N1911c29586L20J13462
11306b15804a812k1165n4929A96577A1148d14479A42500O3974a86236G3802a65676
11294A1287N0734N9822b38443a8079j11108A04127a093j67502F615K7651J12028
$$ plain form
11376 192895 -42760 184854 42397 189001 151635 339208 185905 1731 -89356 169904 -157363
11364 -139343 -71011 -249036 66802 -33 -210616 -176992 -79398 -131020 8646 58214 -205183 -10554
11351 146196 -83213 -45333 108262 321114 -216696 7680 -223292 15765 94049 -169169 -116961
11340 -116961 -286333 309702 -468 59571 119504 62662 -417406 -75494 -186551 -45805 234744
11328 -115690 75410 -244948 -32578 -343570 94679 -273536 -238139 184453 -221275 -177004
11318 -177004 8538 54486 104769 219635 -71429 -116609 -114293 50188 102099 -329586 -329266 -215804
11306 -215804 -1812 -22977 -77906 196577 11148 -414479 142500 206474 -186236 73802 -165676
11294 11287 62021 121843 -238443 -18079 -129187 104127 -1093 -168595 6615 34266 146294
11283A46294a90142P6680A28702A0984c7709k12042A06408e1458D2439b8534r6173
11272a24707A85762G8303c0153A36213J28139a919B15706h3608k14316d8241H1118
11260a18806o9621o5932f5392C0179b58664d85l78965e166j92707E9352L4128
11249I3480L4599l8291D2101O0113l7487c34702q4224a38376F6044b87622i1127
11237C97447c67589R8058A00920d17858B30710a27401A4116b14649L3372B24297
11226H4034j3676O7672d28208B16607a23232A0936L11620A52740c9587j27235
11216a66822I5327k0942b40347e2136j40231A05192a2754l62058A2272b8793G2855
11204e1917A03031D9268h4709J1000B97213a64136L0414k28007B5063b87905o2094
$$ plain form
11283 146294 -190142 -113462 128702 10984 -37709 -249751 106408 -51458 42439 -28534 -124707
11272 -124707 185762 78303 -30153 136213 264352 -1919 215706 -83608 -297924 -48241 81118
11260 -118806 -188427 -254359 -65392 30179 -258664 -485 -379450 -5166 -197873 59352 93480
11249 93480 128079 89788 42101 102214 64727 -334702 -418926 -138376 66044 -287622 -91127
11237 397447 -367589 -269531 100920 -417858 230710 -127401 14116 -214649 -181277 224297
11226 84034 70358 138030 -428208 216607 -123232 10936 322556 152740 -39587 -166822
11216 -166822 95327 74385 -240347 -52136 -192367 105192 -12754 -374812 12272 -28793 72855
11204 -51917 103031 49268 -84709 -73709 297213 -164136 -133722 -361729 25063 -287905 -349999
11193c49999A10725c25029A56115h6579A09952g1207q7891M0275k49637a01778
11182a10261l46733G9518L0873E0176b11825K6760c1958A4479e2055H1574M3370
11171A24944d3042D7183b1028F2154e2157A15044a47764d4130I348b98262a29771
11159I6182c15857A65197g1758k79967A2060h4199C85719r0626f561B85225e1268
11147C67253A02842a92163Q2626l1194k69309J90493A73481a01411F2249a58745
11136A02384m8479j8841a67687B96320k0815a03651G1029Q7799c46453F1752e7615
11124f2667B58002a48110N1340D7911a7118L129B1409J23369p0136a59905b2986
11112a25474n0977E7353a30024A72232J52831b39758I4415K3642b32084F3827
$$ plain form
11193 -349999 110725 -325029 156115 -86579 109952 -71207 -159098 -118823 -368460 -101778
11182 -110261 -456994 79518 110391 50176 -211825 -185065 -31958 14479 -52055 81574 124944
11171 124944 -43042 47183 -21028 62154 -52157 115044 -147764 -44130 9348 -298262 -129771
11159 96182 -315857 165197 -71758 -351725 12060 -84199 385719 295093 -6561 285225 -51268
11147 367253 102842 -192163 -109537 -140731 -410040 -219547 173481 -101411 62249 -158745
11136 102384 53905 35064 -167687 296320 275505 -103651 71029 158828 -346453 61752 -57615
11124 -62667 258002 -148110 -96770 47911 -17118 -13989 21409 144778 74642 -159905 -22986
11112 -125474 -176451 57353 -130024 172232 325063 -239758 94415 118057 -232084 63827
11101C31339J17113A34095A3693J45448k2280K42409o47j65656m6351B3006K37178
11090B60184m6281J31832A46187m4918C4307J22471L17587I5627J00806K22739
11080D19172j43248h1111E99414A98864p9764k2855M18183L8261k42700P4438
11070C84427e8115k44798C91310j57778L81401q5699J1711k25506J06621J2242
11060D34302B10613L84552B93682R6530J59615M3756j5059O9887j54682J84052
11050F77781K937k48827M13234k12609n5116N25919m41222L61224l09329K51322
11040I65314J19876m69332L11586D40027L98259k27808K98974j19634k06052K99158
11030H82924M646j49048j64416J96934j5132r547n2116o3190j5381k23116M90844
$$ plain form
11101 331339 448452 134095 13693 159141 136861 379270 378623 212967 166616 23006 260184
11090 260184 213903 345735 146187 101269 34307 156778 474365 95627 196433 419172
11080 419172 275924 -81111 599414 198864 119100 96245 514428 552689 309989 384427
11070 384427 -58115 -302913 391310 233532 614933 529234 540945 315439 422060 434302
11060 434302 210613 595165 293682 390212 549827 593583 578524 648411 493729 677781
11050 677781 680718 431891 845125 632516 577400 1103319 662097 1023321 713992 965314
11040 965314 1085190 615858 927444 440027 838286 610478 909452 789818 583766 882924
11030 882924 887570 738522 574106 771040 755908 746361 694245 631055 615674 392558 883402
11019H83402l36672J09485k87341J76845K36052C69678K8869K24689j9220K7520
11009F31536j05608j89803J88966Q4315J50634j36821K90156J77025j81805k23696
10999F84899k10901J76557l0748l5250l1973n35J25918J17012j55304p6996K61276
10988H23955l334j43881P2680L1318j57557J47103J00290M1163K04717k0586j76189
10977I19679L67803m46424N22886m0851K27647J18423J07467J96409j37966Q03498
10967B638571k48596m5382L17469o4070J82838k98404l65064l90822j54502J48532
10957A720570N8287J4455j30729M0475j52448J94391R1299N4386j35589n16928
10947A238169P0589l15867k4107k14300k70322N4948j66427L15930C37196P0696
$$ plain form
11019 883402 546730 656215 368874 545719 781771 369678 398547 623236 604016 631536
11009 631536 525928 336125 525091 609406 760040 623219 913375 1090400 908595 684899
10999 684899 473998 650555 619807 584557 552584 552049 677967 794979 639675 562679 823955
10988 823955 820621 676740 749420 780738 623181 770284 870574 911737 1116454 1095868 919679
10977 919679 1287482 841058 1363944 1323093 1550740 1669163 1776630 1973039 1835073 2638571
10967 2638571 2389975 2344593 2662062 2597992 2780830 2482426 2117362 1726540 1572038 1720570
10957 1720570 1778857 1793312 1662583 1703058 1550610 1745001 1836300 1890686 1755097 1238169
10947 1238169 1308758 992891 968784 754484 484162 539110 372683 688613 337196 407892
10937D07892A89804J6729J5212q9296E2118J37250N7048A09490M7813K35792B1189
10925B26373f7631I7627J37546b2155j82329P1122E2909J84299c25961a21289
10914c84677A0874c5976A77587c2464k10395B11835B8567c2405B18580A05010
10903H1170c25678L0794Q5631B02883a63436H5074i8590d8468j01651g0341A8944
10891f3275b2333A28288a7978j70268G4003d8517j13583n7602L4649h3933B28020
10879b65286d5071a5007E3779J14342E8862R2094O6386i6456B66256I5217d7122
10867b40097r6373B42413b5777B01532F8126k9473b50692b7012C6167h0424k02716
10856b83140J12829I7006O7022J02992b51631C41058A30621b74479i6864A43004
$$ plain form
10937 407892 189804 206533 221745 132449 52118 189368 246416 109490 157303 393095 21189
10925 226373 -67631 97627 235173 -22155 -204484 -133362 52909 237208 -325961 -121289
10914 -384677 10874 -35976 177587 -32464 -242859 211835 28567 -32405 218580 105010
10903 81170 -325678 -294884 -209253 202883 -163436 85074 -98590 -48468 -150119 -70341 18944
10891 -63275 -22333 128288 -17978 -188246 74003 -48517 -162100 -219702 -185053 -83933 228020
10879 -265286 -45071 -15007 53779 168121 58862 150956 217342 -96456 266256 95217 -47122
10867 -240097 -336470 242413 -25777 201532 68126 38653 -250692 -27012 36167 -80424 -283140
10856 -283140 -170311 97006 164028 267020 -251631 341058 130621 -274479 -96864 143004
10845a33467m2617d1020A16308a41620M8986o2279B56942a03858A06379b83206
10834d3873I7112a03708A10768b77839J35190F7799a29447o8337o3988A66492
10823b57497D4331a88367i1205B223J61490a62399B0639J41980E08a43313A32828
10811b04058d7929k45176a22571A51620E0790c107m4670q8118J6476j75556r6824
10800c91799a59998e1271r8352i041B89652d21A85439a38285q5653j73409f0454
10788b02127M4191j72058a0820k10124M1830B2693a76275g8385k7410j4257A71133
10776A34267g014k22906G4749o45g2463A48238f3680k22602a33564c8380A60883
10764a2456B1967K14000G1589r693b96224O6754c5411k61553b9221A62622a70997
$$ plain form
10845 -133467 -176084 -41020 116308 -141620 -92634 -154913 256942 -103858 106379 -283206
10834 -43873 97112 -103708 110768 -277839 -142649 67799 -129447 -197784 -261772 166492
10823 -257497 44331 -188367 -91205 2223 163713 -162399 20639 162619 508 -143313 132828
10811 -204058 -47929 -293105 -122571 151620 50790 -3107 -47777 -135895 -119419 -294975 -391799
10800 -391799 -159998 -51271 -149623 -9041 289652 -421 185439 -138285 -223938 -397347 -60454
10788 -202127 -157936 -329994 -10820 -220944 -179114 22693 -176275 -78385 -105795 -120052 171133
10776 134267 -7014 -229920 74749 74104 -72463 148238 -63680 -286282 -133564 -38380 160883
10764 -12456 21967 235967 71589 61896 -296224 -229470 -35411 -296964 -29221 162622 -170997
10752b52073Q3577e3311j70965B2263J66244a8962j7388m777j31364A4626a43845
10740C6541b8699D9059A4610e3596A23524a80150N1298l44668a47286A0417a34960
10728c09366E37296a65921B38800D3520M1264B751a55216j15871o6158d6569K0567
10717b6002A04043g649j24494M5557k3054n046E0591a56915j64422A18431m7874
10706G0557J07234g463o3698A59140h8712j56214J14591b7059k0966K0161j40888
10695a68752I5743c82108h1393j19210A21779J16191e6758O988j11457m70154
10685f31381A01916g634k99742f6920m2570j05250L0758A88423h0984B75565A02879
10673b06732R593h2328b0623F7758b08702C62266c5827k850c763l99066M4421
$$ plain form
10752 -252073 -168496 -53311 -224276 22263 188507 -18962 -36350 -41127 -172491 14626 -143845
10740 36541 -28699 49059 14610 -53596 123524 -180150 -128852 -473520 -147286 10417 -134960
10728 -309366 537296 -165921 238800 43520 84784 2751 -155216 -271087 -337245 -46569 -26002
10717 -26002 104043 -7649 -132143 -86586 -109640 -114686 50591 -156915 -321337 118431 70557
10706 70557 177791 -7463 -71161 159140 -88712 -244926 -130335 -27059 -48025 -27864 -168752
10695 -168752 95743 -382108 -81393 -200603 121779 237970 -56758 -49770 -161227 -631381
10685 -631381 101916 -7634 -307376 -66920 -109490 -214740 -183982 188423 -80984 275565 102879
10673 -206732 -197139 -82328 -20623 67758 -208702 362266 -35827 -38677 -3763 -402829 -358408
10662c58408O5728D4973h838j9738k9762j08168P6596q3234B50233F0058a16063
10650a10636B39373a19410A55474B7848b82095D3838a79583M1311C0474a78318
10639d67297A65389b3862B17862r2265a07549A61152J86866F4832a70843E471
10628b48032A90506D2505b5753j49986k08523B5379G984g4635H9428i8692B3271
10616E5865g6995C3932a46742B15573a70334l541b2677k33313g0380j26571h3810
10604c3437B05277a03235k4326a9750B32401c2779f884j24415A78727a97564q2361
10593b79925K2174k60643A22375C392i5139C30546j07473a21040q9074i3066B99235
10581c5734B87337I7330j6867c16582b212A19472h5572l31052C3479a32807o9163
$$ plain form
10662 -358408 -292680 44973 -8838 -28576 -58338 -166506 -89910 -173144 250233 60058 -116063
10650 -110636 239373 -119410 155474 27848 -282095 43838 -179583 -138272 30474 -178318
10639 -467297 165389 -23862 217862 125597 -107549 161152 348018 64832 -170843 5471
10628 -248032 190506 42505 -25753 -175739 -384262 25379 7984 -74635 89428 -98692 23271
10616 55865 -76995 33932 -146742 215573 -170334 -173875 -22677 -255990 -70380 -196951 -83810
10604 -33437 205277 -103235 -127561 -19750 232401 -32779 -6884 -131299 178727 -197564 -279925
10593 -279925 -257751 -518394 122375 3392 -95139 330546 223073 -121040 -210114 -93066 299235
10581 -35734 287337 97330 80463 -316582 -2212 119472 -85572 -416624 33479 -132807 -201970
10570b01970B90582b22798A07432a11578J8524B8485K17801E909L21697b26067
10559A72333n3157a57611D4209d62254a63433B976a56079I9876c5832A96370e1072
10547b30080a03150A00396h5820k3763j38437A00094f2435A81175g5938D4944
10536A46084a02367K4873p1448q0699q618J16030B91705a34077H415b07182q257
10525b15439j0264O9799e4252p7155I3769J06122a89466i20j01344k1948j24882
10514b49094R9470B79031e6624q5009E9345a08141j80692N4321a04309A85038
10503d07406A62155e1019k48685a00269c963G7594a89729N7510K8950B32115A07007
10491b00218A92767a65332d7996C8997b4079E4712a82239B09235j2562k8436b25757
$$ plain form
10570 -201970 290582 -222798 107432 -111578 -93054 28485 246286 5909 327606 -226067
10559 172333 119176 -157611 44209 -462254 -163433 2976 -156079 99876 -35832 196370 -51072
10547 -230080 -103150 100396 -85820 -109583 -248020 100094 -62435 181175 -75938 44944
10536 146084 -102367 -77494 -148942 -229641 -238259 -122229 291705 -134077 8415 -207182 -215439
10525 -215439 -225703 -155904 -54252 -131407 93769 199891 -189466 -920 -102264 -124212 -249094
10514 -249094 -149624 279031 -56624 -141633 59345 -108141 -288833 -234512 -104309 185038
10503 -407406 162155 -51019 -299704 -100269 -3963 77594 -189729 -132219 -103269 232115 107007
10491 -200218 192767 -165332 -47996 38997 -24079 54712 -182239 209235 196673 168237 -225757
10479a1481n9967J6055B60665L22855k14954j707P9939j31650J25088B5454J03127
10468A28581O9241O9258B6200P651L6364J99211a5093A59930d1518C3105c58381
10456H8049b28375J04893l2400j01710e4174a175r3627m0327j16803j045B83928
10444C0328g3172n0381n5834A17673a51132I3943B2354d7565A51226f1757r742
10433g1499C91298c30611A13818b04569h7778B81143G1706a91539r7389a864k7689
10422b9553m1793q2186f9440A17561E5066c45404A78784a73532D3375J0593R4065
10411A48033b25603m8715E5445a96889e3331j3585j66168P5499E1357A6160K04143
10400B20303c4396l332j73051B81048c05683E1433M8749e1633n2402A06496J50203
$$ plain form
10479 -11481 -71448 -55393 260665 583520 368566 366859 446798 315148 440236 25454 128581
10468 128581 197822 267080 26200 33851 70215 269426 -15093 159930 -41518 33105 -358381
10456 88049 -228375 -123482 -155882 -257592 -54174 -1175 -94802 -135129 -251932 -252977 283928
10444 30328 -73172 -123553 -179387 117673 -151132 93943 22354 -47565 151226 -61757 -71499
10433 -71499 391298 -330611 113818 -204569 -87778 281143 71706 -191539 -288928 -1864 -29553
10422 -29553 -71346 -153532 -69440 117561 55066 -345404 178784 -173532 43375 53968 148033
10411 148033 -225603 -274318 55445 -196889 -53331 -66916 -233084 -157585 51357 16160 220303
10400 220303 -34396 -37728 -210779 281048 -305683 51433 100182 -51633 -104035 106496 256699
10389B56699d5553E12450k5084c4435p2975j46016A55120j0636g6331F8874e9929
10377A44746J996C2029K11488K29087l1679J2137k20845Q6503p2306r9765J69251
10366C15900M0940j3003n929P3470A78501K076n0814L12503b11070C50012r4526
10355B55486A14034N080L60849B38605Q8910j13592K92181j60484K80408k7613
10345E98415j25092P0004k42731j01415J19414j4116j46818K0513J592H5145l9833
10334D5312K68468O114J14936B03430J14221A19689a46892a590j34049a7801B59482
10322H0227m856O6576F22M81633A66154a27724N4931B08356F4654a6025E7268
10310B00504J04696c86011A36859R1660a22341L793K9556L3087B02819g6545K2252
$$ plain form
10389 256699 -45553 512450 487366 -34435 -107410 -253426 155120 144484 -76331 68874 -59929
10377 144746 146742 32029 243517 472604 440925 453062 232217 318720 246414 146649 315900
10366 315900 356840 343837 337908 411378 178501 180577 129763 442266 -211070 350012 255486
10355 255486 114034 119114 479963 238605 327515 213923 506104 345620 626028 598415
10345 598415 473323 543327 300596 199181 318595 304479 157661 178174 179766 85145 45312
10334 45312 313780 319894 434830 203430 317651 119689 -146892 -1590 -135639 -17801 259482
10322 80227 75371 141947 622 482255 166154 -127724 -72793 208356 64654 -16025 57268
10310 200504 305200 -386011 136859 228519 -122341 -118548 -88992 -55905 202819 -76545 -54293
10299e4293j95336H299a09169B14913d0485o4535c7072a7593e572A70883a09700
10287a45016A62391b20753B77130a11598A13510C9124g518G9378J52093c01598
10276a50566l08671B70838n8886c34762a54636O7337m07755g1669n6988J4839
10266a13818G5794J0612k4359k2432b89430H3989J92906A32987n8638a3186l54668
10255c67854C87535e85B60403K67476j59828l5537A06348Q7526K484q4694J05683
10244B17347a47946r4235M4880B04375L843A3643b15788M1152A1139Q7315L7465
10233A35919b18966J05429q7368B6959a30775A04828K29707f1856k17283R6109
10223a83030j2310J8160j9257j21428a20194j07418c2130F5044a75512C2388a6268
$$ plain form
10299 -54293 -249629 8299 -109169 214913 -40485 -105020 -37072 -17593 -5572 170883 -109700
10287 -145016 162391 -220753 277130 -111598 113510 39124 -7518 79378 231471 -301598
10276 -150566 -459237 270838 211952 -334762 -154636 -87299 -495054 -71669 -128657 -113818
10266 -113818 75794 86406 62047 39615 -289430 83989 276895 132987 74349 -13186 -367854
10255 -367854 387535 -585 260403 527879 368051 332514 106348 193874 196358 111664 217347
10244 217347 -147946 -242181 -197301 204375 208218 13643 -215788 -174636 11139 98454 135919
10233 135919 -218966 -113537 -200905 26959 -130775 104828 334535 -61856 -279139 -183030
10223 -183030 -195340 -177180 -196437 -317865 -120194 -227612 -32130 65044 -175512 32388 -16268
10211B04496E4319j1604R8074g0342j0069A25145h4635E6379K25765b10256A93848
10199i0259k0292A01013d595j8348A86466f6414q6683K5145B6386a83608G3201
10187c09428a08590G8922g6699B40345j07870i8843j79677B8669c04131j86785
10177d90916H1849c23204J36313e9764E3065h6791A70154c960B05887b4865k0109
10166d4974q4674B29574a49285p0888I0615a20516K0646E844a7064A43195I546
10154c86542M6782i3953n854B38833a35156j47767a08028e2243A38767K0041h8071
10142F4483J4860b01101E1012P8121a02849H197K17386G197a15499n1258a5487
10130d085B24811E9926i3062b6511k28395F064a59932l56037a88310M6510A10450
$$ plain form
10211 204496 54319 42715 140789 -70342 -80411 125145 -84635 56379 282144 -210256 193848
10199 -90259 -110551 101013 -4595 -22943 186466 -66414 -153097 -127952 26386 -183608 73201
10187 -309428 -108590 78922 -76699 240345 132475 -98843 -278520 28669 -304131 -490916
10177 -490916 81849 -323204 -186891 -59764 53065 -86791 170154 -3960 205887 -24865 -44974
10166 -44974 -129648 229574 -149285 -220173 90615 -120516 -99870 5844 -17064 143195 9546
10154 -386542 -339760 -93953 -99807 238833 -135156 -282923 -108028 -52243 138767 158808 -88071
10142 64483 79343 -201101 51012 129133 -102849 8197 225583 7197 -115499 -166757 -15487
10130 -4085 224811 59926 -93062 -26511 -254906 6064 -159932 -515969 -188310 -141800 110450
10118A06158e02174G6157a38181A52354c43281A75419h3116r2899l1335j05274
10108c12624B29018a3164k88813A79753a08174K5440B16100A00883c79400m5245
10098d24645A60003f0493G6069k5288a57365j49679J50944A36492a13505q5630
10088a99135B28078j7037C3875R6667c1222A94933E4304a83206a6974k61878i1017
10076c12757A84980p3751e0631A81868a7567j54794f1606j9127p1080A17174d64289
10064c02751a06664r3032M7908f4714k3764r2785q6942f4853c2416A09477m1020
10053F8457j2993g9835j67077e2413C1573h3550n9044j1720P2449A38139f8A06614
10040d37745d830E1421c8561k69226a44704N2522b1333l2929J6395A36419a82474
$$ plain form
10118 106158 -502174 76157 -138181 152354 -343281 175419 -83116 -176015 -207350 -312624
10108 -312624 229018 -13164 -301977 179753 -108174 -82734 216100 100883 -379400 -424645
10098 -424645 160003 -60493 76069 50781 -157365 -307044 -156100 136492 -113505 -199135
10088 -199135 228078 211041 33875 130542 -31222 194933 54304 -183206 -16974 -278852 -91017
10076 -312757 184980 111229 -50631 181868 -17567 -172361 -61606 -80733 -151813 117174 -464289
10064 -302751 -106664 -199696 -151788 -64714 -88478 -181263 -268205 -64853 -32416 109477 68457
10053 68457 55464 -79835 -246912 -52413 31573 -83550 -142594 -154314 -81865 138139 -68 106614
10040 -437745 -4830 51421 -38561 -307787 -144704 -92182 -21333 -54262 -37867 136419 -182474
10028g2871b6185o2741o6528b0139A09057K8043b52032J23432A621c27638a59575
10016a07856j25866a05622A7145b20020E1543O281B679a44976o0424g3639k3207
10005i6846F8048L4629a38368F3942f8997A02608e0518j06606l9652R2098A07023
9993I2992h4689k4515A03830g8325a9238j63750o1665A03883i8464c5661o8890
9982a04551a3206k3318j46336B55815m6738E5769a01885A63264c2041j03292O496
9971a28837m6068Q5038b5185j13749r6106R9914I0070a03935J9849o0114M5163
9960i9037B03883b42705O6204C9078D7P453a56195p1198K6872H5660I616c8400
9947f6686B54482c684D79i8730D2716L20075F677L1471d65237b8847j8914m5378
$$ plain form
10028 -72871 -26185 -88926 -155454 -20139 109057 137100 -252032 -128600 1621 -327638 -159575
10016 -107856 -233722 -105622 17145 -220020 51543 57824 2679 -144976 -205400 -73639 -96846
10005 -96846 68048 102677 -138368 63942 -68997 102608 -50518 -157124 -196776 -104678 107023
9993 92992 -84689 -109204 103830 -78325 -19238 -182988 -244653 103883 -98464 -35661 -104551
9982 -104551 -13206 -36524 -182860 255815 209077 55769 -101885 163264 -32041 -135333 -128837
9971 -128837 -174905 -89867 -25185 -138934 -235040 -135126 90070 -103935 -84086 -144200 -99037
9960 -99037 203883 -242705 -176501 39078 47 7500 -156195 -227393 -200521 85660 9616 -38400
9947 -66686 254482 -3684 479 -98730 42716 362791 6677 38148 -465237 -28847 -47761 -93139
9935i3139k7475j178j60206G9117a93657R5332C8385a26003k73464Q7810H1178
9923a77537E3628b21951A28343a77687B94226B0808J52610Q080a8004j2156m9518
9912g9678B93096g5818j39762B009b67072j55a9765C6986h6291l8433d6325B5416
9899e29371B36681a35891B7714a79229f142r5430C6347f8252H6861a06283F5955
9887A30376D6611A1317M1153b5718A83949c03716L8975Q2001r5745A08771b81275
9875a71688l1794F1169b9744I2412d0551j79300J1654j2585j66945L4586J30195
9864b22946N2021P2079B41728r5197c0674A52698J77730I621f8781l38802a46662
9852d61158f7486j62977b5268a1367p6509l51405G7372h6339r742B00682e6948
$$ plain form
9935 -93139 -120614 -121792 -281998 79117 -193657 -98325 38385 -126003 -399467 -311657 81178
9923 -177537 53628 -221951 128343 -177687 294226 20808 173418 181498 -18004 -30160 -79678
9912 -79678 293096 -75818 -215580 2009 -267072 -267227 -19765 36986 -86291 -124724 -46325 25416
9899 -529371 236681 -135891 27714 -179229 -6142 -101572 36347 -68252 86861 -106283 65955
9887 130376 46611 11317 52470 -25718 183949 -303716 -264741 -182740 -278485 108771 -281275
9875 -171688 -203482 61169 -29744 92412 -40551 -219851 -208197 -220782 -387727 -353141 -222946
9864 -222946 -170925 -98846 241728 146531 -30674 152698 330428 9621 -68781 -407583 -146662
9852 -461158 -67486 -230463 -25268 -11367 -87876 -439281 77372 -86339 -96081 200682 -56948
9840b39490b1337d647l98963J55324E8608i3849l50376a18918m1506A13349a46987
9828a71486k73929a72209n129r4269a12661j54896j22942A34681n5546a79316
9817A54647b1537H3515a26554j5298C711R7124b16259J170A21187D5765b32456
9805a59890g3093j83629m8540H126Q54a32821j00520j02464D5738a40828c2296
9793a22335k0540j57146A29723l0044d4416k89803D6542h3917k83338b01p351
9782g552D9330a4688A64948a94013C5533l321b47916m7686D0313O025O9686l6049
9770G9975J20322g3923k76966i4023l4849A18416l9484L2421f5189j88687g5081
9758c23221p4625a69128k0146n1686b0643k94660E2326o668N6395i4879d1460
$$ plain form
9840 -239490 -21337 -4647 -403610 -248286 58608 -93849 -444225 -118918 -160424 113349 -146987
9828 -171486 -445415 -172209 -177338 -271607 -112661 -267557 -390499 134681 79135 -179316
9817 154647 -21537 83515 -126554 -141852 3711 100835 -216259 -215089 121187 45765 -232456
9805 -159890 -73093 -256722 -305262 8126 8980 -132821 -233341 -335805 45738 -140828 -32296
9793 -122335 -142875 -300021 129723 99679 -44416 -334219 46542 -83917 -367255 -201 -7552
9782 -7552 49330 -14688 164948 -194013 35533 32212 -247916 -295602 40313 46338 116024 79975
9770 79975 200297 -73923 -350889 -94023 -128872 118416 78932 111353 -65189 -253876 -75081
9758 -323221 -397846 -169128 -189274 -240960 -20643 -315303 52326 45658 102053 -94879 -41460
9746a43035E5726M217b48339l6710P3462Q0875A1763b16971A50553O9413b01500
9734a86690j36647a36012E6665i5022b4111j66171h3752o7842p5963n9243P145
9723b79655B19855a61173j8443n770r3218c9877k6292A54427a34897H5610F035
9711C7639L53594d02293e8849k9609L3924I1261c17443a2867j688j09845k4083
9700a48483N9366k80588A56769K4949d3618B39763g7835j26318f4184J6161o3040
9689a11063J0552j1801B0954c5786A71055a41432A7962b86770F3874b13038k5112
9678b38150A78425k1066c62461a61552A08129a05983j22615d9240q1782e4125
9667D7359b90917h5289m04646A65625K7470c66954E1931e1769A8260a32442p8026
$$ plain form
9746 -143035 55726 59943 -248339 -285049 -211587 -130712 11763 -216971 150553 219966 -201500
9734 -186690 -323337 -136012 56665 -95022 -24111 -190282 -83752 -151594 -227557 -286800 -279655
9723 -279655 219855 -161173 -179616 -185386 -278604 -39877 -66169 154427 -134897 85610 6035
9711 37639 391233 -402293 -58849 -88458 -54534 91261 -317443 -12867 -14555 -124400 -148483
9700 -148483 -89117 -369705 156769 181718 -43618 239763 -77835 -204153 -64184 -48023 -111063
9689 -111063 -100511 -112312 20954 -35786 171055 -141432 17962 -286770 63874 -213038 -238150
9678 -238150 178425 157359 -362461 -161552 108129 -105983 -228598 -49240 -131022 -54125
9667 47359 -290917 -85289 -489935 165625 193095 -366954 51931 -51769 18260 -132442 -210468
9656b10468L5019j48455n0782F2413c41942a66477j46986D20033j05329c972q5940
9645h9912j12860A12651a10387B09288f4895C20384g374l78833J34080c113E0411
9633c298D9441K4715K82481A49877O6498Q6122c3636A15578a85946H6810B560
9621b25871P9951A88674b14339b8775o0892c7766j42289E3045h777k9022q5039
9610a22838A5455a32059n1784F5726J90273F977L0641R1850a14018m8301q0188
9599b42507K3331J05125A77526o4776a35623C12858A49892a10859C16414h8911
9588a24497k76218A88465D608M626c76729E9536q184e6843j9270p2932H5157n1
9576H5106K2650a15582k8159b9607r6396A5495d8281A8774K3875b23739a9703
$$ plain form
9656 -210468 -175449 -323904 -374686 62413 -341942 -166477 -313463 420033 314704 -3972 -89912
9645 -89912 -202772 112651 -110387 209288 -64895 320384 -7374 -386207 -252127 -3113 50411
9633 -3298 49441 74156 356637 149877 216375 302497 -33636 115578 -185946 86810 2560
9621 -225871 -145920 188674 -214339 -28775 -89667 -37766 -180055 53045 -8777 -37799 -122838
9610 -122838 15455 -132059 -183843 65726 255999 6977 37618 129468 -114018 -162319 -242507
9599 -242507 -219176 -114051 177526 112750 -135623 312858 149892 -110859 316414 -88911
9588 -124497 -400715 188465 4608 9234 -376729 59536 51352 -56843 -76113 -149045 85157 85106
9576 85106 107756 -115582 -143741 -29607 -126003 15495 -48281 18774 42649 -223739 -19703
9564a17540A14066R8712c3773k54511F2607d5604I237a03402B53244a04132k56326
9553c60458B40743P0617j14229o1021c65800a59582J8692r5193o9906j24671a26346
9541a8014l5875B29986q9086m2344L40292a07606j44321A19266L0300c02082J38215
9530a63867C7847a88243a5550j41133m8026K0759h1274q3087B26774A11003b83280
9518a63692k24378a63832j01638C2990g5135j54724D06685a70023M9330o9508
9508a90201B8958K4132J19237O8255b16697B5684b67129A92313f9370j27301A21618
9496F8464k3428b3062k69892B40141F3396C542a77163F2320h022C67414E2267
9484i7632K3421k9161C1203c51932J40014N6160B8519j0162a66906K5300l3451
$$ plain form
9564 -117540 114066 212778 -33773 -288284 62607 -45604 9237 -103402 253244 -104132 -360458
9553 -360458 240743 311360 197131 136110 -365800 -159582 -140890 -236083 -305989 -430660 -126346
9541 -18014 -53889 229986 140900 98556 438848 -107606 -251927 119266 149566 -302082 -163867
9530 -163867 37847 -188243 -15550 -156683 -204709 -183950 -81274 -164361 226774 111003 -283280
9518 -163692 -388070 -163832 -265470 32990 -75135 -229859 406685 -170023 -120693 -190201
9508 -190201 28958 53090 172327 240582 -216697 25684 -267129 192313 -69370 -196671 121618
9496 68464 45036 -23062 -292954 240141 63396 3542 -177163 62320 -8022 367414 52267
9484 -97632 -74211 -103372 31203 -351932 -211918 -155758 28519 18357 -166906 -141606 -175057
9473a75057e057k86051c0640B1843c17768A63129a6070k18013a16800e4660A21290
9461e8582P554H1652b30497a02921k29233a40912q9414O4954g6106A3149J3152
9450B6301b71500d7988D3822c0091k91445N5158B50044a99347k7856l9918a26206
9438b05134k9898m95J17359N451r2881A46556E4424p10J10670a91607b9469A10309
9425B89385B7040a32385D8976J68270a8730A12551c7683q4041B59179b27673e9760
9413i46r9358j69804J04380j54179d5635k68863N4995k641H9717d3045j13000
9402a56045F9584N8137N1477C4351P7243B9246G618a16228A63596e672B3170K5910
9390D9080b02344j80155J45165a6581l08637O9111E3173a22845C2090b155F5098
$$ plain form
9473 -175057 -5057 -291108 -30640 21843 -317768 163129 -16070 -234083 -116800 -54660 121290
9461 -58582 -51028 81652 -230497 -102921 -332154 -140912 -230326 -165372 -76106 13149 26301
9450 26301 -271500 -47988 43822 -30091 -321536 -266378 250044 -199347 -227203 -267121 -126206
9438 -205134 -235032 -235527 -118168 -112717 -205598 146556 54424 53714 164384 -191607 -29469 110309
9425 289385 27040 -132385 48976 217246 -18730 112551 -37683 -121724 259179 -227673 -59760
9413 -946 -100304 -270108 -165728 -319907 -45635 -314498 -259503 -262144 89717 -43045 -156045
9402 -156045 69584 127721 179198 34351 111594 29246 7618 -116228 163596 -5672 23170 49080
9390 49080 -202344 -382499 -237334 -16581 -325218 -256107 53173 -122845 32090 -2155 65098
9378D502K55557a51954L8360p6925b2506B6814b15189H1466J30691o9204a6955
9366e7593o2817e9139k714k20434F4851b13896e3079D1214a10631d5642o3365
9355a09007E1066b67566i4435l2469D5847J0683L9550C4158b70855A38117f0203
9343F8769a52070d3976m6264d3547q7097A39638D2277J08497d28244a91200Q0308
9332a10892c0111A39690a31964r1200g7257a547l9735j31362J3347q4311n253
9321b48861B36651a9221B11925a82615B71740c27893D5619d0341A38944m3132
9311I5812N2501b17067C49181o9433a39101G2744b18386K3342B1531a31956F952
9299e6329I8586g0093B32498B0374a27609K418j75195a09130k5778j71070J45614
$$ plain form
9378 4502 260059 -151954 -113594 -190519 -22506 26814 -215189 81466 212157 142953 -16955
9366 -57593 -120410 -59139 -61853 -282287 64851 -213896 -53079 41214 -110631 -45642 -109007
9355 -109007 51066 -267566 -94435 -126904 45847 56530 96080 34158 -270855 138117 -60203
9343 68769 -152070 -43976 -90240 -43547 -130644 139638 42277 150774 -428244 -191200 -110892
9332 -110892 -30111 139690 -131964 -223164 -77257 -1547 -41282 -172644 -159297 -243608 -248861
9321 -248861 236651 -19221 211925 -182615 271740 -327893 45619 -40341 138944 95812
9311 95812 148313 -217067 349181 279748 -139101 72744 -218386 -195044 21531 -131956 6952
9299 -56329 98586 -70093 232498 20374 -127609 -125191 -300386 -109130 -134908 -305978 -160364
9288a60364J3266j856f8569A2482d014E5462K46448b58892M4433o374R3841j07469
9276b34461D7830J05794f8312B70183K0183C7696K51249a48590j12343o8237A38522
9264c06956A2187K24957q8870a45370k60353H7284c91243a2807C4993N6546m4512
9253D7027A0208Q452c21541A8808h0577G2372g1783l78744a93384f3160j27223
9242a90383j28491a20122d5572l75320a43402k98095D9486b76372h6137j36658
9232b22795A28391J47998K787b24568p6522a26309B26930A9425m320N8074E30
9220b8739j31681n1516R1510c3905i678k08833A1129J17069D8808b18883g5138
9208E7038a36211l84957b47296a05818j74083E4444a7384k57123a11182B02252
$$ plain form
9288 -160364 -147098 -148954 -68569 12482 -4014 55462 301910 -258892 -214459 -220833 -126992 -234461
9276 -234461 47830 153624 -68312 270183 290366 37696 288945 -148590 -260933 -329170 138522
9264 -306956 12187 237144 148274 -145370 -405723 87284 -391243 -12807 34993 91539 47027
9253 47027 10208 18660 -321541 18808 -80577 72372 -71783 -450527 -193384 -63160 -190383
9242 -190383 -318874 -120122 -45572 -420892 -143402 -441497 49486 -276372 -86137 -222795
9232 -222795 128391 276389 279176 -224568 -301090 -126309 226930 19425 15105 73179 530
9220 -28739 -160420 -211936 -120426 -33905 -9678 -218511 11129 128198 48808 -218883 -75138
9208 57038 -136211 -521168 -247296 -105818 -279901 54444 -17384 -274507 -111182 202252
9197i4566b0347k12970g5884j69416o8563a45454p0456B68608a00637A13903a7486
9185d45062i0725j10841K277r1303J41478A57487J2157d7717j41258A88989b12221
9173C26097a10235j3303p7506N8458j22690J14221B70266g2286C66434d4441k73440
9162c17881a10093A15445a1606A47301k7595H179K96563A9176J28739P8654c4700
9150c7116j12533j02415A54775d766D9816O9863a17510k45579J6090J13566c3193
9138A70094i3398B1600P3313c59342p1930B08033c17902C5807b19995B76729D8918
9126i3817F771b78990J02221a9379I3354c77403A52138C6872J03835c6791J5395
9115b1396j37104E3340b1787O957B13173j2860l4680B4279b2370I5207a61386
$$ plain form
9197 -94566 -20347 -233317 -75884 -245300 -313863 -145454 -215910 268608 -100637 113903 -17486
9185 -445062 -90725 -201566 -199289 -290592 -149114 157487 169644 -47717 -188975 188989 -212221
9173 326097 -110235 -123538 -201044 -142586 -265276 -151055 270266 -72286 366434 -44441 -317881
9162 -317881 -110093 115445 -11606 147301 119706 8179 304742 19176 147915 226569 -34700
9150 -37116 -149649 -252064 154775 -4766 49816 119679 -117510 -363089 -346999 -233433 -33193
9138 170094 -93398 21600 94913 -359342 -431272 208033 -317902 35807 -219995 276729 48918
9126 -93817 6771 -278990 -176769 -19379 93354 -377403 152138 36872 140707 -36791 -21396
9115 -21396 -158500 53340 -21787 -14830 213173 200313 165633 24279 -22370 95207 -161386
9103a48343A46653a02778d7352j21946O047j99475J52999i7792K6967E4970c0271
9091A17272b25355J01138n7246d1911j93326Q8980I4636a94554D0823J38119b8758
9079i0222k1327k07473i9684j01532I8397M2546h0766A5289K7010i7159C0990
9067A49099b1437l05398g1113q1863c166A53910h9331n9665j04100a21561l03638
9056d25199f9341j02425d8127H5305A6567c26960e1935A45638A585J04282j4411
9045I1456K85317j82983E4978b28827i5733k18938B01021R9407A4419h7175m9045
9034a36220d748o5929H0620a60542c0536F0749b46565J02461O364p9328k42808
9023d59876J70418A22460n7587c1739n2618A29526E5449a03465L9803A2430K58766
$$ plain form
9103 -148343 146653 -102778 -47352 -169298 -163251 -362726 -209727 -97792 -70825 54970 -30271
9091 117272 -225355 -124217 -181463 -41911 -235237 -146257 94636 -194554 40823 178942 -28758
9079 -90222 -111549 -319022 -99684 -201216 98397 140943 -80766 15289 42299 -97159 30990
9067 149099 -21437 -326835 -71113 -152976 -3166 153910 -89331 -148996 -253096 -121561 -425199
9056 -425199 -69341 -171766 -48127 85305 16567 -326960 -51935 145638 1585 105867 91456
9045 91456 376773 193790 54978 -228827 -95733 -314671 201021 300428 14419 -87175 -136220
9034 -136220 -4748 -70677 80620 -160542 -30536 60749 -246565 -144104 -137740 -217068 -459876
9023 -459876 -289458 122460 64873 -31739 -84357 129526 55449 -103465 -63662 12430 271196
9012B71196f0863a4022k09234a01133J8112j11558B69931L649m5389G009Q5588
9001I2597f15290A26705B9910b15329N0021D2756O6692K3185Q3850a77654I5847
8989D1864j592j4291N2753a5454k33223P4305A84179D5341A1099c50136D9573
8977I9185a26668d0869n4923p1091M4327B43602c60675E4403c2105G0720N2106
8966A22826d7390H9244a78845m24266b90738A39940a81509b427H8281c35077C07281
8954B05563a57A64806a57184D1818g1036A06787a08652L6780G7434g5661D8039
8942a16930A2684a22183B78735a46770g447k65436B05419k5385b543C98959l7774
8931C61185A28442a07936o4237N7312B02512G1170a22331B62759N9336M66795
$$ plain form
9012 271196 -60863 -14022 -223256 -101133 -83021 -194579 269931 273580 228191 7009 92597
9001 92597 -615290 126705 29910 -215329 -165308 42756 109448 132633 216483 -177654 95847
8989 41864 40272 25981 78734 -15454 -248677 -174372 184179 45341 11099 -350136 49573
8977 99185 -126668 -40869 -95792 -166883 -122556 243602 -360675 54403 -32105 70720 122826
8966 122826 -47390 89244 -178845 -603111 -290738 139940 -181509 -2427 88281 -335077 307281
8954 205563 -157 164806 -157184 41818 -71036 106787 -108652 -71872 77434 -75661 48039
8942 -116930 12684 -122183 278735 -146770 -7447 -272883 205419 180034 -2543 398959 361185
8931 361185 128442 -107936 -172173 -114861 202512 71170 -122331 262759 322095 788890
8921G88890R16931L441103O799707m380054C122859j347085q16694j37002B89731
8911C30732K9100a7783k06912B22329C7877K19232K00453j84240A36249K7680
8901A63929e8069k2250m4379G4102K37128A12433j8685i0118c3260j86110b3881
8889A24142j4216a60555A05302c67180D9483e2915k56732R3498A65022C7734f218
8877G3562G78J03275L4272e3968r6532B4215J08698k3310J234a20213D4058j0117
$$ plain form
8921 788890 1705821 5146924 11946631 7566577 3122859 1775774 959080 822078 289731
8911 330732 359832 -17783 -224695 222329 37877 257109 457562 273322 136249 163929
8901 163929 -58069 -80319 -124698 74102 311230 112433 93748 -90118 -33260 -219370 -23881
8889 124142 109926 -160555 105302 -367180 49483 -52915 -309647 -216149 165022 37734 -6218
8877 73562 778 104053 138325 -53968 -150500 24215 132913 109603 110837 -120213 44058 33941
$$ [...]
##END NTUPLES=NMR SPECTRUM
##END=
