
##TITLE=AC1267_CTIAH12085_6647440_FoAI34keot
##JCAMPDX= 6.0         $$ Bruker NMR JCAMP-DX V2.0
##DATA TYPE= NMR SPECTRUM
##DATA CLASS= NTUPLES
##ORIGIN= BRUKER
##OWNER= Administrator
$$ 1.72 TOPSPIN		Version 2.1
$$ 2012-08-09 15:51:34.484 -0500  Administrator@TOPSPIN
$$ Compression mode = diff/dup
##.OBSERVE FREQUENCY= 400.02188249412
##.OBSERVE NUCLEUS= ^1H
##.ACQUISITION MODE= SIMULTANEOUS (DQD)
##.ACQUISITION SCHEME= undefined
##.AVERAGES= 64
##.DIGITISER RES= 22
##SPECTROMETER/DATA SYSTEM= spect
##.PULSE SEQUENCE= noesygpps1d.comp
##.SOLVENT NAME= COFFEE_meoh
##.SHIFT REFERENCE= INTERNAL, COFFEE_meoh, 1, 14.96257
##AUDIT TRAIL= $$ (NUMBER, WHEN, WHO, WHERE, PROCESS, VERSION, WHAT)
$$ ##TITLE= Audit trail, TOPSPIN		Version 2.1
$$ ##JCAMPDX= 5.01
$$ ##ORIGIN= Bruker BioSpin GmbH
$$ ##OWNER= Administrator
$$ $$ C:\Bruker\TOPSPIN/data/COFFEE/nmr/AC1267_CTIAH12085_6647440_FoAI34keot/12/pdata/1/auditp.txt
$$ ##AUDIT TRAIL=  $$ (NUMBER, WHEN, WHO, WHERE, PROCESS, VERSION, WHAT)
(   1,<2012-08-09 15:51:29.140 -0500>,<Administrator>,<TOPSPIN>,<go>,<TOPSPIN 2.1>,
      <created by zg
	started at 2012-08-09 15:39:49.000 -0500,
	POWCHK enabled, PULCHK disabled,
       configuration hash MD5:
       6B 1B 68 BB D9 2E 58 E2 7F 35 AD 54 07 DF 0E 41
       data hash MD5: 64K
       64 17 96 69 16 6E CA 23 D8 D3 68 0D 7B 3A 8C D7>)
(   2,<2012-08-09 15:51:32.171 -0500>,<Administrator>,<TOPSPIN>,<proc1d>,<TOPSPIN 2.1>,
      <Start of raw data processing
       efp LB = 0.3 FT_mod = 6 PKNL = 1 PHC0 = 0 PHC1 = 0 SI = 128K 
       data hash MD5: 128K
       2D E0 6F 4F C0 6D 5A 13 77 BE 3A 27 68 5F CC 0C>)
(   3,<2012-08-09 15:51:33.312 -0500>,<Administrator>,<TOPSPIN>,<proc1d>,<TOPSPIN 2.1>,
      <pk PHC0 = -3.026733 PHC1 = 0 
       data hash MD5: 128K
       E7 4F A8 BC F5 A5 79 18 50 98 2F D3 53 19 F2 1C>)
(   4,<2012-08-09 15:51:34.125 -0500>,<Administrator>,<TOPSPIN>,<proc1d>,<TOPSPIN 2.1>,
      <abs ABSG = 1 
       data hash MD5: 128K
       FE 3F 44 F8 5E 63 0A 20 E4 D3 15 59 67 6B 05 0A>)
(   5,<2012-08-09 15:51:34.218 -0500>,<Administrator>,<TOPSPIN>,<proc1d>,<TOPSPIN 2.1>,
      <abs ABSG = 2 
       data hash MD5: 128K
       9A 77 6F 92 C3 91 15 16 1B F9 30 E0 E5 17 76 3F>)
(   6,<2012-08-09 15:51:34.281 -0500>,<Administrator>,<TOPSPIN>,<proc1d>,<TOPSPIN 2.1>,
      <abs ABSG = 3 
       data hash MD5: 128K
       C3 D3 AD EF 55 99 31 33 03 B0 9B DF 81 F1 92 2E>)
(   7,<2012-08-09 15:51:34.359 -0500>,<Administrator>,<TOPSPIN>,<proc1d>,<TOPSPIN 2.1>,
      <abs ABSG = 4 
       data hash MD5: 128K
       B8 1A 96 3B AA 27 80 56 12 6A 55 83 FB 21 52 00>)
(   8,<2012-08-09 15:51:34.406 -0500>,<Administrator>,<TOPSPIN>,<proc1d>,<TOPSPIN 2.1>,
      <abs ABSG = 5 
       data hash MD5: 128K
       DC BE A9 57 DC 5F 71 B6 46 48 91 78 02 73 20 9C>)
$$ ##END=
$$ 
$$ $$ hash MD5
$$ $$ 8C 2D 68 74 08 CA 41 B0 BC 33 A5 D8 B5 0F 46 28
##$RELAX= 
##$RELAX= 
##$RELAX= 
##$RELAX= 
##$RELAX= 
##$RELAX= 
##$RELAX= 
##$RELAX= 
$$ Bruker specific parameters
$$ [...]
##$TP07= 0
##$TPNAME0= <>
##$TPNAME1= <>
##$TPNAME2= <>
##$TPNAME3= <>
##$TPNAME4= <>
##$TPNAME5= <>
##$TPNAME6= <>
##$TPNAME7= <>
##$TPOAL= (0..7)
0.5 0.5 0.5 0.5 0.5 0.5 0.5 0.5
##$TPOFFS= (0..7)
0 0 0 0 0 0 0 0
##$TUNHIN= 0
##$TUNHOUT= 0
##$TUNXOUT= 0
##$USERA1= <user>
##$USERA2= <user>
##$USERA3= <user>
##$USERA4= <user>
##$USERA5= <user>
##$V9= 5
##$VALIST= <valist>
##$VCLIST= <CCCCCCCCCCCCCCC>
##$VD= 0
##$VDLIST= <DDDDDDDDDDDDDDD>
##$VPLIST= <PPPPPPPPPPPPPPP>
##$VTLIST= <TTTTTTTTTTTTTTT>
##$WBST= 1024
##$WBSW= 4
##$XGAIN= (0..3)
0 0 0 0
##$XL= 0
##$YL= 0
##$YMAX_a= 17562592
##$YMIN_a= -10953437
##$ZGOPTNS= <>
##$ZL1= 120
##$ZL2= 120
##$ZL3= 120
##$ZL4= 120
##$ABSF1= 14.96257
##$ABSF2= -5.595612
##$ABSG= 5
##$ABSL= 3
##$ALPHA= 0
##$AQORDER= 0
##$ASSFAC= 0
##$ASSFACI= 0
##$ASSFACX= 0
##$ASSWID= 0
##$AUNMP= <proc_prof1d_extract.lims>
##$AXLEFT= 0
##$AXNAME= <>
##$AXNUC= <1H>
##$AXRIGHT= 0
##$AXTYPE= 0
##$AXUNIT= <>
##$AZFE= 0.1
##$AZFW= 0.1
##$BCFW= 0
##$BC_mod= 0
##$BYTORDP= 0
##$COROFFS= 0
##$CY= 15
##$DATMOD= 1
##$DC= 0
##$DFILT= <>
##$DTYPP= 0
##$F1P= 0
##$F2P= 0
##$FCOR= 0.5
##$FTSIZE= 131072
##$FT_mod= 6
##$GAMMA= 0
##$GB= 0
##$INTBC= 1
##$INTSCL= 1
##$ISEN= 128
##$LB= 0.3
##$LEV0= 0
##$LPBIN= 0
##$MAXI= 10000
##$MC2= 0
##$MEAN= 0
##$ME_mod= 0
##$MI= 0
##$NCOEF= 0
##$NC_proc= -2
##$NLEV= 6
##$NOISF1= 0
##$NOISF2= 0
##$NSP= 0
##$NTH_PI= 0
##$NZP= 0
##$OFFSET= 14.96257
##$PC= 1
##$PHC0= -3.026733
##$PHC1= 0
##$PH_mod= 1
##$PKNL= yes
##$PPARMOD= 0
##$PPDIAG= 0
##$PPIPTYP= 0
##$PPMPNUM= 2147483647
##$PPRESOL= 1
##$PSCAL= 4
##$PSIGN= 0
##$PYNMP= <proc.py>
##$REVERSE= no
##$SF= 400.020009007846
##$SI= 131072
##$SIGF1= 0
##$SIGF2= 0
##$SINO= 400
##$SIOLD= 131072
##$SPECTYP= <>
##$SREGLST= <1H.CDCl3>
##$SSB= 0
##$STSI= 131072
##$STSR= 0
##$SW_p= 8223.68421052631
##$SYMM= 0
##$S_DEV= 0
##$TDeff= 65536
##$TDoff= 0
##$TI= <>
##$TILT= no
##$TM1= 0
##$TM2= 0
##$TOPLEV= 0
##$USERP1= <user>
##$USERP2= <user>
##$USERP3= <user>
##$USERP4= <user>
##$USERP5= <user>
##$WDW= 1
##$XDIM= 131072
##$YMAX_p= 377885153
##$YMIN_p= -11669
##$CURPLOT= <Network HP LaserJet P1505>
##$CURPRIN= <$Network HP LaserJet P1505>
##$DFORMAT= <normdp>
##$LAYOUT= <+/1D_H.xwp>
##$LFORMAT= <normlp>
##$PFORMAT= <normpl>
##$SURQMSG= 1
$$ End of Bruker specific parameters
$$ ---------------------------------
##NTUPLES= NMR SPECTRUM
##VAR_NAME=  FREQUENCY,     SPECTRUM/REAL,   SPECTRUM/IMAG
##SYMBOL=    X,             R,               I
##VAR_TYPE=  INDEPENDENT,   DEPENDENT,       DEPENDENT
##VAR_FORM=  AFFN,          ASDF,            ASDF
##VAR_DIM=   131072,        131072,          131072
##UNITS=     HZ,            ARBITRARY UNITS, ARBITRARY UNITS
##FACTOR=    0.0627417313425164, 1,          1
##FIRST=     8223.62146879497, 176,          -65948
##LAST=      0,             2451,            -66765
##MIN=       0,             -11669,          0
##MAX=       8223.62146879497, 377885153,    0
$$ Real data points
##PAGE= N=1
##DATA TABLE= (X++(R..R)), XYDATA
$$ [...]
60900I39550j8764j7026j5470j3882j2327j0565q240n703l870l069k639j981j274
60887H24740q08l41K22K01r86k761m014m541n127o263p589q609r258r624r608
60872G55634r079q083o832n722n221n375n537n026l856k454r54O33J876K402K820
60857G05226M140O179P571P677P481Q041R067R845J0656J2193J4086J5257J5528
60844H32947J5836J6712J7597J7823J7499J6997J6224J4865J2974J0894Q805O734
60832A005907M808L332K554K425K512K286J621Q90L13n41k202m408o252p225p668
60817I98352q150q861r710j0525j1000j0871j0338r947r878r724r133q348p783
60804H74084p431o940o033m644k878j156r4J32J80R40K521M149N104N556O309
$$ y = [939550, 920786, 903760, 888290, 874408, 862081, 851516, 843276, 837573, 833703, 830634, 827995, 826014, 824740, 823932, 823591, 823813, 824014, 823028, 820267, 816253, 811712, 806585, 800322, 792733, 784124, 774866, 765242, 755634, 746555, 738472, 731640, 725918, 720697, 715322, 709785, 704759, 700903, 698449, 697495, 698128, 700004, 702406, 705226, 709366, 715545, 723116, 730793, 738274, 746315, 755382, 765227, 775883, 788076, 802162, 817419, 832947, 848783, 865495, 883092, 900915, 918414, 935411, 951635, 966500, 979474, 990368, 999173, 1005907, 1010715, 1014047, 1016601, 1019026, 1021538, 1023824, 1025445, 1026335, 1026648, 1026107, 1023905, 1019497, 1013245, 1006020, 998352, 990202, 981341, 971631, 961106, 950106, 939235, 928897, 918950, 909072, 899348, 890215, 881867, 874084, 866653, 859713, 853680, 849036, 846158, 845002, 844908, 845040, 845220, 846160, 848681, 852830, 857934, 863490, 869799]
60789H69799P848R857J1673J3003J4034J4919J5592J6071J6584J7153J7371J6911
60777A040815J6043J5299J4780J4121J3010J1413R522P749O587O110N781N104
60765A166334M240L521K753J522k3j352k334l239m108m788n479o470p366p361
60751A135850o378n194m445m170m329m917n389m944l771l189m066n780p164p791
60737A064323p863p413o331m831l385k342j816j639j352o20K46O96Q90J588K967
60722A033118M258M798M656M012K783J294L79K92K15n93j911l214m422n422n767
60707A034476n574n872p178q508q707q070p643p595p424p283p791q799r509r756
60693I24767j0133j0826j1348j1517j1737j2101j2098j1415j0437r676r242r020
$$ y = [869799, 877647, 887504, 899177, 912180, 926214, 941133, 956725, 972796, 989380, 1006533, 1023904, 1040815, 1056858, 1072157, 1086937, 1101058, 1114068, 1125481, 1135003, 1142752, 1149339, 1155449, 1161230, 1166334, 1170574, 1174095, 1176848, 1178370, 1178347, 1176995, 1174661, 1171422, 1167314, 1162526, 1157047, 1150577, 1143211, 1135850, 1129472, 1124278, 1119833, 1115663, 1111334, 1106417, 1101028, 1096084, 1092313, 1089124, 1085058, 1079278, 1072114, 1064323, 1056460, 1049047, 1042716, 1037885, 1034500, 1032158, 1030342, 1028703, 1027351, 1026731, 1026977, 1027673, 1028563, 1030151, 1033118, 1037376, 1042174, 1046830, 1050842, 1053625, 1054919, 1055298, 1055590, 1055805, 1055212, 1053301, 1050087, 1045665, 1040243, 1034476, 1028902, 1023030, 1015852, 1007344, 998637, 990567, 982924, 975329, 967905, 960622, 952831, 944032, 934523, 924767, 914634, 903808, 892460, 880943, 869206, 857105, 845007, 833592, 823155, 813479, 804237, 795217]
60681G95217q882q599p988p166o342n400m141k792j760r69O8J460K738L398L370
60666G52212K970K710K947L420L467L040K975L767M588M363L436L139L881M701
60652H01616M758M333M159M558N539O977Q362Q982Q731Q302Q316Q604Q651Q299
60638I00187P852P775Q407R679J1009J1764J1939J2064J2426J2785J2859J2758
60626A031504J2728J2755J2497J1467R419O718M186K209K57k277n009o931p793
60613A081730q398r438j0627j1226j0927r893q271o069l441q65J096K232K935
60600A008838L716M461M379K974P44j390k998m160m867n029m890m817m746m308
60586I87907l465k573j788r84k35Q1k22q49j338j390q73J81J451K441K795K504
$$ y = [795217, 786335, 777736, 769748, 762582, 756240, 750840, 746699, 743907, 742147, 741178, 741246, 742706, 745444, 748842, 752212, 755182, 757892, 760839, 764259, 767726, 770766, 773741, 777508, 782096, 786459, 789895, 793034, 796915, 801616, 806374, 810707, 814866, 819424, 824963, 831940, 840302, 849284, 858015, 866317, 874633, 883237, 891888, 900187, 908039, 915814, 924221, 933900, 944909, 956673, 968612, 980676, 993102, 1005887, 1018746, 1031504, 1044232, 1056987, 1069484, 1080951, 1090370, 1097088, 1101274, 1103483, 1103740, 1101463, 1096454, 1089523, 1081730, 1073332, 1063894, 1053267, 1042041, 1031114, 1021221, 1012950, 1006881, 1003440, 1002575, 1003671, 1005903, 1008838, 1012554, 1017015, 1021394, 1024368, 1025112, 1023722, 1020724, 1016564, 1011697, 1006668, 1001778, 996961, 992215, 987907, 984442, 981869, 980081, 979097, 978862, 978943, 978721, 977872, 976534, 975144, 974271, 974452, 975903, 978344, 981139, 983643]
60570I83643J911J491J416J315P85Q2k52n01j692m018o207p056o891o834p214
60555I49978p619p907q176q078p170n752m444l228j783m13M01J121K656M835O581
60540I11002P637Q971J1310J4406J7993K2361K7536L2884L7836M2188M5314M6078
60528A225516M3930L9297L2491K3307J2306J492p147j3270j7613k0394k1040j9195
60516A279680j5256j0134m911m92K936N808Q234R422Q584O083L243J141l3n31
60502A293774m01O56K959O396J0340J4188J8038K2560K8227L4937M2419N0637
60490A524730N9592O9033P8582Q8038R7513J07463J18480J31083J45948J64437
60480B584899J88231K17711K50904K84653L16221L42687L58886L57698L33460
$$ y = [983643, 985554, 987045, 988461, 989776, 990561, 990643, 990391, 989890, 988198, 984180, 977973, 970917, 964026, 957192, 949978, 942359, 934452, 926276, 918198, 911028, 905276, 900832, 897604, 895821, 895408, 895809, 896930, 899586, 904421, 911002, 918639, 927610, 938920, 953326, 971319, 993680, 1021216, 1054100, 1091936, 1134124, 1179438, 1225516, 1269446, 1308743, 1341234, 1364541, 1376847, 1378339, 1371192, 1357922, 1340309, 1319915, 1298875, 1279680, 1264424, 1254290, 1249379, 1248887, 1251823, 1257631, 1265865, 1275287, 1283871, 1289954, 1293197, 1294338, 1294305, 1293774, 1293373, 1294029, 1296988, 1303384, 1313724, 1327912, 1345950, 1368510, 1396737, 1431674, 1474093, 1524730, 1584322, 1653355, 1731937, 1819975, 1917488, 2024951, 2143431, 2274514, 2420462, 2584899, 2773130, 2990841, 3241745, 3526398, 3842619, 4185306, 4544192, 4901890, 5235350]
60471E235350K85046K15699J30879L6916n9015j48985k25275k82062l17201l32770
60461D538582l33461l23836l06989k85202k60884k36321k13028j91647j72219
60452B214995j54384j37764j22449j08856r7052q6613p7191o8818o1559n5311
60442A244998m9986m5453m1344l7408l4017l1678l0061k8208k5786k3361k1385
60431H76311j9693j8144j6947j6006j4769j3084j1473j0212q891p303n963n283
60419G28543m860m193l473l053k696j943q47J73Q98J294J344J282J537K125K497
60404G18628K320J933J800K019K590L503M261M145L401L275M268N259N094M252
60390G66748L866L854L308K237J545J381P88o71k085k487k135j968k294k603k372
$$ y = [5235350, 5520396, 5736095, 5866974, 5903890, 5844875, 5695890, 5470615, 5188553, 4871352, 4538582, 4205121, 3881285, 3574296, 3289094, 3028210, 2791889, 2578861, 2387214, 2214995, 2060611, 1922847, 1800398, 1691542, 1594490, 1507877, 1430686, 1361868, 1300309, 1244998, 1195012, 1149559, 1108215, 1070807, 1036790, 1005112, 975051, 946843, 921057, 897696, 876311, 856618, 838474, 821527, 805521, 790752, 777668, 766195, 755983, 747092, 739789, 733826, 728543, 723683, 719490, 716017, 712964, 710268, 708325, 707478, 707651, 708549, 709843, 711187, 712469, 714006, 716131, 718628, 720948, 722881, 724681, 726700, 729290, 732793, 737054, 741199, 744600, 747875, 752143, 757402, 762496, 766748, 770614, 774468, 777776, 780013, 781558, 782939, 783727, 783056, 780971, 778484, 776349, 774381, 772087, 769484, 767112]
60375G67112j591n96K60P75Q61N80J90R7N91J522K423K985L225L196K825K180
60359G86635J622J474J720K183K725L172L339L317L504M107M843N329N580N951
60345H35501O758Q039R488J0516J0678J0119R389Q774Q079P137O136N334M763
60332I40711M331L956L510K955K598K856L715M763N710O529P108P255P022O538
60318A009557N582L821J498p54k733m672o408p369p443p105o607n800m919m550
60304I62098m565m027k598j091j78N70J710K893L562M026M924O055O557O001M828
60289I90765L871L696M078L943K468L30q56o02n0j38l57J0O41J090J868L460N076
60272A019293N727N930O984Q926J0564J1371J2088J3373J5035J6794J8847K1362
$$ y = [767112, 765521, 764925, 765185, 765960, 766821, 767401, 767591, 767688, 768279, 769801, 772224, 775209, 778434, 781630, 784455, 786635, 788257, 789731, 791451, 793634, 796359, 799531, 802870, 806187, 809691, 813798, 818641, 823970, 829550, 835501, 842259, 850298, 859786, 870302, 880980, 891099, 900488, 909262, 917341, 924478, 930614, 935948, 940711, 945042, 948998, 952508, 955463, 958061, 960917, 964632, 969395, 975105, 981634, 988742, 995997, 1003019, 1009557, 1015139, 1018960, 1020458, 1019704, 1016971, 1012299, 1005891, 998522, 991079, 983974, 977367, 971567, 966648, 962098, 957533, 953506, 950908, 949817, 949639, 950209, 951919, 954812, 958374, 962400, 967324, 973379, 979936, 985937, 990765, 994636, 998332, 1002410, 1006353, 1008821, 1009151, 1008295, 1007693, 1007643, 1007505, 1007148, 1007158, 1007799, 1008889, 1010757, 1014217, 1019293, 1025020, 1030950, 1037934, 1046860, 1057424, 1068795, 1080883, 1094256, 1109291, 1126085, 1144932, 1166294]
60260A166294K4062K6605K9049L1778L5237L9569M4236M8357N1855N5744O0871
60249A613657O6963P3553Q1148R0344J00294J09323J16977J24260J31820J38902
60239B647241J44310J47422J48016J45922J41285J34497J25632J14418J01049
60230C849792Q6450P1490N6378M0991K5401R907n044j8754l0475l9772m6521n0515
60218C949328n1506m9571m5094l8397k9791j9886r301J954J4364K8020M2342N6764
60206C849226P1291Q6132J01014J15073J27284J36928J43785J47813J48666J45613
60196E072825J38130J26368J11056R3110P3574N3367L2718J1115j1638l4470n5532
60185E610623p3488q8001r9188j07076j11606j12702j10286j04410r5357q3482
$$ y = [1166294, 1190356, 1216961, 1246010, 1277788, 1313025, 1352594, 1396830, 1445187, 1497042, 1552786, 1613657, 1680620, 1754173, 1835321, 1925665, 2025959, 2135282, 2252259, 2376519, 2508339, 2647241, 2791551, 2938973, 3086989, 3232911, 3374196, 3508693, 3634325, 3748743, 3849792, 3936242, 4007732, 4064110, 4105101, 4130502, 4140409, 4135365, 4116611, 4086136, 4046364, 3999843, 3949328, 3897822, 3848251, 3803157, 3764760, 3734969, 3715083, 3705782, 3707736, 3722100, 3750120, 3792462, 3849226, 3920517, 4006649, 4107663, 4222736, 4350020, 4486948, 4630733, 4778546, 4927212, 5072825, 5210955, 5337323, 5448379, 5541489, 5615063, 5668430, 5701148, 5712263, 5700625, 5666155, 5610623, 5537135, 5449134, 5349946, 5242870, 5131264, 5018562, 4908276, 4803866, 4708509, 4625027]
60175D625027o9134n2844l5317j7042J797K0832L9213N6098P1038Q3627R3140
60164D816435R8861J00513R8022R1337Q0930O8162N4510M0566K6113J1061m099
60153E482411j8423l0748l9911m5222m6627m4353l8542k9417j7370k775J4008
60142E183031L2296N1314P0996R2062J15019J39618J65518J92879K21907K52349
60132F516989K83709L15285L45822L73884L98948M21168M39675M52205M57123
60123A0004808M54713M45641M29229M04375L71275L30956K83948K30886J73711
60114A3129542J14670N4347p794p1016j32751j90354k42169k86897l23241l50440
60104A1693897l68175l75868l73155l61175l42319l18369k89722k56662k20405
$$ y = [4625027, 4555893, 4503049, 4467732, 4450690, 4452487, 4473319, 4512532, 4568630, 4639668, 4723295, 4816435, 4915296, 5015809, 5113831, 5205168, 5286098, 5354260, 5408770, 5449336, 5475449, 5486510, 5482411, 5463988, 5433240, 5393329, 5348107, 5301480, 5257127, 5218585, 5189168, 5171798, 5169023, 5183031, 5215327, 5266641, 5337637, 5429699, 5544718, 5684336, 5849854, 6042733, 6264640, 6516989, 6800698, 7115983, 7461805, 7835689, 8234637, 8655805, 9095480, 9547685, 10004808, 10459521, 10905162, 11334391, 11738766, 12110041, 12440997, 12724945, 12955831, 13129542, 13244212, 13298559, 13290765, 13219749, 13086998, 12896644, 12654475, 12367578, 12044337, 11693897, 11325722, 10949854, 10576699, 10215524, 9873205, 9554836, 9265114, 9008452, 8788047]
60095H788047j82515j44020j05441o7175k9635O508M0036O9524R3927J12565J24796
60084H706617J30280J29186J21583J07065Q5822N9732L1426K444k6840n5834q3412
60073I208069j08899j32329j53685j72693j89308k03413k14117k20356k22152
60064G591117k20399k15453k07064j95625j82288j67624j51183j32665j12580
60055F006236r1558o9897m7887k5688k825K1111M5216O7798Q8211J06933J23616
60044F221266J36549J44504J47755J46502J39686J26481J08004Q6331O2392L5951
60034G355421P270k2229n0943p7988j03084j25955j45849j61514j71855j76761
60024F326513j77001j73333j66095j55747j43046j28483j12121r4292p5834n7209
$$ y = [8788047, 8605532, 8461512, 8356071, 8288896, 8259261, 8265769, 8305805, 8375329, 8469256, 8581821, 8706617, 8836897, 8966083, 9087666, 9194731, 9280553, 9340285, 9371711, 9374155, 9347315, 9291481, 9208069, 9099170, 8966841, 8813156, 8640463, 8451155, 8247742, 8033625, 7813269, 7591117, 7370718, 7155265, 6948201, 6752576, 6570288, 6402664, 6251481, 6118816, 6006236, 5914678, 5844781, 5796894, 5771206, 5768381, 5789492, 5834708, 5902506, 5990717, 6097650, 6221266, 6357815, 6502319, 6650074, 6796576, 6936262, 7062743, 7170747, 7257078, 7319470, 7355421, 7362691, 7340462, 7289519, 7211531, 7108447, 6982492, 6836643, 6675129, 6503274, 6326513, 6149512, 5976179, 5810084, 5654337, 5511291, 5382808, 5270687, 5176395, 5100561, 5043352]
60014E043352l7882j7083N163K8177N1485P5104R9126J23261J46772J68736J88353
60003E874564K04956K17586K24809K25434K19189K06468J87687J63484J35241
59994G659418J04606P2454L8879M238l0447o3990r5253j22792j45028j61064j70963
59983G090058j75137j73916j67738j57318j43575j27609j10439r2340p2683n1097
59973E818206k8435o105J5197L5440N4385P1628Q7181J01053J12540J20772J25714
59962F507576J27669J26209J20811J12240J02033R0654P7476O2589M7355L3038
59952G407650K0158R347J581k739l783j178O020J8039L4298N4743P9946J09676
59940G733758J42761J78801K18500K61721L06580L51219L95125M37662M76324
$$ y = [5043352, 5005470, 4988387, 4993550, 5021727, 5073212, 5148316, 5247442, 5370703, 5517475, 5686211, 5874564, 6079520, 6297106, 6521915, 6747349, 6966538, 7173006, 7360693, 7524177, 7659418, 7764024, 7836478, 7875357, 7879595, 7849148, 7785158, 7689905, 7567113, 7422085, 7261021, 7090058, 6914921, 6741005, 6573267, 6415949, 6272374, 6144765, 6034326, 5941986, 5869303, 5818206, 5789771, 5783666, 5798863, 5834303, 5888688, 5960316, 6047497, 6148550, 6261090, 6381862, 6507576, 6635245, 6761454, 6882265, 6994505, 7096538, 7187192, 7264668, 7327257, 7374612, 7407650, 7427808, 7437155, 7438736, 7435997, 7432214, 7431036, 7437056, 7455095, 7489393, 7544136, 7624082, 7733758, 7876519, 8055320, 8273820, 8535541, 8842121, 9193340, 9588465, 10026127, 10502451]
59931A0502451N07584N28666N37604N32185N09944M69112M09263L31661K39557
59922A4568027J37766L1676p3249j71459k58127l30397l87239m28187m53211m63774
59912A2171826m62458m51178m30873m03147l70657l35352k97680k58135k17984
59903H944362j77767j36622r4199n1896j1082K8526O7435J04494J37897J67008
59893H978156J91564K09813K19040K17685K05736J83337J50353J07244N5448k922
59883A0515454o4882j26395j83413k33333k75117l08374l32876l48548l55364
59874H287152l53714l45165l32081l15867k96358k73639k49538k26258k04270
59865E690262j82851j62171j43553j27848j14837j04277r6460r1457q8573q6773
$$ y = [10502451, 11010035, 11538701, 12076305, 12608490, 13118434, 13587546, 13996809, 14328470, 14568027, 14705793, 14737469, 14664220, 14492761, 14234634, 13904237, 13516998, 13088811, 12635600, 12171826, 11709368, 11258190, 10827317, 10424170, 10053513, 9718161, 9420481, 9162346, 8944362, 8766595, 8629973, 8535774, 8483878, 8472796, 8501322, 8568757, 8673251, 8811148, 8978156, 9169720, 9379533, 9598573, 9816258, 10021994, 10205331, 10355684, 10462928, 10518376, 10515454, 10450572, 10324177, 10140764, 9907431, 9632314, 9323940, 8991064, 8642516, 8287152, 7933438, 7588273, 7256192, 6940325, 6643967, 6370328, 6120790, 5894532, 5690262, 5507411, 5345240, 5201687, 5073839, 4959002, 4854725, 4758265, 4666808, 4578235, 4491462]
59855D491462q5201q3136p9978p5353o9059o1007n1539m1649l2543k5006j9264
59844C867727j5225j2820j2419j4864k0674k9049l8169m6464n3167n7841o0283
59833C506752o0930o0413n8564n4762m9324m3441l7474l0565k2322j3657n395
59822C069905K775J1294J9883K8456L7664M7613N6994O4492P0115P4361P7075
59811C560627P8076P7910P6853P4070O8750O1233N2053M0897K7905J5058M795
59800D138227k288p078r850r921p043j702N912J6115K8797M3239N8954P6148R5517
59787D425027J17914J43924J73259K05130K39639K78028L20724L65764M09621
59778F679030M48651M78763M94416M89188M57364L95308L03335J88147O2753n7866
$$ y = [4491462, 4406261, 4323125, 4243147, 4167794, 4098735, 4037728, 3986189, 3944540, 3911997, 3886991, 3867727, 3852502, 3839682, 3827263, 3812399, 3791725, 3762676, 3724507, 3678043, 3624876, 3567035, 3506752, 3445822, 3385409, 3326845, 3272083, 3222759, 3179318, 3141844, 3111279, 3088957, 3075300, 3069905, 3072680, 3083974, 3103857, 3132313, 3169977, 3217590, 3274584, 3339076, 3409191, 3483552, 3560627, 3638703, 3716613, 3793466, 3867536, 3936286, 3997519, 4049572, 4090469, 4118374, 4133432, 4138227, 4135939, 4128861, 4119011, 4109090, 4102047, 4100345, 4106257, 4122372, 4151169, 4194408, 4253362, 4329510, 4425027, 4542941, 4686865, 4860124, 5065254, 5304893, 5582921, 5903645, 6269409, 6679030, 7127681, 7606444, 8100860, 8590048, 9047412, 9442720, 9746055, 9934202, 9996955, 9939089]
59768I939089j61898k42490k96976l26531l35896l31195l17239k97073k73064
59759G356727k47116k20185j92799j65781j39720j14358q9477o5762m3771k2863
59749F054895k257J7734L6777N5967P6576R8036J18857J39135J60489J83799K08643
59738G148651K34842K63013K93551L26372L61655L99645M39902M81937N26189
59729A0475757N73005O20735O66270P07203P42104P68855P84535P87289P77068
59720A6902821P54612P21147O79604O34882N92458N57319N33723N24501N30145
59711B2431212N49466N80906O22057O68279P13464P52456P81547P96751P93363
59702B8689501P67871P19181O47833N55501M46056L26036K03233Q5056k2043j12915
$$ y = [9939089, 9777191, 9534701, 9237725, 8911194, 8575298, 8244103, 7926864, 7629791, 7356727, 7109611, 6889426, 6696627, 6530846, 6391126, 6276768, 6187291, 6121529, 6077758, 6054895, 6052638, 6070372, 6107149, 6163116, 6239692, 6337728, 6456585, 6595720, 6756209, 6940008, 7148651, 7383493, 7646506, 7940057, 8266429, 8628084, 9027729, 9467631, 9949568, 10475757, 11048762, 11669497, 12335767, 13042970, 13785074, 14553929, 15338464, 16125753, 16902821, 17657433, 18378580, 19058184, 19693066, 20285524, 20842843, 21376566, 21901067, 22431212, 22980678, 23561584, 24183641, 24851920, 25565384, 26317840, 27099387, 27896138, 28689501, 29457372, 30176553, 30824386, 31379887, 31825943, 32151979, 32355212, 32440268, 32418225, 32305310]
59692C2305310j84233k34170k61575k66183k49393k13737j61374r3877j3189P8497
59682C0706076J79875K90395M08855N33185O61442P91506R19319J038407J141259
59673C6670319J220054J265939J269241J221412J116715R52922P32632M65142
59665D4914376J66129j45284m49349p27133r62525j145229j271947j344614j368395
59656C7666029j351299j303842j237338j162567j090077j030494r93087r83554
59648B8513771j002353j043660j095635j143777j176385j187992j178417j150104
59640A9535448j106811j053209r93708r31238q67543q04287p43190o85320o30879
59631A1719263n79745n31869m87201m45525m06506l69846l35464l03400k73505
$$ y = [32305310, 32121077, 31886907, 31625332, 31359149, 31109756, 30896019, 30734645, 30640768, 30627579, 30706076, 30885951, 31176346, 31585201, 32118386, 32779828, 33571334, 34490653, 35529060, 36670319, 37890373, 39156312, 40425553, 41646965, 42763680, 43716602, 44449234, 44914376, 45080505, 44935221, 44485872, 43758739, 42796214, 41650985, 40379038, 39034424, 37666029, 36314730, 35010888, 33773550, 32610983, 31520906, 30490412, 29497325, 28513771, 27511418, 26467758, 25372123, 24228346, 23051961, 21863969, 20685552, 19535448, 18428637, 17375428, 16381720, 15450482, 14582939, 13778652, 13035462, 12350142, 11719263, 11139518, 10607649, 10120448, 9674923, 9268417, 8898571, 8563107, 8259707, 7986202]
59622G986202k45424k19141j95122j73714j54632j37527j22610j10320j00751
59613F526961r4005r0594r0761r3742r8353j03979j10251j16272j21130j24830
59603E483044j27753j29434j28871j25875j21133j15107j07841r9683r1232q2622
59593D353493p3659o4531n5477m6110l6123k6446j8482j2270o459j62O202J1834
59581D031810J6306J9292K0635K0944K1327K2379K3987K6009K8406L1026L4035
59570D296156L8261M4294N1678N9775O8920P9619R1290J03093J15452J29391J44785
59559E222714J60860J77957J97049K17656K38054K57660K77527K98215L18690
59550G366382L37620L54311L68043L77733L82724L83000L78611L69855L57772
$$ y = [7986202, 7740778, 7521637, 7326515, 7152801, 6998169, 6860642, 6738032, 6627712, 6526961, 6432956, 6342362, 6251601, 6157859, 6059506, 5955527, 5845276, 5729004, 5607874, 5483044, 5355291, 5225857, 5096986, 4971111, 4849978, 4734871, 4627030, 4527347, 4436115, 4353493, 4279834, 4215303, 4159826, 4113716, 4077593, 4051147, 4032665, 4020395, 4013936, 4013774, 4019976, 4031810, 4048116, 4067408, 4088043, 4108987, 4130314, 4152693, 4176680, 4202689, 4231095, 4262121, 4296156, 4334417, 4378711, 4430389, 4490164, 4559084, 4638703, 4729993, 4833086, 4948538, 5077929, 5222714, 5383574, 5561531, 5758580, 5976236, 6214290, 6471950, 6749477, 7047692, 7366382, 7704002, 8058313, 8426356, 8804089, 9186813, 9569813, 9948424, 10318279, 10676051]
59541A0676051L43378L26725L07939K88572K70421K53557K37203K21850K08438
59532A3134134J96074J83339J71706J64855J64023J66423J68616J68734J64580
59523A4682484J52507J29902R6876N4268K069n8784j24912j92446k58975l22344
59513A4160645l79190m26448m63106m89260n04686n09821n06789m97937m84088
59504I899320m65473m43288m19060l93340l66283l38749l11620k84774k57812
59495F618921k31220k05860j81930j59234j37797j17537r7898p8564n9802m1677
59485E307402k3646n327J3193L2086N1766P1966R2018J12360J34275J57821J81526
59474F125440K04633K27897K51381K73219K91442L05353L14164L15891L08948
$$ y = [10676051, 11019429, 11346154, 11654093, 11942665, 12213086, 12466643, 12703846, 12925696, 13134134, 13330208, 13513547, 13685253, 13850108, 14014131, 14180554, 14349170, 14517904, 14682484, 14834991, 14964893, 15061769, 15116037, 15118106, 15059322, 14934410, 14741964, 14482989, 14160645, 13781455, 13355007, 12891901, 12402641, 11897955, 11388134, 10881345, 10383408, 9899320, 9433847, 8990559, 8571499, 8178159, 7811876, 7473127, 7161507, 6876733, 6618921, 6387701, 6181841, 5999911, 5840677, 5702880, 5585343, 5487445, 5408881, 5349079, 5307402, 5283756, 5278429, 5291622, 5323708, 5375474, 5447440, 5539458, 5651818, 5786093, 5943914, 6125440, 6330073, 6557970, 6809351, 7082570, 7374012, 7679365, 7993529, 8309420, 8618368]
59465H618368K93252K68608K33638J87902J33811P4945J3605m8561j08836j64089
59455I502643k12538k53443k85888l09244l24170l31908l33097l28377l19365
59446F804613l07855k94506k79307k62733k45580k28253k11019j94358j78452
59437D602550j62918j47656j33169j19723j07075r5311q4797p5041o5040n5073
59427C556747m6486l9276l1761k3334j5510r304l724J996O733R611J1868J5014
59415C432574J8804K2648K7206L2893L8569M3439M8362N3428N6351N5806N4641
59404C884721N7024O3810P3330Q5354J01039J19785J39435J59455J81017K03926
59394E068896K26243K47608K70665K98507L32349L71858M16010M63150N11441
$$ y = [8618368, 8911620, 9180228, 9413866, 9601768, 9735579, 9810524, 9824129, 9775568, 9666732, 9502643, 9290105, 9036662, 8750774, 8441530, 8117360, 7785452, 7452355, 7123978, 6804613, 6496758, 6202252, 5922945, 5660212, 5414632, 5186379, 4975360, 4781002, 4602550, 4439632, 4291976, 4158807, 4039084, 3932009, 3836698, 3751901, 3676860, 3611820, 3556747, 3510261, 3470985, 3439224, 3415890, 3400380, 3391076, 3387352, 3389348, 3396081, 3405692, 3417560, 3432574, 3451378, 3474026, 3501232, 3534125, 3572694, 3616133, 3664495, 3717923, 3774274, 3830080, 3884721, 3941745, 4005555, 4078885, 4164239, 4265278, 4385063, 4524498, 4683953, 4864970, 5068896, 5295139, 5542747, 5813412, 6111919, 6444268, 6816126, 7232136, 7695286, 8206727]
59385H206727N59507O05702O47136O80723P04666P17621P17263P01801O72601
59376A4213747O33443N87346N35877M81290M26990L75329L26474K79720K34503
59367A8094719J89825J44033R5673M3772j2437p2766j35110j96403k54322l06922
59357A7590062l51071l82990m00796m05565m00046l87434l71207l54690l40371
59348A4195892l30220l26155l29125l37985l50348l64271l78357l90899m00313
59339A0988219m05997m07612m04076l94642l80435l63412l44240l22684k99604
59330G665517k76771k54784k32816k10517j88710j68081j48470j29602j11499
59321E944267r4186p7889o3388n1295m1329l3076k6916k3110k0743j8824j7858
$$ y = [8206727, 8766234, 9371936, 10019072, 10699795, 11404461, 12122082, 12839345, 13541146, 14213747, 14847190, 15434536, 15970413, 16451703, 16878693, 17254022, 17580496, 17860216, 18094719, 18284544, 18428577, 18524250, 18568022, 18555585, 18482819, 18347709, 18151306, 17896984, 17590062, 17238991, 16856001, 16455205, 16049640, 15649594, 15262160, 14890953, 14536263, 14195892, 13865672, 13539517, 13210392, 12872407, 12522059, 12157788, 11779431, 11388532, 10988219, 10582222, 10174610, 9770534, 9375892, 8995457, 8632045, 8287805, 7965121, 7665517, 7388746, 7133962, 6901146, 6690629, 6501919, 6333838, 6185368, 6055766, 5944267, 5850081, 5772192, 5708804, 5657509, 5616180, 5583104, 5556188, 5533078, 5512335, 5493511, 5475653]
59310E475653j8927k1819k5401k9291l3646l7883m1167m3735m6208m7974m7886
59299E081716m6048m3372l9772l4405k7330j9263j0082P73J2782K4999L7792N2163
59287D989953O7636Q2757R7454J12954J29416J45605J60911J75732J89698K01336
59277F353452K09788K15158K16986K13930K05300J91466J72758J49383J22445
59268H050666R3519O3261L1882N83k9153n7536q5596j12367j34913j51400j62298
59257G506648j68458j70129j68302j64878j60640j54590j46011j35691j24570
59248F113379j12601r9528q5437p0027n2609l3249j2719R002L2951N9624Q8490
59237E837276J19229J52244J87759K25530K65462L07184L49043L88810M25208
$$ y = [5475653, 5456726, 5434907, 5409506, 5380215, 5346569, 5308686, 5267519, 5223784, 5177576, 5129602, 5081716, 5035668, 4992296, 4952524, 4918119, 4890789, 4871526, 4861444, 4862217, 4874999, 4899998, 4937790, 4989953, 5057589, 5140346, 5237800, 5350754, 5480170, 5625775, 5786686, 5962418, 6152116, 6353452, 6563240, 6778398, 6995384, 7209314, 7414614, 7606080, 7778838, 7928221, 8050666, 8144185, 8207446, 8239328, 8239911, 8210758, 8153222, 8067626, 7955259, 7820346, 7668946, 7506648, 7338190, 7168061, 6999759, 6834881, 6674241, 6519651, 6373640, 6237949, 6113379, 6000778, 5901250, 5815813, 5745786, 5693177, 5659928, 5647209, 5656211, 5689162, 5748786, 5837276, 5956505, 6108749, 6296508, 6522038, 6787500, 7094684, 7443727, 7832537, 8257745]
59228H257745M57205M82018M95578M95006M79015M46186L95236L27395K46468
59219A2081852J56049N8510m2855j42781k36086l19189l89146m43217m80453n02354
59209I740330n11000n07743m94320m73693m48821m21428l92556l63206l34008
59200E793555l05298k77848k52492k29009k06586j85454j66605j50004j34629
59191C885630j20439j08436r8547q9318q0088p1745o4848n8697n2772m7345m2197
59180C051198l6424l0113k4484j9796j4818q969l238J718O595J1875J6923K1499
59168B971966K6474L2172L7593M2180M6747N1708N5900N8243N9197N9577N9218
59157C500975N7691N5175N1683M6658M0084L2908K5675J7931R524J270o225j3131
$$ y = [8257745, 8714950, 9196968, 9692546, 10187552, 10666567, 11112753, 11507989, 11835384, 12081852, 12237901, 12296411, 12253556, 12110775, 11874689, 11555500, 11166354, 10723137, 10242684, 9740330, 9229330, 8721587, 8227267, 7753574, 7304753, 6883325, 6490769, 6127563, 5793555, 5488257, 5210409, 4957917, 4728908, 4522322, 4336868, 4170263, 4020259, 3885630, 3765191, 3656755, 3558208, 3468890, 3388802, 3317057, 3252209, 3193512, 3140740, 3093395, 3051198, 3014774, 2984661, 2960177, 2940381, 2925563, 2916594, 2913356, 2915074, 2921669, 2933544, 2950467, 2971966, 2998440, 3030612, 3068205, 3110385, 3157132, 3208840, 3264740, 3322983, 3382180, 3441757, 3500975, 3558666, 3613841, 3665524, 3712182, 3752266, 3785174, 3810849, 3828780, 3838304, 3839574, 3833349, 3820218]
59145C820218j9258k3799k6688k8832l0411l0461k8730k6314k3747k0074j4654
59134C547250q360k111M415J1775J9860K8737L8974N0369O1776P2900Q4842R8177
59122D008604J12023J25799J40354J56425J73478J90887K08875K27379K45456
59113E589280K62642K79488K95816L09823L19597L24087L21860L10574K88707
59104H301874K56370K13802J60786R8798L2015l4862r8660j56922k07093k47755
59094H318353k79310l02288l16422l22361l22661l19701l13911l05086k94017
59085E542596k81675k68184k53787k39440k25438k10880j95510j80657j67277
59076C519748j54707j42481j31660j22921j14901j06049r6854q8736q1901p5702
$$ y = [3820218, 3800960, 3777161, 3750473, 3721641, 3691230, 3660769, 3632039, 3605725, 3581978, 3561904, 3547250, 3538890, 3536779, 3541194, 3552969, 3572829, 3601566, 3640540, 3690909, 3752685, 3825585, 3910427, 4008604, 4120627, 4246426, 4386780, 4543205, 4716683, 4907570, 5116445, 5343824, 5589280, 5851922, 6131410, 6427226, 6737049, 7056646, 7380733, 7702593, 8013167, 8301874, 8558244, 8772046, 8932832, 9031630, 9063645, 9028783, 8930123, 8773201, 8566108, 8318353, 8039043, 7736755, 7420333, 7097972, 6775311, 6455610, 6141699, 5836613, 5542596, 5260921, 4992737, 4738950, 4499510, 4274072, 4063192, 3867682, 3687025, 3519748, 3365041, 3222560, 3090900, 2967979, 2853078, 2747029, 2650175, 2561439, 2479538, 2403836]
59066B403836o9994o4755n9341n3357m7444m2245l7660l3787l1201k9516k7288
59055A907248k4312k2343k2427k3260k3492k3840k5350k7237k8136k8177k8128
59044A630546k7795k6731k5276k3487k0361j5713j1410r086p852n840k890k4K572
59031A456653N398Q369J1195J4161J7301J9718K0819K1081K0681J8828J5498J2145
59019A641847R452O230K058j023j371m27l59o21O93L481O121Q328J1030J4032
59005A699471J6097J7014J7521J7553J6342J3958J1165Q174M949K156M06p90k062
58992A821954k920k799k354k349k190j015O19J718K583M046N868P385Q864J0810
58978A850220J2832J4494J6317J8515K0038K0354K0968K3438K7104L0442L3466
$$ y = [2403836, 2333842, 2269087, 2209746, 2156389, 2108945, 2066700, 2029040, 1995253, 1964052, 1934536, 1907248, 1882936, 1860593, 1838166, 1814906, 1791414, 1767574, 1742224, 1714987, 1686851, 1658674, 1630546, 1602751, 1576020, 1550744, 1527257, 1506896, 1491183, 1479773, 1470687, 1462835, 1456995, 1454105, 1454081, 1456653, 1462051, 1470420, 1481615, 1495776, 1513077, 1532795, 1553614, 1574695, 1595376, 1614204, 1629702, 1641847, 1651299, 1657529, 1659587, 1658564, 1657193, 1656766, 1656407, 1655786, 1656479, 1659960, 1666081, 1674409, 1685439, 1699471, 1715568, 1732582, 1750103, 1767656, 1783998, 1797956, 1809121, 1817295, 1822244, 1824400, 1824806, 1824016, 1821954, 1819034, 1816235, 1813881, 1811532, 1809342, 1808327, 1808946, 1810664, 1813247, 1817293, 1823161, 1830546, 1839410, 1850220, 1863052, 1877546, 1893863, 1912378, 1932416, 1952770, 1973738, 1997176, 2024280, 2054722, 2088188]
58967B088188L6909M0128M1998M2949M4229M5754M6546M6586M6488M6117M5231
58956B571123M4711M5544M7267M9063N1444N5301O0158O5030P0170P6360Q3356
58945C219527R0583R8352J06930J15535J23824J33108J44408J56655J68634J81298
58935D538854J96168K12832K30127K48490K68986K91350L15255L42176L73546
58926G017784M08239M44432M82781N25136N71218O19373O69535P22387P76171
58917A2237056Q27380Q74012R15100R47341R65276R64903R44279R00593Q29890
58908B0405830P30717O05915M60395K99319J29003m2620k07559l59033m91626
58899B1530341o02077o90023p56610q02440q28123q36187q30447q13757p87961
$$ y = [2088188, 2125097, 2165225, 2207223, 2250172, 2294401, 2340155, 2386701, 2433287, 2479775, 2525892, 2571123, 2615834, 2661378, 2708645, 2757708, 2809152, 2864453, 2924611, 2989641, 3059811, 3136171, 3219527, 3310110, 3408462, 3515392, 3630927, 3754751, 3887859, 4032267, 4188922, 4357556, 4538854, 4735022, 4947854, 5177981, 5426471, 5695457, 5986807, 6302062, 6644238, 7017784, 7426023, 7870455, 8353236, 8878372, 9449590, 10068963, 10738498, 11460885, 12237056, 13064436, 13938448, 14853548, 15800889, 16766165, 17731068, 18675347, 19575940, 20405830, 21136547, 21742462, 22202857, 22502176, 22631179, 22588559, 22381000, 22021967, 21530341, 20928264, 20238241, 19481631, 18679191, 17851068, 17014881, 16184434, 15370677, 14582716]
58890A4582716p55522p19239o80527o39737n97995n57043n17692m80086m45123
58881I189752m13931l86309l61325l38902l19197l01058k82963k64981k48174
58872F272912k32551k17360k02627j88739j75179j61422j48340j37000j26868
58863D682826j16887j07335r8817r0574q1693p2793o4583n6128m6721l7924l1245
58852C878126k5265j7789r468k330M025J1572K0228K8340L5921M4183N2601N9811
58840D079955O6865P6145Q7487R8634J09231J20948J33929J46671J59394J74082
58830E253341J90955K08246K25761K45421K67973K92238L18035L46798L79008
58821G727776M13957M52303M95753N43737N93465O43697O95436P48347P99430
$$ y = [14582716, 13827194, 13107955, 12427428, 11787691, 11189696, 10632653, 10114961, 9634875, 9189752, 8775821, 8389512, 8028187, 7689285, 7370088, 7069030, 6786067, 6521086, 6272912, 6040361, 5823001, 5620374, 5431635, 5256456, 5095034, 4946694, 4809694, 4682826, 4565939, 4458604, 4359787, 4269213, 4187520, 4114727, 4050144, 3994016, 3947295, 3909371, 3878126, 3852861, 3835072, 3825604, 3823274, 3827299, 3838871, 3859099, 3887439, 3923360, 3967543, 4020144, 4079955, 4146820, 4222965, 4310452, 4409086, 4518317, 4639265, 4773194, 4919865, 5079259, 5253341, 5444296, 5652542, 5878303, 6123724, 6391697, 6683935, 7001970, 7348768, 7727776, 8141733, 8594036, 9089789, 9633526, 10226991, 10870688, 11566124, 12314471, 13113901]
58812A3113901Q45789Q85710R16237R32490R30172R06478Q58355P82876O80216
58803B0852224N53944M08170K47060P7281r2258k53936m02486n32765o39963p22767
58793A9494504p83427q23969q45095q49116q40608q23058p97501p65339p29542
58784A2236849o92180o53386o13674n74779n37387n00667m64837m31608m01494
58775G366837l73212l46461l22658l02227k83794k66683k51559k38010k24234
58766D757999k09865j96442j84503j72831j61112j50452j40782j30580j19787
58757C291645j10089j01752r3236q4469p7324p2079o6682o0415n5006n1182m7390
58746B472021m3045l9726l7849l5391l1392k7806k6386k6500k7184k8578l0105
$$ y = [13113901, 13959690, 14845400, 15761637, 16694127, 17624299, 18530777, 19389132, 20172008, 20852224, 21406168, 21814338, 22061398, 22138679, 22046421, 21792485, 21389999, 20857234, 20217271, 19494504, 18711077, 17887108, 17042013, 16192897, 15352289, 14529231, 13731730, 12966391, 12236849, 11544669, 10891283, 10277609, 9702830, 9165443, 8664776, 8199939, 7768331, 7366837, 6993625, 6647164, 6324506, 6022279, 5738485, 5471802, 5220243, 4982233, 4757999, 4548134, 4351692, 4167189, 3994358, 3833246, 3682794, 3542012, 3411432, 3291645, 3181556, 3079804, 2986568, 2902099, 2824775, 2752696, 2686014, 2625599, 2570593, 2519411, 2472021, 2428976, 2389250, 2351401, 2316010, 2284618, 2256812, 2230426, 2203926, 2176742, 2148164, 2118059]
58735B118059l0206k9061k8812k9998l0776l0537l1093l3039l4383l4181l4194
58724A771779l5366l5964l4890l3720l3589l3198l1629l0139k9391k7896k5097
58713A420900k2931k2413k1669j9364j7162j6597j6341j4837j3072j2448j2282
58702A231784j1454j0389r495p956n736m541n118o043o596q201j1390j4177j5155
58689A115533j5520j6299j6342j4960j3676j3393j2526j0034p612o788o406m980
58677I76997l085j488N52L158M605M073L128K735J555r43k633k061q08l52N43
58662I85976L003N320N548M385L261J894j9j117n33M64R02J811L802N569O405
58647A026671P564R420J0379J0283J1627J5368J8896K0420K1901K5241K9006L1661
$$ y = [2118059, 2087853, 2058792, 2029980, 1999982, 1969206, 1938669, 1907576, 1874537, 1840154, 1805973, 1771779, 1736413, 1700449, 1665559, 1631839, 1598250, 1565052, 1533423, 1503284, 1473893, 1445997, 1420900, 1397969, 1375556, 1353887, 1334523, 1317361, 1300764, 1284423, 1269586, 1256514, 1244066, 1231784, 1220330, 1209941, 1200446, 1192490, 1186754, 1182213, 1177095, 1171052, 1164456, 1156255, 1144865, 1130688, 1115533, 1100013, 1083714, 1067372, 1052412, 1038736, 1025343, 1012817, 1002783, 995171, 988383, 981977, 976997, 973912, 972424, 972976, 976134, 980739, 984812, 987940, 990675, 992230, 991287, 988654, 986593, 985785, 985433, 985976, 988979, 994299, 999847, 1004232, 1007493, 1009387, 1009368, 1008251, 1007718, 1008182, 1009084, 1010895, 1014697, 1020266, 1026671, 1034235, 1043655, 1054034, 1064317, 1075944, 1091312, 1110208, 1130628, 1152529, 1177770, 1206776, 1238437]
58635A238437L4735L9695M4839M8378N1822N7276O4032P0748P8391Q8185R9209
58624A915747J10702J24134J40375J57619J74653J93208K14366K35714K54860
58615C521378K72515K89043L01069L04804K99738K85896K60701K22309J73435
58606E930888J18468N9461j796o0755j12934j57244j93424k19129k33223k39071
58596D891241k40736k38424k31094k20555k09145j96204j80824j65348j52159
58587C056752j39631j25445j11261r9889r0414q0479p1095o4691o0561n6566n3370
58576B103350n2629n2979n1946n0034m8898m7534m4377m0929l9164l7498l3656
58565A603706k9258k7109k6133k3738k1112k1168k2960k3175k1836k1579k2421
$$ y = [1238437, 1273172, 1312867, 1357706, 1406084, 1457906, 1515182, 1579214, 1649962, 1728353, 1816538, 1915747, 2026449, 2150583, 2290958, 2448577, 2623230, 2816438, 3030804, 3266518, 3521378, 3793893, 4082936, 4384005, 4688809, 4988547, 5274443, 5535144, 5757453, 5930888, 6049356, 6108817, 6107021, 6046266, 5933332, 5776088, 5582664, 5363535, 5130312, 4891241, 4650505, 4412081, 4180987, 3960432, 3751287, 3555083, 3374259, 3208911, 3056752, 2917121, 2791676, 2680415, 2580526, 2490112, 2409633, 2338538, 2273847, 2213286, 2156720, 2103350, 2050721, 1997742, 1945796, 1895762, 1846864, 1799330, 1754953, 1714024, 1674860, 1637362, 1603706, 1574448, 1547339, 1521206, 1497468, 1476356, 1455188, 1432228, 1409053, 1387217, 1365638, 1343217]
58554A343217k1998k0132j8697j7811j6231j4612j4356j4399j2995j1411j1954
58543A168621j3781j4507j4474j5424j6590j6178j5140j5349j5755j4481j2898
58532A004044j3307j4410j3567j1752j1636j2517j1913j0548j0839j1942j1261
58521H70352r500r308j0153r402p343o282n873m177k125k077l060k329m08J87
58507G98502k1J214K873K291N76J101L493M402L507L435M478M580M042N012O795
58492H46280O753N399N591P184P354N776M581L827J840n61j159q99k455n037n644
58477H78830m613m769n923n570m245m727o494o436m697m334n587n832m934n286
58463H05383o806p087o240o538p627p171n689n591o166m802k439k279l776l495
$$ y = [1343217, 1321219, 1301087, 1282390, 1264579, 1248348, 1233736, 1219380, 1204981, 1191986, 1180575, 1168621, 1154840, 1140333, 1125859, 1110435, 1093845, 1077667, 1062527, 1047178, 1031423, 1016942, 1004044, 990737, 976327, 962760, 951008, 939372, 926855, 914942, 904394, 893555, 881613, 870352, 860852, 851544, 841391, 831989, 824646, 818364, 812491, 808314, 806189, 804112, 801052, 798723, 798315, 798502, 798481, 799695, 802568, 804859, 805435, 806536, 810029, 814431, 817938, 821373, 825851, 830431, 834473, 839485, 846280, 853033, 858432, 864023, 871207, 878561, 884337, 888918, 892745, 894585, 894024, 892865, 891966, 889511, 884474, 878830, 874217, 869448, 863525, 857955, 853710, 848983, 842489, 836053, 831356, 827022, 821435, 815603, 810669, 805383, 798577, 791490, 785250, 778712, 771085, 763914, 758225, 752634, 746468, 741666, 739227, 736948, 733172, 729677]
58449G29677j317k19l89P49L205M587N066O654Q413P988O915Q545J1746J2666
58435H04286J1580J1616J1950R147M459K513L197J988j762m037l679l712m850
58422H42696m647l327l807n577n208l047k711l980l064P6J754J840L787P254Q211
58407H30250O590O517Q435Q576O646O475Q288P916M508J717N83j437l874l331
58393H87859o94n83l049l504j343n73j456J8L662M717K859K955N802O814N114
58378I08598N025P135O892L735K641M788N647M125M568P672Q613O423O089Q979
58364I90930J0246Q151O921P976P447M804M682P683Q655O513O315R111R571O363
58350A095368M878O790O988L915K735M886M841Q42j413M73J492l97k63L506N433
$$ y = [729677, 728360, 728141, 727752, 728501, 731706, 736293, 741359, 748013, 756426, 764414, 771329, 779874, 791620, 804286, 815866, 827482, 839432, 848579, 853038, 855551, 858748, 860736, 858974, 854937, 851258, 847546, 842696, 838049, 834722, 830915, 825338, 820130, 817083, 814372, 810392, 807328, 807404, 809158, 810998, 814785, 822039, 830250, 836840, 843357, 851792, 860368, 867014, 873489, 881777, 889693, 894201, 895918, 896501, 895064, 891190, 887859, 887165, 886582, 883533, 880029, 878686, 878113, 876657, 876675, 880337, 885054, 887913, 890868, 896670, 903484, 908598, 913623, 920758, 927650, 931385, 934026, 938814, 944461, 948586, 953154, 960826, 969439, 975862, 981951, 990930, 1001176, 1009327, 1016248, 1024224, 1031671, 1036475, 1041157, 1048840, 1057495, 1064008, 1070323, 1079434, 1089005, 1095368, 1100246, 1107036, 1114024, 1117939, 1120674, 1125560, 1130401, 1131243, 1129830, 1130303, 1131795, 1131398, 1131135, 1134641, 1140074]
58335A140074L636L712P760J0063Q250P986J1913J4524J2917J2019J4273J4815
58323A261942J1840J0944J4165J5586J2906J2181J5928J7915J5236J4000J7291
58312A419934J9064J6004J3761J5295J4865R885O846Q942R847O413N263R818J3186
58299A569123J1282J0475J4753J7801J5674J4735J8936K1864J9582J8712K3293
58288A756230K6477K3896K2367K6496K9600K7037K5486K9679L3068L1039L0293
58277B061668L5558M0310L9970M0758M6074M8245M3362L9770M2212M2696L7018
58266B517641L4351L9768M3742M0294L8766M5580N1441M9384M8257N4961O0708
58255C024893N8753N8232O6071P2874P1526P1703Q0862Q9195Q9014R0154J00106
$$ y = [1140074, 1143710, 1147422, 1155182, 1165245, 1173495, 1181481, 1193394, 1207918, 1220835, 1232854, 1247127, 1261942, 1273782, 1284726, 1298891, 1314477, 1327383, 1339564, 1355492, 1373407, 1388643, 1402643, 1419934, 1438998, 1455002, 1468763, 1484058, 1498923, 1508808, 1515654, 1524596, 1534443, 1540856, 1546119, 1555937, 1569123, 1580405, 1590880, 1605633, 1623434, 1639108, 1653843, 1672779, 1694643, 1714225, 1732937, 1756230, 1782707, 1806603, 1828970, 1855466, 1885066, 1912103, 1937589, 1967268, 2000336, 2031375, 2061668, 2097226, 2137536, 2177506, 2218264, 2264338, 2312583, 2355945, 2395715, 2437927, 2480623, 2517641, 2551992, 2591760, 2635502, 2675796, 2714562, 2760142, 2811583, 2860967, 2909224, 2964185, 3024893, 3083646, 3141878, 3207949, 3280823, 3352349, 3424052, 3504914, 3594109, 3683123, 3773277, 3873383]
58244C873383J08301J06884J07069J17558J27148J26848J28198J40841J53421
58235D989651J56269J60849J76548J91077J94849K01108K20162K38477K45859
58226F774849K57320K84160L10760L25218L44195L80670M17266M40091M67467
58217A0001996N14760N64059O01156O47431P20248P98771Q66589R49013J067929
58208A6731952J201405J331781J489414J701868J948026K213894K541380K965807
58200C2125527L464142M029524M734679N653579O794682Q188297R947146J2144377
58192H7081953J4743406J7765375K1361243K5495255K9674303L3231362L5692711
58185B65045608L6425425L4033956K6905549J4942978N31637j2705036k2196730
$$ y = [3873383, 3981684, 4088568, 4195637, 4313195, 4440343, 4567191, 4695389, 4836230, 4989651, 5145920, 5306769, 5483317, 5674394, 5869243, 6070351, 6290513, 6528990, 6774849, 7032169, 7316329, 7627089, 7952307, 8296502, 8677172, 9094438, 9534529, 10001996, 10516756, 11080815, 11681971, 12329402, 13049650, 13848421, 14715010, 15664023, 16731952, 17933357, 19265138, 20754552, 22456420, 24404446, 26618340, 29159720, 32125527, 35589669, 39619193, 44353872, 50007451, 56802133, 64990430, 74937576, 87081953, 101825359, 119590734, 140951977, 166447232, 196121535, 229352897, 265045608, 301471033, 335504989, 362410538, 377353516, 377885153, 365180117, 342983387]
58178C42983387k7467165k9379044k8997222k7200237k4751453k2223127j9860896
58171A63104243j7684858j5684960j3857966j2170935j0609250r217194q027843
58164G5851237p004440o096322n294370m590680l943066l319909k729540k175926
58156D0696984j634612j089811n40596L6697O64268J294228J837332K252153K496202
58147D6012845K383455J655389K99882j294740k613445l399344l712525l710796
58139C5620721l505101l187781k854225k552882k276986k020740j796649j600097
58131A5826260j409981j228342j077085r56188q44631p39618o56616n93734n32580
58122G787485m72068m27371l97933l68205l36930l15398l00168k76829k47496
$$ y = [342983387, 315516222, 286137178, 257139956, 229939719, 205188266, 182965139, 163104243, 145419385, 129734425, 115876459, 103705524, 93096274, 83879080, 75851237, 68846797, 62750475, 57456105, 52865425, 48922359, 45602450, 42872910, 40696984, 39062372, 37972561, 37431965, 37468662, 38132930, 39427158, 41264490, 43516643, 46012845, 48396300, 50051689, 50351571, 49056831, 46443386, 43044042, 39331517, 35620721, 32115620, 28927839, 26073614, 23520732, 21243746, 19223006, 17426357, 15826260, 14416279, 13187937, 12110852, 11154664, 10310033, 9570415, 8913799, 8320065, 7787485, 7315417, 6888046, 6490113, 6121908, 5784978, 5469580, 5169412, 4892583, 4645087]
58113D645087k26835k14222j96548j74587j60382j52299j38512j21840j15966
58104C143896j19683j19000j12123j09162j09697j03528r1756q5255q3945p8188
58094B131559o8721o4935o5570o0916n2138m9140n1175m8482m1267l8698m0804
58083A549713l9235l4265l3559l5927l3427k7640k6996k9932k7554k1019j9461
58072A220698k2402k0997j5344j3854j6585j5541j0829j0337j3823j3104p995
58061A059887o688j0150j1033q346q654j2311j2681r516r457j2744j2817r427
58049I36063r016j1743j1160p143o285q943q596m607l167m925l971K34J872L99
58035H59012J295M732N201K939L919P774P680L140J159L462M103J306K57K344
$$ y = [4645087, 4418252, 4204030, 4007482, 3832895, 3672513, 3520214, 3381702, 3259862, 3143896, 3024213, 2905213, 2793090, 2683928, 2574231, 2470703, 2378947, 2293692, 2209747, 2131559, 2062838, 1997903, 1932333, 1871417, 1819279, 1770139, 1718964, 1670482, 1629215, 1590517, 1549713, 1510478, 1476213, 1442654, 1406727, 1373300, 1345660, 1318664, 1288732, 1261178, 1240159, 1220698, 1198296, 1177299, 1161955, 1148101, 1131516, 1115975, 1105146, 1094809, 1080986, 1067882, 1059887, 1053199, 1043049, 1032016, 1023670, 1015016, 1002705, 990024, 980508, 971051, 958307, 945490, 936063, 927047, 915304, 904144, 897001, 890716, 881773, 873177, 868570, 865403, 860478, 856507, 856741, 858613, 859012, 860307, 865039, 870240, 873179, 877098, 884872, 892552, 895692, 896851, 900313, 904416, 905722, 905979, 908323]
58021I08323K574k97j481R8q7k747l305j372j884n337o583m699m483o755o844
58006H65121m092l251m954m328p31O50j317j671R24J611j469m156m461n345p491
57991H25040p615n658n466p006o036k661j641l195k293J596L123R73J20K246K937
57976G94464O30l44J773L062J707Q44J401J54k849l120k11P68j544k260N17K205
57960G97197M21j013J92Q45p27j323K13J21k922m702l098j725k788l118p54J247
57944G78066R79J167L212M082K396J391K623K873L81j865k111k955n547o822n620
57929G72250n523q360j0790j0481r812j0400r812o958m962n478n639l783k548
57916F77704l275l008l03J646R09L27J887L117K399K392M735O649O241O067P958
$$ y = [908323, 910897, 910600, 909119, 909217, 909130, 906383, 903078, 901706, 899822, 894485, 887902, 883203, 878720, 871965, 865121, 861029, 857778, 852824, 848496, 847765, 848415, 847098, 845427, 846351, 847962, 846493, 842337, 837876, 832531, 825040, 817425, 811767, 806301, 799295, 793259, 790598, 788957, 785762, 783469, 785065, 788188, 789161, 789281, 791527, 794464, 795094, 794750, 796523, 799585, 801292, 802136, 803537, 803691, 800842, 797722, 797511, 798279, 796735, 794475, 794992, 797197, 797618, 796605, 796797, 797642, 796915, 795592, 795805, 795926, 793004, 788302, 785204, 783479, 780691, 777573, 776819, 778066, 779045, 780212, 783424, 787506, 789902, 791293, 793916, 796789, 797170, 795305, 793194, 790239, 784692, 777870, 772250, 766727, 758367, 747577, 737096, 727284, 716884, 707072, 700114, 695152, 689674, 684035, 680252, 677704, 674429, 671421, 671118, 672764, 673673, 674000, 675887, 679004, 681403, 683795, 688530, 695179, 701420, 707487, 715445]
57901G15445R413Q523P551Q237Q420O603N077N303M944K603O67M51m40k998m234
57886G75565k905k442m804o737n744m530n588o518m877k863k939l282j773k17
57872G20346m94o51J195L085L256L812O487Q765Q206O815P122P741O703N535O017
57857G93940O485N166L756L950L873J751l44j84N13o53k593l383l879n249o068
57842G97081n225m530n246n417l734k490l394m222l011j811k661l734l189l021
57828G45396n034o766n748m243n369p729q461q408r754j1299j0663q793p944p561
57814F37624o200n104n787o452m906k724k476l101k105j50N54M49J290K521K704
57799F06137K662L712M718M393M361O431R028R881J0021J1379J2780J2104J0400
$$ y = [715445, 724858, 733381, 740932, 749169, 757589, 764192, 769269, 774572, 779516, 782119, 782786, 783237, 782797, 779799, 775565, 772660, 770218, 765414, 758677, 752933, 748403, 742815, 736297, 731420, 728557, 725618, 722336, 720563, 720346, 719852, 719201, 720396, 723481, 726737, 730549, 737036, 745801, 754007, 760822, 767944, 775685, 782388, 787923, 793940, 800425, 805591, 809347, 813297, 817170, 818921, 818577, 818393, 818906, 818253, 815660, 812277, 808398, 803149, 797081, 791856, 787326, 782080, 776663, 772929, 770439, 767045, 762823, 759812, 758001, 755340, 751606, 748417, 745396, 740362, 733596, 727848, 723605, 718236, 710507, 702046, 693638, 683884, 672585, 661922, 653129, 645185, 637624, 631424, 626320, 620533, 614081, 609175, 606451, 603975, 600874, 598769, 598619, 599173, 599622, 600912, 603433, 606137, 608799, 612511, 617229, 621622, 625983, 632414, 641442, 651323, 661344, 672723, 685503, 697607, 708007]
57786G08007R909R956Q652O827O449O800N905M193L189K226q6k745m078m860o491
57771G53853p877p331n818n102m643l465k889m090n230m450l379l976m442k237
57757F88924J117K593K914M794P660Q798Q353Q719R976J0182R369R212R479Q708
57743G90798P584P999R462R947R517R726J0405J0304R895J0237J0293Q745P118
57730I12030P595R075R083Q185Q701J0205J0423R647J0245J2442J4392J5874J8221
57717A056118K1128K3116K4524K6741K9128L0174L0825L3096L6239L8044L9125
57706A388258M2108M7129N1993N6349O1883O8675P5151Q1623R0247J01464J13737
57695B178617J26676J41293J57405J73896J91231K10525K30529K48641K64212
$$ y = [708007, 717916, 727872, 736524, 743351, 749800, 756600, 762505, 766698, 769887, 772113, 772027, 769282, 765204, 760344, 753853, 745976, 738645, 732827, 727725, 723082, 719617, 716728, 712638, 707408, 702958, 699579, 695603, 691161, 688924, 690041, 692634, 695548, 700342, 708002, 716800, 725153, 733872, 743848, 754030, 763399, 772611, 782090, 790798, 798382, 806381, 815843, 825790, 835307, 845033, 855438, 865742, 875637, 885874, 896167, 904912, 912030, 919625, 928700, 937783, 945968, 954669, 964874, 975297, 984944, 995189, 1007631, 1022023, 1037897, 1056118, 1077246, 1100362, 1124886, 1151627, 1180755, 1210929, 1241754, 1274850, 1311089, 1349133, 1388258, 1430366, 1477495, 1529488, 1585837, 1647720, 1716395, 1791546, 1873169, 1963416, 2064880, 2178617, 2305293, 2446586, 2603991, 2777887, 2969118, 3179643, 3410172, 3658813, 3923025]
57686C923025K77562K86358K86527K76404K56677K26956J86280J36908Q4061L1968
57676E972726j6783n8705r0200j10754j21973j23885j15838j00581q3429o7671
57666E082907n5074n0634o1482q9145j26215j61958j88606k02390k02955j93615
57656C750833j79346j62919j44754j26199j09733r5585q1595o7135n4092m3299
57646B686176l3183k2777j3034m182N269J5971K6758L7126M8161O0270P2485Q4769
57634B963809R8485J13986J30070J46381J63843J82261J99806K15300K28501K37761
57624D680203K40078K33961K19889J97574J65493J23764P5215K3229k9201p8352
57614E851853j20560j54710j81672k01265k12371k15970k15045k11186k04128
$$ y = [3923025, 4200587, 4486945, 4773472, 5049876, 5306553, 5533509, 5719789, 5856697, 5940758, 5972726, 5955943, 5897238, 5807038, 5696284, 5574311, 5450426, 5334588, 5234007, 5150578, 5082907, 5027833, 4977199, 4915717, 4826572, 4700357, 4538399, 4349793, 4147403, 3944448, 3750833, 3571487, 3408568, 3263814, 3137615, 3027882, 2932297, 2850702, 2783567, 2729475, 2686176, 2652993, 2630216, 2617182, 2613000, 2618269, 2634240, 2660998, 2698124, 2746285, 2806555, 2879040, 2963809, 3062294, 3176280, 3306350, 3452731, 3616574, 3798835, 3998641, 4213941, 4442442, 4680203, 4920281, 5154242, 5374131, 5571705, 5737198, 5860962, 5936177, 5959406, 5930205, 5851853, 5731293, 5576583, 5394911, 5193646, 4981275, 4765305, 4550260, 4339074, 4134946]
57605D134946j94679j84924j75099j63577j50551j38542j28504j18693j08299
57596B772078r8996r1667q4652p6713o9017o2807n7473n2306m7829m4187m0381
57585B046050l6196l2832l0711k8714k6319k4293k2657k0284j7248j5161j4421
57574A777214j3475j1526r590q171o350m019k424j710l70K010L947M823N880P583
57560A743822Q643Q726R533J1976J4695J6520J8089K0003K1741K3524K6745L1504
57548A955521L6050L9799M4461N0992N8002O4547P1977Q1544R2419J03645J15832
57537B714789J29419J43350J56910J70830J85112J97692K06684K11911K12850
57528D329547K07124J92700J69927J40080J03783O2340J8973k2812o0873r3629
$$ y = [4134946, 3940267, 3755343, 3580244, 3416667, 3266116, 3127574, 2999070, 2880377, 2772078, 2673082, 2581415, 2496763, 2420050, 2351033, 2288226, 2230753, 2178447, 2130618, 2086431, 2046050, 2009854, 1977022, 1946311, 1917597, 1891278, 1866985, 1844328, 1824044, 1806796, 1791635, 1777214, 1763739, 1752213, 1742623, 1734452, 1728102, 1724083, 1721659, 1719949, 1719579, 1721589, 1725536, 1730359, 1736239, 1743822, 1752465, 1761191, 1770724, 1782700, 1797395, 1813915, 1832004, 1852007, 1873748, 1897272, 1924017, 1955521, 1991571, 2031370, 2075831, 2126823, 2184825, 2249372, 2321349, 2402893, 2495312, 2598957, 2714789, 2844208, 2987558, 3144468, 3315298, 3500410, 3698102, 3904786, 4116697, 4329547, 4536671, 4729371, 4899298, 5039378, 5143161, 5205501, 5224474, 5201662, 5140789, 5047160]
57518E047160j19458j37991j50424j57594j59358j56529j51372j45194j37400
57509C731840j27812j17879j08543r9077q9149q0038p2577o5819n8845n2022m5546
57498B814533l8774l2005k6700k2915j8594j2614o335j039L955R420J4759J9706
57486B703397K5408L2475L9985M7462N5687O4609P2909Q0795R0643J03438J17156
57475C433964J30164J43413J57643J71005J81534J89324J94164J93390J84493
57466D979094J67785J44399J13863P6126L4103q219m8699q6044j17839j41916
57456E112653j58417j68519j72564j71269j66989j61652j54881j45963j36058
57447C676341j26571j17055j06777r6710q8020q0092p2101o4908n9447n4766m9670
$$ y = [5047160, 4927702, 4789711, 4639287, 4481693, 4322335, 4165806, 4014434, 3869240, 3731840, 3604028, 3486149, 3377606, 3278529, 3189380, 3109342, 3036765, 2970946, 2912101, 2860079, 2814533, 2775759, 2743754, 2717054, 2694139, 2675545, 2662931, 2656596, 2655557, 2659512, 2668932, 2683691, 2703397, 2728805, 2761280, 2801265, 2848727, 2904414, 2969023, 3041932, 3122727, 3213370, 3316808, 3433964, 3564128, 3707541, 3865184, 4036189, 4217723, 4407047, 4601211, 4794601, 4979094, 5146879, 5291278, 5405141, 5481267, 5515370, 5507151, 5458452, 5372408, 5254569, 5112653, 4954236, 4785717, 4613153, 4441884, 4274895, 4113243, 3958362, 3812399, 3676341, 3549770, 3432715, 3325938, 3229228, 3141208, 3061116, 2989015, 2924107, 2864660, 2809894, 2760224]
57436B760224m4726m0719l6830l2350k8461k6097k3854k0289j6616j4679j3756
57425B461847j1994r595q012p149n901m500l873l533k369p53K56R42K159L489
57411B411014M129M592N685O811P185P557Q815J0165J0601J0830J1741J2397J1724
57398B523246J0788J1061J1815J1626J1054J1441J2235J2187J1965J2849J3958
57387B654225J3594J2394J2276J3069J3009J2012J1610J2081J2338J2288J2721
57376B791617J3178J2568J1534J1697J2793J3139J2617J2669J3448J3594J2871
57365B931725J2530J2908J3029J2795J3319J4744J5820J6023J6218J6913J7526
57354C093550J7663J7669J7797J8105J8971K0420K1357K0948K0119K0183K0686
$$ y = [2760224, 2715498, 2674779, 2637949, 2605599, 2577138, 2551041, 2527187, 2506898, 2490282, 2475603, 2461847, 2449853, 2440258, 2432246, 2425097, 2419196, 2414696, 2410823, 2407290, 2404921, 2404168, 2404424, 2405366, 2407525, 2411014, 2415143, 2419735, 2425420, 2432231, 2439416, 2446973, 2455788, 2465953, 2476554, 2487384, 2499125, 2511522, 2523246, 2534034, 2545095, 2556910, 2568536, 2579590, 2591031, 2603266, 2615453, 2627418, 2640267, 2654225, 2667819, 2680213, 2692489, 2705558, 2718567, 2730579, 2742189, 2754270, 2766608, 2778896, 2791617, 2804795, 2817363, 2828897, 2840594, 2853387, 2866526, 2879143, 2891812, 2905260, 2918854, 2931725, 2944255, 2957163, 2970192, 2982987, 2996306, 3011050, 3026870, 3042893, 3059111, 3076024, 3093550, 3111213, 3128882, 3146679, 3164784, 3183755, 3204175, 3225532, 3246480, 3266599, 3286782, 3307468]
57343C307468K0430J9820K0134K1131K1496K1196K1233K1490K0982J9975J9694
57332C535049K0201K0560K0834K1789K2935K3002K2198K1929K2453K2834K3015
57321C776799K3848K5225K6180K6646K7218K7471K6682K5787K6336K7745K7949
57310D067886K6712K5902K6369K6984K6976K6950K7283K7535K7857K8989L0602
57299D370045L1530L1788L2573L4094L5314L5920L6718L7990L9244M0592M2505
57288D768313M4350M5039M5008M5473M6106M5694M4716M4643M4661M1949L5728
57277E251680K8420K2173J6625J0824N040l10n532j0476j4153j6248j7484j8046
57265E252513j7348j5611j3939j2514j0564q292o841o141m819k597p18L50J443
$$ y = [3307468, 3327898, 3347718, 3367852, 3388983, 3410479, 3431675, 3452908, 3474398, 3495380, 3515355, 3535049, 3555250, 3575810, 3596644, 3618433, 3641368, 3664370, 3686568, 3708497, 3730950, 3753784, 3776799, 3800647, 3825872, 3852052, 3878698, 3905916, 3933387, 3960069, 3985856, 4012192, 4039937, 4067886, 4094598, 4120500, 4146869, 4173853, 4200829, 4227779, 4255062, 4282597, 4310454, 4339443, 4370045, 4401575, 4433363, 4465936, 4500030, 4535344, 4571264, 4607982, 4645972, 4685216, 4725808, 4768313, 4812663, 4857702, 4902710, 4948183, 4994289, 5039983, 5084699, 5129342, 5174003, 5215952, 5251680, 5280100, 5302273, 5318898, 5329722, 5334762, 5334452, 5328920, 5318444, 5304291, 5288043, 5270559, 5252513, 5235165, 5219554, 5205615, 5193101, 5182537, 5174245, 5167404, 5161263, 5156444, 5153847, 5153129, 5153479, 5154922]
57252E154922K610K817K238K522M092N465N925O651Q294R716J0210J0792J2151
57239E238405J3213J3074J2554J2763J3583J4553J5739J6865J7122J6630J6566
57228E401067J7141J7165J6215J5468J5563J5477J4439J3137J2175J1058R668
57217E558573Q953R157R092Q262P943Q994J0277J0549J0392J0839J1446J1200
57205E675677J0300R727R741R866R756R366Q928R058J0140J1474J2104J2361J3351
57192E811849J5036J6382J7285J8433J9390J8982J7722J7481J8382J8437J6866
57181F006245J5229J4518J3728J2305J1532J2026J2298J1273J0103R875R600Q157
57169F146889O388N558N357N014M802M971M717L628K597J963M64k559n647p472
$$ y = [5154922, 5157532, 5160349, 5162587, 5165109, 5169201, 5174666, 5180591, 5187242, 5195536, 5205252, 5215462, 5226254, 5238405, 5251618, 5264692, 5277246, 5290009, 5303592, 5318145, 5333884, 5350749, 5367871, 5384501, 5401067, 5418208, 5435373, 5451588, 5467056, 5482619, 5498096, 5512535, 5525672, 5537847, 5548905, 5558573, 5567526, 5576683, 5585775, 5594037, 5601980, 5610974, 5621251, 5631800, 5642192, 5653031, 5664477, 5675677, 5685977, 5695704, 5705445, 5715311, 5725067, 5734433, 5743361, 5752419, 5762559, 5774033, 5786137, 5798498, 5811849, 5826885, 5843267, 5860552, 5878985, 5898375, 5917357, 5935079, 5952560, 5970942, 5989379, 6006245, 6021474, 6035992, 6049720, 6062025, 6073557, 6085583, 6097881, 6109154, 6119257, 6129132, 6138732, 6146889, 6153277, 6158835, 6164192, 6169206, 6174008, 6178979, 6183696, 6187324, 6189921, 6191884, 6192348, 6189789, 6184142, 6176670]
57155F176670q888j1173j3786j5644j7068j8855k0651k1868k2893k3937k4081
57144E977826k2882k1537k1063k0758j9846j8992j8715j7914j5599j2538r651
57133E778331o410k525N96J894K494L560L965K142j299m895q638j2698j5341j4557
57119E726619j0616m918K404J1330J9791K5273K7826K9286L0691L2825L8112M9142
57107E977765O5924Q6942J12186J42886J79410K22171K73881L38086M16213N08638
57097H324102O18000P48600R03231J083383J291469J529070J792841K074770K365406
57088B0730872K653285K922417L155119L337547L459041L509477L485863L399393
57080D6653014L258947L036016K657843K059794J256893L59046m91345j199950
$$ y = [6176670, 6167782, 6156609, 6142823, 6127179, 6110111, 6091256, 6070605, 6048737, 6025844, 6001907, 5977826, 5954944, 5933407, 5912344, 5891586, 5871740, 5852748, 5834033, 5816119, 5800520, 5787982, 5778331, 5771921, 5769396, 5769992, 5771886, 5774380, 5777940, 5781905, 5784047, 5782748, 5777853, 5769215, 5756517, 5741176, 5726619, 5716003, 5711085, 5713489, 5724819, 5744610, 5769883, 5797709, 5826995, 5857686, 5890511, 5928623, 5977765, 6043689, 6130631, 6242817, 6385703, 6565113, 6787284, 7061165, 7399251, 7815464, 8324102, 8942102, 9690702, 10593933, 11677316, 12968785, 14497855, 16290696, 18365466, 20730872, 23384157, 26306574, 29461693, 32799240, 36258281, 39767758, 43253621, 46653014, 49911961, 52947977, 55605820, 57665614, 58922507, 59281553, 58790208, 57590258]
57072E7590258j749767k172254k505466k773917k986976l140529l220228l211127
57064C5829994l109402k926922k687258k418879k148673j896039j669768j470365
57056A7502688j294933j139508r99237q70491p53970o53723n72275n08162m58119
57047A0252270m19263l88634l63426l43390l30988l27376l29435l32208l32906
57038G084644l31252l27448l21722l14935l07786k99845k90482k80137k69616
57029D341421k58958k47955k36963k26275k15632k05197j95958j88193j80664
57020B385626j72237j63148j53746j43401j31755j19725j08143r6658q5056p4154
57010A137603o4415n5120m6035l8063l1178k3684j4871o186J707J0612K1859L4409
$$ y = [57590258, 55840491, 53668237, 51162771, 48388854, 45401878, 42261349, 39041121, 35829994, 32720592, 29793670, 27106412, 24687533, 22538860, 20642821, 18973053, 17502688, 16207755, 15068247, 14069010, 13198519, 12444549, 11790826, 11218551, 10710389, 10252270, 9833007, 9444373, 9080947, 8737557, 8406569, 8079193, 7749758, 7417550, 7084644, 6753392, 6425944, 6104222, 5789287, 5481501, 5181656, 4891174, 4611037, 4341421, 4082463, 3834508, 3597545, 3371270, 3155638, 2950441, 2754483, 2566290, 2385626, 2213389, 2050241, 1896495, 1753094, 1621339, 1501614, 1393471, 1296813, 1211757, 1137603, 1073188, 1018068, 972033, 933970, 902792, 879108, 864237, 858051, 859758, 870370, 892229, 926638]
56998I26638M7956O4807Q5778J07283J25749J41040J50377J42200J04438M0275
56988A936541k9959q4810j16232j28425j28418j21375j11188j00801r1854q5274
56978I38205q1233p8001p2794o4957n6682m9772m3504l6637k9606k3512j8494
56967C83013j4219j0623p280l338J068M638O895R023J2058J5509J8409K0298K0455
56954D55906J7604J1404L293m756j1477j6015j7861j7632j6765j5800j3992j1042
56942C62867q032n996m616k932n15K530N933R287J2413J5692J9387K2778K4892
56929D53688K5558K4560K0369J1623j20j0886j7943k1506k2918k2869k1845k0599
56917C97112j9402j7918j6133j4407j2564j0238q088p147p008o230m624l439l140
$$ y = [926638, 974594, 1039401, 1125179, 1232462, 1358211, 1499251, 1649628, 1791828, 1896266, 1936541, 1906582, 1821772, 1705540, 1577115, 1448697, 1327322, 1216134, 1115333, 1023479, 938205, 856972, 778971, 706177, 641220, 584538, 534766, 491262, 454625, 425019, 401507, 383013, 368794, 358171, 350891, 347553, 348621, 353259, 360154, 369177, 381235, 396744, 415153, 435451, 455906, 473510, 484914, 488207, 483451, 471974, 455959, 438098, 420466, 403701, 387901, 373909, 362867, 354835, 348839, 344223, 341291, 340776, 343306, 349239, 358526, 370939, 386631, 406018, 428796, 453688, 479246, 503806, 524175, 535798, 535678, 524792, 506849, 485343, 462425, 439556, 417711, 397112, 377710, 359792, 343659, 329252, 316688, 306450, 298362, 291215, 284207, 277977, 273353, 269914, 266774]
56904B66774k783j852j003n71N6J157K258L312M769O360P373Q268J0257J3115
56890C17490J5296J6435J7778J9811K1534K2415K2794K1828J7513R727J106o152
56878D97575j2189j7192j9596j8358j5092j2116r691o835l564o00K133N277R014
56865C98766J3453J9154K6163L3270L9242M4104M8268N0992N0377M4391L1918
56854H00098J4051n202k0894l0579l5042l5714l3098k8087k2762j8452j4386r201
56842E60732k665M910J3543K2978L2367M1531N1334O2006P2247Q0486Q5458Q4714
56830A109641P4470N2903K3045q595l5807n4939o5198o8206o6655o2498n6591
56819H41570m9792m3087l6416k8904k0568j2416m554M093J3811K3521L2592M1415
$$ y = [266774, 263991, 262139, 261136, 260565, 260621, 261778, 264036, 267348, 272117, 278477, 285850, 294118, 304375, 317490, 332786, 349221, 366999, 386810, 408344, 430759, 453553, 475381, 492894, 502621, 503727, 497575, 485386, 468194, 448598, 430240, 415148, 403032, 393341, 386506, 382942, 382342, 384475, 389752, 398766, 412219, 431373, 457536, 490806, 530048, 574152, 622420, 673412, 723789, 768180, 800098, 814149, 808947, 788053, 757474, 722432, 686718, 653620, 625533, 602771, 584319, 569933, 560732, 558067, 562977, 576520, 599498, 631865, 673396, 724730, 786736, 858983, 939469, 1024927, 1109641, 1184111, 1237014, 1260059, 1251464, 1215657, 1160718, 1095520, 1027314, 960659, 898161, 841570, 791778, 748691, 712275, 683371, 662803, 650387, 645833, 649926, 663737, 687258, 719850, 761265]
56807G61265M9554N5030N5852N0554L7416J6034r481l1850m6631n4862n8926n8910
56795G65045n4705m8634m3256l8462l3052k7432k2449j7301j1001m494R28N973
56783D71160J1946J8236K3299K6868K8885K7467K0480Q651m839j7230k7062l3239
56771E54622l5453l5005l3543l1452k8655k5920k3855k1704j8773j5942j4145
56760B70175j2640j0520q686q279q359p273n356m173l955l795l532l514l293k566
56746A84234k446l769n134m763l395l019l601l480k420j704j678j563j420j976
56732A43866k781k737k268k711l773l872k874k256k471k369j434n76l50k63j32
56717A12999m17r56r46m32l05p60j106j114j173j191p56k19k19l79L2N84L28l99
$$ y = [761265, 810819, 865849, 921701, 972255, 1009671, 1025705, 1016224, 984374, 937743, 882881, 823955, 765045, 710340, 661706, 618450, 579988, 546936, 519504, 497055, 479754, 468753, 464259, 465187, 471160, 483106, 501342, 524641, 551509, 580394, 607861, 628341, 636992, 632153, 614923, 587861, 554622, 519169, 484164, 450621, 419169, 390514, 364594, 340739, 319035, 300262, 284320, 270175, 257535, 247015, 238329, 230050, 221691, 214418, 209062, 204889, 200934, 197139, 193607, 190093, 186800, 184234, 181788, 178019, 172885, 168122, 164727, 161708, 158107, 154627, 152207, 150503, 148825, 147262, 145842, 143866, 141085, 138348, 136080, 133369, 129596, 125724, 122850, 120594, 118123, 115754, 114320, 113744, 113394, 113131, 112999, 112582, 111626, 110680, 110248, 109943, 109183, 108077, 106963, 105790, 104599, 103843, 103624, 103405, 103026, 103058, 103642, 103970, 103571]
56699A03571m60J31M40M39Q06J196O70l32l56O92J392J080N71M53L34Jj27R1M55
56680A11047J123K212K890K362J350J138J454R57m24j408j392j002o89m45o40
56665A18533j603k526k402j736j724k199k130j760k216l270l535k804k306k603
56651H5719l114l657m574n375n102m077l522l448k839j736j293j708j983j728
56637D1563j425r76M8R49O80l0N32K270L429L472L472L661L037J697J163J832
56621F5374K347J986J580J566J284P03P97J631K091J986K365L336L627K938K571
56606I6182L131L593L307K954K915K626K156K373K996K570R92p3N6J16n87r49
56590A24358l12K12k02o74m44k15o23r49n49N9M31R74J735J952J629J828K656
$$ y = [103571, 103111, 103242, 103682, 104121, 104927, 106123, 106793, 106461, 106105, 106797, 108189, 109269, 109840, 110293, 110627, 110628, 110501, 110592, 111047, 112170, 114382, 117272, 119634, 120984, 122122, 123576, 124533, 124109, 122701, 121309, 120307, 119618, 119173, 118533, 116930, 114404, 112002, 110266, 108542, 106343, 104213, 102453, 100237, 96967, 93432, 90628, 88322, 85719, 82605, 78948, 74374, 68999, 63897, 59820, 56298, 52850, 50011, 48275, 46982, 45274, 43291, 41563, 40138, 39162, 39210, 40159, 40839, 40809, 41341, 43611, 47040, 50512, 53984, 57645, 60682, 62379, 63542, 65374, 67721, 69707, 71287, 72853, 74137, 74840, 75637, 77268, 79359, 81345, 83710, 87046, 90673, 93611, 96182, 99313, 102906, 106213, 109167, 112082, 114708, 116864, 119237, 122233, 124803, 125795, 125722, 125778, 125894, 125307, 124358, 124046, 124258, 124056, 123382, 122938, 122723, 122100, 121151, 120602, 120661, 121092, 122066, 123801, 125753, 127382, 129210, 131866]
56573A31866K818J906J354K080L049L113K660K408K192K010K634M165N349N258
56559A72862M362L361K414J989K689L764L575K164J405K064K718K337J654J181
56545B08539P9j800k917k405j478j322j454j330j534k177k090r86m64j436k429
56530A84796j948p66k45j62K70P12N89K57k2q52k222k821k130j561k188l016k894
56513A65797k498k867l523l540l163k933k500j644j114j245j129l26J64k07m12
56498A38860J60L89m77j195o09L32L54L5M85J241J280R27J086J624J986K345K865
56481A51688K990K594K593L264L494K765K320L019L752L446K990L604M730N205
56467A98454N115N080M941M512M373M675M588L909L652M043L807K508J555J622
$$ y = [131866, 134684, 136590, 137944, 140024, 143073, 146186, 148846, 151254, 153446, 155456, 158090, 162255, 167604, 172862, 177224, 180585, 182999, 184988, 187677, 191441, 195016, 197180, 198585, 200649, 203367, 205704, 207358, 208539, 208618, 206818, 203901, 201496, 200018, 198696, 197242, 195912, 194378, 192201, 190111, 189125, 188661, 187225, 184796, 182848, 182082, 181837, 181675, 181945, 182657, 183246, 183503, 183481, 182629, 180407, 177586, 175456, 173895, 171707, 168691, 165797, 163299, 160432, 156909, 153369, 150206, 147273, 144773, 143129, 142015, 140770, 139641, 139315, 139479, 139272, 138860, 139020, 139409, 138932, 137737, 137128, 137460, 137814, 137849, 138334, 139575, 140855, 141782, 142868, 144492, 146478, 148823, 151688, 154678, 157272, 159865, 163129, 166623, 169388, 171708, 174727, 178479, 181925, 184915, 188519, 193249, 198454, 203569, 208649, 213590, 218102, 222475, 227150, 231738, 235647, 239299, 243342, 247149, 249657, 251212, 252834]
56453B52834J388K32j80J146K408J930J043J663L020L246K580K488K944K958K596
56438B82296K448K197J522J155J373J007l96j272p22m55k038m131m859m940n856
56423B67329o725n828l862k892l107l257l230l667l976l156j852j379j583j534
56409B21281j373j537j416o19l65j670l425m166m291m654m638l680k998l612m272
56394A78565l550k280j652q53R66K387K027J358K305L905M225L848M405N234M765
56379B05655L738L896M789N034N343P059Q983Q974P619O997O883N482K964J023
56365B84439k57j897l314l234k399k394k728k071j178j473k045j278j89o35j540
56350B57807n73J534K220J579J786K916L272L157M273O021O288N488N834P101
$$ y = [252834, 254222, 254454, 254274, 255420, 257828, 259758, 260801, 262464, 265484, 268730, 271310, 273798, 276742, 279700, 282296, 284744, 286941, 288463, 289618, 290991, 291998, 291602, 290330, 289608, 289153, 287115, 282984, 278125, 273185, 267329, 260604, 254776, 250914, 248022, 244915, 241658, 238428, 234761, 230785, 227629, 225777, 224398, 222815, 221281, 219908, 218371, 216955, 216336, 215971, 214301, 210876, 206710, 202419, 197765, 193127, 189447, 186449, 182837, 178565, 175015, 172735, 171083, 170230, 171196, 173583, 175610, 176968, 179273, 183178, 187403, 191251, 195656, 200890, 205655, 209393, 213289, 218078, 223112, 228455, 235514, 244497, 253471, 261090, 268087, 274970, 280452, 283416, 284439, 284182, 282285, 278971, 275737, 273338, 270944, 268216, 266145, 264967, 263494, 261449, 260171, 259982, 259347, 257807, 257234, 258768, 260988, 262567, 264353, 267269, 270541, 273698, 277971, 283992, 290280, 295768, 301602, 308703]
56336C08703P120O024N973O910O751N585N591O798P023O076N995O983P143O456
56322C99131O921Q379Q336O439N125N211M764L058J827J675J027n15j257p91q60
56307D48470j976k487j766j169j106l23J207J875J475J572K333K184J081R52K352
56292D54674L800M765O154P623P741P105P922J0181J1697J2144J3443J5908J7710
56279E80867J8532K0059K2428K4049K5277K8280L2717L5698L6818L9091M3953
56268I07769M9307N3762N8807O5469P2570P9684Q8315R8794J09325J19289J30201
56257A833292J42374J53885J63834J73288J82125J88238J90666J90270J86743
56248C404715J78402J65417J49730J31379J08765Q2847N7098L2786Q545j4976
$$ y = [308703, 315823, 321847, 327820, 334730, 341481, 347066, 352657, 359455, 366478, 372554, 378549, 385532, 392675, 399131, 406052, 414431, 422767, 429206, 434331, 439542, 444306, 447364, 449191, 450866, 451893, 451378, 450121, 449330, 448470, 446494, 444007, 442241, 441072, 439966, 439643, 440850, 442725, 444200, 445772, 448105, 450289, 451370, 452322, 454674, 458474, 463239, 469393, 477016, 484757, 491862, 499784, 509965, 521662, 533806, 547249, 563157, 580867, 599399, 619458, 641886, 665935, 691212, 719492, 752209, 787907, 824725, 863816, 907769, 957076, 1010838, 1069645, 1135114, 1207684, 1287368, 1375683, 1474477, 1583802, 1703091, 1833292, 1975666, 2129551, 2293385, 2466673, 2648798, 2837036, 3027702, 3217972, 3404715, 3583117, 3748534, 3898264, 4029643, 4138408, 4221255, 4278353, 4311139, 4319684, 4304708]
56238D304708l4613m9575o2293p3467q1008q4911q8346r2448r4702r4162r3628
56227C455555r4937r6547r7622j00028j04322j07927j09321j10131j11365j11560
56217B411795j10267j09186j08317j05158r9313r3656q9374q4369p7997p2778
56207A461380o9536o5617n9885n4781n1426m7469m1963l7581l5551l3207k9058
56196I35306k5628k4597k3568k0518j7158j5213j3431j0820q820p919o212l395
56184G58027j916k230j488J042K290J162Q95L143M947M311L583M422M568K763
56170G85519J717K909L449J433m67p0N06n73j291j07R26O17J328M091N920N260
56154H11167N013P006Q658Q478R396J3029J6159J6621J7326K0642K4345K6975
$$ y = [4304708, 4270095, 4220520, 4158227, 4084760, 4003752, 3918841, 3830495, 3738047, 3643345, 3549183, 3455555, 3360618, 3264071, 3166449, 3066421, 2962099, 2854172, 2744851, 2634720, 2523355, 2411795, 2301528, 2192342, 2084025, 1978867, 1879554, 1785898, 1696524, 1612155, 1534158, 1461380, 1391844, 1326227, 1266342, 1211561, 1160135, 1112666, 1070703, 1033122, 997571, 964364, 935306, 909678, 885081, 861513, 840995, 823837, 808624, 795193, 784373, 775553, 767634, 761422, 758027, 756111, 753881, 752393, 753435, 755725, 756887, 757782, 760925, 765872, 770183, 773766, 778188, 782756, 785519, 787236, 790145, 793594, 795027, 794560, 794490, 794996, 794423, 793132, 793025, 793951, 794568, 795896, 799987, 805907, 811167, 816180, 823186, 831844, 840322, 849718, 862747, 878906, 895527, 912853, 933495, 957840, 984815]
56142I84815L1462L9374M7310N3272O0830P2584Q5308R6146J07736J22311J36419
56131A837567J46478J53837J59426J59315J50996J38584J26611J14368J01355
56122C088537R1867Q8084Q4407P4834O0542M4775K6494N474j2514k2870k9465
56111C500165l8265m8993n9534p2720r1286j10951j25753j35739j42997j45215
56101B528712j40129j31476j23611j15001j03464r2478q5394p8851o9080n9320
56091A529908n3701m9309m1972l4450l1042k9261k4811j9716j7620j6189j2102
56080A199735q305q364q930n872k359k658l583o56K993K704J453L943P308O970
56066A184379N898Q566J1549R940P351R409J3041J2568J0738J3082J6878J6569
$$ y = [984815, 1016277, 1055651, 1102961, 1156233, 1217063, 1289647, 1374955, 1471101, 1578837, 1701148, 1837567, 1984045, 2137882, 2297308, 2456623, 2607619, 2746203, 2872814, 2987182, 3088537, 3180404, 3268488, 3352895, 3427729, 3488271, 3533046, 3559540, 3565014, 3552500, 3529630, 3500165, 3461900, 3412907, 3353373, 3280653, 3189367, 3078416, 2952663, 2816924, 2673927, 2528712, 2388583, 2257107, 2133496, 2018495, 1915031, 1822553, 1737159, 1658308, 1589228, 1529908, 1476207, 1426898, 1384926, 1350476, 1319434, 1290173, 1265362, 1245646, 1228026, 1211837, 1199735, 1191430, 1183066, 1174136, 1168264, 1165905, 1163247, 1159664, 1159008, 1162001, 1164705, 1166158, 1170101, 1177409, 1184379, 1190277, 1198843, 1210392, 1220332, 1227683, 1237092, 1250133, 1262701, 1273439, 1286521, 1303399, 1319968]
56054A319968J4748J6763J9787J8359J5465J6938K0208J9859J8730K1969K5855
56043A528649K4465K1637K4065K8494K8271K6662L0445L6254L6794L4902L7610
56032A858248M1959M0840L7316L8728M2167M0456L6944L9251M4015M3199L9893
56021B303016M2172M7091M6848M4890M9262N6043N6433N4236N8769O6597O8429
56010B893786O7683P3512Q1932Q3395Q2356Q9142R9188J01409J00194J07151J18039
55999C897787J20932J20273J28696J41933J46941J48089J59068J75481J82825
55990E222025J85041J96819K14133K22177K26061K42545K67654K84755K98199
55981G359409L25207L60957L87344M09672M47286M94968N33410N70521O29877
$$ y = [1319968, 1334716, 1351479, 1371266, 1389625, 1405090, 1422028, 1442236, 1462095, 1480825, 1502794, 1528649, 1553114, 1574751, 1598816, 1627310, 1655581, 1682243, 1712688, 1748942, 1785736, 1820638, 1858248, 1900207, 1941047, 1978363, 2017091, 2059258, 2099714, 2136658, 2175909, 2219924, 2263123, 2303016, 2345188, 2392279, 2439127, 2484017, 2533279, 2589322, 2645755, 2699991, 2758760, 2825357, 2893786, 2961469, 3034981, 3116913, 3200308, 3282664, 3371806, 3470994, 3572403, 3672597, 3779748, 3897787, 4018719, 4138992, 4267688, 4409621, 4556562, 4704651, 4863719, 5039200, 5222025, 5407066, 5603885, 5818018, 6040195, 6266256, 6508801, 6776455, 7061210, 7359409, 7684616, 8045573, 8432917, 8842589, 9289875, 9784843, 10318253, 10888774, 11518651]
55972A1518651P05715P74754Q44947R43834J066742J189369J323687J504255J727755
55963B1599709J968681K246168K606619L050025L551560M148250M920244N898836
55955D9990092P090808Q575983J0458994J2742202J5396301J8527897K2241521
55948A45023798K6284566L0061729L3038412L4745712L4177005K9698205K0328940
55941C53358367P266403o306296j7217672k4076308k7268217k7831091k6690813
55934B31234373k4614192k2249566j9980258j7893815j5967810j4198732j2571162
55927A03758838j1051017r654151q438925p414564o528360n746480n075588m502868
55919D5346885l986590l514949l112804k782430k492463k230268k012130j836006
$$ y = [11518651, 12224366, 12999120, 13844067, 14787901, 15854643, 17044012, 18367699, 19871954, 21599709, 23568390, 25814558, 28421177, 31471202, 35022762, 39171012, 44091256, 49990092, 57080900, 65656883, 76115877, 88858079, 104254380, 122782277, 145023798, 171308364, 201370093, 234408505, 269154217, 303331222, 333029427, 353358367, 360624770, 354318474, 337100802, 313024494, 285756277, 257925186, 231234373, 206620181, 184370615, 164390357, 146496542, 130528732, 116330000, 103758838, 92707821, 83053670, 74614745, 67200181, 60671821, 54925341, 49849753, 45346885, 41360295, 37845346, 34732542, 31950112, 29457649, 27227381, 25215251, 23379245]
55911B3379245j674038j518647j390144j292074j201400j108879j028830r63135
55903A3202098q93986q18409p53990p04370o52911n95724n48080n12877m74529
55894G247222m29723l93672l70139l44492l12333k86958k72297k55428k32066
55885D350114k13797k03861j90478j70373j55167j48366j38899j23503j13142
55876B892528j11133j06482r5158q7201q6424q3193p3727o7144o6964o4247n5563
55865A995292m9876n1189n1481m6914m4498m6764m5981l9443l4812l4708l1367
55854A518259k2070j4854j3363j0740m012l06l368p622j0572j7257k7588l3021
55842A353486l1117l0009l3523l5132l1660k9452l1575l1893k7597k4958k6972
$$ y = [23379245, 21705207, 20186560, 18796416, 17504342, 16302942, 15194063, 14165233, 13202098, 12308112, 11489703, 10735713, 10031343, 9378432, 8782708, 8234628, 7721751, 7247222, 6817499, 6423827, 6053688, 5709196, 5396863, 5109905, 4837608, 4582180, 4350114, 4136317, 3932456, 3741978, 3571605, 3416438, 3268072, 3129173, 3005670, 2892528, 2781395, 2674913, 2579755, 2492554, 2406130, 2322937, 2249210, 2182066, 2115102, 2050855, 1995292, 1945416, 1894227, 1842746, 1795832, 1751334, 1704570, 1658589, 1619146, 1584334, 1549626, 1518259, 1496189, 1481335, 1467972, 1457232, 1453220, 1452914, 1449546, 1441924, 1431352, 1414095, 1386507, 1353486, 1322369, 1292360, 1258837, 1223705, 1192045, 1162593, 1131018, 1099125, 1071528, 1046570, 1019598]
55831A019598k7434k3044j9579k0372k0224j6384j4249j6495j7561j4518j2678
55820H17060j4891j5861j2645j0399j2121j2869r660p186q223q152m457k094l860
55807F94642m878k110j41k045l585j973j462m704p195n868m776o919q669p597
55793F32720p597j0890j3022j1167r496j1042j2054r791q091r847j1329r415p236
55780E01743p474p165m235k108k869k952n67k60m910j0152j1846j2321j4162j4679
55766D06043j1886r293r519r456o772m731n677o177l770k098m102o398n695m646
55752C15823o102p535o432n330o326o389l327o79j471k812j829j242l693o103
55738B56553n139l105l083l415k028j136k483l091q01J080l48k274j735j142l000
$$ y = [1019598, 992164, 969120, 949541, 929169, 908945, 892561, 878312, 861817, 844256, 829738, 817060, 802169, 786308, 773663, 763264, 751143, 738274, 728614, 721428, 713205, 705053, 700596, 698502, 694642, 689764, 687654, 687513, 685468, 681883, 679910, 678448, 673744, 666549, 660681, 655905, 648986, 640317, 632720, 625123, 614233, 601211, 590044, 580548, 569506, 557452, 547661, 539570, 529723, 518394, 508979, 501743, 494269, 487104, 482869, 480761, 477892, 474940, 474373, 474113, 469203, 459051, 447205, 434884, 420722, 406043, 394157, 384864, 375345, 365889, 359117, 354386, 348709, 342532, 338762, 336664, 332562, 326164, 320469, 315823, 309721, 302186, 295754, 290424, 284098, 277709, 274382, 273703, 272232, 269420, 267591, 266349, 262656, 256553, 251414, 248309, 245226, 241811, 239783, 238647, 236164, 233073, 232272, 233352, 233004, 230730, 228995, 227853, 224853]
55723B24853m498k839q32j563k496o32J394K18j798j054P31L29o73O73K676K291
55707B16780R31J500K940K977K908M557N822M343K184K061K364P46r86m53M60
55692B49134p24k216j669j035k690m458l613k171k917l825j901Q63J011j74M82
55677B24097K018J697N09Q82J609L56j490j541j221k653l749j797R23P16j002
55662B19354m44J747K215J159J202J889J014l06N77K502K281L93k44J71q82l168
55646B29460m348m531n521o707o288n262n763o761n820l779l259l940l687l017
55632A60777l886n471n445m326m266m818m125k897l091l916l310j956j790k052
55618A09428r39L76l14j886j761n04l03m90Q73K499J719n01j077j95n31k064k374
$$ y = [224853, 220355, 217516, 216684, 215121, 212625, 211993, 213387, 213605, 211807, 210753, 211484, 211813, 211140, 211813, 214489, 216780, 217711, 219211, 222151, 225128, 228036, 232593, 238415, 242758, 244942, 247003, 249367, 250113, 249127, 248674, 249134, 248410, 246194, 244525, 243490, 240800, 236342, 232729, 230558, 227641, 223816, 221915, 222778, 223789, 223615, 224097, 226115, 227812, 228321, 229203, 230812, 231168, 229678, 228137, 226916, 224263, 220514, 218717, 219640, 220356, 219354, 218910, 220657, 222872, 224031, 225233, 227122, 228136, 227830, 228407, 230909, 233190, 233583, 233339, 233510, 232628, 229460, 225112, 220581, 215060, 208353, 202065, 196803, 191040, 184279, 178459, 174680, 171421, 167481, 163794, 160777, 156891, 151420, 145975, 141649, 137383, 132565, 128440, 125543, 122452, 118536, 115226, 113270, 111480, 109428, 108489, 108865, 108551, 106665, 104904, 104400, 104097, 103607, 104480, 106979, 108698, 108197, 107120, 106925, 106394, 104330, 101956]
55601A01956j310r06j311j013m18j112k304k020r25j070j865j280P3J47m56K67
55585H6453J555J214n7JP55Oj388r02O98N15j165j481k57J44k54Q29L118L916
55567I3700L070L222M891N698M788L873L562K594R42l4o37k380m564m980l836
55552A09909l356l771l451k619k988m000l446j661j093j840j688m21l6o53l53
55537G8533Q18P44o16r62J16N62k10n30N7K15j16K75O81r45l994n634n393n541
55519E8060o687o962n971n560o027n312k731n0J811L716N539N876M952M464M302
55504D9420K824N60o7J070J583Q73P41J416R44p38j150L68J454Q33J7q0o33j958
55486E7477k529k041k214l470m019l165k361k137j201N40J278N23q4O6k40r78
$$ y = [101956, 100646, 99740, 98429, 97416, 96998, 95886, 93582, 91562, 90637, 89567, 87702, 86422, 86495, 86642, 86186, 86453, 88008, 89222, 89165, 89166, 89921, 89927, 88539, 87637, 88335, 88850, 87685, 86204, 85947, 86091, 85837, 86666, 89784, 93700, 96770, 99992, 104883, 110581, 115369, 119242, 122804, 125398, 126340, 126306, 125669, 123289, 118725, 113745, 109909, 106553, 102782, 99331, 96712, 93724, 89724, 86278, 84617, 83524, 81684, 79996, 79575, 79539, 78886, 78533, 79351, 80095, 79479, 78517, 78633, 79195, 78985, 78455, 78512, 78727, 78611, 78886, 79567, 78622, 74628, 68994, 63601, 58060, 51373, 44411, 38440, 32880, 26853, 21541, 18810, 18760, 20571, 24287, 29826, 35702, 40654, 45118, 49420, 52244, 52804, 52737, 53807, 55390, 56263, 57004, 58420, 59364, 58626, 57476, 57844, 59298, 60131, 60148, 60068, 59435, 57477, 54948, 52907, 50693, 47223, 43204, 40039, 37678, 35541, 34340, 34880, 36158, 36681, 36597, 36663, 36423, 35445]
55470C5445l62J602K442J147l43n97n79j035j116o38q64j967k481k108k231l029
55454B3286k968j814j152j271o82O74R76p2o25j93l40j201q28J081K251J682J082
55437A9886J380J308M41K35Q84O15p69j132L7N38l66m30J308K521J656M61N25
55420B9098O79o9l30P49J465O61n0O84J469R43K55O44J058M60Q5J150K500K660
55402D4111K160K005J734P91j03m47j019k011k245j401r12j410j671j107q64j326
55386C6285j218l34l97j794k429j270r6j72j02J116J869Q38n26n44J24L64O48
55369C2362J365J486O74L35R93J050j94j059n85k95j073j315j53N51l84j064K5
55352C2719J137M35p57o60k61r41j402j17J447J172n4j32N56L11n93p15k38k30
$$ y = [35445, 35083, 36685, 39127, 40274, 39931, 39334, 38755, 37720, 36604, 35966, 35102, 33135, 30654, 28546, 26315, 23286, 20318, 18504, 17352, 16081, 15399, 16073, 17049, 16977, 16352, 16159, 15819, 14618, 13790, 14871, 17122, 18804, 19886, 21266, 22574, 23015, 23250, 24134, 24749, 23980, 22848, 22885, 23423, 23057, 22627, 23935, 26456, 28112, 28573, 29098, 29777, 29708, 29378, 30127, 31592, 32253, 32203, 32887, 34356, 35299, 35554, 36198, 37256, 37716, 37801, 38951, 41451, 44111, 46271, 48276, 50010, 50801, 50698, 50251, 49232, 47221, 44976, 43575, 42663, 41253, 39582, 38475, 37611, 36285, 35067, 34733, 34336, 32542, 30113, 28843, 28747, 28575, 28473, 29589, 31458, 32296, 31770, 31226, 31350, 31714, 32362, 33727, 35213, 35887, 36222, 37215, 38265, 38071, 37012, 36427, 36132, 35059, 33744, 33591, 34142, 33758, 32694, 32719, 33856, 34291, 33534, 32874, 32613, 31672, 30270, 30153, 31600, 32772, 32718, 32586, 33142, 33453, 32860, 32145, 31907, 31677]
55334C1677l44K91J025Q51L05K00q8j044j394k12J004N69o99j182j048j018m35
55317B8458J086J860N86j138j213k75q1k94K85R61M59l52L7Q30K94r74j072k01
55299B9256j45j011j214l33M85P01P92Q82P91R95J772K054R18o66j199q76p48
55282C2454p16j72L40J9n65m36P3J98K53O69P87K16lP50J160J40j029p75R9M5
55262C3507m92k05N01N03K93R09J599J024k73q32p76j047j211l49P22N91k96m71
55244C3697l2q9n01l95j42o09j181p42Q6r8j014j297r06q15r60n60J07K69K79
55225B5097Q63J514J475J333J781J910Q27k19L26J499J291l6o73l83l04l23N85
55208C6563J849J844O90J08O08J044Q54N84L95pk09L34R44O65%j02j21r16j687
$$ y = [31677, 31333, 31624, 32649, 33500, 33805, 34005, 33917, 32873, 31479, 31267, 32271, 32840, 32141, 30959, 29911, 28893, 28458, 29544, 31404, 31990, 30852, 29639, 29364, 29283, 28989, 29274, 30235, 30694, 30342, 30379, 31209, 31503, 30529, 29457, 29256, 29111, 28100, 26886, 26553, 27038, 27739, 28531, 29413, 30204, 31199, 32971, 35025, 35943, 35277, 34078, 33202, 32454, 31738, 31566, 31906, 31925, 31360, 30924, 30997, 31195, 31448, 32117, 32904, 33120, 33117, 33867, 35027, 35167, 34138, 33363, 33462, 33507, 33015, 32810, 33311, 33814, 34107, 35016, 36615, 37639, 37366, 36534, 35758, 34711, 33500, 33151, 33873, 34464, 34168, 33697, 33665, 33576, 33075, 32680, 32538, 31929, 30748, 30006, 30092, 29994, 28980, 27683, 26777, 25962, 25002, 24442, 24549, 24818, 25097, 25960, 27474, 28949, 30282, 32063, 33973, 34800, 34581, 34907, 36406, 37697, 37661, 36988, 36605, 36301, 35978, 36563, 38412, 40256, 40946, 41054, 41662, 42706, 43560, 44144, 44539, 44532, 44323, 44657, 45601, 46266, 46266, 46164, 46043, 45127, 43440]
55189D3440j139N3J99o23j017q10q91j124o96K3P9j62J15K31p85j846j188N65
55171C4424J308Q00M88O24K24m25j50N44kj586k288j599q86p63n38j95l81n50
55153B9049L85J584J195l25n93Q19J745J073K39L22L83l64j036q48m57n74p93
55136C1804o34l05R6P54J304J157P18Q38J217R52L72N69J309J393Q61P92J125
55119D4322P96l0j57L51K69l69l17L51J57j068j695r38J97R90J812K455J942N58
55101D9626m5O38J262J011O99R28J105R18J026J598J827J414R55N42l57j367j282
55084F0498o8R47J192J414J941K153J897J717J421K85j180j535p03j32m45q15
55068F8587q33r81j032j00J421J930J055R9k72o65j109p27K56L48p73j711j717
$$ y = [43440, 42301, 42354, 42553, 41930, 40913, 40103, 39212, 38088, 37392, 37415, 37494, 37332, 37447, 37678, 36893, 35047, 33859, 34424, 35732, 36532, 37020, 37644, 37868, 37443, 37293, 37837, 37835, 36249, 33961, 32362, 31476, 30713, 30175, 29980, 29599, 29049, 29434, 31018, 32213, 31888, 31295, 32114, 33859, 34932, 35171, 35493, 35876, 35512, 34476, 33628, 33171, 32597, 31804, 31170, 30865, 30961, 31715, 33019, 34176, 34894, 35732, 36949, 37901, 38273, 38842, 40151, 41544, 42405, 43197, 44322, 45118, 45088, 44931, 45282, 45551, 45182, 44865, 45216, 45373, 44305, 42610, 41672, 41869, 42859, 44671, 47126, 49068, 49626, 49581, 50219, 51481, 52492, 53191, 54119, 55224, 56142, 57168, 58766, 60593, 62007, 62962, 63504, 63147, 61780, 60498, 60430, 61377, 62569, 63983, 65924, 68077, 69974, 71691, 73112, 73397, 72217, 70682, 69979, 69847, 69402, 68587, 67754, 66773, 65741, 65641, 67062, 68992, 70047, 70146, 69874, 69209, 68100, 67373, 67629, 67977, 67204, 65493, 63776]
55051F3776j557j508o84Q35J418L58r45j147o29j70L01P92O99o1p23j050j520
55034E8185j895j249K32J163J060P97P43L22k90q8P20O54m75j016j63Q37Q58M03
55016F0798K23K08L06Q71J465J067j03o75l86l52q39q72l58l38p38k64R49J082
54998F2044k13r57j9J220J460J302J368R24l17j111p97n35j183j795j409n54Q9
54981E9517P61J379J092N2k84M55R07N60P68K105L076K662J979K060K196J806
54965H1091J823K721L322K983K915L844M504M086L983N391P259Q402R616J1713
54951A53653J3437J3410J2430J1806J1019R017O305L736P72l119o746q806r848
54938B07066j0811j1084r964q572q291q564q202p598p594p516o394n027m678m698
$$ y = [63776, 62219, 60711, 60027, 60862, 62280, 62638, 61693, 60546, 59917, 59747, 60048, 60840, 61539, 61478, 60755, 59705, 58185, 56290, 55041, 55273, 56436, 57496, 58293, 59036, 59358, 59068, 58980, 59700, 60354, 59879, 58863, 58700, 59537, 60395, 60798, 61021, 61229, 61535, 62406, 63871, 64938, 64835, 64160, 63774, 63422, 62583, 61711, 61353, 61015, 60277, 60013, 60962, 62044, 61831, 60874, 60855, 62075, 63535, 64837, 66205, 67129, 66812, 65701, 64904, 64369, 63186, 61391, 59982, 59428, 59517, 60278, 61657, 62749, 62801, 62517, 62972, 63879, 64439, 65207, 67312, 70388, 73050, 75029, 77089, 79285, 81091, 82914, 85635, 88957, 91940, 94855, 98699, 103203, 107289, 111272, 116663, 123922, 132324, 141940, 153653, 167090, 180500, 192930, 204736, 215755, 224772, 231077, 234813, 235585, 232466, 225720, 216914, 207066, 196255, 185171, 175207, 166635, 158344, 149780, 141578, 133980, 126386, 118870, 112476, 107449, 102771, 98073]
54924I8073l568j513l8M35O07P00N97Q76K024L253L646L753M609O016P284Q712
54908A35466J0706J2277J2168J0749R263P904O044L693J269j274l880n737o551
54895A92097p384q932j0026r427q041p683q486r092q743p650o056m375l508l683
54881H9011l760k833j617j094r45n81m81j072j547j255j049j634j937r07L92M31
54865F9122l02m63l75j164k306k342j454j067j364j234m18K51N51J004J517J415
54849F1371O66k18j112j908j885p76L10L32j20p6K9n11r27j74J020J247P16N25
54831E8509M09n44j678j470p4R79J313J816K481K310J365Q76J177J357J101J157
54815G1084J801K308K249J974J742J552J696K344K823K495K047K626M093N446
$$ y = [98073, 94505, 92992, 92954, 93389, 93996, 94696, 95293, 96169, 98193, 101446, 105092, 108845, 113454, 119470, 126754, 135466, 146172, 158449, 170617, 181366, 190629, 198533, 204577, 208270, 209539, 208265, 204385, 198648, 192097, 184713, 175781, 165755, 156328, 148287, 140604, 132118, 123026, 114283, 106633, 100577, 96202, 92694, 89011, 85251, 82418, 80801, 79707, 78762, 78181, 77700, 76628, 75081, 73826, 72777, 71143, 69206, 68299, 68691, 69122, 68820, 68357, 67982, 66818, 64512, 62170, 60716, 59649, 58285, 57051, 56633, 56884, 57435, 58439, 59956, 61371, 62037, 61819, 60707, 58799, 56914, 56138, 56448, 56780, 56660, 56584, 56613, 56102, 55175, 55001, 56021, 57268, 57984, 58509, 58918, 58374, 56696, 55226, 55152, 56131, 57444, 59260, 61741, 64051, 65416, 66292, 67469, 68826, 69927, 71084, 72885, 75193, 77442, 79416, 81158, 82710, 84406, 86750, 89573, 92068, 94115, 96741, 100834, 106280]
54801A06280O523P917R592J0968J2029J3042J3582J3116J2002J0719Q753N643
54789B30166K355P5j621l698n633o313o331p260q991r820r002p447n971m682l862
54774A51965l776l695k753j531j239j621j428o13j97j79M39J652K396K606L483
54759A45509N536P872R707J1124J2312J3380J4794J6656J7850J7309J5720J4385
54747C02154J2840R509M428o80m868q578j1805j3704j4228j4296j4134j3142j1560
54734B21936j0510j0158r566q542p966q004p743o843o022n552m855l861l254l147
54720A25913k913k507k504k744k449j767j666k161k219j556j006r51q59n28k84
54705I9799M6Q82J616J188q4q92j027j321j619r46K67L20r71j784j104j6M90R92
$$ y = [106280, 112803, 120720, 130312, 141280, 153309, 166351, 179933, 193049, 205051, 215770, 224523, 230166, 232521, 232596, 230975, 227277, 221644, 215331, 209000, 201740, 192749, 182929, 173927, 166480, 160509, 155827, 151965, 148189, 144494, 141741, 140210, 138971, 137350, 135922, 135309, 135112, 134933, 135372, 137024, 139420, 142026, 145509, 151045, 158917, 168624, 179748, 192060, 205440, 220234, 236890, 254740, 272049, 287769, 302154, 314994, 324503, 328931, 328251, 323383, 314805, 303000, 289296, 275068, 260772, 246638, 233496, 221936, 211426, 201268, 191702, 183160, 175194, 167190, 159447, 152604, 146582, 141030, 136175, 132314, 129060, 125913, 123000, 120493, 117989, 115245, 112796, 111029, 109363, 107202, 104983, 103427, 102421, 101470, 100611, 100083, 99799, 99845, 100727, 102343, 103531, 103447, 102555, 101528, 100207, 98588, 97642, 97909, 98229, 97258, 95474, 94370, 94354, 94844, 95836]
54687I5836J984K618K141J163M72o3o15o26K49J418K255K713K730K111J345J301
54671A17032J874K053J636J564K307L183L591L644L354K588J913K148K883K985
54657A52755K518K581L176L165K536K653L833M732M748N016O227P435Q045R029
54643B18449J0987J2744J3182J2934J2923J2557J0816P993N035K096j104m250
54631C14362o929r363j1705j3304j3534j2804j1952j1266j0615r971r216q089
54619A85614o720n617m858m058l244k897k986k947k707k684k645j878o33k6k72
54604A41442l70J9j01j240k374k477j939j680j819j967j913j573j024r51k072
54589A19961l846m788m344l451l038l045l129l118k594j267M7J32p55j146o54
$$ y = [95836, 97820, 100438, 102579, 103742, 104214, 104151, 103536, 102910, 103159, 104577, 106832, 109545, 112275, 114386, 115731, 117032, 118906, 120959, 122595, 124159, 126466, 129649, 133240, 136884, 140238, 142826, 144739, 146887, 149770, 152755, 155273, 157854, 161030, 164195, 166731, 169384, 173217, 177949, 182697, 187713, 193940, 201375, 209420, 218449, 229436, 242180, 255362, 268296, 281219, 293776, 304592, 312585, 317620, 319716, 318612, 314362, 307433, 298070, 286365, 273061, 259527, 246723, 234771, 223505, 212890, 202919, 193703, 185614, 178894, 173277, 168419, 164361, 161117, 158220, 155234, 152287, 149580, 146896, 144251, 142373, 141740, 141714, 141442, 141072, 141091, 140990, 139750, 137376, 134899, 132960, 131280, 129461, 127494, 125581, 124008, 122984, 122033, 119961, 116115, 111327, 106983, 103532, 100494, 97449, 94320, 91202, 88608, 87341, 87388, 87520, 86765, 85619, 84965]
54574H4965m11r75j434j129o94o78n98l9N54P89Q93R08M90j14j38L20L12l36p29
54555H1956m34J07P36J638K202J572M19K61J003J146O01Q71K171K918K699L062
54539A02928M430M984L905L122M152N610N684M995N042N577N557N147M881M190
54525A70204K480M69j055k480m032m720m116l674m616n948o200n711n474n180
54511A19947m222l331l320l413k613j608j503j778j374p44r07j459j395j063j386
54496H9831j960j781j169j127j439j129k32M65Q49J145R49J08l15M66J399J224
54480H7284O72J139K099J946P74J40M38O77O25J042J840J934J146M80L17k7p56
54463A01770j084o82k77m49r10j136q88r5R38J293L67j094j760j337o64m70q61
$$ y = [84965, 84554, 83579, 82145, 81016, 80322, 79644, 79046, 79007, 79561, 80350, 81243, 82151, 82641, 82527, 82389, 82709, 83021, 82685, 81956, 81522, 81629, 82365, 84003, 86205, 87777, 88196, 88457, 89460, 90606, 91207, 92078, 94249, 97167, 99866, 102928, 107358, 112342, 116247, 119369, 123521, 129131, 134815, 139810, 144852, 150429, 155986, 161133, 166014, 170204, 172684, 173153, 172098, 169618, 165586, 160866, 156750, 153076, 148460, 142512, 136312, 130601, 125127, 119947, 115725, 112394, 109074, 105661, 103048, 101440, 99937, 98159, 96785, 96041, 95134, 93675, 92280, 91217, 89831, 87871, 86090, 84921, 83794, 82355, 81226, 80994, 81459, 82308, 83453, 84402, 84510, 84195, 84661, 86060, 87284, 87956, 89095, 91194, 93140, 93914, 94054, 94492, 95169, 95794, 96836, 98676, 100610, 101756, 102236, 102553, 102526, 101770, 100686, 100004, 99727, 99278, 98368, 97232, 96344, 96249, 97187, 98480, 98847, 97753, 95993, 94656, 93992, 93522, 92661]
54446I2661j598k109j603j20J028P28n28j473j701j562j203p11n70q70p66K23
54430G9826J135R65L28M00R56R42L49M9J61J43P2M69J088J265J156J308J329M27
54412I2368r63j487p41M25J343K108K757L044L008K882K565J947J505J734K359
54397A14854K887L363L804L539K219Q15M22O74M65l32j052j545k031k177j636
54382A24269j014j103j611j781j761k097k450k179j661j668j905j549p90m85o84
54367A01531p66o65p04o83l85l27p57o72O50J950J523j44j118q82n63o06l04M53
54349I7531Q54P69J003J791K447K660K720K530J775R74J005J665K037K029K156
54334A23946K121J280K15J27P32N49p18j861k291k668l273l444l052k873l128
$$ y = [92661, 91063, 88954, 87351, 87231, 88259, 88987, 88459, 86986, 85285, 83723, 82520, 81809, 81239, 80369, 79603, 79826, 80961, 81926, 82254, 82654, 83610, 84552, 84901, 84950, 85111, 85254, 85326, 85795, 86883, 88148, 89304, 90612, 91941, 92368, 91405, 89918, 89177, 89602, 90945, 93053, 95810, 98854, 101862, 104744, 107309, 109256, 110761, 112495, 114854, 117741, 121104, 124908, 128447, 130666, 131481, 131903, 132577, 133042, 132710, 131658, 130113, 128082, 125905, 124269, 123255, 122152, 120541, 118760, 116999, 114902, 112452, 110273, 108612, 106944, 105039, 103490, 102700, 102215, 101531, 100765, 100100, 99396, 98713, 98328, 98001, 97244, 96572, 97222, 99172, 100695, 100551, 99433, 98551, 97988, 97382, 97078, 97531, 98385, 99154, 100157, 101948, 104395, 107055, 109775, 112305, 114080, 115054, 116059, 117724, 119761, 121790, 123946, 126067, 127347, 127562, 127689, 128421, 128970, 128252, 126391, 124100, 121432, 118159, 114715, 111663, 108790, 105662]
54319A05662l109k592k221k188j948j485j532k233k833k920k736k222j082Q9K13
54304G6863n87j097r05p20p37l17M47N51j67n73j28L25J37j70j02o5l87o77o83
54285G1008p97j124j145p13m06n06o00m90m75m48J92J352K022J601O25j20l45
54268F9631n4N41Q84P17P33J555K378J891L40p24p38n87p85p88l62r5j75n3L72
54249G4681M63N0k99l90n62o56j56N74N86K3m8M58N50R7J49R12J220N44j56k10
54229G7830k66q34j288j075o16k57L43J130J203K24q33j003m13L28P86N56l98
54212G5417j103n83M82N94j37k22N04N43m46q46Q3Q09R5j034j213p57m14J49J158
54193G3079J556O69l00l4Q28Q55N4n15m89j52M41J096J042O3p55n22J41K97J92
$$ y = [105662, 102553, 99961, 97740, 95552, 93604, 92119, 90587, 88354, 85521, 82601, 79865, 77643, 76561, 76650, 76863, 76276, 75179, 74274, 73554, 72817, 72500, 72947, 73498, 73331, 72758, 72630, 72955, 73092, 72922, 72820, 72755, 72368, 71691, 71008, 70211, 69087, 67942, 67229, 66823, 66317, 65717, 65227, 64752, 64304, 64496, 65848, 67870, 69471, 70096, 69976, 69631, 69577, 70118, 71002, 71719, 72452, 74007, 76385, 78276, 78616, 77892, 77154, 76567, 75782, 74994, 74632, 74537, 74362, 74309, 74681, 75144, 75194, 74895, 74505, 73943, 73287, 73131, 73705, 74291, 74314, 74266, 74724, 75274, 75371, 75520, 76432, 77652, 78196, 78040, 77830, 77564, 76730, 75442, 74367, 73751, 73494, 73837, 74967, 76170, 76394, 75561, 74558, 74145, 74473, 75259, 75815, 75417, 74314, 73731, 74213, 74807, 74670, 74448, 74952, 75495, 75049, 74203, 74286, 75095, 75190, 74156, 72943, 72186, 71772, 71921, 73079, 74635, 75304, 75004, 74970, 75798, 76653, 76707, 76192, 75703, 75551, 75992, 77088, 78130, 78193, 77438, 76916, 77057, 77354, 77546]
54174G7546L40K08p74j739j507m31K58L86O75J136J118O14K16r4q64j890k159
54157G3039j241J18R57J050Q07O41N78L53p2k47J57O96P35N09P17J166R17j13
54139H0767r04r22p16o78m53%P8k47k17J39l07j795k816k122m00R66J565J504
54121G3442O02q51j697j406r57j206j505j003j88Q2K7J60K8q68j730j414j42R41
54103F2315J394J494J275O18j30n90r14j193r91k82N0m34q40m06N7n51j650j738
54085E7484o00N38Q01M92K78M56Q78J046N28l05n26L5N26M76M70R05J220J001
54067F5703P33O89L38k99j66J032J907J516R60J459K285K157J407R83N22o09j420
54050G9197n54J224J928J291P54R24J037Q05Q36J138J002N66Q40K035L230L871
$$ y = [77546, 77886, 78094, 77320, 75581, 74074, 73643, 73901, 74287, 74962, 76098, 77216, 77830, 78046, 77952, 77088, 75198, 73039, 71798, 71916, 72873, 73923, 74730, 75371, 75949, 76302, 76230, 75983, 76140, 76836, 77571, 78080, 78797, 79963, 80880, 80767, 79863, 78941, 78225, 77547, 77094, 77094, 77172, 76925, 76708, 76847, 76540, 74745, 71929, 69807, 69407, 70373, 71938, 73442, 74044, 73193, 71496, 70090, 69133, 67927, 66422, 65419, 65231, 65313, 65340, 65500, 65528, 64660, 62930, 61516, 61374, 62315, 63709, 65203, 66478, 67096, 66966, 66376, 65462, 64269, 63278, 62996, 63046, 62612, 61772, 61366, 61423, 60872, 59222, 57484, 56884, 57422, 58223, 58715, 58993, 59449, 60327, 61373, 61901, 61596, 61070, 61105, 61631, 62107, 62577, 63482, 64702, 65703, 66436, 67125, 67463, 67164, 66998, 68030, 69937, 71453, 72413, 73872, 76157, 78314, 79721, 80704, 81226, 80617, 79197, 78643, 79867, 81795, 83086, 83840, 84764, 85801, 86606, 87442, 88580, 89582, 90148, 90988, 93023, 96253, 100124]
54034A00124M252M508M415M252M544M965M761M211M292M899M949M309M161N022
54020A63664N815N468M315L315K811K619K577K525K265J958J976K258K236J601
54006B05403O41j82p05j086j733k953m356n010m585l850l525l270k526j643j296
53991A69324j235p26J51N31k0j139k252k820k419j322o37j052j886k128j827j571
53975A48972j304p02j86m05j072j408j373j404j330p10J30M93M44M73M62Q8j53
53958A41015L70J106R81J59k18J79O36Q76J345J990K144J789J719K195K526K280
53942A61092J941K095K691L334L703L660L501L780M392M249K784J086N42Q30N74
53927B00254m09j028q29n12n31n47m33n39o75j03J164K129K240K122K547L448
$$ y = [100124, 104376, 108884, 113299, 117551, 122095, 127060, 131821, 136032, 140324, 145223, 150172, 154481, 158642, 163664, 169479, 174947, 179262, 182577, 185388, 188007, 190584, 193109, 195374, 197332, 199308, 201566, 203802, 205403, 206044, 205862, 205157, 204071, 202338, 199385, 195029, 190019, 185434, 181584, 178059, 174789, 172263, 170620, 169324, 168089, 167363, 167514, 168045, 168025, 166886, 164634, 161814, 159395, 158073, 157436, 156384, 154498, 152370, 150543, 148972, 147668, 146966, 146780, 146375, 145303, 143895, 142522, 141118, 139788, 139078, 139208, 139701, 140145, 140618, 141080, 141168, 141015, 141385, 142491, 143472, 143631, 143413, 143592, 144228, 145104, 146449, 148439, 150583, 152372, 154091, 156286, 158812, 161092, 163033, 165128, 167819, 171153, 174856, 178516, 182017, 185797, 190189, 194438, 197222, 198308, 198850, 199680, 200254, 199845, 198817, 197988, 197476, 196945, 196398, 195965, 195426, 194751, 194648, 195812, 197941, 200181, 202303, 204850, 208298]
53911B08298M304M740M682M414M556N384O348O779O772O713O402N582M791M656
53897B84421M674L880K401J194M77l64j485k405k960l327l283k659k224k892m205
53882B71243m949n031n342n959n972n171m367m016l841l908m564n290n126m365
53868B03342m248m812m737l646k818l081l656l794l951m457m531l660k713k606
53854A50632k866k612k097k113k552k572j923j268j327k173l167l378k418r52
53840A19214m2R5O4J89J62k25p96j423j973j910q85L05M96j54l48L22Q46N38O6
53821A14541J51L68Kq04j423j644j609j327p68p1O31J213J443J234J011J219J675
53804A15842J982K282K858L317L187K964L436M229M229L376K707K688K893L297
$$ y = [208298, 212602, 217342, 222024, 226438, 230994, 236378, 242726, 249505, 256277, 262990, 269392, 274974, 279765, 284421, 289095, 292975, 295376, 296570, 297047, 296683, 295198, 292793, 289833, 286506, 283223, 280564, 278340, 275448, 271243, 266294, 261263, 255921, 249962, 243990, 238819, 234452, 230436, 226595, 222687, 218123, 212833, 207707, 203342, 199094, 194282, 189545, 185899, 183081, 180000, 176344, 172550, 168599, 164142, 159611, 155951, 153238, 150632, 147766, 145154, 143057, 140944, 138392, 135820, 133897, 132629, 131302, 129129, 125962, 122584, 120166, 119214, 119172, 119267, 119331, 119520, 119682, 119457, 118661, 117238, 115265, 113355, 112470, 112775, 113271, 113117, 112769, 113091, 113937, 114475, 114541, 114692, 115060, 115062, 114258, 112835, 111191, 109582, 108255, 107487, 107416, 108047, 109260, 110703, 111937, 112948, 114167, 115842, 117824, 120106, 122964, 126281, 129468, 132432, 135868, 140097, 144326, 147702, 150409, 153097, 155990, 159287]
53790A59287M419N937O612N979M868L905K794J431M51J80J89K71P61J561J968
53775B00613J815J644J500P57n61j584k064k673l511l691k920k139j987j982j795
53760A81422j943k535k677j977j401j739k282j984r99k58k25p57j460j741j267
53745A58177p02j056k069k442j825j256j259j060l01O3o33j629k067k132k078
53730A37731j480l41L31J5m47l53j79k34K51J547K367J709N06J06K40n1n67n50
53712A40601k55l26l43M70J607J840J016J22j38K18J042K062K685K666K572K793
53696A58632K846K319J842K109K767L176L455L796L606K501J392J358K112K717
53682A94628L105L647L924L376K581K472K727K282J178M76O05J027J387J773J901
$$ y = [159287, 163706, 169643, 176255, 182234, 187102, 191007, 193801, 195232, 195683, 195863, 196052, 196323, 197084, 198645, 200613, 202428, 204072, 205572, 206329, 205768, 204184, 202120, 199447, 195936, 192245, 189325, 187186, 185199, 183217, 181422, 179479, 176944, 174267, 172290, 170889, 169150, 166868, 164884, 163885, 163627, 163402, 162645, 161185, 159444, 158177, 157475, 156419, 154350, 151908, 150083, 148827, 147568, 146508, 146207, 146270, 145637, 144008, 141941, 139809, 137731, 136251, 135910, 136241, 136256, 135809, 135456, 135277, 135043, 135294, 136841, 139208, 140917, 141423, 141529, 141769, 141718, 141151, 140601, 140346, 140020, 139677, 140147, 141754, 143594, 144610, 144732, 144594, 144812, 145854, 147916, 150601, 153267, 155839, 158632, 161478, 163797, 165639, 167748, 170515, 173691, 177146, 180942, 184548, 187049, 188441, 189799, 191911, 194628, 197733, 201380, 205304, 208680, 211261, 213733, 216460, 218742, 219920, 220396, 221001, 222028, 223415, 225188, 227089]
53667B27089J316L30k26j90j17k42l08k78l53m17l23m68j165j793j479n36j15
53650B20725n56j061j033p48o23n78m16j76O9L27N64P27Q35P60K57n39j040r78
53632B16516p97q33p21j22N43P44O74P93J038J124J143J243J179Q69Q24J402K158
53615B27777K525K636K825K944K821K778L026L206L173L451M162M437L795L176
53601B72732L569M437M702M498M667N146N289N234N599O122N986N249M760M758
53587C42748M752M567M395M051L277K562K560K926K831K356K193K273J958J430
53573C84879J504K084K141J287K27n00r51r38k2J318J751P98m90j060j107j313
53557C89608j587j325m06N60Q35K33o82j014l95O53J397J648J600J335Q87M16
$$ y = [227089, 228405, 228735, 228509, 228319, 228202, 227960, 227652, 227374, 227021, 226604, 226281, 225813, 224648, 222855, 221376, 220840, 220725, 220169, 219108, 218075, 217327, 216704, 216126, 215710, 215534, 215603, 215930, 216494, 217221, 218056, 218816, 219073, 218534, 217494, 216516, 215719, 214886, 214165, 214043, 214586, 215330, 216004, 216797, 217835, 218959, 220102, 221345, 222524, 223393, 224217, 225619, 227777, 230302, 232938, 235763, 238707, 241528, 244306, 247332, 250538, 253711, 257162, 261324, 265761, 269556, 272732, 276301, 280738, 285440, 289938, 294605, 299751, 305040, 310274, 315873, 321995, 327981, 333230, 337990, 342748, 347500, 352067, 356462, 360513, 363790, 366352, 368912, 371838, 374669, 377025, 379218, 381491, 383449, 384879, 386383, 388467, 390608, 391895, 392122, 391622, 390671, 389733, 389711, 391029, 392780, 393578, 393088, 392028, 390921, 389608, 388021, 386696, 386290, 386850, 387685, 387918, 387236, 386222, 385827, 386480, 387877, 389525, 391125, 392460, 393347, 393763]
53541C93763j07q81j501r62Q67K549K775K155K195L068L638L402L075L258L718
53526D21012M092M345M418M291M411N255O474P295P688Q282R177R732R650R427
53512E15549R672J0583J2102J3868J5111J5316J4959J4984J5620J6406J7124J8012
53500F89306J9096K0064K0776K1296K1627K1889K2494K3541K4470K4881K5224
53489I34664K5935K6446K5981K4852K3994K3707K3756K4220K5125K5722K5379
53478A209781K4741K4822K5316K5207K4628K4629K5154K4976K3737K2549K2164
53467A477704K1953K1120J9814J8461J7091J5711J4630J3919J3226J2333J1310
53456A657272J0113Q673P242N903M035J125k132m608o356q268j0354j1755j2392
$$ y = [393763, 393656, 392775, 391274, 390312, 391179, 393728, 396503, 398658, 400853, 403921, 407559, 410961, 414036, 417294, 421012, 425104, 429449, 433867, 438158, 442569, 447824, 454298, 461593, 469281, 477563, 486740, 496472, 506122, 515549, 525221, 535804, 547906, 561774, 576885, 592201, 607160, 622144, 637764, 654170, 671294, 689306, 708402, 728466, 749242, 770538, 792165, 814054, 836548, 860089, 884559, 909440, 934664, 960599, 987045, 1013026, 1037878, 1061872, 1085579, 1109335, 1133555, 1158680, 1184402, 1209781, 1234522, 1259344, 1284660, 1309867, 1334495, 1359124, 1384278, 1409254, 1432991, 1455540, 1477704, 1499657, 1520777, 1540591, 1559052, 1576143, 1591854, 1606484, 1620403, 1633629, 1645962, 1657272, 1667385, 1676058, 1683300, 1689203, 1693238, 1694363, 1692231, 1687623, 1681267, 1672999, 1662645, 1650890, 1638498]
53443A638498j3237j4765j6509j8291k0457k2554k3317k2521k1619k1860k2857
53432A420511k3625k3986k4240k4312k3951k3142k1787j9740j7484j6070j5772
53421A186402j5586j4536j2883j1545j0835j0254r160p309n065l146j873p48P54
53408A084216K281L227L928N319P563R975J2217J4454J6408J7482J8004J9133
53396A214207K1212K3340K4903K6414K8394L0456L2064L3407L5017L7149L9815
53385A546378M2729M5011M5874M5838M6406M8271N0701N2830N4673N6457N7909
53374B093077N8688N8878N8698N8322N8040N7950N7451N5881N3623N1566M9572
53363B711746M6598M2468L8234L4528L0839K6850K3143K0013J6678J2373P344
$$ y = [1638498, 1625261, 1610496, 1593987, 1575696, 1555239, 1532685, 1509368, 1486847, 1465228, 1443368, 1420511, 1396886, 1372900, 1348660, 1324348, 1300397, 1277255, 1255468, 1235728, 1218244, 1202174, 1186402, 1170816, 1156280, 1143397, 1131852, 1121017, 1110763, 1101603, 1094294, 1089229, 1086083, 1084210, 1083462, 1084216, 1086497, 1089724, 1093652, 1098971, 1106534, 1116509, 1128726, 1143180, 1159588, 1177070, 1195074, 1214207, 1235419, 1258759, 1283662, 1310076, 1338470, 1368926, 1400990, 1434397, 1469414, 1506563, 1546378, 1589107, 1634118, 1679992, 1725830, 1772236, 1820507, 1871208, 1924038, 1978711, 2035168, 2093077, 2151765, 2210643, 2269341, 2327663, 2385703, 2443653, 2501104, 2556985, 2610608, 2662174, 2711746, 2758344, 2800812, 2839046, 2873574, 2904413, 2931263, 2954406, 2974419, 2991097, 3003470, 3010814]
53352C010814K180k940p813j1939j5269j8485k2014k5527k8738l2010l5759l9925
53340B772575m4235m8250n1104n2223n2324n2634n3094n2651n1406n0794n1278
53329B212582n1499n0503m9150m8352m7496m5837m4102m3262m2721m1181l8651
53318A709828l6205l4166l1863k8942k5973k3732k2540k2190k2100k1788k1417
53307A418912k1305k0963j9453j6989j5026j4275j3690j2113r916q130o893n597
53295A254562l949k131n24K50j62q38j66K045M180N298O555R078J1900J3518J4477
53280A314093J6506J9755K2600K4010K4569K5149K5851K6430K6700K6417K5574
53269A577654K4693K4197K3669K2481K0856J9444J8177J6445J4233J2099J0184
$$ y = [3010814, 3012994, 3010054, 3002241, 2990302, 2975033, 2956548, 2934534, 2909007, 2880269, 2848259, 2812500, 2772575, 2728340, 2680090, 2628986, 2576763, 2524439, 2471805, 2418711, 2366060, 2314654, 2263860, 2212582, 2161083, 2110580, 2061430, 2013078, 1965582, 1919745, 1875643, 1832381, 1789660, 1748479, 1709828, 1673623, 1639457, 1607594, 1578652, 1552679, 1528947, 1506407, 1484217, 1462117, 1440329, 1418912, 1397607, 1376644, 1357191, 1340202, 1325176, 1310901, 1297211, 1285098, 1275182, 1267052, 1260159, 1254562, 1250613, 1248482, 1247958, 1248208, 1248046, 1247208, 1247042, 1249087, 1253267, 1258565, 1265120, 1274198, 1286098, 1299616, 1314093, 1330599, 1350354, 1372954, 1396964, 1421533, 1446682, 1472533, 1498963, 1525663, 1552080, 1577654, 1602347, 1626544, 1650213, 1672694, 1693550, 1712994, 1731171, 1747616, 1761849, 1773948, 1784132]
53258A784132Q148O115M668L821K729P18j992m779p360r787j2079j4109j5754
53245A744471j7139j8657k0528k2380k3676k4578k5880k7885k9844l0817l0617
53234A472470k9682k8575k7876k8011k8703k9080k8593k7458k6053k4542k3247
53223A170650k2644k2564k2255k1537k1122k1341k1449k0788j9786j9004j8053
53212I40107j6346j4372j3285j3468j4206j4599j4310j3629j3225j3514j4090
53201G85063j4198j3814j3590j3676j3480j2883j2569j2764j2676j1876j1166
53190F42371j1361j2058j2465j2574j2690j2663j2319j1997j1911j1698j1353
53179E09282j1592j2590j3224j2615j1521j1173j1517j1632j1168j0355r249p973
$$ y = [1784132, 1792280, 1798395, 1803063, 1806884, 1809613, 1810331, 1808339, 1803560, 1796200, 1786413, 1774334, 1760225, 1744471, 1727332, 1708675, 1688147, 1665767, 1642091, 1617513, 1591633, 1563748, 1533904, 1503087, 1472470, 1442788, 1414213, 1386337, 1358326, 1329623, 1300543, 1271950, 1244492, 1218439, 1193897, 1170650, 1148006, 1125442, 1103187, 1081650, 1060528, 1039187, 1017738, 996950, 977164, 958160, 940107, 923761, 909389, 896104, 882636, 868430, 853831, 839521, 825892, 812667, 799153, 785063, 770865, 757051, 743461, 729785, 716305, 703422, 690853, 678089, 665413, 653537, 642371, 631010, 618952, 606487, 593913, 581223, 568560, 556241, 544244, 532333, 520635, 509282, 497690, 485100, 471876, 459261, 447740, 436567, 425050, 413418, 402250, 391895, 382646, 374673]
53167C74673p104o791o245n058m182m512n295n272m633m510n097n639n844n882
53153B98609n442m272l236l378m118l884k494j462j769k678l042k723k246j953
53139B55912j804j555r84k93n9l81n06P3P26O28J11O4M81O88O63J023J829K425
53121B59041K411J861Q18n59j574j679j421j808k887l845m282m464m480m164l710
53106B29258l525l484l175k713k529k534k284j846j680j861k130k437k735k604
53092A93721j880j263j459k111k452k480k565k492j973j536j704j856j185l55
53078A68410o16j631j836q54N6O8k88n16r71j799k345k184j719j356r77n79n35
53061A50328q79j061p66k62J62M34L18m16j358j771j569j316j245j061o25j60
$$ y = [374673, 367569, 360778, 354533, 349475, 345293, 340781, 335486, 330214, 325581, 321071, 315974, 310335, 304491, 298609, 293167, 288895, 285659, 282281, 278163, 274279, 271785, 270323, 268554, 265876, 262834, 260111, 257865, 255912, 254108, 252553, 251569, 251276, 251217, 250836, 250330, 250403, 251129, 251757, 251868, 251932, 252413, 253101, 253764, 254787, 256616, 259041, 261452, 263313, 264131, 263572, 261998, 260319, 258898, 257090, 254203, 250358, 246076, 241612, 237132, 232968, 229258, 225733, 222249, 219074, 216361, 213832, 211298, 209014, 207168, 205488, 203627, 201497, 199060, 196325, 193721, 191841, 190578, 189119, 187008, 184556, 182076, 179511, 177019, 175046, 173510, 171806, 169950, 168765, 168410, 167794, 166163, 164327, 163473, 163529, 163597, 163309, 162793, 161822, 160023, 157678, 155494, 153775, 152419, 151442, 150863, 150328, 149449, 148388, 147622, 147360, 147522, 147956, 148274, 147858, 146500, 144729, 143160, 141844, 140599, 139538, 138913, 138753]
53045A38753J39J37l62j119j295n83L3l37j013q47j99k85r77j002j69L20r4o41
53027A30459q08j052j542j712j481j504j798j493m09M67N84O07R43Q89L8p49o72
53010A20767k93n25j146j209m43N37J027Q11K40L1N29J149J098N61M14Q20J053
52993A25421P32K88J34L34J003K042K555J791N86N04J445J769R63N44J614L211
52977A44936L881L476K553J295M2l36L31Q77M11l43l48O8r2p65r94m03L82N58
52959A55529k29j695k944l132k429j806j662j444q62m26l80j84M25Q66Q16Q49
52943A41292J212J132J72p53p11j52k9l12m39m79o60m49O58J927K180J514J060
52926A47163J261J423R95K73k40m65n51n95n86m12L0N07O01L99O30J670K888L390
$$ y = [138753, 138892, 139029, 138667, 137548, 136253, 135670, 135703, 135366, 134353, 133506, 133307, 133022, 132045, 131043, 130874, 131194, 131100, 130459, 129651, 128599, 127057, 125345, 123864, 122360, 120562, 119069, 118660, 119127, 119711, 120318, 121261, 122150, 122188, 121439, 120767, 120474, 119949, 118803, 117594, 117151, 117688, 118715, 119526, 119766, 119797, 120326, 121475, 122573, 123134, 123548, 124368, 125421, 126153, 126441, 126575, 126909, 127912, 129954, 132509, 134300, 134886, 135390, 136835, 138604, 139567, 140111, 141725, 144936, 148817, 152293, 154846, 156141, 156183, 155847, 156178, 157055, 157466, 157123, 156775, 156843, 156751, 155986, 154992, 154589, 154971, 155529, 155300, 153605, 150661, 147529, 145100, 143294, 141632, 140188, 139326, 138900, 138520, 138336, 138761, 139627, 140443, 141292, 142504, 143636, 143808, 143055, 142344, 142192, 142163, 141851, 141412, 140933, 140273, 139824, 140482, 142409, 144589, 146103, 147163, 148424, 149847, 150842, 151115, 150875, 150410, 149859, 149264, 148678, 148266, 148296, 148803, 149404, 149803, 150433, 152103, 154991, 158381]
52908A58381K958J935O64m88j077j078r86j057q37O2J234K027K342K428K335K041
52892A70884J695J353Q87M46M62Q53R08L38k17k31l6O4N83J921L279L447K407
52875A89043J304J011J352J638J448R06N41O90R38N91k13m37N09J997L082L486
52859B07886L285K495J476J083J653K429K617K435K517K710K329J262J94j42L90
52844B34619J228J481Q65J86L31P81K23j339k330j944j261j331j558j120o94j311
52828B26826k462k869k468k158k105j771j262j184j407j279r47j106j619j634
52814B02555j097q72j213j431j270j394k085k564k174j336p97o28n57o62j161
52799A83314j808k117j920j437q87l31J51L68J09o08j390j706j404q74n58n41
$$ y = [158381, 161339, 163274, 163938, 163450, 162373, 161295, 160309, 159252, 158415, 158477, 159711, 161738, 164080, 166508, 168843, 170884, 172579, 173932, 174819, 175265, 175727, 176580, 177488, 177826, 177609, 177378, 177342, 177406, 177989, 179910, 183189, 186636, 189043, 190347, 191358, 192710, 194348, 195796, 196702, 197243, 197933, 198871, 199462, 199249, 198812, 199321, 201318, 204400, 207886, 211171, 213666, 215142, 216225, 217878, 220307, 222924, 225359, 227876, 230586, 232915, 234177, 234371, 234229, 234619, 235847, 237328, 238193, 238379, 238710, 239491, 239714, 238375, 236045, 234101, 232840, 231509, 229951, 228831, 228137, 226826, 224364, 221495, 219027, 216869, 214764, 212993, 211731, 210547, 209140, 207861, 206914, 205808, 204189, 202555, 201458, 200586, 199373, 197942, 196672, 195278, 193193, 190629, 188455, 187119, 186322, 185694, 185137, 184475, 183314, 181506, 179389, 177469, 176032, 175145, 174814, 174965, 175333, 175442, 174834, 173444, 171738, 170334, 169460, 168902, 168361]
52783A68361p31j088j466j548j256r43r25j065j087r98r21p96n93m96o20p78q08
52766A52242q28q98q22n20k49k09l11n40j104j953k632k880k882k703k141j352
52750A30218r84j221j433j137o90n09m06k34m07j043j387q56l8J93m2j30j35m89
52732A19270r51j005q86j261j995k203j488l28O82J299J423J150Q82R04R90Q53
52716A17336O74O59N37J48K4N61J122Q60Q3k01J17K14k40o42n57k93j98j78j92
52697A19834n18j184j756j935j955k066k045j556p46k32m75j191j587j228o02
52682A00758m73q33j005p33n02o43q91j083j477j989j923j063k52k40o28o18j81
52665H6224K02L96M42J48m40o81j68N48P54N52M16L82L23L85N36L31j60j22N61
$$ y = [168361, 167630, 166542, 165076, 163528, 162272, 161329, 160404, 159339, 158252, 157254, 156333, 155537, 154944, 154448, 153828, 153050, 152242, 151414, 150516, 149694, 149174, 148925, 148716, 148405, 147865, 146761, 144808, 142176, 139296, 136414, 133711, 131570, 130218, 129234, 128013, 126580, 125443, 124753, 124244, 123838, 123604, 123197, 122154, 120767, 119911, 119873, 120066, 120024, 119894, 119759, 119270, 118319, 117314, 116428, 115167, 113172, 110969, 109481, 109153, 109835, 111134, 112557, 113707, 114589, 115493, 116483, 117336, 118010, 118669, 119206, 119354, 119378, 119939, 121061, 121921, 122004, 121803, 121920, 122134, 121894, 121252, 120695, 120402, 120204, 120026, 119834, 119316, 118132, 116376, 114441, 112486, 110420, 108375, 106819, 106073, 105841, 105366, 104175, 102588, 101360, 100758, 100285, 99452, 98447, 97714, 97212, 96569, 95678, 94595, 93118, 91129, 89206, 88143, 87891, 87651, 87023, 86405, 86224, 86426, 86822, 87264, 87412, 86972, 86291, 86123, 86671, 87425, 87977, 88393, 88775, 89098, 89483, 90019, 90350, 90190, 90068, 90629]
52646I0629O46o44k140k363j624j127q57k6J030J262Q34R00J545J711J173Q69
52630I1818J078Q78k04j414k064k354k466k108j398j030j075p04M00J324J255
52615H1936O32M10Q24J411J696J406N86j94k22M95J157J130N34j52n37l45M37
52598I1204J364J873J865J547R24J7p06p53l08Q3K69M09M35L82P38J712K514K300
52580A05869J467J011J046R47O19L76l4r59j643r28Q21J977J919J614J786J977
52564A17865J768J618J830J877J274L32m42q07m91O00J685J668O93J09N60J234
52548A31373J297J001Q68Q33P33P73R64R41O72O30R19J090J001R63Q89L28m26
52531A44849m72J88M72k5l42J71P53N91J46K26P19J048J153J141P51q6p36p03
$$ y = [90629, 91275, 90631, 88491, 86128, 84504, 83377, 82520, 82494, 83524, 84786, 85620, 86520, 88065, 89776, 90949, 91818, 92896, 93774, 93570, 92156, 90092, 87738, 85272, 83164, 81766, 80736, 79661, 78957, 79357, 80681, 81936, 82568, 82978, 83802, 85213, 86909, 88315, 88901, 88707, 88485, 88980, 90137, 91267, 91801, 91649, 91112, 90767, 91204, 92568, 94441, 96306, 97853, 98777, 98794, 98088, 97335, 97027, 97110, 97379, 97788, 98223, 98605, 99343, 101055, 103569, 105869, 107336, 108347, 109393, 110340, 110959, 111335, 111301, 110342, 108699, 107771, 108592, 110569, 112488, 114102, 115888, 117865, 119633, 121251, 123081, 124958, 126232, 126564, 126122, 125315, 124824, 125424, 127109, 128777, 129470, 129579, 130139, 131373, 132670, 133671, 134539, 135372, 136105, 136878, 137842, 138783, 139455, 140085, 141004, 142094, 143095, 144058, 144947, 145275, 144849, 144377, 144565, 145037, 145012, 144670, 144841, 145594, 146185, 146331, 146557, 147276, 148324, 149477, 150618, 151369, 151283, 150547, 149844]
52513A49844l90l80n58n46m27l81j87L42Q84J105J156J200J008M07l22q42j045
52496A50868p95j2P66Q24M52P10J669K063J227K61L87J179J401Q89M34L96M63
52479A63182M70N41N90M02J35J78O09J158J526J536J263J146J533K013J801R24
52463A79007K87L30M31K4n41o64l01L56J284K193K439J883J217R97J016J005J123
52446A92086J288R10j21r58j006p89r98j396j388j051q26q09r16j244j621j510
52430A79651q88n06o98p36m3P46P48J33m16q30j316j530j058l15l0j82k50j53
52412A72327j90m44q30j353j739j380l03M86L02j50J10Q40J194J233J689K536
52396A74328K868K186R29k54j020j259j079q20o21k18M82J021J072R92J215J545
$$ y = [149844, 149454, 149074, 148516, 147970, 147543, 147162, 146975, 147317, 148201, 149306, 150462, 151662, 152670, 153077, 152755, 151913, 150868, 150073, 150061, 150827, 151651, 152103, 152813, 154482, 156545, 157772, 158033, 158420, 159599, 161000, 161889, 162323, 162719, 163182, 163652, 164193, 164783, 165185, 165320, 165498, 166107, 167265, 168791, 170327, 171590, 172736, 174269, 176282, 178083, 179007, 179294, 179624, 180055, 180079, 179538, 178874, 178573, 178929, 180213, 182406, 184845, 186728, 187945, 188942, 189958, 190963, 192086, 193374, 194284, 194163, 193205, 192199, 191410, 190412, 189016, 187628, 186577, 185751, 184942, 184026, 182782, 181161, 179651, 178763, 178257, 177559, 176823, 176780, 177526, 178274, 178407, 177991, 177161, 175845, 174315, 173257, 172942, 172912, 172730, 172480, 172327, 172137, 171693, 170863, 169510, 167771, 166391, 166088, 166574, 166876, 166726, 166836, 167676, 168870, 170103, 171792, 174328, 177196, 179382, 180311, 180057, 179037, 177778, 176699, 175879, 175258, 175040, 175522, 176543, 177615, 178607, 179822, 181367]
52380A81367J651J679J775J571Q66K24K21O14Q93J051J132P75J5k01O94J769J808
52363A97904J025M94M54L87L13O95J368J777J975K311K413J770R78J095J942K430
52347B19331K435K807L489L276J808L50k0L03N95J006J814K454K276J609J228
52332B44761J250J267J201J295J505J525J307J132J187J335J307J031Q26J229
52318B62158K397L720M364M146L648L423L494L642L735L724L643L708M176M962
52304C14940N717O299O939P835Q811R490R656R467R359R743J0610J1565J2251
52291D32682J2666J2946J3182J3509J4106J4844J5273J5185J4956J5132J5830
52280E90311J6713J7250J6960J5831J4615J4213J4611J4987J4941J4886J4961
$$ y = [181367, 183018, 184697, 186472, 188043, 188909, 189133, 189354, 189968, 190861, 191912, 193044, 193819, 193834, 193633, 194327, 196096, 197904, 198929, 199423, 199877, 200264, 200577, 201272, 202640, 204417, 206392, 208703, 211116, 212886, 213864, 214959, 216901, 219331, 221766, 224573, 228062, 231338, 233146, 233496, 233476, 233779, 234374, 235380, 237194, 239648, 241924, 243533, 244761, 246011, 247278, 248479, 249774, 251279, 252804, 254111, 255243, 256430, 257765, 259072, 260103, 260929, 262158, 264555, 268275, 272639, 276785, 280433, 283856, 287350, 290992, 294727, 298451, 302094, 305802, 309978, 314940, 320657, 326956, 333895, 341730, 350541, 360031, 369687, 379154, 388513, 398256, 408866, 420431, 432682, 445348, 458294, 471476, 484985, 499091, 513935, 529208, 544393, 559349, 574481, 590311, 607024, 624274, 641234, 657065, 671680, 685893, 700504, 715491, 730432, 745318, 760279]
52269G60279J4537J3296J1872J0691R121O729M569L975M543M632L589K231J218
52256H51282K79p75j464j527j501j865k379k663k895l352l765l644k994k233j506
52241H18998m98J069K898M336N051N432O128P275Q376Q999R310R837J0887J2289
52227I10387J3510J3975J3564J2758J2076J1512J0889J0426J0373J0261R381P886
52215A046998O524N289L467J120p06j625k512l953n288n975o701q223j0057j1276
52201A007082j1800j1977j1758j1245j1179j1923j2721j2815j2487j2058j0994
52190H76125r160p825p969q533p934o492n686n657n342m568m141m080l625k938
52176G92175k974l665l917l580l683m438m716l930k987k706k744k623k578k765
$$ y = [760279, 774816, 788112, 799984, 810675, 819796, 826525, 831094, 835069, 839612, 844244, 847833, 850064, 851282, 851561, 850786, 849322, 847795, 846294, 844429, 842050, 839387, 836492, 833140, 829375, 825731, 822737, 820504, 818998, 818500, 819569, 822467, 826803, 831854, 837286, 843414, 850689, 859065, 868064, 877374, 887211, 898098, 910387, 923897, 937872, 951436, 964194, 976270, 987782, 998671, 1009097, 1019470, 1029731, 1039112, 1046998, 1053522, 1058811, 1062278, 1063398, 1062692, 1061067, 1058555, 1054602, 1049314, 1043339, 1036638, 1028415, 1018358, 1007082, 995282, 983305, 971547, 960302, 949123, 937200, 924479, 911664, 899177, 887119, 876125, 866965, 859140, 851171, 842638, 834704, 828212, 822526, 816869, 811527, 806959, 802818, 798738, 795113, 792175, 789201, 785536, 781619, 778039, 774356, 769918, 765202, 761272, 758285, 755579, 752835, 750212, 747634, 744869]
52162G44869k818k777l382m779n961o096n550m934m108k844j686j423k074l000
52148F93437l619l720l446l210l266l281k818k164k037k528l044l255l339l296
52134F50414k861k195j829j856j958k181k875l784m160l866l490l279k900k356
52120F10824k109k128j819j158r07j389j969k046j725j221m35N52J419K200L186
52105F01275M067M179L745L838M847O051O997Q194R931J1552J2564J3439J4691
52092G05370J5962J6717J7134J7688J8471J9460K0763K2145K2938K2874K2440
52081I21962K2007K1273K0018J8745J8034J7788J7509J6852J5683J4161J2858
52070A116890J2205J1683J0337Q136N925L984J713r88l259m643n755o984p729
$$ y = [744869, 742051, 739274, 735892, 731113, 725152, 719056, 713506, 708572, 704464, 701620, 699934, 698511, 696437, 693437, 689818, 686098, 682652, 679442, 676176, 672895, 670077, 667913, 665876, 663348, 660304, 657049, 653710, 650414, 647553, 645358, 643529, 641673, 639715, 637534, 634659, 630875, 626715, 622849, 619359, 616080, 613180, 610824, 608715, 606587, 604768, 603610, 602703, 601314, 599345, 597299, 595574, 594353, 593918, 594470, 595889, 598089, 601275, 605342, 609521, 613266, 617104, 621951, 628002, 634999, 643193, 653124, 664676, 677240, 690679, 705370, 721332, 738049, 755183, 772871, 791342, 810802, 831565, 853710, 876648, 899522, 921962, 943969, 965242, 985260, 1004005, 1022039, 1039827, 1057336, 1074188, 1089871, 1104032, 1116890, 1129095, 1140778, 1151115, 1159251, 1165176, 1169160, 1170873, 1169885, 1166626, 1161983, 1156228, 1149244, 1141515]
52057A141515p667p657q464r475r703r346r276r615r731r348q685p849o835n906
52043A021958n362n034m507l637k468j016N77K026L262M418N340N718N878O634
52029A033787Q038R035Q880Q152P793P847P732P182O380N600N159N192N148M156
52015A130081K229M12p45j910l703n560o728p466q423r430r990j0477j1818j4143
52001A042329j6632j8616k0147k1438k2368k2641k2218k1561k1472k2327k3486
51990H09423k3899k3414k2879k2811k2775k2335k1791k1501k1232k0774k0455
51979E65557k0535k0637k0401j9983j9394j8025j5645j3259j2097j2097j2144
51968C81340j1572j0693r993r477q822p874o884o383o548o847o589n827n161m758
$$ y = [1141515, 1133848, 1126191, 1117727, 1108252, 1098549, 1089203, 1079927, 1070312, 1060581, 1051233, 1042548, 1034699, 1027864, 1021958, 1016596, 1011562, 1007055, 1003418, 1000950, 999934, 1000511, 1002537, 1005799, 1010217, 1015557, 1021275, 1027153, 1033787, 1041825, 1050860, 1059740, 1067892, 1075685, 1083532, 1091264, 1098446, 1104826, 1110426, 1115585, 1120777, 1125925, 1130081, 1132310, 1132722, 1131977, 1130067, 1126364, 1120804, 1114076, 1106610, 1098187, 1088757, 1078767, 1068290, 1056472, 1042329, 1025697, 1007081, 986934, 965496, 943128, 920487, 898269, 876708, 855236, 832909, 809423, 785524, 762110, 739231, 716420, 693645, 671310, 649519, 628018, 606786, 586012, 565557, 545022, 524385, 503984, 484001, 464607, 446582, 430937, 417678, 405581, 393484, 381340, 369768, 359075, 349082, 339605, 330783, 322909, 316025, 309642, 303094, 296247, 289658, 283831, 278670, 273912]
51954B73912m326l933l930m043l630k986l154m081m305l104j647j205j388j178
51940B31002o53m96o58o80p54j294j900j866j367j192j585k084k277k082j538
51925B10576r60q31j113j188q89q79j463j936j703j239j106r71m94l20j107k306
51909A92071k979l075k884k100o12N12L05n18o11j04j89r82j479j376j377j661
51893A72941j622j245j312j888j983j176l30j82k22L03J114J311O20l72r82j063
51877A63912j022j310j816j930j312l79K55M46L00j99q04q26K1R63J111O38L34
51860A58382L94M64N35Q52J128Q24J31j55L24J225K150K893L195K934K478K195
51844A79949J857J127L34L4J11J05J30O53J460J744J158J12q09j141n74N58J107
$$ y = [273912, 269586, 265653, 261723, 257680, 254050, 251064, 247910, 243829, 239524, 236420, 234773, 233568, 232180, 231002, 230349, 229853, 229195, 228515, 227761, 226467, 224567, 222701, 221334, 220142, 218557, 216473, 214196, 212114, 210576, 209616, 208785, 207672, 206484, 205595, 204716, 203253, 201317, 199614, 198375, 197269, 196298, 195804, 195484, 194377, 192071, 189092, 186017, 183133, 181033, 180421, 180933, 181238, 180720, 180109, 180005, 179816, 178834, 177355, 175979, 174602, 172941, 171319, 170074, 168762, 166874, 164891, 163715, 163385, 163203, 162981, 163284, 164398, 165709, 166329, 165957, 164975, 163912, 162890, 161580, 159764, 157834, 156522, 156143, 156398, 156844, 157144, 156945, 156141, 155315, 155336, 156299, 157410, 158048, 158382, 158776, 159240, 159775, 160627, 161755, 162579, 162710, 162555, 162879, 164104, 166254, 169147, 172342, 175276, 177754, 179949, 181806, 182933, 183267, 183301, 183412, 183517, 183647, 184300, 185760, 187504, 188662, 188774, 187965, 186824, 186250, 186808, 187915]
51827A87915K70j271k095j693n92P01J965K716K462J533Q07O48P80R73J088Q27
51811A97034K58J77R71J592Q39p03j359p59j39k53n17m17l99p98j150j072q80
51794A92425q75q19n96n07n61l18K07L37j13l70Q1O46N35q9n26n32l02J38Q49
51775A89610J512J603J089N34M77Q16Q75J67r47j564j263n20O9M62Q80J305J736
51758A96841K429L352L868L590L025K881L165L552M017M424M236L448L192M322
51744B46342O024O909O907O879O909O403N510M928M508L533K254J683J781J370
51730C11940J8j295j644j066J03J546K471K099R38L23N84Q09O08O19J086J378
51714C20517J358J675K247J979O50l66j04N68M88j00l51l05m12m70j37Q0o29k118
$$ y = [187915, 188185, 186914, 184819, 183126, 182534, 183235, 185200, 187916, 190378, 191911, 192718, 193366, 194146, 195119, 196207, 197034, 197292, 197469, 198440, 200032, 200871, 200168, 198809, 198050, 197911, 197658, 197141, 196724, 196325, 195527, 194377, 193305, 192425, 191550, 190731, 190135, 189628, 189067, 188749, 188956, 189293, 189180, 188810, 188891, 189537, 190072, 189983, 189457, 188925, 188623, 188761, 189610, 191122, 192725, 193814, 194348, 194825, 195641, 196516, 196683, 195736, 194172, 192909, 192389, 192458, 192920, 193800, 195105, 196841, 199270, 202622, 206490, 210080, 213105, 215986, 219151, 222703, 226720, 231144, 235380, 238828, 242020, 246342, 252366, 259275, 266182, 273061, 279970, 286373, 291883, 296811, 301319, 304852, 307106, 308789, 310570, 311940, 311958, 310663, 309019, 307953, 308056, 309602, 312073, 314172, 315110, 315433, 316017, 316826, 317434, 318053, 319139, 320517, 321875, 323550, 325797, 327776, 328426, 328060, 327956, 328524, 329012, 328912, 328561, 328256, 327844, 327374, 327237, 327317, 326688, 324570]
51696C24570l395l664k791j175L83J175J292J399J672J611J122R01J404K240K980
51681C29724L717M476M839M547L719K242o1k400l372k807k061j907j448Q7J787
51666C41082K419K256K322K596K374J819J845K660L474L582K969J927P15n31j887
51651C69622l459m852n412n280n431o233o759o189n122m646m806m833m446l975
51637B98179l566l073k597k436k674l238m052m722m550l365j945j128r64j105
51623B58764j371j566j375j064j481k688l389k552r38p8k68n95n27l14j11J79
51607B40626K31n10j795k556k177j165l93j61k27l64n43p35p11k14N95J022O48
51590B31571P3K99J340K153K179K062K481L094L299L303L667M240M336L746K932
$$ y = [324570, 321175, 317511, 314720, 313545, 313928, 315103, 316395, 317794, 319466, 321077, 322199, 323100, 324504, 326744, 329724, 333441, 337917, 342756, 347303, 351022, 353264, 353203, 350803, 347431, 344624, 342563, 340656, 339208, 339295, 341082, 343501, 345757, 348079, 350675, 353049, 354868, 356713, 359373, 362847, 366429, 369398, 371325, 372040, 371509, 369622, 366163, 361311, 355899, 350619, 345188, 338955, 332196, 326007, 320885, 316239, 311433, 306600, 302154, 298179, 294613, 291540, 288943, 286507, 283833, 280595, 276543, 271821, 267271, 263906, 261961, 260833, 259869, 258764, 257393, 255827, 254452, 253388, 251907, 249219, 245830, 243278, 242340, 242262, 241994, 241399, 240872, 240558, 240447, 240626, 240857, 240347, 238552, 235996, 233819, 232654, 232261, 232100, 231873, 231509, 230966, 230231, 229520, 229306, 229901, 230923, 231571, 231644, 231943, 233283, 235436, 237615, 239677, 242158, 245252, 248551, 251854, 255521, 259761, 264097, 267843, 270775]
51575B70775K405K348K608K676J994P07k25r9O81J149Q32p7j165k008k263j957
51559B78381j425q14l1P56J109J013R28J046J145J286J832K580K873K737K870
51544B96286L183K671J313O85J698L040L053K060J428J295Q19O6l3N88R40N75
51528C19667J48K64P33J105J155Q47M07M27J154J912J797P87m76j606k522k942
51512C22857k709k387k670l333l593l327l174l528m094m415m252l593k780k393
51498B76609k581k796k675k598k807k645j525j16M06o6o59q53p62l93L16R47R70
51481B58772O17N50Q61J185J477J801J740J036N52J400L245M570M647M174L935
51466B90562L932M022M403N079N618N750N631N375M978M736N086N895O515O518
$$ y = [270775, 273180, 275528, 278136, 280812, 282806, 283513, 283288, 283189, 283870, 285019, 285851, 285774, 284609, 282601, 280338, 278381, 276956, 276142, 276111, 276867, 277976, 278989, 279917, 280963, 282108, 283394, 285226, 287806, 290679, 293416, 296286, 299469, 302140, 303453, 304138, 305836, 308876, 311929, 313989, 315417, 316712, 317531, 317597, 317564, 318152, 319092, 319667, 319815, 320079, 320812, 321917, 323072, 323919, 324326, 324753, 325907, 327819, 329616, 330403, 329927, 328321, 325799, 322857, 320148, 317761, 315091, 311758, 308165, 304838, 301664, 298136, 294042, 289627, 285375, 281782, 279002, 276609, 274028, 271232, 268557, 265959, 263152, 260507, 258982, 258866, 259272, 259206, 258547, 257694, 256932, 256539, 256855, 257802, 258772, 259389, 259939, 260800, 261985, 263462, 265263, 267003, 268039, 268591, 269991, 273236, 277806, 282453, 286627, 290562, 294494, 298516, 302919, 307998, 313616, 319366, 324997, 330372, 335350, 340086, 345172, 351067, 357582, 364100]
51452C64100N942M921L748L031L139L566L535L060K718K625K445K154J931J520
51438D08435O34k41m09j41j92m23j42L41r0j434k384k390k524l582m690m658l773
51421C82337l240l502m020m253m050l435k663k243k404k696k542k000j640j765
51407C41884k068j952j084K90J508K114K192J995J480O23k00o10q13j212j647
51392C42500j670j434j592k365l317l980m226m091l868m156n151o080o120n587
51378B88863n394n589n505n204n485o286o371n090l379k483k555l063l732m411
51364B24316m677m306l693l277k933k348j683j338j394j600j739j718j514j197
51350A90899q69n69l90n41j035j477j574j581j799j976j787j498j418j110m3J245
$$ y = [364100, 370042, 374963, 378711, 381742, 384881, 388447, 391982, 395042, 397760, 400385, 402830, 404984, 406915, 408435, 409069, 408828, 408419, 408278, 408086, 407663, 407521, 407862, 407772, 406338, 403954, 401564, 399040, 395458, 390768, 386110, 382337, 379097, 375595, 371575, 367322, 363272, 359837, 357174, 354931, 352527, 349831, 347289, 345289, 343649, 341884, 339816, 337864, 336780, 337070, 338578, 340692, 342884, 344879, 346359, 346982, 346782, 346172, 345359, 344147, 342500, 340830, 339396, 337804, 335439, 332122, 328142, 323916, 319825, 315957, 311801, 306650, 300570, 294450, 288863, 283469, 277880, 272375, 267171, 261686, 255400, 249029, 243939, 240560, 238077, 235522, 232459, 228727, 224316, 219639, 215333, 211640, 208363, 205430, 203082, 201399, 200061, 198667, 197067, 195328, 193610, 192096, 190899, 190030, 189461, 189071, 188530, 187495, 186018, 184444, 182863, 181064, 179088, 177301, 175803, 174385, 173275, 173232, 174477]
51334A74477J730J485J469J857J799R76J57j4L21J021K153L112K842J460N28R74
51318A96347J945K317K272K490K867K996L076L354L297K373J051J96j74o46j380
51303B22381k121k808l429l611l134k524k487k970l378l410l103k507j874j849
51289A83176k704l656l672k729j711j258j317j629j959j984j549j053j086j655
51275A55214k097j834r26N8N12L24J8J97P73J094Q57L99l5o53j444j824j508j048
51257A48077r62q84k49N73O70j16r76j165o85o6J05l70r48p39L11J038M71p40
51239A43345j101k84N27L50l96o50j05O24Q05K13q26j690j800j020J51Q96P41
51222A39780L6l35R5Q28J033N68k2l80n86n40J25J248J930J690J211J366J980
$$ y = [174477, 176207, 177692, 179161, 181018, 182817, 183793, 183950, 183936, 184257, 185278, 187431, 190543, 193385, 194845, 195373, 196347, 198292, 200609, 202881, 205371, 208238, 211234, 214310, 217664, 220961, 223334, 224385, 224581, 224407, 223761, 222381, 220260, 217452, 214023, 210412, 207278, 204754, 202267, 199297, 195919, 192509, 189406, 186899, 185025, 183176, 180472, 176816, 173144, 170415, 168704, 167446, 166129, 164500, 162541, 160557, 159008, 157955, 156869, 155214, 153117, 151283, 150357, 150415, 150927, 151251, 151269, 151466, 152239, 153333, 154190, 154589, 154554, 153901, 152457, 150633, 149125, 148077, 147115, 146231, 145982, 146555, 147225, 147109, 146133, 144968, 144283, 144217, 144322, 143952, 143004, 142265, 142576, 143614, 144085, 143345, 142244, 141960, 142487, 142837, 142441, 141791, 141686, 142310, 143115, 143328, 142502, 140812, 139012, 137992, 138143, 139039, 139780, 139816, 139481, 139576, 140404, 141437, 142005, 141983, 141603, 141017, 140477, 140602, 141850, 143780, 145470, 146681, 148047, 150027]
51205A50027K274K114K014K019J565M64o69j257j407j408j127l45O64J359J571
51190A57858J497J151L46p05j243q23RL82K67L61Q24R49L72k09j21J82q3o02m10
51171A60002M42Q49L05m18n84m39m36m42k94m27j228k226k630k304j712j169p10
51154A46579m44m97o95p34n48k86o0N1m3k95m89n81p49r53q20k32L82N90N08M17
51134A41101K36k22o56m84M22J493K050J921J490J146Q19J60p46j230q50o9L29
51117A46910J89j44n67j132j439j056m36m72j076j244o67j80k60k82J82M64kn40
51099A38248k91M28P65P21P91Q17L11k91k6J102J970J887J360J125J232J373J491
51082A53013J600J473R43L24J17L64N19J40n14p46l37J23N7l31m54k35j0K68R24
$$ y = [150027, 152301, 154415, 156429, 158448, 160013, 160477, 159808, 158551, 157144, 155736, 154609, 154264, 154928, 156287, 157858, 159355, 160506, 160852, 160147, 158904, 158081, 158090, 158472, 158739, 159100, 159924, 160873, 161245, 161036, 160915, 161097, 161014, 160412, 160002, 160444, 161293, 161598, 161180, 160596, 160157, 159721, 159279, 158985, 158558, 157330, 155104, 152474, 150170, 148458, 147289, 146579, 146135, 145638, 144943, 144209, 143661, 143375, 143315, 143366, 143323, 143028, 142539, 141958, 141209, 140256, 139436, 139204, 139586, 140176, 140684, 141101, 141337, 141115, 140459, 139975, 140397, 141890, 143940, 145861, 147351, 148497, 149316, 149476, 148730, 147500, 146650, 146581, 146910, 147099, 146955, 146388, 145256, 143817, 142761, 142325, 141853, 140777, 139533, 138866, 138686, 138426, 138144, 138326, 138790, 138788, 138248, 137957, 138385, 139150, 139871, 140662, 141479, 141790, 141499, 141473, 142575, 144545, 146432, 147792, 148917, 150149, 151522, 153013, 154613, 156086, 157029, 157353, 157470, 157834, 158353, 158493, 157979, 157233, 156896, 157019, 157076, 156745, 156291, 156056, 156046, 156314, 157238]
51063A57238J662J690R12K59M03Q81R25N07J11j1J32M89Q05P34M33N59J274J864
51045A70867J753J326J188J238J089Q47Q62J074J196J224J248J119P32L23J33
51030A86219Q0Q4J98K36r8m07J80J541K220J284k98r61m92J41L15J41j62l42N1
51011A89930J044J870J952J846K361L176L332K671J952J708J912K455L169L581
50997B22959L459L333L802M634N230N547N807N890N840O374P820R096Q999Q069
50983C06859P901Q861R911J0527J1372J2924J4754J6492J8373K0581K2981K5677
50971D87213K8909L2326L5313L8177M1847M6316N0441N3659N6673O0008O2975
50960I93857O4741O5510O5878O5732O4531O2149N8824N4539M9066M2444L5030
$$ y = [157238, 158900, 160590, 161502, 161761, 162164, 163045, 163970, 164477, 164588, 164577, 164709, 165198, 166003, 166737, 167170, 167729, 169003, 170867, 172620, 173946, 175134, 176372, 177461, 178308, 179170, 180244, 181440, 182664, 183912, 185031, 185763, 186086, 186219, 186299, 186383, 186581, 186817, 186719, 186312, 186492, 188033, 190253, 191537, 191239, 190278, 189786, 189927, 190242, 190383, 190221, 189879, 189930, 190974, 192844, 194796, 196642, 199003, 202179, 205511, 208182, 210134, 211842, 213754, 216209, 219378, 222959, 226418, 229751, 233553, 238187, 243417, 248964, 254771, 260661, 266501, 272875, 280695, 289791, 298790, 306859, 314760, 323621, 333532, 344059, 355431, 368355, 383109, 399601, 417974, 438555, 461536, 487213, 516122, 548448, 583761, 621938, 663785, 710101, 760542, 814201, 870874, 930882, 993857, 1058598, 1124108, 1189986, 1255718, 1320249, 1382398, 1441222, 1495761, 1544827, 1587271, 1622301]
50949A622301K7214J9257J1394L945k604p859j2009j5686j9059k1432k2198k1620
50937A561644k0229j8186j6029j5184j6449j8544j9660k0111k1777k5068k8305
50926A342102l0370l2207l4907l7918m0156m1592m2731m3414m3277m2633m1966
50915I10931m1058l9416l7073l4369l1516k8838k6821k5279k3261k0371j7542
50904E85387j5709j4496j2948j0977r128p506n825m191k896j743l58R86J662J609
50890E03867J331J128R34P41N63K38j80r9Q74K121K724K765L113M000M759N065
50874E33944N510O593P892Q787R485J0679J2484J4282J5621J6735J8048J9592
50862F79652K1269K3442K6686L0892L5131L8811M2598M7596N3850O0468O7221
$$ y = [1622301, 1649515, 1668772, 1680166, 1684111, 1681507, 1673648, 1661639, 1645953, 1626894, 1605462, 1583264, 1561644, 1541415, 1523229, 1507200, 1492016, 1475567, 1457023, 1437363, 1417252, 1395475, 1370407, 1342102, 1311732, 1279525, 1244618, 1206700, 1166544, 1124952, 1082221, 1038807, 995530, 952897, 910931, 869873, 830457, 793384, 759015, 727499, 698661, 671840, 646561, 623300, 602929, 585387, 569678, 555182, 542234, 531257, 522129, 514623, 508798, 504607, 501711, 499968, 499610, 500596, 502258, 503867, 505198, 506326, 507260, 508001, 508564, 508802, 508622, 508523, 509397, 511518, 514242, 517007, 520120, 524120, 528879, 533944, 539454, 546047, 553939, 562726, 572211, 582890, 595374, 609656, 625277, 642012, 660060, 679652, 700921, 724363, 751049, 781941, 817072, 855883, 898481, 946077, 999927, 1060395, 1127616]
50851A127616P5058Q4622R5014J04705J13236J21241J29130J36537J43018J48384
50841B278561J52168J53398J51322J46010J37831J26676J12109R4210P3922N2595
50831C478802L1431J1342o964k2972l6301m6564n3450n7046n7825n6224n2449
50820C131780m7008m1121l6109l2497l0263k9799l1862l6463m2569m9345n6950
50809B697794o5581p4377q2078q8369r3778r8434j01654j02754j01573r8329r3512
50798A697355q7906q2184p6431p0499o4604n9058n3537m7358m0502l3711k7574
50787A053991k2097j7206j3005r391n977k669J36K062L167L739M060M268M137
50774A005215L124J134j020k489l568n214p532r593j0800j1538j2272j2853j3153
$$ y = [1127616, 1202674, 1287296, 1382310, 1487015, 1600251, 1721492, 1850622, 1987159, 2130177, 2278561, 2430729, 2584127, 2735449, 2881459, 3019290, 3145966, 3258075, 3352285, 3426207, 3478802, 3510233, 3521575, 3514611, 3491639, 3455338, 3408774, 3355324, 3298278, 3240453, 3184229, 3131780, 3084772, 3043651, 3007542, 2975045, 2944782, 2914983, 2883121, 2846658, 2804089, 2754744, 2697794, 2632213, 2557836, 2475758, 2387389, 2293611, 2195177, 2093523, 1990769, 1889196, 1790867, 1697355, 1609449, 1527265, 1450834, 1380335, 1315731, 1256673, 1203136, 1155778, 1115276, 1081565, 1053991, 1031894, 1014688, 1001683, 992292, 986315, 983646, 983782, 985844, 989011, 992750, 996810, 1001078, 1005215, 1008339, 1009473, 1008453, 1005964, 1002396, 997182, 989650, 980057, 969257, 957719, 945447, 932594, 919441]
50761I19441j3483j3960j3980j2902j0885q580o415m479k795j335N5J587L563
50748H35832O383J0082J3924J7003J9297K1564K4224K6982K9659L2571L5886L9329
50736A112736M2912M7280N2935N9629O6744P3797Q0309Q5848R0509R4732R8355
50725A905786J00434J00300R8096R3899Q7147P7524O5710N2551L8070K2031N109
50714B646657j1258k5932l8391m8254n5154n9121o0478n9454n6221n1333m5736
50703B135325m0287l5370l0972k7070k4087k2860k3904k6777l0642l5292m1015
50692A797049m7436n3266n7513o0239o1791o2026o0792n8546n5838n2631m8683
50681A178288m4282l9958l5725l1163k6124k0921j5915j1215o696k090K737P516
$$ y = [919441, 905958, 891998, 878018, 865116, 854231, 845651, 839236, 834757, 831962, 830627, 830682, 832269, 835832, 842215, 852297, 866221, 883224, 902521, 924085, 948309, 975291, 1004950, 1037521, 1073407, 1112736, 1155648, 1202928, 1255863, 1315492, 1382236, 1456033, 1536342, 1622190, 1712699, 1807431, 1905786, 2006220, 2106520, 2204616, 2298515, 2385662, 2463186, 2528896, 2581447, 2619517, 2641548, 2646657, 2635399, 2609467, 2571076, 2522822, 2467668, 2408547, 2348069, 2288615, 2232394, 2181061, 2135325, 2095038, 2059668, 2028696, 2001626, 1977539, 1954679, 1930775, 1903998, 1873356, 1838064, 1797049, 1749613, 1696347, 1638834, 1578595, 1516804, 1454778, 1393986, 1335440, 1279602, 1226971, 1178288, 1134006, 1094048, 1058323, 1027160, 1001036, 980115, 964200, 952985, 946289, 944199, 946936, 954452]
50669I54452J1819J5641J9398K3229K6673K9201L0530L0500K9204K7420K6203
50658A224270K5659K4848K3156K1122J9452J8008J6304J4401J2745J1548J0947
50647A422460J1153J1935J2537J2750J3482J5541J8420K1113K3623K6646L0139
50636A619799L3255L5622L7711L9745M1149M1305M0287L8547L6303L3514L0079
50625B027316K5961K1294J6507J2126Q436N466L317K250K424L661N500P566R980
50612B151804J3231J7375K1424K4014K4604K3727K1998J9476J6050J1792O790
50601B352285J147m835j0989j7879k6166l5305m3739n0696n6768o2377o6826o9536
50589A908316p1017p1723p1022o8445o5101o2495o0540n8144n5204n2558n0191
$$ y = [954452, 966271, 981912, 1001310, 1024539, 1051212, 1080413, 1110943, 1141443, 1170647, 1198067, 1224270, 1249929, 1274777, 1297933, 1319055, 1338507, 1356515, 1372819, 1387220, 1399965, 1411513, 1422460, 1433613, 1445548, 1458085, 1470835, 1484317, 1499858, 1518278, 1539391, 1563014, 1589660, 1619799, 1653054, 1688676, 1726387, 1766132, 1807281, 1848586, 1888873, 1927420, 1963723, 1997237, 2027316, 2053277, 2074571, 2091078, 2103204, 2111640, 2117106, 2120423, 2122673, 2125097, 2128758, 2134258, 2141824, 2151804, 2165035, 2182410, 2203834, 2227848, 2252452, 2276179, 2298177, 2317653, 2333703, 2345495, 2352285, 2353432, 2348597, 2337608, 2319729, 2293563, 2258258, 2214519, 2163823, 2107055, 2044678, 1977852, 1908316, 1837299, 1765576, 1694554, 1626109, 1561008, 1498513, 1437973, 1379829, 1324625, 1272067, 1221876]
50578A221876m7045m2841l8626l5190l1995k8260k4204k0585j7621j4919j2152
50567I08438r363o770m443k118O02L695O551Q728J0634J3067J6193J9453K2299
50554I86966K4615K6568K8556L1106L4329L7562M0056M1796M3263M4654M5798
50543A385269M6531M6579M5503M3463M1674M1157M1318M0748L9353L8569L9356
50532A849520M1117M2889M4613M6686M9121N1746N4627N7772O0898O4027O7657
50521B430673P1860P5670P8090P9309Q0112Q0400P9131P5715P0641O4380N6487
50510C242468M6326L4256K1390Q320n192j9144l2632m4658n5031o3886p0675p4412
50498B987130p4824p2529o8066o1453n2912m3288l3291k2934j2160j639P584J4949
$$ y = [1221876, 1174831, 1131990, 1093364, 1058174, 1026179, 997919, 973715, 953130, 935509, 920590, 908438, 899075, 892305, 887862, 885744, 886346, 890041, 896592, 905320, 915954, 929021, 945214, 964667, 986966, 1011581, 1038149, 1066705, 1097811, 1132140, 1169702, 1209758, 1251554, 1294817, 1339471, 1385269, 1431800, 1478379, 1523882, 1567345, 1609019, 1650176, 1691494, 1732242, 1771595, 1810164, 1849520, 1890637, 1933526, 1978139, 2024825, 2073946, 2125692, 2180319, 2238091, 2298989, 2363016, 2430673, 2502533, 2578203, 2656293, 2735602, 2815714, 2896114, 2975245, 3050960, 3121601, 3185981, 3242468, 3288794, 3323050, 3344440, 3352760, 3347568, 3328424, 3295792, 3251134, 3196103, 3132217, 3061542, 2987130, 2912306, 2839777, 2771711, 2710258, 2657346, 2614058, 2580767, 2557833, 2545673, 2544034, 2551618, 2566567]
50486B566567K0486K4234K5865K4743K0139J1714Jj3789k8526m3456n7717p0196
50474B480065q0135q7463r2347r4873r5361r4394r2247q8764q4123p9073p4191
50463A517094o9406o4539n9628n4464m8653m2531l7226l3217k9654k5713k1745
50452A030318j8388j5334j1933q334n133k346M44L405O545R847J2698J4085J4214
50439A030088J5015J7865K1654K4304K5473K6369K7628K9021L0710L3115L5593
50428A316835L6948L7182L7249L7181L6100L4182L2845L2631L2431L1302K9638
50417A694524K8010K6311K4694K4058K4777K5958K6788K7628K9093L0963L2734
50406A995538L4353L5652L5826L4376L2027K9892K8184K6303K3678J9946J4836
$$ y = [2566567, 2587053, 2611287, 2637152, 2661895, 2682034, 2693748, 2693749, 2679960, 2651434, 2607978, 2550261, 2480065, 2399930, 2312467, 2220120, 2125247, 2029886, 1935492, 1843245, 1754481, 1670358, 1591285, 1517094, 1447688, 1383149, 1323521, 1269057, 1220404, 1177873, 1140647, 1107430, 1077776, 1052063, 1030318, 1011930, 996596, 984663, 976329, 971196, 968850, 969294, 972699, 979244, 989091, 1001789, 1015874, 1030088, 1045103, 1062968, 1084622, 1108926, 1134399, 1160768, 1188396, 1217417, 1248127, 1281242, 1316835, 1353783, 1390965, 1428214, 1465395, 1501495, 1535677, 1568522, 1601153, 1633584, 1664886, 1694524, 1722534, 1748845, 1773539, 1797597, 1822374, 1848332, 1875120, 1902748, 1931841, 1962804, 1995538, 2029891, 2065543, 2101369, 2135745, 2167772, 2197664, 2225848, 2252151, 2275829, 2295775, 2310611]
50395B310611Q577J974m514j1488j9752k9068l8294m6517n3611n9788o5054o9049
50383A924027p1184p1111o9104o5775o1370n5729m8986m1808l4745k7770k0667
50372A355778j3512o517J50O183J1000J4056J5121J4206J1510P382K077m393j1805
50359A401236j9249k5501k9915l2619l4090l4970l5944l7097l7597l6725l5008
50348A042521l3524l2295l0429k7757k5190k3268k1438j9177j6820j4793j2901
50337G84929j0923r148p708o093l942j706P5J649L573N758P595Q779R555J0261
50323G92654J1012J1814J2707J3801J5108J6326J7040J7419J8271J9902K1375
50312I67429K1715K1531K2287K4101K5372K4908K3215K1374J9684J7983J6396
$$ y = [2310611, 2319188, 2321162, 2316648, 2305160, 2285408, 2256340, 2218046, 2171529, 2117918, 2058130, 1993076, 1924027, 1852843, 1781732, 1712628, 1646853, 1585483, 1529754, 1480768, 1438960, 1404215, 1376445, 1355778, 1342266, 1335749, 1335899, 1342082, 1353082, 1367138, 1382259, 1396465, 1407975, 1415357, 1417434, 1413041, 1401236, 1381987, 1356486, 1326571, 1293952, 1259862, 1224892, 1188948, 1151851, 1114254, 1077529, 1042521, 1008997, 976702, 946273, 918516, 893326, 870058, 848620, 829443, 812623, 797830, 784929, 774006, 764858, 757150, 751057, 747115, 745409, 745484, 747133, 750706, 756464, 764059, 772838, 782393, 792654, 803666, 815480, 828187, 841988, 857096, 873422, 890462, 907881, 926152, 946054, 967429, 989144, 1010675, 1032962, 1057063, 1082435, 1107343, 1130558, 1151932, 1171616, 1189599, 1205995]
50301A205995J5039J3580J1702R555P287M684J638j476m213o474q194r219r714
50288A230190j0228j1141j2420j4052j6059j8130j9863k1397k3073k4511k4962
50277A034354k4583k4271k4105k3234k1635k0533k0529k0596j9789j8766j8504
50266G97809j8578j7864j6356j5033j4306j3573j2222j0251q117o437n551n068
50254F54453m261l132k400k192j679n27L43K54K7P58K127L002L082K861K501J831
50238F57048J098O89L64k83r48j040p20n82o79p38j037k054l379m032l817l453
50222F36437l412l449l328l181l030k668k073j473q66l0J048K153L168L967M234
50207F27497L877L432L504L931M079L745L255K851K582K606K973L213K785J884
$$ y = [1205995, 1221034, 1234614, 1246316, 1255871, 1263158, 1267842, 1269480, 1268004, 1263791, 1257317, 1249123, 1239904, 1230190, 1219962, 1208821, 1196401, 1182349, 1166290, 1148160, 1128297, 1106900, 1083827, 1059316, 1034354, 1009771, 985500, 961395, 938161, 916526, 895993, 875464, 854868, 835079, 816313, 797809, 779231, 761367, 745011, 729978, 715672, 702099, 689877, 679626, 671509, 665072, 659521, 654453, 650192, 647060, 644660, 642468, 640789, 640262, 640605, 640859, 640886, 641644, 643771, 646773, 649855, 652716, 655217, 657048, 658146, 658835, 659199, 658916, 657968, 656928, 656208, 655626, 654947, 654209, 653172, 651118, 647739, 643707, 639890, 636437, 633025, 629576, 626248, 623067, 620037, 617369, 615296, 613823, 612957, 612927, 613975, 616128, 619296, 623263, 627497, 631374, 634806, 638310, 642241, 646320, 650065, 653320, 656171, 658753, 661359, 664332, 667545, 670330, 672214]
50193F72214J287J406J919K299K259J769R97J78o91j767k844l386l438l902n286
50178F63014o759p195o695o289o430o667o571o095n084l385j382K69J479K541
50164F04751L246K972J792O23M3l58j160k293l398m482n712o831p230o663n602
50149E69698m807m560m444l982l336l046l110k871j950q06j01K8j90n19n87K8
50133E35445J148K011K324K729L703M697N059N113N455N825N601N016M733M623
50119E93482M061L333L465M527N221M506K848J445Q64Q37Q56N80k0o33q38m81
50103F24053K62R96J189M48r08j856j707q48k8O61J523K390K780K763K914L541
50087F38173M494N659O987Q191R019R742J0747J1830J2454J2535J2436J2366J2392
$$ y = [672214, 673501, 674907, 676826, 679125, 681384, 683153, 684150, 684328, 683637, 681870, 679026, 675640, 672202, 668300, 663014, 656255, 649060, 642365, 636076, 629646, 622979, 616408, 610313, 605229, 601844, 600462, 600731, 602210, 604751, 607997, 610969, 612761, 613384, 613427, 613069, 611909, 609616, 606218, 601736, 596024, 589193, 581963, 575300, 569698, 564891, 560331, 555887, 551905, 548569, 545523, 542413, 539542, 537592, 536786, 536685, 536713, 536523, 536004, 535417, 535445, 536593, 538604, 540928, 543657, 547360, 552057, 557116, 562229, 567684, 573509, 579110, 584126, 588859, 593482, 597543, 600876, 604341, 608868, 614089, 618595, 621443, 622888, 623752, 624589, 625445, 626025, 626005, 625372, 624534, 624053, 624315, 625311, 626500, 626948, 626040, 624184, 622477, 621629, 621601, 622262, 623785, 626175, 628955, 631718, 634632, 638173, 642667, 648326, 655313, 663504, 672523, 682265, 693012, 704842, 717296, 729831, 742267, 754633, 767025]
50074G67025J2775J3574J4222J4206J3964J4237J4795J4711J3810J2778J1900
50063I17997J0723R137P771O980O263N143L964L378L517L953M124L621K500J361
50049I90432P68O00L46j05n57j115j927k497k193j377j142j725k202k018j846
50034I73442k437l426l947l761l193k378j247O7J307K512L903N489P142R019J1615
50019I94107J5232J9465K3324K6153K8352L0841L3716L5930L6584L5910L4474
50008A314088L2053K8185K3419J9044J5676J3021J0921R714R382R251Q706P542
49996A501002N470J986l040r165j5945k3097l0127l6423m1741m6024m8765m9416
49984A204715m8435m7056m5802m4068m1379l8207l5186l2335k9501k6905k4723
$$ y = [767025, 779800, 793374, 807596, 821802, 835766, 850003, 864798, 879509, 893319, 906097, 917997, 928720, 937857, 945628, 952608, 958871, 964014, 967978, 971356, 974873, 978826, 982950, 986571, 989071, 990432, 991200, 991800, 992146, 992041, 991484, 990369, 988442, 985945, 983752, 982375, 981233, 979508, 977306, 975288, 973442, 971005, 967579, 963632, 959871, 956678, 954300, 953053, 953120, 954427, 956939, 960842, 966331, 973473, 982492, 994107, 1009339, 1028804, 1052128, 1078281, 1106633, 1137474, 1171190, 1207120, 1243704, 1279614, 1314088, 1346141, 1374326, 1397745, 1416789, 1432465, 1445486, 1456407, 1466121, 1475503, 1484754, 1493460, 1501002, 1506472, 1508458, 1505418, 1496253, 1480308, 1457211, 1427084, 1390661, 1348920, 1302896, 1254131, 1204715, 1156280, 1109224, 1063422, 1019354, 977975, 939768, 904582, 872247, 842746, 815841, 791118]
49973G91118k2683k0513j8361j6425j4632j3042j1997j1479j0801r343p350n666
49961F28826m924n138n792o153n820n109m665m729n127n716o280o259n311m175
49947E53628m049m992n737n322m086k866k014j582j607j788j509o99OL17P81J752
49931E20233K605K730K694L607N583P568Q644Q922R110R590J0064J0013R412Q905
49917F19680R088R852J0727J1587J2585J3578J4336J5143J6440J8012J9379K0979
49905G91386K3829K7927L2034L5539L9365M4438N0221N5501N9807O3125O4896
49894A288068O4421O1915N8339N4371N0165M5975M2238L9170L6737L4924L3523
49883A809846L1919K9576K6528K2949J8414J2120L819n867j5988k5731l4396m1429
$$ y = [791118, 768435, 747922, 729561, 713136, 698504, 685462, 673465, 661986, 651185, 641842, 634492, 628826, 623902, 618764, 612972, 606819, 600999, 595890, 591225, 586496, 581369, 575653, 569373, 563114, 557803, 553628, 549579, 544587, 538850, 533528, 529442, 526576, 524562, 522980, 521373, 519585, 518076, 517377, 517383, 517700, 518481, 520233, 522838, 525568, 528262, 531869, 537452, 545020, 553664, 562586, 571696, 581286, 591350, 601363, 610775, 619680, 628768, 638620, 649347, 660934, 673519, 687097, 701433, 716576, 733016, 751028, 770407, 791386, 815215, 843142, 875176, 910715, 950080, 994518, 1044739, 1100240, 1160047, 1223172, 1288068, 1352489, 1414404, 1472743, 1527114, 1577279, 1623254, 1665492, 1704662, 1741399, 1776323, 1809846, 1841765, 1871341, 1897869, 1920818, 1939232, 1951352, 1955171, 1949304, 1933316, 1907585, 1873189, 1831760]
49871A831760m6710n0642n3821n6532n8502n9237n8676n7470n6389n5566n4492
49860A223723n2696n0066m6789m3333m0367l8131l6016l3287l0140k7379k5227
49849H00292k3176k0988j8987j7243j5415j3586j2425j2168j2250j2241j2327
49838F29486j2499j2195j1283j0560j0600j0822j0365r317q322p486o444n202
49826E14391m210l752l730l847l699l043k260k104k649l018k525j547p68j96M89
49811D77532J173J583J915K503L165L477L481L454L297K738J985J616J860K437
49797E12216K981L319L474L700M318N274O100O560O993P746Q669R551J0638J2272
49783F03811J4357J6599J9085K2156K5871K9994L4301L8603M2511M5516M7250
$$ y = [1831760, 1785050, 1734408, 1680587, 1624055, 1565553, 1506316, 1447640, 1390170, 1333781, 1278215, 1223723, 1171027, 1120961, 1074172, 1030839, 990472, 952341, 916325, 883038, 852898, 825519, 800292, 777116, 756128, 737141, 719898, 704483, 690897, 678472, 666304, 654054, 641813, 629486, 616987, 604792, 593509, 582949, 572349, 561527, 551162, 541845, 533523, 526037, 519593, 514391, 510181, 506429, 502699, 498852, 495153, 492110, 489850, 487746, 485097, 482079, 479554, 478007, 477239, 477043, 477532, 478705, 480288, 482203, 484706, 487871, 491348, 494829, 498283, 501580, 504318, 506303, 507919, 509779, 512216, 515197, 518516, 521990, 525690, 530008, 535282, 541382, 547942, 554935, 562681, 571350, 580901, 591539, 603811, 618168, 634767, 653852, 676008, 701879, 731873, 766174, 804777, 847288, 892804, 940054]
49772I40054M7602M6726M4822M1786L7176L1007K4416J8954J5243J2856J1385
49761A272027J0783J0746J0635J0189R409P530L193l938j2569k1134k8893l5453
49749A232525m0331m3620m6089m7882m8084m6180m3090m0014l7167l4345l1730
49738G73993k9322k6531k3306k0601j8832j6845j3755j0730r417r378q689o718
49726E79869m735l897m068m575m917m724m095l834m397m922m401l426l408m258
49712E20212m441l393k351k397l054l358l221l082l032k907k644k079j009L40
49698D83584J363J820J926J717R76o7p79r37r09q15l36M99J052R43N16K34J49
49681D90936K36O27J173J315P75l4n45n92l08J37M94N75N48Q02J397K006K402
$$ y = [940054, 987656, 1034382, 1079204, 1120990, 1158166, 1189173, 1213589, 1232543, 1247786, 1260642, 1272027, 1282810, 1293556, 1304191, 1314380, 1323789, 1331319, 1334512, 1330574, 1318005, 1296871, 1267978, 1232525, 1192194, 1148574, 1102485, 1054603, 1006519, 960339, 917249, 877235, 840068, 805723, 773993, 744671, 718140, 694834, 674233, 655401, 638556, 624801, 614071, 604654, 595276, 586587, 579869, 575134, 571237, 567169, 562594, 557677, 552953, 548858, 545024, 540627, 535705, 531304, 527878, 524470, 520212, 515771, 512378, 510027, 507630, 504576, 501218, 497997, 494915, 491883, 488976, 486332, 484253, 483244, 483584, 484947, 486767, 488693, 490410, 491386, 491319, 490540, 489603, 488694, 487879, 487543, 488042, 489094, 490037, 490553, 490787, 490936, 491172, 491799, 492972, 494287, 495062, 495028, 494483, 493891, 493583, 493720, 494214, 494789, 495337, 496139, 497536, 499542, 501944]
49664E01944K634K754K765K791K880K780K288J788J823K289K565K401K079J719
49650E35500J136M13k1KK24M90R22J495J890J918J627J092M96L46J014K134K969
$$ y = [501944, 504578, 507332, 510097, 512888, 515768, 518548, 520836, 522624, 524447, 526736, 529301, 531702, 533781, 535500, 536636, 537049, 537028, 537030, 537254, 537744, 538666, 540161, 542051, 543969, 545596, 546688, 547184, 547530, 548544, 550678, 553647]
$$ [...]
##END NTUPLES=NMR SPECTRUM
##END=
