
##TITLE=AC1268_CTIAH12086_6642501_yozsytwoCr
##JCAMPDX= 6.0         $$ Bruker NMR JCAMP-DX V2.0
##DATA TYPE= NMR SPECTRUM
##DATA CLASS= NTUPLES
##ORIGIN= BRUKER
##OWNER= Administrator
$$ 1.72 TOPSPIN		Version 2.1
$$ 2012-08-08 19:57:04.343 -0500  Administrator@TOPSPIN
$$ Compression mode = diff/dup
##.OBSERVE FREQUENCY= 400.02188249412
##.OBSERVE NUCLEUS= ^1H
##.ACQUISITION MODE= SIMULTANEOUS (DQD)
##.ACQUISITION SCHEME= undefined
##.AVERAGES= 8
##.DIGITISER RES= 22
##SPECTROMETER/DATA SYSTEM= spect
##.PULSE SEQUENCE= zg30
##.SOLVENT NAME= COFFEE_meoh
##.SHIFT REFERENCE= INTERNAL, COFFEE_meoh, 1, 14.98509
##AUDIT TRAIL= $$ (NUMBER, WHEN, WHO, WHERE, PROCESS, VERSION, WHAT)
$$ ##TITLE= Audit trail, TOPSPIN		Version 2.1
$$ ##JCAMPDX= 5.01
$$ ##ORIGIN= Bruker BioSpin GmbH
$$ ##OWNER= Administrator
$$ $$ C:\Bruker\TOPSPIN/data/COFFEE/nmr/AC1268_CTIAH12086_6642501_yozsytwoCr/10/pdata/1/auditp.txt
$$ ##AUDIT TRAIL=  $$ (NUMBER, WHEN, WHO, WHERE, PROCESS, VERSION, WHAT)
(   1,<2012-08-08 19:56:57.531 -0500>,<Administrator>,<TOPSPIN>,<go>,<TOPSPIN 2.1>,
      <created by zg
	started at 2012-08-08 19:55:51.109 -0500,
	POWCHK enabled, PULCHK disabled,
       configuration hash MD5:
       6B 1B 68 BB D9 2E 58 E2 7F 35 AD 54 07 DF 0E 41
       data hash MD5: 64K
       A1 8B 3A 7D 7E 0C DB 5B 5B D7 18 CB 7F 3C CB F1>)
(   2,<2012-08-08 19:57:00.343 -0500>,<Administrator>,<TOPSPIN>,<proc1d>,<TOPSPIN 2.1>,
      <Start of raw data processing
       efp LB = 0 FT_mod = 6 PKNL = 1 PHC0 = 0 PHC1 = 0 SI = 32K 
       data hash MD5: 32K
       33 C4 51 02 B8 9A 91 27 70 7E E5 88 14 72 58 FB>)
(   3,<2012-08-08 19:57:00.671 -0500>,<Administrator>,<TOPSPIN>,<proc1d>,<TOPSPIN 2.1>,
      <pk PHC0 = 175.8746 PHC1 = 0 
       data hash MD5: 32K
       1D 85 48 38 13 17 D9 AD F5 C6 2D 51 89 3E 47 97>)
(   4,<2012-08-08 19:57:00.734 -0500>,<Administrator>,<TOPSPIN>,<proc1d>,<TOPSPIN 2.1>,
      <abs ABSG = 1 
       data hash MD5: 32K
       66 D2 94 6D B8 BE A0 72 D1 81 54 B8 60 93 8E 6E>)
(   5,<2012-08-08 19:57:00.765 -0500>,<Administrator>,<TOPSPIN>,<proc1d>,<TOPSPIN 2.1>,
      <abs ABSG = 2 
       data hash MD5: 32K
       CF 18 74 C2 CD 10 D1 DF 86 85 9F B4 AE 65 89 31>)
(   6,<2012-08-08 19:57:00.796 -0500>,<Administrator>,<TOPSPIN>,<proc1d>,<TOPSPIN 2.1>,
      <abs ABSG = 3 
       data hash MD5: 32K
       2B C6 BE 65 52 3A 52 3D 1F 09 32 E2 B7 72 FB 6B>)
(   7,<2012-08-08 19:57:00.828 -0500>,<Administrator>,<TOPSPIN>,<proc1d>,<TOPSPIN 2.1>,
      <abs ABSG = 4 
       data hash MD5: 32K
       B7 C0 7A 83 2B 43 02 1C DB D9 0D 02 84 88 C0 E3>)
(   8,<2012-08-08 19:57:00.843 -0500>,<Administrator>,<TOPSPIN>,<proc1d>,<TOPSPIN 2.1>,
      <abs ABSG = 5 
       data hash MD5: 32K
       21 9B 17 E8 39 7C 42 4F AF 3B D9 37 22 BE A9 12>)
$$ ##END=
$$ 
$$ $$ hash MD5
$$ $$ 89 C0 2B 3D 70 CC 42 C8 D5 3F 59 E2 98 EA A4 40
##$RELAX= 
##$RELAX= 
##$RELAX= 
##$RELAX= 
##$RELAX= 
##$RELAX= 
##$RELAX= 
$$ Bruker specific parameters
$$ --------------------------
$$ [...]
150 150 150 150 150 150 150 150
##$TP07= 0
##$TPNAME0= <>
##$TPNAME1= <>
##$TPNAME2= <>
##$TPNAME3= <>
##$TPNAME4= <>
##$TPNAME5= <>
##$TPNAME6= <>
##$TPNAME7= <>
##$TPOAL= (0..7)
0.5 0.5 0.5 0.5 0.5 0.5 0.5 0.5
##$TPOFFS= (0..7)
0 0 0 0 0 0 0 0
##$TUNHIN= 0
##$TUNHOUT= 0
##$TUNXOUT= 0
##$USERA1= <user>
##$USERA2= <user>
##$USERA3= <user>
##$USERA4= <user>
##$USERA5= <user>
##$V9= 5
##$VALIST= <valist>
##$VCLIST= <CCCCCCCCCCCCCCC>
##$VD= 0
##$VDLIST= <DDDDDDDDDDDDDDD>
##$VPLIST= <PPPPPPPPPPPPPPP>
##$VTLIST= <TTTTTTTTTTTTTTT>
##$WBST= 1024
##$WBSW= 4
##$XGAIN= (0..3)
0 0 0 0
##$XL= 0
##$YL= 0
##$YMAX_a= 473285
##$YMIN_a= -615297
##$ZGOPTNS= <>
##$ZL1= 120
##$ZL2= 120
##$ZL3= 120
##$ZL4= 120
##$ABSF1= 14.98509
##$ABSF2= -5.573092
##$ABSG= 5
##$ABSL= 3
##$ALPHA= 0
##$AQORDER= 0
##$ASSFAC= 0
##$ASSFACI= 0
##$ASSFACX= 0
##$ASSWID= 0
##$AUNMP= <proc_prof1d_extract_pilot.lims>
##$AXLEFT= 0
##$AXNAME= <>
##$AXNUC= <1H>
##$AXRIGHT= 0
##$AXTYPE= 0
##$AXUNIT= <>
##$AZFE= 0.1
##$AZFW= 0.1
##$BCFW= 0
##$BC_mod= 0
##$BYTORDP= 0
##$COROFFS= 0
##$CY= 15
##$DATMOD= 1
##$DC= 0
##$DFILT= <>
##$DTYPP= 0
##$F1P= 0
##$F2P= 0
##$FCOR= 0.5
##$FTSIZE= 32768
##$FT_mod= 6
##$GAMMA= 0
##$GB= 0
##$INTBC= 1
##$INTSCL= 1
##$ISEN= 128
##$LB= 0
##$LEV0= 0
##$LPBIN= 0
##$MAXI= 10000
##$MC2= 0
##$MEAN= 0
##$ME_mod= 0
##$MI= 0
##$NCOEF= 0
##$NC_proc= -8
##$NLEV= 6
##$NOISF1= 0
##$NOISF2= 0
##$NSP= 0
##$NTH_PI= 0
##$NZP= 0
##$OFFSET= 14.98509
##$PC= 1
##$PHC0= 175.8746
##$PHC1= 0
##$PH_mod= 1
##$PKNL= yes
##$PPARMOD= 0
##$PPDIAG= 0
##$PPIPTYP= 0
##$PPMPNUM= 2147483647
##$PPRESOL= 1
##$PSCAL= 4
##$PSIGN= 0
##$PYNMP= <proc.py>
##$REVERSE= no
##$SF= 400.02
##$SI= 32768
##$SIGF1= 0
##$SIGF2= 0
##$SINO= 400
##$SIOLD= 32768
##$SPECTYP= <>
##$SREGLST= <1H.CDCl3>
##$SSB= 0
##$STSI= 32768
##$STSR= 0
##$SW_p= 8223.68421052631
##$SYMM= 0
##$S_DEV= 0
##$TDeff= 65536
##$TDoff= 0
##$TI= <>
##$TILT= no
##$TM1= 0
##$TM2= 0
##$TOPLEV= 0
##$USERP1= <user>
##$USERP2= <user>
##$USERP3= <user>
##$USERP4= <user>
##$USERP5= <user>
##$WDW= 1
##$XDIM= 32768
##$YMAX_p= 451609656
##$YMIN_p= -724073
##$CURPLOT= <Network HP LaserJet P1505>
##$CURPRIN= <$Network HP LaserJet P1505>
##$DFORMAT= <normdp>
##$LAYOUT= <+/1D_H.xwp>
##$LFORMAT= <normlp>
##$PFORMAT= <normpl>
##$SURQMSG= 1
$$ End of Bruker specific parameters
$$ ---------------------------------
##NTUPLES= NMR SPECTRUM
##VAR_NAME=  FREQUENCY,     SPECTRUM/REAL,   SPECTRUM/IMAG
##SYMBOL=    X,             R,               I
##VAR_TYPE=  INDEPENDENT,   DEPENDENT,       DEPENDENT
##VAR_FORM=  AFFN,          ASDF,            ASDF
##VAR_DIM=   32768,         32768,           32768
##UNITS=     HZ,            ARBITRARY UNITS, ARBITRARY UNITS
##FACTOR=    0.250966925370066, 1,           1
##FIRST=     8223.43324360094, 14864,        134418
##LAST=      0,             107583,          -164953
##MIN=       0,             -724073,         0
##MAX=       8223.43324360094, 451609656,    0
$$ Real data points
##PAGE= N=1
##DATA TABLE= (X++(R..R)), XYDATA
$$ [...]
19475c08894P5229J11287A41627d0753O965d306k53555C8540b71074a6173I207
19463a81868m8106k7882a7597n8551l5650B99276d7404j63802c3427o6289C95629
19451c88398a48139A6500b87307r7777C3549J19080E6784b86093a17523B33942
19440c33057B59566b04300b8253G7465b93604h5851n2516B38601i0424A25636
19429A2218a66593k43728a28610l6666I1032Q1599C6686b52357j6590E3407b98325
19417c210j19501l27041F6774b23901J4055M6481C09221a36708m531j27583e1307
19405c78695D3056g710D4514J1440g5687j79644l1436d9393B35068a17672j95148
19394c12820K6567B55813c3562A26436j4559g9517q3461j37460K0971a37005k1037
$$ y = [-308894, -233665, -122378, 141627, -40753, -33788, -4306, -257861, 38540, -271074, -16173, 9207, -181868, -229974, -257856, -17597, -76148, -111798, 299276, -47404, -211206, -33427, -99716, 395629, -388398, -148139, 16500, -287307, -385084, 33549, 152629, 56784, -286093, -117523, 233942, -333057, 259566, -204300, -28253, 77465, -293604, -85851, -138367, 238601, -90424, 125636, 12218, -166593, -410321, -128610, -165276, 91032, 172631, 36686, -252357, -268947, 53407, -298325, -3210, -122711, -449752, 66774, -223901, -209846, -163365, 309221, -136708, -141239, -268822, -51307, -378695, 43056, -7710, 44514, 55954, -75687, -255331, -286767, -49393, 235068, -117672, -312820, -286253, 255813, -33562, 126436, 111877, -79517, -162978, -300438, -279467, -137005, -158042]
19383a58042N3286K6882j3019M4395j6532j16967P5273d1385I0489a35933r1688
19372b27621C3338O8815H737c9045l37612q429R6966m0753H0310g1872d002k8370
19360c2372o9194C8259b65279B2957K2185f0785E0045b52389J04203k16480B16283
19348b17422L9797j65678J66349c3571A3104O5643b4027A2529b13678b010o5341
19337f7351j63964C556b48557M0658L8928j91801f2459B15701d757j3590q4559
19326a02906l788j34735M0235B64925A29055b04585B12390a20748M7639B07897
19315a04415A77101g2386k535A06925L6926c03185a07116L6034l13536c4260r680
19304d3940j32798B99483o5831a05360j84318h4700K4246G2632a51756b4304C31358
$$ y = [-158042, -104756, -77874, -90893, -46498, -63030, -179997, -104724, -41385, 90489, -135933, -227621, 33338, 102153, 8737, -39045, -376657, -385086, -288120, -328873, 80310, -71872, -4002, -32372, -101566, 38259, -265279, 22957, 45142, -60785, 50045, -252389, -148186, -364666, 216283, -217422, -177625, -343303, -176954, -33571, 13104, 78747, -24027, 12529, -213678, -2010, -67351, -231315, 3556, -248557, -207899, -168971, -360772, -62459, 215701, -4757, -18347, -102906, -106694, -241429, -201194, 264925, 129055, -204585, 212390, -120748, -73109, 207897, -104415, 177101, -72386, -74921, 106925, 143851, -303185, -107116, -71082, -384618, -34260, -43940, -176738, 299483, 233652, -105360, -289678, -84700, -60454, 72632, -151756, -24304, 331358]
19292a22360j98412j41H563b42172A95659m1880d33199h2356k86151N15h7951
19280i8665C7733E859K3724J65734A5219d5165J7680q0592C70537I0385a07111
19268a07203g981q7106k36915A4083c99733d6343j19804B78395j21329b37997
19257H3725l122a21242l9428A44623a05926L0577A0817a33644H5004J81753b04497
19245A12585R058b33037j05697A86567H6154f0694k02949J10941P1503j54621
19235b35820B53255D3419N5074J04919E4319O7708l5716c39459d2717A73532A638
19223b37647J6605H0359a77584g7861j84124J13566E4096d9699k69412A8331O4125
19212H2456B513b99587G2217b68353D6342j0244c37985a31132f1794j27343k4879
$$ y = [-122360, -320772, -320913, 8563, -242172, 195659, 153779, -433199, -82356, -368507, -367992, -87951, -98665, 37733, 5859, 29583, 195317, 15219, -45165, -27485, -108077, 370537, 90385, -107111, -107203, -7981, -95087, -332002, 14083, -399733, -46343, -166147, 278395, 157066, -237997, 83725, 80603, -121242, -160670, 144623, -105926, -75349, 10817, -133644, 85004, 266757, -204497, 112585, 121643, -233037, -338734, 186567, 86154, -60694, -263643, -152702, -81199, -235820, 253255, 43419, 98493, 203412, 54319, 122027, 86311, -339459, -42717, 173532, 1638, -237647, -221042, 80359, -177584, -77861, -261985, -148419, 54096, -49699, -319111, 18331, 82456, 2513, -299587, 72217, -268353, 46342, 36098, -337985, -131132, -61794, -189137, -214016]
19201b14016F6607a0575p3547H2158f2792l09974C10185F5499A5482a81199M0154
19190a41045j59918P5104D1357J1730K3808a97677A10311J27357b86855D7943
19179a85462A25531f7358k67016K2539N1495L4473J07104g570B51401h5333j32207
19168b17540D1588h8127L0011j97855a861k29954c1653H4989a79737a4155E8292
19156b23415E8111c0815k43544a07559L1579G8176J11239I2015e5582A71918O1218
19145B33136a83697j27432J31028D3785b98327a4752k67324e6559M1G4504f0404
19133E65179E8129O9570c10093L3679J32150h175A72133J14171a52461D08188
19122A93230a70939P2768p6984A32249L3015E9188k4409b0810j117A67091f0290
$$ y = [-214016, 66607, -10575, -84122, 82158, -62792, -372766, 310185, 65499, 15482, -181199, -141045, -300963, -225859, 41357, 53087, 76895, -197677, 110311, 237668, -286855, 47943, -185462, 125531, -67358, -334374, -311835, -260340, -225867, -118763, -7570, 251401, -85333, -217540, 41588, -88127, -58116, -255971, -1861, -231815, -31653, 84989, -179737, -14155, 58292, -223415, 58111, -30815, -274359, -107559, -75980, 78176, 189415, 92015, -55582, 171918, 233136, -183697, -311129, -180101, 43785, -298327, -14752, -282076, -56559, -56518, 74504, -60404, 565179, 58129, 127699, -310093, -276414, -144264, -8175, 172133, 286304, -152461, 408188, 193230, -170939, -98171, -175155, 132249, 165264, 59188, 34779, -20810, -21927, 167091, -60290]
19110F2692K8598a68673Q2169B75862b20332h4273J7453o0479B1171b17122A96067
19098c4766l83051J20399A13988A4031J8488H097K05862i1581k7183j9980d0336
19086h2141j24865P5070n635j93734a39342e712j63718B46213n6916l4463i9656
19074b13238A59307a65787I510K5435a53828B41548D5271L03580h6984L4579l0958
19063h3363o7027G9467B8764J4588J04491c22783B4578J7221K8784J2132Q0883
19052A63598b15484c7995m48622C9703K71671b76463g3224OD4929b38763l6993
19041b75756Q3684b4680q6194B12770a97342j302B03762a32000E0962b58903h4534
19029c48589H5607i8741I6976j6103a19684B44371D3805b31020j30750A23647
$$ y = [62692, 91290, -168673, -86504, 275862, -220332, -84273, -66820, -127299, 21171, -217122, 196067, -34766, -417817, -297418, 113988, 14031, 32519, 8097, 213959, -91581, -118764, -138744, -40336, -82141, -207006, -131936, -137571, -331305, -139342, -5712, -169430, 246213, 189297, 154834, -99656, -213238, 159307, -165787, 9510, 34945, -153828, 241548, 45271, 348851, -86984, -52405, -83363, -150390, 79467, 28764, 43352, 147843, -322783, 24578, 41799, 70583, 82715, 163598, -215484, -37995, -486617, 39703, 311374, -276463, -73224, -73218, 44929, -238763, -275756, -192072, -24680, -110874, 212770, -197342, -198644, 203762, -132000, 50962, -258903, -84534, -348589, 85607, -98741, 96976, 80873, -119684, 244371, 43805, -231020, -361770, 123647]
19018d50460F0659J58959A03182J22208h6141L9654C932c1208p3395C8796O7479
19007A06275a28399A98199A5430b72302C4574K3744K6490e6354a7519j43870B71080
18995b37309B42147b01584A36890b52503L1201B826b37411N4270p9280g4574c0452
18983F2115b47239J12413k59395h4879L3856m78782A78077D1992d55290i743L842
18972e901C38017B6336M56643A73602k8079n8600a3708j46055e0786K1779B41703
18960A97969g9438k3551A10833f517j97570O2253D0507A5426b84252i6505K1731
18949g4774c6759I25N6098Q5656e2679p4388d9734l5497h825j31516B27650g6480
18936e987l1485E922b50168D891f793A25612o832C0529e9817K6530j24023a213
$$ y = [-450460, 60659, 219618, 103182, 225390, -86141, -46487, 3932, -31208, -104603, 38796, 106275, -128399, 198199, 15430, -272302, 34574, 58318, 84808, -56354, -17519, -161389, 271080, -237309, 242147, -201584, 136890, -252503, -221302, 2826, -237411, -183141, -262421, -74574, -30452, 62115, -247239, -134826, -394221, -84879, -51023, -529805, 178077, 41992, -455290, -9743, -5901, 338017, 26336, 482979, 173602, 145523, 86923, -13708, -159763, -50786, -29007, 241703, 197969, -79438, -102989, 110833, -6517, -204087, -141834, 40507, 15426, -284252, -96505, -74774, -36759, 925, 57023, 142679, -52679, -127067, -49734, -85231, -8825, -140341, 227650, -76480, -5987, -37472, 5922, -250168, 4891, -6793, 125612, 118780, 30529, -59817, -33287, -157310, -1213]
18923H9047b718A56703g7299l8760A42917g5184A34896D1246i9541A30728m0283
18912I0445a52623I0041K5736D5186L90334B3924L62674j05739J49511c1456A39208
18900i9780j383n3794b4771A95628f1751A75774b7365l45712i8677B05942g7001
18888b73030J18242L971j0189j65661B63791d5029l03177J50906A03166l2700
18878G0466J24752f2771n8248b1980G399J12003b03703g3238A70730a62367b8750
18866C02844e3012A1665J81017C2982K29033n2782b0761j05040C95821A91164
18855g1498j83367A55521b98801k3587c387E1859p306Q6932n8115c27560g4229
18843A01363b27847g9903l17411a30979p0903k76085E0191b59705F9594M0263
$$ y = [89047, -2718, 156703, -77299, -116059, 142917, -75184, 134896, 41246, -99541, 130728, 90445, -152623, 90041, 115777, 45186, 435520, 23924, 386598, 280859, 430370, -31456, 139208, -99780, -101163, -154957, -24771, 195628, -61751, 175774, -27365, -373077, -98677, 205942, -77001, -273030, -154788, -150817, -161006, -326667, 263791, -45029, -348206, -197300, 103166, 70466, 195218, -62771, -121019, -21980, 7399, 119402, -203703, -73238, 170730, -162367, -28750, 302844, -53012, 11665, 192682, 32982, 262015, 209233, -20761, -125801, 395821, 191164, -71498, -254865, 155521, -298801, -322388, -3387, 51859, 44553, 131485, 73370, -327560, -74229, 101363, -227847, -79903, -397314, -130979, -201882, -477967, 50191, -259705, 69594, 109857]
18833A09857J4195J00555c7606j66705j0410Q9031l7126K2892B32397a0069j35285
18822a45354A65949o5253k2926K78628p0196r0169p0494a50604A64656E7789O9574
18811A27363a27905A20861l6240O1941F5275K06490j14496f9650k10813C35164
18800b60672o9722J07735P5931A08004A6241i7164G318a69103J8156J0800C0010
18788a09532L3353b1733j48017L4749B1533f878j12958N8485A68514C6051f4282
18776G1921b97341R0297a03343j4146d9633F9410g6925C6255b61573A74310L441
18765A77751c48471i5349L918g513H4842L5483F426K09336b7646B50678D7100
18753B40127j01657a70274q2976k4844i3031M5115D87675A6097O3085c20160h1501
$$ y = [109857, 124052, 224607, -37606, -204311, -214721, -125690, -162816, -139924, 232397, -10069, -145354, 165949, 100696, 77770, 356398, 286202, 196033, 125539, -150604, 164656, 57789, 127363, -127905, 120861, 84621, 146562, 65275, 271765, 157269, -69650, -280463, 335164, -260672, -330394, -222659, -146728, 108004, 16241, -97164, 7318, -169103, -150947, -140147, 30010, -109532, -76179, -21733, -169750, -135001, 21533, -6878, -119836, -61351, 168514, 36051, -64282, 71921, -297341, -207044, -103343, -117489, -49633, 69410, -76925, 36255, -261573, 174310, 177751, -348471, -95349, -91431, -7513, 84842, 120325, 6426, 215762, -27646, 250678, 47100, 240127, 138470, -170274, -253250, -278094, -93031, -47916, 487675, 16097, 79182, -320160, -81501]
18741B7419d717j93298B26064p5717a43995j29222h9507B60558A04405J16515
18731B20920h9002K4593A20946a27234D29818b28277C0125g8577j02863k74704
18721d56144c3969G4264b49442J14543l75552a43991A46264b9659n329m6603a8555
18709c74209K4673J59799C53446b7568q9214L4449L5157M318E4121A0929b37570
18697a79464C01461a27635q8557F3269b8418j11319I4938a81938Q8169F4140d1969
18685I8825d2759k73093J51744j0879o8935b1965r414a1014B49897b24748a1563
18673b37291C7132j0930c28553A04918h6139E2739b16293b3588j24000m85H9399
18661a39336c099k37677m5366j6587b2967j32211F3552c51105K7932j0306E6124
$$ y = [27419, -4717, -198015, 226064, 150347, -143995, -273217, -89507, 260558, 104405, 220920, -89002, -64409, 120946, -127234, 429818, -228277, 30125, -78577, -181440, -456144, -33969, 74264, -249442, -134899, -510451, -143991, 146264, -29659, -34988, -81591, -18555, -374209, -349536, -189737, 353446, -27568, -116782, -82333, -47176, -42858, 54121, 10929, -237570, -179464, 301461, -127635, -216192, 63269, -28418, -139737, 94938, -181938, -93769, 64140, -41969, 98825, -42759, -315852, -164108, -174987, -243922, -21965, -31379, -11014, 249897, -224748, -11563, -237291, 37132, 26202, -328553, 104918, -86139, 52739, -216293, -23588, -147588, -148073, 89399, -139336, -3099, -240776, -286142, -302729, -22967, -155178, 63552, -351105, -323173, -333479, 56124]
18649A00068b51452A84854b50209A52375a55231A38186b390B61179c38613I3784
18638A5927J88334F9509K6451J06250a73628A20212J17864b03202Q2205K5358
18628i5639G5737l4604c59953A60425a59396j62880E5563a93312N3832O883A58059
18616g5638a470l93886R8141G1695R911l3108e6990k83626A79518B6363J8508
18605D4871a56691a0434k19257A8118a28115F4469b5020k5350m2270D4321a21810
18593A48112B1757a27483j11143B05692G2628K14891i5328D4584b49776a19145
18582a38929N0336n0240k66668a05485j52835G6680q872a07415C04306b12827
18571a8573I6211A1890L4721b467B4002N5288Q71a64898P6588c5012j73687k71908
$$ y = [100068, -251452, 184854, -250209, 152375, -155231, 138186, -2390, 261179, -338613, 93784, 15927, 204261, 69509, 95960, 202210, -173628, 120212, 238076, -203202, -120997, -95639, 75737, 41133, -359953, 160425, -159396, -322276, 55563, -193312, -139480, -132597, 158059, -75638, -1470, -395356, -297215, 71695, 81606, 48498, -56990, -340616, 179518, 26363, 44871, -156691, -10434, -229691, 18118, -128115, 64469, -25020, -50370, -92640, 44321, -121810, 148112, 21757, -127483, -238626, 205692, 72628, 287519, -95328, 44584, -249776, -119145, -138929, -88593, -138833, -405501, -105485, -258320, 76680, 67808, -107415, 304306, -212827, -18573, 96211, 11890, 46611, -2467, 24002, 79290, 80161, -164898, -88310, -35012, -208699, -480607]
18559d80607d6487J6980j47106Q2099M5904k23683F8716P1092D1777b81903o526
18548b88429A11379c0995K146A0788b1946j26942B2633d2850m4389l34134b03426
18536b31462J07923B1770c171I9537O3679b16022R7864H8281B0031O8381b22299
18524g7340j68108G7741e2147k9708H4061k2574J8511b3404k74407A38580a47313
18512C44422a29557o7641B82860D3613c9627G2568j449b02729j08771J5116B47609
18500b98007E3281g4248A73654E5971J78595K17091k17540o3650a7226l3503C21635
18488G2934g6886a5934H1056a56272G3168h7114E091P3595a43039A09914g3181
18476H9334K88691H3462a39577K350B58951G2311H922a95623c0861k08741B28653
$$ y = [-480607, -46487, -29507, -176613, -94514, -48610, -272293, 68716, 139808, 41777, -281903, -288429, 111379, -30995, -28849, 10788, -21946, -148888, 22633, -42850, -87239, -421373, -203426, -231462, -123539, 21770, -3171, 99537, 163216, -216022, -118158, 88281, 20031, 88412, -222299, -77340, -245448, 77741, -52147, -81855, 84061, 61487, 79998, -23404, -297811, 138580, -147313, 344422, -129557, -197198, 282860, 43613, -39627, 72568, 71119, -202729, -311500, -296384, 247609, -298007, 53281, -74248, 173654, 55971, 234566, 451657, 234117, 170467, -17226, -50729, 321635, 72934, -76886, -15934, 81056, -156272, 73168, -87114, 5091, 78686, -143039, 109914, -73181, 89334, 378025, 83462, -139577, -137227, 258951, 72311, 8922, -195623, -30861, -239602, 228653]
18464B15765b89391g3046j40041j27351A03668i2173R381o2233O0818E0939M4552
18453I5491i2838k1014C0064h4871G3417c38714J00388C3995c47800H4820K78898
18442C63718a04366q9413L5590k5297A97324c21245h6534r7983c1381J4230B19618
18430B44123G4227M7486N3241a64946A01075a07725F1174b15808c1669C1939a45383
18418A02438b05745a9208m88255a35367l51616A51004b00604l7451B1924E852
18407i3049B50079D12a74657A19807f909j02307C65316a02525N392o2631A14370
18395a59715H4989a49224C38834a877k17779E4746N6364g8212j6242a187k78349
18384b79536J36452B74571i4930r4682A69638a58666K1302d759m2137a6934p8760
$$ y = [215765, -289391, -73046, -213087, -340438, 103668, -92173, -82792, -145025, -84207, 50939, 95491, -92838, -113852, 30064, -84871, 73417, -338714, -238326, 33995, -347800, 84820, 363718, -104366, -193779, -158189, -183486, 197324, -321245, -86534, -184517, -31381, -17151, 219618, 244123, 74227, 121713, 174954, -164946, 101075, -107725, 61174, -215808, -31669, 31939, -145383, 102438, -205745, -19208, -507463, -135367, -486983, 151004, -200604, -238055, 21924, 5852, -93049, 250079, 412, -174657, 119807, -6909, -109216, 365316, -102525, -97133, -159764, 114370, -159715, 84989, -149224, 338834, -1877, -219656, 54746, 111110, -78212, -94454, -1187, -279536, -143084, 274571, -94930, -189612, 169638, -158666, -137364, -4759, -46896, -16934, -95694]
18373i5694D6142O5643D3834d2235m6318J0724r3963I16L98706a7779j50453C9730
18360A01480A6930a8610l03514l6170B70855k3322B7056a23219N7412A58239c25428
18348F7935c42755A8408b76639A2769a95663F895P5308K17999b4063r3070o9931
18337a87064l22584i9461j59604Q0870k62035J10158B66328a09961k20985J20654
18327b10292q6720J25821F9204b91669e7774n9146J9598G7595a17951j31587a2757
18315b21990m597A0025d0928E8845K5949a9566E0466J0981J17625i3780B5623
18303c4283l12085A21648b14817a503k8497m8721A41115d4849k6393j56167E7956
18291A80553a4515m533G5361a37232o8510B88016H037b60026a0265m5542k48574
$$ y = [-95694, 46142, 111785, 43834, -42235, -88553, -77829, -171792, 916, 399622, -17779, -168232, 39730, 101480, 16930, -18610, -322124, -358294, 270855, 247533, 27056, -123219, -65807, 158239, -325428, 67935, -342755, 18408, -276639, 12769, -195663, 6895, 82203, 300202, -24063, -117133, -187064, -509648, -99461, -259065, -178195, -440230, -330072, 266328, -109961, -330946, -210292, -297012, -171191, 69204, -291669, -57774, -116920, -97322, 77595, -117951, -249538, -12757, -221990, -226587, 10025, -40928, 58845, 84794, -19566, 50466, 61447, 179072, -93780, 25623, -34283, -346368, 121648, -214817, -1503, -30000, -78721, 141115, -44849, -71242, -227409, 57956, 180553, -14515, -19048, 75361, -137232, -205742, 288016, 8037, -260026, -10265, -55807, -304381]
18280c04381R9989C93111a76842N6045j22535b2662A45180A7430a32974E092b99965
18268i7198d1224a557A21413e5254K6704C577J86758a60618J6476L8752c8144
18256a41233l4221q9432E0214c80741a68986q9845G4543J423a09575E8005j394
18245E6611c3512j62474A17012J21473p9165D4977D343c22092B14231c5899j41897
18234a77796A63968J55381b4996j7809o1767B74239A30558n3732a27131k43050
18224c70181B2856a56808d7054B00399c20733A13095a03027B9979i33A07183b53260
18212a81880o0610O8757B19362a55240B70616e22967a79379b1663k33162h0900
18201c6871G257K90922a63567K4591o9495B00794j2290m2195a38653K8218b3549
$$ y = [-304381, -204392, 393111, -176842, -120797, -243332, -22662, 145180, 17430, -132974, 5092, -299965, -97198, -41224, -1557, 121413, -55254, -28550, 3577, 190335, -160618, -144142, -105390, -38144, -141233, -175454, -264886, 50214, -380741, -168986, -258831, 74543, 75966, -109575, 58005, 56611, -33512, -195986, 117012, 238485, 159320, 44977, 4343, -322092, 214231, -35899, -177796, 163968, 319349, -24996, -42805, -104572, 274239, 130558, 76826, -127131, -370181, 22856, -156808, -47054, 200399, -320733, 113095, -103027, 29979, -933, 107183, -253260, -181880, -242490, -173733, 219362, -155240, 270616, -522967, -179379, -21663, -254825, -80900, -36871, 7257, 298179, -163567, -138976, -208471, 200794, 188504, 146309, -138653, -110435, -23549]
18189b4484j76215N1153A54735E600a36684j13538A12811K9275K34114a7476m06024
18178d23500A4512a00208j4897M5952C77063c0726C3550b10483J1330J6405d7552
18166b05591b7406A72833a85354d4004k21019B95787b38296B10464f8114j82578
18156b50692f9800A6222Q0017h8952a5580e612B90309g4635l1959l8871A34505
18144B9827o042g2157J6846q4391n2557a3578a606A5816a79191N0538A12109C5273
18131c09726e5743o9642R449A3605J59046a51752C27308g4057B40994e3708k0734
18120g4442k06053I9046R7615c0043B88281b49882d3769l9293I2752J96383D890
18108I2082h5313D5258a51543A13041l4447j6980c04933C84215A6814J8236L18425
$$ y = [-24484, -200699, -149546, 154735, 5600, -136684, -250222, 112811, 142086, 376200, -17476, -423500, 14512, -100208, -115105, -69153, 377063, -30726, 33550, -210483, -199153, -182748, -47552, -205591, -27406, 172833, -185354, -44004, -265023, 295787, -238296, 210464, -68114, -250692, -69800, 16222, 96239, -88952, -15580, -5612, 290309, -74635, -106594, -145465, 134505, 29827, 23785, -72157, -55311, -139702, -192259, -13578, -1606, 15816, -179191, -128653, 112109, 35273, -309726, -55743, -125385, -115936, 13605, 172651, -151752, 327308, -74057, 240994, -53708, -74442, -280495, 99046, 196661, -30043, 288281, -249882, -43769, -83062, 92752, 289135, 4890, 92082, -85313, 45258, -151543, 113041, 78594, 61614, -304933, 384215, 16814, 35050, 353475]
18097C53475a60608A7325b21947J08787C8456h2899j561p1599B11893o4599A7195
18085D1127f0116A6093b27240B91338N4230H6805C2200c93535F4552J70988F7903
18073B08822a01678k416n5283j56326J19987k0663E2511j3444a00895b5703p3335
18062i9038C11379A07668Q6609o6602a27562F4747B6384k787c43424e1635r5460
18051a47095A48541b64513A93704b32212A52555a68162P2608D5555e4418j02231
18041a56649A02811c32931E8048k6229c9880D4624i7451A01485j2377J0990k3642
18030G6456N6207c64971J28185B02980a69051K2235N2733a5475A71484D3473L23861
18019C67334a08894C7040a93884E7963a7027j84853H7326K29481c69411K4305
$$ y = [353475, -160608, 17325, -221947, -113160, 38456, -82899, -84460, -156059, 211893, 147294, 17195, 41127, -60116, 16093, -227240, 291338, 345568, 86805, 32200, -393535, 64552, 235540, 67903, 208822, -101678, -104094, -159377, -315703, -195716, -216379, 52511, 39067, -100895, -25703, -99038, 311379, 107668, 194277, 127675, -127562, 64747, 26384, 23597, -343424, -51635, -147095, 148541, -264513, 193704, -232212, 152555, -168162, -95554, 45555, -54418, -156649, 102811, -332931, 58048, 31819, -39880, 44624, -97451, 101485, 89108, 100098, 76456, 132663, -364971, -236786, 202980, -169051, -146816, -94083, -15475, 171484, 43473, 367334, -108894, 37040, -193884, 57963, -17027, -201880, 87326, 316807, -369411, -345106]
18009c45106a9427o4554m34901f14l1750j50404H1405e7749I7364g3010P071I9324
17996D9321J73876C4312e9509A20354L9654n0207b19743E085J55267d9587H8612
17984a6398B5712a98168N1220b8470k70731K3642D9476J22342H4289c11746e3733
17972a97450A14158e6110A05039J61388g7680A14554D7554a80189r1150B27688
17961a12884C15580M1057a86925F1288E784J6620b909j97754a9099A96043J38877
17950C34920e4144j79448A38899E2728d15332h9196j20396B92344d7479A1038
17939b04447M4667G2150J896d2946k85107A12461N3012B1879a81186A0507K12039
17928B22546C7066R4925n1298J50072l2259d58544F2776B0954a59430c172r0160
$$ y = [-345106, -19427, -83981, -518882, -614, -32364, -182768, 81405, -57749, 97364, -73010, -65939, 99324, 49321, 223197, 34312, -59509, 120354, 160008, 109801, -219743, 5085, 160352, -49587, 88612, -16398, 25712, -198168, -146948, -28470, -299201, -275559, 49476, 171818, 84289, -311746, -53733, -197450, 114158, -56110, 105039, 266427, -77680, 114554, 47554, -180189, -271339, 227688, -112884, 315580, 356637, -186925, 61288, 5784, 22404, -2909, -200663, -19099, 196043, 334920, -54144, -233592, 138899, 52728, -415332, -89196, -209592, 292344, -47479, 11038, -204447, -159780, 72150, 74046, -42946, -328053, 112461, 165473, 21879, -181186, 10507, 222546, 37066, 131991, 80693, 230765, 198506, -458544, 62776, 20954, -159430, -3172, -93332]
17917i3332b341F1226A4094a38274B65113A16322D7312h3261F4544B152b9468
17905B27618a43681J7004G7518K14962b6228p7114B16443k5371a864k20913D7510
17893a58443F7272O0091D1765M0019a79899A67361b11888A07622Q2328E4268L19742
17882C74010a57965N348M5719A19386a478C70849k0241b27849c9939k21114A6580
17870B66393M6731j13152A3984a99806j07944a00204M233E04005B8084a81799
17859H4859M28126E9234P3773a01812A10607l3746J59489A14410l9776k4806D698
17847a69228b8348A6399f7301a1072e82B67111j06087a00823a6305A36184C9658
17835a61481G5230a4474A25576i9774A25378b60929C57268A66704h5557A7940
$$ y = [-93332, -2341, 61226, 14094, -138274, 265113, 116322, 47312, -83261, 64544, 2152, -29468, 227618, -143681, -126677, 77518, 292480, -26228, -103342, 216443, 191072, -1864, -222777, 47510, -158443, 67272, 127363, 41765, 81784, -179899, 167361, -211888, 107622, 189950, 54268, 374010, -157965, -152617, -106898, 119386, -1478, 370849, 350608, -227849, -39939, -261053, 16580, 266393, 313124, 199972, 13984, -199806, -307750, -100204, -95971, 504005, 28084, -181799, 84859, 512985, 59234, 133007, -101812, 110607, 76861, 236350, 114410, 74634, 49828, 4698, -169228, -28348, 16399, -67301, -11072, -582, 267111, 161024, -100823, -16305, 136184, 39658, -161481, 75230, -14474, 125576, -99774, 125378, -260929, 357268, 166704, -85557, 17940]
17824b09878l6678A60144k7876K98105a24121A39244a15758e3341j38680f2881
17813b3704I6736K4574O6218A631a49221L1865c0444A66754a71864H4635l8257
17802D6378J42268H8098a97112P3497I8886h1756B80610b8600B25362D4043J05544
17791A49587b40292g3877K6313b1764k8948B69798A9964c17692i768B78950b13919
17779A5048L25866g6885A48208G1876b03672A65963E6207K29392O462d8614C51643
17767A86810A3656K97445a30950k7852O9666B18213c43939b2495j3666D01067
17756F6890J47386a61263l00572B81473H0717a62906A9302f4578B37507b85113
17745c24404B34471a35675l0878B18674i0360E5902k0762h9747B43988N7600q3157
$$ y = [-209878, -246556, 160144, 132268, 430373, -124121, 139244, -115758, -53341, -192021, -62881, -23704, 96736, 121310, 187528, 1631, -149221, -117356, -30444, 166754, -171864, 84635, 46378, 188646, 88098, -197112, -123615, 98886, -81756, 280610, -28600, 225362, 44043, 149587, -240292, -73877, -47564, -21764, -50712, 269798, 19964, -317692, -9768, 278950, -213919, 15048, 340914, -76885, 148208, 71876, -203672, 165963, 56207, 285599, 292061, -48614, 351643, 186810, 13656, 311101, -130950, -158802, -89136, 218213, -343939, -22495, -36161, 401067, 66890, 214276, -161263, -461835, 281473, 80717, -162906, 19302, -64578, 237507, -285113, -324404, 234471, -135675, -166553, 218674, -90360, 55902, 35140, -89747, 243988, 301588, 218431]
17734B18431J29630B3823a96028K0278A86150H0668K00610a30539B59405j5642
17724B43763O3916f4377C38819A53754A3560L9914e473j38003A06194K15589c9580
17712C06532q1939k9471g5381C15100o1599J420A14045Q3720J63527a57544n1840
17701b09384C95094G6619E386f0806K6464A46048a06909l7212r2706B59106h2306
17689C06525c50819C3019j2548K59439c1443B70139J09732b1852I4518A6915b67906
17677f961B05758a54900A37797F4938K62154A03969R6482N699B0346L92457G9331
17665F8099R1958O9383j6698a3933D79802G8174a96175A26413n6671Q5332K60714
17654D15788a0857D3638Q7731b9742A271L23703B7589K08248r5968B7170J69786
$$ y = [218431, 348061, 23823, -196028, -175750, 186150, 80668, 281278, -130539, 259405, 243763, 307679, -64377, 338819, 153754, 13560, 53474, -5473, -143476, 106194, 321783, -39580, 306532, 224593, 195122, -75381, 315100, 253501, 254921, 114045, 197765, 361292, -157544, -209384, 395094, 76619, 5386, -60806, -34342, 146048, -106909, -144121, -236827, 259106, -82306, 306525, -350819, 33019, 20471, 279910, -31443, 270139, 379871, -21852, 94518, 16915, -267906, -6961, 205758, -154900, 137797, 64938, 327092, 103969, 200451, 206150, 20346, 412803, 79331, 68099, 160057, 229440, 212742, -13933, 479802, 78174, -196175, 126413, 69742, 155074, 415788, -10857, 43638, 131369, -29742, 1271, 324974, 27589, 235837, 139869, 27170, 196956]
17643A96956q3271j8850b6456G8340B2221a12732k2047A67649E1576B4020R0760
17632A14780K00277g5632A96097D818M24685G588J00447J48339r5653J75139a88384
17620A58409E2404Q5445K39098c04565a2354A72684h2986B4817J6970g3749B04725
17608D09406A38481a9535A57871G1968M3625L90234B05069P5602i677A72166J38770
17597C10936j4145A20892E7070k4272a218H1214P9596K95804A24796n8652M10543
17586D76687A04204L76900d5285K0498A06948B92L61509E7306B6648b80524e3206
17574C25729A12665n4362L2427B7821J84596e3795A76180J93102a0610B24111
17563c280j10349B08110n5530A9881a40783F1202P4315F3780i3108B22427j01548
$$ y = [196956, 113685, 94835, -26456, 78340, 22221, -112732, -134779, 167649, 51576, 24020, 114780, 315057, -75632, 196097, 4818, 429503, 7588, 108035, 256374, 160721, 335860, -188384, 158409, 52404, 137849, 376947, -304565, -12354, 172684, -82986, 24817, 41787, -73749, 204725, 409406, 138481, -19535, 157871, 71968, 115593, 505827, 205069, 280671, -9677, 172166, 310936, 296791, 120892, 57070, 32798, -1218, 81214, 160810, 456614, 124796, 66144, 476687, 104204, 481104, -45285, -24787, 106948, 292, 361801, 57306, 26648, -280524, -53206, 325729, 112665, 58303, 90730, 27821, 212417, -53795, 176180, 369282, -10610, 224111, -3280, -113629, 208110, 152580, 19881, -140783, 61202, 135517, 63780, -93108, 222427, 120879]
17552A20879A2456J56393n9418M63763E5734g3424C8745M8822L96613j92650D9673
17540E30865h4107B13709K18068q9536A17565L23491j44344J66862a53007D3541
17529B78823p6995J87654K23623B91332L24594q1521O27606j46606M2226k48922
17519H08709k17751k21222M07881k96543M457J44553B15375O4321J73724L00628
17509G54048j11127L24210k57650O79692o92436l34757L8316p4935R8476h8831
17498B87590r9010q2558K26122a46827B99504M5243b9684D26745m4323j00720
17488B81702k7600L030O2871l3029A35522K50485k4269O2686Q9853B11141K01771
17477D12912F6458J26302L07515a08232B46739N8740J20899A70272K71932i7035
$$ y = [120879, 12456, 168849, 109431, 573194, 55734, -73424, 38745, 87567, 484180, 291530, 49673, 530865, -84107, 213709, 431777, 342241, 117565, 441056, 296712, 463574, -153007, 43541, 278823, 201828, 389482, 613105, 291332, 615926, 534405, 1162011, 1015405, 1057631, 808709, 590958, 369736, 777617, 481074, 485531, 630084, 215375, 279696, 453420, 754048, 642921, 967131, 709481, 1389173, 696737, 361980, 400296, 325361, 423837, -88831, 287590, 188580, 106022, 332144, -146827, 299504, 344747, -29684, 426745, 382422, 281702, 254102, 257132, 320003, 286974, 135522, 386007, 361738, 424424, 514277, 211141, 412912, 66458, 192760, 500275, -108232, 246739, 305479, 426378, 170272, 442204, -97035]
17466h4973B63053j11714R0968p0058C1266K78899j44644P9923Q7847O497J71924
17455E11712A79052P3382A12686M46089p5472J03135B67813K14364A39808K03869
17445C43677A07496M32684L8962l2656B49972F4741Q3200j9882k2173J40177J60271
17434D06334j57558R2189A11618K75142j04297K47216F8428K14071K26936B45461
17423E30357j09566A29906K92158o779A72531J67270N2482R8483J73096B10446
17412A73377O1291R4686o3416K29923J50378q5627B12486p0722k5615K55489j62942
17401B08696l6010H2681M55981A57144K24101K53808k09930g139B24185J70789
17391C94974j51271J74052j38518F7249J03229m1329P9245L28348H0743C2162
$$ y = [-84973, 263053, 151339, 242307, 172249, 31266, 310165, 165521, 245444, 333291, 339788, 511712, 179052, 252434, 112686, 558775, 483303, 586438, 267813, 482177, 139808, 343677, 107496, 540180, 579142, 546486, 249972, 64741, 147941, 128059, 105886, 246063, 406334, 248776, 340965, 111618, 386760, 282463, 529679, 68428, 282499, 509435, 245461, 530357, 420791, 129906, 422064, 415285, 172531, 339801, 392283, 490766, 663862, 210446, 173377, 234668, 329354, 265938, 495861, 646239, 560612, 212486, 141764, 116149, 371638, 208696, 172686, 82681, 538662, 157144, 381245, 635053, 425123, -7139, 224185, 394974, 243703, 417755, 279237, 67249, 170478, 129149, 208394, 536742, 80743, 32162]
17380C12091A30586L3731K12492j17503c5624B48628L6254n7024K17328A97743
17369A80708K37435r8284q8868f9771D63654j23093H1483J56469J10429a04881
17358B50508r3379J24459O5368J05322b9298A26572j0531K72882A03321M567J43168
17347B51056a09107A98935E3173M29416H4988L09823j09783o076K16225B27364
17336D67366o7171A89813J58923o5765r4812j9262K00567j80417F5419M95986
17326E61405h209m748B29663k9511m5280R1498N4535K16411A83594C5315K01486
17315B36801J74727E0223L32279G8917J92158p1764J8363O9963L19022B74123
17304C65038j58622O7464L0175j26983o5942K45459j01612A27074K15092A56386
$$ y = [312091, 130586, 164317, 376809, 259306, -35624, 248628, 284882, 227858, 445186, 197743, 180708, 418143, 319859, 230991, -69771, 463654, 340561, 81483, 237952, 348381, -104881, 250508, 157129, 281588, 346956, 452278, -29298, 126572, 116041, 388923, 103321, 107888, 251056, -109107, 198935, 53173, 482589, 84988, 394811, 285028, 278952, 495177, 227364, 467366, 400195, 189813, 348736, 282971, 188159, 168897, 369464, 189047, 65419, 561405, -8209, -12957, 229663, 200152, 154872, 246370, 300905, 517316, 183594, 35315, 236801, 411528, 50223, 382502, 78917, 271075, 199311, 217674, 287637, 606659, 274123, 365038, 206416, 273880, 304055, 177072, 111130, 356589, 254977, 127074, 342166, 156386]
17293D00797P2177J1351F9479L90231N0738k03803J09861I5971K80197A61176
17282B72753J15300o7543K34095k72524j11783N7010A07908J62848n2026N1920
17272B70650j21802P5629J60451j3623j16030M5771R4861A97907a00919A87832
17261a45078D34488l143A96508i888B23590K75131B39937J70748A78369J54037
17251C32406j04518K10633K6869B15960O0637D2874L33247J37966E3834N9778
17241A13612o84M66347B63269J39579j72252J62323o9364A42298L63176B28173
17230D13271j83580K68246j21301r1750J2544L99849l47351J87809k26501L02780
17220F14016j65988B14044L45712J054A45056J10076M4281K61116n7531j71544
$$ y = [400797, 472974, 484325, 69479, 459710, 510448, 306645, 416506, 95971, 376168, 161176, 272753, 388053, 320510, 554605, 282081, 170298, 227308, 107908, 270756, 218730, 270650, 148848, 224477, 384928, 371305, 255275, 301046, 395907, 197907, -100919, 187832, -145078, 434488, 431345, 196508, -9888, 223590, 498721, 239937, 410685, 178369, 332406, 227888, 438521, 465390, 215960, 276597, 42874, 376121, 514087, 53834, 113612, 112928, 579275, 263269, 402848, 230596, 392919, 323555, 142298, 505474, 228173, 413271, 229691, 497937, 376636, 284886, 297430, 697279, 349928, 537737, 311236, 614016, 448028, 214044, 559756, 560810, 145056, 255132, 299413, 560529, 502998, 331454]
17210C31454m0019K81328k44055j38047R4166L91349k25174K2391A56813n7N84446
17199G41202j87638A83535J06505M6129J49333b6326B28807B4422M44714p6325
17189C92811A62475K84198L47581k99787q6136J5486r8445J41937r9998j36585
17179B30726M5635C3340L51925j86294R5512J69459j11027O0148k02671L29057
17169E39449p99j81448o1689J91414M15016C85188O0880n5192p5290o4957J36895
17158C87524K80673A89899K90632B38701K99962B24432K10353K79759j73693J24854
17148F65705l19297j12872j9765J72940J1809K842j21215j38584L02814O0446
17138E04823B19397N65741k25749J3404q8481m1570J45516K53002k78045k50044
$$ y = [331454, 291435, 572763, 328708, 190661, 284827, 676176, 451002, 473393, 156813, 156756, 741202, 553564, 183535, 290040, 336169, 485502, -26326, 228807, 24422, 469136, 392811, 162475, 446673, 794254, 494467, 408331, 423817, 325372, 467309, 367311, 230726, 276361, 33340, 385265, 198971, 294483, 463942, 352915, 413063, 210392, 539449, 538650, 357202, 295513, 486927, 901943, 385188, 446068, 390876, 315586, 250629, 387524, 668197, 189899, 480531, 238701, 538663, 224432, 434785, 714544, 540851, 665705, 346408, 233536, 213771, 386711, 398520, 401362, 280147, 141563, 444377, 504823, 219397, 785138, 559389, 572793, 484312, 442742, 588258, 841260, 563215, 313171]
17128C13171J19625m0178K7749R2400j58906K24796j78205J0341j5923K79797
17118F74667Q0460l50196j18278K66234n1557j15653L95231l9093P41k76839K90475
17107G56192j39585L52972k74508j33997K70173l56270J42027k15289J35519m1774
17097D95460L38131l8906L33491D43993J99128j94298J35766K14563J57401k75495
17087F81058q031p0466K16333j65396l02837M35242L0285J07396m36755K16730
17077G03559L9889k26729K59588N2043Q5541l75752K19500K23480l74729L67310
17067I73700m73135M33644k07286j80153J29634O94990F49179J83489j43864J20529
17057H09333l7519n3902L62523n37206J12812P26187E35472O57072l58079j5910
$$ y = [313171, 432796, 392618, 420367, 512767, 353861, 578657, 400452, 410793, 394870, 674667, 755127, 404931, 286653, 552887, 501330, 385677, 780908, 741815, 742556, 465717, 756192, 616607, 969579, 695071, 561074, 831247, 474977, 617004, 401715, 537234, 495460, 833591, 794685, 1128176, 443993, 643121, 448823, 584589, 799152, 956553, 681058, 673027, 602561, 818894, 653498, 350661, 785903, 816188, 923584, 486829, 703559, 743448, 516719, 776307, 828350, 913891, 538139, 757639, 981119, 606390, 973700, 500565, 934209, 726923, 546770, 676404, 1371394, 649179, 832668, 688804, 809333, 771814, 717912, 1080435, 543229, 656041, 1382228, 535472, 1192544, 834465, 818555]
17047H18555n4136K52977k54600K93139j12878l47937L0094M8077K15903p3285
17037H15909J72857k6877j81967J44449k012k53826K31578J24743J27837o6480
17027A086211j99600k59886L69409L6292m25098P54804l21011l03878K72143J74621
17017A184007k9885k78180K24039L09994l03804k92640N61176k51703k79129K07188
17007A051063O0872j38344j5361J86189j91680K30086j32023q1099J94326j2114
16997A151915K58340j36174n7298J20438k13116Q5282m4266Q0273K9160J81572
16987A456126j08345J08619l55066K23335L87318o78238K75279L23267k13132
16978A419163k03287K92200p4579o0058J73184l74105J27631j18804N87107k09463
$$ y = [818555, 764419, 1017396, 762796, 1055935, 943057, 595120, 625214, 673291, 889194, 815909, 988766, 961889, 779922, 924371, 922359, 668533, 900111, 1024854, 1152691, 1086211, 886611, 626725, 996134, 1032426, 607328, 1362132, 1041121, 737243, 1009386, 1184007, 1154122, 875942, 1099981, 1409975, 1106171, 813531, 1374707, 1123004, 843875, 1051063, 1111935, 973591, 958230, 1144419, 952739, 1182825, 1050802, 969703, 1164029, 1151915, 1410255, 1274081, 1216783, 1337221, 1124105, 1209387, 1165121, 1245394, 1274554, 1456126, 1347781, 1456400, 1101334, 1324669, 1711987, 1033749, 1309028, 1632295, 1419163, 1215876, 1508076, 1433497, 1373439, 1546623, 1172518, 1300149, 1181345, 1768452, 1558989]
16968A558989q8929k16306R8158R6473l19812M08425J10069O1983k70670j78863
16958A259517M65878l31275M37062l87448N13818k26838Q5222n1317R4418l23803
16948A535234j62796M81409j69770L91983K0291m86628N94166o94250L17928l6597
16938A790970N4707J89603J4184k47792N4897L55520j36127q6415R9108r4691
16928A993964p6783L06474j48115j45835K41242L7986J08634l60819L26329R7696
16918B380773l00096L3752l5301M67347l00942n2003K54087j68872N01227k47798
16908B532174R2540K2002J00673n1330k82759M06387j22348P3151k22260J23526
16898B671756M87663J686J50649n26686L48126P4076n2600J92838l69581L56156
$$ y = [1558989, 1470060, 1253754, 1351912, 1448385, 1128573, 1536998, 1647067, 1709050, 1438380, 1259517, 1725395, 1394120, 1831182, 1443734, 1957552, 1730714, 1815936, 1764619, 1859037, 1535234, 1372438, 1853847, 1684077, 2076060, 2096351, 1609723, 2203889, 1509639, 1827567, 1790970, 1845677, 2035280, 2049464, 1801672, 1856569, 2212089, 2075962, 1989547, 2088655, 1993964, 1917181, 2223655, 2075540, 1929705, 2170947, 2208933, 2317567, 1956748, 2283077, 2380773, 2080677, 2114429, 2079128, 2546475, 2245533, 2193530, 2447617, 2278745, 2779972, 2532174, 2624714, 2646716, 2747389, 2696059, 2413300, 2819687, 2697339, 2770490, 2548230, 2671756, 3159419, 3161105, 3311754, 2785068, 3133194, 3207270, 3154670, 3347508, 2977927, 3334083]
16888C334083j99373J01254J0381K08491R6702j56860K0401j50452K71866J11604
16878C648097j38747J0494L16092m04880N20543J31523j48883k48702L70350Q8975
16868D144862K94626j04110J88742k55133L21432Q6870j8435k22796L8970J54190
16858D629218J09606L22007j45738M0394l6718Q8111p2634K18400L68975j78734
16848E342887l25856N62507J6838J48978J146N03519o0992n2192j40732M35679
16838F431782J08415N1507J63804K42311j34489K32110o5446K60528K17044k03037
16828G304529N69102l14202L08201K46838K79671J13114q8209N13928K61421J62123
16818I356516k4265J99928J47949J44706J41054M45129m2903P97792m01146L21923
$$ y = [3334083, 3134710, 3235964, 3246345, 3454836, 3551538, 3394678, 3415079, 3264627, 3536493, 3648097, 3509350, 3519844, 3835936, 3431056, 3951599, 4083122, 3934239, 3685537, 4055887, 4144862, 4439488, 4335378, 4524120, 4268987, 4590419, 4677289, 4658854, 4436058, 4475028, 4629218, 4738824, 5060831, 4915093, 4955487, 4918769, 5006880, 4934246, 5152646, 5521621, 5342887, 5017031, 5579538, 5596376, 5745354, 5746500, 6250019, 6189027, 6136835, 5996103, 6431782, 6540197, 6591704, 6755508, 6997819, 6863330, 7095440, 7029994, 7290522, 7507566, 7304529, 7873631, 7559429, 7867630, 8114468, 8394139, 8507253, 8419044, 8932972, 9194393, 9356516, 9332251, 9532179, 9680128, 9824834, 9965888, 10411017, 10368114, 11165906, 10764760, 11086683]
16808A1086683K64173L79496K44658J74339L20918M00617K64611r0261P19878
16799A3765112L6958O92959n819L70892N37601M83741J64356L22701M87856O16477
16789A7472834K34174N41153N43784P18525L88826L30073M76620P51651P13281
16780B2170921L10218Q45618N62163O40132Q27583O86258P20200Q40447J023951
16771B8627491P25945Q72698J103050R74819N69680J763169N79390J644238J238175
16762C8098655J356945J054972J473173J449095J490989J697368J353040J508552
16754D9482789K297211J650639K031831K250827J678855K325307K163719K616834
16746F6498012K309677K397500K668223K648168K814624K518914K537003K725262
$$ y = [11086683, 11350856, 11730352, 11975010, 12149349, 12470267, 12870884, 13135495, 13045234, 13765112, 13802070, 14495029, 14489210, 14860102, 15397703, 15881444, 16045800, 16368501, 16856357, 17472834, 17707008, 18248161, 18791945, 19510470, 19899296, 20229369, 20705989, 21457640, 22170921, 22481139, 23326757, 23888920, 24529052, 25356635, 26042893, 26763093, 27603540, 28627491, 29353436, 30226134, 31329184, 32304003, 32873683, 34636852, 35216242, 36860480, 38098655, 39455600, 40510572, 41983745, 43432840, 44923829, 46621197, 47974237, 49482789, 51780000, 53430639, 55462470, 57713297, 59392152, 61717459, 63881178, 66498012, 68807689, 71205189, 73873412, 76521580, 79336204, 81855118, 84392121, 87117383]
16738H7117383L270147K524951K637607L018964K783500K541415K735847K133943
16730A08763757K180733K264403J979914J738908J127321J157970Q57216O21782
16722A20692004K0555p4955l63978o76737j328938j314904j929414j878381k038684
16713A11106568k266950k529906k522735k601315l233574k751194k762235l195737
16705H9242922k805518k642068l138220k343726l165418k650037k775527k442090
16697F7280318k506014k392132k169430k441281k082115k003666j998875k135014
16689D9551791j298557j837076j777642j383755j785112j092384j633005j409060
16681C7335200j353818j315655q96361j007470j220213j130708j038383q28710
$$ y = [87117383, 90387530, 92912481, 95550088, 98569052, 101352552, 103893967, 106629814, 108763757, 110944490, 113208893, 115188807, 116927715, 118055036, 119213006, 120070222, 120692004, 120712559, 120637604, 120273626, 119596889, 118267951, 116953047, 115023633, 113145252, 111106568, 108839618, 106309712, 103786977, 101185662, 97952088, 95200894, 92438659, 89242922, 86437404, 83795336, 80657116, 78313390, 75147972, 72497935, 69722408, 67280318, 64774304, 62382172, 60212742, 57771461, 55689346, 53685680, 51686805, 49551791, 48253234, 46416158, 44638516, 43254761, 41469649, 40377265, 38744260, 37335200, 35981382, 34665727, 33769366, 32761896, 31541683, 30410975, 29372592, 28543882]
16673B8543882r56239p09693p12808r85465p07775n14617o94391r55269m68843
16664B1838782m10005j174063l23377p01030m00469l63869l72041n25301k96563
16655A7272064n76068m14745m16266k89874m29884o89487k1411n30018m36830
16646A3467481k56764K02161n60845k49963m56453j34797o52274q4432k96848
16637A0977266q8653k02889k09007k35761j33984k69260r991k78225m04029j80529
16627H964938l07913K5911l04514j18692J4850P4688l94928k14930j14473l00568
16617G324369P337l48851K17267l15381P5092j29500R6311m21079k40159M69406
16607F734812n32907R9821m56151j23429K39713j58639l12738M89535o41547L19335
$$ y = [28543882, 27587643, 26877950, 26165142, 25179677, 24471902, 23957285, 23262894, 22307625, 21838782, 21428777, 20254714, 19931337, 19230307, 18829838, 18465969, 18093928, 17568627, 17272064, 16695996, 16281251, 15864985, 15575111, 15145227, 14455740, 14434329, 13904311, 13467481, 13210717, 13412878, 12852033, 12602070, 12145617, 12010820, 11358546, 11274114, 10977266, 10888613, 10685724, 10476717, 10240956, 10106972, 9837712, 9827721, 9549496, 9145467, 8964938, 8657025, 8682936, 8378422, 8259730, 8274580, 8349268, 7954340, 7739410, 7624937, 7324369, 7331706, 6982855, 7200122, 6884741, 6959833, 6830333, 6926644, 6505565, 6265406, 6734812, 6201905, 6301726, 5845575, 5722146, 5961859, 5803220, 5490482, 5980017, 5338470, 5657805]
16597E657805j25780k67652k0966P8866k56162j82797J06037k09124r5862j50615
16587D533750J09645j1054l13903N8191j3266l02424j31267P7792N5732K1890
16577D085086N8234J16853n33577o8280K09454k12918k1950J1339k7576j48899
16567C467766k97213L48586l79058J30340K61403l7582Q2435j39984k37589K7838
16557C226942l01438r9627N15457j65661p5449k72329R0483k17470K80017l53769
16547B627156P5086J37173O7095k42698p9515m2135p0646j46871J46357L50242
16537B821244n69874L4868L18875K3368j11939j23452l26242J35986N4780j64830
16527B092784J00654K07463l97931K18781k45774L55580l9181j27538J37267O7377
$$ y = [5657805, 5532025, 5264373, 5243407, 5322273, 5066111, 4883314, 4989351, 4780227, 4684365, 4533750, 4643395, 4632341, 4318438, 4376629, 4363363, 4060939, 3929672, 4007464, 4063196, 4085086, 4143320, 4260173, 3726596, 3658316, 3867770, 3654852, 3632902, 3644241, 3616665, 3467766, 3170553, 3519139, 3140081, 3270421, 3531824, 3494242, 3576677, 3436693, 3199104, 3226942, 2925504, 2825877, 3341334, 3175673, 3100224, 2827895, 2918378, 2700908, 2980925, 2627156, 2702242, 2839415, 2906510, 2663812, 2584297, 2542162, 2471516, 2324645, 2471002, 2821244, 2251370, 2286238, 2605113, 2628481, 2516542, 2393090, 2066848, 2202834, 2257614, 2092784, 2193438, 2400901, 2002970, 2221751, 1975977, 2331557, 2292376, 2164838, 2302105, 2369482]
16517B369482j29517R041k78645j7374K26432l49873J64845l00496J51832K3568
16507A869295L1952j40158K86266J59037j80641l44348K37378j13681P4145l47661
16497A531584p5072J27120J74931m1324j83131M41766l85290J17969N0045k61818
16487A496780K35992k20264m6610P6856l1867m913m06491O47696l13627J26796
16477A560348k29219K12173j99306K40027m17463J58330M0588R629J4423J17093
16467A506623r1019R5578j13732K04741j74442K24903m16857L21349l9430j29163
16457A388551J55707j83869m24156K47557J31153k61844J12778k74174L61696
16448A253399j82192r8850M28192l52635L41634l58001K88920j3010J7185M5116
$$ y = [2369482, 2239965, 2249006, 1970361, 1952987, 2179419, 1829546, 1994391, 1693895, 1845727, 1869295, 1901247, 1761089, 2047355, 2206392, 2025751, 1681403, 1918781, 1805100, 1879245, 1531584, 1456512, 1583632, 1758563, 1717239, 1534108, 1975874, 1590584, 1708553, 1758598, 1496780, 1732772, 1512508, 1465898, 1542754, 1510887, 1505974, 1099483, 1747179, 1433552, 1560348, 1331129, 1543302, 1343996, 1584023, 1166560, 1324890, 1365478, 1375107, 1389530, 1506623, 1415604, 1511182, 1397450, 1602191, 1427749, 1652652, 1235795, 1557144, 1517714, 1388551, 1544258, 1360389, 936233, 1183790, 1314943, 1053099, 1165877, 891703, 1253399, 1071207, 972357, 1400549, 1047914, 1389548, 1031547, 1320467, 1307457, 1324642, 1369758]
16438A369758m48957J11250q7926J93024J42974O5059k53863K8605r2505n2316
16428I75103M3975N6179n7740M21420l86536J2382k8834O3867j85469j22614J43275
16417I35008L01918m57864j84242K38919J82044M841M2702r7462k07227K41983
16407A000620k56903J09129J32373q2270k30417O9067K45171j80961j39868l9911
16397F26030K11669J30303j20255k07574K80959p7940J30414j44921J11629J96221
16387A136535k09261q1923L68001j60561k27814J67721m57197L54815l85840L46441
16377H50917k20821K45307K36234n07349M44536j7034q4455j11127l35561K75126
16367G75773N1780L55859n17417k55133L92453J96551j46222j66138M00569j77613
$$ y = [1369758, 920801, 1032051, 944125, 1137149, 1280123, 1345182, 1091319, 1119924, 1027419, 975103, 1019078, 1075257, 1017517, 1438937, 1052401, 1064783, 1035949, 1099816, 914347, 791733, 935008, 1236926, 779062, 594820, 833739, 1015783, 1020624, 1063326, 965864, 758637, 1000620, 743717, 852846, 985219, 902949, 672532, 741599, 986770, 805809, 665941, 626030, 837699, 968002, 847747, 640173, 921132, 843192, 973606, 828685, 940314, 1136535, 927274, 845351, 1213352, 1052791, 824977, 992698, 535501, 890316, 504476, 850917, 630096, 875403, 1111637, 604288, 1048824, 1031790, 947335, 836208, 500647, 775773, 827553, 1183412, 665995, 410862, 803315, 999866, 853644, 687506, 1088075, 910462]
16357I10462B44274J07198L87630j25770l8079K60966j54090k778K10657j0430
16347H79578D08393L98921P3567D00367K61485J27114l29705L77005k72225K56381
16337H20422P5856J60121E24049J80551p6217r4868P7677K7106P9481C42957J02499
16326D45456L43630j09113j23432p740Q4459n6384j6181L7230j3275P0120K78053
16315I32823l69739j04934A02562K11619M09574k65517J43736p5903m8599j23145
16305C54327A20088O29097j41105j07089J43130j99199n2660r1483j5107J27694
16295D13366M8449N1407M2577N7932k58380J33637O2506j76736k7461K34791j29709
16284D52379M4508A13912J46471M05254C22305j33761N14533C38004K27758l7485
$$ y = [910462, 244274, 351472, 739102, 613332, 575253, 836219, 682129, 679351, 890008, 879578, 408393, 807314, 880881, 400367, 661852, 788966, 459261, 836266, 564041, 820422, 896278, 1056399, 524049, 704600, 628383, 533515, 611192, 638298, 717779, 342957, 445456, 789086, 679973, 556541, 548801, 633260, 576876, 560695, 597925, 584650, 654770, 932823, 563084, 458150, 102562, 314181, 723755, 458238, 601974, 526071, 477472, 354327, 120088, 749185, 608080, 500991, 644121, 444922, 392262, 300779, 285672, 413366, 461815, 513222, 555799, 613731, 355351, 488988, 551494, 374758, 347297, 582088, 452379, 496887, 113912, 260383, 665637, 322305, 188544, 703077, 338004, 565762, 528277]
16274E28277B33245k5927L14720k9919j17524o6029J18806J37151J02430l22332
16264C44621J80433B21452P2212j02044R8746j06713J39433J53178L3947k22508
16254B87703K67368l1974j99039J94926j67572p2256O4297J85853j09099d6007
16243D00872L22843k78475O4342k22472L2273P8454J79586j08115p4494A28067
16232B17323P9466C5921J17675J54317j22398M02055j25175L29475A25485M27506
16222E52991J77328B94746E9248K69130r536J41234A77571L86281j03666j4005
16212D46181A73262O47483C06782J47016j96167j11981N47469A01323M55945j1795
16202E45473k40116M6183A60766K95464A47349K20497q8421r4476P0840J47739
$$ y = [528277, 233245, 207318, 522038, 492119, 374595, 308566, 427372, 564523, 666953, 344621, 525054, 221452, 293664, 191620, 290366, 183653, 323086, 476264, 510211, 287703, 555071, 523097, 324058, 518984, 351412, 279156, 343453, 529306, 420207, -46007, 400872, 723715, 445240, 509582, 287110, 319383, 397837, 577423, 469308, 394814, 128067, 217323, 296789, 35921, 153596, 307913, 185515, 587570, 462395, 791870, 125485, 552991, 730319, 294746, 59248, 328378, 318842, 460076, 177571, 563852, 460186, 446181, 173262, 820745, 306782, 453798, 257631, 145650, 693119, 101323, 557268, 545473, 305357, 351540, 160766, 456230, 147349, 367846, 279425, 184949, 255789, 403528]
16192D03528j58394m7864R8393K9473p1487a18368B80861K86101M2336C0393L59930
16181C90323K2139A8560K59711l8246R8686d586C53799j75120K09804o4149R4951
16170D19285B09438K32294j24834o1000j07087J70971M0540o586E3552J01610
16160A55162J3391J77575A06944L26754B2135N05583A8969L99374F7712L14822
16150C82534h5601A80080J11079H4805J51966i974C01107J30196j85531b4947
16139I2436f0165E27307d7326A91697a90593A56608L36544j21331g3077A43132
16128B34167j8568N7652J0522J43219f2262B12610N1599j1822J93653K408A7536
16116G6075J11320P8909P25j03121L64334i2069A58638o9710M3607n074l7932
$$ y = [403528, 245134, 197270, 295663, 325136, 253649, -118368, 280861, 566962, 609298, 30393, 390323, 412462, 18560, 278271, 240025, 338711, -4586, 353799, 178679, 388483, 324334, 419285, 209438, 441732, 316898, 255898, 148811, 319782, 360322, 353736, 53552, 155162, 168553, 346128, 106944, 433698, 22135, 527718, 18969, 418343, 67712, 382534, -85601, 180080, 291159, 84805, 236771, -9974, 301107, 431303, 245772, -24947, 92436, -60165, 527307, -47326, 191697, -190593, 156608, 493152, 371821, -73077, 143132, 234167, 215599, 273251, 283773, 426992, -62262, 212610, 264209, 252387, 446040, 448448, 17536, 76075, 187395, 266304, 267029, 163908, 528242, -92069, 158638, 88928, 132535, 127461, 89529]
16105H9529J01518f0589C20226j31124G5422J69287D056M97703H2108j8941e7909
16093B31985m3415J1616r4890i9626D28984A18048i2160I886e8093A95437K35682
16082D31119A47386b18959B52543P8004f1495C20626F7731K81406c10618A08368
16071A56725K8979k6559F6588a31924j11973g9108A66684D6653b29703A06468
16060C39083c707A18241J96192A47884a01733B17789r9113b24547A45845L44435
16050D90280A34614g2229C79120A62210d0934B09577b86428a24028j8386A66823
16039G0731B0229J38158R1205K31023G071L1981K50813R0474H3046a63437B50351
16027A86835d785B35483a36866G2041k4174b3440j50262B93166D1924L6871B0946
$$ y = [89529, 191047, -60589, 320226, 189102, 75422, 244709, 4056, 501759, 82108, 63167, -57909, 231985, 188570, 200186, 105296, -99626, 428984, 118048, -92160, 9886, -58093, 195437, 431119, 147386, -218959, 252543, 330547, -61495, 320626, 67731, 349137, -310618, 108368, 156725, 185704, 159145, 66588, -131924, -243897, -79108, 166684, 46653, -229703, 106468, 339083, -3707, 118241, 314433, 147884, -101733, 217789, 118676, -224547, 145845, 490280, 134614, -72229, 379120, 162210, -40934, 209577, -286428, -124028, -142414, 166823, 70731, 20229, 158387, 249592, 480615, 7071, 39052, 289865, 380339, 83046, -163437, 250351, 186835, -4785, 235483, -136866, 72041, 47867, -23440, -173702, 293166, 41924, 78795, 20946]
16015G0716c00882F6406g5772R957l1314I0254A2671K72931p6142K6823a09951
16003d4876r4108q8179A24578j7079a5070C4219b73269D55153d3413q5207N9141
15992f9479B63981J9095a888D40333O5515J51216N19594J45927K05446l87198
15982A140833j70074C34812K76656B44189b5199B68470D5242i1113k5361J8276
15972i8198A72094j2135c73425J79250c0259k74583A54489N1679g62n8279A54375
15960g2193A0695J84747a12009A87657o5293Q5082p7803L8973l6863f9368j26470
15949a95838j63088A57328g5545B5368b45260k612A04923J15316j09387Q8196
15939A99048F3732J52579g1062C3309c24415B01411K7554B8947a27921B19913
$$ y = [70716, -300882, 66406, -75772, -65815, -97129, 90254, 12671, 285602, 209460, 236283, -109951, -44876, -138984, -227163, 124578, 107499, -15070, 34219, -273269, 455153, -43413, -128620, -69479, 263981, 283076, -1888, 440333, 505848, 657064, 1176658, 1322585, 1528031, 1140833, 970759, 334812, 611468, 244189, -25199, 268470, 45242, -91113, -116474, -98198, 172094, 159959, -373425, -194175, -30259, -304842, 154489, 206168, -762, -59041, 154375, -72193, 10695, 195442, -112009, 187657, 122364, 207446, 129643, 168616, 131753, -69368, -195838, -358926, 157328, -75545, 25368, -245260, -247872, 104923, 220239, 110852, 199048, 63732, 216311, -71062, 33309, -324415, 201411, 228965, 28947, -127921, 219913]
15928C82099c466A21954c67102J09710A9994d4722g757B62371B4911c55873A23249
15916G102a23100A53562d0308k4347j02137e9920J4960A00349A2293a0622o6314
15905g6936J7645A39397D659N2197a42669I3815a41018K0871j52196f0272l04523
15894c64795h0269K3978A55424b6008C31771j0534A41733c92441A17789g9858
15883b02260a5533k79324C5340N7332b6923N373D1958M0115c33586a51777O0665
15872i1112C08389A8074a8083B36156g8533L8387E0245P5549J32447r3045q2183
15861H3013B0494P4488L7776l1985c5153j81277k5717f0305q9445j8396h0453
15849A15196e1530J0695j05211k7860A22145a45802A9114c7093N14n2498B46391
$$ y = [382099, -3466, 121954, -367102, -257392, 19994, -44722, -7757, 262371, 24911, -355873, 123249, 7102, -123100, 153562, -40308, -64655, -166792, -59920, -44960, 100349, 12293, -10622, -76936, -59291, 139397, 4659, 56856, -142669, 93815, -141018, -120147, -272343, -60272, -364795, -80269, -56291, 155424, -26008, 331771, 321237, 141733, -392441, 117789, -79858, -202260, -15533, -294857, 35340, 92672, -26923, -21550, 41958, 82073, -333586, -151777, -91112, 308389, 18074, -18083, 236156, -78533, -40146, 50245, 125794, 258241, 165196, 83013, 20494, 94982, 132758, 100773, -35153, -216430, -242147, -60305, -149750, -168146, -80453, 115196, -51530, -40835, -146046, -173906, 122145, -145802, 19114, -37093, -36579, -89077, 246391]
15837C220h3754G0675f4020L0539j93419b1781k03036r0404a16248A51145a71510
15825I7130E926J66063a99963k20895J29353I8150C2397a62003c5518k77700B9555
15813a40807b0055p1642k9221l8818f5134m4071B57434a84792h9621E1162b06299
15801a86519b9949A29036n2096a24559B29546H759a62596j4328l7242i6672P417
15790h9255b8846k8922B68232a75764j52293I7937a30543d5513j36614K4651J0641
15779a46835C19172m2232h590k58696H1522a11890e2390A55833F6050a46007k55813
15768d01820B20733b27665A11131a406j00350o556I2278C9302M8441g0352G0693
15756D4273b50042f604A74875c8865A02019b44158N3567J4463B49952j07991a3133
$$ y = [3220, -83754, 70675, -64020, -33481, -226900, -21781, -224817, -315221, -116248, 151145, -171510, 97130, 5926, 171989, -199963, -420858, -291505, 98150, 32397, -162003, -35518, -313218, 29555, -140807, -20055, -91697, -120918, -159736, -65134, -109205, 257434, -184792, -89621, 51162, -206299, -186519, -29949, 129036, 76940, -124559, 229546, 8759, -162596, -176924, -214166, -96672, -89255, -28846, -57768, 268232, -175764, -328057, 97937, -130543, -45513, -182127, -157476, -146835, 319172, 276940, -8590, -267286, 81522, -111890, -52390, 155833, 66050, -146007, -401820, 220733, -227665, 111131, -1406, -101756, -108312, 92278, 39302, 87743, -70352, 70693, 44273, -250042, -6604, 174875, -38865, 102019, -244158, -190591, -176128, 249952, 141961, -13133]
15744A20756a53075A10459a1639B9913b58394a26193o8926j06978C8118a51310
15733D5719L01158b39950i1255L4153C73195c1710b994C4062M9753a4553j52320
15722a66873d3420N472j4733A34859a25904M4031H3752N3804a47883A71997l9969
15711A32028b15898m9750R889a3475O582n7001n2821j20838a12180B36386b0795
15699c02642i4851c7506n2418B21943a62533f5903A53451l7410l4287K09932A17214
15687B41298a25007K4172H4616b3149B94710f5280l7169L4000j3549j23210A12436
15675E4352b28107A4298J20849n2937a77315h6948j15308A09331N0449a87329
15664b2460F2672a16914K4989a2850k17024R3214O437j82020a32865c3658I1770
$$ y = [120756, -153075, 110459, -11639, 29913, -258394, -126193, -195119, -302097, 38118, -151310, 45719, 346877, -239950, -91255, -57102, 373195, -31710, -2994, 34062, 83815, -14553, -166873, -43420, -37948, -52681, 134859, -125904, -81873, 83752, 137556, -147883, 171997, 132028, -215898, -265648, -255759, -13475, -6893, -63894, -116715, -237553, -112180, 236386, -20795, -302642, -94851, -37506, -89924, 221943, -162533, -65903, 153451, 116041, 81754, 291686, 117214, 241298, -125007, -100835, 84616, -23149, 294710, -65280, -102449, -68449, -81998, -205208, 112436, 54352, -228107, 14298, 135147, 82210, -177315, -86948, -202256, 109331, 159780, -187329, -22460, 62672, -116914, -91925, -12850, -229874, -136660, -130223, -312243, -132865, -33658, 91770]
15652e9584m7350B55385H9346e3961j67410d883j39156B09863a65488H5043N6727
15641A41770C7083f0402c580F5964a14467j16170B24359b92932R8761A77422h8549
15629c87734a08079m9549q793j34576J28014f7872H3231C7307c3004q4520l7257
15618a54781M2597b877B88990a47219A09168f5093D9020j6180K33101d93906A82471
15606F3990b64593N1501b9365q0316C28113c4036A12764f2796a1600A24479a79959
15594a92984f9034o7669E0614L33999a9505F4174c521l04627B22195e2200C34755
15582a01236q410B4792L7425g4549M997A9175J20463a33739B10935D3196L7235
15571H0431f707k74332B47253a0368D8643F442J37380a0373o2683k26555f1499
$$ y = [-59584, -106934, 255385, 89346, -53961, -221371, -4883, -144039, 209863, -165488, 85043, 141770, 37083, -60402, -3580, 65964, -114467, -230637, 224359, -292932, -194171, 177422, -88549, -387734, -108079, -157628, -166421, -300997, -172983, -67872, 83231, 37307, -33004, -117524, -154781, -112184, -2877, 288990, -147219, 109168, -65093, 49020, 32840, 265941, -493906, 182471, 63990, -264593, -213092, -29365, -109681, 328113, -34036, 112764, -62796, -11600, 124479, -179959, -192984, -69034, -136703, 50614, 384613, -19505, 64174, -3521, -308148, 222195, -52200, 334755, -101236, -109646, 24792, 62217, -74549, -69552, 19175, 139638, -133739, 210935, 43196, 80431, -6707, -281039, 247253, -10368, 48643, 6442, 143822, -10373, -73056, -299611, -61499]
15559a95962I7852d96783e4247o8080J3823A35250J42031g4150j92652Q1502A09135
15547B13263c0505F9793a77961q7654A95490a48224J5041Q086G8683J45942A0112
15535c631A37243B3559R4201f9226j31737g6045C0905a50673H4971K02547A30287
15523B1183J34519L8899b3632n1476j904q7580e349j10820B14435J35638j74054
15512A76019L49519A38755a15731A34259h0106G7807B3699R6242E5751J40322
15502A96073J85689g8733F7592a10692C86631g275E59850a97150G2452k4714P3492
15491A21230P8130j9760o8540L7379m4879h498A97335b7374B62457j17724J30192
15480B74925O302i8937B92843B0406b11051g2611E28670m9895J5224K23314C39137
$$ y = [-195962, 97852, -496783, -54247, -122327, -108504, 135250, 277281, -74150, -266802, -185300, 109135, 213263, -30505, 69793, -177961, -265615, 195490, -148224, -133183, -125097, 78683, 224625, 10112, -3631, 137243, 23559, 117760, -69226, -200963, -76045, 30905, -150673, 84971, 287518, 130287, 21183, 155702, 194601, -23632, -75108, -77012, -164592, -5349, -116169, 214435, 350073, 176019, 525538, 138755, -115731, 134259, -80106, 77807, 23699, 119941, 55751, 196073, 381762, -78733, 67592, -110692, 386631, -7275, 559850, -197150, 72452, 47738, 121230, 199360, 179600, 111060, 148439, 103560, -8498, 197335, -27374, 262457, 144733, 274925, 281227, -98937, 292843, 20406, -211051, -72611, 528670, 478775, 493999, 717313, 339137]
15468A10420O493K29841B5702R733K20039q9029l7634e8517b7196p4052m7990
15457a49238B18153e4428A84127P869B1526K15916K0457b16782K6972e8544B44338
15445A20825J2544J69079K63352k81497M90402J26349j55835l70797K79281j80848
15435D72855F9013L74437j91572M9488j48796a78689H2022J79196b246j92391
15425a94637A93441M5936A9262Q4595a46691F340M2874J44452a2438l95451a31481
15413a14539G0113d8665B6393J19746n5381b09589A57860b49346A61285a58174
15402B4299a67743D4303N5150J00307h4735K561j95476E4909h782A65627a32987
15390e1103r3600B39300g1956k359A26829b08072j15798a42915d7583A33985A4617
$$ y = [110420, 116913, 346754, 25702, 35435, 255474, 166445, 128811, -58517, -27196, -101248, -149238, 218153, -54428, 184127, 191996, 21526, 237442, 257899, -216782, -189810, -58544, 244338, 120825, 133369, 302448, 565800, 284303, 774705, 901054, 745219, 374422, 653703, 472855, 69013, 443450, 251878, 301366, 152570, -178689, 82022, 261218, -2246, -194637, 193441, 239377, 19262, 103857, -146691, 6340, 49214, 193666, -12438, -407889, -131481, -114539, 70113, -48665, 26393, 146139, 90758, -209589, 157860, -249346, 161285, -158174, 24299, -167743, 44303, 99453, 199760, -84735, -82174, -277650, 54909, -8782, 165627, -132987, -51103, -144703, 239300, -71956, -74315, 126829, -208072, -323870, -142915, -47583, 133985, 14617]
15378F23946A55675h3948B4936M00697G3170Q2104K66779A31749Q8597a02909
15367C261N7954J41676L9304L6605A35368L59585A35801k9209R8652f3103D01887
15355a46114B76327p28D8845Q9570J97488r5015K41587B30238j8670m3615J08296
15344B76249r0371D9209O4935L44221k2420A67365Q8749m863E2895K21689g9879
15332f9776a8429L381C69000A81317J80482j48724b31578A37910i0151B1514J92158
15321B13672A0432g6263F7870c3270A84385D9295l617h355j7710j61885C69415
15309A10233J82445G2786d6924D37704A66906R507m7399a46641A46902a52761
15298a41318B13349A3287d1555o1373a5566C7676J9884a31971b2843A92613J66910
$$ y = [623946, 155675, -83948, 24936, 425633, 73170, 155274, 422053, 131749, 220346, -102909, 3261, 61215, 202891, 242195, 278800, 135368, 494953, 135801, 106592, 205244, -63103, 401887, -146114, 276327, 275599, 48845, 138415, 335903, 240888, 482475, 230238, 211568, 167953, 276249, 185878, 49209, 114144, 458365, 435945, 167365, 256114, 251251, 52895, 274584, -79879, -69776, -18429, -15048, 369000, 181317, 361799, 213075, -231578, 137910, -90151, 21514, 213672, 10432, -76263, 67870, -33270, 184385, 49295, 45678, -8355, -26065, -187950, 369415, 110233, 292678, 72786, -46924, 437704, 166906, 176413, 129014, -146641, 146902, -152761, -141318, 213349, 13287, -41555, -102928, -15566, 37676, 57560, -131971, -22843, 192613, 359523]
15287C59523a69317B9168f4222C1899a4375A19181b91907e3982D516Q5068J87742
15276B77326R3526b054E2180a24085M776D2883a05164H3463J13260P5216H6014
15264b36718B13527g2202B51062F5234J3946K46593j29709D1024a42971B26656
15253F453i2860d5659A01714Q1507n6270E2660K92523A20086J8641Q07064O51421
15242A597212l6911k8981j14363o20097k63607k64865j31323b68819B71670b22750
15231c4864j26305F1757b95589B82843a52226A99297c58363A47838a05320C51508
15220H7398O5637p1487Q6187d29759B2670N8648O8054a13176D4903M01673b23334
15208A60023L6258n7357N4253b92716c3297B3464h8138j31321L2616o7662e9548
$$ y = [359523, -169317, 29168, -64222, 31899, -14375, 119181, -291907, -53982, 4516, 89584, 277326, 370852, -2054, 52180, -124085, -119309, 42883, -105164, 83463, 196723, 271939, 86014, -236718, 213527, -72202, 251062, 65234, 79180, 325773, 196064, 41024, -142971, 226656, 6453, -92860, -45659, 101714, 183221, 126951, 52660, 345183, 120086, 138727, 945791, 1597212, 1560301, 1531320, 1416957, 796860, 533253, 268388, 137065, -268819, 271670, -222750, -34864, -161169, 61757, -295589, 282843, -152226, 199297, -358363, 147838, -105320, 351508, 87398, 153035, 81548, 167735, -429759, 22670, 81318, 149372, -113176, 44903, 446576, -223334, 160023, 196281, 138924, 193177, -292716, -33297, 23464, -88138, -219459, -186843, -254505, -59548]
15196A12813b01400Q2305d6036i331r5636A9459a36611C58881C5274J34129a45213
15184C73635A15214J41254r9914a06774E14182q0034o7327A4588J82916j3815
15174A83689L14504a85698E6853K94883a6074j04473C20165H6508a06781B999
15163B56843A00625J93764p0478l8609K4957G4216a41874I4903L45614A84922
15152B20880F505K78130E3952d3392A81086j9988B304K12711K5370N5471A10730
15140g9310B01146A1292J0203b665E5500c92750C23747a1961B84901K8019f4781
15128B75717r2675o371N101a26671C71531A66106n5736J8303P7595J08361K9857
15117C44486A54931A3018M14486j48272q4364L7134J93816A08478K87561j67887
$$ y = [112813, -201400, -119095, -46036, -9331, -104967, 19459, -136611, 358881, 35274, 169403, -145213, 373635, 115214, 256468, 156554, -106774, 514182, 434148, 366821, 14588, 197504, 183689, 498193, -185698, 56853, 351736, -16074, -120547, 320165, 86508, -106781, 2999, 256843, 100625, 294389, 223911, 185302, 210259, 74216, -141874, 94903, 440517, 184922, 220880, 6505, 284635, 53952, -43392, 181086, 161098, 2304, 215015, 240385, 295856, 110730, -79310, 201146, 11292, 21495, -2665, 55500, -392750, 323747, -11961, 284901, 312920, -64781, 275717, 183042, 176671, 181772, -126671, 371531, 166106, 110370, 128673, 206268, 314629, 344486, 154931, 13018, 427504, 279232, 194868, 232002, 425818, 108478, 396039, 228152]
15107B28152I9727B239J50973K37356A83575g571C1923L34974j27845R2189j53013
15096A78228L83b49776G7807A4219R8057a29444a9175f321A43483h5077I3552
15084A04088R7985I6035m6305J39670G6126k3920M59048B37834a9829D0689i9613
15072b21125A80063a9198A86285o2404n6722c05453A99597b221C35804H0940j7579
15061F3361M00360c72487B35305l2679J9322E5160L98256A67246k7125M27038
15051E67159A56184K26109g020E17841I9518L11248A6043L64592j36143e3101
15040B86726k9290K78689j50023c8250D23346r4372A49640J39885J48875A32381
15029D58128J86774Q2995q553L7479C27776n3486K13179L6469K11949B85168M11265
$$ y = [228152, 99727, 2239, 153212, 390568, 183575, -7571, 31923, 366897, 239052, 331241, 178228, 178611, -249776, 77807, 14219, 112276, -129444, -19175, -6321, 143483, -85077, 93552, 104088, 202073, 96035, 49730, 189400, 76126, 52206, 511254, 237834, -19829, 40689, -99613, -221125, 180063, -19198, 186285, 123881, 67159, -305453, 199597, -2221, 335804, 80940, 63361, 463721, -372487, 235305, 202626, 221948, 55160, 453416, 167246, 140121, 567159, 156184, 382293, -7020, 517841, 99518, 410766, 16043, 380635, 244492, -53101, 286726, 257436, 536125, 386102, -38250, 423346, 328974, 149640, 289525, 438400, 132381, 458128, 644902, 727897, 719344, 756823, 327776, 274290, 487469, 523938, 735887, 285168, 696433]
15018F96433j32144k03022A69172R2512l4253L88695Q1135B01884N34193k81842
15008D54235j25996L23121B70483L57668k26764j20477r854J64412N1620j18184
14998C68904n563J35512L2656j88524j53678K45295q4647J54919K0767M311j31899
14987C98053L69659k07726B34767J61955L52114k10870L14036J03769k51800r7409
14977F06562j71739K45726k74525j25779j11730J60602N10066C60106K56630A29641
14966D81929q1962j88758J59160K03503L2472F3352K79650O7558j73246L25427
14956E62741j90697j69184O7695J04536J3136j27162J33743p1872O2045j73504
14946B11477K81036N2511j3413K6306J86443B79035K12157j9771r9961K52053
$$ y = [696433, 564289, 361267, 169172, 261684, 227431, 616126, 697261, 201884, 736077, 454235, 328239, 651360, 270483, 628151, 401387, 280910, 271056, 435468, 487088, 368904, 363341, 498853, 531509, 342985, 189307, 434602, 349955, 504874, 525641, 529952, 398053, 767712, 559986, 234767, 396722, 748836, 537966, 852002, 955771, 703971, 606562, 434823, 680549, 406024, 280245, 168515, 329117, 839183, 360106, 616736, 129641, 481929, 399967, 211209, 370369, 573872, 606344, 63352, 343002, 410560, 237314, 562741, 372044, 202860, 270555, 375091, 388227, 261065, 394808, 322936, 384981, 211477, 492513, 545024, 531611, 557917, 744360, 279035, 491192, 471421, 371460, 623513]
14936F23513j97664J60240r5630P5881J30003J40180J67950j74475J51624L32762
14926A314384j90537J53948L62589k95361K37220m96671L82339j37779M67886
14917A798018j86307L49672m46375L27637k78226k31437j92636j81280J94888
14908A153954D19531j05409j52362K92101q0006L54256C43360n4645K86317k25096
14898C49936j38519K39302L016K1734a06770B83139L21146B73824l2371L37329
14888E78782j35763L42507j11232q3460J46857J36232K8470k39377J25747M6690
14878H35453j20803K77261m02679j27695j06519j01026N11655j38515B57748J50272
14868D08020J5532J29609K91261j11829o3591K14068m37183j7287j5701l9964
$$ y = [623513, 425849, 586089, 490459, 566340, 696343, 836523, 1004473, 829998, 981622, 1314384, 1123847, 1277795, 1640384, 1345023, 1582243, 1085572, 1467911, 1330132, 1798018, 1611711, 1961383, 1515008, 1842645, 1564419, 1332982, 1140346, 959066, 1153954, 419531, 314122, 161760, 453861, 373855, 728111, 343360, 288715, 575032, 349936, 211417, 450719, 453735, 475469, -106770, 283139, 604285, 273824, 241453, 578782, 443019, 785526, 674294, 590834, 737691, 873923, 902393, 663016, 788763, 835453, 714650, 991911, 589232, 461537, 355018, 253992, 765647, 627132, 257748, 408020, 423552, 553161, 844422, 732593, 669002, 883070, 445887, 428600, 412899, 372935]
14858C72935J78710J13509q5409J01362j44524B42385K63595A17679O63945l81439
14848D00185J68711J33568j77951R6207J40739K1997K84475l38402J96320K55309
14838A181158l62094N28936l52197j11376K8204j63037j51818j63857M91890l82726
14828E43083j11827P2515M27347k73121l3785M32337l10369C3040N27088j61147
14818C98981J46854K86602l57917J90546l12162M67607k32951j98838J8015m7505
14808C59232L66975k01863n2340K51138J29857j21304L18773r5997j01890C54713
14797E33369L06345C96132K10136B26455L53895k49515K74217q0405j6236l8988
14787D69423O8523L14394k66101p18k60435M16194k33517K3030O2569J79031K166
$$ y = [372935, 551645, 665154, 579745, 681107, 536583, 242385, 505980, 117679, 781624, 400185, 568896, 702464, 524513, 620720, 761459, 783456, 1067931, 729529, 925849, 1181158, 819064, 1348000, 995803, 884427, 912631, 749594, 597776, 433919, 925809, 543083, 431256, 503771, 931118, 657997, 624212, 1056549, 746180, 33040, 560128, 398981, 545835, 832437, 474520, 665066, 352904, 820511, 587560, 388722, 406737, 359232, 726207, 524344, 472004, 723142, 852999, 731695, 1050468, 954471, 852581, 354713, 533369, 839714, 396132, 606268, 226455, 580350, 330835, 605052, 524647, 508411, 469423, 537946, 852340, 586239, 585521, 325086, 741280, 507763, 530793, 593362, 772393, 774559]
14776G74559l40116O42406l43981Q3137K03432l42678M3032C45819L18110l08529
14766C55400K41358K23811J3603B41741K55937J84237n3337Q1698j4225o9113
14756F26938N1112r1104N0123J74929j83284j37031L00720J47883q7804k83199
14746E69283Q5040J72029q9202r439k31531J35901k42171M14986j95545J11113
14736G20464j31854M77377k56305j09651k44982O68992j24295Q7120K83571j95774
14726A174663K9596K80627j04010L92716j45426m88403R2800j17886L5587j32516
14716A017748j08907k40136K79348k79967j59632L14334k09966J44671J28078
14707H85571j18636L07471j25796N29274o49082M10452j06354N69198m42034L23008
$$ y = [774559, 434443, 1076849, 732868, 816005, 1019437, 676759, 719791, 345819, 663929, 355400, 596758, 820569, 834172, 241741, 497678, 681915, 628578, 710276, 696051, 626938, 678050, 586946, 637069, 811998, 628714, 491683, 792403, 940286, 852482, 569283, 654323, 826352, 737150, 727711, 496180, 632081, 389910, 804896, 609351, 720464, 588610, 1065987, 809682, 700031, 455049, 1124041, 999746, 1086866, 1370437, 1174663, 1204259, 1484886, 1380876, 1773592, 1628166, 1139763, 1232563, 1114677, 1150264, 1017748, 908841, 668705, 948053, 668086, 508454, 822788, 612822, 757493, 885571, 766935, 1074406, 948610, 1477884, 828802, 1239254, 1132900, 1702098, 1260064, 1583072]
14697A583072K54567n35686P2620j98294J75754l64786K32411l30864n8151M17769
14687A248412k25567j93734L5445r4674O8058P7526o1455k55965M67763l98461
14677F67348J89556J62966k4782R2835j99044M71464l77957O0564Q3504j03529
14667A022925M3737l3794j39138J54147L43292m14952Q6669l9619k11177K8655
14657H40745L44023N2391P177K52515n73541K63571L38761q8648k66666J59014
14647A329342J34855k53623L81536j92518j30388k1706P1262Q024m14966K87702
14637A199520j59522J82463j78006J39040K05556m0366L6716k95723m5271P4994
14627A119401L06730J98169p4139r5400m01710L41465m23833M89774J11329j70460
$$ y = [1583072, 1837639, 1301953, 1374573, 1176279, 1352033, 987247, 1219658, 888794, 830643, 1248412, 1022845, 829111, 864556, 769882, 837940, 915466, 854011, 598046, 1065809, 667348, 856904, 1019870, 995088, 1087923, 888879, 1360343, 982386, 1042950, 1126454, 1022925, 1066662, 1032868, 893730, 1047877, 1391169, 976217, 1062886, 1023267, 812090, 840745, 1184768, 1237159, 1244336, 1496851, 923310, 1186881, 1525642, 1436994, 1170328, 1329342, 1464197, 1210574, 1592110, 1399592, 1269204, 1247498, 1318760, 1326784, 911818, 1199520, 1039998, 1222461, 1044455, 1183495, 1389051, 1348685, 1385401, 1089678, 1044407, 1119401, 1426131, 1624300, 1550161, 1454761, 1053051, 1394516, 970683, 1460457, 1571786, 1401326]
14617A401326J27561m2214l776P1627m67794K73914J9199j21103K37049k48428
14607A247361Q00430k85995o038p1077k0074N9615o9458j82341k94932M40514
14597A618005o2011M57217l45208J9203k25864M22181m01257L05678M7794J42809
14587A978547J16846n43937L00776Q1854l0944K95568j73576k08264Q8745J02812
14577B008427j43816O1385r0403L24033j34521L82786m07606K40397j23993J44421
14567B261110K08247k07421K26548J3074K33019k37859j341L85635k00486K91243
14557B971769N5666L89258k20299M67217J92736L96011O81170J355473J913972
14548H202973L768761P884770J2991298j518391j0458799o952209o402154l209044
$$ y = [1401326, 1528887, 1486673, 1482897, 1554524, 1086730, 1360644, 1379843, 1258740, 1495789, 1247361, 2047791, 1761796, 1755758, 1684681, 1664607, 1724222, 1654764, 1472423, 1177491, 1618005, 1555994, 2013211, 1668003, 1687206, 1461342, 1883523, 1482266, 1787944, 1835738, 1978547, 2095393, 1551456, 1852232, 1934086, 1903142, 2198710, 2025134, 1816870, 1905615, 2008427, 1864611, 1925996, 1835593, 2159626, 2025105, 2407891, 2000285, 2240682, 2116689, 2261110, 2469357, 2261936, 2488484, 2501558, 2734577, 2496718, 2495377, 2881012, 2680526, 2971769, 3027435, 3416693, 3196394, 3663611, 3856347, 4252358, 4933528, 6289001, 8202973, 11971734, 19856504, 32847802, 31329411, 20870612, 13918403, 7516249, 4307205]
14540D307205k70085N17180L28424j159214o43188m98859l98270j35633j05161
14531A942399j71309N78774l03377J12043p0561L37394J14612k08857m0081j31344
14521B159693N05712n57992M02377N6724j2657J32206o1762N2969K879o5110q3138
14510B531901O4717L38623k87169L29141j76710N6932L65784J49861l05485m6339
14500C021256J97183k55498M59081j76917p9974J23539o7876J03320j29197K12498
14490C407415P0051j72442K68236P5727n2806j63529K75272J3160l73978M57296
14480C804402J84625k43387l5466O75783l44524k2532n1366K75819r3848P3235
14470D222741J43828p678J6523K50317m59869M17655k9770J2389J27734N2783
$$ y = [4307205, 4037120, 4554300, 4882724, 3723510, 3080322, 2581463, 2183193, 2047560, 1942399, 1771090, 2349864, 2046487, 2158530, 2087969, 2425363, 2539975, 2331118, 2291037, 2159693, 2665405, 2107413, 2509790, 2566514, 2553857, 2686063, 2624301, 2677270, 2680149, 2615039, 2531901, 2596618, 2935241, 2648072, 2977213, 2800503, 2857435, 3223219, 3373080, 3067595, 3021256, 3218439, 2962941, 3422022, 3245105, 3165131, 3288670, 3220794, 3324114, 3194917, 3407415, 3477466, 3305024, 3573260, 3648987, 3596181, 3432652, 3707924, 3721084, 3347106, 3804402, 3989027, 3745640, 3710174, 4385957, 4041433, 4018901, 3967535, 4243354, 4149506, 4222741, 4366569, 4358891, 4375414, 4625731, 4165862, 4583517, 4553747, 4566136, 4693870, 4746653]
14460D746653N01544R4028l26403r505j3313j8092K10056j34843K71370j0782
14450E310713J75370j51442N4580L58413N0781j18583K57533J32718j2144K11247
14440F269186M648N3477j08357L46706r2603j45916j4373N61469Q8479j0509n6526
14429F895681J90811K18121K46880J19453k70111J94027K04437M52243O4711R6717
14419H412970J43177J38928N08724j69700q607l36265K55593N10157j15670J54796
14409I494103R3158K22550L20113k09588M93072K71034M79340l48151J54659K35982
14399A1206272k04089M96311R1835J15748J47037K33621L79690L98891l13485
14390A2551831K56560K86177K01895K61592N46808M7050K70543K68413O17273
$$ y = [4746653, 5248197, 5342225, 5015822, 5006317, 4993004, 4974912, 5184968, 5050125, 5321495, 5310713, 5486083, 5334641, 5389221, 5747634, 5798415, 5679832, 5937365, 6070083, 6057939, 6269186, 6273834, 6327311, 6218954, 6565660, 6473057, 6327141, 6312768, 6874237, 6962716, 6952207, 6895681, 7086492, 7304613, 7551493, 7670946, 7400835, 7594862, 7799299, 8251542, 8316253, 8412970, 8556147, 8695075, 9203799, 9034099, 9025492, 8689227, 8944820, 9454977, 9339307, 9494103, 9587261, 9809811, 10129924, 9920336, 10413408, 10684442, 11163782, 10815631, 10970290, 11206272, 11002183, 11498494, 11590329, 11706077, 11853114, 12086735, 12466425, 12865316, 12551831, 12808391, 13094568, 13296463, 13558055, 14104863, 14151913, 14422456, 14690869, 15308142]
14381A5308142j53426L97044O74273J09892L72696R1418K78799L33319J49377
14372A7561534M44177N15219L21818Q45024Q6320J89970P39977O73031K63865
14363B1640935L3533P31628P34619j75111Q80398L70548Q19829M10430N89261
14354B6036070N87356M64887P86643J062810K95304R75276Q43878N31401Q16225
14345C2399850P33929P42271J342190Q12807O29756J341954Q71369J345271J202210
14336D1421607J133349J156288J596028R71148J452424J451710J508523J470076
14328E2161153J974824J465025J902569J854721J932518J998737K358166K389200
14320F8036913K151360K871600K637911K808853K396595K786239L030738L432558
$$ y = [15308142, 15154716, 15551760, 16226033, 16335925, 16708621, 16800039, 17078838, 17412157, 17561534, 18005711, 18520930, 18842748, 19687772, 19774092, 19964062, 20704039, 21377070, 21640935, 21674468, 22406096, 23140715, 22965604, 23846002, 24216550, 25036379, 25446809, 26036070, 26623426, 27088313, 27874956, 28937766, 29233070, 30208346, 31052224, 31583625, 32399850, 33133779, 33876050, 35218240, 36031047, 36660803, 38002757, 38874126, 40219397, 41421607, 42554956, 43711244, 45307272, 46278420, 47730844, 49182554, 50691077, 52161153, 54135977, 55601002, 57503571, 59358292, 61290810, 63289547, 65647713, 68036913, 70188273, 73059873, 75697784, 78506637, 80903232, 83689471, 86720209, 90152767]
14312I0152767L486105L745174L851805L801057M444594M303492M880939N060229
14304A23726162N384743N355453N928221O407472O397396O955384P676807P766525
14296A75598163Q370549Q638063R430433R458951J0023165J0879043J1162312
14289B43560679J1746369J1990481J2092398J3062913J3753195J3876875J3970017
14282C34052927J3822983J3666033J4317613J3912241J3465141J2682310J1718377
14275D27637625J0226727P540008M048037K157259k6870j218085r526281p835236
14267D33003184l696184r15628m231855j0274728j2948922j4009885j4851249
14260C72074733j5185533j5953344j5882725j5367640j5351405j4751419j4091278
$$ y = [90152767, 93638872, 97384046, 101235851, 105036908, 109481502, 113784994, 118665933, 123726162, 129110905, 134466358, 140394579, 146802051, 153199447, 160154831, 167831638, 175598163, 183968712, 192606775, 202037208, 211496159, 221519324, 232398367, 243560679, 255307048, 267297529, 279389927, 292452840, 306206035, 320082910, 334052927, 347875910, 361541943, 375859556, 389771797, 403236938, 415919248, 427637625, 437864352, 445404360, 449452397, 451609656, 451582786, 450364701, 440838420, 433003184, 429307000, 428391372, 424159517, 413884789, 400935867, 386925982, 372074733, 356889200, 340935856, 325053131, 309685491, 294334086, 279582667, 265491389]
14253B65491389j3529358j2854719j2487529j1617236r588624j0467358r557390
14246A85389175q984297q618727q017580q013611o837739o796660o364311n726718
14238A26029532n343314n307508n349846m155744n085639m044693l466713l474823
14230H9801252l596905l673541k895643l361065k649007k827513k841290k040946
14222F5915342k140100k474584j879342j995862j789568j972416j669553j617663
14214E0376254j379212j368420j482951j407494j672800j094699p75358j017962
14206D0177358q50784j401220r13842j181911p19911q49227j151139j136818n43694
14197C1428812j106662q58825l67513j15294j178152q18852j97323j203675n03222
$$ y = [265491389, 251962031, 239107312, 226619783, 215002547, 205413923, 194946565, 185389175, 176404878, 167786151, 159768571, 151754960, 144917221, 138120561, 131756250, 126029532, 120686218, 115378710, 110028864, 105873120, 100787481, 96742788, 93276075, 89801252, 86204347, 82530806, 79635163, 76274098, 73625091, 70797578, 67956288, 65915342, 63775242, 61300658, 59421316, 57425454, 55635886, 53663470, 51993917, 50376254, 48997042, 47628622, 46145671, 44738177, 43065377, 41970678, 41195320, 40177358, 39326574, 37925354, 37011512, 35829601, 35109690, 34260463, 33109324, 31972506, 31428812, 30322150, 29463325, 29095812, 28980518, 27802366, 26983514, 26786191, 25582516, 25079294]
14188B5079294l97995q91174l12108p77884k48537n29378n29966m53071k12230
14179B0726951m14632k14691l90088j029498j27897j36559n60264l25487l10970
14170A7216865j58340n35863l26122j29959n57316J96852o70543m56290j6986
14161A4562298j11441l94686o55768L00603l15579k55273k32396m07015J70380
14152A2661123j66676l95563k00192k52006l6178n1803j49176m00191n1352j58490
14142A0799496l46348O6226L757p41105J23035l81056J9575j17735j15079m81697
14132H829069R6505K0300l166k80849o3443Q2644l39706n7983j08196k61546j95689
14121G717940J59820K402l01460J21553l91887m6248n3790J13301l07113k18790
$$ y = [25079294, 24681299, 23790125, 23478017, 22700133, 22451596, 21922218, 21392252, 20939181, 20726951, 20312319, 20097628, 19707540, 18678042, 18550145, 18413586, 17853322, 17527835, 17216865, 17058525, 16522662, 16196540, 16066581, 15509265, 15706117, 15035574, 14579284, 14562298, 14450857, 14056171, 13400403, 13701006, 13385427, 13130154, 12897758, 12490743, 12661123, 12494447, 12098884, 11898692, 11646686, 11610508, 11558705, 11409529, 11009338, 10957986, 10799496, 10453148, 10519374, 10523131, 9782026, 9905061, 9524005, 9543580, 9425845, 9310766, 8829069, 8925574, 8945874, 8942708, 8661859, 8598416, 8681060, 8341354, 8283371, 8175175, 7913629, 7717940, 7877760, 7880162, 7578702, 7700255, 7308368, 7262120, 7208330, 7321631, 7014518, 6795728]
14111F795728j50998N27785n92980k32424K36255k27214j42305q5566K80885m3576
14101F365590m63482j36768R4207j07929J71197k23068j4376j05567k02189k8027
14091E349588K30677l47849J73445m30311L30371k15866n4125L578l05131J82284
14081D916661k72200n9552J90028j35436m73670M41085l65326L44218j45827J42698
14071D582679m03920L43866k96733q9312J18054P2903K15866k26093p9424j89250
14061D048636J82639l94386M68118l84491L39674o27500L2315P0495k98244M27796
14051C865052j20596k8550p0146j98957j8122p8424j72095L78772j72893o4932
14041C319109P0393l87955J7970j6110K61826l2833k27535J10683m1670k40056
$$ y = [6795728, 6644730, 7172515, 6579535, 6347111, 6583366, 6356152, 6213847, 6128281, 6409166, 6365590, 5902108, 5765340, 5859547, 5751618, 5922815, 5699747, 5685371, 5579804, 5377615, 5349588, 5580265, 5232416, 5405861, 4975550, 5305921, 5090055, 5035930, 5039508, 4734377, 4916661, 4644461, 4584909, 4774937, 4639501, 4165831, 4606916, 4241590, 4585808, 4439981, 4582679, 4178759, 4522625, 4225892, 4136580, 4254634, 4327537, 4543403, 4317310, 4237886, 4048636, 4231275, 3836889, 4305007, 3920516, 4260190, 3632690, 3665005, 3735500, 3437256, 3865052, 3744456, 3715906, 3645760, 3446803, 3428681, 3350257, 3178162, 3556934, 3384041, 3319109, 3389502, 3001547, 3019517, 3003407, 3265233, 3232400, 3004865, 3115548, 3073878, 2833822]
14031B833822O43500k00256k42720J33975n2339m49021L18331K21203o46748K49552
14021B809299L6283J04316k32404n8412M18667n00124J38176k61192R2427m9071
14011B497965k30125M8521K96508j43218n4664j5373J86029r3936O9108j49732
14001B411083j08985k25817p6163M49409Q0579k86895J43974l2876Q5316J69678
13991B609303J48885Q84316J015530K881192N893136J3671018N660400q581220
13983B4182560o083576o655324m744041j172551r84512o71529n05605k12269j97850
13974B955303j34794l08811J95677j76871k31900J01147r5220J56360j40728j6324
13964B303839k8947r8214J61449j48334j73445K67179l4732j03037l5793J16924
$$ y = [2833822, 3477322, 3277066, 3034346, 3168321, 3115982, 2666961, 2985292, 3206495, 2559747, 2809299, 2845582, 2949898, 2717494, 2659082, 3077749, 2577625, 2715801, 2454609, 2547036, 2497965, 2267840, 2316361, 2612869, 2469651, 2414987, 2399614, 2585643, 2491707, 2560815, 2411083, 2302098, 2076281, 2000118, 2449527, 2530106, 2243211, 2387185, 2354309, 2439625, 2609303, 2758188, 3642504, 4658034, 7539226, 13432362, 27103380, 32763780, 24182560, 18098984, 11443660, 6699619, 5527068, 4542556, 3871027, 3365422, 3153153, 2955303, 2820509, 2511698, 2707375, 2530504, 2298604, 2399751, 2304531, 2460891, 2320163, 2303839, 2274892, 2176678, 2338127, 2189793, 2016348, 2283527, 2248795, 2145758, 2109965, 2226889]
13954B226889k29314j72613J93944j3100p2695p8241m90321J160305p15224J28259
13944A937889j1267j28948P1149k89246J78941L7494J11538k63857K0041j83780
13934A479954J20908J53480k2801l0308J8393J16241l44976j53461K57530K9880
13924A624840m34170K60227l3802p4237K61594l0139k18492j629K09380r3627
13914A469945N7210j6746J37659m86722J77884J53469m2686l7698J5508O9427
13904A497250p3499j59174J27507j16428K41242j72845L00882m59527K07362k39444
13894A153326N6552q5870j10682J94510J19076N726O4066r5028N4451k10561k71576
13883H73990M86122j78062M94881l53653N3137L9967l02456K20003l25222J20291
$$ y = [2226889, 1997575, 1824962, 2018906, 2005806, 1933111, 1854870, 1364549, 2524854, 1809630, 1937889, 1926622, 1797674, 1868823, 1579577, 1758518, 1796012, 1907550, 1643693, 1663734, 1479954, 1600862, 1754342, 1731541, 1701233, 1719626, 1835867, 1490891, 1337430, 1594960, 1624840, 1190670, 1450897, 1417095, 1342858, 1604452, 1574313, 1355821, 1354192, 1563572, 1469945, 1527155, 1510409, 1648068, 1161346, 1339230, 1492699, 1450013, 1412315, 1427823, 1497250, 1423751, 1264577, 1392084, 1275656, 1516898, 1344053, 1644935, 1185408, 1392770, 1153326, 1209878, 1124008, 1013326, 1207836, 1326912, 1332638, 1396704, 1301676, 1356127, 1145566, 873990, 1360112, 1182050, 1676931, 1323278, 1376415, 1416382, 1113926, 1333929, 1008707, 1128998]
13873A128998M399O5800j20370j70259R1464Q6181L546O8377J0618L1556l28469
13862H71841L81471j22247J08475r4916j41714J8890q5075N4804R7483j78943
13852I10069k31721K98500N3114J7945k28324P929j96335J07214J31936L54356
13842A224683o9424k37360J67334k16030n8526J77429k59916K81155j76667j0481
13832H22197K75982j70403J59491m7425o0737m1724K47465k84911m1187l2872
13822H25876j60j29724J01690P3847J45564o8058O0680j73309K2185k37542J03878
13811G24927O0247j0328j99436J04938J01671P484R4732N7960J61636n00717J61734
13800G64848m0130K89482j86389j17945R3767Q6922q2996R9123j32215j77745
$$ y = [1128998, 1133397, 1199197, 1078827, 908568, 1000032, 1086213, 1089759, 1158136, 1168754, 1200310, 871841, 1253312, 1131065, 1239540, 1144624, 1002910, 1021800, 936725, 991529, 1089012, 910069, 678348, 976848, 1029962, 1047907, 819583, 827512, 631177, 738391, 870327, 1224683, 1155259, 917899, 1085233, 869203, 810677, 988106, 728190, 1009345, 832678, 822197, 1098179, 927776, 1087267, 1039842, 979105, 937381, 1184846, 899935, 858748, 825876, 825716, 695992, 797682, 871529, 1017093, 949035, 1009715, 836406, 858591, 621049, 724927, 785174, 774846, 575410, 680348, 782019, 789503, 884235, 942195, 1103831, 603114, 764848, 724718, 1014200, 827811, 709866, 803633, 890555, 807559, 906682, 774467, 596722]
13790E96722J27104K41768q4744J17417m89702J82966Q061M40092m56774Q1894
13780G64804C57689O19188k01612k38717K18225l3250l616J05729m05634J56038
13770E74040J03999k98578L42436r1057J72591p363o8033k05519L30465K81822
13760A134803k58507k99324p172O6265k26044M24258C33397M19488j12923J61381
13750H01343k13077K61519q8579k49618K56180j32719k34051J14637q5267K10167
13740F40535o396J24073k10177N8782j58754M40081l16212q586Q1749j70580O9031
13729E43546k3921j14792l9957J30264J00659B93639N21063C56471Q7368m3196
13719D00643J78598k45536O21022l41384m0007K55427p7161B98012J02528j06224
$$ y = [596722, 723826, 965594, 880850, 998267, 508565, 691531, 699592, 1139684, 682910, 764804, 357689, 976877, 775265, 536548, 754773, 721523, 717907, 823636, 418002, 574040, 678039, 379461, 721897, 630840, 803431, 796068, 728035, 522516, 852981, 1134803, 876296, 576972, 569800, 636065, 410021, 834279, 333397, 752885, 639962, 801343, 588266, 849785, 761206, 511588, 767768, 635049, 400998, 515635, 430368, 640535, 634139, 758212, 548035, 606817, 448063, 888144, 571932, 563346, 645095, 474515, 543546, 519625, 404833, 364876, 495140, 595799, 293639, 814702, 356471, 443839, 400643, 579241, 333705, 954727, 613343, 573336, 828763, 751602, 298012, 400540, 294316]
13709B94316M44332m9580k42525j7110M4268K05216l16705J17904K60252C24157
13698D16971Q6004P9363Q8554k13011q4578M72887m16777J89620j0927j55808
13688D52298k04444M40121C31428K06496P9286J66504k27204n432k29397K42627
13678E64308K35395A77857L45298p1120A77556q5642M13151j80735P4870K56484
13668F55684j77827K6998n2804m2391J07158l1614k3212L70276l22956O7464p2799
13657E03977m682j49870K50341M7516o5962k87762M8296E7132O31101C12268J565
13646C13833A47645M89248k3784k92808J71298p2620p6788L2171J05007F7862
13635A84971K96374L14527l33320J58552j55519K72203C03526O8467K47936B94308
$$ y = [294316, 738648, 689068, 446543, 429433, 473701, 678917, 362212, 480116, 740368, 324157, 416971, 502975, 582338, 670892, 457881, 373303, 846190, 429413, 619033, 608106, 452298, 247854, 687975, 331428, 537924, 617210, 783714, 556510, 551078, 321681, 564308, 799703, 177857, 523155, 452035, 177556, 91914, 505065, 324330, 399200, 655684, 477857, 504855, 452051, 409660, 516818, 485204, 461992, 832268, 509312, 576776, 503977, 499295, 349425, 599766, 647282, 581320, 293558, 341854, 57132, 688233, 312268, 313833, 147645, 636893, 613109, 320301, 491599, 418979, 342191, 374362, 479369, 67862, 184971, 481345, 795872, 462552, 621104, 465585, 737788, 303526, 371993, 619929, 294308]
13624D19641n7439K61607A63203L14083P7143j56091m6577n2041R4199A90386
13613A67698K71278B07313J9718N2640J90069j51001M8599o2513K36039k08376
13603C32488L61408R2598C51759j38727L12615A99929K30676j33019C1442N31508
13593E62950j69822A51859L23022B18547J02672J19054l4812j25974b8553D6655
13582D39493A70842O2254k8771m854M5203J64762q5761J3545r3385K18803A62323
13570C27067A08368J95869K46083J86205I0940K1361K05179J01236n6722Q3604
13560D45598G7060L22820j51583m2294K0342E7222L4936J39778N2116A26876A0456
13548C1764K44979L2738R938q9831L08374j65872I6778K11669J063J15149K1746
$$ y = [419641, 362202, 623809, 163203, 477286, 554429, 398338, 351761, 299720, 393919, 190386, 167698, 438976, 207313, 227031, 279671, 469740, 318739, 367338, 304825, 540864, 332488, 693896, 786494, 351759, 213032, 525647, 199929, 430605, 297586, 31442, 562950, 393128, 151859, 474881, 218547, 321219, 440273, 405461, 279487, -28553, 46655, 439493, 170842, 233096, 204325, 199471, 244674, 409436, 323675, 337220, 243835, 462638, 162323, 327067, 108368, 304237, 550320, 736525, 90940, 112301, 317480, 418716, 361994, 445598, 77060, 399880, 248297, 206003, 226345, 57222, 92158, 231936, 284052, 126876, 10456, 31764, 276743, 309481, 319419, 229588, 537962, 372090, 96778, 308447, 309510, 424659, 446405]
13537D46405B13736L88209j06479m8079C3904K07698O1991A03718J42642q007
13527B38353A11679J37293A06748K46051j4283j14934J65342M3665A62740p7650
13517H5090J36697m8799J61620A19853L48699A17854k3030M602J36990k4314Q1356
13506B93458R335K91287B20505N688J98677j2306A00961M76178A99158d3768B45531
13494A38927M33041k42154D458J68406K01046c00253A14191M06425A55868l555
13484A52313C9178b3067D03376q7091m1970K46062B51231j1924K38421A03878
13473C67532k5908j30888j01467L78993B17787K28241A37621M03376A37761a74849
13462B64146m9244J70948l6140j48984q6340J47447L59140A69496K1774Q3251
$$ y = [446405, 213736, 601945, 495466, 447387, 33904, 241602, 303593, 103718, 246360, 238353, 111679, 248972, 106748, 352799, 338516, 223582, 388924, 432589, 162740, 85090, 221787, 172988, 334608, 119853, 468552, 117854, 94824, 99426, 236416, 212102, 293458, 302793, 594080, 220505, 226193, 424870, 412564, 100961, 577139, 199158, -43768, 245531, 138927, 571968, 329814, 4458, 172864, 373910, -300253, 114191, 520616, 155868, 152313, 39178, -23067, 403376, 316285, 274315, 520377, 251231, 239307, 477728, 103878, 367532, 341624, 210736, 109269, 488262, 217787, 446028, 137621, 540997, 137761, -174849, 264146, 214902, 385850, 349710, 200726, 114386, 261833, 620973, 169496, 191270, 274521]
13452B74521J50226j74669K5818R2577o9816n8115l6111Q9267J99063A21678L77395
13441D99073o2617j51853A35606j1156D903L94586C2781L66525J85571B79393
13430A30485b09095A73431g1125A08714A4246L51626e0672C21423j05937L0746
13420B46232O9698j50654a5086C87054j24458n4455m2621p1839I782a27092B5260
13408A72181G9494k6487O7540K09781I5454L02569k2071C8232J57968q2729J53848
13397B67319R0911j14006K75674A00388J25589D2948b02889D41223A01198N1987
13387A53185i3324A18786P8707K34884A68019k3259K895a30350B28823J29135
13377C57958A67595m1483K7449e4598C10445j20479N77951g9744E30803a67597
$$ y = [274521, 424747, 250078, 275896, 368473, 298657, 240542, 204431, 293698, 492761, 121678, 499073, 436456, 284603, 135606, 124450, 4903, 399489, 32781, 399306, 584877, 279393, 130485, -209095, 173431, -71125, 108714, 14246, 365872, -50672, 321423, 215486, 246232, 315930, 165276, -15086, 387054, 262596, 208141, 165520, 93681, 9782, -127092, 25260, 172181, 79494, 53007, 120547, 330328, 95454, 398023, 375952, 38232, 196200, 113471, 267319, 358230, 244224, 519898, 100388, 225977, 42948, -202889, 441223, 101198, 153185, -93324, 118786, 197493, 432377, 168019, 144760, 147655, -130350, 228823, 357958, 167595, 126112, 153561, -54598, 310445, 189966, 767917, -79744, 530803, -167597]
13366C79697l1576N4803a32175C26126j45924L26568G8911J80590r295p3868l2568
13355A43770K03282j3314J00329j66813m4106o0560L3855b9110C95993J71502
13345E67495A46911K60400j50734I5476M06786A32508J57774K30861A7036M41366
13335D58402j95377K11363i2438C88728j6592A30460K60309h3433A65521A9100
13324D78414H1702B3078M08078F1301N7414j4056f5291A68661K17347A34580J40811
13313B75391N7594k8187j10178b7298A6746M00676B08332K21388c8113A00406
13302C92315j66254k0784J40347A22483B8643J63889N7076n9449o8758b23234
13291C70515j48901p8766l4445c13320C54362D1783c6311D61590k07090J04580
$$ y = [379697, 348121, 402924, -132175, 326126, 180202, 506770, 78911, 259501, 250206, 176338, 143770, 347052, 333738, 434067, 267254, 223148, 162588, 196443, -29110, 395993, 567495, 146911, 407311, 256577, 95476, 502262, 132508, 290282, 521143, 17036, 458402, 263025, 474388, -92438, 388728, 372136, 130460, 390769, -83433, 165521, 19100, 478414, 81702, 23078, 431156, 61301, 118715, 104659, -65291, 168661, 386008, 134580, 275391, 332985, 304798, 194620, -27298, 16746, 417422, 208332, 429720, -38113, 100406, 392315, 226061, 205277, 345624, 122483, 28643, 192532, 249608, 190159, 121401, -223234, 370515, 221614, 142848, 108403, -313320, 354362, 41783, -36311, 461590, 254500, 359080]
13281C59080P2810A41673j810n9865a26790K993F1364e4507b5718H9037M9980
13270A39017J24634p8076l4852K66772j93565A01041C667d7282k9807L0733C32745
13258c6582k14748A73111O5344m45H1362K83036K94334B06354k9045K72040B01707
13246C33649J27046A39791R3566K04041B7935J36041C2852a10831A19974b16342
13235B49382I2681R2459J07817N4449A71062a19703A41578R9682n6481J21477
13225C06256A924h2683k17052A07149b35686B05900b74685B26876Q2586q8438
13215B21024R7933P9668B1093b7916A78789c3853C4024b95032d8547j26416A53536
13203E424J05726f9635j5722J4538f299B62334a77567A06450a0198D56480E4668
$$ y = [359080, 431890, 141673, 139863, 79998, -126790, -123797, 61364, -54507, -25718, 89037, 139017, 263651, 185575, 150723, 417495, 223930, 101041, 3667, -47282, -77089, -46356, 332745, -36582, -251330, 173111, 238455, 238010, 81362, 364398, 658732, 206354, 177309, 449349, 201707, 333649, 460695, 139791, 233357, 437398, 27935, 163976, 32852, -110831, 119974, -216342, 249382, 92681, 185140, 292957, 347406, 171062, -119703, 141578, 241260, 184779, 306256, 1924, -82683, -299735, 107149, -235686, 205900, -274685, 226876, 309462, 221024, 318957, 398625, 21093, -27916, 178789, -33853, 34024, -295032, -48547, -174963, 153536, 5424, 111150, -69635, -85357, -70819, -6299, 262334, -177567, 106450, -10198, 456480, 54668]
13191E2981a96099b3163G9068M39807j71878I6033b7307l8847A76027K4601R5865
13180B96493c26903B64155P2670j18407R2474C2883J79487a13146D28357H1066
13169D48924A13688J1914a58844E6824j6180K60847c4788C26134A50013P0719
13159B20732L2348a57295B17652m9395C0397K38588R0791B8194b7267B26070A03650
13147a72180E1050b06197f5339A11801K84101g7131j47111B04163f7020A7436
13136e8624n0926A80041g4227I1943J14100p9308c8816C93879o7529A62155J97615
13125C59770H5819C6278a39411H091M5556J37813m7371K14374g3170j56516B1360
13113A29615Q781j1600D3726M09572C3005K5689j9490N0338R8279a08882A69189
$$ y = [52981, -196099, -23163, 79068, 518875, 346997, 96033, -27307, -66154, 176027, 200628, 296493, -326903, 264155, 336825, 218418, 310892, 32883, 212370, -113146, 428357, 81066, 448924, 113688, 125602, -158844, 56824, 40644, 301491, -34788, 326134, 150013, 220732, 253080, -157295, 217652, 168257, 30397, 268985, 359776, 28194, -27267, 226070, 103650, -172180, 51050, -206197, -65339, 111801, 395902, -77131, -224242, 204163, -67020, 17436, -58624, -109550, 180041, -74227, 91943, 206043, 126735, -38816, 393879, 326350, 162155, 359770, 85819, 36278, -139411, 8091, 53647, 191460, 144089, 358463, -73170, -229686, 21360, 129615, 138396, 126796, 43726, 453298, 33005, 58694, 39204, 89542, 187821, -108882, 169189]
13101A07381m7051O9741a07210B97387c5503B39340a15495F1636i3425B04246
13090a92493F118a53601A50029e4111A31484l7692G071J51812e6631A0946J87505
13079A98451m7802P3831G007J09920a22610K7886A26240a96643A76281b61372
13068a11953A36194e5804B73118Q779G2603a95493E0637J67792j0966d0503A66567
13056A2470J18848K74299j50929j19651b12383C48676b6173I9385M88c4407B6013
13044B57740F2065K6515O6979J54142J62384A18341D0514b504B37140E3451K42250
13033B95701b92106L8668A64201J25818k5042b62752C6072J69353p0920J09934
13023B44439A3042J27848m1297c0552A44929c167m5121r4775A25275A4616J67736
$$ y = [107381, 60330, 130071, -107210, 297387, -35503, 239340, -115495, 61636, -93425, 204246, -192493, 6118, -153601, 150029, -54111, 131484, 93792, 7071, 158883, -56631, 10946, 198451, 150649, 224480, 7007, 116927, -122610, -94724, 126240, -196643, 176281, -261372, -111953, 136194, -55804, 273118, 281897, 72603, -195493, 50637, 218429, 207463, -40503, 166567, 12470, 131318, 405617, 254688, 135037, -212383, 348676, -26173, 99385, 99873, -34407, 26013, 257740, 62065, 88580, 155559, 309701, 472085, 118341, 40514, -2504, 237140, 53451, 295701, -292106, -253438, 164201, 290019, 264977, -262752, 36072, 205425, 134505, 244439, 13042, 140890, 99593, -30552, 144929, -3167, -48288, -143063, 125275, 14616, 182352]
13012A82352Q5731J09573I625d06406a44227k9451E6920a75539d8973q07F089
13000B81044g4148A05746J33470D4056j412Q274A0076b27145A75036K57368j96443
12989B35961H6071P1913m3494B4698a3061m8696E2809R3571L2340a71705A28681
12977c7657J5265C02593I7280Q6664h6483B35402k8574I077a60960o6694A15442
12965c50881R4794C54402G8486g5042j2323E9049a83439e7890o7668k32115B37005
12953G3572O0950b38621B41539k5442B1354d7073B43357a2385n7689A3472K62515
12942B75987a06147H6071B2348h4821c4135B62028f3566A80910a9999I2507J85995
12931B78502H4724C6110h6717A43025P1065a54212H1810K38683E1340N8036e216
$$ y = [182352, 268083, 377656, 9625, -406406, -144227, -173678, 56920, -175539, -48973, -49780, 6089, 281044, -74148, 105746, 239216, 44056, 42644, 50918, 10076, -227145, 175036, 432404, 235961, 86071, 157984, 114490, 24698, -13061, -61757, 52809, 146380, 178720, -171705, 128681, -37657, -22392, 302593, 97280, 183944, -86483, 235402, 206828, 9077, -160960, -227654, 115442, -350881, -256087, 354402, 78486, -75042, -87365, 59049, -183439, -57890, -125558, -357673, 237005, 73572, 134522, -238621, 241539, 216097, 21354, -47073, 243357, -12385, -70074, 13472, 275987, -106147, 86071, 22348, -84821, -34135, 262028, -63566, 180910, -19999, 92507, 278502, 84724, 36110, -86717, 143025, 214090, -154212, 81810, 320493, 51340, 109376, -5216]
12919C60381A5423K7202R512K47328f2365B46811n079m2945b6381A72399a22819
12907a78303d8637G056P3094K59750a855I1327e0700l0275C77899e169A8353N3908
12895G2261g1467i102q7598B52236D6224Q1444J14576a89696A65842a33749j44602
12884b78351b5699r9799A08820D2722A4643c7407A40967B2386P825J31909b69313
12872B53566H0160M46392A69002a79294I9035N4008o4487B8808i2918A74193k6465
12861A47728a3065B46275a09326j9078C9561K8796K98986B0511f6903o2185d1478
12849A24150P0675b5910k1858k64939B24688b20690A00223Q0131a8675A58706
12838f298B85449a77548j08737G5851c2994l4857r6386M2584a1578k22058d7937
$$ y = [360381, 15423, 42625, 52137, 299465, -62365, 246811, 241732, 198787, -26381, 172399, -122819, -178303, -48637, 7056, 80150, 339900, -1855, 91327, -50700, -80975, 377899, -5169, 18353, 72261, -71467, -9102, -96700, 252236, 46224, 127668, 242244, -189696, 165842, -133749, -278351, -25699, -125498, 108820, 42722, 14643, -37407, 140967, 22386, 30211, 162120, -269313, 253566, 80160, 526552, 169002, -179294, 99035, 153043, 88556, 28808, -92918, 174193, 147728, -13065, 246275, -109326, -128404, 39561, 68357, 367343, 20511, -66903, -129088, -41478, 124150, 194825, -25910, -47768, -312707, 224688, -220690, 100223, 180354, -18675, 158706, -6298, 285449, -177548, -286285, 75851, -32994, -67851, -164237, -121653, -11578, -233636, -47937]
12826E5331J70726a14024A17647c34415J60444I8254K71740a71677j8932E4120
12815a13306j19643D84638c5154J6919N129j91662O0724A18589i6314a2854B558
12803h5752d892j95551A38016l5402m1797H045c79885J16748A95175o9348M983
12792A30810a63734f4542A04250h1548j85099a32825M6023b8924B22073D3000
12781a1752k30063P7359g4035k80492P1214C4971P6147c6939C1559c8401B62042
12769A17965D5879K51192G5469a52793E2265b42131B52634E9846d6943A31225
12758a35026j931e9095l7479B99O2094a2789A09181K5965J4078a75804A13169
12746D6757a73277D0751i7741B68887h6075a2939A15170b57478B08077N7409E3446
$$ y = [55331, 226057, -114024, 117647, -334415, -173971, 98254, 369994, -171677, -190609, 54120, -113306, -232949, 484638, -35154, -18235, -13106, -204768, -144044, 118589, -96314, -12854, 2558, -85752, -4892, -200443, 138016, 102614, 60817, 8045, -379885, -263137, 195175, 125827, 130810, -163734, -64542, 104250, -81548, -266647, -132825, -86802, -28924, 222073, 43000, -11752, -241815, -164456, -74035, -354527, -283313, 34971, 111118, -36939, 31559, -38401, 262042, 117965, 45879, 297071, 75469, -152793, 52265, -242131, 252634, 59846, -46943, 131225, -135026, -136957, -59095, -96574, 299, 62393, -12789, 109181, 135146, 149224, -175804, 113169, 46757, -173277, 40751, -97741, 268887, -86075, -12939, 115170, -257478, 208077, 265486, 53446]
12734g8932J1013f047j46730r5971B32101A1125a14048l8787P5179k5301r4851
12723a97808B51682l1562a05650A39419a04014F0370O9162h7705k2406C8176a72166
12711A14451a08777B16189N7864n8762G7208c3811D14488b2998B21190m8587j1593
12700A61010J23009a37311B94646a92448F1097C204J85548B9117P1043J620r603
12689I2177i9081j11001A54491g2368A91275a7231D8819N9331N9625J17545a2845
12677c79318b9529B65596C4080K00571a32677A08988b89315B23977b23134b7693
12666G1903b4409E8395N3635g6100A63253c8744n4906L2430C04314j30567a19809
12654A36303B9209J02719E1785J21273c9249A22405b7510j09271F9554K07766
$$ y = [-78932, -67919, -6047, -152777, -248748, 232101, 11125, -114048, -152835, -77656, -102957, -197808, 251682, 220120, -105650, 139419, -104014, 60370, 129532, -87705, -110111, 38176, -172166, 114451, -108777, 216189, 274053, 215291, 77208, -33811, 414488, -22998, 221190, 172603, 161010, 284019, -137311, 294646, -192448, 61097, 3204, 188752, 29117, 100160, 101780, 92177, -99081, -210082, 154491, -72368, 191275, -17231, 48819, 108150, 167775, 285320, -12845, -379318, -29529, 265596, 34080, 234651, -132677, 108988, -289315, 223977, -223134, -27693, 71903, -24409, 58395, 112030, -76100, 163253, -38744, -93650, -61220, 304314, 173747, -119809, 136303, 29209, 131928, 51785, 173058, -39249, 122405, -27510, -136781, 69554, 277320]
12644B77320C9839A3341b67762B02029b1483j67541P9968c7464j24071A64503
12633b25271B23414f8476B66465a70080H3063L04472j87008P7782D5949K89689
12623C35638j32889c74692C2425J00358b9697I089a13424G4959e7209B25308b01287
12611E7563j2641A5334O9273J09999B2433N4138L11479j46876D6351L74354g619
12599C60268A12118N0979L14658B06757b94124E2637h7883B10978p6977a72791
12588c45220A91667J2057d093k04679M5540g9323G0110e264A20006a59470O5496
12577i3974A97918a74294p5171A6627J90519J49897d996j0988A19449J56611b04915
12565C3413c09485h2798D4918J23633j3381J28549b15089D0333b3414E5941M50326
$$ y = [277320, 39839, 13341, -267762, 202029, -21483, -189024, -109056, -37464, -161535, 164503, -225271, 223414, -68476, 266465, -170080, 83063, 387535, 200527, 278309, 45949, 335638, 202749, -374692, 32425, 132783, -29697, 9089, -113424, 74959, -57209, 225308, -201287, 57563, 44922, 15334, 84607, 194606, 22433, 76571, 388050, 241174, 46351, 420705, -7619, 360268, 112118, 163097, 477755, 206757, -294124, 52637, -87883, 210978, 134001, -172791, -345220, 191667, 203724, -4093, -208772, -163232, -79323, 70110, -5264, 120006, -159470, -93974, 197918, -174294, -249465, 16627, 207146, 357043, -4996, -15984, 119449, 276060, -204915, 33413, -309485, -82798, 44918, 168551, 155170, 283719, -215089, 40333, -23414, 55941, 506267]
12554E06267c07805i7538c3187D759L69609j67712l3584d4991j42229A00922B7096
12542G624a69084B37478a28498k52958B2018a62672M8090k29641B6669P817g888
12530d17782a69263j47828J29178F4339b08605C29862f5642k1922j74579A85904
12519a29836E6439d870n5889B53990b04211A39990O268R6337a19762A25803c10991
12507a21214B53152a8918o6395h71A81653c83271A4958Q9678R7675b894B55855
12495a3168B42740a21750N7874A25647C5245c5234k2272B07736l6306o9868g8293
12483D6846a42802G5712c38798J47189C1081f1048j22865A02177l6327L1448J71549
12472B68847q5874C2266a78994a9617q9962D5764J09481a09585A53096E5528g0660
$$ y = [506267, -307805, -97538, -33187, 4759, 374368, 206656, 173072, -44991, -187220, 100922, 27096, 7624, -169084, 237478, -128498, -381456, 22018, -162672, -114582, -344223, 26669, 34486, -7888, -417782, -169263, -317091, -187913, 64339, -208605, 329862, -65642, -87564, -262143, 185904, -129836, 56439, -4870, -60759, 253990, -204211, 139990, 146258, 242595, -119762, 125803, -310991, -121214, 253152, -18918, -85313, -871, 181653, -383271, 14958, 104636, 202311, -2894, 255855, -13168, 242740, -121750, -63876, 125647, 35245, -35234, -57506, 207736, 171430, 101562, -78293, 46846, -142802, 75712, -338798, -191609, 31081, -61048, -183913, 102177, 65850, 97298, 268847, 182973, 32266, -178994, -19617, -109579, 45764, 155245, -109585, 153096, 55528, -70660]
12460H0219a22927E3697h8629q5121M6865n8449c6476O008C27363G4996b5115
12448i9365H0932j1533g1293I7449A3067J38140j6343c9582C45984c0189k05312
12437b35501Q6697A85691N836a67442c5880k1668p6258l12504C04390B0084c3680
12425a52709B82013a07452B68339a47480F9412a7819C772a4632l2389B58156i7554
12413I9255d88964a79826A09978f26864b59778a13259D1855b20293J08937j4983
12403a26339k23036a62200B64878H0501e4250n3222j68380C3360a18348C1046
12392A44012o0651J31584d3300A47468F7776c0730j6185A3903P1820P5069b14789
12380B5099L3957J31343g4583A54298f4119D3750K21105d2346C16567F9459j4363
$$ y = [80219, -122927, 53697, -88629, -173750, -126885, -185334, -36476, -30468, 327363, 74996, -25115, -99365, 80932, 69399, -71293, 97449, 13067, 151207, 134864, -39582, 345984, -30189, -235501, -148804, 185691, 191527, -167442, -35880, -57548, -133806, -446310, 304390, 20084, -33680, -152709, 282013, -107452, 268339, -147480, 69412, -17819, 3772, -14632, -47021, 258156, -97554, 99255, -488964, -179826, 109978, -626864, -259778, -113259, 41855, -220293, -111356, -126339, -349375, -162200, 264878, 80501, -54250, -107472, -275852, 33360, -118348, 31046, 144012, 83361, 214945, -43300, 147468, 67776, -30730, -46915, 13903, 85723, 160792, -214789, 25099, 59056, 190399, -74583, 154298, -64119, 43750, 264855, -42346, 316567, 69459, 55096]
12369E5096j5106A2940J55883F2080b39522I3172e8324E2117a43904j43826a25584
12357A7508K50662G4400a87983B6127h7407F2203k3407K45762b5748A87004A5193
12345d39455b12674H7007h6637l4554A35725c6020A59710N6321b86882D2513f6022
12333a69570a8650A87896F1243e082k60219h7603H0481N3389K48155b08727B39471
12321A12990Q5320L4936p4414a647B76828b12151N9151B64531j28658m5865b03708
12309g7869C79796j89171E1548a01170j16813F2897P6970b54333B80007j05704
12299A74303a48332B15760j02457R4308J6901j1389b10079B29270a09640L3558
12289g6082C35706h148j59687D40828F0196J01427D9595J41938E1452K8337O5556
$$ y = [55096, 39990, 12940, 168823, 62080, -239522, 93172, -58324, 52117, -143904, -287730, -125584, 17508, 268170, 74400, -187983, 26127, -87407, 62203, 38796, 284558, -25748, 187004, 15193, -439455, -212674, 87007, -86637, -121191, 135725, -36020, 159710, 216031, -286882, 42513, -66022, -169570, -18650, 187896, 61243, -5082, -265301, -87603, 80481, 133870, 382025, -208727, 239471, 112990, 198310, 233246, 158832, -1647, 276828, -212151, -153000, 264531, 135873, 90008, -203708, -77869, 379796, 190625, 51548, -101170, -217983, 62897, 139867, -254333, 280007, 174303, -148332, 215760, 113303, 207611, 224512, 213123, -210079, 229270, -109640, -76082, 335706, -8148, -167835, 440828, 60196, 161623, 49595, 191533, 51452, 79789, 145345]
12278A45345k1i7770l2042E17691B13734i0591B22821J94001j96174L662a17654
12266h290C71826E0157K29693k0821P608P1425a85075B21309b62315C80075j55370
12255B24705q7131L0220L6938p0016K6485a68596P5287E03024k41060j05255M0019
12244A96728l5962D0050J36306j0609Q9208G5800N605l4021M908K79354K4340
12233C55986e4427B60929A29423f842A72045p349k4868N442K7029j0358J502j0533
12221A52910j5174n1018L21594P453n1989f6080G14298B7848J40022J41417A00464
12209D34162q3736m1607d905C09534G2835k2696J90530K3114J73134a23261E2766
12197A0853J14722j4086J78235I1594J53872a46962I1821p549J44502K17034j91645
$$ y = [145345, 145324, -97770, -129812, 517691, 213734, -90591, 222821, 416822, 220648, 224310, -117654, -8290, 371826, 50157, 279850, 259029, 266637, 338062, -185075, 221309, -262315, 380075, 224705, 137574, 167794, 204732, 134716, 161201, -168596, -93309, 503024, 261964, 156709, 196728, 160766, 40050, 176356, 165747, 254955, 75800, 81405, 47384, 52292, 331646, 355986, -54427, 260929, 129423, -6842, 172045, 164696, 139828, 145270, 172299, 161941, 163443, 152910, 137736, 86718, 408312, 415765, 363776, -66080, 714298, 27848, 167870, 309287, 100464, 434162, 350426, 308819, -4905, 309534, 72835, 50139, 240669, 263783, 436917, -123261, 52766, 10853, 125575, 111489, 289724, 91594, 245466, -146962, 91821, 84272, 228774, 445808, 254163]
12186B54163a79733A71663m0803R5076A04325k8354J72365k6369a36931B86215
12175G6535K3785b41292B80872P185q3157e2027B58066J99217a45233A71299L47254
12164E18553J36505E1173M51039k41852K2488L8309b6937B68533J6151l4146G8540
12152D0634d9308J4787A80886G2498a05311C8897J94939A14979b87561F3510c07055
12140h2227A14755a0937j53284B39110D2524R8948J38130G7031Q5155c2521I880
12128B16222c0332A35540K21249f9332k3376F4733P6203e4792B8222n681K14566
12117B37107A12610l7041e7326J170I3446k1412J65410G6492M2980k8691C3488
12105B41153H038i0378c4045m9942A22729Q5017q0139J15518L2206a13127B43474
$$ y = [254163, -179733, 171663, 130860, 225936, 104325, 75971, 248336, 221967, -136931, 286215, 76535, 100320, -241292, 280872, 288057, 204900, -52027, 258066, 457283, -145233, 171299, 518553, 655058, 51173, 502212, 260360, 282848, 321157, -26937, 268533, 284684, 250538, 78540, 40634, -49308, -34521, 180886, 72498, -105311, 38897, 233836, 114979, -287561, 63510, -307055, -82227, 114755, -10937, -164221, 239110, 42524, 141472, 279602, 77031, 162186, -32521, 9880, 216222, -30332, 135540, 356789, -69332, -92708, 64733, 140936, -54792, 28222, 22541, 237107, 112610, 75569, -57326, -56156, 93446, 72034, 237444, 76492, 119472, 90781, 33488, 241153, 8038, -90378, -34045, -83987, 122729, 207746, 127607, 243125, 275331, -113127, 243474]
12093C0092i5974B35448a3622C27875Q4903C8646O5715J77917J94052D7605A5380
12081a57376m600B01538C7383a53603k54092C44049E7114d6671B82835j3874A18836
12069A07566A0156K50210J34280G2131J70077j20163J34678l9275B316N9073b10768
12057F8460j9540j1037J45944M446H2800L01740a46028C57285l2238F0266h0794
12045C92697b07045O0799B69930a43022D3360K33957l4483E8226b81631g1089
12034C6635b39793B1606b05790c4770O909C49646a18284j04705A5491a96277C40843
12022B22095g6299A83238l3551a44203B11762h4237k6815B0838a61367r8933j06849
12011c67149c3898A05193C2852i9245A79464F8002J53856p8442a29884N6610r9841
$$ y = [30092, -95974, 235448, -13622, 327875, 412778, 38646, 104361, 282278, 476330, 47605, 15380, -157376, -161976, 201538, 37383, -153603, -407695, 344049, 57114, -46671, 282835, 268961, 118836, 107566, 10156, 260366, 394646, 72131, 242208, 122045, 256723, 217448, 2316, 61389, -210768, 68460, 48920, 37883, 183827, 188273, 82800, 384540, -146028, 357285, 325047, 60266, -80794, 392697, -207045, -146246, 269930, -143022, 43360, 277317, 242834, 58226, -281631, -71089, 36635, -239793, 21606, -205790, -34770, -27861, 349646, -118284, -222989, 15491, -196277, 340843, 222095, -76299, 183238, 149687, -144203, 211762, -84237, -111052, 20838, -161367, -260300, -367149, -33898, 105193, 32852, -99245, 179464, 68002, 221858, 143416, -129884, -73274, -173115]
12000a73115l2418R3939H6786B21O9580J06603o9060M4127c60965a21356e7741
11988H4498l2850a81981D2773a20887C36454c37684J27262D9491K54399h3149
11977A0764c91751i4732C68421I4171b00547B59430r7049a1060E2847c37909C5185
11965a41025O0684q346l86680B26887a08777F2053L9719N0349c87274F2826a01797
11953a05772B4353J76138a95711P9766B26533J34173A62819I371a69437C80803
11942A522e0117l3548A16858J93144F6860b79203b6401j73122A40868a5508k83293
11931b98801J32802I7936N385k2358i5937j63895M5341d3236j20187l6578I79
11919b0157I8982a65712Q0374k1117n9281e5849B47088C5494i3044k17006a01209
$$ y = [-173115, -205533, -111594, 86786, 221, 69801, 176404, 107344, 151471, -360965, -121356, -57741, 84498, 51648, -181981, 42773, -120887, 336454, -337684, -210422, 49491, 303890, -83149, 10764, -391751, -94732, 368421, 94171, -200547, 259430, 162381, -11060, 52847, -337909, 35185, -141025, -80341, -88687, -475367, 226887, -108777, 62053, 101772, 152121, -387274, 62826, -101797, -105772, 24353, 200491, -195711, -115945, 226533, 360706, 162819, 9371, -169437, 380803, 1522, -50117, -83665, 116858, 310002, 66860, -279203, -26401, -199523, 140868, -15508, -298801, -165999, 97936, 103321, 80963, -95937, -259832, -214491, -43236, -163423, -200001, 979, -20157, 98982, -165712, -85338, -106455, -165736, -55849, 247088, 35494, -93044, -310050, -101209]
11907A39809F7513d85140c9317B5752J55321N2082b05880a9755q2934K2772j12668
11896a92585h7172A8937b21472d1243H9560a41123O9647H3872b69394g4297j71663
11885b45960Q0593H1508k4816J13896c1238D01083g7925b6137A36676c2532E5611
11873a77560j27866C66310E8600J38533a53691j59j6757C94919b3348j03840A7575
11861C7234a24663b0185k25307A26648c57583i0078E5279c16283J50226g0854
11850E5601c59920B17313O0048d1510q535j65786Q1467D43800a06959k87388N0826
11839c43521a03330c8364j92508E7530a07463M0496r0486O8739k29120c8485H7417
11827a44449p2104A28997H839J2526L6122J65600I189Q0286g5571p1514E4600
$$ y = [139809, 67513, -485140, -39317, 25752, 181073, 233155, -205880, -19755, -102689, -79917, -192585, -87172, 18937, -221472, -41243, 89560, -141123, -71476, 83872, -269394, -74297, -245960, -165367, 81508, 56692, 170588, -31238, 401083, -77925, -26137, 136676, -32532, 55611, -177560, -305426, 366310, 58600, 197133, -153691, -153850, -170607, 394919, -23348, -127188, 17575, 37234, -124663, -20185, -245492, 126648, -357583, -90078, 55279, -316283, -166057, -70854, 55601, -359920, 217313, 277361, -41510, -50045, -215831, -134364, 443800, -106959, -394347, -343521, -103330, -38364, -230872, 57530, -107463, -66967, -157453, -88714, -317834, -38485, 87417, -144449, -216553, 128997, 8839, 21365, 57487, 223087, 9189, 89475, -75571, -147085, 54600]
11815c97850G0065a01392q700O053j16185p5749A8167b5094A12601K01825b04024
11803H3224a82054B31819n5514p218F7331b4347m638p0988k25997F7107a35038
11791b51708A08207b36602I6972a10603j29196E8257L4274k1977L5917a12896
11780b4467o4365a1233A98083a6573B4582i4322A78486l5677a7271l0332j23936
11769a71539K5628d0164H0725L8223b6229p1633j06001l2491D3773L5517l201
11758G6089a28274b2579E0337K05634r1197a76636A74104a63571L3352C55313
11747b74013A88465J604E5804L239R4940C3566a90255e6902j04733a6035C79410
11735C353g0039L1020H4360a59949c8847A76403h8464K7850j51520G7103L60354
$$ y = [-397850, 70065, -101392, -110092, -104039, -220224, -295973, 18167, -25094, 112601, 314426, -204024, 83224, -182054, 231819, 176305, 169087, 67331, -24347, -28985, -99973, -325970, 67107, -135038, -251708, 108207, -236602, 96972, -110603, -239799, 58257, 92531, 70554, 106471, -112896, -24467, -88832, -11233, 198083, -16573, 24582, -94322, 178486, 142809, -17271, -47603, -171539, -145911, -40164, 80725, 118948, -26229, -97862, -203863, -236354, 43773, 79290, 76089, -128274, -22579, 50337, 255971, 164774, -176636, 174104, -163571, -130219, 355313, -274013, 188465, 190069, 55804, 59043, 153983, 33566, -190255, -56902, -161635, -16035, 379410, 3353, -70039, -39019, 84360, -159949, -38847, 176403, -88464, -60614, -212134, 77103, 437457]
11724D37457g4078j2964k49432L0450i9480O392L8261F7914K58500f2931k47199
11713c10130B5760a09198A39991d9378C1670K0507L058J35b7448A19328f1832
11701A87299K27542A20268J41334b4058F3036a01343D0280r588J22073O577a92862
11689a49928O8382A07787J92880A17458a43313C17663j40119D7606c22175C90605
11678h6488j50444H5449L7949J86239b64915B52163K2762i7677C06413E517h0066
11666c02297A07898a35146A3787a60018B81122b06081o6218A21768P424g4187
11655b05510N513G7171K0292K1509h7240H7334b0520k1909A81916a84850k1865
11644b06715A96519g177A35311b0756m15055A29710a48460H2159b15364A74990
$$ y = [437457, -74078, -87042, -336474, -306024, -99480, -93088, -54827, 67914, 326414, -62931, -310130, 25760, -109198, 139991, -49378, 31670, 52177, 55235, 55370, -27448, 119328, -61832, 187299, 414841, 120268, 261602, -24058, 63036, -101343, 40280, 30692, 152765, 159342, -192862, -149928, -81546, 107787, 300667, 117458, -143313, 317663, 177544, 47606, -322175, 390605, -86488, -236932, 85449, 123398, 309637, -264915, 252163, 274925, -97677, 306413, 5517, -80066, -302297, 107898, -135146, 13787, -160018, 281122, -206081, -272299, 121768, 129192, -74187, -205510, -199997, 77171, 97463, 118972, -87240, 87334, -20520, -42429, 181916, -184850, -206715, 196519, -7177, 135311, -20756, -435811, 129710, -148460, 82159, -215364, 174990]
11633b34507D6629Q9840d4367l333A01094b2593m1539A49550E8371q697b57444
11621a18797A09637b87329d4535r6969B54753i3383B1859b13892b418C36995f5531
11609b44766A12701B0956h3205j33758O6444f9836A12550b90149A54004j6355
11599A37649A7146i0856j40965l9575a24068L4229B68049f0418C87046b10044
11588A36495D0844L10071a23921A30653N9038f0661B68776Q878f8267b0341m2318
11577f2659p0077A53662d8203H1447Q6449J12580n1633H4746J55761O1827c9904
11565A15308a06982B7910O0579a92459B97650j23337p4806a69845D3345H640b85912
11553G3029J10317a08953j00511n9175d7274n00064a31821F9391L7549b5638m02835
$$ y = [-234507, 46629, 136469, -44367, -47700, 101094, -22593, -64132, 149550, 58371, 49674, -257444, -118797, 109637, -287329, -44535, -141504, 254753, -93383, 21859, -213892, -2418, 336995, -65531, -244766, 112701, 20956, -83205, -216963, -150519, -69836, 112550, -290149, 154004, 137649, 17146, -90856, -231821, -271396, -124068, -89839, 268049, -60418, 387046, -210044, 136495, 40844, 350915, -123921, 130653, 189691, -60661, 268776, 277654, -68267, -20341, -62659, -132736, 153662, -48203, 81447, 167896, 280476, 228843, 84746, 240507, 302334, -39904, 115308, -106982, 27910, 88489, -192459, 297650, 174313, 99507, -169845, 43345, 8640, -285912, 73029, 183346, -108953, -209464, -268639, -47274, -547338, -131821, 69391, 106940, -25638, -428473]
11542d28473b4220E2637b50590D9829g3190G8359a34388C16637j05314N1350j14242
11531A48431F159J3397J45833a83531A47982e9912p9371A74569N375a56132A63367
11519A90112b30946m666f977l31405A15454A6239O3960l7618L7826d0001J7183
11508b2818A46451j1991J02622M2637i1433B83263A13298b261i64A95665E7721
11496D31958A47644a11447B06560K9912J78612A91474a36342M9636F4769J24221
11486A88990g3984A46732k7433b33806c5490C21548A41855R2414c480G7074a26564
11474d0106A17886J2654J2275N6302R1626a36482A36906Q8801K7909C8379b21593
11462A66510b35812c180A23690c157B35961n7549g9940C05625i1555p3791A00804
$$ y = [-428473, -24220, 52637, -250590, 49829, -73190, 78359, -134388, 316637, 211323, 262673, 148431, 6159, 19556, 165389, -183531, 147982, -59912, -139283, 174569, 179944, -156132, 163367, 190112, -230946, -235612, -6977, -338382, 115454, 16239, 80199, 42581, 80407, -40001, -22818, 146451, 134460, 237082, 279719, -91433, 283263, 113298, -2261, -964, 195665, 57721, 431958, 147644, -111447, 206560, 236472, 415084, 191474, -136342, -86706, 64769, 188990, -73984, 146732, 119299, -233806, -35490, 321548, 141855, 234269, -3480, 77074, -126564, -40106, 117886, 130540, 142815, 199117, 290743, -136482, 136906, 225707, 253616, 38379, -221593, 166510, -235812, -3180, 123690, -3157, 235961, 178412, -79940, 305625, -91555, -165346, 100804]
11450D62019b57217B22973i4984I6820d4312A64804M5388r2788a72696B23508
11439a63387A84558J7745E2831c1230C43859a34736B18432h3864C53788E0242
11428A27040a29152j67463I9251K06662j26643a37802F32a83824G98b6624A90219
11416e4492r1212N3555M193A90483R7846o0536j01452a02457C89122b66949E1358
11404f6158F3934J98583b61491O1852B04595d0867H6828L25299B0786g6685p5401
11393a52086j72467a06631L805A63243J41433a78492A38565a17170M4049k61140
11383c34261J39353P9065c0407n0779g875j2657B78012a28704B69989c10361A51164
11371e5734j03005O7901j35531a4852j45352B3895L541d22816c307r0831B19572
$$ y = [462019, -257217, 222973, -94984, 96820, -44312, 164804, 210192, 117404, -172696, 223508, -163387, 184558, 202303, 52831, -31230, 343859, -134736, 218432, -83864, 353788, 50242, 127040, -129152, -296615, 99251, 305913, 179270, -137802, 632, -183824, 798, -26624, 190219, -54492, -145704, -92149, -87956, 190483, 288329, 227793, 126341, -102457, 389122, -266949, 51358, -66158, 63934, 262517, -261491, -199639, 204595, -40867, 86828, 412127, 20786, -76685, -152086, -324553, -106631, -102826, 163243, 304676, -178492, 138565, -117170, -73121, -334261, -194908, -115843, -30407, -81186, -7875, -20532, 278012, -128704, 269989, -310361, 151164, -55734, -158739, -90838, -226369, -14852, -160204, 23895, 27436, -422816, -3307, -94138, 219572]
11359a6458j56362h1849q7922D464O5233g2187j25941A55796d5658j88124j08373
11348c42155a07494E01929a55408d5763A80517c4968l30485a26467d693C6480
11337b93166a05767A6200L6045a07213G9832a74814B23897r0638i7422n9959A05589
11325a65969A08137a47099p4050a1475k7842B35436F63M7038g5911A01700J64428
11314B66128e0778n8465a2866j67011L5768E5509b2587m5606a5711F4416a666
11302a9914B83798A32347M1945c08315C94446i7102a5196H2982g2110o534R889
11291f8755K6098q6476A32967a08131a9804H8a52549G3873k3106e8636r2204A67505
11278a03925A64515q1900O2450O5858D8915c86204J29892R0139A98943c61838
$$ y = [-16458, -172820, -81849, -169771, 4464, 69697, -72187, -198128, 155796, -45658, -233782, -342155, -107494, 501929, -155408, -45763, 180517, -34968, -365453, -126467, -4693, 36480, -293166, -105767, 16200, 52245, -107213, 79832, -174814, 223897, 133259, -97422, -157381, 105589, -165969, 108137, -147099, -221149, -11475, -39317, 235436, 663, 47701, -75911, 101700, 266128, -50778, -109243, -12866, -179877, -144109, 55509, -22587, -68193, -15711, 64416, -1666, -19914, 283798, 132347, 174292, -308315, 394446, -97102, -15196, 82982, -72110, -78644, -68755, -42657, -129133, 132967, -108131, -19804, 88, -152549, 73873, 50767, -58636, -150840, 167505, -103925, 164515, 82615, 145065, 210923, 48915, -386204, -256312, -166173, 198943, -361838]
11267c43284A51838a83011P725O1123A66415i0570l0337j26367h4946E049J0609
11256A5658a9831q3303j49339B1252a4386n096j04477a8580j43033A39824P4993
11245B14817a55163q982A33689c71390J58972A99501a6716j76096a410j41371
11235a42781m031h122m0770J9207G781a30585b9687A7013b17293A26851b41563
11223b17220B36219a37187B29554B7639q370Q2544a76528M3064e6781q5244E373
11211A08880a05098m567C21803A06450c17685A84532K99109b19320j06450f6605
11200c01287A20843a06211c7592A56161D6584a35460J2058J3643A55422G4032
11189b84806J25807I5530f47A02495h4891j13096C2581a89214B36793d0420j13936
$$ y = [-343284, 151838, -183011, -175286, -114163, 166415, -90570, -120907, -247274, -84946, 5049, 15658, -19831, -103134, -252473, 21252, -14386, -19482, -123959, -18580, -161613, 139824, 214817, -155163, -164145, 133689, -371390, -212418, 199501, -16716, -192812, -1410, -142781, -146812, -8122, -48892, -29685, 7781, -130585, -29687, 17013, -217293, 126851, -241563, -217220, 236219, -137187, 229554, 27639, 19269, 101813, -176528, -133464, -56781, -142025, 5373, 108880, -105098, -109665, 321803, 106450, -317685, 184532, 483641, -219320, -325770, -66605, -301287, 120843, -106211, -37592, 156161, 46584, -135460, -123402, -109759, 155422, 74032, -284806, -158999, 95530, -647, 102495, -84891, -197987, 32581, -189214, 236793, -40420, -154356]
11178a54356M1093h214l48887A11467b48834C52669F980c56400A25934A8438a90376
11166c65576a15771q5407a00266A0824c50900q1183I6117b00663O4163C6197c34485
11154f808A33859J45354a35821C7132b73484o3976A12106E0271e3718R490p771
11143e1999C98219a05398G7886a53934j16499H9720J02416i2310A34960b19686
11132a74679o8332d4994A09970a83462B65748a3494A05450Q7324b70088A50221
11121B56008E2429a74688A68272C611Q0250g6047r3697E7046e2780A92277m9986
11110A42291J89429b03948B99197D075R7788a2280C96327A54076C7570K60984
11100B98554A48081K3755K67117q919j16490B7137J93668P3686q6711H4353A6467
$$ y = [-154356, -113263, -8214, -357101, 111467, -248834, 352669, 6980, -356400, 125934, 18438, -190376, -365576, -115771, -201178, -100266, 10824, -350900, -432083, 96117, -200663, -136500, 36197, -334485, -6808, 133859, 279213, -135821, 37132, -273484, -337460, 112106, 50271, -53718, -44228, -51999, 398219, -105398, 77886, -153934, -270433, 89720, 192136, -92310, 134960, -219686, -174679, -243011, -44994, 109970, -183462, 265748, -13494, 105450, 192774, -270088, 150221, 256008, 52429, -174688, 168272, 3611, 83861, -76047, -169744, 57046, -52780, 192277, 142291, 331720, -203948, 299197, 4075, 101863, -12280, 396327, 154076, 37570, 298554, 148081, 171836, 438953, 430034, 313544, 27137, 220805, 294491, 207780, 84353, 16467]
11088A76289a42559B38422J31693a7638k256B16068q9581M1558J93000G1315b8278
11076D65594B16214b45352B49447L21008k45170K9359j07996n010J66195l2997
11066C74836J1277K6970A07467N08129j81075l7495G6599J54895L39584r2180
11056D78898J87645j1164L2900k84768L67751B68316L87861J12331l7361l8088
11046F93059k41838J95102J08745l3469o6077L65843k34152k07255L08950l45087
11036E43821M28123j46558m1087j42867K36346j16059j64337k42033N84557j62551
11026G77355l00623K57091l3584O8301J22466l47832L6599o900J70722j65265
11016E78330K49030k12094p5119J97706j83650j13825L33132N3806j81428J60401
$$ y = [176289, -142559, 238422, 370115, -17638, -19894, 216068, 126487, 168045, 361045, 71315, -28278, 465594, 216214, -245352, 249447, 570455, 325285, 354644, 246648, 241638, 407833, 374836, 386113, 413083, 107467, 615596, 434521, 397026, 76599, 231494, 571078, 478898, 666543, 655379, 688279, 403511, 771262, 268316, 656177, 768508, 731147, 693059, 451221, 646323, 755068, 721599, 655522, 1021365, 787213, 579958, 888908, 543821, 971944, 825386, 784299, 641432, 877778, 761719, 597382, 355349, 939906, 777355, 476732, 733823, 700239, 768540, 891006, 543174, 579773, 572873, 743595, 578330, 827360, 615266, 540147, 737853, 554203, 440378, 773510, 827316, 645888, 806289]
11006H06289L7723l11049p5172J21319q5082J33049m0442q7471Q9962n8533P0959
10995F01552o9998K2117L47615l44955j36750J65079R811j77893j9736L07023
10985G03865j9142L29284j97255M63763l68059j65950N97880l90487K13188M6187
10975A213274M2551K97591k53201J48287M16220L71736k9741k5865R6874J45420
10965B423146j94067m18226L31827k09335n72408J6724J33107k10834m19529N36170
10955A416575P0216r9220q2613K28414j64503j47150j48283o0723r640j88172
10945H14901P7310l63991o0669l1824B09940a29923D2181M17744c9757B96662
10934B68445a92501A94499L29286b0152P802A29490H679a67712A14675a30500
$$ y = [806289, 844012, 532963, 457791, 579110, 494028, 627077, 586635, 499164, 589126, 530593, 601552, 531554, 553671, 901286, 556331, 419581, 584660, 594471, 416578, 396842, 703865, 684723, 1014007, 816752, 1280515, 912456, 746506, 1344386, 953899, 1167087, 1213274, 1255825, 1553416, 1300215, 1448502, 1864722, 2236458, 2206717, 2180852, 2277726, 2423146, 2229079, 1810853, 2142680, 1933345, 1360937, 1377661, 1510768, 1299934, 880405, 1416575, 1486791, 1387571, 1304958, 1533372, 1368869, 1221719, 1073436, 1012713, 1003073, 814901, 892211, 528220, 467551, 435727, 209940, -129923, 42181, 459925, -39757, 296662, 268445, -192501, 194499, 523785, -20152, -12350, 129490, 8679, -167712, 114675, -130500]
10923C31489G4204h13k1907k1476j51200i3363m2970A02921c46600J25162p6857
10912b98295A92647M2260h6241p7703A14382K9487E4970e0584l65855g456j97721
10901b05177A15523E2513a01650A21027M6930B2724a11172H9963M7326c6697C11847
10889H5027J29210a71570d0664r3553q5955k9553h1560I2401j5768M1187a58500
10877f380F1826a59692B72309K6855c286I5120i4069k4964k67390A77459p2760
10866A04699c17690N622a30908j13931P0986b7842A35299m1236L16492b35900
10855a98514A221L1584a941A12548c59227a31143K9813G3882J74032K13925d6146
10843E2536a71189b9593A23236l0177P8203a07835I2452c07263g5304j6300B02762
$$ y = [331489, 74204, -813, -22720, -44196, -195396, -93363, -136333, 102921, -346600, -221438, -298295, 192647, 234907, -86241, -163944, 114382, 143869, 54970, -50584, -416439, -7456, -205177, 115523, 52513, -101650, 121027, 167957, 22724, -111172, 89963, 137289, -36697, 311847, 85027, 214237, -171570, -40664, -134217, -220172, -249725, -81560, 92401, 76633, 117820, -158500, -6380, 61826, -159692, 272309, 299164, -3286, 95120, -94069, -119033, -386423, 177459, 104699, -317690, -312068, -130908, -244839, -173853, -27842, 135299, 94063, 410555, -235900, -198514, 1221, 32805, -1941, 112548, -359227, -131143, -101330, 73882, 247914, 461839, -46146, 52536, -171189, -29593, 123236, 93059, 171262, -107835, 92452, -307263, -75304, -91604, 202762]
10831a19400e7700A40495d3328k47298D9076a22554B09685I8954J81959A16971
10820a04330C25421b17004A9202b74946f8471D5354b63828A54402a00895l3641
10810a34536l6488J1693C4790f5727B76155i1837I6812b12397j58499O8235f6892
10798A53445c60388J50593A52326B9665c6395a2128A78598e2701A73241a67259
10787G6103E753h3467m79447b72137B041a8737r5606A15079a54996i366C9259
10775b85063f7224r7400A55495a61644D4242A5910K97163e8704A42268b9756j72436
10764b02192B68436G3919a73982l7950A78964c0482j00237K9764n1631A19543
10753b3964l57254A84512c60636a75414O5611j27203A03895m8948J7897I376O8180
$$ y = [-119400, -57700, 140495, -43328, -290626, 49076, -122554, 209685, 98954, 280913, 116971, -104330, 325421, -217004, 19202, -274946, -68471, 45354, -263828, 154402, -100895, -134536, -171024, -159331, 34790, -65727, 276155, -91837, 96812, -212397, -370896, -302661, -66892, 153445, -360388, -209795, 152326, 29665, -36395, -12128, 178598, -52701, 173241, -167259, 76103, 5753, -83467, -562914, -272137, 2041, -18737, -114343, 115079, -154996, -9366, 39259, -285063, -67224, -164624, 155495, -161644, 44242, 15910, 313073, -58704, 142268, -29756, -202192, 268436, 73919, -173982, -211932, 178964, -30482, -130719, -100955, -152586, 119543, -23964, -381218, 184512, -360636, -175414, -109803, -237006, 103895, 54947, 72844, 9376, 77556]
10742G7556c13066Q9207p0123J19193b3789B01068a74984a6353k85959D237J30762
10731A34999c78620F6264a81312G8914c7231j37447j26776C27599a04666m3848
10721a48514l2899d6645j04072M1111j27958f464j93625e4980k00256I5838a97490
10709D66232b6072j56069B526f0968b0981k1434j30279H9948R4730q3577a45697
10697a07172j22757r0570J43405A76299K26926I8807N4841m5822i2085A25587
10686f5971k57238A52001c64062A59270a49594G10b18247M1391N6742p402B34009
10674D2950A6239J59418L631b44347N6931G9631N6295b66146g6045D511a78415
10662E6461K5923a70290f2888A63842a65769A83398q8804l5696a26658k333F584
$$ y = [77556, -313066, -223859, -293982, -174789, -23789, 201068, -174984, -16353, -302312, 4237, 134999, -378620, 66264, -181312, 78914, -37231, -174678, -301454, 327599, -104666, -148514, -181413, -46645, -150717, -109606, -237564, -6464, -200089, -54980, -255236, 95838, -197490, 466232, -26072, -182141, 2526, -60968, -20981, -42415, -172694, 89948, 184678, 101101, -145697, -107172, -229929, -320499, -177094, 176299, 403225, 98807, 153648, 107826, -92085, 125587, -65971, -323209, 152001, -364062, 159270, -149594, 710, -218247, -176856, -120114, -127516, 234009, 42950, 16239, 175657, 179288, -244347, -187416, 79631, 135926, -266146, -76045, 4511, -178415, 56461, 82384, -170290, -62888, 163842, -165769, 183398, 94594, 58898, -126658, -128991, 6584]
10650a84095B854g7428I8186h7167n2965A08137k6082d136B07788N0134m3067
10639B14855d2353I5978a28106A1285J3181a76372o6048P8790o6093D2642c20508
10627A3956Q5187j374f9147k4400b1692B64714F9531a59295A21474b08816O6451
10616a42365E3703a56677E8916J22044b4176l2952m5645j32549A55173a95205
10605g3473J8318j89658n4511D8364c14893R3787A54214a99436D9694d2154j63468
10594b05622d6671B423b43333q1571H0788c9498j22363j59649f83q0235B72748
10582E1412g7947n8094m0450D22347a91952Q3632k52180A26168D2943J00668A7934
10570e715B47791a4915k76285A60869a70484E8274b13192i2854n456j25837K0649
$$ y = [-184095, 2854, -77428, 98186, -87167, -140132, 108137, 82055, -4136, 207788, 257922, 214855, -42353, 95978, -128106, 11285, 24466, -176372, -242420, -163630, -229723, 42642, -320508, 13956, 99143, 97769, -69147, -93547, -21692, 264714, 69531, -159295, 121474, -208816, -142365, 53703, -156677, 58916, 180960, -24176, -57128, -102773, -235322, 155173, -195205, -73473, -55155, -244813, -299324, 48364, -314893, -221106, 154214, -199436, 49694, -42154, -205622, -46671, 2423, -243333, -324904, 80788, -39498, -161861, -321510, -683, -80918, 272748, 51412, -77947, -136041, -176491, 422347, -191952, -108320, -360500, 126168, 42943, 143611, 17934, -5715, 247791, -14915, -291200, 160869, -170484, 58274, -213192, -92854, -98310, -224147, -203498]
10559b03498j51247d3463K0884m8235r6368A71824Q881b08154a0437k04407A48247
10547b30305f6588j82164c3900C652b3031A43612b20788G947J69842n7013J08537
10536B29313a02002B69560a22510C13008c04192a37137l2849d0872j44358A54623
10525b95441a2445A24786b873o07A02790a32337E0319J24884A4604e2801r8408
10514a51209l09526D4312M2652a34204E8340N6751n5410a73988c460l00515P5615
10503b28360d0184B13166Q3780a54374P3418K8845n4042j16930J05406c8844m8243
10492h7087c9219B3099J0190f6284D7208b6082H8066i3399E0770O5888c09749
10480A7111J62065K093C8338K40954H8695L05203j84123c1918o5596K0598j39974
$$ y = [-203498, -354745, -43463, -22579, -70814, -167182, 171824, 180705, -208154, -10437, -214844, 148247, -230305, -66588, -248752, -33900, 3652, -23031, 143612, -220788, 7947, 177789, 120776, 229313, -102002, 269560, -122510, 313008, -304192, -137137, -169986, -40872, -185230, 154623, -295441, -12445, 124786, -2873, -3480, 102790, -132337, 50319, 175203, 14604, -52801, -151209, -460735, 44312, 86964, -134204, 58340, 115091, 59681, -173988, -3460, -303975, -228360, -40184, 213166, 296946, -154374, -80956, -52111, -106153, -223083, -117677, -38844, -87087, -39219, 23099, 33289, -66284, 47208, -26082, 88066, -93399, 50770, 116658, -309749, 17111, 179176, 181269, 38338, 279292, 88695, 393898, 209775, -31918, -97514, -76916, -216890]
10469b16890p0393A92709k6202d40626D5003L69318a99576A10707a76673b022
10458c1725A52542J6149a81456A24437P0078B1612a36393f5065F3541J93870I2373
10446A0025c9104B18824o9004c19782a05497k04994q770A21956b07568A17599
10435d6768D8142p517g5110j19075M033B65573j05723h5565l2426D0297N7996
10424I8293h4297B5209d07984J35735e4975A31738c18753A465a2041j45481E5735
10412I3527a47893l2719a0539q7558k01253J522J33473O6248F5365B2366J40623
10401A62989A0239a72834c2445F2151J72844a93251k16685B8127a91533D45927
10390A22615J76787j5626a59509B31751j08198F0075N39k1296L196M7906c837
$$ y = [-216890, -287283, 192709, 166507, -440626, 45003, 414321, -199576, 110707, -176673, -2022, -31725, 152542, 168691, -181456, 124437, 194515, 21612, -136393, -65065, 63541, 257411, 92373, 10025, -39104, 218824, 149820, -319782, -105497, -310491, -319261, 121956, -207568, 117599, -46768, 48142, 40625, -75110, -194185, -190152, 265573, 159850, -85565, -117991, 40297, 98293, -84297, 25209, -407984, -272249, -54975, 131738, -318753, 1465, -12041, -157522, 55735, 93527, -147893, -180612, -10539, -98097, -299350, -297828, -164355, -98107, 65365, 22366, 162989, 10239, -172834, -32445, 62151, 234995, -193251, -409936, 28127, -191533, 445927, 122615, 299402, 283776, -159509, 231751, 123553, 60075, 60614, 39318, 42514, 90420, -3837]
10378A46632e7135A74582m7593l2942N3345K86925A85279J5670J70519q5392c2519
10366A95472J68801I8838K70160O9051P2969j89852J72758B29364j1157k0437
10356A97770J44988A6999J08973K13863h2998A38467R3428K82019B50735R5471
10346C46206o3705L1419j32275J46396d8993a2925F2955J1967P1794J26014q7782
10335A84948o888e2658j5276D80593A81646L1729J73833A39276c0321B89160F5398
10323a24539M8963B26902L7662q8330J84668O4023j68356J13844B4668L27746
10313C52414b19539E7195K36866B3626d0108F2436a58262k28655A80057P3723
10303B53780d4172A87177a52744A5351g2159F4639c94610a23210C55456A55296
$$ y = [146632, -57135, 174582, 126989, 94047, 147392, 434317, 185279, 200949, 371468, 286076, -32519, 195472, 364273, 98838, 368998, 438049, 511018, 321166, 493924, 229364, 218207, 197770, 342758, 16999, 125972, 339835, -82998, 138467, 231895, 513914, 250735, 346206, 282501, 313920, 181645, 328041, -48993, -12925, 62955, 74922, 146716, 272730, 184948, 178060, -52658, -67934, 480593, 181646, 213375, 387208, 139276, -30321, 289160, 65398, -124539, -75576, 226902, 264564, 176234, 360902, 424925, 256569, 370413, 24668, 352414, -219539, 57195, 294061, 23626, -40108, 62436, -158262, -386917, 180057, 253780, -44172, 187177, -152744, 15351, -72159, 64639, -394610, -123210, 355456, 155296]
10292g4937p3729D3319P3517i0151E1213g0981B49818a21624K4259j80792o1760
10281c39917L0763J22413E0104O1739a11593A96328g9876n9508D577K48360b9532
10269d4990q5547B56398a61291c8804l67555Q4215P6787A02236a89030A21431
10258D908L57196g0556B01992Q2926H7500K14773a39392D14494A68450a42323
10247G959J26651a69191P0918A7617J3193J26039g250H792b23285R5899k06342
10236c33728K7776A48336n2296J11898a98680r8666E1704d66669f3524l80716
10226d44240K04974h2976A72968a28974D4811h5312A03714c5503A13474a70780
10215b66977a04443j92445e1950j14749n1155j9118k9028D9497K53328A1361K2436
$$ y = [-74937, -148666, 43319, 116836, -90151, 51213, -70981, 249818, -121624, -97365, -278157, -339917, -309154, -186741, 50104, 111843, -111593, 196328, -79876, -139384, 4577, 252937, -29532, -44990, -130537, 256398, -161291, -38804, -406359, -322144, -245357, 102236, -189030, 121431, 4908, 362104, -70556, 201992, 284918, 87500, 302273, -139392, 414494, 168450, -142323, 7959, 134610, -169191, -98273, 17617, 30810, 156849, -7250, 8792, -223285, -127386, -333728, -305952, 148336, 96040, 207938, -198680, -297346, 51704, -466669, -63524, -444240, -239266, -82976, 172968, -128974, 44811, -85312, 103714, -35503, 113474, -170780, -266977, -104443, -296888, -51950, -166699, -217854, -236972, -266000, 49497, 302825, 11361, 33797]
10204C3797J92563a69624A12403a94937g1762A99454a96119n1601B28607a1983
10193h0087k080a8789B31388o1264c5004j08834A59855E6927k3788J6861J02380
10182A52380f994B64402c2446l4548k35260J45220j49535C4197M6135a06877n1891
10171a58768B4532c14139F6396B0337a63074b5150j48056P9101j09506g92j2078
10160a2870j17139j31102g9009I1507A8961a1348o7910j94985M2476E4046b71774
10148C45470D3760b37719O3526p2581e0779k97937a53613H5309a55771J0800A56409
10136A82072b88542b9899C6000A4037b44544B10421B6311a24896q066N4281b5394
10124A76560a31610R15C8709N1624a71818C6923a97617Q0608n7546j39387G0807
$$ y = [33797, 226360, -169624, 112403, -194937, -71762, 199454, -196119, -247720, 228607, -11983, -80087, -82167, -18789, 231388, 170124, -35004, -143838, 159855, 56927, 33139, 50000, 152380, -6994, 264402, -32446, -66994, -302254, -157034, -306569, 34197, 80332, -106877, -158768, 24532, -314139, 66396, 20337, -163074, -25150, -173206, -94105, -203611, -792, -12870, -130009, -261111, -79009, 91507, 18961, -11348, -79258, -274243, -231767, 54046, -271774, 345470, 43760, -237719, -174193, -246774, -50779, -348716, -153613, 85309, -155771, -144971, 156409, 182072, -288542, -29899, 36000, 14037, -244544, 210421, 26311, -124896, -132962, -78681, -25394, 176560, -131610, -130695, 38709, 90333, -171818, 36923, -197617, -117009, -174555, -313942, 70807]
10112a66402A36329j6912d2285B00901d7583n05858J81869J81979g7388I0833
10101e715l03401P1739H1800b75335A8584M0863a73080F920L38072a33245H1503
10089d4832D1972J3266J13732P1987A20352d7634A68895J43834a4874F8489g5064
10077c32659C2910e8968a5793N426k1717m29013a61288A0213J05903c18659J01917
10066b16742m9867a29875j87446J33648r5304C39959f7439l1570M6280A37606
10055f7747j01121P6754j98100R1784B3904c32247A18701E1216c39963a46952
10044A2178M3605K20515A16602a88167j32753f826j33123J9811a4585m06036B87041
10032f5296m2114j01142B57589A2668b24468h3588K7061A95549d0211j57826M368
$$ y = [-166402, 136329, 119417, -42285, 200901, -47583, -553441, -371572, -189593, -77388, 90833, -5715, -309116, -237377, 81800, -275335, 18584, 59447, -173080, 6920, 344992, -133245, 81503, -44832, 41972, 55238, 168970, 240957, 120352, -47634, 168895, 312729, -14874, 68489, -75064, -332659, 32910, -58968, -15793, -10367, -32084, -461097, -161288, 10213, 116116, -318659, -216742, -266609, -129875, -317321, -183673, -278977, 339959, -67439, -99009, -52729, 137606, -67747, -168868, -92114, -290214, -198430, 23904, -332247, 118701, 51216, -339963, -146952, 12178, 55783, 276298, 116602, -188167, -320920, -6826, -139949, -120138, -14585, -420621, 287041, -65296, -107410, -208552, 257589, 12668, -224468, -83588, -56527, 195549, -40211, -198037, -193669]
10021a93669g2561l8217b7260L327j18738q3426C1258J52008o0588b64879A3256
10009b08137j74150g682A16253k8571e6614A29749j4112n6085a30055o7395a5612
9997a52360E742N4707c0192k16931a14769r585I4346A7875c13045J48382A00313
9985b55498B66753A12961N795b44542R4462a1260l02684E5157b91383R7377f1930
9973a95947j04828a42392d2854B01116h9198j5285m6922n4807r6296A6277K21161
9962B37438a42717H9844a24715A06490Q1030p2611c26445A53084P7536a77711
9951a66234j91657Q6072G3024c28595A16006a07455F89c8730j91720d8578C5902
9939a72025B5057b36482j19268D6876i3104j92652a04975n6336k43089e9161b9475
$$ y = [-193669, -72561, -110778, -27260, -23933, -142671, -226097, 31258, 183266, 122678, -264879, 13256, -208137, -382287, -7682, 116253, 87682, -56614, 129749, 115637, 59552, -130055, -197450, -15612, -152360, 5742, 60449, -30192, -247123, -114769, -124354, 94346, 17875, -313045, -164663, 100313, -255498, 266753, 112961, 118756, -244542, -150080, -11260, -313944, 55157, -291383, -194006, -61930, -195947, -300775, -142392, -42854, 201116, -89198, -104483, -151405, -206212, -302508, 16277, 237438, -142717, 89844, -124715, 106490, 187520, 114909, -326445, 153084, 230620, -177711, -166234, -357891, -271819, 73024, -328595, 116006, -107455, 689, -38730, -230450, -48578, 35902, -172025, 25057, -236482, -355750, 46876, -93104, -285756, -104975, -161311, -404400, -59161, -29475]
9927B04667H7009a81458B13873h1006A6939L9487H530D006K2847c81213a24124
9915b72938e9014m8403A0418a20540k03750J2623A05907b43370Q3687L2231j35518
9904b62970j56784g0837o8201O1330A74138h2232c5434j45077A97139g1758h17
9892b23201A76031d2744j7462j09896A52092a20397A23536C125a39338B74856
9881a17695l828A09094N9586a68163A78779a93826l3076A30424c4535l03613e3429
9869a76943H3711c30740J51603k1533N4896A56175b15680m6732A6744d71903a67357
9857I5012K7317a81325C39649a23785B0180a1222p837p8167A51155d26900d5871
9845a40080A50515C2490c6022C21777a06309n1270F3901b56962A96373r3224b13403
$$ y = [204667, 87009, -181458, 213873, -81006, 16939, 56426, 8530, 4006, 26853, -381213, -124124, -272938, -59014, -107417, 10418, -120540, -324290, -311667, 105907, -243370, -159683, -127452, -262970, -419754, -70837, -139038, -77708, 174138, -82232, -35434, -180511, 197139, -71758, -817, -223201, 176031, -42744, -60206, -170102, 152092, -120397, 123536, 3125, -139338, 274856, -117695, -121523, 109094, 168680, -168163, 178779, -193826, -226902, 130424, -34535, -338148, -53429, -176943, 83711, -330740, -179137, -200670, -145774, 156175, -215680, -262412, 16744, -471903, -167357, 95012, 122329, -181325, 339649, -123785, 20180, -11222, -19059, -97226, 151155, -426900, -45871, -140080, 150515, 32490, -36022, 321777, -106309, -157579, 63901, -256962, 196373, 103149, -213403]
9833a13605m1482N3569C46409G899a99746k54328A72407j8930a85874Q5157d5353
9821i2828k38379Q2184A28941c00412A23214n8324a81359c101m470l20444J32816
9810a95199j82863C7210c5025A41657m3718C3645a45340f7118C2488a45230a6246
9798a99090d1000k6382j20247a2778E5270e8369r8324j62267O1988J07113j0878
9787a60737A53458a61506J0625l30943J98726g3947K6746C13673a77624C7476
9776a17997j29536C23096B3924a29691e9755I9810b11524B66802H4162a27053
9765a09489C5982L39682g8465c897A6565Q9891i3339A48215R4924E587d5360D9186
9752a5730j02038j11738d906C14931a07257A00698b04430E7638b46909a0322G4668
$$ y = [-113605, -155087, -101518, 346409, 7899, -199746, -454074, 172407, 153477, -185874, -100717, -45353, -92828, -331207, -249023, 128941, -300412, 123214, 64890, -181359, -3101, -7571, -328015, -195199, -378062, 37210, -35025, 141657, 97939, 33645, -145340, -67118, 32488, -145230, -16246, -199090, -41000, -67382, -187629, -12778, 55270, -58369, -156693, -318960, -256972, -149859, -160737, 153458, -161506, -150881, -481824, -283098, -73947, -47201, 313673, -177624, 37476, -117997, -247533, 323096, 23924, -129691, -59755, 99810, -211524, 266802, 84162, -127053, -109489, 35982, 375664, -78465, -3897, 16565, 106456, -93339, 148215, 243139, 5587, -45360, 49186, -15730, -117768, -229506, -4906, 314931, -107257, 100698, -204430, 57638, -246909, -10322, 74668]
9740B5964K8269R6192g5033B9757J4795b38839A13290D6634A1539J30644K2540
9729A64723b96280f1806j27368A76015a78210B3313a41086B64527I5446i251k38151
9718b47402h7702p6272l6290n3754l9565A7177a18114A44911J14a04403b3832
9706B8202H834O3683A1812a35950l11820J2149a938B6862N6381c40091E2168i762
9693d7832l05895C6603a42553p0947P7744k40684F8849K0328m3198p396c967C5111
9680d3698L626l25489B05138a23151E2499b53938d2366B28777B1521a45498j37743
9669b83241a9371k63443B14111A8558d72861B3749j0463J59004l9132a21172E8467
9657a53393e6225B2946a71120A01085b84146O1385b8596D0289G525J26489c6686
$$ y = [25964, 54233, 150425, -75033, 29757, 44552, -238839, 113290, 46634, 11539, 142183, 164723, -296280, -61806, -189174, 176015, -178210, 23313, -141086, 264527, 95446, -9251, -247402, -87702, -163974, -200264, -254018, -293583, 17177, -118114, 144911, 145025, -104403, -23832, 28202, 8834, 72517, 11812, -135950, -447770, -435621, -1938, 26862, 83243, -340091, 52168, -9762, -47832, -353727, 36603, -142553, -213500, -135756, -376440, 68849, 89177, 45979, 38583, -3967, 35111, -43698, -40072, -365561, 205138, -123151, 52499, -253938, -42366, 228777, 21521, -145498, -283241, -19371, -282814, 214111, 18558, -472861, 23749, 13286, 172290, 133158, -121172, 58467, -153393, -56225, 22946, -171120, 101085, -284146, -222761, -28596, 40289, 7525, 134014, -36686]
9645c21432e7895k58929L9858A56306d0148E2825b59057D395K2569h4018M0062
9634d3956a5880l8269B21783a51541O4908B34976C0872b69163R5371A15249k0196
9623I5053d6535k11778i7596C5300E9P35a91936A59815d2660l44702C68288i7597
9610b43305m5640B67251G7337M2448d18232E2760a04696K4937D4459J15622b84285
9598b01945l72891a16417o5511G0875b8002n3671m6900r3915J0590L8742n7218
9587b30374J07099j6958P824N6679j55724P5366k25362A41580a58094r0219j3201
9576b61514m0842a27091H7139j2660e135B49986a7001A78371l0444l4419c76635
9564b4220A47367b4562E8480Q1096e0578B2429i2374r0983C40647b09724M8112
$$ y = [-321432, -57895, -316824, -276966, 156306, -40148, 52825, -259057, 4395, 26964, -84018, -43956, -15880, -54149, 221783, -151541, -86633, 234976, 30872, -269163, -173792, 115249, 95053, -46535, -258313, -97596, 35300, 59, 794, -191936, 159815, -42660, -387362, 368288, -97597, -243305, -288945, 267251, 77337, 119785, -418232, 52760, -104696, -79759, 44459, 160081, -284285, -201945, -574836, -116417, -181928, 70875, -28002, -81673, -128573, -222488, -211898, -173156, -230374, -123275, -140233, -132409, -75730, -231454, -156088, -381450, 141580, -158094, -248313, -261514, -302356, -127091, 87139, 74479, -5135, 249986, -17001, 178371, 147927, 113508, -376635, -24220, 147367, -24562, 58480, 139576, -50578, 22429, -92374, -183357, 340647, -209724, -161612]
9553a61612P0066K0380j27271c5273D493c34854K3735F8255a1760C6875b40244
9541a00981A05698C5320a43946H4243d1511r9502G9578b54547a1923j68633C4079
9529a57543c244q9968k23875c6351M823k45975e4759b5329j70164j70291E3367
9517a4624l02817Q4989A12400a1319q7344A65274p3867e8133p6510A39173d50722
9505A66449a76277M850Q0257J4702j48947A86796L5449b10230m2936J3980k00332
9494d39518B475K37706e0149j00123m5208J9142o9201e586D6865a36824B02966
9482a58130d8289k9051a180A08824h7516A38011D270J93237P7104i4930p7856
9471a72786G1590K32472b51358A5972d2390A00082b15116d5051A4865b31613J05837
$$ y = [-161612, -91546, -71166, -198437, -35273, 4493, -334854, -311119, 68255, -11760, 36875, -240244, -100981, 105698, 35320, -143946, 84243, -41511, -141013, 79578, -254547, -11923, -180556, 34079, -157543, -3244, -93212, -317087, -36351, -31528, -277503, -54759, -25329, -195493, -365784, 53367, -14624, -317441, -232452, 112400, -11319, -98663, 165274, 91407, -58133, -134643, 139173, -450722, 166449, -176277, -171427, -91170, -76468, -225415, 186796, 222245, -210230, -253166, -239186, -439518, 2475, 240181, -50149, -150272, -195480, -176338, -245539, -5586, 46865, -136824, 202966, -158130, -48289, -77340, -1180, 108824, -87516, 138011, 4270, 197507, 274611, -94930, -172786, 71590, 304062, -251358, 15972, -42390, 100082, -215116, -45051, 14865, -231613, -125776]
9460a25776C8994J10906b17363m578e0818k57069a25461A95090b66304o3706J1232
9449c18778a32554j44482d3873k26026h2404j4923L799A74066l8686a34199p5775
9438b09974j08040A65749b79876A4771d0580j72075Q0345A0495c41355a22219
9427a90102L8280D6785c295j03147A11718C3285a84196j42286a33041A81281q6078
9416I5203b65615H2306K3488k7954a37346J1660c9918j23509a9352l41255G6394
9404A1270a11036j41935p7525B84150b40214h8450K9776h852B658N1570a36705
9392I7426a01004H1126c12375f2949q555h107j57870N2736B1406a1111A7579a94819
9379d22759d7957D2977O4471L8912j5227f3700o5697l741j06638n5506I3910D4019
$$ y = [-125776, 38994, 149900, -217363, -221941, -50818, -307887, -125461, 195090, -266304, -330010, -318778, -132554, -277036, -43873, -269899, -82404, -97327, -93528, 174066, 135380, -134199, -209974, -318014, 165749, -279876, 14771, -40580, -212655, -132310, 10495, -341355, -122219, -190102, -151822, 46785, -3295, -106442, 111718, 33285, -184196, -326482, -133041, 181281, 95203, -265615, 82306, 105794, 77840, -137346, -125686, -39918, -163427, -19352, -360607, 76394, 11270, -111036, -252971, -330496, 284150, -240214, -88450, -58674, -8852, 2658, 54228, -136705, 97426, -101004, 81126, -312375, -62949, -71504, -8107, -165977, -113241, 21406, -11111, 17579, -194819, -422759, -47957, 42977, 107448, 146360, 131133, -63700, -129397, -133138, -239776, -295282, 93910, 44019]
9366a22810l20217g5852n1346a8098E4001b67887H0013c14214A8854b60043L813
9355b56230J05387D6702D368e0789A39300i2952A94990a59609K3492k23220a10161
9343h6715M1342j05910C39615A00845d71266e956l2834n6290p8709k17168h397
9331G2253a02593A98782F7654F78J5971a36679c7762L852p2605B6685b17231D2694
9318f9034A14281D0692b86141P160A82461d0918k80820R2814k10352h9104A23705
9306a3353F3274j5873a82227E3294a08399k02994J01693g3345A28599b02915A38014
9294E8158K8422l7170i6813a1421q9363G6210a75090j72346N7481E5032J2734
9283F7766f1317B09025p7753D549a61780k612A47102c1553B68737b60785n4257
$$ y = [-122810, -443027, -75852, -127198, -18098, 54001, -267887, 80013, -314214, 18854, -260043, -256230, -150843, 46702, 4368, -50789, 139300, -92952, 194990, -159609, -136117, -359337, -110161, -86715, -45373, -151283, 339615, 100845, -471266, -5956, -38790, -95080, -173789, -390957, -8397, 72253, -102593, 198782, 67654, 678, 16649, -136679, -37762, -33910, -106515, 26685, -217231, 42694, -69034, 114281, 40692, -286141, -278981, 182461, -40918, -321738, -228924, -439276, -89104, 123705, -13353, 63274, 47401, -182227, 53294, -108399, -311393, -209700, -73345, 128599, -202915, 138014, 58158, 86580, 49410, -96813, -11421, -100784, 76210, -175090, -347436, -289955, 55032, 67766, -61317, 209025, 131272, 4549, -161780, -164392, 147102, -31553, 268737, -260785, -315042]
9272c15042g6269F1439A5107b01821a00204m5860j04099K1740E9318b25046C8096
9260A45913f7575B70920b42481C01781A18754c11418A66413e2960B3832a50789
9249h1057o9106r433c4178o1839k00990L8601a08877d903m88925G1797J9655a26618
9236a79610B7558K97857a86834E9607a30663j28011e8820j70452Q5713l7837C78626
9224A08060L4490b50537b3058A24054g7581E2400J15282c29164a25967j76244
9214c02211a49051A16899d5351E8891K14335j12074j4189f2492A56743b4113k50131
9203b74244g0683B89704a23060K9822I3536l9136b6736k7526I0068a50627M7004
9192a03623B1051J13709f8708H0842a48268B14041f0443l0787M924M2522A2127
$$ y = [-315042, -76269, 61439, 15107, -201821, -100204, -146064, -250163, -228423, 59318, -225046, 38096, 145913, -67575, 270920, -242481, 301781, 118754, -311418, 166413, -52960, 23832, -150789, -81057, -150163, -159596, -34178, -96017, -297007, -258406, -108877, -4903, -493828, 71797, 91452, -126618, -179610, 27558, 325415, -186834, 59607, -130663, -258674, -58820, -229272, -143559, -181396, 378626, 108060, 142550, -250537, -23058, 124054, -77581, 52400, 167682, -329164, -125967, -302211, -149051, 116899, -45351, 58891, 273226, 161152, 146963, -62492, 156743, -24113, -274244, -70683, 289704, -123060, -93238, 93536, 54400, -26736, -54262, 90068, -150627, -103623, 21051, 134760, -68708, 80842, -148268, 214041, -60443, -91230, -86306, -43784, 12127]
9180A7208b86918c0014n3365l2130J4688N0074l19985M7008d7791H5555B668a31784
9167F0603c3645j97008h8128j60036O6691B76473B1504b00252D8278e8890j77416
9156b36306P4600o7004b2121E4465b72774c6310r5028k72312i9136J7400j50111
9145b31847A55579B2531J7126J6f4653k1702B76796d4948q2839A93080P1506b68639
9132a61471N6773A04344P8689b01258A55914B7321g5934a2933A8447J10344J60756
9121B89547c619j09460p1624r8043G3962b37772A06692b22796G7522a83767A53034
9109D8059b08506f0103m3215A59302b12201A95774F2651O0570d46501a40030N1518
9098h8512l63913d9680G878a46594R706C25946e8483a5802I7339m1963N1018a71961
$$ y = [17208, -286918, -30014, -83379, -115509, -100821, -50747, -370732, -323724, -47791, 85555, 2668, -131784, 60603, -33645, -230653, -88128, -248164, -181473, 276473, 21504, -200252, 48278, -58890, -236306, -161706, -228710, -22121, 54465, -272774, -36310, -131338, -403650, -99136, -81736, -231847, 155579, 22531, 39657, 39673, -64653, -86355, 276796, -44948, -127787, 193080, 264586, -268639, -161471, -104698, 104344, 183033, -201258, 155914, 27321, -75934, -12933, 18447, 128791, 289547, -3619, -113079, -184703, -282746, 73962, -237772, 106692, -222796, 77522, -183767, 153034, 48059, -208506, -60103, -103318, 159302, -212201, 195774, 62651, 123221, -446501, -140030, -88512, -452425, -49680, 7878, -146594, -136888, 325946, -58483, -15802, 97339, 55376, 106394, -171961]
9085b76465C939g07222I608c78031E73i6269A9582a28846G6495P3497b66659c6675
9072C0980O3519J33448d78080C1783K0859i3793a3192l34912d2700l1972n9594
9061a34266D8192c6821J0894H6210c27840O8112j01334a48383F7157b10310C7582
9049b41126J09413C5800K20514a76271M5764j66365A65185o3010m7311B4656N9741
9038H4397R4615b09015D9739A5154a20184j29031C88988I4973K15307c6309H5517
9026b5652m2141A64059d1190k98444J36048D2781L9695b76795J21461A02242a5660
9014G6976k5324a17974D648K4349b06765I5285m1110c31148c5709C32505b43640
9002F8799B9821f7390j29151h7468C5250N7731a94581q371B03856C888c9228p3406
$$ y = [-276465, 3939, -707222, 9608, -378031, 573, -96269, 19582, -128846, 76495, 149992, -266659, -36675, 30980, 94499, 227947, -478080, 31783, 52642, -93793, -13192, -348104, -42700, -74672, -134266, 48192, -36821, -25927, 86210, -327840, -259728, -361062, -148383, 67157, -210310, 37582, -241126, -131713, 35800, 256314, -176271, -130507, -296872, 165185, 102175, 54864, 24656, 84397, 179012, -209015, 49739, 15154, -120184, -249215, 388988, 94973, 310280, -36309, 85517, -25652, -67793, 164059, -41190, -339634, -203586, 42781, 82476, -276795, -155334, 102242, -15660, 76976, 51652, -117974, 4648, 28997, -206765, 95285, 54175, -331148, -35709, 332505, -243640, 68799, 29821, -67390, -196541, -87468, 35250, 92981, -194581, -202952, 203856, 3888, -39228, -112634]
8990a12634Q490J4070r8451o3935H759J69784d63745J85655j33232c2927r390
8979d2317m4786A05133b43344f1615B38020c46053F9246a41524E8351a83563A02484
8967A76924f3080q1698e0747k37140i204j24444m31679B28645E687J72009h2318
8955b8399l76278a10656g091j32762f1408n1507j19992A74574b64877e9065o0590
8944a19655A48969f041j35502L857O7687F2111Q2631b10690A07174c06381D5189
8932c46072A09287e8225j67492A27957d4784A04789k616c74376c4670E81646A21983
8920G97471J615730q461A053180j6477A47776K13871c34016G4445b60776A39055
8909D5870b07462O4143A53970j7070Q9649a37081r4201B17779b0077E8322O0743
$$ y = [-112634, -104144, -90074, -188525, -252460, 8759, 178543, -463745, -278090, -411322, -32927, -42317, -87103, 105133, -243344, -61615, 238020, -346053, 69246, -141524, 58351, -183563, 102484, 176924, -63080, -144778, -50747, -287887, -9204, -133648, -565327, 228645, 5687, 177696, -82318, -28399, -404677, -110656, -7091, -139853, -61408, -112915, -232907, 174574, -264877, -59065, -119655, 148969, -6041, -141543, -137686, -69999, 62111, 144742, -210690, 107174, -306381, 45189, -346072, 109287, -58225, -225717, 127957, -44784, 104789, 102173, -374376, -34670, 581646, 121983, 797471, 2413201, 2404740, 1053180, 1036703, 147776, 361647, -334016, 74445, -260776, 139055, 45870, -207462, -143319, 153970, 136900, 226549, -137081, -231282, 217779, -20077, 58322, 119065]
8898A19065l9002d20512a66761k62382a08175K8619b9687j83387p8935J18759
8888a73250D0683A1831b4761A05977a28180a434A1967b3297q6400p2843F6065
8876C042a22492B374K54440b98102J31101g1516m7591K0210k0738m2988C4011
8864a2739j46447B62240J38777b41926n6653M0978C2253R7782a12011c1070j86769
8853b17839B7938a29295M7322cq8606L5949A32121g5273D2870R5a5905j0768A20245
$$ y = [119065, 80063, -420512, -166761, -429143, -108175, -79556, -29687, -213074, -292009, -173250, 40683, 11831, -24761, 105977, -128180, -1434, 11967, -23297, -109697, -182540, 66065, 3042, -122492, 2374, 256814, -298102, -167001, -71516, -119107, -98897, -119635, -162623, 34011, -12739, -159186, 262240, 401017, -241926, -298579, -257601, 32253, 130035, -112011, -31070, -217839, 27938, -129295, -81973, -3, -88609, -52660, 132121, -75273, 42870, 42965, -15905, -26673, 120245]
$$ [...]
##END NTUPLES=NMR SPECTRUM
##END=
