
##TITLE=AC1268_CTIAH12086_6642501_yozsytwoCr
##JCAMPDX= 6.0         $$ Bruker NMR JCAMP-DX V2.0
##DATA TYPE= NMR SPECTRUM
##DATA CLASS= NTUPLES
##ORIGIN= BRUKER
##OWNER= Administrator
$$ 1.72 TOPSPIN		Version 2.1
$$ 2012-08-08 20:10:09.937 -0500  Administrator@TOPSPIN
$$ Compression mode = diff/dup
##.OBSERVE FREQUENCY= 400.02188249412
##.OBSERVE NUCLEUS= ^1H
##.ACQUISITION MODE= SIMULTANEOUS (DQD)
##.ACQUISITION SCHEME= undefined
##.AVERAGES= 64
##.DIGITISER RES= 22
##SPECTROMETER/DATA SYSTEM= spect
##.PULSE SEQUENCE= noesygpps1d.comp
##.SOLVENT NAME= COFFEE_meoh
##.SHIFT REFERENCE= INTERNAL, COFFEE_meoh, 1, 14.96219
##AUDIT TRAIL= $$ (NUMBER, WHEN, WHO, WHERE, PROCESS, VERSION, WHAT)
$$ ##TITLE= Audit trail, TOPSPIN		Version 2.1
$$ ##JCAMPDX= 5.01
$$ ##ORIGIN= Bruker BioSpin GmbH
$$ ##OWNER= Administrator
$$ $$ C:\Bruker\TOPSPIN/data/COFFEE/nmr/AC1268_CTIAH12086_6642501_yozsytwoCr/12/pdata/1/auditp.txt
$$ ##AUDIT TRAIL=  $$ (NUMBER, WHEN, WHO, WHERE, PROCESS, VERSION, WHAT)
(   1,<2012-08-08 20:10:04.843 -0500>,<Administrator>,<TOPSPIN>,<go>,<TOPSPIN 2.1>,
      <created by zg
	started at 2012-08-08 19:58:34.625 -0500,
	POWCHK enabled, PULCHK disabled,
       configuration hash MD5:
       6B 1B 68 BB D9 2E 58 E2 7F 35 AD 54 07 DF 0E 41
       data hash MD5: 64K
       9B EC 02 0F 7E 9D 95 C5 B8 DC 4C C2 94 D8 D9 F6>)
(   2,<2012-08-08 20:10:07.750 -0500>,<Administrator>,<TOPSPIN>,<proc1d>,<TOPSPIN 2.1>,
      <Start of raw data processing
       efp LB = 0.3 FT_mod = 6 PKNL = 1 PHC0 = 0 PHC1 = 0 SI = 128K 
       data hash MD5: 128K
       AD A4 4D 80 45 39 3D 5B 71 F2 CF 4A 16 43 1D 75>)
(   3,<2012-08-08 20:10:08.921 -0500>,<Administrator>,<TOPSPIN>,<proc1d>,<TOPSPIN 2.1>,
      <pk PHC0 = -1.713867 PHC1 = 0 
       data hash MD5: 128K
       39 8E 1D C3 B4 84 3F BF 28 F0 38 67 FE 2F 45 F9>)
(   4,<2012-08-08 20:10:09.562 -0500>,<Administrator>,<TOPSPIN>,<proc1d>,<TOPSPIN 2.1>,
      <abs ABSG = 1 
       data hash MD5: 128K
       13 E4 AA 75 5B 70 C5 86 4B C1 20 7D 5A F4 F4 43>)
(   5,<2012-08-08 20:10:09.640 -0500>,<Administrator>,<TOPSPIN>,<proc1d>,<TOPSPIN 2.1>,
      <abs ABSG = 2 
       data hash MD5: 128K
       5B E9 B5 C9 47 75 A0 E4 7E 1A F5 9F 36 9C CE 30>)
(   6,<2012-08-08 20:10:09.687 -0500>,<Administrator>,<TOPSPIN>,<proc1d>,<TOPSPIN 2.1>,
      <abs ABSG = 3 
       data hash MD5: 128K
       77 2E 34 28 B7 D3 A6 01 3F 2E FA 4C D4 3E A1 9A>)
(   7,<2012-08-08 20:10:09.765 -0500>,<Administrator>,<TOPSPIN>,<proc1d>,<TOPSPIN 2.1>,
      <abs ABSG = 4 
       data hash MD5: 128K
       F7 0A F9 1F 75 48 BB E3 E1 55 5C 18 60 8A BF 0F>)
(   8,<2012-08-08 20:10:09.828 -0500>,<Administrator>,<TOPSPIN>,<proc1d>,<TOPSPIN 2.1>,
      <abs ABSG = 5 
       data hash MD5: 128K
       2F 35 CA 78 9D B7 93 C3 68 89 3C C7 F7 66 8D 20>)
$$ ##END=
$$ 
$$ $$ hash MD5
$$ $$ A1 85 CE BE 47 47 7C 9F 5B 9F A4 BB 2C C0 66 F3
##$RELAX= 
##$RELAX= 
##$RELAX= 
##$RELAX= 
##$RELAX= 
##$RELAX= 
##$RELAX= 
##$RELAX= 
$$ Bruker specific parameters
$$ [...]
##$TP07= 0
##$TPNAME0= <>
##$TPNAME1= <>
##$TPNAME2= <>
##$TPNAME3= <>
##$TPNAME4= <>
##$TPNAME5= <>
##$TPNAME6= <>
##$TPNAME7= <>
##$TPOAL= (0..7)
0.5 0.5 0.5 0.5 0.5 0.5 0.5 0.5
##$TPOFFS= (0..7)
0 0 0 0 0 0 0 0
##$TUNHIN= 0
##$TUNHOUT= 0
##$TUNXOUT= 0
##$USERA1= <user>
##$USERA2= <user>
##$USERA3= <user>
##$USERA4= <user>
##$USERA5= <user>
##$V9= 5
##$VALIST= <valist>
##$VCLIST= <CCCCCCCCCCCCCCC>
##$VD= 0
##$VDLIST= <DDDDDDDDDDDDDDD>
##$VPLIST= <PPPPPPPPPPPPPPP>
##$VTLIST= <TTTTTTTTTTTTTTT>
##$WBST= 1024
##$WBSW= 4
##$XGAIN= (0..3)
0 0 0 0
##$XL= 0
##$YL= 0
##$YMAX_a= 15916203
##$YMIN_a= -9972442
##$ZGOPTNS= <>
##$ZL1= 120
##$ZL2= 120
##$ZL3= 120
##$ZL4= 120
##$ABSF1= 14.96219
##$ABSF2= -5.595992
##$ABSG= 5
##$ABSL= 3
##$ALPHA= 0
##$AQORDER= 0
##$ASSFAC= 0
##$ASSFACI= 0
##$ASSFACX= 0
##$ASSWID= 0
##$AUNMP= <proc_prof1d_extract.lims>
##$AXLEFT= 0
##$AXNAME= <>
##$AXNUC= <1H>
##$AXRIGHT= 0
##$AXTYPE= 0
##$AXUNIT= <>
##$AZFE= 0.1
##$AZFW= 0.1
##$BCFW= 0
##$BC_mod= 0
##$BYTORDP= 0
##$COROFFS= 0
##$CY= 15
##$DATMOD= 1
##$DC= 0
##$DFILT= <>
##$DTYPP= 0
##$F1P= 0
##$F2P= 0
##$FCOR= 0.5
##$FTSIZE= 131072
##$FT_mod= 6
##$GAMMA= 0
##$GB= 0
##$INTBC= 1
##$INTSCL= 1
##$ISEN= 128
##$LB= 0.3
##$LEV0= 0
##$LPBIN= 0
##$MAXI= 10000
##$MC2= 0
##$MEAN= 0
##$ME_mod= 0
##$MI= 0
##$NCOEF= 0
##$NC_proc= -2
##$NLEV= 6
##$NOISF1= 0
##$NOISF2= 0
##$NSP= 0
##$NTH_PI= 0
##$NZP= 0
##$OFFSET= 14.96219
##$PC= 1
##$PHC0= -1.713867
##$PHC1= 0
##$PH_mod= 1
##$PKNL= yes
##$PPARMOD= 0
##$PPDIAG= 0
##$PPIPTYP= 0
##$PPMPNUM= 2147483647
##$PPRESOL= 1
##$PSCAL= 4
##$PSIGN= 0
##$PYNMP= <proc.py>
##$REVERSE= no
##$SF= 400.020009159799
##$SI= 131072
##$SIGF1= 0
##$SIGF2= 0
##$SINO= 400
##$SIOLD= 131072
##$SPECTYP= <>
##$SREGLST= <1H.CDCl3>
##$SSB= 0
##$STSI= 131072
##$STSR= 0
##$SW_p= 8223.68421052631
##$SYMM= 0
##$S_DEV= 0
##$TDeff= 65536
##$TDoff= 0
##$TI= <>
##$TILT= no
##$TM1= 0
##$TM2= 0
##$TOPLEV= 0
##$USERP1= <user>
##$USERP2= <user>
##$USERP3= <user>
##$USERP4= <user>
##$USERP5= <user>
##$WDW= 1
##$XDIM= 131072
##$YMAX_p= 313608066
##$YMIN_p= -11267
##$CURPLOT= <Network HP LaserJet P1505>
##$CURPRIN= <$Network HP LaserJet P1505>
##$DFORMAT= <normdp>
##$LAYOUT= <+/1D_H.xwp>
##$LFORMAT= <normlp>
##$PFORMAT= <normpl>
##$SURQMSG= 1
$$ End of Bruker specific parameters
$$ ---------------------------------
##NTUPLES= NMR SPECTRUM
##VAR_NAME=  FREQUENCY,     SPECTRUM/REAL,   SPECTRUM/IMAG
##SYMBOL=    X,             R,               I
##VAR_TYPE=  INDEPENDENT,   DEPENDENT,       DEPENDENT
##VAR_FORM=  AFFN,          ASDF,            ASDF
##VAR_DIM=   131072,        131072,          131072
##UNITS=     HZ,            ARBITRARY UNITS, ARBITRARY UNITS
##FACTOR=    0.0627417313425164, 1,          1
##FIRST=     8223.62146879497, -1064,        -53541
##LAST=      0,             -725,            -54106
##MIN=       0,             -11267,          0
##MAX=       8223.62146879497, 313608066,    0
$$ Real data points
##PAGE= N=1
##DATA TABLE= (X++(R..R)), XYDATA
$$ [...]
60947H354696r74043q45816p25121o17273n24283m45841l80637l26917k82564
60938C232201k45508k14368j88417j66832j48411j32258j18347j06956r7799r0113
60928A723192q3461p7962p3642o9955o6153o1949n7593n3394m9460m5855m2711
60917A041057l9944l7084l3731l0116k6944k4605k2822k1152j9486j7915j6444
60906G50814j5069j3908j2921j1791j0363q969p965p141o029m702l745l408l232
60893F41571k578j276L06J609K251K398K660L442M419M941M797M268L549K668
60879F75025J871J478J288O72n44j732k338k583l065l952m870n337n082m299l678
60864F42854l872m617m819l804k169r90n61l49M7N06R52J726L200N278P413R036
$$ y = [8354696, 7380653, 6534837, 5809716, 5192443, 4668160, 4222319, 3841682, 3514765, 3232201, 2986693, 2772325, 2583908, 2417076, 2268665, 2136407, 2018060, 1911104, 1813305, 1723192, 1639731, 1561769, 1488127, 1418172, 1352019, 1290070, 1232477, 1179083, 1129623, 1083768, 1041057, 1001113, 964029, 930298, 900182, 873238, 848633, 825811, 804659, 785173, 767258, 750814, 735745, 721837, 708916, 697125, 686762, 677793, 669828, 662687, 656658, 651956, 648211, 644803, 641571, 638993, 637717, 638023, 639632, 641883, 644281, 646941, 650383, 654802, 659743, 664540, 668808, 672357, 675025, 676896, 678374, 679662, 680334, 679790, 678058, 675720, 673137, 670072, 666120, 661250, 655913, 650831, 646532, 642854, 638982, 634365, 629546, 625742, 623573, 622583, 622022, 621673, 621720, 622226, 623178, 624904, 628104, 633382, 640795, 649831]
60848F49831R952J0417J0885J1609J2518J3439J4214J4604J4301J3369J2380J1899
60836G99418J1871J1754J1094R828Q186O529N227M344L554K566J558R74R54J214
60822H79071J420J416J090L37p40j883k915l835m582n015n152n289n709o368o971
60807H34875p292p386p491p771q117q211p819o973n908m861l994l337k738j965
60793G51012r75MP80J438K200L176M390N920P715R374J0406J0740J0814J1143
60779H28137J1856J2733J3433J3715J3535J3009J2314J1577J0853J0091R117P869
60767I68239O685O088O093O022N289M176L459L350L254K610J580P91N61O26M94
60752A019317n1p38j097j004q13r04j259j654k042k458k738k703k593k908l796
$$ y = [649831, 659783, 670200, 681085, 692694, 705212, 718651, 732865, 747469, 761770, 775139, 787519, 799418, 811289, 823043, 834137, 843965, 852151, 858680, 863907, 868251, 871805, 874371, 875929, 876903, 877857, 879071, 880491, 881907, 882997, 883334, 882594, 880711, 877796, 873961, 869379, 864364, 859212, 853923, 848214, 841846, 834875, 827583, 820197, 812706, 804935, 796818, 788607, 780788, 773815, 767907, 763046, 759052, 755715, 752977, 751012, 750037, 750041, 750821, 752259, 754459, 757635, 762025, 767945, 775660, 785034, 795440, 806180, 816994, 828137, 839993, 852726, 866159, 879874, 893409, 906418, 918732, 930309, 941162, 951253, 960370, 968239, 974924, 981012, 987105, 993127, 998416, 1002592, 1006051, 1009401, 1012655, 1015265, 1016845, 1017636, 1018197, 1018823, 1019317, 1019266, 1018528, 1017431, 1016427, 1015614, 1014710, 1013451, 1011797, 1009755, 1007297, 1004559, 1001856, 999263, 996355, 992559]
60737I92559m903n814o303o233n606m803m317m111l697k931k264k024j902j479
60723I36172q68m30k14k6J76L30M89O30M33l76j593k720l424l599l242k649k468
60706I16621l062m012m654m886m964m753l941k949k785l771n016n603n663n897
60692H54665o460o891o891o696o762p403q625r988j0776j0653j0027r553r341
60679G44599r014q448q051q224q832r292r007p781n975m308l192k304j074L79
60665F59476J229J028N00Q11K187L700M419M381M263M383M495M409M379M650N021
60650G09331N157N147N333N681N780N486N141N016M996N078N630O704P521P328
60636G89329O570O448P303Q208Q411Q427R206J0733J2131J2860J3200J3588J4006
$$ y = [992559, 987656, 981842, 975539, 969306, 963700, 958897, 954580, 950469, 946772, 943841, 941577, 939553, 937651, 936172, 935304, 934874, 934660, 934634, 934810, 935140, 935629, 936259, 936692, 936316, 934723, 932003, 928579, 924980, 921738, 919089, 916621, 913559, 909547, 904893, 900007, 895043, 890290, 886349, 883400, 880615, 876844, 871828, 866225, 860562, 854665, 848205, 841314, 834423, 827727, 820965, 813562, 804937, 794949, 784173, 773520, 763493, 753940, 744599, 735585, 727137, 719086, 710862, 702030, 692738, 683731, 675950, 669975, 665667, 662475, 660171, 659097, 659476, 660705, 661733, 662233, 663044, 665231, 668931, 673350, 677731, 681994, 686377, 690872, 695281, 699660, 704310, 709331, 714488, 719635, 724968, 730649, 736429, 741915, 747056, 752072, 757068, 762146, 767776, 774480, 782001, 789329, 795899, 802347, 809650, 817858, 826269, 834696, 843902, 854635, 866766, 879626, 892826, 906414, 920420]
60623I20420J4118J3671J2667J1409J0401R899R529Q604O890M841L004J507J86
60610A027146r55j657j681j116n13n99j711l446n091o416p805r581j1426j2728
60596I62421j3258j3312j3280j3260j3067j2434j1266r768q312p115o040m802
60584H36507l313j818o98r3K94R30J850K532K524K073J814K005K497L339M715
60569H55158O217O878O330N346M781M498L930L186K805K673K112R41l51j575l080
60554H99849m787n797n491m423l551l018k278j139JR73K307M572P564J0466J2864
60539I08112J5343J8742K2893K6474K8381K8826K8603K7696K5323K1198J5928
60528A167519J0040L585l009q540j2120j4009j4856j4680j3283j1144r021p000
$$ y = [920420, 934538, 948209, 960876, 972285, 982686, 992585, 1002114, 1010718, 1017608, 1022449, 1025453, 1026960, 1027146, 1026191, 1024534, 1022853, 1021737, 1021224, 1020625, 1018914, 1015468, 1010377, 1003961, 996156, 986575, 975149, 962421, 949163, 935851, 922571, 909311, 896244, 883810, 872544, 862776, 854464, 847349, 841309, 836507, 833194, 831376, 830678, 830585, 830879, 831809, 833659, 836191, 838715, 840788, 842602, 844607, 847104, 850443, 855158, 861375, 868253, 874583, 879929, 884710, 889208, 893138, 896324, 899129, 901802, 903914, 904855, 904504, 902929, 899849, 895062, 889265, 883774, 879351, 875800, 872782, 870504, 869365, 869366, 870339, 872646, 877218, 884782, 895248, 908112, 923455, 942197, 965090, 991564, 1019945, 1048771, 1077374, 1105070, 1130393, 1151591, 1167519, 1177559, 1181144, 1178135, 1169595, 1157475, 1143466, 1128610, 1113930, 1100647, 1089503, 1080482, 1073482]
60516A073482m647j942O01K631M123N038N445N864O770P921Q759R433J0715J2986
60502A147179J5972J9525K3856K8940L4427M0297M6909N4330O2280P0848Q0367
60491A624930R0417R9954J08897J18806J31386J47000J65201J85883K08911K32999
60481C114384K55617K73669K83667K81825K65178K32923J86488J28710O3527l963
60471E082025o8296j25077j71732k07367k32545k48949k58405k62011k60328k54079
60461B993236k44056k30678k14325j96077j77382j59020j41098j23939j08305
60452A398356r4542q2343p1481o2168n4366m7412m0756l4624k9604k5925k3376
60441H31759k1584k0082j8470j6791j5478j4729j4209j3514j2604j1589j0507
$$ y = [1073482, 1068835, 1066893, 1067494, 1070125, 1074248, 1079286, 1084731, 1090595, 1097365, 1105286, 1114045, 1123478, 1134193, 1147179, 1163151, 1182676, 1206532, 1235472, 1269899, 1310196, 1357105, 1411435, 1473715, 1544563, 1624930, 1715347, 1815301, 1924198, 2043004, 2174390, 2321390, 2486591, 2672474, 2881385, 3114384, 3370001, 3643670, 3927337, 4209162, 4474340, 4707263, 4893751, 5022461, 5085988, 5082025, 5013729, 4888652, 4716920, 4509553, 4277008, 4028059, 3769654, 3507643, 3247315, 2993236, 2749180, 2518502, 2304177, 2108100, 1930718, 1771698, 1630600, 1506661, 1398356, 1303814, 1221471, 1149990, 1087822, 1033456, 986044, 945288, 910664, 881060, 855135, 831759, 810175, 790093, 771623, 754832, 739354, 724625, 710416, 696902, 684298, 672709, 662202]
60430F62202r491q826q554q305p762o961o049n051m099l464l078k462j432n01
60416E86167k20l64k38M83J487K292K656K686K720K974L203L046K730K953L860
60401F16435M698M834M599M647N045N494N960O452O605O246N964O292O661O126
60387F96058M900M129M101L836K701J369P00N49K89k60r86j894k702k636j479
60372G08675l00k61j081j549j320j125j221q43M04J627J756J020N16P56J355J934
60356G10343K563L275L862M333N078O216P240P610P448P302P389P473P417P459
60342G95008P843Q453Q907Q904Q405P642O987O686O680O842P336Q500J0362J2472
60328I11027J4333J5814J7021J7886J8002J6799J3956R817N412J676j439m754
$$ y = [662202, 652711, 643885, 635331, 627026, 619264, 612303, 606254, 601203, 597104, 593640, 590562, 588100, 586668, 586167, 585947, 585583, 585345, 585828, 587315, 589607, 592263, 594949, 597669, 600643, 603846, 606892, 609622, 612575, 616435, 621133, 625967, 630566, 635213, 640258, 645752, 651712, 658164, 664769, 671015, 676979, 683271, 689932, 696058, 700958, 705087, 709188, 713024, 715725, 717094, 717794, 718343, 718632, 718372, 717386, 715492, 712790, 710154, 708675, 708375, 708114, 707033, 705484, 704164, 703039, 701818, 700975, 701379, 703006, 704762, 705782, 706298, 707054, 708409, 710343, 712906, 716181, 720043, 724376, 729454, 735670, 742910, 750520, 757968, 765270, 772659, 780132, 787549, 795008, 802851, 811304, 820211, 829115, 837520, 845162, 852149, 858835, 865515, 872357, 879693, 888193, 898555, 911027, 925360, 941174, 958195, 976081, 994083, 1010882, 1024838, 1034655, 1040067, 1041743, 1040304, 1035550]
60316A035550q641j2366j4896j6027j6347j6404j6289j5892j5097j3882j2512
60305H77197j1527j1025j0134p893m678k108j241j428j273l20P07J034O84K06
60291H28201J5R6J85J82L87J221K594L794M209M002L811L921M136M362M794N309
60275H71219N188L965K305J529K158L388M216M649N415O774Q198R196R945J0858
60261I49003J1963J3036J4093J5413J7126J9118K1297K3736K6458K9338L2201
60250A172782L5009L7984M1559M6048N1172N6143O0466O4563O9281P4880Q0780
60239A790667Q6254R1012R5074R8457J01121J02971J03722J02975J00544R6560
60229B769357R1170Q4316P5968O6359N5892M4955L3881K2915J2112J485q570j7212
$$ y = [1035550, 1026909, 1014543, 999647, 983620, 967273, 950869, 934580, 918688, 903591, 889709, 877197, 865670, 854645, 844511, 836618, 831940, 829832, 828591, 827163, 825890, 825570, 826277, 827311, 827995, 828201, 828216, 828312, 828497, 828679, 829066, 830287, 832881, 836675, 840884, 844886, 848697, 852618, 856754, 861116, 865910, 871219, 876407, 880372, 882677, 884206, 886364, 889752, 893968, 898617, 904032, 910806, 919004, 928200, 938145, 949003, 960966, 974002, 988095, 1003508, 1020634, 1039752, 1061049, 1084785, 1111243, 1140581, 1172782, 1207791, 1245775, 1287334, 1333382, 1384554, 1440697, 1501163, 1565726, 1635007, 1709887, 1790667, 1876921, 1967933, 2063007, 2161464, 2262585, 2365556, 2469278, 2572253, 2672797, 2769357, 2860527, 2944843, 3020811, 3087170, 3143062, 3188017, 3221898, 3244813, 3256925, 3258410, 3249840, 3232628]
60217C232628k3735k8143l0966l2587l2924l1664k8602k3724j7196r344n40Q947
60205B982150J8939K9227L9545M9741N9822O9716P9072Q7385R4167R8868J00790
60194C709422R9502R5476Q9833Q3148P4820O4063N1189L7289K2833P526q350k3394
60182D303357l6461m7758n7790o5877p0724p2191p1451o9363o5574n9492n1289
60171C635387m1545l0516j8290n328P545J9604L0527M0388M9325N6985O2316O4408
60159C870806O3463O0492N6021M9742M1587L2430K3317J4550O029j945q796j4253
60147D193443j8259k0451k0158j7037j1408m041M302J3332K3449L5305M8999O4027
60135D291503Q0078R7514J16661J37041J57701J78075J98144K17938K37253K55712
$$ y = [3232628, 3208893, 3180750, 3149784, 3117197, 3084273, 3052609, 3024007, 3000283, 2983087, 2973743, 2973203, 2982150, 3001089, 3030316, 3069861, 3119602, 3179424, 3249140, 3328212, 3415597, 3509764, 3608632, 3709422, 3808924, 3904400, 3994233, 4077381, 4152201, 4216264, 4267453, 4304742, 4327575, 4335101, 4326751, 4303357, 4266896, 4219138, 4161348, 4095471, 4024747, 3952556, 3881105, 3811742, 3746168, 3686676, 3635387, 3593842, 3563326, 3545036, 3539708, 3547253, 3566857, 3597384, 3637772, 3687097, 3744082, 3806398, 3870806, 3934269, 3994761, 4050782, 4100524, 4142111, 4174541, 4197858, 4212408, 4218437, 4216492, 4207696, 4193443, 4175184, 4154733, 4134575, 4117538, 4106130, 4102089, 4106391, 4119723, 4143172, 4178477, 4227476, 4291503, 4371581, 4469095, 4585756, 4722797, 4880498, 5058573, 5256717, 5474655, 5711908, 5967620]
60125E967620K72694K87332K98845L06831L10983L10788L05748K95729K80778
60116H637348K60879K36197K07406J75299J40182J02053O1303J8962k3726o5690
60106I750213j05974j43579j77388k06254k29322k46342k57511k62895k62409
60097G858539k56356k45516k30436k11216j88326j63104j36851j09928q2334n4738
60087F179734k8213l285J9883M0524N7321O9460P6975Q0039P8633P2989O3713
60076F707773N1348L6381J9713K486j4753l2227n0123o8051q5350j01438j15789
60065F349970j28089j38475j47121j53507j56682j56277j52751j46676j38468
60056E031924j28777j18277j06812r3559p8399o2369m6377l0243j3457L753K0721
$$ y = [5967620, 6240314, 6527646, 6826491, 7133322, 7444305, 7755093, 8060841, 8356570, 8637348, 8898227, 9134424, 9341830, 9517129, 9657311, 9759364, 9820667, 9839629, 9815903, 9750213, 9644239, 9500660, 9323272, 9117018, 8887696, 8641354, 8383843, 8120948, 7858539, 7602183, 7356667, 7126231, 6915015, 6726689, 6563585, 6426734, 6316806, 6234472, 6179734, 6151521, 6148236, 6168119, 6208643, 6265964, 6335424, 6412399, 6492438, 6571071, 6644060, 6707773, 6759121, 6795502, 6815215, 6817701, 6802948, 6770721, 6720598, 6652547, 6567197, 6465759, 6349970, 6221881, 6083406, 5936285, 5782778, 5626096, 5469819, 5317068, 5170392, 5031924, 4903147, 4784870, 4678058, 4584499, 4506100, 4443731, 4397354, 4367111, 4353654, 4357407, 4378128]
60045D378128L7053N2406O6085P7547Q6880R4191R8887J00134R7677R1688Q2275
60034E262951O9855N5532M0205K3612N110j4762l4367n2580o9305q4359r6909
60023E104983j06381j13122j17521j19178j17533j12887j06119r7678q7486p5724
60013D051354o3072n0025l6443k1976o625R325K5704M2545N9791P7087R3830J09312
60001D290807J22890J34226J43289J49955J53581J53275J48703J40325J28682
59992E565733J13772R5562P4793N2717L0041O721j7174m0886o3364q3631j00574
59981E633710j13020j20590j24113j24639j22304j16675j07919r6954q4499p0597
59971D552400n5249l8987k2512o082J0323K6371M1278N4443O5997P6370Q5295
$$ y = [4378128, 4415181, 4467587, 4533672, 4611219, 4698099, 4792290, 4891177, 4991311, 5088988, 5180676, 5262951, 5332806, 5388338, 5428543, 5452155, 5457265, 5442503, 5408136, 5355556, 5286251, 5201892, 5104983, 4998602, 4885480, 4767959, 4648781, 4531248, 4418361, 4312242, 4214564, 4127078, 4051354, 3988282, 3938257, 3901814, 3879838, 3873213, 3882538, 3908242, 3950787, 4010578, 4087665, 4181495, 4290807, 4413697, 4547923, 4691212, 4841167, 4994748, 5148023, 5296726, 5437051, 5565733, 5679505, 5775067, 5849860, 5902577, 5932618, 5939339, 5922165, 5881279, 5817915, 5734284, 5633710, 5520690, 5400100, 5275987, 5151348, 5029044, 4912369, 4804450, 4707496, 4622997, 4552400, 4497151, 4458164, 4435652, 4429570, 4439893, 4466264, 4507542, 4561985, 4627982, 4704352, 4789647]
59960D789647R1629R4496R4380R2543Q9428Q4334P6853O7936N9018N0572M2179
59949E633015L3721K5814J9170J4245J1468J1317J3989J9421K7699L9119N3759
59938E902737P1383R1719J14551J39529J66240J94388K23478K52267K79058L02617
59928G737967L22324L37280L45792L45916L36189L15596K83553K40458J88171
59919A0453246J29484O7181L740n8395j16738j69116k14015k50666k78929k98877
59909I266915l10526l14135l10713l01673k87798k69041k45682k19131j91032
59900F817184j61986j31875j01087p0563m0699j1157J7907M5161O9205Q9771J07283
59889F629144J21460J31041J34704J31848J22435J06579Q4503N6764K4399j1027
$$ y = [4789647, 4881276, 4975772, 5070152, 5162695, 5252123, 5336457, 5413310, 5481246, 5540264, 5590836, 5633015, 5666736, 5692550, 5711720, 5725965, 5737433, 5748750, 5762739, 5782160, 5809859, 5848978, 5902737, 5974120, 6065839, 6180390, 6319919, 6486159, 6680547, 6904025, 7156292, 7435350, 7737967, 8060291, 8397571, 8743363, 9089279, 9425468, 9741064, 10024617, 10265075, 10453246, 10582730, 10649911, 10653651, 10595256, 10478518, 10309402, 10095387, 9844721, 9565792, 9266915, 8956389, 8642254, 8331541, 8029868, 7742070, 7473029, 7227347, 7008216, 6817184, 6655198, 6523323, 6422236, 6351673, 6310974, 6299817, 6317724, 6362885, 6432090, 6521861, 6629144, 6750604, 6881645, 7016349, 7148197, 7270632, 7377211, 7461714, 7518478, 7542877, 7531850]
59879G531850m7594q3442j17090j47453j73741j95475k12463k24536k31528k33681
59869E864847k31847k26929k19212k08680j95798j81535j66621j51322j36048
59860D146855j21556j08376r6555q6226p7892p1668o6648o1607n6158n0804m6040
59849C303325m1870l7991l4022k9657k5097k1122j8330j6473j5068j4418j5325
59838C033952j7823k1004k4182k7413l0621l2979l3729l3094l1856l0410k8667
59827B722174k6528k3986k0966j7542j4082j0863p638l916N50N756J1662J8006
59815B632627K4080K9127L2935L5877L8481M1119M3874M6433M8246M8946M8455
59804C070200M6596M3115L8281L3098K8391K4066J9731J5695J2829J1665J2167
$$ y = [7531850, 7484256, 7400814, 7283724, 7136271, 6962530, 6767055, 6554592, 6330056, 6098528, 5864847, 5633000, 5406071, 5186859, 4978179, 4782381, 4600846, 4434225, 4282903, 4146855, 4025299, 3916923, 3820368, 3734142, 3656250, 3584582, 3517934, 3456327, 3400169, 3349365, 3303325, 3261455, 3223464, 3189442, 3159785, 3134688, 3113566, 3095236, 3078763, 3063695, 3049277, 3033952, 3016129, 2995125, 2970943, 2943530, 2912909, 2879930, 2846201, 2813107, 2781251, 2750841, 2722174, 2695646, 2671660, 2650694, 2633152, 2619070, 2608207, 2600569, 2596653, 2597203, 2602959, 2614621, 2632627, 2656707, 2685834, 2718769, 2754646, 2793127, 2834246, 2878120, 2924553, 2972799, 3021745, 3070200, 3116796, 3159911, 3198192, 3231290, 3259681, 3283747, 3303478, 3319173, 3332002, 3343667, 3355834]
59793C355834J4200J7684K2434K8390L5882M5097N5559O6782P9271R4120J11618
59782C926871J31090J52116J75048K00001K26175K52495K77985L00686L16783
59773E959250L21797L12576K87784K47227J92070J26214N6516r399o6078j11445
59763G316512j45937j71013j88249j98925k03832k03342j97832j87955j74325
59754E645102j57228j37056j14964r2647p1260n0934l1376j2449O067K4568M2954
59743E050777O0413P6514R2091J08328J25292J42281J59374J77578J97442K18600
59733F408690K40902K64924K90861L17897L45372L73846M04141M35825M67404
59724I549862M97659N25895N50995N71067N84266N89582N86909N76877N60868
$$ y = [3355834, 3370034, 3387718, 3410152, 3438542, 3474424, 3519521, 3575080, 3641862, 3721133, 3815253, 3926871, 4057961, 4210077, 4385125, 4585126, 4811301, 5063796, 5341781, 5642467, 5959250, 6281047, 6593623, 6881407, 7128634, 7320704, 7446918, 7503434, 7494035, 7427957, 7316512, 7170575, 6999562, 6811313, 6612388, 6408556, 6205214, 6007382, 5819427, 5645102, 5487874, 5350818, 5235854, 5143207, 5071947, 5021013, 4989637, 4977188, 4983255, 5007823, 5050777, 5111190, 5187704, 5279795, 5388123, 5513415, 5655696, 5815070, 5992648, 6190090, 6408690, 6649592, 6914516, 7205377, 7523274, 7868646, 8242492, 8646633, 9082458, 9549862, 10047521, 10573416, 11124411, 11695478, 12279744, 12869326, 13456235, 14033112, 14593980]
59715A4593980N40832N18900M97238M78012M63123M53726M50094M51723M57412
59706A8905040M65342M73446M79763M82379M79214M68199M47655M16529L74634
59697B2992201L23085K64388K01648J37635P4727J5549l6986q0484j13673j35994
59687B3642096j46873j45652j32122j06876p1051k5818K7834Q8977J56618K29749
59677B3516882L07274L87571M68109N45692O17049O78868P27102P56666P62228
59668B8767441P39530O86006O00765M84766L41584J77954L068j73251l42260m96792
59658C0788811o30893p40064q22351q78876r12572r26339r22733r05144q78534
59649B3171305q48822q21917q02971p95144p98046q07639q18295q25128q24871
$$ y = [14593980, 15134812, 15653712, 16150950, 16628962, 17092085, 17545811, 17995905, 18447628, 18905040, 19370382, 19843828, 20323591, 20805970, 21285184, 21753383, 22201038, 22617567, 22992201, 23315286, 23579674, 23781322, 23918957, 23993684, 24009233, 23972247, 23891763, 23778090, 23642096, 23495223, 23349571, 23217449, 23110573, 23039522, 23013704, 23041538, 23130515, 23287133, 23516882, 23824156, 24211727, 24679836, 25225528, 25842577, 26521445, 27248547, 28005213, 28767441, 29506971, 30192977, 30793742, 31278508, 31620092, 31798046, 31801114, 31627863, 31285603, 30788811, 30157918, 29417854, 28595503, 27716627, 26804055, 25877716, 24954983, 24049839, 23171305, 22322483, 21500566, 20697595, 19902451, 19104405, 18296766, 17478471, 16653343, 15828472]
59640A5828472q15887p98498p74921p47739p18162o85996o50993o13597n74507
59631I448172n34236m93338m52625m12984l75178l39707l06546k75254k45730
59622F012574k18659j94670j73306j53517j35101j18752j04701r2209q0844p1357
59612D669458o4570o0036n6617n4162n3677n5730n9370o2990o5851o8364p1103
59601C996988p3962p6342p7748p7912p6573p3615o9494o5073o0780n6247n1033
59590C238209m5315l9459l3293k6491j9439j2995p417k244K648O687R660J2342
59578C082893J5475J8704K1142K2656K3890K5203K6408K7548K9219L1926L5558
59567C360622L9707M4142M8786N3614N8827O4857P1897P9629Q7768R6740J07366
$$ y = [15828472, 15012585, 14214087, 13439166, 12691427, 11973265, 11287269, 10636276, 10022679, 9448172, 8913936, 8420598, 7967973, 7554989, 7179811, 6840104, 6533558, 6258304, 6012574, 5793915, 5599245, 5425939, 5272422, 5137321, 5018569, 4913868, 4821659, 4740815, 4669458, 4604888, 4544852, 4488235, 4434073, 4380396, 4324666, 4265296, 4202306, 4136455, 4068091, 3996988, 3923026, 3846684, 3768936, 3691024, 3614451, 3540836, 3471342, 3406269, 3345489, 3289242, 3238209, 3192894, 3153435, 3120142, 3093651, 3074212, 3061217, 3053800, 3051556, 3054204, 3060891, 3070551, 3082893, 3098368, 3117072, 3138214, 3160870, 3184760, 3209963, 3236371, 3263919, 3293138, 3325064, 3360622, 3400329, 3444471, 3493257, 3546871, 3605698, 3670555, 3742452, 3822081, 3909849, 4006589, 4113955]
59556D113955J19793J33074J46042J58443J70889J83817J96874K09377K21023
59547E653287K31768K41195K48358K52347K52843K50090K44612K36915K27186
59538G838601K15102K00086J81927J61124J38693J15929R4202P4550N7205M1908
59528I119327K8948J9539J4755J4432J7691K4318L4790M8841O4763Q0474R4640
59517I562518J06117J12885J12572J04132Q8257O5882L6953J241m0129q4563j29433
59506I936432j73095k14556k52552k85283l10952l28679l38989l43320l42721
59497G346285l37102l26107l10493k92022k71973k50472k27563k04134j81199
59488D945220j58831j36602j14693r3769p3895n4570l5810j8204j666J4922L2273
$$ y = [4113955, 4233748, 4366822, 4512864, 4671307, 4842196, 5026013, 5222887, 5432264, 5653287, 5885055, 6126250, 6374608, 6626955, 6879798, 7129888, 7374500, 7611415, 7838601, 8053703, 8253789, 8435716, 8596840, 8735533, 8851462, 8945664, 9020214, 9077419, 9119327, 9148275, 9167814, 9182569, 9197001, 9214692, 9239010, 9273800, 9322641, 9387404, 9467878, 9562518, 9668635, 9781520, 9894092, 9998224, 10086481, 10152363, 10189316, 10190557, 10150428, 10065865, 9936432, 9763337, 9548781, 9296229, 9010946, 8699994, 8371315, 8032326, 7689006, 7346285, 7009183, 6683076, 6372583, 6080561, 5808588, 5558116, 5330553, 5126419, 4945220, 4786389, 4649787, 4535094, 4441325, 4367430, 4312860, 4277050, 4258846, 4257180, 4272102, 4304375]
59477D304375M9696O6182Q1874R7659J13738J29551J44827J59752J73919J85944
59467E507517J94530J99283K00138J96537J87712J73423J53888J29132R9107O4564
59457G105831K7393j0266m7057q2431j15864j46411j73001j94892k11696k23321
59447E928285k30145k33112k33211k30727k25303k16869k06266j94660j82609
59438C975383j70001j56837j43611j30821j18493j06474r4903q4115p4154o4777
59428B831197n5979m8132m1401l5309k9213k3076j7406j2378p474k277K822P169
59416B568543J0950J5021J9525K3274K4968K4556K2919K0669J8077J6039J6046
59405B780587J8768K3327K8501L4093M0475M7206N3035N7215O0156O2745O5758
$$ y = [4304375, 4354071, 4420253, 4502127, 4599786, 4713524, 4843075, 4987902, 5147654, 5321573, 5507517, 5702047, 5901330, 6101468, 6298005, 6485717, 6659140, 6813028, 6942160, 7041267, 7105831, 7133224, 7122958, 7075901, 6993470, 6877606, 6731195, 6558194, 6363302, 6151606, 5928285, 5698140, 5465028, 5231817, 5001090, 4775787, 4558918, 4352652, 4157992, 3975383, 3805382, 3648545, 3504934, 3374113, 3255620, 3149146, 3054243, 2970128, 2895974, 2831197, 2775218, 2727086, 2685685, 2650376, 2621163, 2598087, 2580681, 2568303, 2560829, 2558552, 2561374, 2568543, 2579493, 2594514, 2614039, 2637313, 2662281, 2686837, 2709756, 2730425, 2748502, 2764541, 2780587, 2799355, 2822682, 2851183, 2885276, 2925751, 2972957, 3025992, 3083207, 3143363, 3206108, 3271866]
59394C271866P0154P7081Q6984R9057J12118J25881J40898J57584J75896J95857
59384D513376K17803K42004K68384K96674L26493L57154L87814M17829M46571
59375G474102M72735M94142N08528N14491N11768N01051M83676M61107M34380
59366A1855980M04252L71832L38563L05253K71676K37434K02800J68149J32946
59357A4288885R6062N6995J6179k5884o9112j13203j57025j98983k37758k72701
59347A3383455l03715l30935l54338l73740l89397m02267m13082m21245m25313
59338I969423m24722m20349m13153m03029l89548l73140l54861l35350l14697
59329F540574k93181k71430k49897k28734k08115j88210j68865j49894j31639
$$ y = [3271866, 3342020, 3419101, 3506085, 3605142, 3717260, 3843141, 3984039, 4141623, 4317519, 4513376, 4731179, 4973183, 5241567, 5538241, 5864734, 6221888, 6609702, 7027531, 7474102, 7946837, 8440979, 8949507, 9463998, 9975766, 10476817, 10960493, 11421600, 11855980, 12260232, 12632064, 12970627, 13275880, 13547556, 13784990, 13987790, 14155939, 14288885, 14384947, 14441942, 14458121, 14432237, 14363125, 14249922, 14092897, 13893914, 13656156, 13383455, 13079740, 12748805, 12394467, 12020727, 11631330, 11229063, 10815981, 10394736, 9969423, 9544701, 9124352, 8711199, 8308170, 7918622, 7545482, 7190621, 6855271, 6540574, 6247393, 5975963, 5726066, 5497332, 5289217, 5101007, 4932142, 4782248, 4650609]
59320D650609j14731r9262q4735p0891n8009m6242l5320k5191j6318q931k572
59309D088407L112P570J0024J0611J0168R152P511N496L687K032k53l448o674
59296D147395q965j0382j1418j1781j0633p820m055K57N644J2778K1567L1351
59284D153938M1578N1983O2460P3148Q4362R6067J07532J17824J26548J33670
59274E049110J38712J40505J37889J30487J18729J03441Q5603O6313M6574K6979
59264F044342P705j1051k8761m4781n8806p0846q0732q8002r2519r4963r6369
59253E385217r7269r7512r6812r5094r2476q9363q6439q3961q1052p6371o9700
59242D419168o2166n4731m7168l8904k9969k0362r300L869J8501L3500M9057O6391
$$ y = [4650609, 4535878, 4436616, 4351881, 4280990, 4222981, 4176739, 4141419, 4116228, 4099910, 4090979, 4088407, 4091519, 4099089, 4109113, 4119724, 4129892, 4139044, 4146555, 4152051, 4155738, 4157770, 4157517, 4154069, 4147395, 4138430, 4128048, 4116630, 4104849, 4094216, 4086396, 4082341, 4082598, 4088242, 4101020, 4122587, 4153938, 4195516, 4247499, 4309959, 4383107, 4467469, 4563536, 4671068, 4788892, 4915440, 5049110, 5187822, 5328327, 5466216, 5596703, 5715432, 5818873, 5904476, 5970789, 6017363, 6044342, 6052047, 6040996, 6012235, 5967454, 5908648, 5837802, 5757070, 5669068, 5576549, 5481586, 5385217, 5287948, 5190436, 5093624, 4998530, 4906054, 4816691, 4730252, 4646291, 4565239, 4488868, 4419168, 4357002, 4302271, 4255103, 4216199, 4186230, 4165868, 4156568, 4160437, 4178938, 4212438, 4261495, 4327886]
59230D327886Q5862J06554J27961J50831J75784K02021K28115K53245K76945K98179
59220F233383L15417L27298L32523L29372L16177K92237K57974K14311J62426
59211H781118J03987M1183k3564q7661j48371k03173k50262k88675l18158l39099
59201G267325l52265l58268l57492l50667l39066l23794l05282k83998k61244
59192D335249k38588k16794j95895j76170j58190j41983j26926j12701r9731q8381
59182B779890p8343o9101o0611n3049m6247l9749l3321k7153k1619j6960j3103
59171B320634r637o060k175J837N683R204J2461J5708J9212K2854K6159K8957
59159B444837L1837L5369L9052M1696M2928M3610M4529M5332M5228M4103M2318
$$ y = [4327886, 4413748, 4520302, 4648263, 4799094, 4974878, 5176899, 5405014, 5658259, 5935204, 6233383, 6548800, 6876098, 7208621, 7537993, 7854170, 8146407, 8404381, 8618692, 8781118, 8885105, 8926288, 8902724, 8815063, 8666692, 8463519, 8213257, 7924582, 7606424, 7267325, 6915060, 6556792, 6199300, 5848633, 5509567, 5185773, 4880491, 4596493, 4335249, 4096661, 3879867, 3683972, 3507802, 3349612, 3207629, 3080703, 2968002, 2868271, 2779890, 2701547, 2632446, 2571835, 2518786, 2472539, 2432790, 2399469, 2372316, 2350697, 2333737, 2320634, 2310997, 2304937, 2302762, 2304599, 2310282, 2319486, 2331947, 2347655, 2366867, 2389721, 2415880, 2444837, 2476674, 2512043, 2551095, 2592791, 2635719, 2679329, 2723858, 2769190, 2814418, 2858521, 2900839]
59148B900839L9738L5861L0819K5553K0748J6065J0801N015m17m843q471j1801
59136C059907j4684j6423j6782j6383j5733j4317j1246o629j555L309Q410J4371
59124B972245K1015K7822L4806M2393N0673N9273O7839P6276Q4640R3102J01871
59113C631955J10889J19817J28546J37349J46226J54553J61811J68236J74123
59104D933505J78901J81638J82174J80828J77024J69182J56147J37891J14631
59095F411921Q6273N3259J7242j9739n6301r1495j24156j53198j78187j98987
59085E746632k15172k26406k33120k36129k35721k31799k24834k15959k06039
59076C721453j95284j83824j72093j60412j48744j37158j26072j15776j06101
$$ y = [2900839, 2940577, 2976438, 3007257, 3032810, 3053558, 3069623, 3080424, 3085439, 3085022, 3080179, 3071708, 3059907, 3045223, 3028800, 3012018, 2995635, 2979902, 2965585, 2954339, 2947710, 2946155, 2949464, 2957874, 2972245, 2993260, 3021082, 3055888, 3098281, 3148954, 3208227, 3276066, 3352342, 3436982, 3530084, 3631955, 3742844, 3862661, 3991207, 4128556, 4274782, 4429335, 4591146, 4759382, 4933505, 5112406, 5294044, 5476218, 5657046, 5834070, 6003252, 6159399, 6297290, 6411921, 6498194, 6551453, 6568695, 6548956, 6492655, 6401160, 6277004, 6123806, 5945619, 5746632, 5531460, 5305054, 5071934, 4835805, 4600084, 4368285, 4143451, 3927492, 3721453, 3526169, 3342345, 3170252, 3009840, 2861096, 2723938, 2597866, 2482090, 2375989]
59067B375989r6888q8397q0924p4231o7802o1514n5722n0752m6611m3118m0001
59056A670029l6887l3500l0033k7113k5149k3824k2446k0809j9466j8967j9034
59045A392801j8779j7746j6352j5168j4174j2947j1362r671q083o622n328m231
59033A252338l109j670J39K270M860P902J0747J2513J3101J3252J3482J3534J3034
59020A352393J2083J0884R395P750O566O248O407O407O167N969N835N695N779
59007A447578O284O828O880O584O475O527O149N155M054L239K478J458L50m06
58993A509633o03m48m52j059j948j928j89K361L804L522L028M023O272Q090Q550
58978A542656Q442R075J0725J2521J3553J3858J4257J5351J6858J8112J8980J9937
$$ y = [2375989, 2279101, 2190704, 2109780, 2035549, 1967747, 1906233, 1850511, 1799759, 1753148, 1710030, 1670029, 1633142, 1599642, 1569609, 1542496, 1517347, 1493523, 1471077, 1450268, 1430802, 1411835, 1392801, 1374022, 1356276, 1339924, 1324756, 1310582, 1297635, 1286273, 1276602, 1268519, 1261897, 1256569, 1252338, 1249229, 1247559, 1247698, 1249968, 1254828, 1262730, 1273477, 1285990, 1299091, 1312343, 1325825, 1339359, 1352393, 1364476, 1375360, 1384755, 1392505, 1399071, 1405319, 1411726, 1418133, 1424300, 1430269, 1436104, 1441799, 1447578, 1453862, 1460690, 1467570, 1474154, 1480629, 1487156, 1493305, 1498460, 1502514, 1505753, 1508231, 1509689, 1510039, 1509633, 1509030, 1508582, 1508130, 1507071, 1505123, 1503195, 1503006, 1505367, 1509171, 1512693, 1515721, 1519744, 1526016, 1534106, 1542656, 1551098, 1560173, 1570898, 1583419, 1596972, 1610830, 1625087, 1640438, 1657296, 1675408, 1694388, 1714325]
58966A714325K1302K2862K4258K5335K6055K6535K7242K8572L0099L0871L0759
58955B008215L0847L2060L3969L5582L6765L8208M0262M2581M4800M6917M9052
58944B439258N1378N4300N8157O2784O7764P3055P8804Q4691R0131R5245J01003
58933C256570J08161J16537J25616J35336J45930J57382J69506J82410J96464
58924D593912K11882K28574K46440K65525K85965L07867L31315L56432L83310
58915G211222M11885M41765M72267N02529N31605N58458N81976O00991O13977
58906A1926675O18630O12173N92472N58779N11172M49696L74699K87907J92603
58897A6124806R2563q784j08164k02234k88148l64149m29370m83206n25169n55170
$$ y = [1714325, 1735627, 1758489, 1782747, 1808082, 1834137, 1860672, 1887914, 1916486, 1946585, 1977456, 2008215, 2039062, 2071122, 2105091, 2140673, 2177438, 2215646, 2255908, 2298489, 2343289, 2390206, 2439258, 2490636, 2544936, 2603093, 2665877, 2733641, 2806696, 2885500, 2970191, 3060322, 3155567, 3256570, 3364731, 3481268, 3606884, 3742220, 3888150, 4045532, 4215038, 4397448, 4593912, 4805794, 5034368, 5280808, 5546333, 5832298, 6140165, 6471480, 6827912, 7211222, 7623107, 8064872, 8537139, 9039668, 9571273, 10129731, 10711707, 11312698, 11926675, 12545305, 13157478, 13749950, 14308729, 14819901, 15269597, 15644296, 15932203, 16124806, 16217369, 16208585, 16100421, 15898187, 15610039, 15245890, 14816520, 14333314, 13808145, 13252975]
58887A3252975n73720n81881n81110n72935n58605n39089n15420m88802m60333
58878H381080m30922m01544l73203l46384l20970k97012k75143k55745k38071
58869E442086k20894k03969j88096j73734j60378j47573j35785j25565j16478
58860C969614j07565r8602r0118q2300p4689o7069n9771n2891m5956l8862l2340
58849C219451k6869k1715j5892r606l771J640P646J4534K1272K7022L2259L7832
58837C283803M3767M9718N5983O3104P0839P8381Q5450R2493R9941J07959J16839
58826D148277J26953J38239J50325J63240J77425J93036K09785K27594K46836
58817E781710K67816K90534L15147L42015L70941M00893M30854M60602M90188
$$ y = [13252975, 12679255, 12097374, 11516264, 10943329, 10384724, 9845635, 9330215, 8841413, 8381080, 7950158, 7548614, 7175411, 6829027, 6508057, 6211045, 5935902, 5680157, 5442086, 5221192, 5017223, 4829127, 4655393, 4495015, 4347442, 4211657, 4086092, 3969614, 3862049, 3763447, 3673329, 3591029, 3516340, 3449271, 3389500, 3336609, 3290653, 3251791, 3219451, 3192582, 3170867, 3154975, 3145369, 3141598, 3143238, 3150884, 3165418, 3186690, 3213712, 3245971, 3283803, 3327570, 3377288, 3433271, 3496375, 3567214, 3645595, 3731045, 3823538, 3923479, 4031438, 4148277, 4275230, 4413469, 4563794, 4727034, 4904459, 5097495, 5307280, 5534874, 5781710, 6049526, 6340060, 6655207, 6997222, 7368163, 7769056, 8199910, 8660512, 9150700]
58808I150700N18977N45517N68103N84878N93600N91914N78013N50865N09746
58799A4192313M54076L84044L01374K09273J11463J1278q8382j84455k73596l52930
58789A4764458m20878m77091n21702n54884n76992n88758n91276n85844n73820
58780I873213n56394n34562n09412m82240m54082m25384l96545l68565l42552
58771E803477l18646k96050k74285k53766k34986k17751k01691j86955j73819
58762C645528j61907j50413j38987j27994j17919j08860j00598r2881q5598p8813
58752B481558p2619o6885o1367n6092n1369m7241m3331l9396l5744l2740l0316
58741A944458k8343k7108k6770k6603k5536k3527k1748k1219k1750k2437k2723
$$ y = [9150700, 9669677, 10215194, 10783297, 11368175, 11961775, 12553689, 13131702, 13682567, 14192313, 14646389, 15030433, 15331807, 15541080, 15652543, 15663821, 15575439, 15390984, 15117388, 14764458, 14343580, 13866489, 13344787, 12789903, 12212911, 11624153, 11032877, 10447033, 9873213, 9316819, 8782257, 8272845, 7790605, 7336523, 6911139, 6514594, 6146029, 5803477, 5484831, 5188781, 4914496, 4660730, 4425744, 4207993, 4006302, 3819347, 3645528, 3483621, 3333208, 3194221, 3066227, 2948308, 2839448, 2738850, 2645969, 2560371, 2481558, 2408939, 2342054, 2280687, 2224595, 2173226, 2125985, 2082654, 2043258, 2007514, 1974774, 1944458, 1916115, 1889007, 1862237, 1835634, 1810098, 1786571, 1764823, 1743604, 1721854, 1699417, 1676694]
58730A676694k2604k2198k1583k0971k0640k0646k0786k0818k0673k0512k0706
58719A444557k1591k3069k4518k5263k5122k4414k3519k2603k1696k0831j9996
58708A191935j9169j8490j8280j8664j9224j9203j8233j6761j5571j4978j4621
58697I98741j4174j3853j4008j4343j4007j2632j0921r896r648r277q011o087
58685H61884m316l087k160j260n26k65n16r94j351j410j191q16l53J63N59M86
58669H44847k33j289k151k630k889k976k667j932j249j246k119l465m479m398
58655H11124l106j389k42J76N29J199J822K134K617L823N524P160Q644J0127J1372
58640H61514J2156J2967J4493J6558J8424K0024K1967K4269K6119K7275K8712
$$ y = [1676694, 1654090, 1631892, 1610309, 1589338, 1568698, 1548052, 1527266, 1506448, 1485775, 1465263, 1444557, 1422966, 1399897, 1375379, 1350116, 1324994, 1300580, 1277061, 1254458, 1232762, 1211931, 1191935, 1172766, 1154276, 1135996, 1117332, 1098108, 1078905, 1060672, 1043911, 1028340, 1013362, 998741, 984567, 970714, 956706, 942363, 928356, 915724, 904803, 894907, 885259, 875982, 867971, 861884, 857568, 854481, 852321, 851061, 850535, 850270, 849754, 848760, 847409, 845999, 844808, 843992, 843639, 843802, 844361, 844847, 844614, 843325, 841174, 838544, 835655, 832679, 830012, 828080, 826831, 825585, 823466, 820001, 815522, 811124, 808018, 806629, 806387, 806563, 807092, 808291, 810113, 812247, 814864, 818687, 824211, 831371, 840015, 850142, 861514, 873670, 886637, 901130, 917688, 936112, 956136, 978103, 1002372, 1028491, 1055766, 1084478]
58629A084478L1422L5180L9126M2943M6874N0991N5201N9775O5298P2045P9739
58618A663072Q7877R6149J04630J13701J23650J34272J44991J55363J65028J73226
58608B961959J78818J80933J79124J72784J61038J43608J21190R4656O4542L1853
58598D290505j183l2069n9570q3650j04220j20773j33248j42403j48971j52915
58588C311503j53875j51944j47727j41905j35035j27551j19597j10957j01443
58579B121469r1499q2160p4194o7367o0805n4087m7734m2474l8357l4903l1854
58568A496035k9331k7423k6015k4993k4189k3302k2360k2040k2824k3954k4067
58557A225537k3005k2052k2075k2391k2011k1024j9992j8719j6712j4368j2691
$$ y = [1084478, 1115900, 1151080, 1190206, 1233149, 1280023, 1331014, 1386215, 1445990, 1511288, 1583333, 1663072, 1750949, 1847098, 1951728, 2065429, 2189079, 2323351, 2468342, 2623705, 2788733, 2961959, 3140777, 3321710, 3500834, 3673618, 3834656, 3978264, 4099454, 4194110, 4258652, 4290505, 4289322, 4257253, 4197683, 4114033, 4009813, 3889040, 3755792, 3613389, 3464418, 3311503, 3157628, 3005684, 2857957, 2716052, 2581017, 2453466, 2333869, 2222912, 2121469, 2029970, 1947810, 1873616, 1806249, 1745444, 1691357, 1643623, 1601149, 1562792, 1527889, 1496035, 1466704, 1439281, 1413266, 1388273, 1364084, 1340782, 1318422, 1296382, 1273558, 1249604, 1225537, 1202532, 1180480, 1158405, 1136014, 1114003, 1092979, 1072987, 1054268, 1037556, 1023188, 1010497]
58546A010497j2006j1797j1619j1312j0447q573o112m210l476l505l700l894l992
58533I15854l782l415l465m077m627m634m582n243o547p683q240q656r494j0697
58519H30712j1725j2173j2015j1390j0482r556q835q226p333o005m677l890l575
58506G20830l205k613k197k163k077j489o16L7M07P81J122J085O35K41L09P75
58490G11862J403K198L213M115M294L595K681K367K616K666K215J941K459L338
58476G50963L781L875M243M722M497L570K960L074L035K076O41n78j720l073m153
58461G77913m411m232m288m473m393m371m937n645n534m504l255k111q84J99N17
58446G25591M2n87r51r79l48J232L074L915L508K991L376M463N456N907N754N091
$$ y = [1010497, 998491, 986694, 975075, 963763, 953316, 944743, 938631, 934421, 930945, 927440, 923740, 919846, 915854, 912072, 908657, 905192, 901115, 896488, 891854, 887272, 882029, 875482, 867799, 859559, 850903, 841409, 830712, 818987, 806814, 794799, 783409, 772927, 763371, 754536, 746310, 738977, 732972, 728295, 724405, 720830, 717625, 715012, 712815, 710652, 708575, 707086, 706470, 706507, 706914, 707695, 708817, 709902, 710537, 710778, 711087, 711862, 713265, 715463, 718676, 722791, 727085, 730680, 733361, 735728, 738344, 741010, 743225, 745166, 747625, 750963, 754744, 758619, 762862, 767584, 772081, 775651, 778611, 781685, 784720, 786796, 787437, 786859, 785139, 782066, 777913, 773502, 769270, 764982, 760509, 756116, 751745, 746808, 741163, 735629, 731125, 727870, 725759, 724875, 725074, 725591, 725633, 725046, 724095, 723116, 722768, 724000, 727074, 730989, 734497, 737488, 740864, 745327, 750783, 756690, 762444, 767535]
58430G67535M258L642L245K889K794L316M140M472M129L690L535L540L813M743
58416H19741O119P136P587Q120Q976R481R306R185R653J0006R453Q524Q206Q177
58402I39670P131M775K376J133Q22M30m76j416j731j225k26P29J231J207R45R30
58386I56305J489K473L379L897M198M539M819M791M573M505M637M724M705M786
58372A013820N113N663O481P642R005J0265J1129J1309J0572R278Q509R036J0316
58359A128138J1083J0845J0203R803R661R588R568R640R800J0127J0527J0509
58347A249492R769Q797Q333Q313Q112P600P155O797O320O186P222R195J0788J1301
58333A365380J1428J1987J2856J3672J4623J5913J7190J8117J8918J9743K0161
$$ y = [767535, 771793, 775435, 778680, 781569, 784363, 787679, 791819, 796291, 800420, 804110, 807645, 811185, 814998, 819741, 825860, 832996, 840583, 848703, 857679, 867160, 876466, 885651, 895304, 905310, 914763, 923287, 931493, 939670, 946801, 951576, 953952, 955085, 955907, 956337, 955861, 954445, 952714, 951489, 951263, 951992, 953223, 954430, 955375, 956305, 957794, 960267, 963646, 967543, 971741, 976280, 981099, 985890, 990463, 994968, 999605, 1004329, 1009034, 1013820, 1018933, 1024596, 1031077, 1038719, 1047724, 1057989, 1069118, 1080427, 1090999, 1100277, 1108786, 1117822, 1128138, 1139221, 1150066, 1160269, 1170072, 1179733, 1189321, 1198889, 1208529, 1218329, 1228456, 1238983, 1249492, 1259261, 1268058, 1276391, 1284704, 1292816, 1300416, 1307571, 1314368, 1320688, 1326874, 1334096, 1343291, 1354079, 1365380, 1376808, 1388795, 1401651, 1415323, 1429946, 1445859, 1463049, 1481166, 1500084, 1519827, 1539988]
58322A539988J9883J9491J9795K0769K1666K1923K1578K1045K0785K0983K1359
58311A769265K1539K1616K1884K2106K1652K0526J9559J9402J9953K0870K2057
58300B000429K3289K4094K4385K4682K5447K6656K8150K9857L1549L2895L3966
58289B305399L5074L6153L6933L7691L9005M0741M2161M3197M4630M6839M9296
58278B757119N1585N3951N6485N8685O0316O1905O3951O6274O8462P0294P1601
58267C440628P2377P3197P4742P6814P8621Q0016Q1595Q3564Q5573Q7667R0323
58256D325117R3487R6649R9876J03705J08146J12943J18480J25076J31730J37295
58246E452504J42551J49197J57010J64225J70719J78238J87265J96248K04456
$$ y = [1539988, 1559871, 1579362, 1599157, 1619926, 1641592, 1663515, 1685093, 1706138, 1726923, 1747906, 1769265, 1790804, 1812420, 1834304, 1856410, 1878062, 1898588, 1918147, 1937549, 1957502, 1978372, 2000429, 2023718, 2047812, 2072197, 2096879, 2122326, 2148982, 2177132, 2206989, 2238538, 2271433, 2305399, 2340473, 2376626, 2413559, 2451250, 2490255, 2530996, 2573157, 2616354, 2660984, 2707823, 2757119, 2808704, 2862655, 2919140, 2977825, 3038141, 3100046, 3163997, 3230271, 3298733, 3369027, 3440628, 3513005, 3586202, 3660944, 3737758, 3816379, 3896395, 3977990, 4061554, 4147127, 4234794, 4325117, 4418604, 4515253, 4615129, 4718834, 4826980, 4939923, 5058403, 5183479, 5315209, 5452504, 5595055, 5744252, 5901262, 6065487, 6236206, 6414444, 6601709, 6797957, 7002413]
58237G002413K13014K22380K31479K40279K50672K63542K77486K91623L07168
58228I300056L24982L44135L64230L86606M11799M38451M66287M97508N33573
58219A3067627N73365O16192O63784P17546P76885Q42174R16272J001187J096602
58210B0271634J203909J328132J473824J643298J841681K079344K366372K709191
58202C4917385L115558L596914M161454M811614N556013O421645P451250Q693756
58194G8725589J0197673J1999299J4106418J6499899J9144432K1941747K4596395
58187A97211452K6502615K6822697K4792925K0099258J3115721M890535l140206
58180C10294997r650951j3939322j6148957j7029790j7406803j7751177j8107397
$$ y = [7002413, 7215427, 7437807, 7669286, 7909565, 8160237, 8423779, 8701265, 8992888, 9300056, 9625038, 9969173, 10333403, 10720009, 11131808, 11570259, 12036546, 12534054, 13067627, 13640992, 14257184, 14920968, 15638514, 16415399, 17257573, 18173845, 19175032, 20271634, 21475543, 22803675, 24277499, 25920797, 27762478, 29841822, 32208194, 34917385, 38032943, 41629857, 45791311, 50602925, 56158938, 62580583, 70031833, 78725589, 88923262, 100922561, 115028979, 131528878, 150673310, 172615057, 197211452, 223714067, 250536764, 275329689, 295428947, 308544668, 313435203, 310294997, 300644046, 286704724, 270555767, 253525977, 236119174, 218367997, 200260600]
58173B00260600j8295149j8133705j7538305j6514213j5129660j3497192j1749309
58166H9403067j0004233q340878o798464n391889m121296k970897j916065r52577
58158D8906768j29350M50393O70997M66520j29018r67177j822550k479632k827534
58149D2139417k897861k816571k710679k642134k604905k563250k487820k367366
58141B1048831k203347k003736j782085j556243j342510j149997r81310q37124
58133I192479p17688o20993n42866m79647m28917l87715l52526l21475k94455
58124E046197k70700k48429k27210k08386j92404j77775j63406j49962j38233
58115C269692j28053j19548j13530j09758j06533j02783r8906r5047r0394q4921
$$ y = [200260600, 181965451, 163831746, 146293441, 129779228, 114649568, 101152376, 89403067, 79398834, 71057956, 64259492, 58867603, 54746307, 51775410, 49859345, 48906768, 48777418, 49227811, 49898808, 50365328, 50236310, 49269133, 47446583, 44966951, 42139417, 39241556, 36424985, 33714306, 31072172, 28467267, 25904017, 23416197, 21048831, 18845484, 16841748, 15059663, 13503420, 12160910, 11010913, 10029603, 9192479, 8474791, 7853798, 7310932, 6831285, 6402368, 6014653, 5662127, 5340652, 5046197, 4775497, 4527068, 4299858, 4091472, 3899068, 3721293, 3557887, 3407925, 3269692, 3141639, 3022091, 2908561, 2798803, 2692270, 2589487, 2490581, 2395534, 2305140, 2220219]
58105B220219p9912p5960p2179o8128o4565o1576n7961n3485m9726m7428m5017
58094A544282m1113l6743l3558l1515k9829k8723k8569k8486k7536k6243k5566
58083A206401k5259k4626k3882k3582k3487k3292k3388k3776k3289k1244j8818
58072I51758j7491j7006j6264j5213j4433j3651j2282j0775r934r459q536p395
58060G99319o853o857o832p006p925q980q856p427n916n215n191n512o010o249
58046G04490n823n145n073n598n757m899l383j968j100p61n13J74J245J972J953
58031F69814J725J877K096J852J441J460J585R57m42j633j900j483j051j104j773
58016F73421k702l214l072k795k872l065l029l123l866m947n629n792n831n732
$$ y = [2220219, 2140307, 2064347, 1992168, 1924040, 1859475, 1797899, 1739938, 1686453, 1636727, 1589299, 1544282, 1503169, 1466426, 1432868, 1401353, 1371524, 1342801, 1314232, 1285746, 1258210, 1231967, 1206401, 1181142, 1156516, 1132634, 1109052, 1085565, 1062273, 1038885, 1015109, 991820, 970576, 951758, 934267, 917261, 900997, 885784, 871351, 857700, 845418, 834643, 824709, 815250, 806714, 799319, 792466, 785609, 778777, 771771, 763846, 754866, 746010, 738583, 732667, 727452, 722261, 716749, 710739, 704490, 698667, 693522, 688449, 682851, 677094, 672195, 668812, 666844, 665744, 664983, 664470, 664644, 665889, 667861, 669814, 671539, 673416, 675512, 677364, 678805, 680265, 681850, 682807, 682365, 680732, 678832, 677349, 676298, 675194, 673421, 670719, 667505, 664433, 661638, 658766, 655701, 652672, 649549, 645683, 640736, 635107, 629315, 623484, 617752]
58002F17752n138m169l371k871k328j722j434j459j231m75K73K40o92j867k450
57987E89058k185j561j119p38N8J059J380O75l11p38n83j73M36J042R98Q9q33
57970E86554q62k33K89N96J063J479J183J07j124k006k465k542k444k675l513
57955E73407m509n091n414o005o801p227o986o160m767k879j046J02N43P47J065
57940E18979J671K711L983M761M585L870L162K252P02j237k998m606o340p838
57926E23657q442q193p675p050o174n379n248n683n970n700m854l354j329M58
57912D49064J403K061L336M901N620N400N357O073O858O955O415N512M369L437
57898E16761L301L667L448K281J007L48k3o68j565k560l788n100n802n596n101
$$ y = [617752, 612614, 608445, 605074, 602203, 599875, 598153, 596719, 595260, 594029, 593554, 593827, 594067, 593375, 591508, 589058, 586873, 585312, 584193, 583455, 583513, 584572, 585952, 586627, 586316, 585578, 584995, 584822, 585258, 586300, 587298, 587387, 586554, 585692, 585459, 585748, 586344, 587407, 588886, 590069, 590176, 589052, 587046, 584581, 582039, 579595, 576920, 573407, 568898, 563807, 558393, 552388, 545587, 538360, 531374, 525214, 520447, 517568, 516522, 516624, 517167, 517914, 518979, 520650, 523361, 527344, 532105, 536690, 540560, 543722, 545974, 546676, 545439, 542441, 537835, 531495, 523657, 515215, 507022, 499347, 492297, 486123, 480744, 475496, 469813, 463843, 458143, 453289, 449935, 448606, 449064, 450467, 452528, 455864, 460765, 466385, 471785, 477142, 483215, 490073, 497028, 503443, 508955, 513324, 516761, 520062, 523729, 527177, 529458, 530465, 530813, 530790, 530122, 528557, 525997, 522209, 517109, 511307, 505711, 500610]
57883E00610m996n159n107m698l998l061k251k164k708k880j959m27Q56J786K772
57868D66616L765M350M514M704N139N548N626N449N295N302N255M843M078L273
57854E33757K463J243m12j624j686j357k026l664m708m306l524l806n077o121
57840D99152o154n320m141l237l143l729m114l681k892k609k927l297l465l696
57826D46747m129m562m852n138n540n899n892n332m475m006m401n239n540m930
57812C76812m060l647l507k953j753l80N07N78O9k47L71J840L299M141M698N626
57796C81394O935P858P610O064L988K527K299K905L640M385N329O084O015N453
57782D52486N454O099O125M757K838J453M20r13k248k839k892l245m034m638m752
$$ y = [500610, 495614, 490455, 485348, 480650, 476652, 473591, 471340, 469176, 466468, 463588, 461629, 461202, 462058, 463844, 466616, 470381, 474731, 479245, 483949, 489088, 494636, 500262, 505711, 511006, 516308, 521563, 526406, 530484, 533757, 536220, 537463, 537051, 535427, 533741, 532384, 530358, 526694, 521986, 517680, 514156, 510350, 505273, 499152, 492998, 487678, 483537, 480300, 477157, 473428, 469314, 465633, 462741, 460132, 457205, 453908, 450443, 446747, 442618, 438056, 433204, 428066, 422526, 416627, 410735, 405403, 400928, 396922, 392521, 387282, 381742, 376812, 372752, 369105, 365598, 362645, 360892, 360512, 361019, 361597, 361666, 361419, 361790, 363630, 366929, 371070, 375768, 381394, 388329, 396187, 403797, 409861, 413849, 416376, 418675, 421580, 425220, 429605, 434934, 441018, 447033, 452486, 457940, 464039, 470164, 474921, 477759, 479212, 479632, 478719, 476471, 473632, 470740, 467495, 463461, 458823, 454071]
57767D54071m557m025l011j917j338j120o36J05N64Q05J472K600L435L707M091
57752D54246N012N924O260O305O610P103P424P579P711P596P056O517O575P123
57738E49041P454P178O589O150O022O122O333O554O681O719O776O972P390Q065
57724F44046Q916R704J0221J0532J0937J1592J2222J2382J2068J1922J2560J3776
57712G80878J4772J5236J5784J7138J9204K1299K2924K4004K4731K5642K7524
57701A009136L0625L4125L6977L9170M1539M4483M7672N1004N4963N9777O5035
57690A514506P0633P7295Q5595R5058J04866J14996J25947J37782J50107J62617
57680B639402J74746J85043J91825J94534J93632J89133J80236J66731J49939
$$ y = [454071, 449514, 445489, 442478, 440561, 439223, 438103, 437467, 437572, 438136, 438941, 440413, 443013, 446448, 450155, 454246, 459258, 465182, 471442, 477747, 484357, 491460, 498884, 506463, 514174, 521770, 528826, 535343, 541918, 549041, 556495, 563673, 570262, 576412, 582434, 588556, 594889, 601443, 608124, 614843, 621619, 628591, 635981, 644046, 652962, 662666, 672887, 683419, 694356, 705948, 718170, 730552, 742620, 754542, 767102, 780878, 795650, 810886, 826670, 843808, 863012, 884311, 907235, 931239, 955970, 981612, 1009136, 1039761, 1073886, 1110863, 1150033, 1191572, 1236055, 1283727, 1334731, 1389694, 1449471, 1514506, 1585139, 1662434, 1748029, 1843087, 1947953, 2062949, 2188896, 2326678, 2476785, 2639402, 2814148, 2999191, 3191016, 3385550, 3579182, 3768315, 3948551, 4115282, 4265221]
57671D265221J31633J12537R2235O9763M3564J1578k7094p0074j11923j46920
57661D370520j71819j86436j92550j92744j89605j84954j79261j71883j62130
57652B739138j50192j37093j23765j10321r6432q2342o9142n7802m8196l9421
57642A824432l0860k2581j4842p751j473L791Q315J3024J8822K5815L3343M0663
57630A890698M7503N4124O0954O8179P5752Q3820R2887J03154J13806J23449J31225
57619B845551J36990J40555J41246J38408J31634J20363J04022Q2928N8514L2246
57609C932457N006k2142m7409o9369q8007j03867j16686j25787j31379j34431
57599C098386j35445j34307j31231j26821j21162j13871j05306r6731q8971q1632
$$ y = [4265221, 4396854, 4509391, 4601626, 4671389, 4714953, 4726531, 4699437, 4629363, 4517440, 4370520, 4198701, 4012265, 3819715, 3626971, 3437366, 3252412, 3073151, 2901268, 2739138, 2588946, 2451853, 2328088, 2217767, 2121335, 2038993, 1969851, 1912049, 1863853, 1824432, 1793572, 1770991, 1756149, 1748398, 1746925, 1750716, 1759031, 1772055, 1790877, 1816692, 1850035, 1890698, 1938201, 1992325, 2053279, 2121458, 2197210, 2281030, 2373917, 2477071, 2590877, 2714326, 2845551, 2982541, 3123096, 3264342, 3402750, 3534384, 3654747, 3758769, 3841697, 3900211, 3932457, 3937463, 3915321, 3867912, 3798543, 3710536, 3606669, 3489983, 3364196, 3232817, 3098386, 2962941, 2828634, 2697403, 2570582, 2449420, 2335549, 2230243, 2133512, 2044541, 1962909]
57589A962909p4071o6484n9608n3811m8903m4417l9885l5162l0687k7028k4089
57578A458764k1271j8402j5922j4021j2258j0269q252o526n074l797k686j618
57566A338668m51N95J289K161M028O607Q554R276R756J1012J2621J3629J4119
57553A431864J4943J6354J7835J9052K0228K1631K3256K4934K6391K7469K8585
57542A672542L0595L3773L7411M0796M4097M7843N2067N6595O1698O7685P4286
57531B219388Q0986Q7724R4603J01338J07614J13575J19206J23565J25351J24001
57521C297351J19571J11899J00614Q5752O7758M7215K5184L404j6686l4798n1012
57510C756252o4661p4930q2110q7151r0250r1014q9718q7198q3529p8176p1482
$$ y = [1962909, 1888838, 1822354, 1762746, 1708935, 1660032, 1615615, 1575730, 1540568, 1509881, 1482853, 1458764, 1437493, 1419091, 1403169, 1389148, 1376890, 1366621, 1358369, 1351843, 1346769, 1342972, 1340286, 1338668, 1338217, 1338812, 1340101, 1342262, 1346290, 1352897, 1361451, 1370727, 1380483, 1391495, 1404116, 1417745, 1431864, 1446807, 1463161, 1480996, 1500048, 1520276, 1541907, 1565163, 1590097, 1616488, 1643957, 1672542, 1703137, 1736910, 1774321, 1815117, 1859214, 1907057, 1959124, 2015719, 2077417, 2145102, 2219388, 2300374, 2388098, 2482701, 2584039, 2691653, 2805228, 2924434, 3047999, 3173350, 3297351, 3416922, 3528821, 3629435, 3715187, 3782945, 3830160, 3855344, 3858748, 3842062, 3807264, 3756252, 3691591, 3616661, 3534551, 3447400, 3357150, 3266136, 3176418, 3089220, 3005691, 2927515, 2856033]
57499B856033o4757n8562n2208m5296l8567l2654k7023k0950j4753r302m791o65
57487B486505L537P775J1686J4987J7896K1118K4967K8743L1738L4605L8761M4371
57475B766689N0152N5326O0541O6406P2448P8269Q4586R2027R9817J06752J12813
57464C645826J18616J23638J26159J24870J19703J11084R9195Q4015O5692M4814
57454D663612K2676R66j9138l7326n3268o6046p5036q0891q4874q7445q8187q6849
57442D008194q3710p9075p3160o6456n9543n2598m5505l8409l1639k5200j8961
57431C433938j3167q209m012k14L093N553P451R679J2612J5602J7799J9021J9645
57418C518791K0037K0442K1045K1856K2675K3294K3665K3909K4317K5206K6504
$$ y = [2856033, 2791276, 2732714, 2680506, 2635210, 2596643, 2563989, 2536966, 2516016, 2501263, 2491961, 2487170, 2486505, 2490042, 2497817, 2509503, 2524490, 2542386, 2563504, 2588471, 2617214, 2648952, 2683557, 2722318, 2766689, 2816841, 2872167, 2932708, 2999114, 3071562, 3149831, 3234417, 3326444, 3426261, 3533013, 3645826, 3764442, 3888080, 4014239, 4139109, 4258812, 4369896, 4469091, 4553106, 4618798, 4663612, 4686288, 4687254, 4668116, 4630790, 4577522, 4511476, 4436440, 4355549, 4270675, 4183230, 4095043, 4008194, 3924484, 3845409, 3772249, 3705793, 3646250, 3593652, 3548147, 3509738, 3478099, 3452899, 3433938, 3420771, 3412562, 3408550, 3408336, 3411429, 3416982, 3424433, 3434112, 3446724, 3462326, 3480125, 3499146, 3518791, 3538828, 3559270, 3580315, 3602171, 3624846, 3648140, 3671805, 3695714, 3720031, 3745237, 3771741]
57407C771741K7647K8286K8879L0186L2218L4207L5575L6422L7067L7674L8379
57396D138281L9253L9984M0098L9729L9643M0253M1069M1464M1632M2245M3460
57385D587111M4670M5278M5358M5545M6347M7600M8551M8652M8196M8008M8469
57374E103785M9210M9788N0248N0741N1068N1011N0900N1238N1881N2125N1750
57363E663745N1429N1842N2728N3401N3823N4626N6006N7282N7913N8373N9464
57352F270632O1090O2411O3083O3562O4128O4474O4476O4684O5400O5979O5760
57341F975679O5297O5825O7633O9715P1046P1544P1763P2244P3236P4511P5300
57330G753793P4909P3557P2252P1695P1709P1781P1656P1360P1053P1067P1629
$$ y = [3771741, 3799388, 3827674, 3856553, 3886739, 3918957, 3953164, 3988739, 4025161, 4062228, 4099902, 4138281, 4177534, 4217518, 4257616, 4297345, 4336988, 4377241, 4418310, 4459774, 4501406, 4543651, 4587111, 4631781, 4677059, 4722417, 4767962, 4814309, 4861909, 4910460, 4959112, 5007308, 5055316, 5103785, 5152995, 5202783, 5253031, 5303772, 5354840, 5405851, 5456751, 5507989, 5559870, 5611995, 5663745, 5715174, 5767016, 5819744, 5873145, 5926968, 5981594, 6037600, 6094882, 6152795, 6211168, 6270632, 6331722, 6394133, 6457216, 6520778, 6584906, 6649380, 6713856, 6778540, 6843940, 6909919, 6975679, 7040976, 7106801, 7174434, 7244149, 7315195, 7386739, 7458502, 7530746, 7603982, 7678493, 7753793, 7828702, 7902259, 7974511, 8046206, 8117915, 8189696, 8261352, 8332712, 8403765, 8474832, 8546461]
57319H546461P2491P3242P3919P4811P5634P5662P4867P4132P4017P4000P3423
57308I362659P2412P1349P0111O8539O7018O5815O4387O2304O0448O0284O2045
57297A0087371O4635O7184O9816P2827P6160P9842Q4023Q8313R1878R4495R6691
57286A0973235R8577R9460R9141R8531R8261R7418R4716R0384Q5907Q2163P8765
57275A1996558P5126P1230O7294O3477O0054N7237N4659N1717M8531M5967M4526
57264A2636376M3843M3500M3659M4474M5498M6190M6491M6403M5421M3083L9757
57253A3124695L6189L2396K7705K1948J5931J0470N642J242k399m661n422n153
57241A3258583m244k581L9L416P049J0624J4179J7791K1259K4343K7240L0601
$$ y = [8546461, 8618952, 8692194, 8766113, 8840924, 8916558, 8992220, 9067087, 9141219, 9215236, 9289236, 9362659, 9435071, 9506420, 9576531, 9645070, 9712088, 9777903, 9842290, 9904594, 9965042, 10025326, 10087371, 10152006, 10219190, 10289006, 10361833, 10437993, 10517835, 10601858, 10690171, 10782049, 10876544, 10973235, 11071812, 11171272, 11270413, 11368944, 11467205, 11564623, 11659339, 11749723, 11835630, 11917793, 11996558, 12071684, 12142914, 12210208, 12273685, 12333739, 12390976, 12445635, 12497352, 12545883, 12591850, 12636376, 12680219, 12723719, 12767378, 12811852, 12857350, 12903540, 12950031, 12996434, 13041855, 13084938, 13124695, 13160884, 13193280, 13220985, 13242933, 13258864, 13269334, 13274976, 13276218, 13273819, 13269158, 13263736, 13258583, 13254339, 13251758, 13251797, 13255213, 13262262, 13272886, 13287065, 13304856, 13326115, 13350458, 13377698, 13408299]
57229A3408299L4838L9441M3193M5229M5783M5874M6229M6630M6304M4784M2280
57218A3888884L9225L5698L1444K6397K0957J5644J0618N628L73n249j1168j7165
57206A4041286k2824k7692l1766l5722m0372m5826n1421n6609o1630o6999p2551
57195A3527874p7436q1144q4105q7059r0101r2626r4070r4465r4280r3834r2891
57184A2545863r0797q7169q2324p6795p0567o3205n4799m6081l7469k8685j9779
57173A1888193j1783n659j143K549N271O089M541P69n436j4504k5991l8643n1781
57160A1752472o5613p9990r3947j06830j18761j29432j37375j41154j40463j35488
57150A0603419j26139j12861r7531q2559o9568n9574n3827n3468n8634o8517q1924
$$ y = [13408299, 13443137, 13482578, 13525771, 13571000, 13616783, 13662657, 13708886, 13755516, 13801820, 13846604, 13888884, 13928109, 13963807, 13995251, 14021648, 14042605, 14058249, 14068867, 14074495, 14074868, 14069619, 14058451, 14041286, 14018462, 13990770, 13959004, 13923282, 13882910, 13837084, 13785663, 13729054, 13667424, 13600425, 13527874, 13450438, 13369294, 13285189, 13198130, 13108029, 13015403, 12921333, 12826868, 12732588, 12638754, 12545863, 12455066, 12367897, 12285573, 12208778, 12138211, 12075006, 12020207, 11974126, 11936657, 11907972, 11888193, 11876410, 11870751, 11869608, 11872157, 11877428, 11883517, 11888058, 11888827, 11883391, 11868887, 11842896, 11804253, 11752472, 11686859, 11606869, 11512922, 11406092, 11287331, 11157899, 11020524, 10879370, 10738907, 10603419, 10477280, 10364419, 10266888, 10184329, 10114761, 10055187, 10001360, 9947892, 9889258, 9820741, 9738817]
57139I738817r7083j11594j23361j31391j35144j33858j27478j17660j06884r6977
57129H557387q9250q5316q6368r1834r9798j08549j16712j22347j23325j18844
57119G515044j09768r7798q5186p4748o8588o6483o6287o5728o2850n5316m1037
57108F721255j9950N835L3889O2955R3208J26432J66017K15806K78848L57523
57098H041818M53672N67607O98474Q47454J019340J218761J445669J696041J964363
57089A7953199K241762K513988K766156K988155L170978L303281L385488L448412
57081D1771419L536595L649547L697736L534580L050468K249088J246841K09401
57073F2945675p19949j461516k003639k381052k644052k835462k982451l097263
$$ y = [9738817, 9641734, 9530140, 9406779, 9275388, 9140244, 9006386, 8878908, 8761248, 8654364, 8557387, 8468137, 8382821, 8296453, 8204619, 8104821, 7996272, 7879560, 7757213, 7633888, 7515044, 7405276, 7307478, 7222292, 7147544, 7078956, 7012473, 6946186, 6880458, 6817608, 6762292, 6721255, 6701305, 6707140, 6741029, 6803984, 6897192, 7023624, 7189641, 7405447, 7684295, 8041818, 8495490, 9063097, 9761571, 10609025, 11628365, 12847126, 14292795, 15988836, 17953199, 20194961, 22708949, 25475105, 28463260, 31634238, 34937519, 38323007, 41771419, 45308014, 48957561, 52655297, 56189877, 59240345, 61489433, 62736274, 62945675, 62225726, 60764210, 58760571, 56379519, 53735467, 50900005, 47917554, 44820291]
57065D4820291l179542l220685l211481l148401l034168k875308k681151k463317
57057B1006238k233534k001737j776579j565868j374780j204533j054382r24016
57049H870809q12951p18832o38264n68902n09385m57921m12464l72026l36475
57040D043589l05215k77081k51340k27790k06101j85967j67663j51607j37565
57031B133260j24926j13513j03405r4361q6007p8324p1358o4798n8447n2549m7166
57020A238406m1827l6413l1691k8118k4793k0538j5456j0480n817p70N356J3113
57008A040972K3148L5576M9671O5321Q4120J07168J31420J49375J52669J35880
56998A975320R8427M5774j0547n6914q4938r5918r8006r9159j02527j06854j09517
$$ y = [44820291, 41640749, 38420064, 35208583, 32060182, 29026014, 26150706, 23469555, 21006238, 18772704, 16770967, 14994388, 13428520, 12053740, 10849207, 9794825, 8870809, 8057858, 7339026, 6700762, 6131860, 5622475, 5164554, 4752090, 4380064, 4043589, 3738374, 3461293, 3209953, 2982163, 2776062, 2590095, 2422432, 2270825, 2133260, 2008334, 1894821, 1791416, 1697055, 1611048, 1532724, 1461366, 1396568, 1338121, 1285572, 1238406, 1196579, 1160166, 1128475, 1100357, 1075564, 1055026, 1039570, 1029090, 1023273, 1022503, 1027859, 1040972, 1064120, 1099696, 1149367, 1214688, 1298808, 1405976, 1537396, 1686771, 1839440, 1975320, 2073747, 2119521, 2108974, 2052060, 1967122, 1871204, 1773198, 1674039, 1571512, 1464658, 1355141]
56987A355141j08885j04907r8328q9800p9816o9295n9662n2029m6509m2476l9324
56976E64110l6745l4496l2224k9603k6628k3650k0983j8422j5367j1545p438l718
56964C03291n57K321N110P868J0689J3543J6006J7557J8026J7397J5387J1715
56952D38353O790J646k832o274q531r591r871j0104j0621j1044j0821r791q049
56939C49260n523k104J868N525Q164J0057J2291J5537J8969K0790J9815J6205
56927D70854J0776M237k591q505j2620j5020j6311j6894j7127j7657j8769j9664
56915C40709j9197j7361j5256j3673j2414j1087r746q498p150n613m182l088k170
56902B11274j243m24K01Q46J723K748L837N202P055R249J1452J3586J5844J8351
$$ y = [1355141, 1246256, 1141349, 1043021, 953221, 873405, 804110, 744448, 692419, 645910, 603434, 564110, 527365, 492869, 460645, 431042, 404414, 380764, 359781, 341359, 325992, 314447, 307009, 303291, 302734, 305055, 310165, 318033, 328722, 342265, 358271, 375828, 393854, 411251, 426638, 438353, 445143, 446789, 443957, 437683, 429152, 419561, 409690, 399586, 388965, 377921, 367100, 357309, 349260, 343737, 341633, 343501, 349026, 357190, 367247, 379538, 395075, 414044, 434834, 454649, 470854, 481630, 485867, 483276, 474771, 462151, 447131, 430820, 413926, 396799, 379142, 360373, 340709, 321512, 304151, 288895, 275222, 262808, 251721, 241975, 233477, 226327, 220714, 216532, 213444, 211274, 210031, 209607, 209808, 210654, 212377, 215125, 218962, 224164, 231219, 240468, 251920, 265506, 281350, 299701]
56888B99701K0986K3452K5353K6216K5573K3172J9206J4339R348M773R86j500
56876D91605k269j709j000r60j198p99M32J937L391N135P666J1256J6027K1884
56862E51398K8290L4442L9607M2844M2655L7762K8481J6824N025n561j4098j9693
56850G87976k1946k1771k0933k0581k0377j9084j5847j0871m993J296Q211J6137
56838F57217K5043L4611M4633N4781O3996P0311P1384O5314N1683L2396J1306
56827A182675p693k2520l2930l9422m2765m4200m5016m5592m5321m3538m0003
56816G73675l4615k7393j8874r887p24Q839J8634K7800L5489M1128M3711M1703
56804H99486L4237K2127P407p607k0691l0069l5236l7278l7911l8302l8792l9131
$$ y = [299701, 320687, 344139, 369492, 395708, 421281, 444453, 463659, 477998, 487346, 492119, 493105, 491605, 489336, 487627, 486627, 485667, 484469, 483670, 484102, 486039, 489430, 494565, 502231, 513487, 529514, 551398, 579688, 614130, 653737, 696581, 739236, 776998, 805479, 822303, 827328, 821767, 807669, 787976, 766030, 744259, 723326, 702745, 682368, 663284, 647437, 636566, 631573, 632869, 641080, 657217, 682260, 716871, 761504, 816285, 880281, 950592, 1021976, 1087290, 1138973, 1171369, 1182675, 1174982, 1152462, 1119532, 1080110, 1037345, 993145, 948129, 902537, 857216, 813678, 773675, 739060, 711667, 692793, 682906, 682182, 691021, 709655, 737455, 772944, 814072, 857783, 899486, 933723, 955850, 963257, 955650, 934959, 904890, 869654, 832376, 794465, 756163, 717371, 678240]
56792F78240l8602l6416l2495k7549k2142j6180r626l101K796Q266J3702J8575
56780E35468K1524K1482J8244J2160L983n000j3171j9222k2688k4068k4490k4943
56768D79279k5541k5755k5412k4941k4441k3230k0819j7891j5556j4004j2548
56757B49141j0774q965p457o219n173m359l729l134k545k011j491j068j128j845
56743A89243k604k499j483m91l20q30j380j683j925k329k803l073k946k505k022
56728A60350j634j277r08o64o17o51p18r06j103q58KR05J085M79l03p03n86p4
56710A51819N18P10L15j84j74K26L24j55p12q15m91l5M56J029J628K144K490K559
56692A61652K304J935J756J745J485P18k66q69p32oQ03J173J012O73N51O36P13
$$ y = [678240, 639638, 603222, 570727, 543178, 521036, 504856, 495230, 492129, 494925, 503191, 516893, 535468, 556992, 578474, 596718, 608878, 612861, 607861, 594690, 575468, 552780, 528712, 504222, 479279, 453738, 427983, 402571, 377630, 353189, 329959, 309140, 291249, 275693, 261689, 249141, 238367, 229402, 221945, 215726, 210553, 206194, 202465, 199331, 196786, 194775, 193284, 192216, 191088, 189243, 186639, 184140, 182657, 182166, 181846, 181016, 179636, 177953, 176028, 173699, 170896, 167823, 164877, 162372, 160350, 158716, 157439, 156531, 155867, 155250, 154599, 153881, 152975, 151872, 151014, 151016, 151921, 153006, 153485, 153182, 152479, 151893, 151819, 152337, 153047, 153362, 153178, 153004, 153230, 153554, 153399, 152687, 151872, 151381, 151346, 151802, 152831, 154459, 156603, 159093, 161652, 163956, 165891, 167647, 169392, 170877, 171595, 171329, 170460, 169728, 169722, 170525, 171698, 172710, 173383, 173934, 174570, 175283]
56675A75283Q35J284K038K612K518J760P93J50J20O56J466K238K704K613J900
56660A98970R38L74M80R00J223J446J597J290K50j023j662j502j208j325j726
56645A99022k052k232k415k709l124l538l749l749l762l821l541k813k319k707
56631A56491l467l513k773k269k486k679k120j163m51K5M45M85r3p02o47j87p5
56614A34821l68m89k78j10r9J1J56p9o51r89q53n93l85N4P63J247J252J206J432
56595A36048J537J131O06N62Q47R19Q07R82J411J548J256R67Q29M57k19n80k19
56578A48889M69R95J513K198K503J846P86N56J438K452K810K818L027L234K954
56563A78488K331J940J873J697J299J155J686K680L502L679L184K411J867J744
$$ y = [175283, 176118, 177402, 179440, 182052, 184570, 186330, 187123, 187273, 187393, 188049, 189515, 191753, 194457, 197070, 198970, 199908, 200282, 200762, 201662, 202885, 204331, 205928, 207218, 207468, 206445, 204783, 203281, 202073, 200748, 199022, 196970, 194738, 192323, 189614, 186490, 182952, 179203, 175454, 171692, 167871, 164330, 161517, 159198, 156491, 153024, 149511, 146738, 144469, 141983, 139304, 137184, 136021, 135570, 135595, 136040, 136525, 136432, 135730, 135083, 134896, 134821, 134453, 133964, 133686, 133576, 133477, 133488, 133644, 133565, 132914, 131925, 131072, 130479, 130094, 130148, 130911, 132158, 133410, 134616, 136048, 137585, 138716, 139322, 139884, 140731, 141650, 142457, 143439, 144850, 146398, 147654, 148621, 149450, 149907, 149688, 149108, 148889, 149358, 150353, 151866, 154064, 156567, 158413, 159199, 159755, 161193, 163645, 166455, 169273, 172300, 175534, 178488, 180819, 182759, 184632, 186329, 187628, 188783, 190469, 193149, 196651, 200330, 203514, 205925, 207792, 209536]
56549B09536J729J385O97N8k87m55n69m57N5P55J146R83L85m49j466k523l233
56532B07290l259k795k412k474k831l157l260l032k400j569r98q87r05p60o73
56517A75878q97j156j107j077j591k313k381j735j223j223j151o99n43j180j912
56502A55690j802j008l12R4M85P10M33k3m6K40J84j74p0P46J571J755J426J024
56484A60923P88Q66J339J963K364K595K961L354L369L132L184L483L327K594K128
56469A98370K492L108L225L026L054L146K807K248K192K727L128K870K204J586
56455B36183J111P13N23O55Q71Q28N37L31L05P9o42j444j529p34J40K17n38j501
56437B36105k140k253j835j185q80j145j421j075l14J57K11K62L35K2o53j150
$$ y = [209536, 211265, 212650, 213347, 213405, 213118, 212663, 212094, 211637, 211692, 212447, 213593, 214576, 214961, 214512, 213046, 210523, 207290, 204031, 201236, 198824, 196350, 193519, 190362, 187102, 184070, 181670, 180101, 179103, 178216, 177311, 176551, 175878, 174981, 173825, 172718, 171641, 170050, 167737, 165356, 163621, 162398, 161175, 160024, 159325, 158782, 157602, 155690, 153888, 152880, 152568, 152662, 153147, 153857, 154290, 154267, 154221, 154461, 154645, 154471, 154401, 155147, 156718, 158473, 159899, 160923, 161711, 162577, 163916, 165879, 168243, 170838, 173799, 177153, 180522, 183654, 186838, 190321, 193648, 196242, 198370, 200862, 203970, 207195, 210221, 213275, 216421, 219228, 221476, 223668, 226395, 229523, 232393, 234597, 236183, 237294, 238007, 238530, 239185, 240056, 240884, 241421, 241752, 242057, 242136, 241494, 240050, 238521, 237787, 237927, 238144, 237606, 236105, 233965, 231712, 229877, 228692, 227812, 226667, 225246, 224171, 223857, 224014, 224225, 224487, 224822, 224844, 224191, 223041]
56421B23041j303j502j809j749j235r11j180j640j805j721j465q77k01j71r12
56406B04560j532j442j288j780k345j955p41K94P61J067J363J283Q01L50J41M3
56390A99580J61P55J528J768J347Q95Q91J193J628K292L059L409L053K366J860
56375B25785J616J461J356J349J447J744K416L373M103M097L392K608K442L083
56361B60272L967M222L501K343J531J281J279J343J635K269L066L693L833L298
56347B97533K292J487J415J845K074J826J561J881K913M231N117M988L938K823
56333C35924K464K815L229L459L920M919O093O859P024O858O791P176Q121R362
56319D15014J0450J1099J1266J0960J0303R625R205Q815P984O736N733N472N621
$$ y = [223041, 221738, 220236, 218427, 216678, 215443, 214532, 213352, 211712, 209907, 208186, 206721, 205844, 205643, 205472, 204560, 203028, 201586, 200298, 198518, 196173, 194218, 193477, 193771, 194532, 195599, 196962, 198245, 199046, 199396, 199537, 199580, 199741, 200496, 202024, 203792, 205139, 206034, 206925, 208118, 209746, 212038, 215097, 218506, 221559, 223925, 225785, 227401, 228862, 230218, 231567, 233014, 234758, 237174, 240547, 244650, 248747, 252139, 254747, 257189, 260272, 264239, 268461, 271962, 274305, 275836, 277117, 278396, 279739, 281374, 283643, 286709, 290402, 294235, 297533, 299825, 301312, 302727, 304572, 306646, 308472, 310033, 311914, 314827, 319058, 324175, 329163, 333101, 335924, 338388, 341203, 344432, 347891, 351811, 356730, 362823, 369682, 376706, 383564, 390355, 397531, 405652, 415014, 425464, 436563, 447829, 458789, 469092, 478717, 487922, 496737, 504721, 511457, 517190, 522662, 528283]
56306E28283N396M451L134K008J295Q10L87K01N73J444K292K702K865L262M068
56291E63171N121O315P624Q816R517R743J0054J1075J2889J4956J6593J7639J8663
56278G12176K0350K2675K4983K7001K9309L2474L6157L9554M2485M5507M9188
56267A081859N3790N9520O6502P4390Q2533R0619R8864J07495J16456J25593J34806
56256B092427J43988J52953J61389J68570J73428J75228J73992J69830J62285
56247C574090J50888J36094J18841R9345P7286N3258K9040O126j5297l5451n3838
56236D140382o9622q2610r3211j01704j08055j12362j15057j16736j17954j18997
56226C104074j19683j19498j18204j16139j13805j11372j08705j05702j02433
$$ y = [528283, 533679, 538130, 541264, 543272, 544567, 545377, 545764, 545965, 546538, 547982, 550274, 552976, 555841, 559103, 563171, 568292, 574607, 582231, 591047, 600564, 610307, 620361, 631436, 644325, 659281, 675874, 693513, 712176, 732526, 755201, 780184, 807185, 836494, 868968, 905125, 944679, 987164, 1032671, 1081859, 1135649, 1195169, 1261671, 1336061, 1418594, 1509213, 1608077, 1715572, 1832028, 1957621, 2092427, 2236415, 2389368, 2550757, 2719327, 2892755, 3067983, 3241975, 3411805, 3574090, 3724978, 3861072, 3979913, 4079258, 4156544, 4209802, 4238842, 4244968, 4229671, 4194220, 4140382, 4070760, 3988150, 3894939, 3793235, 3685180, 3572818, 3457761, 3341025, 3223071, 3104074, 2984391, 2864893, 2746689, 2630550, 2516745, 2405373, 2296668, 2190966, 2088533]
56217B088533r9048r5650r2231q8708q5099q1468p7538p2706o6829o0752n5511
56206A212993n1187m7084m2952l9208l5971l2709k9170k5940k3597k1858k0062
56195H43255j8004j5844j3527j0881q091n653l960l142l094l433l573l083j875
56182G49095o7K071M010N282O075P049Q360R419R853J0216J1256J2855J4195J4754
56168H64423J4618J4039J3193J2256J1367J0454R476Q713Q477Q564Q357P527O389
56155I97853N508N183N421O196P495R115J0597J1706J2891J5060J8668K3201K7875
56142A156769L2643L8202M5045N2879O1050O9266P7765Q6876R6430J05503J12826
56131A935254J17484J19072J17338J12302J05030R7614R1719Q7260Q2922P7386
$$ y = [2088533, 1989485, 1893835, 1801604, 1712896, 1627797, 1546329, 1468791, 1396085, 1329256, 1268504, 1212993, 1161806, 1114722, 1071770, 1032562, 996591, 963882, 934712, 908772, 885175, 863317, 843255, 825251, 809407, 795880, 784999, 776908, 771255, 767295, 764153, 761059, 757626, 754053, 750970, 749095, 749028, 751099, 755109, 760391, 766466, 773515, 781875, 791294, 801147, 811363, 822619, 835474, 849669, 864423, 879041, 893080, 906273, 918529, 929896, 940350, 949826, 958539, 967016, 975580, 983937, 991464, 997853, 1003361, 1008544, 1013965, 1020161, 1027656, 1036771, 1047368, 1059074, 1071965, 1087025, 1105693, 1128894, 1156769, 1189412, 1227614, 1272659, 1325538, 1386588, 1455854, 1533619, 1620495, 1716925, 1822428, 1935254, 2052738, 2171810, 2289148, 2401450, 2506480, 2604094, 2695813, 2783073, 2865995, 2943381]
56121B943381O9570N8432M3884K7738J2665R1j0239j9005k6812l4901m4803n6728
56109B963273o9191q0595r0250r7615j01772j02417j00441r6793r1532q4612p6850
56098A971205o9266o2071n5006m8215m2086l6648l1741k7375k3467j9695j6054
56087A539581j3080j1006r266p311n338l688k153n40P16J281J770L051N013O817
56073A505847Q088R194J0515J2084J3821J5608J7177J8321J9111J9731K0275K0897
56061A690669K1780K2778K3543K4193K5270K6862K8350K9328L0076L0866L1535
56050A985250L2142L3216L4783L6008L6405L6647L7549L8903M0087M1170M2641
56039B394801M4536M6536M8567N0701N2877N5173N7840O0681O2987O4508O5861
$$ y = [2943381, 3012951, 3071383, 3115267, 3143005, 3155670, 3155761, 3145522, 3126517, 3099705, 3064804, 3020001, 2963273, 2894082, 2813487, 2723237, 2625622, 2523850, 2421433, 2320992, 2224199, 2132667, 2048055, 1971205, 1901939, 1839868, 1784862, 1736647, 1694561, 1657913, 1626172, 1598797, 1575330, 1555635, 1539581, 1526501, 1515495, 1506229, 1498918, 1493580, 1489892, 1487739, 1487199, 1487915, 1489196, 1490966, 1494017, 1499030, 1505847, 1513935, 1523129, 1533644, 1545728, 1559549, 1575157, 1592334, 1610655, 1629766, 1649497, 1669772, 1690669, 1712449, 1735227, 1758770, 1782963, 1808233, 1835095, 1863445, 1892773, 1922849, 1953715, 1985250, 2017392, 2050608, 2085391, 2121399, 2157804, 2194451, 2232000, 2270903, 2310990, 2352160, 2394801, 2439337, 2485873, 2534440, 2585141, 2638018, 2693191, 2751031, 2811712, 2874699, 2939207, 3005068]
56028C005068O7658O9880P2370P5101P7649P9475Q1016Q3396Q6596Q9287R0931
56017C878427R2582R4899R7033R8530J00699J04738J09831J14563J18994J23953
56007D934249J29402J34968J41049J48016J55280J62350J69798J78019J86298
55998F339429J94309K02996K12682K22010K30398K39663K51394K64440K77200
55989H434521K90540L06067L23303L41224L60996L84239M10032M36627M64886
55980A1752435M97017N33171N72450O16049O66140P22698P84780Q53876R32694
55971A7931310J022035J122505J237916J373259J531055J714245J931098K192550
55963C0055973K506350K879025L321351L845199M456624N160541N974161O931866
$$ y = [3005068, 3072726, 3142606, 3214976, 3290077, 3367726, 3447201, 3528217, 3611613, 3698209, 3787496, 3878427, 3971009, 4065908, 4162941, 4261471, 4362170, 4466908, 4576739, 4691302, 4810296, 4934249, 5063651, 5198619, 5339668, 5487684, 5642964, 5805314, 5975112, 6153131, 6339429, 6533738, 6736734, 6949416, 7171426, 7401824, 7641487, 7892881, 8157321, 8434521, 8725061, 9031128, 9354431, 9695655, 10056651, 10440890, 10850922, 11287549, 11752435, 12249452, 12782623, 13355073, 13971122, 14637262, 15359960, 16144740, 16998616, 17931310, 18953345, 20075850, 21313766, 22687025, 24218080, 25932325, 27863423, 30055973, 32562323, 35441348, 38762699, 42607898, 47064522, 52225063, 58199224, 65131090]
55955F5131090Q078992R465088J1134560J3109128J5380161J7922745K0683565
55948A60905329K3479767K5854667K7055187K6244190K2865541J6955798R245653
55941C12606132J001934o368399j1834956j5126207j6718000j7422800j7887616
55934B28250088j8348136j8716288j8806774j8491379j7733701j6572146j5102898
55927A04478766j3460120j1782752j0180687q719900p429107o314234n367979
55920D1223987m573669l909669l355490k894468k511474k191266j920867j691618
55912A8175466j497119j330794j187013j062714r55724q62594p79843p06114o41117
55903I152434n83426n31167m83933m42125m04983l71036l39953l12400k88373
$$ y = [65131090, 73210082, 82675170, 93809730, 106918858, 122299019, 140221764, 160905329, 184385096, 210239763, 237294950, 263539140, 286404681, 303360479, 312606132, 313608066, 307239667, 295404711, 280278504, 263560504, 246137704, 228250088, 209901952, 191185664, 172378890, 153887511, 136153810, 119581664, 104478766, 91018646, 79235894, 69055207, 60335307, 52906200, 46591966, 41223987, 36650318, 32740649, 29385159, 26490691, 23979217, 21787951, 19867084, 18175466, 16678347, 15347553, 14160540, 13097826, 12142102, 11279508, 10499665, 9793551, 9152434, 8569008, 8037841, 7553908, 7111783, 6706800, 6335764, 5995811, 5683411, 5395038]
55894E395038k67046k47845k30527k14668k00042j86971j75327j64024j52531
55885C556057j41974j33520j26470j19299j11810j04941r9057r3795q9056q4754
55875B451381q0112p4576o9118o5235o2867o0506n7274n3742n0752m8398m6195
55864A782606m3525l9995l5874l1954k8544k5133k1636j9260j9232k1192k3734
55853A472527k6007k7876k9042k9153k8606k8292k8533k8844k8650k7702k6154
55842A163668k4601k3643k2940k1383j8697j6126j4853j4527j4145j3609j3343
55831I65801j3179j2755j2529j3142j4156j4539j4242j4221j4979j6048j6873
55820H09138j7367j7632j7794j7979j7937j7031j5189j3405j2567j2267j1440
$$ y = [5395038, 5127992, 4880147, 4649620, 4434952, 4234910, 4047939, 3872612, 3708588, 3556057, 3414083, 3280563, 3154093, 3034794, 2922984, 2818043, 2718986, 2625191, 2536135, 2451381, 2371269, 2296693, 2227575, 2162340, 2099473, 2038967, 1981693, 1927951, 1877199, 1828801, 1782606, 1739081, 1699086, 1663212, 1631258, 1602714, 1577581, 1555945, 1536685, 1517453, 1496261, 1472527, 1446520, 1418644, 1389602, 1360449, 1331843, 1303551, 1275018, 1246174, 1217524, 1189822, 1163668, 1139067, 1115424, 1092484, 1071101, 1052404, 1036278, 1021425, 1006898, 992753, 979144, 965801, 952622, 939867, 927338, 914196, 900040, 885501, 871259, 857038, 842059, 826011, 809138, 791771, 774139, 756345, 738366, 720429, 703398, 688209, 674804, 662237, 649970, 638530]
55809F38530r839q002o227m443k751j282K09J810K943L115K753K430J806K54j866
55794F19440l589m603n277n734n980o478p580q648q813q292p894p607o821n712
55780E26412n118n218n561o217p540q927r217q500q127q618q973q503p954q165
55766D19774q654q470p687p173p405q038q479q387p885p477p555p954q232q222
55752C08156p964p326o300n377n010m901m573m298m578m975m579l488k777k868
55738B39142l046k707k019j220l00M23M49J00L08J056J096l02k242l428l610l320
55722B20380k953k769l082l829m416m374l737k619j114K07N54j5n28m50j58J85
55706A91282J192L012M539M725L896L000K222J224K22j34K92J005J462J336N59
$$ y = [638530, 628691, 620689, 614462, 610019, 607268, 605986, 606195, 608005, 610948, 614063, 616816, 619246, 621052, 621306, 619440, 615851, 611248, 605971, 600237, 594257, 587779, 580199, 571551, 562738, 554446, 546552, 538945, 532124, 526412, 521294, 516076, 510515, 504298, 496758, 487831, 478614, 470114, 461987, 453369, 444396, 435893, 427939, 419774, 411120, 402650, 394963, 387790, 380385, 372347, 363868, 355481, 347596, 340119, 332564, 324610, 316378, 308156, 300192, 292866, 286566, 281189, 276179, 271278, 266705, 262407, 257829, 252854, 248275, 244787, 242010, 239142, 236096, 233389, 231370, 230150, 229850, 230273, 230722, 230822, 231130, 232186, 233282, 232980, 230738, 227310, 223700, 220380, 217427, 214658, 211576, 207747, 203331, 198957, 195220, 192601, 191487, 191694, 192248, 192233, 191705, 191255, 191097, 191282, 192474, 195486, 200025, 204750, 208646, 211646, 213868, 215092, 215314, 215180, 215472, 216477, 217939, 219275, 219834]
55691B19834m00o86j3R34J465J776K298K771K654K096J747J828J995J913J461
55676B41673O04m54j231j509j612j772j725j346j191j660k099j535p7J231J750
55661B29047J798J882K124K399K530K282J686J297J661K518L067K920K364J700
55647B59275Q56k60j513k753l934m921n522n774n900n975n881n658n569n768o088
55632A94615o224o045n708n561n799o190o314o151o048n987n383m058k908k908
55618A19331l674l810k708j253n00l91k71r6l89j148j591j190m43k54p88j435
55602I9390j779j993k190j975j079k2M18K06j6N4M8l09o83o22j76K18K20j81o34
55583H8895n88K14J297J902J892J866K263K796K952K674K369K519L399M786N886
$$ y = [219834, 219434, 218748, 218735, 219669, 221134, 222910, 225208, 227979, 230633, 232729, 234476, 236304, 238299, 240212, 241673, 242277, 241823, 240592, 239083, 237471, 235699, 233974, 232628, 231437, 229777, 227678, 226143, 226066, 227297, 229047, 230845, 232727, 234851, 237250, 239780, 242062, 243748, 245045, 246706, 249224, 252291, 255211, 257575, 259275, 260131, 259871, 258358, 255605, 251671, 246750, 241228, 235454, 229554, 223579, 217698, 212040, 206471, 200703, 194615, 188391, 182346, 176638, 171077, 165278, 159088, 152774, 146623, 140575, 134588, 129205, 125147, 122239, 119331, 115657, 111847, 109139, 107886, 107386, 106995, 106724, 106628, 106239, 105091, 103500, 102310, 101867, 101613, 100825, 99390, 97611, 95618, 93428, 91453, 90374, 90352, 90770, 90976, 90960, 91014, 91062, 90753, 90070, 89448, 89272, 89490, 89710, 89529, 88895, 88307, 88521, 89818, 91720, 93612, 95478, 97741, 100537, 103489, 106163, 108532, 111051, 114450, 119236, 125122]
55568A25122O009N382M839M717M617M262L834L250J934j70k169l304l818m225
55554A50280m391m113l965m680n947o705o479n747n054m481l993l701l691l830
55540H3503l790l110j575L00J532J761J614J647J564J033O05R11J496J432Q34
55525H9757O84J235J663J444J069J074J244J205J082J129J155Q40K81j92n28r69
55509A02173j664k473l035l021k459j849j778k343l074l358k945k192j862k379
55495F7741l107k858j447j32q2r64j673j905k057k016j279j83K19k80o88l83l
55478D8903k59p87r05o94o03n76l60k38o36j295j603j490j321j047l99K45O5q98
55460C6102j533j148m08k00k76J50Q81Q92No55l00L58K70l54n20j31l9n24p98
$$ y = [125122, 131131, 136513, 141352, 146069, 150686, 154948, 158782, 162032, 163966, 163796, 161627, 158323, 154505, 150280, 145889, 141776, 137811, 133131, 127184, 120479, 114000, 108253, 103199, 98718, 94725, 91024, 87333, 83503, 79713, 76603, 75028, 75328, 76860, 78621, 80235, 81882, 83446, 84479, 85084, 85995, 87491, 88923, 89757, 90441, 91676, 93339, 94783, 95852, 96926, 98170, 99375, 100457, 101586, 102741, 103581, 103862, 103670, 103142, 102173, 100509, 98036, 95001, 91980, 89521, 87672, 85894, 83551, 80477, 77119, 74174, 71982, 70120, 67741, 64634, 61776, 60329, 60197, 60115, 59151, 57478, 55573, 53516, 51500, 50221, 50038, 50257, 49977, 49289, 48906, 48903, 48644, 47857, 46952, 46258, 45655, 45079, 44719, 44481, 43845, 42550, 40947, 39457, 38136, 37089, 36690, 36935, 37000, 36102, 34569, 33421, 33013, 32813, 32537, 32687, 33568, 34460, 34465, 33810, 33510, 33868, 34138, 33784, 33264, 33133, 33094, 32570, 31772]
55441C1772k84N74J172J543J755J333Oj528k343k374k083j443j94J241J964J717
55425C2828J073N40J13l07o64r64j248j345j093o78l38R7Q27J493J660J556J665
55408C5215J772J344P04P33J358J450M97o52j144j276j651k018j762j007n07o23
55392C2433j007j143q49l88k13m40n00K16J361J863J322N27K53K60o4o72j100
55375C1859j252j313j227q24l21j22k60m05m06m27o41r70j094o53K91J057J073
55358B4365P74J120K036K208R18p53j307q20n58j053j599j639j491j494j300n14
55342A8893M85R14N12k93r38j153q92k72L96P35O86O62J060J572J368J95j054
55325B2876j284n11K94N68O46Q49Q50L36l54o96p15p76r50j039r47p23m12j79
$$ y = [31772, 31488, 32062, 33234, 34777, 36532, 37865, 37871, 36343, 34000, 31626, 29543, 28100, 27906, 29147, 31111, 32828, 33901, 34441, 34554, 34247, 33583, 32619, 31371, 30026, 28933, 28255, 27917, 28014, 28841, 30334, 31994, 33550, 35215, 36987, 38331, 39035, 39768, 41126, 42576, 43073, 42421, 41277, 40001, 38350, 36332, 34570, 33563, 33056, 32433, 31426, 30283, 29434, 29046, 28833, 28393, 27893, 28109, 29470, 31333, 32655, 33182, 33435, 33695, 33631, 32959, 31859, 30607, 29294, 28067, 27243, 26922, 26800, 26540, 26135, 25729, 25302, 24661, 23691, 22597, 21944, 22235, 23292, 24365, 25139, 26259, 28295, 30503, 31421, 30668, 29361, 28541, 27983, 26930, 25331, 23692, 22201, 20707, 19407, 18893, 19378, 20292, 20804, 20511, 19573, 18420, 17528, 17256, 17652, 18387, 19073, 19735, 20795, 22367, 23735, 23930, 22876, 21592, 21081, 21375, 21943, 22589, 23438, 24288, 24624, 24270, 23574, 22859, 22083, 21133, 20094, 19147, 18424, 18012, 17833]
55307A7833k59n09l83L02R30Q73L45L0J63M60P11R23J024R12O92N21L04q3m66
55288B4323o45p72j054j272j069n80k78k59j01N00J311J796J620R07J98n0l1l81
55270B4163j246j897j614o07L35P76Q00N86K94J48J89J59K0J63O36O51l73j642
55252B1541j751n38O94Q61K27l11l07J15O45Q95N25m27j432j895j513m38O90J082
55234A8663N89m4r0K71M94O78J271J974J916R61l3m40m84m62j68N13J145J307
55216B8061J071O45N1m82m80N5M46L36K65Q18J615J774J025j07r52j129o24R1
55198C2479L31m3m13k63R7J16j14q8K65N58O12N32K86k73r51j273j127q92q57
55179B8982q60o18j95P5p5n73j024j018n46n8nl41o08m01L10J104J350P62j50
$$ y = [17833, 17574, 17065, 16682, 16984, 17914, 18787, 19132, 19162, 19325, 19785, 20496, 21419, 22443, 23355, 24047, 24568, 24872, 24789, 24323, 23678, 22906, 21852, 20580, 19511, 18931, 18653, 18394, 18293, 18793, 20104, 21900, 23520, 24427, 24625, 24575, 24544, 24163, 22917, 21020, 19406, 18799, 19134, 19910, 20710, 21296, 21590, 21738, 21927, 22086, 22106, 22269, 22905, 23556, 23183, 21541, 19790, 19252, 19946, 20807, 21034, 20723, 20416, 20531, 21176, 22071, 22596, 22169, 20737, 18842, 17329, 16891, 17581, 18663, 19252, 19208, 19118, 19389, 19883, 20561, 21832, 23806, 25722, 26683, 26650, 26210, 25726, 25264, 25096, 25609, 26754, 28061, 29132, 29777, 29828, 29346, 28866, 28921, 29367, 29703, 29968, 30786, 32401, 34175, 35200, 35093, 34141, 33012, 32388, 32479, 32810, 32767, 32354, 32091, 32188, 32304, 32190, 32102, 32367, 32925, 33537, 34069, 34355, 34082, 33131, 31858, 30731, 29839, 28982, 28122, 27504, 27309, 27384, 27309, 26736, 25712, 24694, 24148, 24090, 24085, 23744, 23136, 22735, 23045, 24149, 25499, 26261, 26111]
55160B6111m66J19R60J261Q81J17q20j631j695p00O04J039M28k48k62kj10l86
55142B5200j60N72J118J101Q74P83N81m6p42p90j25M71K97m35r58q51l69J5J33
55123B6669J72L48N85N49J24k28J14J064J823J888J654J667J757J487J016P90
55107D1479O78J93n02o44o4N56P50Q12J011J061Q01O25P73Q87P37P34J121J314
55089E2322Q43L16O41J618K191J836R09j54j141j677j408o04K9K43L37M97O31
55072E7429Q52J351J774J507O66R4J53K66q4n60n95k26O3ml81q68j160j076r16
55053E8285j148j617j620r82m30n39r07r17p33r02j352j503j130m83K55J009J484
55036D6770J373Q95N36L50O0k49k11K6j46p56r74k87O97J056P25L54L11M45N17
$$ y = [26111, 25645, 25764, 26724, 27985, 28866, 28983, 28163, 26532, 24837, 24137, 24741, 25780, 26208, 25960, 25698, 25696, 25586, 25200, 25040, 25612, 26730, 27831, 28705, 29488, 30069, 30023, 29281, 28491, 28366, 28837, 29134, 28699, 27741, 26890, 26521, 26536, 26669, 26841, 27189, 27774, 28323, 28447, 28219, 28333, 29397, 31220, 33108, 34762, 36429, 38186, 39673, 40689, 41479, 42157, 42350, 41848, 41204, 41140, 41696, 42446, 43258, 44269, 45330, 46131, 46756, 47529, 48416, 49153, 49887, 51008, 52322, 53165, 53481, 54122, 55740, 57931, 59767, 60676, 60522, 59381, 57704, 56296, 55692, 55721, 55964, 56301, 56798, 57429, 58281, 59632, 61406, 62913, 63579, 63673, 63826, 64092, 64008, 63448, 62853, 62627, 62690, 62686, 62305, 61437, 60277, 59201, 58285, 57137, 55520, 53900, 52918, 52488, 51949, 51042, 50125, 49392, 48490, 47138, 45635, 44505, 44022, 44277, 45286, 46770, 48143, 49038, 49574, 49924, 49984, 49735, 49524, 49550, 49404, 48648, 47674, 47387, 48084, 49140, 49865, 50219, 50530, 50975, 51492]
55017E1492M13N6l70k53P53J905J958P70l43j82Q93J602J354O59J28j30j72J06
54999F0639O13Q56M78k77q13q04l51K18N07K21n02j041r67o08o56j138j261l89
54981E4725J079K056J863Q25j41m23j56J13J16J31M92J084J475J514J471J582
54965F7806J749J805J826J968K198K405K687L169L699L945L899L988M576N620
54951A11340O864Q155R317J0031J0248J0488J1182J1706J0726P787M039R00j466
54938B11317l740n941p342p810q173q911r328q703p550o946p079p273p187p048
54924A08286o828o065m777l629k903j982l93J178J629R61L80Q61K145L316L979
54909I6158M553N520O742P732Q386R155J0303J1276J1108R466O957M412K147L6
$$ y = [51492, 51905, 51961, 51591, 51338, 52091, 53996, 55954, 56724, 56381, 56199, 57092, 58694, 60048, 60707, 60835, 60705, 60533, 60639, 61252, 62108, 62586, 62309, 61496, 60692, 60341, 60559, 61066, 61287, 60785, 59744, 58777, 58169, 57513, 56375, 55114, 54725, 55804, 57860, 59723, 60548, 60407, 59984, 59828, 59941, 60057, 60188, 60680, 61764, 63239, 64753, 66224, 67806, 69555, 71360, 73186, 75154, 77352, 79757, 82444, 85613, 89312, 93257, 97156, 101144, 105720, 111340, 118204, 126359, 135676, 145707, 155955, 166443, 177625, 189331, 200057, 207844, 211883, 212783, 211317, 207577, 201636, 194294, 186484, 178311, 169400, 160072, 151369, 143819, 136873, 129794, 122521, 115334, 108286, 101458, 95393, 90616, 86987, 84084, 82102, 81709, 82887, 84516, 85477, 85857, 86718, 88863, 92179, 96158, 100711, 106231, 112973, 120705, 129091, 138246, 148549, 159825, 170933, 180399, 187356, 191768, 193915, 193951]
54895A93951j990l795n220o259p042p728q385q883r007q716q257p966p891p598
54881I5214o507m636k948k523l203l557k581r81j80m11o24j82L01P2o61j175j201
54864F4217r89q67j099j743k316k035p93N14J030Q60N56K69o8k61k62n38j357
54847E5118k065j905j213r34j158j142o07n1K55N77Q60N51m18j264j365q83j85
54830D4171O29J284J297P93N95J018J324R49M43N43J005J210J290J724K322K458
54814F3055K070J483O99l04q75l39Q10J418J327J497K421L479M048M239M284M150
54798I3462M226N306P390R272J0018J0104J0415J0880J0825J0093Q938P247M856
54785B03032K265K10j352k984m655n741o081o234o535o727o606o392o172n712
$$ y = [193951, 191961, 188166, 182946, 176687, 169645, 161917, 153532, 144649, 135642, 126926, 118669, 110703, 102812, 95214, 88707, 84071, 81123, 78600, 75397, 71840, 69259, 68278, 68098, 67687, 67063, 66881, 67182, 67254, 66593, 65418, 64217, 63228, 62361, 61262, 59519, 57203, 55168, 54375, 54889, 55919, 56779, 57335, 57604, 57536, 57275, 57013, 56475, 55118, 53053, 51148, 49935, 49001, 47843, 46701, 46094, 46043, 46298, 46875, 47735, 48286, 47868, 46604, 45239, 44356, 44171, 44800, 46084, 47381, 48174, 48769, 49787, 51111, 52060, 52503, 53046, 54051, 55261, 56551, 58275, 60597, 63055, 65125, 66608, 67307, 67003, 66128, 65789, 66599, 68017, 69344, 70841, 73262, 76741, 80789, 85028, 89312, 93462, 97688, 102994, 110384, 119656, 129674, 139778, 150193, 161073, 171898, 181991, 190929, 198176, 203032, 205297, 205507, 204155, 201171, 196516, 190775, 184694, 178460, 171925, 165198, 158592, 152200, 146028, 140316]
54771A40316n026m499m152l464k320j441j420j713j327q9J359K535L467M145M395
54756A30766M383M755N956P719R407J0609J1339J1858J2429J3041J3224J2370
54744B47856J0295P412M274J228j497l727n565p426r498j1311j2218j2188j1799
54731A95836j1431j0948j0295r872r920r825q699o654m889m295m461m412l869
54718I6266l229k589j630n03o3p28j717j942j425j083j393j880j964j663j178
54703G3279m29O07J478J683J311Q61N51K74L7J9J96L14K96L24L41%p57j419j396
54684G7570o07N81J696K257J924R43J28Q4O20J265J952K691K956K208R88N58J240
54667I9054J931J692J081J202K061K693K663K446K354J950R76J04J95J121J854
$$ y = [140316, 135290, 130791, 126639, 123175, 120855, 119414, 117994, 116281, 114954, 114865, 116224, 118759, 122226, 126371, 130766, 135149, 139904, 145860, 153579, 162986, 173595, 184934, 196792, 209221, 222262, 235486, 247856, 258151, 265563, 269837, 271065, 269568, 265841, 260276, 252850, 243352, 232041, 219823, 207635, 195836, 184405, 173457, 163162, 153290, 143370, 133545, 124846, 118192, 113303, 109008, 104547, 100135, 96266, 93037, 90448, 88818, 88315, 88252, 87524, 85807, 83865, 82440, 81357, 79964, 78084, 76120, 74457, 73279, 72850, 73457, 74935, 76618, 77929, 78790, 79341, 79615, 79652, 79671, 79867, 80181, 80477, 80801, 81142, 81142, 80385, 78966, 77570, 76963, 77544, 79240, 81497, 83421, 84364, 84492, 84576, 85196, 86461, 88413, 91104, 94060, 96268, 97256, 97814, 99054, 100985, 102677, 103758, 104960, 107021, 109714, 112377, 114823, 117177, 119127, 120103, 120207, 120402, 121523, 123377]
54652A23377J737J156R58J493K405L165L559L661L606L558L792M521N602O609
54638A69199P336P966Q570Q720P986O669N536M761L648J620q80k896m105n009
54624B19121o018o828p024o909p309q504r692r738q308o109m140k925k431k294
54610A30892k061j474p22l05m22p06p37o49r47j836k924l573l336k227q30k8k79
54593A07836j164j885k105k050j925j721j578j858k627l394l594l138k419j927
54579G6451j918k232k383k138j779j610j329m99M95P30R8m33k48N0k12n82k47
54562F2214N79R73P69O41Q94J045P69L37m5n64j154j299q27k95j13P4O29J159
54544F5786J141Q91J093J635J754J322J133J722K581K948K815K685K759K928L292
$$ y = [123377, 125114, 126270, 127228, 128721, 131126, 134291, 137850, 141511, 145117, 148675, 152467, 156988, 162590, 169199, 176535, 184501, 193071, 201791, 209777, 216446, 221982, 226743, 230391, 232011, 231131, 228235, 224130, 219121, 213103, 206275, 199251, 192342, 185033, 176529, 166837, 157099, 148791, 142682, 138542, 135617, 133186, 130892, 128831, 127357, 126635, 126330, 125908, 125202, 124465, 123816, 122869, 121033, 118109, 114536, 111200, 108973, 108143, 108115, 107836, 106672, 104787, 102682, 100632, 98707, 96986, 95408, 93550, 90923, 87529, 83935, 80797, 78378, 76451, 74533, 72301, 69918, 67780, 66001, 64391, 63062, 62563, 63058, 63788, 63886, 63453, 63205, 63255, 63043, 62461, 62214, 62793, 63766, 64535, 65176, 66070, 67115, 67884, 68221, 68176, 67612, 66458, 65159, 64332, 64037, 63924, 63998, 64627, 65786, 66927, 67818, 68911, 70546, 72300, 73622, 74755, 76477, 79058, 82006, 84821, 87506, 90265, 93193, 96485]
54529I6485M007M677M582L692K894K847L059K576J302m3j013j793k415k364j498
54514A16995p14j086k494l753m050l727l499l488l317k851k416k321k487k620
54500G8172k528k188j569o49L47Q77N82j79n53j50M95O00J07l58l47l7J62J42
54482G2926J23L43Q20J317J560J535J514J626J637J336R57Q42Q71P08N17Q49J659
54465I1140K133J712Q74M24M11K41l61j070j549j805j895j710j284j032j317j884
54449H3028k001j279k15L08Ln08n04KM32M07M1m05o70m48L26J051R48Q1o19o18
54429G9360l62k73J9Q11J328O53o99j253n86K07K28r7J5N00Q74J062J198J172
54411H4157J101J589K690L231K261P45N38J773K689K313J815K462L545L550K490
$$ y = [96485, 100492, 105169, 109751, 113443, 116337, 119184, 122243, 124819, 126121, 126078, 125065, 123272, 120857, 118493, 116995, 116281, 115195, 112701, 108948, 104898, 101171, 97672, 94184, 90867, 88016, 85600, 83279, 80792, 78172, 75644, 73456, 71887, 71238, 71585, 72462, 73044, 72865, 72312, 72162, 72657, 73257, 73364, 73006, 72659, 72622, 72784, 72926, 73049, 73392, 74212, 75529, 77089, 78624, 80138, 81764, 83401, 84737, 85694, 86536, 87407, 88115, 88632, 89481, 91140, 93273, 94985, 95859, 96283, 96694, 96935, 96574, 95504, 93955, 92150, 90255, 88545, 87261, 86229, 84912, 83028, 81027, 79748, 79533, 79841, 79844, 79336, 78832, 78834, 79266, 79673, 79714, 79309, 78639, 78191, 78517, 79568, 80516, 80597, 79978, 79360, 78998, 78725, 78744, 79555, 80883, 81536, 80837, 79584, 78998, 79205, 79433, 79336, 79351, 79851, 80725, 81787, 82985, 84157, 85258, 86847, 89537, 92768, 95029, 95774, 96312, 98085, 100774, 103087, 104902, 107364, 110909, 114459, 116949]
54396A16949J636J441J138M22N3M64R72Q87M71J85j76q80j535j784k046k702l084
54379A12411k406j277j084j944k574k346k097k473k756k171j354j323j754j510
54365H5342m96K50K25J8Q5P5k06j81N03J167J009L00m7K53P34J086J467J930K195
54346I5709K093J815J599J513J577J716J698J428J250J458J660J204K76j80J40
54331A14956M36O1m71m61k92q57k081l005l177l083l118l068k805k643k713k622
54315H5057k173j812j946k365k655k681k275j147L58J066L23r45j355q64n43q24
54299F5219j071q85p39j020j327j198q56o79n30q8M99Q54R36R41Q41M55j37o15
54281F0600p84o72l81m4K01L36M71N91N77N21P16J133J347J204J137J408J494
$$ y = [116949, 118585, 120026, 121164, 121586, 121639, 122103, 123075, 123962, 124433, 124618, 124442, 123562, 122027, 120243, 118197, 115495, 112411, 110005, 108728, 107644, 105700, 103126, 100780, 98683, 96210, 93454, 91283, 89929, 88606, 86852, 85342, 84846, 85096, 85321, 85339, 85424, 85499, 85293, 85112, 85615, 86782, 87791, 88091, 88044, 88297, 89031, 90117, 91584, 93514, 95709, 97802, 99617, 101216, 102729, 104306, 106022, 107720, 109148, 110398, 111856, 113516, 114720, 114996, 114816, 114956, 115392, 115453, 114982, 114521, 114229, 113372, 111291, 108286, 105109, 102026, 98908, 95840, 93035, 90392, 87679, 85057, 82884, 81072, 79126, 76761, 74106, 71425, 69150, 68003, 68361, 69427, 69750, 68805, 67450, 66586, 66043, 65219, 64148, 63263, 62524, 61504, 60177, 58979, 58123, 57444, 56914, 56826, 57325, 58179, 59115, 60056, 60897, 61352, 61215, 60600, 59816, 59144, 58763, 58719, 58920, 59256, 59727, 60318, 60895, 61416, 62132, 63265, 64612, 65816, 66953, 68361, 69855]
54264F9855Q08k56o84j50O66J084J074Q28L06m02q63q27o96q95j137p60K06R22
54246F9079P79Q6m92p80r34q38k02P45J285J134Q66J020J239Q06k27j028j107
54229G1431p84n04k20K03M90K78k97p22o61j87M31R08J030P89L98O2q6J23P57
54210G3439J426J470P99J65J97N01K29o93j484j548j064m72K0K61pq23j691j987
54192F8738j556q16l19k63m41n48n72p22r60r10m54j05l68q93q73k37K09j4l47
54173E8549j06M76P26O68Q83J343J216J38j008j136l94Q2l05r45j025n96k86l59
54155E7921n68o93o63k34P83J841J855N61q37r58M0O99J33j000j582j425j115
54138E4758j009r43q07p21n38J24J139J625R72k00p14l11J88J56j17k49m07p40
$$ y = [69855, 70663, 70407, 69723, 69573, 70239, 71323, 72397, 73225, 73531, 73129, 72266, 71439, 70743, 69848, 68711, 67951, 68157, 69079, 69858, 69944, 69452, 68672, 67738, 66900, 66698, 67443, 68728, 69862, 70728, 71748, 72987, 73793, 73566, 72538, 71431, 70647, 70143, 69923, 70126, 70616, 70894, 70597, 69875, 69214, 69027, 69458, 70366, 71396, 72185, 72583, 72645, 72559, 72682, 73439, 74865, 76335, 77134, 77299, 77496, 77997, 78226, 77533, 76049, 74501, 73437, 72965, 72985, 73246, 73239, 72416, 70725, 68738, 67182, 66366, 66047, 65784, 65343, 64795, 64223, 63501, 62541, 61631, 61177, 61072, 60704, 59811, 58938, 58701, 58910, 58896, 58549, 58443, 58919, 59645, 60313, 61196, 62539, 63755, 63893, 62885, 61749, 61355, 61437, 61132, 60187, 59162, 58566, 58280, 57921, 57353, 56660, 55997, 55763, 56546, 58387, 60242, 60803, 59966, 59008, 59048, 59747, 59880, 58880, 57298, 55873, 54758, 53749, 52806, 51999, 51278, 50740, 50864, 52003, 53628, 54600, 54400, 53686, 53375, 53563, 53719, 53602, 53353, 52946, 52206]
54120E2206p92k53K55k6q01j191j100j029q29J46J489J847R50K42P05J285O12
54103E3716p47j101n3J194J692J559J128N62L37Q82J586J273l1q98m42M79O16
54086F1752m9o28o24j31O50J395J484O08o09j151o96K47J059J450J290N71l25
54069F6293p45l50M79J027R86O93O15O79M28j83n56k16N02R77J143J348J599J609
54051G6328J386J221J141R90R57J316J691J470Q79Q03J370J735J559J570K206
54036I6622K758K640K550L370M608N094M725M503M955N546N629N177M502L895
54022A56574L581L557L496L193K890K746K357J458O77P97J495J676R72L4o66j338
54006A83499k035k283j914j510j641k170k746l323l810l754k904j788j252j611
$$ y = [52206, 51414, 51161, 51416, 51390, 50589, 49398, 48298, 47269, 46440, 46586, 48075, 49922, 50872, 51114, 51819, 53104, 53716, 52969, 51868, 51815, 53009, 54701, 56260, 57388, 57950, 58287, 59169, 60755, 62028, 61997, 61099, 60657, 61136, 61752, 61703, 61075, 60451, 60320, 60970, 62365, 63849, 64457, 63848, 62697, 62001, 62248, 63307, 64757, 66047, 66618, 66293, 65548, 65198, 65677, 66704, 67690, 68383, 68998, 69677, 70105, 69922, 69366, 69150, 69652, 70629, 71772, 73120, 74719, 76328, 77714, 78935, 80076, 81066, 82023, 83339, 85030, 86500, 87379, 88182, 89552, 91287, 92846, 94416, 96622, 99380, 102020, 104570, 107940, 112548, 117642, 122367, 126870, 131825, 137371, 143000, 148177, 152679, 156574, 160155, 163712, 167208, 170401, 173291, 176037, 178394, 179852, 180529, 181326, 182821, 184497, 185469, 185503, 184837, 183499, 181464, 179181, 177267, 175757, 174116, 171946, 169200, 165877, 162067, 158313, 155409, 153621, 152369, 150758]
53992A50758k514l399l807l540k851k236j868j489r65o28p42j067j310j583j999
53977A20760k083j261J65J171J237Q74P14O12J29m36k23R26J966J823P44n3M3
53960A27108M03J46p57j660k047j814j067j41M24L77J34K79Q32J375J707J916
53944A27215J980J838J769K155K775K961K566K215K437L046L567L782L612K970
53930A64888K041J341J156J205J114Q76O46M55L83O71J316J903K147K238K349
53915A84729K252J894J944L069M874O199O438O013N555N294N299N729O395O540
53901B52224N501L516J603N73L52K42k05p41q64o23p13j636l044m106m450m366
53885B43263m236m123m024m134m607n205n467n222m816m706m944n121m878m324
$$ y = [150758, 148244, 144845, 141038, 137498, 134647, 132411, 130543, 129054, 128089, 127461, 126719, 125652, 124342, 122759, 120760, 118677, 117416, 117581, 118752, 119989, 120863, 121577, 122189, 122318, 121882, 121659, 122585, 124551, 126374, 127118, 127065, 127108, 127511, 127657, 126900, 125240, 123193, 121379, 120312, 120171, 120595, 120972, 121106, 121385, 122217, 123592, 125299, 127215, 129195, 131033, 132802, 134957, 137732, 140693, 143259, 145474, 147911, 150957, 154524, 158306, 161918, 164888, 166929, 168270, 169426, 170631, 171745, 172621, 173267, 173722, 174105, 174776, 176092, 177995, 180142, 182380, 184729, 186981, 188875, 190819, 193888, 198762, 204961, 211399, 217412, 222967, 228261, 233560, 239289, 245684, 252224, 257725, 261241, 262844, 263417, 263769, 264011, 263806, 263065, 262201, 261578, 260865, 259229, 256185, 252079, 247629, 243263, 239027, 234904, 230880, 226746, 222139, 216934, 211467, 206245, 201429, 196723, 191779, 186658, 181780, 177456]
53871A77456l824l491l190k969l078l465l659l415l139l285l618l573l125k814
53857A30811k891l006k802k332j711r38k61l24j414k796l268k402r48k9j55r66
53841A04568j659j608q07J30N47L48K0k9J11J42K1q1j83m56p62o54o3L90J60l66
53821I9769l38L37Q35O66L20L92N87L20j81j78L46O43M52M79J248K224K601K473
53803A12995K583L157L698L808L672L631L719L749L626L494L643M246M986N102
53789A66109M162K729J892K085K673K837K492K168K216K388K132J202N0m94j41
53774A94500L79J08r00j623j464j041j223j943k499k720l051l614l908l620l137
53759A64244k901k759k317j701j522k075k939l380l055k272j630j450j518j395
$$ y = [177456, 173632, 170141, 166951, 163982, 160904, 157439, 153780, 150365, 147226, 143941, 140323, 136750, 133625, 130811, 127920, 124914, 122112, 119780, 118069, 117131, 116870, 116546, 115132, 112336, 109068, 106666, 105718, 105689, 105534, 104568, 102909, 101301, 100494, 100624, 101171, 101519, 101539, 101510, 101621, 101763, 101784, 101703, 101520, 101064, 100302, 99648, 99585, 99975, 100135, 99769, 99431, 99768, 100603, 101269, 101589, 101981, 102568, 102888, 102707, 102529, 102875, 103518, 103970, 104449, 105697, 107921, 110522, 112995, 115578, 118735, 122433, 126241, 129913, 133544, 137263, 141012, 144638, 148132, 151775, 156021, 161007, 166109, 170271, 173000, 174892, 176977, 179650, 182487, 184979, 187147, 189363, 191751, 193883, 195085, 195135, 194641, 194500, 194879, 194987, 194087, 192464, 191000, 189959, 188736, 186793, 184294, 181574, 178523, 174909, 171001, 167381, 164244, 161343, 158584, 156267, 154566, 153044, 150969, 148030, 144650, 141595, 139323, 137693, 136243, 134725, 133330]
53745A33330r43m42k30l23m08j60L79P15L28o94j604j794j456j166r90n55P1K00
53727A24258m97j345j436p39l5Q0k34m02n3O02R12M36m03o46M9R23J135R05J061
53708A24571J792K476K730K805K934K835K287J653J494J884K434K773K822K701
53694A58191K553K391K083J672J603K246L185L485K866K129K105K633K975K914
53680A93031K782K671K240J391N82K07J26K9j2K94Q76J192P34m47j685k215j795
53663B00001r80n48o94q67n98j88k85q84j206p30J33O83Q44R95J107P22j13o11
53645A96781k43N37R49Q50N09q5r42j391o50Q67J674J039l9k26M43Q95O60L23
53627B01951N25J194J893K395K642K601K342K053J802J532J275J179J183J089
$$ y = [133330, 132387, 131945, 131715, 131392, 130984, 130824, 131203, 131918, 132246, 131552, 129948, 128154, 126698, 125532, 124542, 123987, 124058, 124258, 123761, 122416, 120980, 120241, 120206, 120286, 120052, 119650, 119597, 120199, 121111, 121547, 121144, 120498, 120547, 121470, 122605, 123510, 124571, 126363, 128839, 131569, 134374, 137308, 140143, 142430, 144083, 145577, 147461, 149895, 152668, 155490, 158191, 160744, 163135, 165218, 166890, 168493, 170739, 173924, 177409, 180275, 182404, 184509, 187142, 190117, 193031, 195813, 198484, 200724, 202115, 202697, 202904, 203030, 203059, 203047, 203341, 204217, 205409, 206143, 205696, 204011, 201796, 200001, 199021, 198473, 197779, 196912, 196314, 196126, 195841, 194957, 193751, 193021, 193154, 193837, 194681, 195676, 196783, 197505, 197392, 196781, 196538, 197075, 198024, 198874, 199383, 199298, 198356, 196965, 196315, 197182, 198856, 199895, 199856, 199630, 200073, 200968, 201628, 201951, 202476, 203670, 205563, 207958, 210600, 213201, 215543, 217596, 219398, 220930, 222205, 223384, 224567, 225656]
53613B25656R97J370K394L583M318M490M352L974L350K889L193M190N021N007
53599B74784M449M101M274M725N181N479N409M913M448M584N161N340M722L866
53585C41436L477L507L473L258L033K690J983J097N26L81L21J58R5K29L53L53
53569C66370L88M41J85m29q24l91O98J567J482M55p52j248p65R4N80O58P92R56
53551C70257N70l72r03l41O41R32N44L83P29R00N21J86N12J245J802K142K532
53534C82280K867K890K846L250M031M522M451M408N022O154P203P943Q534Q927
53520D55328Q890Q688R060J0250J1473J1904J1815J2182J3289J4382J4827J4955
53508E97043J5447J6327J7138J7790J8652J9808K0783K1258K1701K2863K4679
$$ y = [225656, 226653, 228023, 230417, 234000, 238318, 242808, 247160, 251134, 254484, 257373, 260566, 264756, 269777, 274784, 279233, 283334, 287608, 292333, 297514, 302993, 308402, 313315, 317763, 322347, 327508, 332848, 337570, 341436, 344913, 348420, 351893, 355151, 358184, 360874, 362857, 363954, 364480, 364861, 365182, 365340, 365435, 365664, 366017, 366370, 366758, 367199, 367384, 366955, 366131, 365740, 366438, 368005, 369487, 369942, 369190, 367942, 367177, 367271, 367851, 368509, 369301, 370257, 370827, 370455, 369552, 369211, 369852, 370784, 371328, 371711, 372440, 373340, 373861, 374047, 374559, 375804, 377606, 379748, 382280, 385147, 388037, 390883, 394133, 398164, 402686, 407137, 411545, 416567, 422721, 429924, 437867, 446401, 455328, 464218, 472906, 481966, 492216, 503689, 515593, 527408, 539590, 552879, 567261, 582088, 597043, 612490, 628817, 645955, 663745, 682397, 702205, 722988, 744246, 765947, 788810, 813489]
53497H13489K6083K6133K5191K4629K5258K6427K6932K6549K6158K6447K7068
53486A100364K7300K7024K6662K6421K6075K5505K5056K5183K5887K6575K6584
53475A388636K5796K4690K3693K2682K1371K0054J9416J9614J9967J9759J8904
53464A624582J7564J5637J3099J0518Q667P631O702N116K699j94l050n537p662
53451A695772r528j0968j1675j1866j2445j4167j6829j9541k1581k2740k3143
53440A521289k3187k3491k4381k5478k6066k5801k4862k3719k2983k3094k3619
53429A254608k3225k1067j7999j5732j4859j4431j3489j2126j0865r758q501o953
53417A085603n146l140j166M33J641K856M418O320Q428J0575J2341J3444J4422
$$ y = [813489, 839572, 865705, 890896, 915525, 940783, 967210, 994142, 1020691, 1046849, 1073296, 1100364, 1127664, 1154688, 1181350, 1207771, 1233846, 1259351, 1284407, 1309590, 1335477, 1362052, 1388636, 1414432, 1439122, 1462815, 1485497, 1506868, 1526922, 1546338, 1565952, 1585919, 1605678, 1624582, 1642146, 1657783, 1670882, 1681400, 1690067, 1697698, 1704400, 1709516, 1712215, 1712021, 1708971, 1703434, 1695772, 1686244, 1675276, 1663601, 1651735, 1639290, 1625123, 1608294, 1588753, 1567172, 1544432, 1521289, 1498102, 1474611, 1450230, 1424752, 1398686, 1372885, 1348023, 1324304, 1301321, 1278227, 1254608, 1231383, 1210316, 1192317, 1176585, 1161726, 1147295, 1133806, 1121680, 1110815, 1101057, 1092556, 1085603, 1080457, 1077317, 1076151, 1076584, 1078225, 1081081, 1085499, 1091819, 1100247, 1110822, 1123163, 1136607, 1151029]
53404A151029J6268J9070K1655K3047K3681K4598K5998K7387K8780L0778L3466
53393A425757L6026L7731L8838M0196M2295M4880M7287M9000M9981N0621N1343
53382A913955N2330N3587N5084N6602N7752N8349N8669N8966N8873N7767N5710
53371B537644N3636N2321N1437M9840M6732M2393L7784L3596K9726K5675K1294
53360B982078J6994J3146R470N269K06n309j0555j5194j9453k3715k8021l2095
53348B892821l5815l9451m3333m7307n0780n3314n4938n5916n6411n6524n6414
53337B342618n6204n5848n5287n4622n4004n3477n2922n2123n0862m9136m7284
53326A760849m5658m4108m2097l9474l6773l4562l2745l0852k8766k6801k5167
$$ y = [1151029, 1167297, 1186367, 1208022, 1231069, 1254750, 1279348, 1305346, 1332733, 1361513, 1392291, 1425757, 1461783, 1499514, 1538352, 1578548, 1620843, 1665723, 1713010, 1762010, 1811991, 1862612, 1913955, 1966285, 2019872, 2074956, 2131558, 2189310, 2247659, 2306328, 2365294, 2424167, 2481934, 2537644, 2591280, 2643601, 2695038, 2744878, 2791610, 2834003, 2871787, 2905383, 2935109, 2960784, 2982078, 2999072, 3012218, 3021688, 3026957, 3027163, 3021854, 3011299, 2996105, 2976652, 2952937, 2924916, 2892821, 2857006, 2817555, 2774222, 2726915, 2676135, 2622821, 2567883, 2511967, 2455556, 2399032, 2342618, 2286414, 2230566, 2175279, 2120657, 2066653, 2013176, 1960254, 1908131, 1857269, 1808133, 1760849, 1715191, 1671083, 1628986, 1589512, 1552739, 1518177, 1485432, 1454580, 1425814, 1399013, 1373846]
53315A373846k3737k2366k1022j9641j8103j6444j4902j3582j2307j0850r270
53304A191622p944p221o952o385m768k215K94J918K785L566M510N384O182P341
53290A188117R103J1169J3167J5111J7093J8887K0236K1363K2738K4358K5640
53279A386982K6141K6078K6000K6118K6261K6258K6107K5735K4862K3315K1317
53268A665174J9314J7581J6046J4411J2369R831P115M728K779P70j743m414o513
53255A757448q027r846j2600j5743j8187j9536k0335k1292k2652k4308k6060k7735
53243A531127k9217l0469l1437l2016l2220l2231l2023l1228k9755k8342k7927
53232A194262k8346k8327k7040k5179k4051k3915k3814k2939k1589k0544k0008
$$ y = [1373846, 1350109, 1327743, 1306721, 1287080, 1268977, 1252533, 1237631, 1224049, 1211742, 1200892, 1191622, 1183678, 1176457, 1169505, 1163120, 1158352, 1156137, 1156431, 1158349, 1161134, 1164700, 1169210, 1174594, 1180776, 1188117, 1197220, 1208389, 1221556, 1236667, 1253760, 1272647, 1292883, 1314246, 1336984, 1361342, 1386982, 1413123, 1439201, 1465201, 1491319, 1517580, 1543838, 1569945, 1595680, 1620542, 1643857, 1665174, 1684488, 1702069, 1718115, 1732526, 1744895, 1754726, 1761841, 1766569, 1769348, 1770118, 1768375, 1763961, 1757448, 1749421, 1739575, 1726975, 1711232, 1693045, 1673509, 1653174, 1631882, 1609230, 1584922, 1558862, 1531127, 1501910, 1471441, 1440004, 1407988, 1375768, 1343537, 1311514, 1280286, 1250531, 1222189, 1194262, 1165916, 1137589, 1110549, 1085370, 1061319, 1037404, 1013590, 990651, 969062, 948518, 928510]
53221I28510j9576j8916j8119j7301j6352j5236j4188j3407j2657j1600j0406
53210G60752r717r886j0511j0937j1003j1072j1386j1661j1419j0636r845r592
53198F33087r793r802r156q173p675q119r124r838r713q957q383q708r859j0960
53184E04827j1128j0291r157q518q673r320r765r421q464p798p969q324p783o414
53170C81802n397n395n727n571n165n216n664n894n824n946o390o602o069m895
53156C02047l603k724k557k983l516l852m187m766n318n327m716l755k616j529
53142B50598j099j675k514k467j599j227k077l191l195k001p27l16p83j488j744
53127B24495j369r42j238k155k615j918o48J40J65k11q41j689k220j829q06p8
$$ y = [928510, 908934, 890018, 871899, 854598, 838246, 823010, 808822, 795415, 782758, 771158, 760752, 751035, 741149, 730638, 719701, 708698, 697626, 686240, 674579, 663160, 652524, 642679, 633087, 623294, 613492, 604336, 596163, 588488, 580369, 571245, 561407, 551694, 542737, 534354, 525646, 515787, 504827, 493699, 483408, 474251, 465733, 457060, 447740, 437975, 428554, 420090, 412292, 404323, 395999, 388216, 381802, 376405, 371010, 365283, 359712, 354547, 349331, 343667, 337773, 331949, 326003, 319613, 313011, 306942, 302047, 298444, 295720, 293163, 290180, 286664, 282812, 278625, 273859, 268541, 263214, 258498, 254743, 252127, 250598, 249499, 247824, 245310, 242843, 241244, 240017, 237940, 234749, 231554, 229553, 228826, 228510, 227727, 226239, 224495, 223126, 222184, 220946, 218791, 216176, 214258, 213610, 213750, 213915, 213704, 212863, 211174, 208954, 207125, 206319, 206241]
53111B06241N6J31M17N32L95O32J444J924J282J75p7P54J694K011J834J308J20
53094B20873j698l243l614k938k050j520j426j704k211k537k375k032k163k899
53080A88463l681l988l905l792l716l349k401j002J97M03o11k125l022k813j973
53065A52685j326j234j437j447j089p65j039j854k440k263j713j394j109l96K66
53050A33445j73j579k440j831o14k9n1%R9j35l54P6P46O08m41j410j737j858k037
53031A20285j751p32K31K16o64j572j977j940j689j338q74k35M08N25j93j114
53015A07586j201l89K22j16p85p67l2O50P68L80l20j051j295p80J6L30R7m6K78
52996A03545O99O42L0o87r64o21k8J99j58o45o91k59K16M41N51Q26J373J976K214
$$ y = [206241, 206297, 206428, 206845, 207377, 207772, 208404, 209848, 211772, 213054, 213229, 213152, 213906, 215600, 217611, 219445, 220753, 220873, 219175, 215932, 212318, 209380, 207330, 205810, 204384, 202680, 200469, 197932, 195557, 193525, 191362, 188463, 184782, 180794, 176889, 173097, 169381, 166032, 163631, 162629, 162826, 163229, 162618, 160493, 157471, 154658, 152685, 151359, 150125, 148688, 147241, 146152, 145387, 144348, 142494, 140054, 137791, 136078, 134684, 133575, 133179, 133445, 133272, 131693, 129253, 127422, 126808, 126779, 126728, 126728, 126827, 126692, 126338, 126414, 127160, 127768, 127327, 125917, 124180, 122322, 120285, 118534, 117802, 118033, 118249, 117585, 116013, 114036, 112096, 110407, 109069, 108195, 107960, 108368, 108893, 108700, 107586, 106385, 105996, 106218, 106102, 105317, 104550, 104518, 105168, 105936, 106316, 105996, 104945, 103650, 102870, 102886, 103216, 103313, 103267, 103545, 104244, 104886, 104916, 104229, 103265, 102644, 102616, 102815, 102657, 102012, 101321, 101062, 101278, 101719, 102270, 103096, 104469, 106445, 108659]
52977A08659J817J114P93J159J724J813J282M66j86k23O51K029K801K285J151
52962A27335O34J044J709K263K979L803L961L112K173K280L284L944L480K364
52948A64365J538J344J363J033K28o01q92n26L9K81J05l02q50j474j820j541r65
52931A61325r87j950k984k948j826p03l46m39l39m8M6o4l2K21M42N33N64L67l42
52912A50490j296j737j367p08k66J40P55J181R59N07P17J580K002J190k84j200
52896A52663j028k26N02Q43Q60P28N69M09J83j21l31k39J45N55P72Q33Q22O52
52878A58591K47j33n0M85Q53O11P3j61j28k88n37j27J163K365K360J252J60j86
52860A66550o8j9k1K85Q95J322J190P08M44O05P68M48k20o14l89K25Q77J394J583
$$ y = [108659, 110476, 111590, 112383, 113542, 115266, 117079, 118361, 118827, 118641, 118418, 119069, 121098, 123899, 126184, 127335, 127969, 129013, 130722, 132985, 135964, 139767, 143728, 146840, 149013, 151293, 154577, 158521, 162001, 164365, 165903, 167247, 168610, 169643, 169871, 169270, 168378, 167852, 167891, 168172, 168277, 167975, 167125, 165651, 163831, 162290, 161325, 160338, 158388, 155404, 152456, 150630, 149927, 149581, 149142, 148803, 148755, 148801, 148737, 148705, 148926, 149368, 149901, 150465, 150832, 150490, 149194, 147457, 146090, 145382, 145116, 145256, 146011, 147192, 148151, 148658, 149375, 150955, 152957, 154147, 153863, 152663, 151635, 151409, 151911, 152754, 153614, 154342, 154911, 155320, 155503, 155382, 155051, 154812, 154957, 155512, 156284, 157117, 157939, 158591, 158838, 158705, 158655, 159140, 159993, 160604, 160677, 160516, 160388, 160100, 159563, 159436, 160599, 162964, 165324, 166576, 166736, 166550, 166482, 166463, 166442, 166727, 167622, 168944, 170134, 170842, 171286, 171891, 172659, 173107, 172887, 172273, 171884, 172109, 172986, 174380, 175963]
52841A75963J252O74N73J191J830J746J212J073J498J832J621J172R82J134J440
52826A95193J688J593R04k21j239j787j979k063k057j875j533j136q17p88j160
52811A82723j665j893j848j973k398k684k450j997j867k099k280k188k023k019
52797A53339k183k352k321j958j435j237j674k381k665k326j801j432j009l90
52783A28175o5o15j727k374k046j297q23n99l57l48r31j611j473o19l20j314k645
52766A09011k860j816o62k69m75p06p09n29l65n12j072j643j683j257r41r71r80
52749I1561p25m91n06m67j03K05j05q96j446j334q80n98o59q81j026r32n40M1
52731H0218N91R21R83Q54O55M88L31M4m13q32r83r81j286k072k803k643j448n5
$$ y = [175963, 177215, 177889, 178462, 179653, 181483, 183229, 184441, 185514, 187012, 188844, 190465, 191637, 192619, 193753, 195193, 196881, 198474, 199378, 199157, 197918, 196131, 194152, 192089, 190032, 188157, 186624, 185488, 184671, 183883, 182723, 181058, 179165, 177317, 175344, 172946, 170262, 167812, 165815, 163948, 161849, 159569, 157381, 155358, 153339, 151156, 148804, 146483, 144525, 143090, 141853, 140179, 137798, 135133, 132807, 131006, 129574, 128565, 128175, 128110, 127495, 125768, 123394, 121348, 120051, 119228, 118629, 118272, 117924, 116993, 115382, 113909, 113290, 112970, 111656, 109011, 106151, 104335, 103673, 103404, 102929, 102223, 101514, 100985, 100620, 100108, 99036, 97393, 95710, 94453, 93512, 92541, 91561, 90836, 90345, 89839, 89372, 89269, 89474, 89369, 88473, 87027, 85693, 84813, 84215, 83556, 82675, 81649, 80717, 80177, 80218, 80809, 81730, 82713, 83567, 84222, 84710, 85041, 85085, 84672, 83840, 82857, 81876, 80590, 78518, 75715, 73072, 71624, 71569]
52713G1569N58K42l97q56j064r63l66N56J150J090R17J271J816J642O36k15q1
52696G7505P59J474J750J866J994J901J347M73k72m58N2R75J759J984J646J122
52680I5877Q25R55J405J876K027J581M85r44k034k261j746j151q53n95o9L84J82
52663I5944o24j328j507j483j694k007j930j338o86m53o46q67q88r37j283j634
52647G6639j336k77P89J082O11j57r86j750j970j248pQ49J116J412K053K514K246
52630H1580J456O85J15l29o25p93j018j278j177n36J61K97m6l06k73k52m00l91
52612G6870RM40L73o5j26N37J229J081L03lN73J159R35L89M52J040J317J121J052
52593H8686J218R89K14l78l28j09k41m68k91L23J092J747J910J364O42O44J335
$$ y = [71569, 72127, 72369, 71972, 71116, 70052, 69089, 68723, 69279, 70429, 71519, 72436, 73707, 75523, 77165, 77801, 77586, 77505, 78264, 79738, 81488, 83354, 85348, 87249, 88596, 89069, 88797, 88339, 88391, 89366, 91125, 93109, 94755, 95877, 96702, 97657, 99062, 100938, 102965, 104546, 105031, 104087, 102053, 99792, 98046, 96895, 96042, 95447, 95378, 95762, 95944, 95320, 93992, 92485, 91002, 89308, 87301, 85371, 84033, 83347, 82894, 82248, 81381, 80493, 79556, 78273, 76639, 75303, 75026, 75815, 76897, 77508, 77351, 76365, 74615, 72645, 71397, 71390, 72239, 73355, 74767, 76820, 79334, 81580, 83036, 83721, 83836, 83507, 82882, 82089, 81071, 79793, 78616, 78080, 78241, 78538, 78492, 78186, 77913, 77661, 77261, 76870, 76879, 77319, 77692, 77627, 77501, 78038, 79267, 80348, 80651, 80648, 81221, 82380, 83315, 83704, 84156, 85196, 86513, 87634, 88686, 89904, 90893, 91107, 90729, 90401, 90292, 90051, 89583, 89292, 89615, 90707, 92454, 94364, 95728, 96370, 97014, 98349]
52576I8349J714J384J099J269J135K88k01O33J855J873Q08J63N41J167J515J873
52560A15465K213J886Q43N8K07Q23J070P14M1n14n02J61Q27Q40N50Q32J681K193
52542A29388K046J845J815J363L64k44J49Q10Q44M87M86Q19R88R84J126J253R78
52525A45501M30Qk95o38o86o7P64R31L66j82l62n82j050j273q82l33k63n49n27
52506A40311K6N41M17j58l15N00J720K122J164l31j108q96n01o11r75r43m23Q6
52488A40626J80J6P4O72J668K482K450J463K48k13L06J060J262J013R26J087R63
52471A56283L80q8J3L42M22M84R14J306Q46l44j149q66k6N38O93P91Q75P36M48
52452A62598L72O95J175J299P09l80j136r06j07J91l13o59L3J326K041J746J034
$$ y = [98349, 100063, 101447, 102546, 103815, 104950, 105238, 105037, 105670, 107525, 109398, 110206, 110369, 110910, 112077, 113592, 115465, 117678, 119564, 120407, 120465, 120672, 121495, 122565, 123279, 123320, 122806, 122304, 122465, 123292, 124132, 124682, 125514, 127195, 129388, 131434, 133279, 135094, 136457, 136821, 136577, 136726, 137536, 138380, 138867, 139353, 140172, 141160, 142144, 143270, 144523, 145501, 145931, 145939, 145644, 145006, 144320, 144253, 145017, 145948, 146314, 146132, 145770, 145188, 144138, 142865, 141983, 141650, 141387, 140838, 140311, 140337, 140878, 141295, 141137, 140822, 141322, 143042, 145164, 146328, 145997, 144889, 143993, 143492, 142881, 141906, 140963, 140540, 140626, 140806, 140822, 140896, 141568, 143236, 145718, 148168, 149631, 149879, 149666, 149972, 151032, 152294, 153307, 154233, 155320, 156283, 156663, 156575, 156588, 156930, 157352, 157836, 158750, 160056, 160902, 160558, 159409, 158543, 158517, 159055, 159748, 160539, 161414, 162150, 162598, 162970, 163665, 164840, 166139, 166848, 166468, 165332, 164426, 164319, 164510, 164197, 163538, 163571, 164897, 166938, 168684, 169718]
52435A69718N05J46k86p33r21p13k48J01M7k63l13J89Q85J145P45Oo33r26q67
52416A67584o49n73p16p79m05L16Q63P99J94m26n24k3O02Q33O03K33j15n14r25
52397A66378j150j170j142r44k88O03R94O31J82K60N75O15N74Q92J302J179O12
52380A70103K91L67K74j94m38R0J125K012K434K444K187J841J639J707J986K317
52364A90185K400J854P25j58Q3J267K277K430K135K046K086J798J231R87J519
52349B12865K646L728M128L671K763J983J506J191J046J271J761K085K148K319
52335B45111K666K619J865J074J093J677J767R80J37P2N66Q52Q06J041J856K618
52319B66800K575J932J688K274K979L057K955L717N335O553O500N811N607O077
$$ y = [169718, 170223, 170369, 170083, 169350, 168429, 167716, 167468, 167569, 167616, 167353, 167040, 167229, 168114, 169259, 170004, 170010, 169377, 168451, 167584, 166935, 166362, 165646, 164867, 164462, 164778, 165641, 166440, 166634, 166208, 165684, 165661, 166263, 167096, 167699, 167932, 167817, 167303, 166378, 165228, 164058, 162916, 161972, 161684, 162287, 163281, 163912, 164094, 164354, 164929, 165544, 166118, 167010, 168312, 169491, 170103, 170394, 170761, 171035, 170841, 170403, 170493, 171618, 173630, 176064, 178508, 180695, 182536, 184175, 185882, 187868, 190185, 192585, 194439, 195164, 195006, 195089, 196356, 198633, 201063, 203198, 205244, 207330, 209128, 210359, 211346, 212865, 215511, 219239, 223367, 227038, 229801, 231784, 233290, 234481, 235527, 236798, 238559, 240644, 242792, 245111, 247777, 250396, 252261, 253335, 254428, 256105, 257872, 258852, 258989, 259061, 259627, 260479, 261285, 262326, 264182, 266800, 269375, 271307, 272995, 275269, 278248, 281305, 284260, 287977, 293312, 299865, 306365, 312176, 317783, 323860]
52305C23860O699P373Q431R666J0269R893R170Q887R208R853J0640J1385J1780
52292D47114J1710J1574J1839J2486J3138J3565J3742J3615J3256J3049J3272
52281E88360J3513J3052J1922J1011J0800J0635R779Q714Q516R090Q961P215M821
52268G16389L431L320L347K662J659J063Q69N96J56j35j62j57k57k80p1K19L05
52251G32954J42q9k67m80p73q79l69Q55K372L705M822N964P090P819P953P793
52235G78612P769Q079Q708R503J0099J0084R551R059Q823Q301P040N590M847M708
52221H90773M215L058K077J930K081J700Q79K04l80j422k884m114m948n916p220
52206H80033q233q411q080p873p902p903p788p575p132o495o065o052o016n519
$$ y = [323860, 330559, 337932, 346363, 356029, 366298, 376191, 385361, 394248, 403456, 413309, 423949, 435334, 447114, 458824, 470398, 482237, 494723, 507861, 521426, 535168, 548783, 562039, 575088, 588360, 601873, 614925, 626847, 637858, 648658, 659293, 669072, 677786, 686302, 695392, 704353, 711568, 716389, 719820, 723140, 726487, 729149, 730808, 731871, 732740, 733336, 733492, 733357, 733195, 733038, 732781, 732501, 732430, 732649, 732954, 733096, 733007, 732740, 732260, 731487, 730608, 730239, 731094, 733466, 737171, 741993, 747957, 755047, 762866, 770819, 778612, 786381, 794460, 803168, 812671, 822770, 832854, 842405, 851464, 860287, 868588, 875628, 881218, 886065, 890773, 894988, 898046, 900123, 902053, 904134, 905834, 906713, 906917, 906537, 905115, 902231, 898117, 893169, 887253, 880033, 871800, 863389, 855309, 847436, 839534, 831631, 823843, 816268, 809136, 802641, 796576, 790524, 784508, 778989]
52192G78989m862m576m424l768k688j986j984k179k230k397k674k375j126L27
52178G42047R18M47n61j658k558k870k477j951j952k338k512k439k654l283l772
52163G12387l688l247k888k737k665k523k207j808j679k064k711l190l476l741
52149F73763l705k878j529p09r95j822k364k569k850l199l237k898k542k417k426
52134F37623k406k326k188j937j579j263j250j736k603l299l303k743k332k502
52120F06156k869k779k093j222o34n06p03q31m35N52J744K807L742M540M933M885
52104F17287N013N927P363Q495R084R709J0812J2053J2885J3289J3668J4242J4980
52091G54807J5806J6627J7223J7456J7469J7428J7160J6385J5279J4431J4082
$$ y = [778989, 774127, 769551, 765127, 761359, 758671, 756685, 754701, 752522, 750292, 747895, 745221, 742846, 741720, 742047, 742965, 743412, 742851, 741193, 738635, 735765, 733288, 731337, 729385, 727047, 724535, 722096, 719442, 716159, 712387, 708699, 705452, 702564, 699827, 697162, 694639, 692432, 690624, 688945, 686881, 684170, 680980, 677504, 673763, 670058, 667180, 665651, 664942, 663947, 662125, 659761, 657192, 654342, 651143, 647906, 645008, 642466, 640049, 637623, 635217, 632891, 630703, 628766, 627187, 625924, 624674, 622938, 620335, 617036, 613733, 610990, 608658, 606156, 603287, 600508, 598415, 597193, 596559, 596053, 595350, 594519, 594084, 594636, 596380, 599187, 602929, 607469, 612402, 617287, 622300, 628227, 635590, 644085, 653169, 662878, 673690, 685743, 698628, 711917, 725585, 739827, 754807, 770613, 787240, 804463, 821919, 839388, 856816, 873976, 890361, 905640, 920071, 934153]
52080I34153J3698J2608J0875R197Q072P370O744O003M957L362J371k65r62j146
52066A016037j816l282m804n568n595n474n612o037o573o908o666n821m882m391
52052I42608m340m300l972l393k701k020j529j337j290j048m20N00J427K033K136
52037I22354J878J682J816K250K922L869M849N130M206K564J281Q46Q10N83J08
52022I57148m21r99j731k542l251l834m341m808n368o263p515q704r424r834j0434
52007H77679j1304j1922j1968j1990j2867j4675j6467j7334j7355j7293j7566
51996G16938j7908j7984j7894j7978j8322j8633j8496j7738j6764j6386j6968
51985E21867j7792j7736j6686j5663j5357j5236j4606j3871j3878j4344j4039
$$ y = [934153, 947851, 960459, 971334, 980531, 988603, 995973, 1002717, 1008720, 1013677, 1017039, 1018410, 1018145, 1017183, 1016037, 1014221, 1010939, 1006135, 1000567, 994972, 989498, 983886, 977849, 971276, 964368, 957702, 951881, 946999, 942608, 938268, 933968, 929996, 926603, 923902, 921882, 920353, 919016, 917726, 916678, 916258, 916758, 918185, 920218, 922354, 924232, 925914, 927730, 929980, 932902, 936771, 941620, 946750, 950956, 953520, 954801, 955647, 956457, 957040, 957148, 956727, 955728, 953997, 951455, 948204, 944370, 940029, 935221, 929853, 923590, 916075, 907371, 897947, 888113, 877679, 866375, 854453, 842485, 830495, 817628, 802953, 786486, 769152, 751797, 734504, 716938, 699030, 681046, 663152, 645174, 626852, 608219, 589723, 571985, 555221, 538835, 521867, 504075, 486339, 469653, 453990, 438633, 423397, 408791, 394920, 381042, 366698, 352659]
51974C52659j2579j1074j0614j0828j0501r188p546o323n623n203n032n182n409
51961B47557n199m407l640l591m068m120l296k323k079k366k288j636j114j208
51947B06222j606j887k094k273k090j398p06n17n72k98J93J93n44j383j581j134
51931A88525o35n17o41n80k62j17n70j371j773j397p29n44j051j838k419k636
51915A71445k597k522k621k926l224l206k716j816p44J71O60P39O22M05kn57j012
51898A50099j241j398j603j716j666j703k044k435k412j861j067m06j90o02j379
51883A28376j799j345l11O11J159J510J651J351P21K25M4p9k33j36K31L75L6k65
51865A32122P7Q09J146P95K11j12o8L42J191K285K983K754J825J047J077J772
$$ y = [352659, 340080, 329006, 318392, 307564, 297063, 287875, 280329, 274006, 268383, 263180, 258148, 252966, 247557, 242358, 237951, 234311, 230720, 226652, 222532, 219236, 216913, 214834, 212468, 210180, 208544, 207430, 206222, 204616, 202729, 200635, 198362, 196272, 194874, 194168, 193651, 193079, 192781, 192974, 193167, 192623, 191240, 189659, 188525, 187890, 187373, 186732, 186152, 185890, 185773, 185203, 183832, 182059, 180662, 179933, 179389, 178338, 176500, 174081, 171445, 168848, 166326, 163705, 160779, 157555, 154349, 151633, 149817, 149073, 149244, 149904, 150643, 151265, 151670, 151668, 151111, 150099, 148858, 147460, 145857, 144141, 142475, 140772, 138728, 136293, 133881, 132020, 130953, 130547, 130357, 129755, 128376, 126577, 125232, 124921, 125532, 126691, 128201, 129852, 131203, 131924, 132149, 132193, 132114, 131881, 131745, 131976, 132351, 132387, 132122, 132199, 133008, 134154, 134949, 135160, 135048, 134980, 135322, 136513, 138798, 141781, 144535, 146360, 147407, 148484, 150256]
51849A50256K418K446J938J434J263J191P75m0p95j071r21o66m54k13qm9l09l30
51831A56865K07R12R89J85q44j205o06N80J780K482K367J554O98L97N29M65L4
51814A67389j78K93J029J205O45l1k95k61k71l45l24k74m04o66q34r05j104j339
51796A63330j124k56O92R41M73j2k6K05K78K15K63M14M81M54N02O52P88Q76R62
51777A70108R55O87K45l5N8L84P06R93J339J714J940J958J996K388L112L642L472
51760A95662K751K120J833J505R77R83K364M783O899P816P797P480P070O574O213
51745B62827O081N815N052L943K842J725M44o96j199j140j105j327j451j212q61
51730B79738o84n40j73L56Q44J250J556J579J266R89J177J667J797J159M8r03
$$ y = [150256, 152674, 155120, 157058, 158492, 159755, 160946, 161721, 161681, 160886, 159815, 158894, 158228, 157774, 157561, 157553, 157504, 157195, 156865, 157072, 157984, 158973, 159158, 158314, 157109, 156503, 157083, 158863, 161345, 163712, 165266, 165964, 166361, 166890, 167355, 167389, 167211, 167504, 168533, 169738, 170383, 170352, 170057, 169796, 169525, 169180, 168856, 168582, 168178, 167512, 166678, 165773, 164669, 163330, 162206, 161950, 162642, 163583, 164056, 164044, 164018, 164223, 164501, 164716, 164979, 165393, 165874, 166328, 166830, 167482, 168270, 169146, 170108, 171063, 171750, 171995, 171960, 172018, 172402, 173108, 174101, 175440, 177154, 179094, 181052, 183048, 185436, 188548, 192190, 195662, 198413, 200533, 202366, 203871, 204848, 205831, 208195, 212978, 219877, 227693, 235490, 242970, 250040, 256614, 262827, 268908, 274723, 279775, 283718, 286560, 288285, 288729, 288033, 286834, 285694, 284589, 283262, 281811, 280599, 279738, 279054, 278514, 278341, 278697, 279541, 280791, 282347, 283926, 285192, 286181, 287358, 289025, 290822, 291981, 292029, 291126]
51714B91126j293j162q25o01n45m35j23J51k8p19j491j885j805j478j148r31p64
51697B76044m62O2N69O93M05P8K9K40O06J170J920K571K859K849K758K621K447
51680B97459K473K875L311L248K704K301K444K875L110L020K778K507K201J823
51666C35129J379J005R66J310J517R09m70j735k129j862j739k306l534n024o159
51651C17257o410n834n125m896n060n172n053m802m475m178m160m412m406l760
51637B49514k880k476k577k648k447k251k247k348k537k810k824k262j507j256
51623B16444j442j327p52l99n70o10j09K30m10j694k563k459j475J54J896K703
51607B07617J946L99n11m45l21p78j297j082p9J194K311L079L404L345L130K935
$$ y = [291126, 289833, 288671, 287846, 287245, 286700, 286265, 286142, 286293, 286265, 285546, 284055, 282170, 280365, 278887, 277739, 276808, 276044, 275582, 275644, 276213, 276906, 277311, 277389, 277418, 277658, 278264, 279434, 281354, 283925, 286784, 289633, 292391, 295012, 297459, 299932, 302807, 306118, 309366, 312070, 314371, 316815, 319690, 322800, 325820, 328598, 331105, 333306, 335129, 336508, 337513, 338479, 339789, 341306, 342215, 341745, 340010, 337881, 336019, 334280, 331974, 328440, 323416, 317257, 310847, 305013, 299888, 294992, 289932, 284760, 279707, 274905, 270430, 266252, 262092, 257680, 253274, 249514, 246634, 244158, 241581, 238933, 236486, 234235, 231988, 229640, 227103, 224293, 221469, 219207, 217700, 216444, 215002, 213675, 212923, 212524, 211954, 211344, 211235, 211465, 211055, 209361, 206798, 204339, 202864, 203018, 204914, 207617, 209563, 209962, 209451, 209006, 208685, 207907, 206610, 205528, 205449, 206643, 208954, 212033, 215437, 218782, 221912, 224847]
51591B24847K825K916L273L672L815L829M146M752N084M806M322M188M340M227
51577B81042L528K401J188J38o60j292j895k458k798k847k769k676k395j750r16
51562B65841l14q7P2N38J281J871K022K016K415L319M142M285L820L270K882K514
51546B99887K061J557R47J71m37m00J95P23R13J100J377J169J84p66o94J46O06
51529C08739K61j00K25Q76J101Q03M37K23m4m80r18j198j386j605j862k175k669
51512C00228l432m242m613m220l372k868l238m123m618m213l230k312j748j422
51498B52577j167r45p97q36j165j602j643j034k08J18j56m02q2P19J644K520L167
51481B50708L201K545J898K126L108L820L669L341L854N133N982N551M416L959
$$ y = [224847, 227672, 230588, 233861, 237533, 241348, 245177, 249323, 254075, 259159, 263965, 268287, 272475, 276815, 281042, 284570, 286971, 288159, 288297, 287637, 286345, 284450, 281992, 279194, 276347, 273578, 270902, 268507, 266757, 265841, 265527, 265440, 265512, 266050, 267331, 269202, 271224, 273240, 275655, 278974, 283116, 287401, 291221, 294491, 297373, 299887, 301948, 303505, 304452, 304623, 304186, 303786, 303981, 304704, 305617, 306717, 308094, 309263, 309447, 308681, 307987, 308133, 308739, 309000, 308900, 309125, 310001, 311102, 311905, 312342, 312565, 312521, 312041, 311123, 309925, 308539, 306934, 305072, 302897, 300228, 296796, 292554, 287941, 283721, 280349, 277481, 274243, 270120, 265502, 261289, 258059, 255747, 253999, 252577, 251410, 250465, 249668, 248832, 247667, 246065, 244422, 243388, 243180, 243298, 243142, 242740, 242658, 243377, 245021, 247541, 250708, 253909, 256454, 258352, 260478, 263586, 267406, 271075, 274416, 278270, 283403, 289385, 294936, 299352, 303311]
51467C03311M742N832N929M973M198M557N552O018N604M910M388L840L092K406
51453C69352J937J421P60M31Q09J476J711J364Q21M07L03O77J362J640J064K12
51437C85747kL28K27p96k201l333m089m540m582m350m343m740n086m938m482m137
51421C34683l969l785l500l063k364j525r19p47q06r32j181j382j013J26J525
51406C11148K657L515M119M052L086J820J088R73J055J158J207P11o96k368l234
51391C30291l272l533m571n713o213o238o296o367o170n818n657n728n820n833
51377B53062n702n276m652m288m388m390l622k323j489j687k478l166l585l929
51363B02087m173m100l749l447l279k886j957p63K8P8l29o67p07n97n84p69r74
$$ y = [303311, 308053, 313885, 319814, 324787, 328985, 333542, 339094, 345112, 350716, 355626, 360014, 363854, 366946, 369352, 371289, 372710, 373470, 373901, 374710, 376186, 377897, 379261, 380082, 380489, 380792, 381469, 382831, 384471, 385535, 385747, 385745, 386073, 386300, 385504, 383303, 379970, 375881, 371341, 366759, 362409, 358066, 353326, 348240, 343302, 338820, 334683, 330714, 326929, 323429, 320366, 318002, 316477, 315558, 314811, 314005, 313073, 311892, 310510, 309497, 309623, 311148, 313805, 317320, 321439, 325491, 328577, 330397, 331485, 332458, 333513, 334671, 335878, 336589, 335893, 333525, 330291, 327019, 323486, 318915, 313202, 306989, 300751, 294455, 288088, 281918, 276100, 270443, 264715, 258895, 253062, 247360, 242084, 237432, 233144, 228756, 224366, 220744, 218421, 216932, 215245, 212767, 209601, 206016, 202087, 197914, 193814, 190065, 186618, 183339, 180453, 178496, 177733, 177761, 177839, 177510, 176843, 176136, 175539, 174955, 174186, 173212]
51346A73212q47j94N93P57k2j173j750j322j65J114J957K021J442Q64Q82J420
51330A78789J944K209K399K542K311J668J215J534K415L127L339L366L504L541
51316B13903L140K374J592R31K98j34N6P15Q29m07k475m078m726n026n326n057
51300A96609l913k800k805l697m340m262l943l733l449l070k956l127l095k618
51286A48801k036j598j186q34q64j175j129n52j42l77p01m18J19R1m60o76k18
51269A36645K67J81k01k13K46N96L10m56j019r74o51o51r63r71l64L65N71K48
51251A32966j56m20p26j254j896k268j971j037r9K43K08N01J100J118K35n46j74
51234A25824R24J467J030L06j01k69l64k67jJ70J74J84J43k54r27j298r81k68
$$ y = [173212, 172365, 172171, 172764, 173521, 173499, 172326, 170576, 169254, 169089, 170203, 172160, 174181, 175623, 176487, 177369, 178789, 180733, 182942, 185341, 187883, 190194, 191862, 193077, 194611, 197026, 200153, 203492, 206858, 210362, 213903, 217043, 219417, 221009, 221940, 222238, 222104, 222160, 222875, 223704, 223297, 220822, 216744, 212018, 206992, 201666, 196609, 192696, 189896, 187091, 183394, 179054, 174792, 170849, 167116, 163667, 160597, 157641, 154514, 151419, 148801, 146765, 145167, 143981, 143147, 142283, 141108, 139979, 139427, 139285, 138908, 138207, 137789, 137908, 137999, 137539, 136863, 136645, 136912, 137093, 136892, 136679, 136925, 137521, 137831, 137375, 136356, 135382, 134731, 134080, 133117, 132146, 131782, 132147, 132718, 132966, 132810, 132390, 131664, 130410, 128514, 126246, 124275, 123238, 123139, 123382, 123590, 124091, 125191, 126309, 126544, 125998, 125824, 126748, 128215, 129245, 129551, 129450, 129181, 128817, 128550, 128549, 128719, 128893, 129077, 129220, 128966, 128039, 126741, 125760, 125492]
51216A25492L01M49K36o9j00L24R28J264J223J008P43M52L40O06J048J275J259
51199A36779J158P80j80j328j726j033J23R77J309J189P56M46P21J296J300M35
51183A43002o54j417j974k302j825n58L03j55j081r97Q2P90M27l24o65o30n13
51166A31509l45j98k99n64o48o45j025j677j836j230n52l78l89j92j33n79j037
51149A19782q46l02j60l71k43K56M06J9j15O13J772K547K651K237J515Q72Q39
51132A31472J405J787J385O16L05N24O10J12q00j740k332k243j500p84q35j511
51116A26471j974j761j164n48J09P57J015O83J47j32j54j45j68k31m62q42j014
51099A20587p00m0O95J382J866J896J586J492J798J872J218M45N40J418J924J345
$$ y = [125492, 125793, 126242, 126478, 126409, 126309, 126633, 127561, 128825, 130048, 131056, 131799, 132251, 132591, 133197, 134245, 135520, 136779, 137937, 138717, 138537, 137209, 135483, 134450, 134573, 135550, 136859, 138048, 138804, 139250, 139971, 141267, 142567, 143002, 142348, 140931, 138957, 136655, 134830, 134272, 134575, 134420, 133339, 132342, 132424, 133214, 133641, 133317, 132652, 132022, 131509, 131164, 130966, 130667, 130103, 129455, 128810, 127785, 126108, 124272, 123042, 122490, 122112, 121723, 121531, 121398, 120819, 119782, 118936, 118634, 118474, 118103, 117860, 118116, 118522, 118541, 118426, 119039, 120811, 123358, 126009, 128246, 129761, 130633, 131472, 132877, 134664, 136049, 136665, 136970, 137494, 138104, 138216, 137416, 135676, 133344, 131101, 129601, 128817, 127982, 126471, 124497, 122736, 121572, 121024, 121133, 121890, 122905, 123588, 123735, 123603, 123449, 123304, 123136, 122905, 122443, 121601, 120587, 119887, 119847, 120542, 121924, 123790, 125686, 127272, 128764, 130562, 132434, 133652, 134097, 134637, 136055, 137979, 139324]
51083A39324J92o03o50j32N67R32N40l90r24l82Q24J576J326O45M71R88J484J380
51065A47168R81R86J448J773J675J484J333Q47m8o14k82M60Q24R58J524K463L018
51048A65998K812K154J362O65N28J135J675J170K9l49L94J092Q46J62k20m41q92
51031A78120j338j449j358j133m54N45R77M88l7J44M18N1l34K45J303J574J049
51014A78811Q74J353J551J065P22J112J667J790J810K221K712K732K480K585L210
50999B06695L958M492M770M888M947M982M885M619M541N167O493P907Q875R375
50985B86594R610R684R751J0063J0685J1459J2401J3763J5560J7411J9053K0719
50973D46753K2781K5309K8129L1010L3687L5975L8040M0180M2306M4004M5231
$$ y = [139324, 139516, 138913, 138263, 138131, 138698, 139630, 140170, 139780, 138856, 138474, 139298, 140874, 142200, 142845, 143316, 144304, 145788, 147168, 148149, 149135, 150583, 152356, 154031, 155515, 156848, 157695, 157647, 157033, 156751, 157211, 158035, 158993, 160517, 162980, 165998, 168810, 170964, 172326, 172991, 173519, 174654, 176329, 177499, 177528, 177179, 177573, 178665, 179511, 179673, 179453, 179012, 178120, 176782, 175333, 173975, 172842, 172388, 172933, 173910, 174398, 174361, 174505, 174923, 174974, 174640, 174885, 176188, 177762, 178811, 179685, 181038, 182589, 183654, 184376, 185488, 187155, 188945, 190755, 192976, 195688, 198420, 200900, 203485, 206695, 210653, 215145, 219915, 224803, 229750, 234732, 239617, 244236, 248777, 253944, 260437, 268344, 277219, 286594, 296204, 305888, 315639, 325702, 336387, 347846, 360247, 374010, 389570, 406981, 426034, 446753, 469534, 494843, 522972, 553982, 587669, 623644, 661684, 701864, 744170, 788174, 833405]
50962H33405M6434M7698M8284M7440M5349M2871M0570L8346L5763L2448K8257
50951A286865K3503J8842J4684J0830O991L427O75j212k733m207n363n846n839
50938A340617n948o610p735q956j0120j1443j3292j5861j9053k2496k5659k8173
50926A165271l0263l2630l5593l8457m0143m0352l9808l9260l8730l7868l6562
50915G55605l4962l3111l0934k8403k5604k2709k0024j7842j6086j4348j2361
50904D99221j0233q168o210m440l088k219j558q36q9N74J197J741J902J519R61
50889D70274P64J095J799K667L333L270K448J798K371M054N685O432O548O659
50875E19197O991P563Q485R665J0589J0967J1282J2214J3731J5273J6708J8510
$$ y = [833405, 879839, 927537, 975821, 1023261, 1068610, 1111481, 1152051, 1190397, 1226160, 1258608, 1286865, 1310368, 1329210, 1343894, 1354724, 1361715, 1365142, 1365817, 1364605, 1361872, 1357665, 1352302, 1346456, 1340617, 1334669, 1328059, 1320324, 1311368, 1301248, 1289805, 1276513, 1260652, 1241599, 1219103, 1193444, 1165271, 1135008, 1102378, 1066785, 1028328, 988185, 947833, 908025, 868765, 830035, 792167, 755605, 720643, 687532, 656598, 628195, 602591, 579882, 559858, 542016, 525930, 511582, 499221, 488988, 480820, 474610, 470170, 467082, 464863, 463305, 462469, 462380, 462954, 464151, 465892, 467794, 469313, 470274, 471038, 472133, 473932, 476599, 479932, 483202, 485650, 487448, 489819, 493873, 499558, 505990, 512538, 519197, 526188, 533751, 542236, 551901, 562490, 573457, 584739, 596953, 610684, 625957, 642665, 661175]
50863F61175K0998K3948K7085L0419L3945L7501M1242M5667N0841N6055O0839
50852A089715O5844P1973P8902Q5343R0683R5426R9859J03300J05108J05600J05277
50841B097030J03725J00009R3756Q5244P4873O3234N1357M0131K9648J9732J0765
50830B769504L231l185r008j3711j6074j5911j4397j2578j0642q908q379r635
50818B650307j2147j5354j9708k5815l3215m0909m8598n6583o4699p2276p8973
50807B182030q4888q9837r3170r4426r3695r1354q7772q3285p8103p2280o6009
50796A247211n9780n3985m8481m2820l6782l0485k4291j8784j4432j0964p553
50785H98854l980j130K40O89J316K169K354J553M96j35m70r35j636k556l778n289
$$ y = [661175, 682173, 706121, 733206, 763625, 797570, 835071, 876313, 921980, 972821, 1028876, 1089715, 1155559, 1227532, 1306434, 1391777, 1482460, 1577886, 1677745, 1781045, 1886153, 1991753, 2097030, 2200755, 2300764, 2394520, 2479764, 2554637, 2617871, 2669228, 2709359, 2739007, 2758739, 2769504, 2772735, 2769550, 2760542, 2746831, 2730757, 2714846, 2700449, 2687871, 2677229, 2668321, 2659942, 2650307, 2638160, 2622806, 2603098, 2577283, 2544068, 2503159, 2454561, 2397978, 2333279, 2261003, 2182030, 2097142, 2007305, 1914135, 1819709, 1726014, 1634660, 1546888, 1463603, 1385500, 1313220, 1247211, 1187431, 1133446, 1084965, 1042145, 1005363, 974878, 950587, 931803, 917371, 906407, 898854, 894874, 893744, 893984, 894673, 895989, 898158, 900512, 902065, 902561, 902426, 901956, 901021, 899385, 896829, 893051, 887762]
50769H87762o867q334r551j0202j0079r581r376r519r404q698p717o696n338l406
50755G72994j276N02J916L385N218P438R920J2451J4894J7366K0093K2982K5710
50742I13593K8284L1099L4366L7890M1593M5693N0126N4306N7936O1586O5824
50731A422296P0009P2602P2764P1071O8614O5794O2294N7771N2218M5645L7866
50720B098944K8818J8900Q804r41j0005j7942k4192k8622l1614l3374l3507l1751
50708A943518k8811k5863k3414k1195j9110j7546j6729j6463j6792j8324k1418
50697A717853k5576k9985l4352l8824m3352m7545n0922n3048n3669n2926n1284
50686A236370m9062m6296m3096l9752l6300l2359k7727k2705j7601j2422p302
$$ y = [887762, 880895, 872561, 863010, 852808, 842729, 833148, 823772, 814253, 804849, 796151, 788434, 781738, 776400, 772994, 771718, 772220, 774136, 777521, 782739, 790177, 800097, 812548, 827442, 844808, 864901, 887883, 913593, 941877, 972976, 1007342, 1045232, 1086825, 1132518, 1182644, 1236950, 1294886, 1356472, 1422296, 1492305, 1564907, 1637671, 1708742, 1777356, 1843150, 1905444, 1963215, 2015433, 2061078, 2098944, 2127762, 2146662, 2155466, 2154525, 2144520, 2126578, 2102386, 2073764, 2042150, 2008776, 1975269, 1943518, 1914707, 1888844, 1865430, 1844235, 1825125, 1807579, 1790850, 1774387, 1757595, 1739271, 1717853, 1692277, 1662292, 1627940, 1589116, 1545764, 1498219, 1447297, 1394249, 1340580, 1287654, 1236370, 1187308, 1141012, 1097916, 1058164, 1021864, 989505, 961778, 939073, 921472, 909050, 901748]
50675I01748k730J165N063R511J3956J7395J9704K1564K3205K4151K4227K4012
50663A082971K3946K3598K2316K0208J8093J6640J5868J5380J4872J4469J4607
50652A282968J5469J6627J7437J7754J8029J8745K0113K2304K5396K8985L2234
50641A516061L4663L6635L8718M0803M2246M2726M2526M1937M0817L8894L6209
50630A952235L3040K9526K5679K1630J7640J3792J0034O591M076K969L136M052
50618B124400N370P033R028J1340J3950J6430J7728J7028J4851J2652J1048R092
50606B269950N662R17m265r642j5611k2134k8689l5188m2062m9203n5642o0579
50594A953514o4122o6605o7849o7703o6835o6253o6060o5248o2839n8884n4307
$$ y = [901748, 899018, 900183, 905246, 914757, 928713, 946108, 965812, 987376, 1010581, 1034732, 1058959, 1082971, 1106917, 1130515, 1152831, 1173039, 1191132, 1207772, 1223640, 1239020, 1253892, 1268361, 1282968, 1298437, 1315064, 1332501, 1350255, 1368284, 1387029, 1407142, 1429446, 1454842, 1483827, 1516061, 1550724, 1587359, 1626077, 1666880, 1709126, 1751852, 1794378, 1836315, 1877132, 1916026, 1952235, 1985275, 2014801, 2040480, 2062110, 2079750, 2093542, 2103576, 2110167, 2114243, 2117212, 2120348, 2124400, 2129770, 2136803, 2145831, 2157171, 2171121, 2187551, 2205279, 2222307, 2237158, 2249810, 2260858, 2269950, 2275612, 2276529, 2272264, 2262622, 2247011, 2224877, 2196188, 2161000, 2118938, 2069735, 2014093, 1953514, 1889392, 1822787, 1754938, 1687235, 1620400, 1554147, 1488087, 1422839, 1360000, 1301116, 1246809]
50583A246809m9995m6234m2757l9196l5400l1419k7332k3292j9652j6745j4412
50572I00375j2001r029n704k588J65K935O018R158J1820J3749J5153J6411J7801
50559I64263J9502K1647K4183K6738K8947L0889L2982L5250L7044L7850L8085
50548A297380L8595L9399L9555L8506L7024L6312L6500L6625L6115L5685L6440
50537A708136L8473M0761M2507M4116M6576N0150N4166N8078O2173O6866P1790
50526B283792P6117P9533Q2255Q4198Q4881Q4286Q2986Q1113P7819P2297O4819
50515C154096N6246M6954L6868K6119J4896K912j0109k3446l5660m5966n4631
50504C168279o1870o7155o9950p0368o8687o4776n8567n0704m2094l3135k3850
$$ y = [1246809, 1196814, 1150580, 1107823, 1068627, 1033227, 1001808, 974476, 951184, 931532, 914787, 900375, 888374, 879345, 873641, 871053, 871218, 874153, 880171, 889329, 901149, 914898, 930051, 946462, 964263, 983765, 1005412, 1029595, 1056333, 1085280, 1116169, 1149151, 1184401, 1221445, 1259295, 1297380, 1335975, 1375374, 1414929, 1453435, 1490459, 1526771, 1563271, 1599896, 1636011, 1671696, 1708136, 1746609, 1787370, 1829877, 1873993, 1920569, 1970719, 2024885, 2082963, 2145136, 2212002, 2283792, 2359909, 2439442, 2521697, 2605895, 2690776, 2775062, 2858048, 2939161, 3016980, 3089277, 3154096, 3210342, 3257296, 3294164, 3320283, 3335179, 3338091, 3327982, 3304536, 3268876, 3222910, 3168279, 3106409, 3039254, 2969304, 2898936, 2830249, 2765473, 2706906, 2656202, 2614108, 2580973, 2557123]
50493B557123j4540n785K033Q698J3770J6700J7275J5521J1241M154n572j7234
50481B603384l0064m3363n6202o7508p6593q3370q8055r1004r2661r3232r2362
50470A788970q9662q5546q1059p6737p2167o6831o0847n4648m8524m2768l7715
50459A072466l3225k8594k3466j8401j4122j0548p188m001j173J613M866Q290
50447I46517J0993J2763J4426J6655J9064K0904K2169K3573K5604K7900K9548
50436A170116K9961K9558K9450L0219L1150L1110L0026K8997K8845K9222K9296
50425A497950K8737K7701K6319K4734K3315K2341K1712K1289K1355K2309K4058
50414A761820K6026K7758K9167L0320L1324L2357L3444L4123L3687L1914K9366
$$ y = [2557123, 2542583, 2536798, 2538831, 2547529, 2561299, 2577999, 2595274, 2610795, 2622036, 2626190, 2620618, 2603384, 2573320, 2529957, 2473755, 2406247, 2329654, 2246284, 2158229, 2067225, 1974564, 1881332, 1788970, 1699308, 1613762, 1532703, 1455966, 1383799, 1316968, 1256121, 1201473, 1152949, 1110181, 1072466, 1039241, 1010647, 987181, 968780, 954658, 944110, 936922, 932921, 931748, 933361, 938227, 946517, 957510, 970273, 984699, 1001354, 1020418, 1041322, 1063491, 1087064, 1112668, 1140568, 1170116, 1200077, 1229635, 1259085, 1289304, 1320454, 1351564, 1381590, 1410587, 1439432, 1468654, 1497950, 1526687, 1554388, 1580707, 1605441, 1628756, 1651097, 1672809, 1694098, 1715453, 1737762, 1761820, 1787846, 1815604, 1844771, 1875091, 1906415, 1938772, 1972216, 2006339, 2040026, 2071940, 2101306]
50403B101306K6781K4308K1412J7525J2620P073J079n641j3414k1968l0448l8096
50391B102537m4783n0811n6309o0836o3640o4260o3031o0850n8336n5314n1277
50380A473090m6171m0347l3992k7009j9586j2337n783p3M700Q305J0642J1770
50368A323209J1510R435N531M59n029j0549j5772k0198k3648k6590k9425l1829
50356A187104l3285l3969l4486l4879l4565l3212l1228k9231k7404k5561k3549
50345H45735k1493j9728j8463j7406j5904j3572j0607p506m667k489j263o70J80
50332G12147J759L503M735N800P591J0123J2383J3585J4019J4472J5292J6246
50320H31655J6957J7337J7701J8418J9305J9658J9127J8287J7998J8464J9263
$$ y = [2101306, 2128087, 2152395, 2173807, 2191332, 2203952, 2211025, 2212104, 2206463, 2193049, 2171081, 2140633, 2102537, 2057754, 2006943, 1950634, 1889798, 1826158, 1761898, 1698867, 1638017, 1579681, 1524367, 1473090, 1426919, 1386572, 1352580, 1325571, 1305985, 1293648, 1287865, 1287792, 1292492, 1300797, 1311439, 1323209, 1334719, 1344154, 1349685, 1350144, 1345115, 1334566, 1318794, 1298596, 1274948, 1248358, 1218933, 1187104, 1153819, 1119850, 1085364, 1050485, 1015920, 982708, 951480, 922249, 894845, 869284, 845735, 824242, 804514, 786051, 768645, 752741, 739169, 728562, 721056, 716389, 713900, 712637, 711967, 712147, 713906, 717409, 722144, 727944, 735535, 745658, 758041, 771626, 785645, 800117, 815409, 831655, 848612, 865949, 883650, 902068, 921373, 941031, 960158, 978445, 996443, 1014907, 1034170]
50309A034170J9892J9798J8405J5854J3357J1996J1391J0434Q946P573O208L864
50297A181888L75l037n287o624p800r059j0463j2323j4638j6743j8192j9325k0503
50284A038269k1444k1928k2452k3374k4124k3924k2919k1761k0630j9453j8569
50273G97691j8318j8257j7672j6610j5613j4675j3361j1771j0432r351q061o671
50261F36899n842n601n076l771k304j479j205q24n0P94J231R95K95j75J78J089
50245F15154J627J333P08M07L91K04l02r26j576k318l088l684m030m205m255m182
50229E91258m062m024m048l893l328k425j583j112q48l60L42P03M60K97J087K683
50213E71147M035M472M276L930L495K981K680K610K201J073k47j021j411k135
$$ y = [1034170, 1054062, 1073860, 1092265, 1108119, 1121476, 1133472, 1144863, 1155297, 1164243, 1171816, 1178024, 1181888, 1182263, 1179226, 1173939, 1167315, 1159515, 1150456, 1139993, 1127670, 1113032, 1096289, 1078097, 1058772, 1038269, 1016825, 994897, 972445, 949071, 924947, 901023, 878104, 856343, 835713, 816260, 797691, 779373, 761116, 743444, 726834, 711221, 696546, 683185, 671414, 660982, 651631, 643570, 636899, 631057, 625456, 620380, 616609, 614305, 612826, 611621, 610797, 610747, 611541, 612772, 613767, 614062, 613887, 614065, 615154, 616781, 618114, 618822, 619229, 619620, 619824, 619522, 618596, 617020, 614702, 611614, 607930, 603900, 599695, 595440, 591258, 587196, 583172, 579124, 575231, 571903, 569478, 567895, 566783, 565935, 565575, 565917, 566620, 567080, 567377, 568464, 571147, 575182, 579654, 583930, 587860, 591355, 594336, 597016, 599626, 601827, 602900, 602653, 601632, 600221, 598086]
50199E98086l213l842l680l347l391l423k928k366k666l799m724m806m580m758
50185E46563n122m961m201l533l507m020m666n101n044m378l345k419j818j433
50171D93015j186j148j256j339j467j787k018j630p62k83o17j082r77p50j396
50156D75317k933m264m496l777k856k328k373k683k646j981j151p83p22k79O25
50141D42670J227J032N91Q00J782K844L276K993K488K348K739L359L903M401M937
50126D81390N313N396N557O177O913P097O824O807P088O820N692M640M525M765
50112E65004M179K700J427J123J439J695J679J515J263R70Q44J072J494J595J011
50097E89010L7m02L04J647K452K253J752J785K348K974L513M020M298M189M120
$$ y = [598086, 594873, 591031, 587351, 584004, 580613, 577190, 574262, 571896, 569230, 565431, 560707, 555901, 551321, 546563, 541441, 536480, 532279, 528746, 525239, 521219, 516553, 511452, 506408, 502030, 498685, 496266, 494448, 493015, 491829, 490681, 489425, 488086, 486619, 484832, 482814, 481184, 480422, 480139, 479522, 478440, 477463, 476713, 475317, 472384, 468120, 463624, 459847, 456991, 454663, 452290, 449607, 446961, 444980, 443829, 443046, 442324, 442045, 442670, 443897, 444929, 445520, 446320, 448102, 450946, 454222, 457215, 459703, 462051, 464790, 468149, 472052, 476453, 481390, 486703, 492099, 497656, 503833, 510746, 517843, 524667, 531474, 538562, 545382, 551074, 555714, 560239, 565004, 569183, 571883, 573310, 574433, 575872, 577567, 579246, 580761, 582024, 582994, 583838, 584910, 586404, 587999, 589010, 589047, 588645, 588949, 590596, 593048, 595301, 597053, 598838, 601186, 604160, 607673, 611693, 615991, 620180, 624300]
50082F24300M641N596O351O770P320Q152Q798Q877Q642Q574Q844R341R829R911
50068G35946R303Q358P901Q257Q840Q992Q874R088R705J0104R796R030Q427Q228
50054H60849Q036P369O382N808N977O227N693M593M003M292M557L949K943K580
50040I33258K992L384L312L102L144L492M324N984Q374J0868J3174J5612J8301
50027A029321K0686K2302K3400K4202K4137K2577K0028J7643J5638J3207J0119
50016A243260P501O486O838P458P719P622O963N177K052j998o477j1172j5817
50003A265612j9955k3421k6671l0132l3366l5324l5564l4805l4077l3571l2810
49992I25916l1778l1146l1129l0727k8764k5525k2572k0973k0293j9517j8223
$$ y = [624300, 628941, 634537, 640888, 647658, 654978, 663130, 671928, 680805, 689447, 698021, 706865, 716206, 726035, 735946, 745249, 753607, 761508, 769765, 778605, 787597, 796471, 805559, 815264, 825368, 835164, 844194, 852621, 860849, 868885, 876254, 882636, 888444, 894421, 900648, 906341, 910934, 914937, 919229, 923786, 927735, 930678, 933258, 936250, 939634, 942946, 946048, 949192, 952684, 957008, 962992, 971366, 982234, 995408, 1011020, 1029321, 1050007, 1072309, 1095709, 1119911, 1144048, 1166625, 1186653, 1204296, 1219934, 1233141, 1243260, 1250761, 1257247, 1264085, 1271543, 1279262, 1286884, 1293847, 1299024, 1301076, 1299078, 1292601, 1281429, 1265612, 1245657, 1222236, 1195565, 1165433, 1132067, 1096743, 1061179, 1026374, 992297, 958726, 925916, 894138, 862992, 831863, 801136, 772372, 746847, 724275, 703302, 683009, 663492, 645269]
49981F45269j6572j4696j2776j1271j0519j0169r474q124o467n061m236l925l644
49968E28335k865j715j001j162j628j643j341j347j638j656j395j439j967k480
49954E05058k715k950l204l019k344j811j688j373m88K95K76q3J59R89J538J420
49938D90060J089J050J426K289L687N280O508P262P902Q585R116R474R997J0909
49924E74634J2073J3318J4595J5786J6857J8248K0637K4085K7881L1392L4637
49913H04143L7868M1012M3912M6568M8752M9707M8885M6781M4504M2513M0321
49902A294966L7496L4367L1560K9233K7254K5702K4630K3375K0776J6277J0467
49891A576103M247k087q605j5013k0727k5617l0084l4379l8340m1815m4798m7005
$$ y = [645269, 628697, 614001, 601225, 589954, 579435, 569266, 559792, 551668, 545201, 540140, 535904, 531979, 528335, 525470, 523755, 522754, 521592, 519964, 518321, 516980, 515633, 513995, 512339, 510944, 509505, 507538, 505058, 502343, 499393, 496189, 493170, 490826, 489015, 487327, 485954, 485466, 485761, 486037, 485954, 486113, 487102, 488640, 490060, 491149, 492199, 493625, 495914, 499601, 504881, 511389, 518651, 526553, 535138, 544254, 553728, 563725, 574634, 586707, 600025, 614620, 630406, 647263, 665511, 686148, 710233, 738114, 769506, 804143, 842011, 883023, 926935, 973503, 1022255, 1071962, 1120847, 1167628, 1212132, 1254645, 1294966, 1332462, 1366829, 1398389, 1427622, 1454876, 1480578, 1505208, 1528583, 1549359, 1565636, 1576103, 1580350, 1578263, 1569658, 1554645, 1533918, 1508301, 1478217, 1443838, 1405498, 1363683, 1318885, 1271880]
49879A271880m7924m7596m6928m6752m6850m6311m4639m2164l9535l7166l5070
49868G90945l2940l0498k7832k5315k3098k1014j9043j7377j5901j4188j2300
49857E51439j0974j0469r919q537o903o140o229o206n758n469n528n375m902m854
49843D54176n502n900n155l749k876k916l314l597l785l971l992l631k878k030
49829D00880j591j812k250k151j396o24k88j03K89P38J010J262J584J625J275
49814C98448J186J944L101L790L952M145M447M500M558N377O926Q171Q571Q921
49800D68037J0111J1786J2963J3533J4291J5760J7699J9823K2254K4992K7503
49789F58752K9238L0359L1540L3034L4155L3867L1755K8402K4810K1533J8452
$$ y = [1271880, 1223956, 1176360, 1129432, 1082680, 1035830, 989519, 944880, 902716, 863181, 826015, 790945, 758005, 727507, 699675, 674360, 651262, 630248, 611205, 593828, 577927, 563739, 551439, 540465, 529996, 520077, 511540, 504637, 498497, 492268, 486062, 480304, 474835, 469307, 463932, 459030, 454176, 448674, 442774, 437619, 433870, 430994, 428078, 424764, 421167, 417382, 413411, 409419, 405788, 402910, 400880, 399289, 397477, 395227, 393076, 391680, 391056, 390768, 390665, 390954, 391692, 392702, 393964, 395548, 397173, 398448, 399634, 401578, 404679, 408469, 412421, 416566, 421013, 425513, 430071, 435448, 442374, 450545, 459116, 468037, 478148, 489934, 502897, 516430, 530721, 546481, 564180, 584003, 606257, 631249, 658752, 687990, 718349, 749889, 782923, 817078, 850945, 882700, 911102, 935912, 957445, 975897]
49778I75897J5347J2450J0312R134Q489P694O412M737K764K66l151p624j2797
49765A029930j8010k2617k6233k8856l0833l2631l4454l5951l6390l5253l2759
49754F95943k9827k7385k5692k4315k2704k0688j8437j6185j4075j2135j0364
49743D74136q827p708p062o533n635m349l168k404j794j041l57o7m7j4p8m29p22
49726D23901n10j31l44j065j369r42o76j284k164k227j351l09L06M74L25l4l76
49709D12224n16n30m68j49L74N43J6o14m75L81J122J385J572J860J718P75m14
49692D18804r28n09K93Q35R63R90J247J630J668J113L69J4P8J41R1K56P22J063
49674D28840J019J043J685K694L169K658J750J381J754K207K102J590J269J357
$$ y = [975897, 991244, 1003694, 1014006, 1023140, 1031629, 1039323, 1045735, 1050472, 1053236, 1053502, 1050351, 1042727, 1029930, 1011920, 989303, 963070, 934214, 903381, 870750, 836296, 800345, 763955, 728702, 695943, 666116, 638731, 613039, 588724, 566020, 545332, 526895, 510710, 496635, 484500, 474136, 465309, 457601, 450539, 444006, 438371, 434022, 430854, 428450, 426656, 425615, 425258, 425191, 425144, 425130, 425052, 424623, 423901, 423391, 423260, 422916, 421851, 420482, 419540, 418864, 417580, 415416, 413189, 411838, 411529, 411835, 412309, 412634, 412600, 412224, 411708, 411178, 410710, 410561, 410935, 411478, 411494, 410880, 410405, 410786, 411908, 413293, 414865, 416725, 418443, 419218, 418804, 417876, 417367, 417660, 418495, 419458, 420448, 421695, 423325, 424993, 426106, 426475, 426489, 426567, 426708, 426799, 427055, 427777, 428840, 429859, 430902, 432587, 435281, 438450, 441108, 442858, 444239, 445993, 448200, 450302, 451892, 453161, 454518]
49660D54518J557J654J752J840J657J253J159J578J848J308L01k80k06L9K59P52
49644D70989J465J781J336N26j02m34n28k74L81J207J866K122J798R88K44K1J
49627D83387l91p63lJ923L416L158J859J238J808K587K688K233J739J490J655
49612E08024K397L529M491M884M865M887N249N923O658P237P748Q396R078R430
49598E92796R452R641J0240J0781J0838J0747J1015J1395J1355J1162J1620J2798
49586G23840J3897J4564J5426J6966J8566J9213J8715J7830J7446J8003J9367
$$ y = [454518, 456075, 457729, 459481, 461321, 462978, 464231, 465390, 466968, 468816, 470124, 470425, 470145, 469939, 469978, 470237, 470989, 472454, 474235, 475571, 476097, 475995, 475561, 475033, 474759, 475140, 476347, 478213, 480335, 482133, 483121, 483365, 483386, 483387, 482996, 482233, 482230, 484153, 487569, 490727, 492586, 493824, 495632, 498219, 500907, 503140, 504879, 506369, 508024, 510421, 513950, 518441, 523325, 528190, 533077, 538326, 544249, 550907, 558144, 565892, 574288, 583366, 592796, 602248, 611889, 622129, 632910, 643748, 654495, 665510, 676905, 688260, 699422, 711042, 723840, 737737, 752301, 767727, 784693, 803259, 822472, 841187, 859017, 876463, 894466, 913833]
$$ [...]
##END NTUPLES=NMR SPECTRUM
##END=
