
##TITLE=AC1270_CCJAH12088_6666195_LycgQF4GN3
##JCAMPDX= 6.0         $$ Bruker NMR JCAMP-DX V2.0
##DATA TYPE= NMR SPECTRUM
##DATA CLASS= NTUPLES
##ORIGIN= BRUKER
##OWNER= Administrator
$$ 1.72 TOPSPIN		Version 2.1
$$ 2012-08-13 16:22:33.343 -0500  Administrator@TOPSPIN
$$ Compression mode = diff/dup
##.OBSERVE FREQUENCY= 400.02188249412
##.OBSERVE NUCLEUS= ^1H
##.ACQUISITION MODE= SIMULTANEOUS (DQD)
##.ACQUISITION SCHEME= undefined
##.AVERAGES= 64
##.DIGITISER RES= 22
##SPECTROMETER/DATA SYSTEM= spect
##.PULSE SEQUENCE= noesygpps1d.comp
##.SOLVENT NAME= COFFEE_meoh
##.SHIFT REFERENCE= INTERNAL, COFFEE_meoh, 1, 14.9624
##AUDIT TRAIL= $$ (NUMBER, WHEN, WHO, WHERE, PROCESS, VERSION, WHAT)
$$ ##TITLE= Audit trail, TOPSPIN		Version 2.1
$$ ##JCAMPDX= 5.01
$$ ##ORIGIN= Bruker BioSpin GmbH
$$ ##OWNER= Administrator
$$ $$ C:\Bruker\TOPSPIN/data/COFFEE/nmr/AC1270_CCJAH12088_6666195_LycgQF4GN3/12/pdata/1/auditp.txt
$$ ##AUDIT TRAIL=  $$ (NUMBER, WHEN, WHO, WHERE, PROCESS, VERSION, WHAT)
(   1,<2012-08-13 16:22:19.093 -0500>,<Administrator>,<TOPSPIN>,<go>,<TOPSPIN 2.1>,
      <created by zg
	started at 2012-08-13 16:10:48.187 -0500,
	POWCHK enabled, PULCHK disabled,
       configuration hash MD5:
       6B 1B 68 BB D9 2E 58 E2 7F 35 AD 54 07 DF 0E 41
       data hash MD5: 64K
       C6 EE 29 B7 94 A2 D9 72 CC 47 88 DB 19 4C 55 60>)
(   2,<2012-08-13 16:22:28.328 -0500>,<Administrator>,<TOPSPIN>,<proc1d>,<TOPSPIN 2.1>,
      <Start of raw data processing
       efp LB = 0.3 FT_mod = 6 PKNL = 1 PHC0 = 0 PHC1 = 0 SI = 128K 
       data hash MD5: 128K
       F5 FA 2E BE FD FD 16 06 C2 5E 10 2E 87 CA 10 6C>)
(   3,<2012-08-13 16:22:29.921 -0500>,<Administrator>,<TOPSPIN>,<proc1d>,<TOPSPIN 2.1>,
      <pk PHC0 = -2.955322 PHC1 = 0 
       data hash MD5: 128K
       8F 4E A3 ED 78 5F 7C 2D 8C 8C 4E 97 45 DE 8F 52>)
(   4,<2012-08-13 16:22:32.093 -0500>,<Administrator>,<TOPSPIN>,<proc1d>,<TOPSPIN 2.1>,
      <abs ABSG = 1 
       data hash MD5: 128K
       99 25 38 E4 58 D9 90 45 47 35 F3 E5 42 78 83 13>)
(   5,<2012-08-13 16:22:32.234 -0500>,<Administrator>,<TOPSPIN>,<proc1d>,<TOPSPIN 2.1>,
      <abs ABSG = 2 
       data hash MD5: 128K
       05 4B 24 2C 7F 1B 2D 9D 55 BF EF DA 38 19 54 78>)
(   6,<2012-08-13 16:22:32.343 -0500>,<Administrator>,<TOPSPIN>,<proc1d>,<TOPSPIN 2.1>,
      <abs ABSG = 3 
       data hash MD5: 128K
       60 14 75 AC 89 54 BD 58 82 EA 54 68 1D BD CD 5C>)
(   7,<2012-08-13 16:22:32.468 -0500>,<Administrator>,<TOPSPIN>,<proc1d>,<TOPSPIN 2.1>,
      <abs ABSG = 4 
       data hash MD5: 128K
       CF 50 EE 51 AB A7 5C 1B 7C 0E 45 3C 82 D6 24 15>)
(   8,<2012-08-13 16:22:32.625 -0500>,<Administrator>,<TOPSPIN>,<proc1d>,<TOPSPIN 2.1>,
      <abs ABSG = 5 
       data hash MD5: 128K
       FD 8A 70 95 1D 8D DB 74 BD C8 70 7B EE E6 AD 9C>)
$$ ##END=
$$ 
$$ $$ hash MD5
$$ $$ 88 9D FB 2D B6 64 D6 6C 6F 70 F6 62 E4 D8 E4 39
##$RELAX= 
##$RELAX= 
##$RELAX= 
##$RELAX= 
##$RELAX= 
##$RELAX= 
##$RELAX= 
##$RELAX= 
$$ Bruker specific parameters
$$ [...]
150 150 150 150 150 150 150 150
##$TP07= 0
##$TPNAME0= <>
##$TPNAME1= <>
##$TPNAME2= <>
##$TPNAME3= <>
##$TPNAME4= <>
##$TPNAME5= <>
##$TPNAME6= <>
##$TPNAME7= <>
##$TPOAL= (0..7)
0.5 0.5 0.5 0.5 0.5 0.5 0.5 0.5
##$TPOFFS= (0..7)
0 0 0 0 0 0 0 0
##$TUNHIN= 0
##$TUNHOUT= 0
##$TUNXOUT= 0
##$USERA1= <user>
##$USERA2= <user>
##$USERA3= <user>
##$USERA4= <user>
##$USERA5= <user>
##$V9= 5
##$VALIST= <valist>
##$VCLIST= <CCCCCCCCCCCCCCC>
##$VD= 0
##$VDLIST= <DDDDDDDDDDDDDDD>
##$VPLIST= <PPPPPPPPPPPPPPP>
##$VTLIST= <TTTTTTTTTTTTTTT>
##$WBST= 1024
##$WBSW= 4
##$XGAIN= (0..3)
0 0 0 0
##$XL= 0
##$YL= 0
##$YMAX_a= 15251271
##$YMIN_a= -9581070
##$ZGOPTNS= <>
##$ZL1= 120
##$ZL2= 120
##$ZL3= 120
##$ZL4= 120
##$ABSF1= 14.9624
##$ABSF2= -5.595781
##$ABSG= 5
##$ABSL= 3
##$ALPHA= 0
##$AQORDER= 0
##$ASSFAC= 0
##$ASSFACI= 0
##$ASSFACX= 0
##$ASSWID= 0
##$AUNMP= <proc_prof1d_extract.lims>
##$AXLEFT= 0
##$AXNAME= <>
##$AXNUC= <1H>
##$AXRIGHT= 0
##$AXTYPE= 0
##$AXUNIT= <>
##$AZFE= 0.1
##$AZFW= 0.1
##$BCFW= 0
##$BC_mod= 0
##$BYTORDP= 0
##$COROFFS= 0
##$CY= 15
##$DATMOD= 1
##$DC= 0
##$DFILT= <>
##$DTYPP= 0
##$F1P= 0
##$F2P= 0
##$FCOR= 0.5
##$FTSIZE= 131072
##$FT_mod= 6
##$GAMMA= 0
##$GB= 0
##$INTBC= 1
##$INTSCL= 1
##$ISEN= 128
##$LB= 0.3
##$LEV0= 0
##$LPBIN= 0
##$MAXI= 10000
##$MC2= 0
##$MEAN= 0
##$ME_mod= 0
##$MI= 0
##$NCOEF= 0
##$NC_proc= -2
##$NLEV= 6
##$NOISF1= 0
##$NOISF2= 0
##$NSP= 0
##$NTH_PI= 0
##$NZP= 0
##$OFFSET= 14.9624
##$PC= 1
##$PHC0= -2.955322
##$PHC1= 0
##$PH_mod= 1
##$PKNL= yes
##$PPARMOD= 0
##$PPDIAG= 0
##$PPIPTYP= 0
##$PPMPNUM= 2147483647
##$PPRESOL= 1
##$PSCAL= 4
##$PSIGN= 0
##$PYNMP= <proc.py>
##$REVERSE= no
##$SF= 400.02000907745
##$SI= 131072
##$SIGF1= 0
##$SIGF2= 0
##$SINO= 400
##$SIOLD= 131072
##$SPECTYP= <>
##$SREGLST= <1H.CDCl3>
##$SSB= 0
##$STSI= 131072
##$STSR= 0
##$SW_p= 8223.68421052631
##$SYMM= 0
##$S_DEV= 0
##$TDeff= 65536
##$TDoff= 0
##$TI= <>
##$TILT= no
##$TM1= 0
##$TM2= 0
##$TOPLEV= 0
##$USERP1= <user>
##$USERP2= <user>
##$USERP3= <user>
##$USERP4= <user>
##$USERP5= <user>
##$WDW= 1
##$XDIM= 131072
##$YMAX_p= 366974131
##$YMIN_p= -12031
##$CURPLOT= <Network HP LaserJet P1505>
##$CURPRIN= <$Network HP LaserJet P1505>
##$DFORMAT= <normdp>
##$LAYOUT= <+/1D_H.xwp>
##$LFORMAT= <normlp>
##$PFORMAT= <normpl>
##$SURQMSG= 1
$$ End of Bruker specific parameters
$$ ---------------------------------
##NTUPLES= NMR SPECTRUM
##VAR_NAME=  FREQUENCY,     SPECTRUM/REAL,   SPECTRUM/IMAG
##SYMBOL=    X,             R,               I
##VAR_TYPE=  INDEPENDENT,   DEPENDENT,       DEPENDENT
##VAR_FORM=  AFFN,          ASDF,            ASDF
##VAR_DIM=   131072,        131072,          131072
##UNITS=     HZ,            ARBITRARY UNITS, ARBITRARY UNITS
##FACTOR=    0.0627417313425164, 1,          1
##FIRST=     8223.62146879497, 1775,         -58878
##LAST=      0,             3920,            -58136
##MIN=       0,             -12031,          0
##MAX=       8223.62146879497, 366974131,    0
$$ Real data points
##PAGE= N=1
##DATA TABLE= (X++(R..R)), XYDATA
$$ [...]
$$ plain form
63225 694726 718185 742290 766869 791416 815472 838611 860458 881075 900968 920424 939184
63214 939184 957038 974303 991346 1008037 1023997 1038866 1051828 1061371 1066141 1065764 1060356 1049736
63202 1049736 1033835 1013509 990073 964230 936217 906783 877101 847816 819083 791660 767005
63191 767005 745939 727912 712017 698253 687541 680931 678961 681278 686656 693817 702467 713182 726259
63178 726259 741218 757473 774786 792845 811095 829402 848266 867877 887487 906254 924327
63167 924327 942446 960729 978447 994869 1009680 1022496 1032512 1038894 1041275 1039621 1033762 1023362
63155 1023362 1008433 989685 968143 944409 918562 890928 862624 835018 808847 784175 760973
63144 760973 739277 718941 699820 682211 666542 652544 639327 626509 614793 605137 597770 592260
$$ packed form
63225F94726K3459K4105K4579K4547K4056K3139K1847K0617J9893J9456J8760
63214I39184J7854J7265J7043J6691J5960J4869J2962R543M770l77n408j0620
63202A049736j5901k0326k3436k5843k8013k9434k9682k9285k8733k7423k4655
63191G67005k1066j8027j5895j3764j0712o610j970K317N378P161Q650J0715J3077
63178G26259J4959J6255J7313J8059J8250J8307J8864J9611J9610J8767J8073
63167I24327J8119J8283J7718J6422J4811J2816J0016O382K381j654n859j0400
63155A023362j4929j8748k1542k3734k5847k7634k8304k7606k6171k4672k3202
63144G60973k1696k0336j9121j7609j5669j3998j3217j2818j1716r656p367n510
$$ plain form
63132 592260 588120 584997 582568 580648 579255 578386 577907 577818 578368 579637 581213 582485 583206 583684 584617 586704
63116 586704 590075 593996 597451 600177 602838 606060 609705 613290 616731 620334 624312 628618 633093 637594
63102 637594 642081 646691 651472 655970 659450 661790 663838 666581 670092 673502 675807 676543 675926 674666 673551
63087 673551 673005 673038 673570 674542 675762 676992 678398 680582 683967 688353 693245 698407 703985 710308 717648
63072 717648 725955 734863 744289 754939 767687 782379 797813 813051 828262 844107 860924 878864
63060 878864 898239 919351 942351 967545 995238 1024991 1055713 1087061 1120144 1156270 1195493
63049 1195493 1237027 1280466 1325697 1372000 1418257 1464028 1509675 1555428 1601032 1646275 1691236
63038 1691236 1735909 1780152 1824018 1867706 1911200 1954405 1997475 2040445 2082631 2123009 2161114
$$ packed form
63132E92260m140l123k429j920j393q69m79q9N50J269J576J272P21M78R33K087
63116E86704L371L921L455K726K661L222L645L585L441L603L978M306M475M501
63102F37594M487M610M781M498L480K340K048K743L511L410K305P36o17j260j115
63087F73551n46L3N32R72J220J230J406K184L385M386M892N162N578O323P340
63072G17648Q307Q908R426J0650J2748J4692J5434J5238J5211J5845J6817J7940
63060H78864J9375K1112K3000K5194K7693K9753L0722L1348L3083L6126L9223
63049A195493M1534M3439M5231M6303M6257M5771M5647M5753M5604M5243M4961
63038A691236M4673M4243M3866M3688M3494M3205M3070M2970M2186M0378L8105
$$ plain form
63027 2161114 2196875 2229524 2257280 2278222 2290903 2294128 2286904 2269036 2241273 2204572 2159596 2107176
63015 2107176 2048882 1986844 1923223 1859930 1798459 1739715 1684262 1632886 1586693 1546551 1512760
63004 1512760 1485379 1464619 1450737 1443725 1443137 1448066 1457397 1470406 1487119 1507761 1531963 1558860
62992 1558860 1587803 1618397 1649848 1680951 1711012 1740307 1769391 1798317 1826661 1853791 1878827
62981 1878827 1900683 1918435 1931407 1938798 1939641 1933238 1919220 1897135 1866597 1828054 1782781 1731813
62969 1731813 1675542 1614781 1551503 1487884 1425074 1363514 1303869 1246806 1192290 1140119 1090986
62958 1090986 1046102 1005759 969210 936034 906657 881250 859007 839016 821096 805164 790428
62947 790428 776003 762004 749266 738075 727858 718094 708905 700529 692725 684948 676847 668340 659447
$$ packed form
63027B161114L5761L2649K7756K0942J2681L225p224j7868k7763l6701m4976n2420
63015B107176n8294o2038o3621o3293o1471n8744n5453n1376m6193m0142l3791
63004A512760k7381k0760j3882p012n88M929R331J3009J6713K0642K4202K6897
62992A558860K8943L0594L1451L1103L0061K9295K9084K8926K8344K7130K5036
62981A878827K1856J7752J2972P391Q43o403j4018k2085l0538l8543m5273n0968
62969A731813n6271o0761o3278o3619o2810o1560n9645n7063n4516n2171m9133
62958A090986m4884m0343l6549l3176k9377k5407k2243j9991j7920j5932j4736
62947G90428j4425j3999j2738j1191j0217r764r189q376p804p777q101q507q893
$$ plain form
62934 659447 650285 641120 632201 623601 615307 607403 600020 593179 586801 580848 575334 570253 565576 561251
62920 561251 557145 553024 548732 544399 540329 536710 533503 530577 527804 525037 522144 519166 516313 513820
62906 513820 511867 510637 510204 510283 510304 509898 509194 508511 507975 507602 507558 507965 508548 508851 508818 508813 508908 508549 507157 504819
62886 504819 502042 499013 495520 491595 487780 484610 482118 480103 478595 477724 477213 476475 475340 474389 474305 475047
62870 475047 475925 476368 476342 476011 475342 474230 472827 471478 470292 468949 467022 464458 461637 458909 456187 453164
62854 453164 449910 447007 444902 443320 441569 439339 436883 434449 431925 429243 426864 425578 425776 427016
62840 427016 428300 428784 428343 427539 426959 426677 426415 426059 425668 425076 424019 422810 422352 423143 424616 425934 427135
62823 427135 428948 431570 434238 436152 437358 438428 439592 440516 440871 440842 441057 442108 444136 446791 449573
$$ packed form
62934F59447r162r165q919q600q294p904p383o841o378n953n514n081m677m325
62920E61251m106m121m292m333m070l619l207k926k773k767k893k978k853k493
62906E13820j953j230m33P9K1m06p04o83n36l73m4M07N83L03l3nR5l59j392k338
62886E04819k777l029l493l925l815l170k492k015j508q71n11p38j135r51q4P42
62870D75047Q78M43k6l31o69j112j403j349j186j343j927k564k821k728k722l023
62854D53164l254k903k105j582j751k230k456k434k524k682k379j286J98J240
62840D27016J284M84m41q04n80k82k62l56l91n92j057j209m58P91J473J318J201
62823D27135J813K622K668J914J206J070J164R24L55k9K15J051K028K655K782
$$ plain form
62808 449573 452221 454780 457388 460086 462914 466114 470089 475040 480707 486646 492811 499728 507973 517665
62794 517665 528686 541112 554999 569812 584694 599518 615255 633060 653313 675831 700570
62783 700570 727637 756841 787841 820797 856533 896019 939842 988084 1040412 1096384 1156000
62772 1156000 1219950 1289007 1363107 1441212 1522004 1604354 1687028 1768231 1845622 1916737 1979342
62761 1979342 2031582 2071932 2099127 2112305 2111311 2096682 2069112 2029077 1977247 1915164 1845261 1770134
62749 1770134 1691882 1611939 1531206 1450386 1370452 1292850 1219000 1149633 1084788 1024359 968392
62738 968392 916976 870176 828045 790295 755951 723871 693813 666605 642977 622518 604086
62727 604086 586990 571366 557539 545472 534921 525771 518058 511875 507394 504760 503698 503366 502960
$$ packed form
62808D49573K648K559K608K698K828L200L975M951N667N939O165O917Q245R692
62794E17665J1021J2426J3887J4813J4882J4824J5737J7805K0253K2518K4739
62783G00570K7067K9204L1000L2956L5736L9486M3823M8242N2328N5972N9616
62772A156000O3950O9057P4100P8105Q0792Q2350Q2674Q1203P7391P1115O2605
62761A979342N2240M0350K7195J3178r94j4629k7570m0035n1830o2083o9903p5127
62749A770134p8252p9943q0733q0820p9934p7602p3850o9367o4845o0429n5967
62738I68392n1416m6800m2131l7750l4344l2080l0058k7208k3628k0459j8432
62727F04086j7096j5624j3827j2067j0551r150p713o183m481k634j062l32m06
$$ plain form
62714 502960 502530 502930 504896 508485 513542 520199 528457 537648 547121 557478 570385 586930 606697 628683
62700 628683 652532 678462 706643 737264 770829 807711 847710 890645 937093 987769 1042314
62689 1042314 1099451 1158384 1219272 1282086 1345628 1407980 1467350 1522106 1570398 1610321 1640432
62678 1640432 1659956 1668623 1666436 1653453 1629706 1595495 1551843 1500472 1443258 1381871 1317887 1252929
62666 1252929 1188503 1125778 1065475 1007798 952572 899810 850157 804467 762903 724789 689436
62655 689436 656743 626906 599885 575401 553135 532693 513570 495489 478660 463492 450025
62644 450025 437809 426351 415650 406164 398171 391207 384355 377145 369965 363425 357606 352171 346960
62631 346960 342064 337463 333032 328916 325573 323343 322066 321032 319257 316162 312307 309135 307668 307729 308681
$$ packed form
62714E02960m30M00J966L589N057O657Q258R191R473J0357J2907J6545J9767K1986
62700F28683K3849K5930K8181L0621L3565L6882L9999M2935M6448N0676N4545
62689A042314N7137N8933O0888O2814O3542O2352N9370N4756M8292L9923L0111
62678A640432J9524Q667k187j2983k3747l4211m3652n1371n7214o1387o3984o4958
62666A252929o4426o2725o0303n7677n5226n2762m9653m5690m1564l8114l5353
62655F89436l2693k9837k7021k4484k2266k0442j9123j8081j6829j5168j3467
62644D50025j2216j1458j0701r486p993o964o852p210p180o540n819n435n211
62631C46960m896m601m431m116l343k230j277j034j775l095l855l172j467O1R52
$$ plain form
62616 308681 310316 312432 314189 314900 315253 316709 319789 323841 328387 333544 339115 344517 350005 356766 365213
62601 365213 374263 383008 392160 403004 415787 430102 446198 464819 486181 510078 536660 566174
62589 566174 598219 632247 668606 708016 750037 793034 835800 878248 920195 960371 997145
62578 997145 1029518 1056815 1077926 1091555 1097115 1094864 1085306 1068914 1046481 1019271 988549 955111
62566 955111 919436 882211 844490 807328 771453 737378 705519 675946 648223 621933 597311
62555 597311 574949 554853 536286 518754 502644 488516 476013 463887 451042 437374 423766
62544 423766 411481 401381 393428 386893 381029 375466 370072 364861 360098 356153 353136 350988 349878 349997
62530 349997 350881 351693 352429 354141 357453 361544 365281 368808 373257 379245 386465 394504 403194 412288 421692
$$ packed form
62616C08681J635K116J757P11L53J456L080M052M546N157N571N402N488O761Q447
62601C65213R050Q745R152J0844J2783J4315J6096J8621K1362K3897K6582K9514
62589E66174L2045L4028L6359L9410M2021M2997M2766M2448M1947M0176L6774
62578I97145L2373K7297K1111J3629N560k251r558j6392k2433k7210l0722l3438
62566I55111l5675l7225l7721l7162l5875l4075l1859k9573k7723k6290k4622
62555E97311k2362k0096j8567j7532j6110j4128j2503j2126j2845j3668j3608
62544D23766j2285j0100p953o535n864n563n394n211m763l945l017k148j110J19
62530C49997Q84Q12P36J712L312M091L737L527M449N988P220Q039Q690R094R404
$$ plain form
62515 421692 432139 444852 460278 477729 496451 516562 538759 563613 591342 621780 654270
62504 654270 687971 722534 758109 794412 830180 863786 894073 920219 941160 955763 963592 965007
62492 965007 960394 949652 932726 910423 884278 855571 824769 792111 758451 725187 693456 663677
62480 663677 635867 610036 586231 564537 545123 528063 513044 499624 487865 478255 470809 464653
62468 464653 458844 453273 448479 444891 442588 441502 441446 442108 443383 445583 449002 453438 458331 463159 467547
62453 467547 471374 475086 479547 485178 491543 498162 505304 513409 522069 530285 537535 543884 549099 552375
62439 552375 553118 551459 547803 542273 534729 525017 513098 499244 484227 469058 454496 440920 428523
62426 428523 417382 407453 398819 391819 386593 382637 379141 375716 372525 369951 368500 368731 370774 373975
$$ packed form
62515D21692J0447J2713J5426J7451J8722K0111K2197K4854K7729L0438L2490
62504F54270L3701L4563L5575L6303L5768L3606L0287K6146K0941J4603P829J415
62492I65007m613j0742j6926k2303k6145k8707l0802l2658l3660l3264l1731k9779
62480F63677k7810k5831k3805k1694j9414j7060j5019j3420j1759r610p446o156
62468D64653n809n571m794l588k303j086n6O62J275K200L419M436M893M828M388
62453D67547L827L712M461N631O365O619P142Q105Q660Q216P250O349N215L276
62439E52375P43j659l656n530p544r712j1919j3854j5017j5169j4562j3576j2397
62426D28523j1141r929q634p000n226l956l496l425l191k574j451K31K043L201
$$ plain form
62412 373975 377558 381537 386551 392900 400219 408008 415952 423778 431353 438887 446597 454202 461247 467799
62398 467799 474250 480479 485840 489998 493112 495130 495610 494436 492072 488897 484865 480098 475190 470565
62384 470565 465998 461148 456231 451804 448277 445897 444918 445383 447053 449871 454440 461717 472251 485717
62370 485717 501098 517423 534608 553612 575576 600861 629162 660263 694103 730297 768369
62359 768369 808578 851783 898103 946187 994090 1040365 1083927 1123368 1157039 1183760 1203190
62348 1203190 1215622 1221566 1221324 1214836 1202051 1183483 1160125 1132850 1102303 1069317 1034960 999943
62336 999943 964447 928704 893383 859235 826744 796312 768411 743317 720956 701054 683060
62325 683060 666003 649042 632345 616925 603398 591416 580464 570603 562142 555213 549988 546658
$$ packed form
62412C73975L583L979N014O349P319P789P944P826P575P534P710P605P045O552
62398D67799O451O229N361M158L114K018M80j174k364l175m032m767m908m625
62384D70565m567m850m917m427l527k380r79M65J670K818M569P277J0534J3466
62370D85717J5381J6325J7185J9004K1964K5285K8301L1101L3840L6194L8072
62359G68369M0209M3205M6320M8084M7903M6275M3562L9441L3671K6721J9430
62348A203190J2432N944k42o488j2785j8568k3358k7275l0547l2986l4357l5017
62336I99943l5496l5743l5321l4148l2491l0432k7901k5094k2361j9902j7994
62325F83060j7057j6961j6697j5420j3527j1982j0952r861q461o929n225l330
$$ plain form
62313 546658 544734 542980 540606 538065 536132 534658 532898 530696 528586 526872 525196 522976 519763 515205
62299 515205 509197 502248 495444 489912 486208 483956 482068 479686 477116 475470 475218 475634 475952 476472 478022
62284 478022 480736 484046 487576 491460 495927 501146 507386 514814 523162 531973 541128 550831 561200 572194
62270 572194 583776 595871 608363 621506 636070 652714 671352 691520 713139 736572 762208
62259 762208 790465 821892 856700 894208 933240 972963 1012947 1052494 1090353 1124989 1154797
62248 1154797 1178310 1194733 1204224 1207249 1203810 1193787 1177737 1156754 1131612 1102734 1070914 1037335
62236 1037335 1002831 967838 933197 900215 869572 840850 813645 788628 766914 748657 732917
62225 732917 718887 706784 697373 690866 686488 683047 679811 676763 674134 671892 669798 667746 665850 664322
$$ packed form
62313E46658j924j754k374k541j933j474j760k202k110j714j676k220l213m558
62299E15205o008o949o804n532l704k252j888k382k570j646k52M16L18N20J550
62284D78022K714L310L530L884M467N219O240P428Q348Q811R155R703J0369J0994
62270E72194J1582J2095J2492J3143J4564J6644J8638K0168K1619K3433K5636
62259G62208K8257L1427L4808L7508L9032L9723L9984L9547L7859L4636K9808
62248A154797K3513J6423R491L025l439j0023j6050k0983k5142k8878l1820l3579
62236A037335l4504l4993l4641l2982l0643k8722k7205k5017k1714j8257j5740
62225G32917j4030j2103r411o507m378l441l236l048k629k242k094k052j896j528
$$ plain form
62211 664322 663326 662826 662394 661439 659871 658350 657575 657554 657896 658605 660118 662652 666017 670130 675293 681909
62195 681909 690161 699938 710756 721902 733156 745410 760084 777778 797774 818874 840287 861527
62183 861527 881975 900996 918327 934079 948333 960876 971316 979531 986156 992537 1000055 1009455
62171 1009455 1020897 1034351 1049653 1066492 1084907 1105712 1129820 1156969 1185521 1213685 1240545
62160 1240545 1265800 1288959 1309211 1325822 1338464 1347196 1352205 1353476 1350798 1344380 1335327 1324998
62148 1324998 1313823 1301268 1287112 1272247 1257882 1244402 1231460 1218971 1207576 1198121 1190885 1185332
62136 1185332 1180651 1176592 1173613 1171962 1170855 1169250 1167399 1166807 1168334 1171194 1174355 1178158 1183649 1190872
62122 1190872 1198900 1207413 1217079 1228258 1240287 1252562 1265566 1280311 1297159 1315650 1335078 1354776
$$ packed form
62211F64322r96n00m32r55j568j521p75k1L42P09J513K534L365M113N163O616
62195F81909Q252R777J0818J1146J1254J2254J4674J7694J9996K1100K1413K1240
62183H61527K0448J9021J7331J5752J4254J2543J0440Q215O625O381P518R400
62171A009455J1442J3454J5302J6839J8415K0805K4108K7149K8552K8164K6860
62160A240545K5255K3159K0252J6611J2642Q732N009J271k678o418r053j0329
62148A324998j1175j2555j4156j4865j4365j3480j2942j2489j1395r455p236n553
62136A185332m681m059k979j651j107j605j851n92J527K860L161L803N491P223
62122A190872Q028Q513R666J1179J2029J2275J3004J4745J6848J8491J9428J9698
$$ plain form
62110 1354776 1374161 1393098 1412138 1432048 1453205 1475643 1499400 1524436 1550444 1577197 1604916
62099 1604916 1633811 1663490 1693548 1724682 1758359 1795025 1833348 1871723 1909977 1948998 1989134
62088 1989134 2029684 2069678 2108403 2145347 2180562 2215241 2251137 2289000 2328086 2367404 2406747
62077 2406747 2446075 2484533 2520880 2554622 2586102 2615707 2643688 2670758 2698147 2726850 2757302
62066 2757302 2789896 2825213 2863322 2903192 2943308 2982748 3021354 3058999 3095144 3129169 3160675
62055 3160675 3189206 3214012 3234638 3251658 3266276 3278959 3288775 3294407 3295558 3293073 3288025 3281223
62043 3281223 3273477 3265597 3257867 3249906 3241297 3232094 3222627 3213165 3203862 3194646 3185078 3174808 3164325
62030 3164325 3154665 3146069 3137536 3128193 3118496 3109428 3100938 3092056 3082387 3072690 3063947 3056493 3050095 3044252
$$ packed form
62110A354776J9385J8937J9040J9910K1157K2438K3757K5036K6008K6753K7719
62099A604916K8895K9679L0058L1134L3677L6666L8323L8375L8254L9021M0136
62088A989134M0550L9994L8725L6944L5215L4679L5896L7863L9086L9318L9343
62077B406747L9328L8458L6347L3742L1480K9605K7981K7070K7389K8703L0452
62066B757302L2594L5317L8109L9870M0116L9440L8606L7645L6145L4025L1506
62055C160675K8531K4806K0626J7020J4618J2683R816N632J151k485n048o802
62043C281223p746p880p730p961q609r203r467r462r303r216r568j0270j0483
62030C164325r660q596q533r343r697r068q490q882r669r697q743p454o398n843
$$ plain form
62016 3044252 3038344 3032124 3026308 3022082 3019742 3018271 3016573 3014787 3014018 3015070 3017800 3021501 3025592 3029925
62002 3029925 3034734 3040388 3047069 3054595 3062431 3069906 3076498 3081930 3085857 3087404 3085321 3078811 3068001 3053372
61988 3053372 3034997 3012768 2987130 2959120 2929670 2899292 2868382 2837334 2806237 2774962 2743725
61977 2743725 2713217 2683958 2655764 2628019 2600288 2572567 2545210 2518765 2493681 2469984 2447312
61966 2447312 2425304 2403855 2383042 2362996 2343794 2325286 2307138 2289262 2272117 2256232 2241563
61955 2241563 2227711 2214698 2203043 2192942 2183824 2174950 2166143 2157815 2150531 2144671 2140236 2136834 2134116
61942 2134116 2132281 2131911 2133249 2135999 2139933 2145329 2152661 2162124 2173612 2186845 2201477 2217418 2235218
61929 2235218 2255787 2279606 2306567 2336660 2370351 2408103 2450076 2496647 2548737 2607160 2672068
$$ packed form
62016C044252n908o220n816m226k340j471j698j786p69J052K730L701M091M333
62002C029925M809N654O681P526P836P475O592N432L927J547k083o510j0810j4629
61988C053372j8375k2229k5638k8010k9450l0378l0910l1048l1097l1275l1237
61977B743725l0508k9259k8194k7745k7731k7721k7357k6445k5084k3697k2672
61966B447312k2008k1449k0813k0046j9202j8508j8148j7876j7145j5885j4669
61955B241563j3852j3013j1655j0101r118q874q807q328p284n860m435l402k718
61942B134116j835l70J338K750L934N396P332R463J1488J3233J4632J5941J7800
61929B235218K0569K3819K6961L0093L3691L7752M1973M6571N2090N8423O4908
$$ plain form
61918 2672068 2743622 2822953 2911871 3011727 3123193 3247215 3385765 3541498 3717093 3915122
61908 3915122 4138325 4389758 4672794 4991164 5348984 5750591 6199925 6699402 7248425
61899 7248425 7842005 8469785 9115447 9756673 10366160 10913908 11370250 11708796 11908984
61890 11908984 11958241 11853660 11602676 11222266 10736582 10173548 9561533 8926835 8291913
61881 8291913 7674104 7085238 6532652 6020794 5551987 5126236 4741417 4394436 4082367
61872 4082367 3802584 3552347 3328744 3128916 2950084 2789561 2645063 2514952 2397960
61863 2397960 2292713 2197675 2111485 2033225 1962476 1899181 1843202 1793802 1749754 1710202 1675194
61852 1675194 1645048 1619304 1596763 1576550 1558762 1543885 1531859 1521926 1513209 1505160 1497544 1490348
$$ packed form
61918B672068P1554P9331Q8918R9856J11466J24022J38550J55733J75595J98029
61908C915122K23203K51433K83036L18370L57820M01607M49334M99477N49023
61899G248425N93580O27780O45662O41226O09487N47748M56342L38546K00188
61890A1908984M9257j04581k50984l80410m85684n63034o12015o34698o34922
61881H291913o17809n88866n52586n11858m68807m25751l84819l46981l12069
61872D082367k79783k50237k23603j99828j78832j60523j44498j30111j16992
61863B397960j05247r5038q6190p8260p0749o3295n5979m9400m4048l9552l5008
61852A675194l0146k5744k2541k0213j7788j4877j2026r933q717q049p616p196
$$ plain form
61840 1490348 1483822 1478371 1474185 1470995 1468334 1466011 1464206 1463176 1463126 1464335 1467109 1471416 1476747 1482460
61826 1482460 1488212 1494049 1500359 1507719 1516398 1525810 1534859 1543141 1551463 1560842 1571399 1582720 1594905
61813 1594905 1608591 1624190 1641840 1662088 1685859 1713605 1745071 1780048 1818798 1861610 1908538
61802 1908538 1959815 2015952 2077154 2143136 2213872 2290152 2373017 2462909 2559721 2663463 2774718
61791 2774718 2894681 3024970 3167155 3322266 3490891 3673820 3872443 4088668 4324892
61782 4324892 4584128 4869749 5185107 5533843 5920678 6351402 6832073 7368751 7968062
61773 7968062 8637261 9383267 10211711 11126118 12125690 13201597 14334302 15493713 16640812
61764 16640812 17728981 18706022 19518679 20118955 20469851 20549393 20353196 19895203 19205857
$$ packed form
61840A490348o526n451m186l190k661k323j805j030n0J209K774M307N331N713
61826A482460N752N837O310P360Q679R412R049Q282Q322R379J0557J1321J2185
61813A594905J3686J5599J7650K0248K3771K7746L1466L4977L8750M2812M6928
61802A908538N1277N6137O1202O5982P0736P6280Q2865Q9892R6812J03742J11255
61791B774718J19963J30289J42185J55111J68625J82929J98623K16225K36224
61782D324892K59236K85621L15358L48736L86835M30724M80671N36678N99311
61773G968062O69199P46006Q28444R14407R99572J075907J132705J159411J147099
61764A6640812J088169R77041Q12657O00276L50896P9542j96197m57993o89346
$$ plain form
61755 19205857 18328026 17311744 16208483 15065778 13923613 12813192 11757088 10769726
61747 10769726 9858517 9025880 8271035 7590800 6980149 6433277 5944304 5507134 5115619
61738 5115619 4764704 4450897 4170968 3920695 3695691 3492964 3310657 3146550 2997887
61729 2997887 2862691 2740232 2629949 2530567 2440394 2357883 2281749 2211140 2145846 2085867 2030657
61718 2030657 1979139 1930392 1883890 1839290 1796675 1756949 1721200 1689416 1660333 1632622 1605708
61707 1605708 1579445 1553732 1528773 1505157 1483280 1462888 1443287 1423723 1403616 1382919 1362393
61696 1362393 1343102 1325436 1308902 1292845 1277007 1261370 1245939 1230772 1215879 1201142 1186696
61685 1186696 1173208 1161220 1150336 1139712 1129315 1119851 1111431 1103286 1095087 1087604 1081430 1075823 1069598
$$ packed form
61755A9205857q77831j016282j103261j142705j142165j110421j056104r87362
61747A0769726r11209q32637p54845o80235o10651n46872m88973m37170l91515
61738E115619l50915l13807k79929k50273k25004k02727j82307j64107j48663
61729B997887j35196j22459j10283r9382r0173q2511p6134p0609o5294n9979n5210
61718B030657n1518m8747m6502m4600m2615l9726l5749l1784k9083k7711k6914
61707A605708k6263k5713k4959k3616k1877k0392j9601j9564k0107k0697k0526
61696A362393j9291j7666j6534j6057j5838j5637j5431j5167j4893j4737j4446
61685A186696j3488j1988j0884j0624j0397r464q420q145q199p483o174n607o225
$$ plain form
61672 1069598 1062697 1056069 1050307 1045117 1040086 1035258 1030877 1026946 1023171 1019088 1014195 1008169 1000993 992924
61658 992924 984437 976261 969161 963434 958671 954159 949480 944718 940265 936480 933458 931097 929487 928996
61644 928996 929712 930954 931819 932164 932625 933699 935323 937377 939973 943057 946254 949364 952552 955842 958975
61629 958975 962020 965565 969865 974328 978256 981666 984881 987790 990079 991767 992855 992786 990959 987570 983258
61614 983258 978083 971657 964210 956613 949130 940985 931626 921805 912876 905359 898681 891956 884534 876099
61600 876099 866906 857940 850284 844183 839070 834506 830595 827335 824245 821168 819016 819013 821243 824614 828314
61585 828314 832710 838596 846132 854937 864770 875614 887336 899771 913033 927386 942944 959830
61573 959830 978396 998821 1020686 1043425 1067101 1092202 1118724 1146021 1173575 1201373 1229404
$$ packed form
61672A069598o901o628n762n190n031m828m381l931l775m083m893o026p176q069
61658I92924q487q176p100n727m763m512m679m762m453l785l022k361j610m91
61644I28996P16J242Q65L45M61J074J624K054K596L084L197L110L188L290L133
61629I58975L045L545M300M463L928L410L215K909K289J688J088o9j827l389m312
61614I83258n175o426p447p597p483q145r359r821q929p517o678o725p422q435
61600H76099r193q966p656o101n113m564l911l260l090l077k152lK230L371L700
61585H28314M396N886P536Q805R833J0844J1722J2435J3262J4353J5558J6886
61573I59830J8566K0425K1865K2739K3676K5101K6522K7297K7554K7798K8031
$$ plain form
61562 1229404 1257264 1284448 1310666 1335740 1359544 1382132 1403621 1423941 1443116 1461627 1479883
61551 1479883 1497277 1512462 1524794 1534865 1543336 1549866 1553561 1553970 1551229 1545752 1538194 1529225 1518901
61538 1518901 1506759 1493000 1479015 1466087 1454030 1441922 1429853 1419056 1410367 1403449 1397789 1393790
61526 1393790 1392511 1394652 1400076 1408224 1418937 1432930 1451373 1474898 1503249 1536112 1573853 1617117
61514 1617117 1666123 1721056 1782869 1852907 1931785 2019458 2116554 2224845 2346053 2480871 2629634
61503 2629634 2793357 2973304 3169611 3380705 3603764 3834962 4069015 4298989 4517008
61494 4517008 4715280 4886639 5024671 5124054 5181272 5195206 5167234 5100981 5001944 4876780
61484 4876780 4732178 4573975 4407386 4237847 4071005 3911405 3761426 3621857 3493360
$$ packed form
61562A229404K7860K7184K6218K5074K3804K2588K1489K0320J9175J8511J8256
61551A479883J7394J5185J2332J0071Q471O530L695M09k741n477p558q969j0324
61538A518901j2142j3759j3985j2928j2057j2108j2069j0797q689o918n660l999
61526A393790j279K141N424Q148J0713J3993J8443K3525K8351L2863L7741M3264
61514A617117M9006N4933O1813P0038P8878Q7673R7096J08291J21208J34818J48763
61503B629634J63723J79947J96307K11094K23059K31198K34053K29974K18019
61494D517008J98272J71359J38032R9383N7218J3934k7972o6253r9037j25164
61484D876780j44602j58203j66589j69539j66842j59600j49979j39569j28497
$$ plain form
61475 3493360 3377035 3273859 3184203 3108005 3044970 2994483 2955716 2928047 2911081 2904171 2906204
61464 2906204 2916099 2933246 2957302 2987807 3024178 3065765 3111562 3160078 3209870 3260125 3310413
61453 3310413 3360012 3407954 3453858 3498287 3542059 3585473 3628424 3671013 3713606 3756384 3799205
61442 3799205 3842002 3884959 3928089 3970850 4012347 4051770 4088419 4121453 4149885 4172887 4189976
61431 4189976 4201039 4206331 4206315 4201174 4190527 4173950 4151836 4125432 4095960 4064067 4030216 3995239
61419 3995239 3960170 3925886 3893227 3863214 3836647 3813542 3793488 3776608 3763757 3755513 3751217 3749235
61407 3749235 3748019 3746752 3745108 3742689 3738789 3732614 3723667 3711949 3697848 3681909 3664804 3647611 3632088
61394 3632088 3620550 3615268 3617844 3629067 3649483 3680153 3722870 3779609 3851833 3940378 4045997
$$ packed form
61475C493360j16325j03176q9656p6198o3035n0487l8767k7669j6966o910K033
61464B906204R895J7147K4056L0505L6371M1587M5797M8516M9792N0255N0288
61453C310413M9599M7942M5904M4429M3772M3414M2951M2589M2593M2778M2821
61442C799205M2797M2957M3130M2761M1497L9423L6649L3034K8432K3002J7089
61431D189976J1063N292j6n141j0647j6577k2114k6404k9472l1893l3851l4977
61419C995239l5069l4284l2659l0013k6567k3105k0054j6880j2851q244m296j982
61407C749235j216j267j644k419l900o175q947j1718j4101j5939j7105j7193j5523
61394C632088j1538n282K576J1223K0416L0670M2717N6739P2224Q8545J05619
$$ plain form
61383 4045997 4169821 4313095 4476448 4659507 4861174 5079964 5313694 5558767 5809898
61374 5809898 6060486 6303042 6529459 6731713 6903025 7038389 7133880 7186027 7192763 7155103
61364 7155103 7077211 6964402 6821257 6651629 6459710 6250334 6028296 5797787 5562556 5326268
61354 5326268 5092474 4864246 4643834 4432708 4231946 4042626 3865789 3702143 3551935
61345 3551935 3415066 3291224 3180051 3081457 2995635 2922433 2860877 2809879 2769342 2739882 2721237
61334 2721237 2711693 2709591 2714739 2727695 2748099 2774590 2806195 2842867 2884441 2929767 2977215 3025553
61322 3025553 3073934 3121355 3166635 3208948 3248102 3284319 3317835 3348720 3376878 3402107 3424211
61311 3424211 3443203 3459493 3473732 3486192 3496285 3502887 3505165 3502762 3495169 3481471 3461185 3435087
$$ packed form
61383D045997J23824J43274J63353J83059K01667K18790K33730K45073K51131
61374E809898K50588K42556K26417K02254J71312J35364R5491N2147O736l7660
61364G155103p7892j12809j43145j69628j91919k09376k22038k30509k35231k36288
61354E326268k33794k28228k20412k11126k00762j89320j76837j63646j50208
61345C551935j36869j23842j11173r8594q5822p3202o1556n0998m0537k9460j8645
61334B721237r544k102N148J2956K0404K6491L1605L6672M1574M5326M7448M8338
61322C025553M8381M7421M5280M2313L9154L6217L3516L0885K8158K5229K2104
61311C424211J8992J6290J4239J2460J0093O602K278k403p593j3698k0286k6098
$$ plain form
61299 3435087 3404696 3370945 3333780 3292955 3248797 3202093 3153612 3103914 3053378 3002269 2951040
61288 2951040 2900673 2852519 2807624 2766349 2728749 2695137 2666050 2641728 2621778 2605382 2591744
61277 2591744 2580303 2570531 2561638 2552698 2543173 2533154 2522857 2511939 2499579 2485366 2469999 2455018
61265 2455018 2441908 2431482 2424024 2419799 2419211 2422502 2429574 2440351 2455268 2475152 2500843 2533345
61253 2533345 2574292 2625548 2687995 2761197 2844599 2938438 3042706 3155410 3272566 3389722
61243 3389722 3502666 3606626 3695866 3764843 3809515 3827318 3816502 3776309 3707793 3614003 3499329
61232 3499329 3368839 3228038 3082539 2937313 2795945 2660556 2532461 2412899 2303000
61223 2303000 2203028 2112032 2028718 1952658 1884179 1823115 1768368 1718963 1674898 1636334 1602446
$$ packed form
61299C435087l0391l3751l7165m0825m4158m6704m8481m9698n0536n1109n1229
61288B951040n0367m8154m4895m1275l7600l3612k9087k4322j9950j6396j3638
61277B591744j1441r772q893q940r525j0019j0297j0918j2360j4213j5367j4981
61265B455018j3110j0426p458m225n88L291P072J0777J4917J9884K5691L2502
61253B533345M0947N1256O2447P3202Q3402R3839J04268J12704J17156J17156
61243C389722J12944J03960Q9240O8977M4672J7803j0816m0193o8516r3790j14674
61232C499329j30490j40801j45499j45226j41368j35389j28095j19562j09899
61223B303000r9972r0996q3314p6060o8479o1064n4747m9405m4065l8564l3888
$$ plain form
61212 1602446 1571928 1544484 1521011 1502231 1487844 1477228 1470253 1466920 1466819 1469615 1475745 1485948
61200 1485948 1500049 1516696 1534266 1551684 1568471 1584545 1599982 1614381 1626312 1633980 1636722 1635381
61188 1635381 1630984 1623632 1613182 1600417 1586601 1571994 1555593 1536466 1514861 1491914 1468823 1446366
61176 1446366 1424693 1403300 1381608 1359721 1338262 1317364 1296392 1274840 1252923 1230935 1208596
61165 1208596 1185531 1161969 1138387 1114807 1091052 1067420 1044510 1022512 1001340 981391 963458
61154 963458 947739 933472 919704 905928 891806 876830 860607 843150 824576 804862 784279
61143 784279 763851 744936 728271 713619 700358 688292 677907 669922 664568 661252 659012 657316
61131 657316 656403 656831 658849 662185 666299 670732 675345 680329 685936 692222 699147 706807 715327 724507 733868
$$ packed form
61212A602446l0518k7444k3473j8780j4387j0616o975l333j01K796O130J0203
61200A485948J4101J6647J7570J7418J6787J6074J5437J4399J1931P668K742j341
61188A635381m397p352j0450j2765j3816j4607j6401j9127k1605k2947k3091k2457
61176A446366k1673k1393k1692k1887k1459k0898k0972k1552k1917k1988k2339
61165A208596k3065k3562k3582k3580k3755k3632k2910k1998k1172j9949j7933
61154I63458j5719j4267j3768j3776j4122j4976j6223j7457j8574j9714k0583
61143G84279k0428j8915j6665j4652j3261j2066j0385p985n354l316k240j696
61131F57316r13M28K018L336M114M433M613M984N607O286O925P660Q520R180R361
$$ plain form
61116 733868 743227 752950 763434 774506 785630 796567 807456 818249 828453 837687 846168 854290
61104 854290 861800 867749 871376 872764 872457 870742 867622 863374 858636 853773 848514 842425 835549 828335
61090 828335 821069 813665 805881 797506 788404 778646 768679 759090 750193 741966 734418 727705 721788 716198
61076 716198 710386 704267 698286 692973 688539 684869 681811 679404 677813 677078 676996 677327 678004 678994 680005 680565
61060 680565 680504 680152 679936 679950 680178 681001 683076 686518 690467 693732 695760 696789 697237 697397 697760 699107 701792
61043 701792 705105 707848 709726 711887 715845 722011 729488 737233 745100 753651 763235 773653 784723 796693
61029 796693 809806 823714 837809 852045 866973 882903 899527 916518 934006 952163 970730
61018 970730 989427 1008560 1028755 1050266 1072994 1097046 1122856 1150748 1180768 1212978 1247727
$$ packed form
61116G33868R359R723J0484J1072J1124J0937J0889J0793J0204R234Q481Q122
61104H54290P510N949L627J388l07j715l120m248m738m863n259o089o876p214
61090H28335p266p404p784q375r102r758r967r589q897q227p548o713n917n590
61076G16198n812o119n981n313m434l670l058k407j591p35q2L31O77R90J011N60
61060F80565o1l52k16J4K28Q23K075L442L949L265K028J029M48J60L63J347K685
61043G01792L313K743J878K161L958O166P477P745P867Q551R584J0418J1070J1970
61029G96693J3113J3908J4095J4236J4928J5930J6624J6991J7488J8157J8567
61018I70730J8697J9133K0195K1511K2728K4052K5810K7892L0020L2210L4749
$$ plain form
61007 1247727 1285667 1327637 1374335 1425936 1482274 1543502 1610089 1681927 1758077 1838013 1922621
60996 1922621 2013435 2111537 2218054 2335116 2465153 2609455 2768405 2942847 3134151 3343340
60986 3343340 3571615 3821904 4099049 4409074 4759981 5163231 5633214 6186473 6844937
60977 6844937 7641675 8622714 9842683 11355061 13191597 15327867 17656804 20008121
60969 20008121 22216704 24182749 25864211 27220934 28195194 28768831 29028418 29141231 29245136
60960 29245136 29361873 29417299 29325942 29032548 28477513 27561508 26184602 24333487 22123789
60951 22123789 19753066 17413073 15234305 13282760 11579526 10117336 8873114 7820120
60943 7820120 6934421 6193305 5573073 5051628 4611423 4238046 3917728 3638209 3390803
$$ packed form
61007A247727L7940M1970M6698N1601N6338O1228O6587P1838P6150P9936Q4608
60996A922621R0814R8102J06517J17062J30037J44302J58950J74442J91304K09189
60986C343340K28275K50289K77145L10025L50907M03250M69983N53259O58464
60977F844937P96738R81039J219969J512378J836536K136270K328937K351317
60969B0008121K208583J966045J681462J356723R74260N73637K59587J12813J03905
60960B9245136J16737N5426r1357k93394n55035r16005j376906j851115k209698
60951B2123789k370723k339993k178768j951545j703234j462190j244222j052994
60943G820120q85699p41116o20232n21445m40205l73377l20318k79519k47406
$$ plain form
60934 3390803 3169842 2970844 2790396 2626662 2478293 2343162 2219170 2105617 2002586
60925 2002586 1909333 1824202 1745605 1672095 1601982 1533963 1468066 1405199 1345932 1290329 1238608
60914 1238608 1191115 1147692 1107709 1070695 1036547 1005288 977047 952030 930052 910233 891555
60903 891555 873562 856291 839821 824249 809811 796716 785091 775215 767366 761209 755881 751008
60891 751008 747102 744577 743049 742180 742586 745081 749335 754063 758421 762579 767027 771880 776855 781490 785288
60876 785288 787880 789053 788576 786265 782369 777496 771989 765783 759004 752127 745250 737830 729610 721222
60862 721222 713372 706041 699132 693290 689221 686549 684181 681626 679270 677646 677251 678849 682990 689072
60848 689072 695688 702149 709147 717816 728615 741215 754982 769362 784118 799281 814635 829384
$$ packed form
60934C390803k20961j98998j80448j63734j48369j35131j23992j13553j03031
60925B002586r3253q5131p8597p3510p0113o8019o5897o2867n9267n5603n1721
60914A238608m7493m3423l9983l7014l4148l1259k8241k5017k1978j9819j8678
60903H91555j7993j7271j6470j5572j4438j3095j1625r876p849o157n328m873
60891G51008l906k525j528q69M06K495M254M728M358M158M448M853M975M635L798
60876G85288K592J173m77k311l896m873n507o206o779o877o877p420q220q388
60862G21222p850p331o909n842m069k672k368k555k356j624l95J598M141O082
60848F89072O616O461O998Q669J0799J2600J3767J4380J4756J5163J5354J4749
$$ plain form
60836 829384 842672 854411 865170 875393 885120 894369 903244 911608 919154 925913 932214 938019 942727
60823 942727 945861 947627 948537 948750 948104 946685 945054 943763 942766 941508 939630 937317 934698 931192 925955
60808 925955 918977 911150 903122 894626 885162 874748 863645 851861 839472 827079 815472 805078
60796 805078 796021 788273 781337 774312 766962 760391 755986 753889 753147 753202 754555 757984 763689 771190 779618
60781 779618 788134 796544 805523 815906 827820 840796 854414 868468 882767 897312 912358 927757
60769 927757 942486 955476 966750 977091 986807 995564 1003279 1010313 1016735 1022239 1026905 1031256 1035350
60756 1035350 1038561 1040579 1041931 1043130 1043980 1044196 1044111 1044166 1044092 1043288 1041867 1040711 1040398 1040477 1039968 1038380 1036016
60739 1036016 1033377 1030475 1026870 1022280 1016887 1011024 1004846 998411 991728 984524 976378 967514 959167 952601
$$ packed form
60836H29384J3288J1739J0759J0223R727R249Q875Q364P546O759O301N805M708
60823I42727L134J766R10K13o46j419j631j291r97j258j878k313k619l506n237
60808I25955o978p827q028q496r464j0414j1103j1784j2389j2393j1607j0394
60796H05078r057p748o936p025p350o571m405k097p42N5J353L429N705P501Q428
60781G79618Q516Q410Q979J0383J1914J2976J3618J4054J4299J4545J5046J5399
60769I27757J4729J2990J1274J0341R716Q757P715P034O422N504M666M351M094
60756A035350L211K018J352J199Q50K16q5N5p4q04j421j156l13P9n09j588k364
60739A036016k639k902l605m590n393n863o178o435o683p204q146q864q347o566
$$ plain form
60725 952601 947873 943947 939954 935922 932427 930078 929299 930132 932123 934685 937557 940586 943197 944553 944245
60710 944245 942436 939413 935471 931140 926921 922610 917375 910813 903632 897178 892488 889780 888459 887499
60696 887499 886131 884404 883003 882501 882890 883671 884105 883446 881276 877655 872783 866596 858866 849500 838551
60681 838551 826183 812900 799507 786490 773724 761117 749145 738230 728043 718110 708794 700971
60669 700971 694910 690277 687016 685375 685115 685545 686348 687614 689134 690521 692036 694276 696959 699064 700403
60654 700403 701987 704395 706928 709023 711456 715178 719682 723573 726367 728829 731720 735065 738573 741992
60640 741992 744996 747304 749171 751442 754949 759890 765764 771867 777974 784623 792536 801788 811804 822184
60626 822184 833129 845033 858098 872465 888242 905174 922661 940242 957602 974095 988935
$$ packed form
60725I52601m728l926l993m032l495k349p79Q33J991K562K872L029K611J356l08
60710I44245j809l023l942m331m219m311n235o562p181o454m690k708j321r60
60696H87499j368j727j401n02L89P81M34o59k170l621m872o187p730r366j0949
60681H38551j2368j3283j3393j3017j2766j2607j1972j0915j0187r933r316p823
60669G00971o061m633l261j641k60M30Q03J266J520J387J515K240K683K105J339
60654G00403J584K408K533K095K433L722M504L891K794K462K891L345L508L419
60640G41992L004K308J867K271L507M941N874O103O107O649P913R252J0016J0380
60626H22184J0945J1904J3065J4367J5777J6932J7487J7581J7360J6493J4840
$$ plain form
60615 988935 1002177 1014753 1027098 1038316 1047228 1053656 1058039 1060410 1060643 1059429 1058004 1056838 1055262
60602 1055262 1052488 1048312 1042616 1034798 1024232 1011126 996552 981551 966304 950324 933495 916728
60590 916728 901387 888137 876700 866677 858186 851506 846564 843029 840618 839088 838232 838066 838565 838984
60576 838984 837955 834819 830623 827286 825895 826132 827061 828017 828911 830248 832812 836962 842188 847674 853225
60561 853225 859290 866207 873718 881103 887372 891520 893234 893474 893786 894733 895405 894762 893120 891892 892078 893489
60545 893489 895549 898403 902942 909958 919705 932389 948752 969854 996331 1028092 1064638 1105310
60533 1105310 1148994 1193762 1237070 1276335 1309298 1333975 1348583 1351912 1343933 1326040 1300521 1269794
60521 1269794 1236241 1202475 1171127 1143996 1121744 1104718 1093691 1089302 1091014 1097267 1106661 1118481
$$ packed form
60615I88935J3242J2576J2345J1218Q912O428M383K371K33j214j425j166j576
60602A055262k774m176n696p818j0566j3106j4574j5001j5247j5980j6829j6767
60590I16728j5341j3250j1437j0023q491o680m942l535k411j530q56j66M99M19
60576H38984j029l136m196l337j391K37R29R56Q94J337K564M150N226N486N551
60561H53225O065O917P511P385O269M148J714K40L12R47O72o43j642j228J86J411
60545H93489K060K854M539P016R747J2684J6363K1102K6477L1761L6546M0672
60533A105310M3684M4768M3308L9265L2963K4677J4608L329p979j7893k5519l0727
60521A269794l3553l3766l1348k7131k2252j7026j1027m389J712O253R394J1820
$$ plain form
60509 1118481 1132113 1146544 1160773 1174443 1187967 1202263 1218415 1237274 1259246 1284617 1314063
60498 1314063 1348693 1389800 1438864 1497572 1567258 1648309 1740544 1844156 1959942 2088745 2231314
60487 2231314 2388846 2563396 2757985 2976749 3224401 3504158 3815279 4152408 4506582
60478 4506582 4865593 5213151 5528985 5791182 5979481 6078144 6078332 5979617 5789438 5520971
60468 5520971 5191491 4821526 4432758 4044326 3670362 3320391 3000577 2713811 2459844
60459 2459844 2236851 2042833 1875218 1730202 1603907 1494023 1399382 1318213 1247778 1185646
60449 1185646 1130443 1081398 1037886 999405 965328 934671 906636 881249 858846 839053 820935
60438 820935 803993 788311 773708 759473 745113 730824 717125 704429 693014 682950 673985 665908
$$ packed form
60509A118481J3632J4431J4229J3670J3524J4296J6152J8859K1972K5371K9446
60498A314063L4630M1107M9064N8708O9686Q1051R2235J03612J15786J28803J42569
60487B231314J57532J74550J94589K18764K47652K79757L11121L37129L54174
60478D506582L59011L47558L15834K62197J88299R8663J88r8715j90179k68467
60468E520971l29480l69965l88768l88432l73964l49971l19814k86766k53967
60459B459844k22993j94018j67615j45016j26295j09884r4641q1169p0435o2132
60449A185646n5203m9045m3512l8481l4077l0657k8035k5387k2403j9793j8118
60438H20935j6942j5682j4603j4235j4360j4289j3699j2696j1415j0064q965q077
$$ plain form
60426 665908 658942 653318 648501 643449 637736 631987 627033 623091 619940 617529 616055 615532 615500 615266 614594
60411 614594 614180 615141 617891 621741 625822 629956 634265 638351 641558 643898 646143 648981 652573 656918 662177
60396 662177 668427 675360 682391 689011 695139 701274 708028 715303 722151 727682 731850 735050 737275 738121
60382 738121 737416 735391 732384 728696 724545 719882 714553 708960 704121 700572 697633 694416 691177 688862
60368 688862 687533 686200 684261 682335 681466 682057 683741 685835 687756 689408 691180 693298 695382 697119 699079
60353 699079 702122 706093 709966 713339 716948 721487 726705 732068 737644 743815 750606 757751 765068 772310
60339 772310 778944 784523 789133 793202 796949 800202 802597 803866 804229 804612 806246 809787 815023 821444 828802
60324 828802 836913 845257 853134 860095 865943 870375 872888 873108 871118 867311 861928 854855 846095 836426
$$ packed form
60426F65908o966n624m817n052n713n749m954l942l151k411j474n23l2k34o72
60411F14594m14R61K750L850M081M134M309M086L207K340K245K838L592M345N259
60396F62177O250O933P031O620O128O135O754P275O848N531M168L200K225Q46
60382G38121p05k025l007l688m151m663n329n593m839l549k939l217l239k315
60368F88862j329j333j939j926q69N91J684K094J921J652J772K118K084J737J960
60353F99079L043L971L873L373L609M539N218N363N576O171O791P145P317P242
60339G72310O634N579M610M069L747L253K395J269L63L83J634L541N236O421P358
60324H28802Q111Q344P877O961N848M432K513K20j990l807n383p073q760r669
$$ plain form
60310 836426 827269 819625 813331 807548 801810 796331 791529 787620 784642 782514 781058 780135 779760 779943 780590
60295 780590 781737 783686 786683 790608 795156 800116 805266 810335 815340 820590 826007 830876 834709 837979
60281 837979 841449 845200 848970 853029 857835 863013 867627 871432 874971 878411 881345 884049 888002 894487
60267 894487 903207 912843 922643 933014 944834 958606 974203 991202 1009539 1029817 1052812 1078700
60255 1078700 1107050 1137513 1170189 1205422 1243719 1285913 1332854 1384776 1441430 1502951 1570170
60244 1570170 1643864 1724117 1810659 1903528 2003044 2109243 2221393 2337927 2456831 2576253
60234 2576253 2694638 2810087 2919888 3021177 3112044 3191660 3259509 3315058 3358099 3388764
60224 3388764 3407037 3412706 3405920 3387520 3358981 3322569 3281370 3238326 3195067 3152285 3111414 3075243
$$ packed form
60310H36426r157p644o294n783n738n479m802l909k978k128j456r23l75J83O47
60295G80590J147J949K997L925M548M960N150N069N005N250N417M869L833L270
60281H37979L470L751L770M059M806N178M614L805L539L440K934K704L953O485
60267H94487Q720R636R800J0371J1820J3772J5597J6999J8337K0278K2995K5888
60255A078700K8350L0463L2676L5233L8297M2194M6941N1922N6654O1521O7219
60244A570170P3694Q0253Q6542R2869R9516J06199J12150J16534J18904J19422
60234B576253J18385J15449J09801J01289R0867P9616O7849N5549M3041L0665
60224C388764J8273N669o786j8400k8539l6412m1199m3044m3259m2782m0871l6171
$$ plain form
60212 3075243 3046683 3027460 3018310 3019728 3032054 3055373 3089910 3136357 3195409 3267076 3350595 3444730
60200 3444730 3547899 3658131 3773081 3890027 4006027 4118377 4224891 4323372 4410911 4484212
60190 4484212 4540686 4578968 4598528 4599326 4581801 4546674 4494851 4428067 4349524 4263149 4172185 4079112
60178 4079112 3986776 3898579 3817331 3744849 3682949 3633841 3599017 3578616 3572510 3581303 3605468 3644047
60166 3644047 3694968 3756307 3826520 3903639 3984860 4066922 4146554 4220784 4287144 4343622 4388407
60155 4388407 4420160 4438692 4444953 4440195 4425618 4402999 4374990 4344385 4313635 4285435 4263087 4249598
60143 4249598 4246802 4255839 4278044 4314806 4367110 4436040 4523577 4632121 4763138 4916733 5092551
60132 5092551 5290710 5511902 5756947 6026246 6319325 6634612 6969483 7320266 7682225
$$ packed form
60212C075243k8560j9223r150J418J2326K3319L4537M6447N9052P1667Q3519R4135
60200C444730J03169J10232J14950J16946J16000J12350J06514R8481Q7539P3301
60190D484212N6474L8282J9560P98j7525l5127n1823o6784p8543q6375r0964r3073
60178D079112r2336q8197q1248p2482o1900m9108l4824k0401o106Q793K4165L8579
60166C644047N0921O1339P0213P7119Q1221Q2062P9632P4230O6360N6478M4785
60155D388407L1753J8532O261m758j4577k2619k8009l0605l0750k8200k2348j3489
60143D249598k796R037K2205L6762N2304O8930Q7537J08544J31017J53595J75818
60132E092551J98159K21192K45045K69299K93079L15287L34871L50783L61959
$$ plain form
60123 7682225 8049884 8417501 8779002 9127613 9456234 9758469 10028971 10262801 10455124
60114 10455124 10601822 10699872 10746925 10741239 10682503 10572261 10413259 10209084 9964937 9688067
60104 9688067 9386615 9068353 8740995 8413072 8093417 7789639 7507381 7250730 7022784
60095 7022784 6825984 6662339 6533257 6438966 6378515 6350613 6353991 6386552 6444652 6523709 6619060
60084 6619060 6725748 6838090 6950186 7056626 7152275 7232025 7291646 7328795 7342643 7332868 7299518
60073 7299518 7243390 7165780 7068096 6952321 6821391 6678266 6524835 6362536 6193749 6021755
60063 6021755 5849509 5679354 5513800 5355614 5206976 5069315 4944029 4832674 4736420 4656049
60053 4656049 4592602 4547313 4520812 4513035 4524064 4554280 4603456 4670271 4752948 4849755 4958560
$$ packed form
60123G682225L67659L67617L61501L48611L28621L02235K70502K33830J92323
60114A0455124J46698R8050M7053n686n8736j10242j59002k04175k44147k76870
60104I688067l01452l18262l27358l27923l19655l03778k82258k56651k27946
60095G022784j96800j63645j29082r4291o0451k7902L378L2561N8100P9057R5351
60084F619060J06688J12342J12096J06440R5649P9750N9621L7149J3848r775l3350
60073G299518n6128p7610r7684j15775j30930j43125j53431j62299j68787j71994
60063F021755j72246j70155j65554j58186j48638j37661j25286j11355r6254q0371
60053D656049o3447m5289k6501p777J1029L0216M9176O6815Q2677R6807J08805
$$ plain form
60042 4958560 5076469 5200227 5326539 5451542 5570292 5677376 5768247 5840035 5891205 5920463
60032 5920463 5926021 5906113 5860367 5790424 5699088 5589269 5464109 5327587 5184169 5037850
60022 5037850 4891962 4749766 4614592 4489399 4376530 4277709 4193792 4124724 4070373 4031338
60012 4031338 4008554 4002480 4013413 4042307 4090382 4157946 4244399 4349291 4472371 4612389 4766751
60001 4766751 4932567 5107120 5286968 5467418 5643317 5809722 5961540 6093575 6201776
59992 6201776 6283944 6338698 6364477 6360408 6327698 6269178 6187545 6084738 5963011 5825987 5678542
59981 5678542 5526036 5373646 5225908 5086608 4959033 4846142 4750283 4672881 4614618 4575836
59971 4575836 4556580 4556511 4575114 4611865 4665935 4735811 4819504 4915081 5020640 5133783 5251390
$$ packed form
60042D958560J17909J23758J26312J25003J18750J07084R0871P1788N1170K9258
60032E920463N558j9908m5746o9943r1336j09819j25160j36522j43418j46319
60022E037850j45888j42196j35174j25193j12869r8821q3917o9068n4351l9035
60012D031338k2784o074J0933K8894M8075O7564Q6453J04892J23080J40018J54362
60001D766751J65816J74553J79848J80450J75899J66405J51818J32035J08201
59992F201776Q2168N4754K5779m069l2710n8520q1633j02807j21727j37024j47445
59981E678542j52506j52390j47738j39300j27575j12891r5859p7402n8263l8782
59971D575836j9256o9J8603L6751N4070O9876Q3693R5577J05559J13143J17607
$$ plain form
59960 5251390 5370058 5486626 5598328 5702745 5797819 5881934 5953905 6012991 6059002 6092484
59950 6092484 6114852 6128340 6135726 6139985 6144123 6151332 6165200 6189620 6228362 6284675 6361391 6461490
59938 6461490 6588493 6746093 6937233 7163534 7425490 7722831 8054276 8416729 8804699
59929 8804699 9210403 9624214 10034877 10429435 10793435 11111991 11371397 11560318 11670190
59920 11670190 11695596 11635248 11492691 11275698 10994844 10662634 10293122 9900871 9499357 9100181
59910 9100181 8713257 8346649 8005893 7694336 7414669 7169536 6960382 6786713 6647390
59901 6647390 6542112 6470905 6432933 6426967 6452610 6509772 6596861 6710410 6846481 7001388 7170703
59890 7170703 7348339 7526889 7698246 7853688 7984211 8081537 8138915 8151278 8115566 8031273
$$ packed form
59960E251390J18668J16568J11702J04417R5074Q4115P1971N9086M6011L3482
59950F092484K2368J3488P386M259M138P209J3868K4420L8742N6313P6716J00099
59938F461490J27003J57600J91140K26301K61956K97341L31445L62453L87970
59929H804699M05704M13811M10663L94558L64000L18556K59406J88921J09872
59920A1670190K5406o0348j42557k16993k80854l32210l69512l92251m01514l99176
59910I100181l86924l66608l40756l11557k79667k45133k09154j73669j39323
59901F647390j05278p1207l7972n966K5643N7162Q7089J13549J36071J54907J69315
59890G170703J77636J78550J71357J55442J30523R7326N7378J2363l5712q4293
$$ plain form
59880 8031273 7900263 7725889 7512811 7267747 6999407 6716771 6427356 6137122 5851313
59871 5851313 5574693 5311180 5063733 4834584 4625260 4436467 4268140 4119606 3989718
59862 3989718 3877174 3780932 3700063 3632942 3576822 3528509 3485439 3446010 3409081 3373482 3338066
59851 3338066 3302220 3266385 3232087 3201204 3174981 3153685 3137094 3124991 3117038 3112302 3109126 3105477
59839 3105477 3099391 3089184 3073408 3050830 3020689 2983158 2939546 2891927 2842567 2793585 2746790
59828 2746790 2703509 2664525 2630373 2601710 2579340 2563926 2555719 2554504 2559804 2571207 2588487 2611248
59816 2611248 2638663 2670025 2705613 2746529 2793438 2845863 2902836 2963602 3027173 3091570 3154078
59805 3154078 3212149 3263846 3307817 3343405 3370733 3390430 3403414 3411006 3414784 3415988 3415611 3415339 3417723
$$ packed form
59880H031273j31010j74374k13078k45064k68340k82636k89415k90234k85809
59871E851313k76620k63513k47447k29149k09324j88793j68327j48534j29888
59862C989718j12544r6242q0869o7121n6120m8313m3070l9429l6929l5599l5416
59851C338066l5846l5835l4298l0883k6223k1296j6591j2103p953m736l176l649
59839C105477o086j0207j5776k2578l0141l7531m3612m7619m9360m8982m6795
59828B746790m3281l8984l4152k8663k2370j5414q207j215N300J1403J7280K2761
59816B611248K7415L1362L5588M0916M6909N2425N6973O0766O3571O4397O2508
59805C154078N8071N1697M3971L5588K7328J9697J2984P592L778J204l77k72K384
$$ plain form
59792 3417723 3424788 3437124 3455160 3480829 3516968 3565350 3626322 3700381 3789232 3895290 4021057
59781 4021057 4169234 4342794 4544732 4778096 5045988 5350389 5690048 6058977 6446135
59772 6446135 6835774 7208559 7543867 7822360 8027532 8146722 8172909 8106617 7956159 7736191
59762 7736191 7465860 7166453 6857926 6555866 6271161 6011545 5782175 5585002 5419286
59753 5419286 5283461 5176066 5095162 5038325 5003709 4990234 4996430 5020215 5060251 5116568 5189425
59742 5189425 5278544 5383930 5506418 5646676 5804496 5979781 6173560 6387422 6622634 6880477
59732 6880477 7162807 7471722 7809285 8178117 8581457 9021861 9500258 10016641 10570698
59723 10570698 11160773 11782553 12429330 13092921 13763792 14431245 15084876 15715992 16317636
$$ packed form
59792C417723P065J2336J8036K5669L6139M8382O0972P4059Q8851J06058J25767
59781D021057J48177J73560K01938K33364K67892L04401L39659L68929L87158
59772F446135L89639L72785L35308K78493K05172J19190K6187o6292j50458k19968
59762G736191k70331k99407l08527l02060k84705k59616k29370j97173j65716
59753E419286j35825j07395q0904n6837l4616j3475O196K3785M0036N6317P2857
59742E189425Q9119J05386J22488J40258J57820J75285J93779K13862K35212K57843
59732F880477K82330L08915L37563L68832M03340M40404M78397N16383N54057
59723A0570698N90075O21780O46777O63591O70871O67453O53631O31116O01644
$$ plain form
59714 16317636 16884642 17415401 17913545 18386894 18844754 19296735 19753134 20224183 20717497
59705 20717497 21236072 21778312 22338849 22908840 23476032 24025204 24538953 24999039 25388587
59696 25388587 25694390 25908033 26025988 26049821 25986635 25848635 25651473 25412436 25149350 24879994
59686 24879994 24621509 24389791 24199049 24061655 23988310 23988280 24069364 24237776 24498457 24855617
59676 24855617 25312603 25870938 26529387 27283299 28123360 29033633 29990311 30962189 31912052
59667 31912052 32798102 33575942 34201821 34636488 34848762 34818841 34540996 34024335 33291150
59658 33291150 32374312 31314905 30159170 28953959 27742227 26560435 25437161 24391265
59650 24391265 23430139 22550044 21738733 20978576 20249213 19530132 18803233 18054600 17275516
$$ packed form
59714A6317636N67006N30759M98144M73349M57860M51981M56399M71049M93314
59705B0717497N18575N42240N60537N69991N67192N49172N13749M60086L89548
59696B5388587L05803K13643J17955K3833o3186j38000j97162k39037k63086k69356
59686B4879994k58485k31718j90742j37394p3345l0Q1084J68412K60681L57160
59676B4855617M56986N58335O58449P53912Q40061R10273R56678R71878R49863
59667C1912052Q86050P77840O25879M34667K12274k9921k77845n16661p33185
59658C3291150r16838j059407j155735j205211j211732j181792j123274j045896
59650B4391265r61126q80095q11311p60157p29363p19081p26899p48633p79084
$$ plain form
59641 17275516 16463568 15623716 14767980 13912989 13076352 12273395 11515317 10808989 10157872
59632 10157872 9562981 9023294 8535972 8096926 7701597 7345559 7025012 6737137 6479852
59623 6479852 6250989 6047759 5867147 5706630 5564392 5439067 5329490 5234429 5152214 5080615
59613 5080615 5017135 4959388 4905237 4852831 4800471 4746213 4687773 4623320 4552371 4475400 4392653
59602 4392653 4304162 4211093 4116155 4022081 3930187 3840857 3754849 3673451 3597788 3528615 3466575
59591 3466575 3412096 3365228 3325981 3294553 3270749 3253505 3241603 3234799 3233766 3238916 3249603 3264491
59579 3264491 3282457 3303130 3326682 3353027 3381283 3410237 3439333 3468888 3499459 3531511 3565731
59568 3565731 3603046 3644172 3689663 3740504 3797984 3862859 3935387 4016364 4107269 4209055 4321737
$$ packed form
59641A7275516q11948q39852q55736q54991q36637q02957p58078p06328o51117
59632A0157872n94891n39687m87322m39046l95329l56038l20547k87875k57285
59623F479852k28863k03230j80612j60517j42238j25325j09577r5061q2215p1599
59613E080615o3480n7747n4151n2406n2360n4258n8440o4453p0949p6971q2747
59602D392653q8491r3069r4938r4074r1894q9330q6008q1398p5663o9173o2040
59591C466575n4479m6868l9247l1428k3804j7244j1902o804j033N150J0687J4888
59579C264491J7966K0673K3552K6345K8256K8954K9096K9555L0571L2052L4220
59568C565731L7315M1126M5491N0841N7480O4875P2528Q0977R0905J01786J12682
$$ plain form
59557 4321737 4445674 4582310 4732986 4897850 5076746 5270384 5479788 5705161 5946088
59548 5946088 6202121 6471997 6752639 7039903 7330074 7619918 7905796 8183871 8451156
59539 8451156 8705530 8944842 9166666 9368792 9549329 9706659 9840073 9950342 10039101 10108083
59529 10108083 10159743 10198401 10229959 10260590 10296114 10341934 10402312 10479416 10573350 10682466 10802753
59518 10802753 10927261 11047103 11152882 11234737 11282075 11285126 11237149 11134534 10975394 10759607
59508 10759607 10490281 10173818 9818160 9431803 9024251 8605766 8185802 7772212 7371894
59499 7371894 6990882 6633272 6301082 5995725 5718880 5471499 5252815 5060921 4893902
59490 4893902 4750180 4628474 4527802 4446910 4383604 4335584 4302300 4285000 4284404 4299199 4327631
$$ packed form
59557D321737J23937J36636J50676J64864J78896J93638K09404K25373K40927
59548E946088K56033K69876K80642K87264K90171K89844K85878K78075K67285
59539H451156K54374K39312K21824K02126J80537J57330J33414J10269Q8759O8982
59529A0108083N1660L8658L1558L0631L5524M5820O0378P7104R3934J09116J20287
59518A0802753J24508J19842J05779Q1855M7338L051m7977j02615j59140k15787
59508A0759607k69326l16463l55658l86357m07552m18485m19964m13590m00318
59499G371894l81012l57610l32190l05357k76845k47381k18684j91894j67019
59490D893902j43722j21706j00672q0892o3306m8020l3284j7300n96J4795K8432
$$ plain form
59479 4327631 4369808 4427418 4501588 4592051 4698306 4820699 4960082 5116977 5291387 5482972
59469 5482972 5690854 5913084 6146457 6386929 6629907 6869729 7098973 7309010 7491660
59460 7491660 7640114 7748383 7811017 7824327 7787475 7701736 7569296 7393803 7181524 6940533
59450 6940533 6678539 6402276 6118588 5834459 5555403 5284802 5025212 4779377 4549418
59441 4549418 4335925 4138566 3957055 3791163 3640318 3503749 3380661 3270110 3171200 3083560
59431 3083560 3006990 2940454 2882175 2831021 2787072 2750523 2720827 2697379 2680171 2669066 2663118
59420 2663118 2661361 2663772 2670705 2681761 2696089 2713632 2735346 2762059 2793455 2828115 2864193 2900249
59408 2900249 2935828 2971271 3006820 3042149 3077090 3112775 3151859 3197706 3253215 3319858 3397318
$$ packed form
59479D327631M2177N7610P4170R0463J06255J22393J39383J56895J74410J91585
59469E482972K07882K22230K33373K40472K42978K39822K29244K10037J82650
59460G491660J48454J08269O2634J3310l6852q5739j32440j75493k12279k40991
59450F940533k61994k76263k83688k84129k79056k70601k59590k45835k29959
59441D549418k13493j97359j81511j65892j50845j36569j23088j10551r8910q7640
59431C083560p6570o6536n8279n1154m3949l6549k9696k3448j7208j1105n948
59420B663118j757K411O933J1056J4328J7543K1714K6713L1396L4660L6078L6056
59408B900249L5579L5443L5549L5329L4941L5685L9084M5847N5509O6643P7460
$$ plain form
59397 3397318 3484158 3579281 3682868 3795888 3918893 4051668 4194222 4348134 4516858 4704714
59387 4704714 4915621 5152896 5419866 5719889 6055410 6427493 6836634 7283302 7766729
59378 7766729 8283335 8826921 9390083 9964602 10540814 11107886 11655263 12173575 12654605
59369 12654605 13091854 13481827 13824243 14120698 14373545 14585846 14760997 14901249 15006708
59360 15006708 15075846 15106386 15095478 15039984 14937595 14787770 14591667 14351862 14072710 13760470
59350 13760470 13422403 13065541 12696115 12319386 11939301 11558237 11177122 10795614 10412330
59341 10412330 10025712 9635306 9242295 8848942 8457891 8071974 7694119 7327222 6974352
59332 6974352 6638875 6323706 6030394 5759421 5511254 5286328 5083937 4902073 4738732
$$ packed form
59397C397318Q6840R5123J03587J13020J23005J32775J42554J53912J68724J87856
59387D704714K10907K37275K66970L00023L35521L72083M09141M46668M83427
59378G766729N16606N43586N63162N74519N76212N67072N47377N18312M81030
59369A2654605M37249L89973L42416K96455K52847K12301J75151J40252J05459
59360A5006708O9138L0540j0908n5494j02389j49825j96103k39805k79152l12240
59350A3760470l38067l56862l69426l76729l80085l81064l81115l81508l83284
59341A0412330l86618l90406l93011l93353l91051l85917l77855l66897l52870
59332F974352l35477l15169k93312k70973k48167k24926k02391j81864j63341
$$ plain form
59323 4738732 4592840 4463745 4350559 4252319 4168120 4096796 4037061 3988305 3950570 3923518 3906060
59312 3906060 3897282 3896985 3904976 3920600 3943432 3973631 4010965 4054101 4101497 4152501 4206933 4263908
59300 4263908 4321699 4378520 4433078 4484558 4532368 4575703 4613364 4644477 4669428 4689542 4705872
59289 4705872 4719128 4730884 4743844 4760427 4781968 4809664 4845273 4890247 4945174 5010783 5088553
59278 5088553 5179264 5281729 5393915 5514642 5642995 5776572 5911477 6043660 6168991 6282213
59268 6282213 6377308 6449483 6496145 6515890 6507550 6470852 6407609 6321882 6219148 6105370 5986347
59257 5986347 5867428 5753369 5647935 5553208 5469511 5396410 5333766 5281707 5239927 5207468 5183036
59246 5183036 5165167 5152255 5142847 5136001 5131245 5128446 5128044 5131254 5139689 5154751 5177609 5209783 5253716
$$ packed form
59323D738732j45892j29095j13186r8240q4199p1324n9735m8756l7735k7052j7458
59312C906060q778k97P991J5624K2832L0199L7334M3136M7396N1004N4432N6975
59300D263908N7791N6821N4558N1480M7810M3335L7661L1113K4951K0114J6330
59289D705872J3256J1756J2960J6583K1541K7696L5609M4974N4927O5609P7770
59278E088553R0711J02465J12186J20727J28353J33577J34905J32183J25331J13222
59268F282213R5095P2175M6662J9745q340l6698o3243q5727j02734j13778j19023
59257E986347j18919j14059j05434r4727q3697p3101o2644n2059m1780l2459k4432
59246E183036j7869j2912r408o846m756k799m02L210Q435J5062K2858L2174M3933
$$ plain form
59233 5253716 5312828 5390954 5491483 5616895 5769123 5950058 6161354 6403910 6677897 6982750
59223 6982750 7316078 7672279 8042678 8416845 8783126 9128215 9437749 9698150 9897642
59214 9897642 10025901 10074498 10038797 9918980 9718940 9445280 9107910 8720155 8296659 7851037
59204 7851037 7395656 6942277 6501258 6080143 5683785 5315463 4977097 4668878 4389792
59195 4389792 4138581 3913684 3712680 3532753 3371712 3228012 3099969 2985591 2883074
59186 2883074 2790905 2707692 2632463 2564959 2505025 2451830 2404088 2360897 2321922 2286940 2255721
59175 2255721 2228235 2204635 2185048 2169535 2158037 2150336 2146462 2147047 2152594 2162333 2174763 2189602
59163 2189602 2208168 2231344 2258211 2287452 2319063 2353772 2391634 2432291 2475905 2522689 2572162
$$ packed form
59233E253716N9112P8126J00529J25412J52228J80935K11296K42556K73987L04853
59223F982750L33328L56201L70399L74167L66281L45089L09534K60401J99492
59214I897642J28259M8597l5701j19817k00040k73660l37370l87755m23496m45622
59204G851037m55381m53379m41019m21115l96358l68322l38366l08219k79086
59195D389792k51211k24897k01004j79927j61041j43700j28043j14378j02517
59186B883074r2169q3213p5229o7504n9934n3195m7742m3191l8975l4982l1219
59175B255721k7486k3600j9587j5513j1498p701l874N85N547R739J2430J4839
59163B189602J8566K3176K6867K9241L1611L4709L7862M0657M3614M6784M9473
$$ plain form
59152 2572162 2623942 2678696 2737169 2798855 2862847 2929432 2999304 3071411 3143082 3212287 3278464
59141 3278464 3341052 3398627 3449854 3494154 3530980 3559412 3579039 3590637 3595634 3595475 3591651 3585592
59129 3585592 3578207 3570105 3562571 3557874 3558346 3565495 3580068 3602631 3634000 3675465 3728585 3794406 3872927
59116 3872927 3963596 4066125 4180526 4306780 4445114 4596310 4761030 4938840 5128351 5328102
59106 5328102 5536598 5751535 5969384 6185520 6394190 6588611 6761787 6907355 7019626
59097 7019626 7093720 7126689 7118464 7070999 6986713 6868413 6720236 6547539 6355652 6149370
59087 6149370 5933411 5712349 5489785 5268000 5048470 4832350 4620736 4415070 4217040
59078 4217040 4027516 3845869 3671091 3503398 3344037 3193823 3052652 2920241 2796434
$$ packed form
59152B572162N1780N4754N8473O1686O3992O6585O9872P2107P1671O9205O6177
59141C278464O2588N7575N1227M4300L6826K8432J9627J1598M997j59l824o059
59129C585592p385q102p534m697M72P149J4573K2563L1369M1465N3120O5821P8521
59116C872927R0669J02529J14401J26254J38334J51196J64720J77810J89511J99751
59106E328102K08496K14937K17849K16136K08670J94421J73176J45568J12271
59097G019626P4094L2969q225m7465q4286j18300j48177j72697j91887k06282
59087F149370k15959k21062k22564k21785k19530k16120k11614k05666j98030
59078D217040j89524j81647j74778j67693j59361j50214j41171j32411j23807
$$ plain form
59069 2796434 2680844 2573011 2472934 2380709 2295755 2217060 2144050 2076573 2014235 1956538 1903429
59058 1903429 1854847 1809937 1767637 1727865 1691141 1657196 1625036 1594368 1565839 1539635 1514857
59047 1514857 1490582 1466684 1443269 1420085 1396866 1373779 1351299 1330077 1310861 1294064 1279491
59036 1279491 1267074 1257570 1251775 1249253 1248765 1249897 1253372 1259720 1268517 1279045 1290876 1303714 1317305
59023 1317305 1331471 1345610 1358378 1368675 1376689 1383141 1387841 1390146 1390525 1390280 1389711 1388014 1385201 1382782
59009 1382782 1382170 1383638 1387228 1393307 1401551 1410483 1418856 1426793 1434978 1443449 1451669 1458991 1464619 1467853
58995 1467853 1468920 1468924 1468597 1467831 1466753 1466400 1467711 1470519 1474109 1478233 1483130 1489028 1496035 1504092 1512831
58980 1512831 1521961 1531914 1543471 1556590 1570366 1584301 1598915 1614921 1632654 1652526 1675038 1699890
$$ packed form
59069B796434j15590j07833j00077r2225q4954p8695p3010o7477o2338n7697n3109
59058A903429m8582m4910m2300l9772l6724l3945l2160l0668k8529k6204k4778
59047A514857k4275k3898k3415k3184k3219k3087k2480k1222j9216j6797j4573
59036A279491j2417r504n795k522m88J132L475O348Q797J0528J1831J2838J3591
59023A317305J4166J4139J2768J0297Q014O452M700K305L79k45n69j697k813k419
59009A382782o12J468L590O079Q244Q932Q373P937Q185Q471Q220P322N628L234
58995A467853J067Ml27p66j078l53J311K808L590M124M897N898P007Q057Q739
58980A512831R130R953J1557J3119J3776J3935J4614J6006J7733J9872K2512K4852
$$ plain form
58968 1699890 1725925 1752498 1780162 1809558 1840396 1872108 1904765 1938648 1973403 2008229 2042579
58957 2042579 2076292 2109491 2142717 2176818 2212482 2250219 2290850 2335315 2383781 2435603 2490438
58946 2490438 2548891 2611860 2679969 2753840 2834166 2921110 3014287 3113766 3220560 3335777 3459876
58935 3459876 3593045 3735752 3888612 4052206 4227405 4415468 4617692 4835321 5069892
58926 5069892 5323166 5596755 5892285 6211750 6557087 6929750 7331576 7765750 8235681
58917 8235681 8742972 9287595 9869822 10490283 11147621 11837286 12552752 13286059 14026041
58908 14026041 14757089 15460587 16116877 16705691 17206567 17600848 17873735 18014883 18018808 17886028
58898 17886028 17623214 17241469 16754973 16181255 15540739 14853930 14138883 13411515 12686839
$$ packed form
58968A699890K6035K6573K7664K9396L0838L1712L2657L3883L4755L4826L4350
58957B042579L3713L3199L3226L4101L5664L7737M0631M4465M8466N1822N4835
58946B490438N8453O2969O8109P3871Q0326Q6944R3177R9479J06794J15217J24099
58935C459876J33169J42707J52860J63594J75199J88063K02224K17629K34571
58926E069892K53274K73589K95530L19465L45337L72663M01826M34174M69931
58917H235681N07291N44623N82227O20461O57338O89665P15466P33307P39982
58908A4026041P31048P03498O56290N88814N00876L94281K72887J41148L925j32780
58898A7886028k62814l81745m86496n73718o40516o86809p15047p27368p24676
$$ plain form
58889 12686839 11978192 11295449 10645014 10031261 9457158 8923927 8431159 7977494 7560951
58880 7560951 7179058 6829229 6508777 6214445 5942710 5691057 5458387 5243685 5044996
58871 5044996 4860268 4688524 4529484 4382536 4246714 4121191 4005248 3898188 3799787 3710306
58861 3710306 3629603 3556708 3490606 3430826 3376974 3328559 3285809 3249813 3221142 3198900 3181726
58850 3181726 3169073 3161036 3157737 3159557 3167334 3181649 3202510 3230193 3265601 3309151 3360085 3417607
58838 3417607 3482010 3553921 3633111 3718931 3811467 3911601 4020345 4138662 4267409 4406932
58828 4406932 4557204 4718799 4893139 5081440 5284294 5502800 5739253 5996043 6274625
58819 6274625 6576243 6902956 7257374 7642131 8060070 8514056 9005908 9536218 10105416
$$ packed form
58889A2686839p08647o82743o50435o13753n74103n33231m92768m53665m16543
58880G560951l81893l49829l20452k94332k71735k51653k32670k14702j98689
58871E044996j84728j71744j59040j46948j35822j25523j15943j07060r8401q9481
58861C710306q0703p2895o6102n9780n3852m8415m2750l5996k8671k2242j7174
58850C181726j2653q037l299J820P777J4315K0861K7683L5408M3550N0934N7522
58838C417607O4403P1911P9190Q5820R2536J00134J08744J18317J28747J39523
58828D406932J50272J61595J74340J88301K02854K18506K36453K56790K78582
58819F274625L01618L26713L54418L84757M17939M53986M91852N30310N69198
$$ plain form
58810 10105416 10713627 11358484 12033861 12731128 13440125 14147754 14836838 15487778 16080792
58801 16080792 16596035 17013495 17315285 17488558 17526161 17426135 17192385 16835208 16369502
58792 16369502 15812319 15182345 14499944 13785241 13055677 12325832 11608466 10914089 10249833
58783 10249833 9620050 9027763 8474631 7960314 7483410 7042869 6637445 6264397 5920135
58774 5920135 5601918 5307798 5035459 4782514 4547729 4330606 4129873 3943512 3770041
58765 3770041 3608673 3458413 3318098 3187182 3065518 2952570 2847745 2751108 2662835 2582369
58755 2582369 2508999 2442668 2383099 2328723 2277832 2230335 2187101 2148008 2112012 2078757 2048605
58744 2048605 2021226 1995542 1970950 1947355 1924162 1900587 1876894 1854021 1832048 1810268 1788640
$$ packed form
58810A0105416O08211O44857O75377O97267P08997P07629O89084O50940N93014
58801A6080792N15243M17460L01790J73273L7603j00026k33750l57177m65706
58792A6369502n57183o29974o82401p14703p29564p29845p17366o94377o64256
58783A0249833o29783n92287n53132n14317m76904m40541m05424l73048l44262
58774E920135l18217k94120k72339k52945k34785k17123k00733j86361j73471
58765C770041j61368j50260j40315j30916j21664j12948j04825r6637q8273q0466
58755B582369p3370o6331n9569n4376n0891m7497m3234l9093l5996l3255l0152
58744B048605k7379k5684k4592k3595k3193k3575k3693k2873k1973k1780k1628
$$ plain form
58733 1788640 1767835 1747884 1728025 1707863 1687406 1666045 1642901 1618377 1594074 1570904 1548296
58722 1548296 1525295 1501330 1475871 1448627 1420364 1392538 1365841 1339989 1314894 1291015 1268502
58711 1268502 1247047 1226717 1207908 1190344 1173139 1155997 1139482 1124014 1109466 1095747 1082869
58700 1082869 1070457 1058075 1046010 1034830 1024328 1013904 1003801 994786 986699 978634 970698 964348
58688 964348 960647 959308 959721 961795 965311 969320 972734 974964 975680 974503 971190 965702 958109 948875 939108
58673 939108 930026 922242 915908 911071 907287 903449 898795 893685 888754 883908 879044 875000 872631 871467
58659 871467 870422 869285 868429 867610 866384 865183 864631 864298 863545 863136 864515 867938 872787 879229 887856 898104
58643 898104 908950 920954 935709 953320 972357 992372 1014494 1039261 1065844 1093854 1124188
$$ packed form
58733A788640k0805j9951j9859k0162k0457k1361k3144k4524k4303k3170k2608
58722A548296k3001k3965k5459k7244k8263k7826k6697k5852k5095k3879k2513
58711A268502k1455k0330j8809j7564j7205j7142j6515j5468j4548j3719j2878
58700A082869j2412j2382j2065j1180j0502j0424j0103r015q087q065p936o350
58688I64348l701j339M13K074L516M009L414K230P16j177l313n488p593r234r767
58673I39108r082p784o334m837l784l838m654n110m931m846m864m044k369j164
58659H71467j045j137q56q19j226j201n52l33p53m09J379L423M849O442Q627J0248
58643H98104J0846J2004J4755J7611J9037K0015K2122K4767K6583K8010L0334
$$ plain form
58632 1124188 1157487 1193415 1232017 1274247 1320567 1370502 1424268 1483527 1549894 1623868 1705701
58621 1705701 1796112 1895635 2004429 2123317 2254066 2398248 2556644 2729756 2917658 3119116
58611 3119116 3331739 3552716 3777967 4000615 4211888 4403694 4569083 4700733 4791495 4837192
58601 4837192 4837329 4792786 4704994 4578194 4420603 4241898 4050266 3852111 3652781 3456522
58591 3456522 3266707 3086643 2918936 2763800 2619680 2486200 2364955 2256799 2160161 2073059
58581 2073059 1995138 1926558 1866280 1812818 1765680 1724863 1689639 1658750 1631107 1605682 1581519
58570 1581519 1558405 1536665 1515866 1494685 1472326 1448895 1424147 1397300 1368536 1339148 1309574
58559 1309574 1278847 1246776 1215153 1185770 1158544 1132543 1107612 1084011 1061638 1040696 1022120
$$ packed form
58632A124188L3299L5928L8602M2230M6320M9935N3766N9259O6367P3974Q1833
58621A705701R0411R9523J08794J18888J30749J44182J58396J73112J87902K01458
58611C119116K12623K20977K25251K22648K11273J91806J65389J31650R0762M5697
58601D837192J37m4543q7792j26800j57591j78705j91632j98155j99330j96259
58591C456522j89815j80064j67707j55136j44120j33480j21245j08156r6638q7102
58581B073059p7921o8580o0278n3462m7138m0817l5224l0889k7643k5425k4163
58570A581519k3114k1740k0799k1181k2359k3431k4748k6847k8764k9388k9574
58559A309574l0727l2071l1623k9383k7226k6001k4931k3601k2373k0942j8576
$$ plain form
58548 1022120 1006345 992564 979973 968761 959137 950434 942038 934234 927330 920936 914834 909564 905403
58535 905403 901709 897939 894328 890968 887353 883457 880090 877473 874545 870401 865272 859403 852155 843086
58521 843086 832871 822369 811691 800857 790336 780262 770128 759820 750000 741101 733025 726095
58509 726095 720910 716972 712978 708857 705839 704054 702020 699228 697178 696833 696974 696368 695777 696316 697395
58494 697395 697868 697911 698288 698842 699092 699302 699756 699965 699656 699496 699883 700177 699991 700001 700588 701137 701624 703298 706620
58475 706620 710077 712345 714140 716580 719212 721182 723021 725670 728883 731977 735105 738467 741388 743499
58461 743499 745627 748277 750449 751263 751411 751633 751121 748936 745735 742501 738685 733221 726414 719384 712540
58446 712540 705926 700073 695263 690900 686686 683295 680934 678706 676490 675815 677507 680055 681800 683094
$$ packed form
58548A022120j5775j3781j2591j1212r624q703q396p804o904o394o102n270m161
58535I05403l694l770l611l360l615l896l367k617k928m144n129n869p248r069
58521H43086j0215j0502j0678j0834j0521j0074j0134j0308r820q899q076o930
58509G26095n185l938l994m121l018j785k034k792k050l45J41o06n91N39J079
58494F97395M73M3L77N54K50K10M54K09l09j60L87K94j86J0N87N49M87J674L322
58475G06620L457K268J795K440K632J970J839K649L213L094L128L362K921K111
58461G43499K128K650K172Q14J48K22n12k185l201l234l816n464o807p030o844
58446G12540o614n853m810m363m214l391k361k228k216o75J692K548J745J294
$$ plain form
58432 683094 684761 686135 686471 686748 688106 689767 690404 690298 690350 690249 689486 688999 689960 692050 694643 698344 703635
58415 703635 709410 714773 720910 729141 738520 747496 756651 767466 779489 790992 801491 811492 820675
58402 820675 828390 835094 841286 846013 848324 849142 849737 849534 847493 844444 841871 839619 837076 835449 836438
58387 836438 839620 843433 847681 852739 857481 860688 863600 868416 874982 881419 887227 893205 899032 903597
58373 903597 907212 911040 914844 917692 920317 924379 929829 935359 940924 947547 955119 962619 970009 977769
58359 977769 985200 991337 996864 1002985 1009256 1014638 1019739 1025714 1031973 1037310 1042265 1047826 1052991 1056317
58345 1056317 1058814 1062451 1066825 1070267 1073307 1077891 1083838 1089233 1093874 1099401 1106462 1114631 1124555 1137200
58331 1137200 1151349 1164758 1177415 1190940 1205382 1219470 1233423 1248482 1264156 1278920 1293178
$$ packed form
58432F83094J667J374L36K77J358J661O37j06N2j01p63m87R61K090K593L701N291
58415G03635N775N363O137Q231R379Q976R155J0815J2023J1503J0499J0001R183
58402H20675P715O704O192M727K311Q18N95k03k041l049k573k252k543j627R89
58387H36438L182L813M248N058M742L207K912M816O566O437N808N978N827M565
58373I03597L615L828L804K848K625M062N450N530N565O623P572P500P390P760
58359I77769P431O137N527O121O271N382N101N975O259N337M955N561N165L326
58345A056317K497L637M374L442L040M584N947N395M641N527P061Q169R924J2645
58331A137200J4149J3409J2657J3525J4442J4088J3953J5059J5674J4764J4258
$$ plain form
58320 1293178 1308617 1325075 1340884 1355710 1370246 1383907 1395881 1407713 1421644 1437081 1451835
58309 1451835 1466017 1481345 1497465 1512557 1526930 1542369 1558486 1573372 1587421 1602847 1619827
58298 1619827 1636730 1653775 1672818 1693923 1715734 1738711 1764331 1791586 1818035 1843714 1870307
58287 1870307 1897265 1922790 1947871 1975044 2003769 2031435 2058321 2087092 2117953 2149058 2181192
58276 2181192 2217101 2256348 2295769 2334993 2376696 2421495 2467495 2514883 2566024 2620916 2677415
58265 2677415 2735885 2798679 2865168 2932453 3000807 3073105 3149002 3225282 3301875 3381898 3465706
58254 3465706 3550767 3637465 3729071 3825886 3925468 4028757 4139693 4258633 4382531 4511711
58244 4511711 4649822 4797005 4950058 5109553 5279702 5461026 5650556 5849406 6062333
$$ packed form
58320A293178J5439J6458J5809J4826J4536J3661J1974J1832J3931J5437J4754
58309A451835J4182J5328J6120J5092J4373J5439J6117J4886J4049J5426J6980
58298A619827J6903J7045J9043K1105K1811K2977K5620K7255K6449K5679K6593
58287A870307K6958K5525K5081K7173K8725K7666K6886K8771L0861L1105L2134
58276B181192L5909L9247L9421L9224M1703M4799M6000M7388N1141N4892N6499
58265B677415N8470O2794O6489O7285O8354P2298P5897P6280P6593Q0023Q3808
58254C465706Q5061Q6698R1606R6815R9582J03289J10936J18940J23898J29180
58244D511711J38111J47183J53053J59495J70149J81324J89530J98850K12927
$$ plain form
58235 6062333 6289569 6527276 6776459 7042963 7328283 7629273 7947505 8289513 8657067
58226 8657067 9047103 9462306 9911446 10398064 10919552 11478919 12086238 12746824 13459795
58217 13459795 14230269 15070658 15987727 16981474 18059526 19239298 20533466 21948070 23498335
58208 23498335 25211248 27109345 29208630 31536605 34135380 37044085 40299348 43960550
58200 43960550 48117559 52873559 58349898 64721849 72235491 81200785 92022480 105270986
58192 105270986 121693819 142091801 167061810 196607606 229690898 264056016 296718393
58185 296718393 324945838 346896617 361336509 366974131 362505468 347578469 323653750
58178 323653750 293761517 261351047 229234218 199223264 172266741 148686645 128398340
$$ packed form
58235F062333K27236K37707K49183K66504K85320L00990L18232L42008L67554
58226H657067L90036M15203M49140M86618N21488N59367O07319O60586P12971
58217A3459795P70474Q40389R17069R93747J078052J179772J294168J414604J550265
58208B3498335J712913J898097K099285K327975K598775K908705L255263L661202
58200D3960550M157009M756000N476339O371951P513642Q965294J0821695J3248506
58192A05270986J6422833K0397982K4970009K9545796L3083292L4365118L2662377
58185B96718393K8227445K1950779J4439892N637622m468663j4926999k3924719
58178C23653750k9892233l2410470l2116829l0010954k6956523k3580096k0288305
$$ plain form
58171 128398340 111128221 96559517 84359340 74173739 65670135 58579865 52682815
58164 52682815 47778844 43701827 40341458 37624483 35488265 33894600 32856090 32426708
58156 32426708 32672898 33656401 35396358 37780489 40503312 43144408 45351573 46942879
58148 46942879 47820180 47821304 46723688 44425752 41107082 37186171 33119891 29235990 25705426
58139 25705426 22596720 19918383 17636556 15698909 14060031 12682885 11526148 10546375
58131 10546375 9711265 8999119 8387108 7851508 7378200 6961370 6591249 6252969 5937706
58122 5937706 5645072 5373337 5116314 4871193 4640766 4426044 4224366 4036251 3866207
58113 3866207 3714682 3576183 3447234 3329367 3222528 3122432 3026540 2936139 2850249 2763819
$$ packed form
58171A28398340j7270119j4568704j2200177j0185601q503604p090270n897050
58164E2682815m903971m077017l360369k716975k136218j593665j038510m29382
58156C2426708K46190R83503J739957K384131K722823K641096K207165J591306
58148D6942879Q77301J124j097616k297936l318670l920911m066280l883901l530564
58139B5705426l108706k678337k281827j937647j638878j377146j156737r79773
58131A0546375q35110p12146o12011n35600m73308m16830l70121l38280l15263
58122E937706k92634k71735k57023k45121k30427k14722k01678j88115j70044
58113C866207j51525j38499j28949j17867j06839j00096r5892r0401q5890q6430
$$ plain form
58103 2763819 2674594 2586084 2501422 2419672 2340284 2265578 2196251 2129512 2064107 2002413 1945500
58092 1945500 1890950 1837644 1787848 1742369 1698469 1654821 1613784 1576354 1539540 1501328 1463791
58081 1463791 1428624 1393882 1357987 1322963 1290827 1260522 1231188 1204836 1182785 1162690 1141998
58070 1141998 1121443 1102579 1084791 1067266 1051183 1037421 1024628 1011716 999759 989355 978792
58059 978792 966887 955030 944449 934022 922710 911435 900594 888483 874362 860506 848968
58048 848968 838769 828342 818315 809682 801620 793427 786430 781790 778460 775342 773415 773637 774828 775713
58034 775713 777091 779849 782686 783949 784073 784244 784255 783587 782944 782856 782295 780428 778199 776511 774461 771079
58018 771079 767151 763588 759577 754143 748096 742686 737607 731881 725450 718553 710905 702797 695457 689149
$$ packed form
58103B763819q9225q8510q4662q1750p9388p4706o9327o6739o5405o1694n6913
58092A945500n4550n3306m9796m5479m3900m3648m1037l7430l6814l8212l7537
58081A463791l5167l4742l5895l5024l2136l0305k9334k6352k2051k0095k0692
58070A141998k0555j8864j7788j7525j6083j3762j2793j2912j1957j0404j0563
58059I78792j1905j1857j0581j0427j1312j1275j0841j2111j4121j3856j1538
58048H48968j0199j0427j0027q633q062q193o997m640l330l118j927K22J191Q85
58034G75713J378K758K837J263J24J71J1o68o43q8n61j867k229j688k050l382
58018G71079l928l563m011n434o047n410n079n726o431o897p648q108p340o308
$$ plain form
58004 689149 682520 675023 668114 662727 657587 651587 645898 641953 639176 636569 634810 634756 635434 635481 635252 635649
57988 635649 636164 635915 635316 634998 634400 633181 632624 633774 635463 636072 636071 636872 638277 639032 639043 639152 639470 639550 639507
57969 639507 639466 638729 636859 634615 632496 629499 624816 619620 615531 612439 609448 606835 605223 603760 601033
57954 601033 597071 592771 588106 582636 577076 572565 568944 565351 562002 559794 558747 558357 559043 561702 566129
57939 566129 571200 576240 581015 584882 587091 587524 586168 582506 576396 568661 559805 549138 536329 522748
57925 522748 509890 497498 484765 472408 461947 453690 447031 441884 438191 434797 430671 426854 425495
57912 425495 427313 431488 437520 445515 454931 464703 474584 485072 496109 506950 517016 525826 532589
57899 532589 536990 539874 541949 542509 540712 537478 534581 532370 529819 526360 522124 516804 509897 501937
$$ packed form
58004F89149o629p497o909n387n140o000n689l945k777k607j759n4O78M7k29L97
57988F35649N15k49n99l18n98j219n57J150J689O09jQ01J405P55J1J09L18Q0m3
57969F39507m1p37j870k244k119k997m683n196m089l092k991k613j612j463k727
57954F01033l962m300m665n470n560m511l621l593l349k208j047l90O86K659M427
57939E66129N071N040M775L867K209M33j356l662o110p735q856j0667j2809j3581
57925E22748j2858j2392j2733j2357j0461q257o659n147l693l394m126l817j359
57912D25495J818M175O032P995R416R772R881J0488J1037J0841J0066Q810O763
57899E32589M401K884K075N60j797l234k897k211k551l459m236n320o907p960
$$ plain form
57885 501937 494112 486781 479573 472629 466432 460806 455418 450930 448271 447064 446171 445484 445779 447061 448643
57870 448643 450667 454047 458848 464147 469561 475587 482382 489457 496596 503854 510584 515679 518972 521338
57856 521338 523301 524488 524448 523082 520305 516198 511443 506726 501854 496281 490258 484483 478928 473037 466799
57841 466799 460602 454357 447875 441797 436997 433262 429643 425844 422183 418596 414844 411356 408551 405663
57827 405663 401550 396384 391131 385675 379012 371114 362997 354957 346423 337651 329925 323671 317830 311467
57813 311467 304747 298058 291554 285955 282350 280601 279092 276695 274038 272365 272050 272687 273800 275030 276421
57798 276421 278871 283548 290623 299265 308944 319852 331897 344245 356098 367135 377013 385284 391981
57785 391981 397534 402070 405539 408412 411284 413805 415018 414718 413454 411206 407227 401273 393843 385109
$$ packed form
57885E01937p825p331p208o944o197n626n388m488k659j207q93o87K95J282J582
57870D48643K024L380M801N299N414O026O795P075P139P258O730N095L293K366
57856E21338J963J187m0j366k777m107m755m717m872n573o023n775n555n891o238
57841D66799o197o245o482o078m800l735l619l799l661l587l752l488k805k888
57827D05663m113n166n253n456o663p898q117q040q534q772p726o254n841o363
57813C11467o720o689o504n599l605j749j509k397k657j673l15O37J113J230J391
57798B76421K450M677P075Q642R679J0908J2045J2348J1853J1037R878Q271O697
57785C91981N553M536L469K873K872K521J213l00j264k248l979n954p430q734
$$ plain form
57771 385109 374916 364027 354056 345742 338443 331728 326298 322826 321021 320392 320936 322512 324436 326311
57757 326311 328474 331144 333836 335973 337370 337846 337268 336282 336197 337703 340476 344230 349210 355325 361736
57742 361736 367726 373193 378077 382218 386052 390456 395559 400627 405341 410096 414759 418456 421185 424405
57728 424405 429254 435246 441495 448161 455759 463988 472270 480730 489690 498723 507153 515073 523180 532013
57714 532013 541977 553628 567335 582996 600536 620155 641703 664487 688220 713501 740892 770301
57702 770301 801864 836574 875169 917076 961411 1008598 1060183 1117388 1180647 1250252 1326673
57691 1326673 1410478 1502687 1605200 1720314 1849760 1994443 2154819 2331103 2523263 2730998
57681 2730998 2953305 3187613 3429392 3672630 3910292 4134513 4337534 4513532 4659696
$$ packed form
57771C85109j0193j0889r971q314p299o715n430l472j805o29N44J576J924J875
57757C26311K163K670K692K137J397M76n78r86q5J506K773L754M980O115O411
57742C61736N990N467M884M141L834M404N103N068M714M755M663L697K729L220
57728D24405M849N992O249O666P598Q229Q282Q460Q960R033Q430P920Q107Q833
57714E32013R964J1651J3707J5661J7540J9619K1548K2784K3733K5281K7391K9409
57702G70301L1563L4710L8595M1907M4335M7187N1585N7205O3259O9605P6421
57691A326673Q3805R2209J02513J15114J29446J44683J60376J76284J92160K07735
57681B730998K22307K34308K41779K43238K37662K24221K03021J75998J46164
$$ plain form
57672 4659696 4775706 4862875 4923628 4960185 4972278 4956417 4908254 4825671 4709164 4559770 4377628
57661 4377628 4163153 3919874 3656492 3386038 3122025 2874394 2648492 2446889 2270732
57652 2270732 2119290 1989884 1879574 1786555 1709446 1646095 1594105 1552018 1519162 1494698 1477626
57641 1477626 1467465 1464198 1467691 1477662 1493964 1516385 1544473 1578106 1618080 1665771 1722399 1788834
57629 1788834 1865573 1952551 2049501 2156981 2276660 2410156 2557851 2718882 2891485 3072796
57619 3072796 3258837 3445104 3626456 3796065 3945438 4066404 4152809 4200182 4205226 4166946
57609 4166946 4087734 3972317 3826117 3655409 3468095 3272468 3074954 2879790 2690453 2510114
57599 2510114 2340682 2182618 2036019 1901171 1778016 1665943 1564288 1472472 1389585 1314504
$$ packed form
57672D659696J16010Q7169O0753L6557J2093j5861m8163q2583j16507j49394j82142
57661D377628k14475k43279k63382k70454k64013k47631k25902k01603j76157
57652B270732j51442j29406j10310r3019p7109o3351n1990m2087l2856k4464j7072
57641A477626j0161l267L493R971J6302K2421K8088L3633L9974M7691N6628O6435
57629A788834P6739Q6978R6950J07480J19679J33496J47695J61031J72603J81311
57619C072796J86041J86267J81352J69609J49373J20966Q6405M7373N044l8280
57609D166946p9212j15417j46200j70708j87314j95627j97514j95164j89337j80339
57599B510114j69432j58064j46599j34848j23155j12073j01655r1816q2887p5081
$$ plain form
57589 1314504 1246513 1185291 1130312 1080802 1036135 995702 958489 923507 890669 860589 833455
57578 833455 808630 785387 763559 743458 725620 710509 697999 687188 677155 667775 659429 652246
57566 652246 646243 641873 639604 639028 639144 639530 640627 642864 646279 651094 657978 667417 679167 692424
57552 692424 706272 720158 734358 749936 767780 787799 809475 832920 858846 887722 919668
57541 919668 955106 994838 1039532 1089691 1145984 1208914 1278289 1353751 1435889 1526075 1625205
57530 1625205 1733325 1850556 1977481 2114255 2259806 2411945 2567449 2721616 2868352
57521 2868352 3001301 3114848 3204121 3264732 3293101 3287155 3246892 3174635 3074794 2952962 2815058
57510 2815058 2667120 2515205 2364555 2218778 2080297 1951311 1833602 1727507 1631987 1545980
$$ packed form
57589A314504o7991o1222n4979m9510m4667m0433l7213l4982l2838l0080k7134
57578H33455k4825k3243k1828k0101j7838j5111j2510j0811j0033r380q346p183
57566F52246o003m370k269n76J16L86J097K237L415M815O884R439J1750J3257
57552F92424J3848J3886J4200J5578J7844K0019K1676K3445K5926K8876L1946
57541I19668L5438L9732M4694N0159N6293O2930O9375P5462Q2138R0186R9130
57530A625205J08120J17231J26925J36774J45551J52139J55504J54167J46736
57521B868352J32949J13547Q9273O0611K8369n946m0263p2257r9841j21832j37904
57510B815058j47938j51915j50650j45777j38481j28986j17709j06095r5520q6007
$$ plain form
57500 1545980 1469097 1400936 1340469 1286566 1238726 1197034 1161649 1132356 1108362 1088658 1072953
57489 1072953 1062042 1056638 1056126 1059199 1065503 1075709 1090025 1107724 1128396 1152682 1181362 1214552
57477 1214552 1252281 1295091 1343530 1397704 1457901 1525270 1601426 1687727 1785097 1893954 2013884
57466 2013884 2143722 2282057 2427011 2575196 2721430 2859694 2983898 3087771 3165213 3211602
57456 3211602 3224424 3202589 3146203 3057668 2942132 2805923 2654895 2494573 2330733 2168519
57446 2168519 2011305 1861272 1720638 1591310 1473636 1366633 1269513 1182178 1104251 1034545
57436 1034545 971724 914906 863475 816906 774961 737605 704521 674936 647974 622992 599648
57425 599648 577922 557934 539515 522229 506062 491646 479231 467884 456455 445128 435146 427051
$$ packed form
57500A545980p6883o8161o0467n3903m7840m1692l5385k9293k3994j9704j5705
57489A072953j0911n404n12L073O304J0206J4316J7699K0672K4286K8680L3190
57477A214552L7729M2810M8439N4174O0197O7369P6156Q6301R7370J08857J19930
57466B013884J29838J38335J44954J48185J46234J38264J24204J03873P7442M6389
57456C211602J2822k1835n6386q8535j15536j36209j51028j60322j63840j62214
57446B168519j57214j50033j40634j29328j17674j07003r7120q7335p7927o9706
57436A034545o2821n6818n1431m6569m1945l7356l3084k9585k6962k4982k3344
57425E99648k1726j9988j8419j7286j6167j4416j2415j1347j1429j1327r982q095
$$ plain form
57413 427051 420012 413074 406256 400064 394538 389182 383514 377354 370908 364810 359788 356042 353194 350989
57399 350989 349725 349746 350786 352142 353325 354297 355214 356221 357478 359114 361033 362835 364111 364911 365878 367677
57383 367677 370203 372560 373946 374387 374434 374432 374402 374418 374627 374967 375169 375085 374664 373717 372151 370435 369352 369130 369232
57364 369232 369241 369519 370648 372467 374088 374853 374964 375109 375661 376412 377059 377817 379337 381925 385030 387724 389624
57347 389624 391048 392358 393526 394478 395512 397052 399078 401080 402599 403691 404875 406713 409441 412925
57333 412925 416883 421098 425454 429851 434227 438619 443115 447748 452513 457395 462267 466837 470858 474433
57319 474433 477968 481866 486321 491301 496513 501471 505899 510188 515290 521941 530051 538877 547705 556342
57305 556342 565009 573939 583088 592307 601756 611996 623517 636208 649453 662737 676127 690241
$$ packed form
57413D27051p039o938o818o192n526n356n668o160o446o098n022l746k848k205
57399C50989j264K1J040J356J183R72R17J007J257J636J919J802J276Q00R67J799
57383C67677K526K357J386M41M7kl0J6K09L40K02q4m21r47j566j716j083k22J02
57364C69232RK78J129J819J621P65J11J45N52P51O47P58J520K588L105K694J900
57347C89624J424J310J168R52J034J540K026K002J519J092J184J838K728L484
57333D12925L958M215M356M397M376M392M496M633M765M882M872M570M021L575
57319D74433L535L898M455M980N212M958M428M289N102O651Q110Q826Q828Q637
57305E56342Q667Q930R149R219R449J0240J1521J2691J3245J3284J3390J4114
$$ plain form
57293 690241 705822 723241 742218 762106 782625 804282 827890 853782 881646 910987 941370
57282 941370 972309 1003290 1033974 1064046 1092901 1119919 1145036 1168447 1189498 1206482 1218004
57271 1218004 1224133 1225679 1222675 1214227 1199750 1179707 1155174 1127350 1097668 1067675 1038375 1009940
57259 1009940 982337 955974 931577 909788 891131 875905 863645 853069 843151 834112 826847 821541
57247 821541 817435 813892 810930 808458 805727 802114 798063 794754 792967 792601 793091 793902 794813 796101 798301
57232 798301 801445 804798 807785 810904 814971 819595 823273 825302 826796 829313 833035 836909 840217 843338
57218 843338 847119 852135 858602 866450 875284 884526 893705 902545 910952 919194 927878 937261 946614 954833
57204 954833 961830 968784 976715 985240 993146 999903 1006089 1012339 1018422 1023593 1027558 1030751 1033725 1036622
$$ packed form
57293F90241J5581J7419J8977J9888K0519K1657K3608K5892K7864K9341L0383
57282I41370L0939L0981L0684L0072K8855K7018K5117K3411K1051J6984J1522
57271A218004O129J546l004q448j4477k0043k4533k7824k9682k9993k9300k8435
57259A009940k7603k6363k4397k1789j8657j5226j2260j0576r918r039p265n306
57247H21541m106l543k962k472k731l613m051l309j787l66M90Q11R11J288K200
57232G98301L144L353K987L119M067M624L678K029J494K517L722L874L308L121
57218H43338L781N016O467P848Q834R242R179Q840Q407Q242Q684R383R353Q219
57204I54833O997O954P931Q525P906O757O186O250O083N171L965L193K974K897
$$ plain form
57190 1036622 1039369 1042150 1045324 1048864 1052251 1055149 1057947 1061330 1065466 1069966 1074600 1079604 1085159 1090920
57176 1090920 1096360 1101467 1106889 1113410 1121366 1130452 1140084 1150044 1160912 1173710 1189112 1207110 1227424
57163 1227424 1249929 1274573 1301264 1330112 1361558 1395965 1433247 1473293 1516605 1564146 1616582
57152 1616582 1674035 1736524 1804234 1877278 1955658 2039654 2129821 2226198 2327668 2432407 2538858
57141 2538858 2646131 2753754 2861485 2969393 3077829 3187153 3297451 3408345 3518875
57132 3518875 3627725 3733797 3836485 3935071 4028069 4113770 4191776 4263747 4332399 4399836 4466861
57121 4466861 4533546 4600143 4667618 4737663 4812113 4891960 4976725 5064969 5155722 5249474 5347767
57110 5347767 5451890 5562102 5678062 5799653 5927071 6060445 6200166 6348224 6509306
$$ packed form
57190A036622K747K781L174L540L387K898K798L383M136M500M634N004N555N761
57176A090920N440N107N422O521P956R086R632R960J0868J2798J5402J7998K0314
57163A227424K2505K4644K6691K8848L1446L4407L7282M0046M3312M7541N2436
57152A616582N7453O2489O7710P3044P8380Q3996R0167R6377J01470J04739J06451
57141B538858J07273J07623J07731J07908J08436J09324J10298J10894J10530
57132C518875J08850J06072J02688R8586R2998Q5701P8006P1971O8652O7437O7025
57121D466861O6685O6597O7475P0045P4450P9847Q4765Q8244R0753R3752R8293
57110E347767J04123J10212J15960J21591J27418J33374J39721J48058J61082
$$ plain form
57101 6509306 6690714 6901648 7152541 7454060 7815604 8244769 8748885 9336935 10019292
57092 10019292 10805598 11703140 12715958 13842567 15072466 16385063 17753008 19147651
57084 19147651 20543513 21920806 23264424 24556868 25767671 26849022 27744335 28403662
57076 28403662 28793642 28898213 28716333 28260838 27555538 26629504 25514395 24248556 22881549
57067 22881549 21470372 20068059 18713450 17428086 16218991 15083887 14016661 13011177
57059 13011177 12062107 11164150 10312236 9502728 8733606 8003411 7310881 6655674 6038470
57050 6038470 5459966 4920280 4419487 3958051 3536480 3154994 2813537 2511493 2247291
57041 2247291 2018893 1824819 1664122 1535309 1435990 1363679 1316132 1290621 1283690 1292051 1313150
$$ packed form
57101F509306J81408K10934K50893L01519L61544M29165N04116N88050O82357
57092A0019292P86306Q97542J012818J126609J229899J312597J367945J394643
57084A9147651J395862J377293J343618J292444J210803J081351Q95313O59327
57076B8403662L89980J04571j81880m55495p05300r26034j115109j265839j367007
57067B2881549j411177j402313j354609j285364j209095j135104j067226j005484
57059A3011177r49070q97957q51914q09508p69122p30195o92530o55207o17204
57050F038470n78504n39686n00793m61436m21571l81486l41457l02044k64202
57041B247291k28398j94074j60697j28813r9319p2311m7547k5511o931Q361K1099
$$ plain form
57030 1313150 1344532 1383389 1427227 1474355 1523223 1571916 1618926 1663926 1707044 1747737 1785032
57019 1785032 1818503 1848274 1874285 1896287 1914532 1929827 1942860 1953908 1963101 1970526 1976247 1980880
57007 1980880 1986024 1993460 2003976 2017869 2036884 2065001 2107014 2166856 2247191 2348833 2468599
56996 2468599 2597749 2723924 2835386 2922872 2977549 2989336 2950124 2859982 2729895 2577722
56986 2577722 2420953 2271944 2137413 2019940 1919390 1834088 1761870 1700483 1647417 1600197
56976 1600197 1557403 1519181 1486353 1459110 1436777 1418642 1404570 1394734 1388984 1386641 1386881 1389343
56964 1389343 1394357 1402517 1414105 1429108 1447634 1469788 1494848 1520908 1545731 1567791 1586158 1599680
56952 1599680 1606895 1606917 1600052 1587482 1570707 1551428 1531462 1512313 1494902 1479834 1467627 1458398
$$ packed form
57030A313150L1382L8857M3838M7128M8868M8693M7010M5000M3118M0693L7295
57019A785032L3471K9771K6011K2002J8245J5295J3033J1048R193P425N721M633
57007A980880N144P436J0516J3893J9015K8117M2013N9842Q0335J01642J19766
56996B468599J29150J26175J11462Q7486N4677J1787l9212r0142j30087j52173
56986B577722j56769j49009j34531j17473j00550q5302p2218o1387n3066m7220
56976A600197m2794l8222l2828k7243k2333j8135j4072r836n750k343K40K462
56964A389343N014Q160J1588J5003J8526K2154K5060K6060K4823K2060J8367J3522
56952A599680P215K2o865j2570j6775j9279j9966j9149j7411j5068j2207r229
$$ plain form
56940 1458398 1451656 1446993 1444877 1446273 1451512 1460250 1472646 1489640 1511321 1535494 1558759 1578761
56928 1578761 1594557 1605020 1608138 1602425 1588224 1567144 1540902 1511317 1480732 1451473 1424944 1401633
56916 1401633 1381630 1364623 1349817 1336545 1324777 1314543 1305282 1296425 1288194 1280998 1274380 1267509
56904 1267509 1260535 1254425 1249525 1245349 1241824 1239665 1239234 1240055 1241769 1244702 1249157 1255157 1263289 1274796
56890 1274796 1290259 1309041 1330575 1355238 1383108 1412620 1441336 1467540 1490288 1508576 1521433
56879 1521433 1528645 1530689 1528316 1522828 1516218 1510133 1504897 1500185 1496284 1493982 1493669 1495526 1500369 1509467
56865 1509467 1523650 1543397 1569605 1603211 1643805 1689126 1735854 1780310 1818558 1846777 1861985
56854 1861985 1862394 1847587 1819149 1780943 1737838 1693863 1651774 1613845 1582014 1557235 1539598 1529291
$$ packed form
56940A458398o742m663k116J396N239Q738J2396J6994K1681K4173K3265K0002
56928A578761J5796J0463L118n713j4201k1080k6242k9585l0585k9259k6529k3311
56916A401633k0003j7007j4806j3272j1768j0234r261q857q231p196o618o871
56904A267509o974o110m900m176l525k159m31Q21J714K933M455O000Q132J1507
56890A274796J5463J8782K1534K4663K7870K9512K8716K6204K2748J8288J2857
56879A521433P212K044k373n488o610o085n236m712l901k302l13J857M843R098
56865A509467J4183J9747K6208L3606M0594M5321M6728M4456L8248K8219J5208
56854A861985M09j4807k8438l8206m3105m3975m2089l7929l1831k4779j7637j0307
$$ plain form
56842 1529291 1526880 1532740 1547102 1570877 1605719 1652996 1713023 1784905 1865884 1950471 2031178 2100865
56830 2100865 2154227 2187169 2196030 2178497 2135426 2071515 1994354 1912438 1832958 1760406 1696849
56819 1696849 1643180 1599671 1565765 1540427 1523249 1514857 1516179 1527983 1551231 1586848 1634243 1690214
56807 1690214 1749663 1807206 1858105 1898305 1924238 1932685 1921163 1889256 1839965 1779274 1713879
56796 1713879 1649165 1588843 1535213 1489106 1450116 1417622 1391518 1371850 1358363 1350936 1350114 1356697
56784 1356697 1370809 1391501 1416905 1444531 1471781 1496453 1516580 1529795 1533459 1525843 1506993 1478415
56772 1478415 1442474 1402211 1360877 1320961 1283836 1250450 1221705 1197774 1177717 1160418 1145480
56761 1145480 1132732 1121486 1111042 1101525 1093405 1086439 1079855 1073446 1067741 1063067 1059114 1055498 1052189
$$ packed form
56842A529291k411N860J4362K3775L4842M7277O0027P1882Q0979Q4587Q0707O9687
56830B100865N3362L2942Q861j7533m3071o3911p7161q1916p9480p2552o3557
56819A696849n3669m3509l3906k5338j7178q392J322J1804K3248L5617M7395N5971
56807A690214N9449N7543N0899M0200K5933Q447j1522l1907m9291o0691o5395
56796A713879o4714o0322n3630m6107l8990l2494k6104j9668j3487p427q22O583
56784A356697J4112K0692K5404K7626K7250K4672K0127J3215L664p616j8850k8578
56772A478415l5941m0263m1334l9916l7125l3386k8745k3931k0057j7299j4938
56761A145480j2748j1246j0444r517q120o966o584o409n705m674l953l616l309
$$ plain form
56748 1052189 1049267 1046780 1044936 1043929 1043341 1042100 1039391 1035426 1031168 1027466 1024617 1022543 1021017 1019649
56734 1019649 1017863 1015088 1011079 1006022 1000427 994963 990253 986466 983059 979322 975341 972026 969888 968268
56720 968268 966253 963877 961702 959617 957011 953942 951112 948607 945764 942539 939908 938420 937280 935527
56706 935527 933321 931364 929754 928239 927041 926506 926193 925170 923122 920552 917941 915293 912418 909259 905935
56691 905935 902776 900163 898074 896002 893578 891023 888732 886743 884992 883754 883373 883712 884279 884811 885507
56676 885507 886794 888885 891420 893540 894724 895503 896827 898742 900434 901656 903223 905785 908954 912088
56662 912088 915067 917778 919753 921043 922648 925233 928076 930104 931326 932395 933378 933918 934060 933906 932912
56647 932912 930526 927117 923236 918366 911597 903307 894997 887489 880325 872907 865247 857607 850403 844522
$$ packed form
56748A052189k922k487j844j007n88j241k709l965m258l702k849k074j526j368
56734A019649j786k775m009n057n595n464m710l787l407l737l981l315k138j620
56720I68268k015k376k175k085k606l069k830k505k843l225k631j488j140j753
56706I35527k206j957j610j515j198n35l13j023k048k570k611k648k875l159l324
56691I05935l159k613k089k072k424k555k291j989j751j238l81L39N67N32O96
56676H85507J287K091K535K120J184P79J324J915J692J222J567K562L169L134
56662I12088K979K711J975J290J605K585K843K028J222J069R83N40J42j54r94
56647I32912k386l409l881m870o769q290q310p508p164p418p660p640p204n881
$$ plain form
56633 844522 840751 838761 837464 836400 835966 836354 837339 839148 842412 846947 851583 855559 859177 862696 865557
56618 865557 867363 868840 871005 873725 875673 875539 872938 868394 862755 856449 849194 840593 831000 821402
56604 821402 812434 803995 795908 788472 782154 777095 773100 769802 766735 763609 760654 758422 757163 756623
56590 756623 756428 756389 756391 756351 756285 756210 755928 755116 753593 751471 749223 747716 747694 748928 750249 750809 750949 751453 752386
56571 752386 753158 753341 752926 752231 752037 753297 756077 759265 761954 764523 767626 770852 773399 775480 777856
56556 777856 780355 782165 783339 784764 786695 788541 790066 791592 792986 793634 793548 793338 792960 791646 789258
56541 789258 786588 784069 781228 777703 773752 769544 764966 760353 756382 753006 749535 745967 743099 741032
56527 741032 738840 736121 733674 732112 730945 729637 728430 727518 726407 724834 723306 722048 720317 717543
$$ packed form
56633H44522l771j990j297j064m34L88R85J809L264M535M636L976L618L519K861
56618H65557J806J477K165K720J948j34k601m544n639o306p255q601r593r598
56604H21402q968q439q087p436o318n059l995l298l067l126k955k232j259n40
56590G56623j95l9Km0o6p5k82q12j523k122k248j507k2J234J321N60J40N04R33
56571G52386P72J83m15o95j94J260K780L188K689K569L103L226K547K081K376
56556G77856K499J810J174J425J931J846J525J526J394O48q6k10l78j314k388
56541G89258k670k519k841l525l951m208m578m613l971l376l471l568k868k067
56527G41032k192k719k447j562j167j308j207r12j111j573j528j258j731k774
$$ plain form
56513 717543 714287 711362 708828 706522 704710 703464 702104 700068 697650 695264 692703 689748 686780 684128
56499 684128 681565 679051 677123 675826 674104 671170 667767 665185 663638 662464 661267 660007 658530 656951
56485 656951 655984 656016 656325 656001 655230 654879 655371 656749 659253 662808 666403 669004 670842 672875 675293 677544
56469 677544 679592 682116 685419 689069 692669 696220 699615 702428 704465 706024 707529 709231 711225 713385
56455 713385 715271 716448 716903 716920 716678 716127 715164 713792 712221 710791 709504 707728 704862 701251 697859 695122
56439 695122 692820 691039 690216 690065 689527 688175 686677 685431 683872 681805 680232 679921 680052 679254 677210 674348
56423 674348 670746 666472 662283 658799 655482 651539 647338 643789 640747 637238 632974 628431 623511 617356
56409 617356 609651 601209 593104 585945 579995 575285 571514 568404 566183 565291 565756 567243 569380 571505 572577
$$ packed form
56513G17543l256k925k534k306j812j246j360k036k418k386k561k955k968k652
56499F84128k563k514j928j297j722k934l403k582j547j174j197j260j477j579
56485F56951r67L2L09l24p71l51M92J378K504L555L595K601J838K033K418K251
56469F77544K048K524L303L650L600L551L395K813K037J559J505J702J994K160
56455G13385J886J177M55J7k42n51r63j372j571j430j287j776k866l611l392k737
56439F95122k302j781q23j51n38j352j498j246j559k067j573l11J31p98k044k862
56423F74348l602m274m189l484l317l943m201l549l042l509m264m543m920o155
56409F17356p705q442q105p159n950m710l771l110k221q92M65J487K137K125J072
$$ plain form
56394 572577 572136 571076 570658 571011 571367 571621 572647 575028 578257 581420 584169 586840 590002 593911 598126
56379 598126 601712 604111 605615 606701 607218 606590 604567 601423 597750 594510 592933 593797 596803 600895 604977
56364 604977 608261 610410 611705 612691 613496 613905 614152 614870 616032 616811 616875 616922 617475 618080 618329 618738 619827 621168
56346 621168 622114 622725 623207 623283 622985 623230 624617 626411 627744 629101 631551 635179 639348 643928 649072 654295
56330 654295 658897 662926 666778 670358 673671 677654 683253 690132 697403 705137 713930 723387 732362 740511
56316 740511 748482 756692 764935 772965 780482 786733 791075 793755 795393 796112 795964 795555 795252 794325 792020
56301 792020 788959 786334 784239 782037 779903 778700 778646 779342 780781 783122 785855 788460 791634 796562 803281
56286 803281 810964 819473 829400 840867 853626 868008 884478 902571 921605 942057 964864 989762
$$ packed form
56394E72577m41j060m18L53L56K54J026K381L229L163K749K671L162L909M215
56379E98126L586K399J504J086N17o28k023l144l673l240j577Q64L006M092M082
56364F04977L284K149J295R86Q05M09K47P18J162P79O4M7N53O05K49M09J089J341
56346F21168R46O11M82P6k98K45J387J794J333J357K450L628M169M580N144N223
56330F54295M602M029L852L580L313L983N599O879P271P734Q793R457Q975Q149
56316G40511P971Q210Q243Q030P517O251M342K680J638P19j48m09l03r27k305
56301G92020l061k625k095k202k134j203n4O96J439K341K733K605L174M928O719
56286H03281P683Q509R927J1467J2759J4382J6470J8093J9034K0452K2807K4898
$$ plain form
56274 989762 1015914 1043865 1075175 1110218 1148022 1188303 1232049 1279999 1332118 1388791 1451104
56263 1451104 1519755 1595069 1678176 1770749 1873309 1985079 2105650 2235499 2374643 2522028
56253 2522028 2676444 2836818 3001350 3167321 3331777 3491344 3641635 3778146 3897804
56244 3897804 3998645 4078440 4135181 4168729 4180477 4171578 4143079 4097572 4038864 3969873 3892435
56233 3892435 3809016 3722565 3634398 3544163 3452242 3360341 3269161 3177394 3083803 2988667 2892453
56222 2892453 2794631 2694755 2593537 2492034 2390796 2290332 2191320 2093926 1998016 1904448
56212 1904448 1815003 1730635 1650931 1575598 1505235 1440234 1380141 1324633 1274092 1228796 1188394
56201 1188394 1152405 1120307 1091159 1064192 1039746 1018533 1000163 983616 968870 956560 946212
$$ packed form
56274I89762K6152K7951L1310L5043L7804M0281M3746M7950N2119N6673O2313
56263A451104O8651P5314Q3107R2573J02560J11770J20571J29849J39144J47385
56253B522028J54416J60374J64532J65971J64456J59567J50291J36511J19658
56244C897804J00841P9795N6741L3548J1748q899k8499m5507n8708o8991p7438
56233C892435q3419q6451q8167r0235r1921r1901r1180r1767r3591r5136r6214
56222B892453r7822r9876j01218j01503j01238j00464r9012r7394r5910r3568
56212A904448q9445q4368p9704p5333p0363o5001o0093n5508n0541m5296m0402
56201A188394l5989l2098k9148k6967k4446k1213j8370j6547j4746j2310j0348
$$ plain form
56190 946212 936511 927257 919332 912750 906570 900875 896997 895440 895248 895695 896974 899028 901455 904848 910518
56175 910518 918604 928022 938394 950238 963184 975950 988334 1001315 1014873 1027665 1039126 1049903
56163 1049903 1059955 1068259 1074730 1080335 1084997 1087567 1088301 1089107 1090897 1092945 1095332 1099636 1106579 1115372
56149 1115372 1126089 1140244 1158236 1178696 1201342 1228142 1260819 1299637 1345580 1401092 1467437
56138 1467437 1543775 1630153 1728854 1841199 1965077 2096881 2233537 2371282 2504917 2630288
56128 2630288 2745918 2851081 2944420 3025708 3096643 3158246 3209460 3249604 3279866 3300795 3310596
56117 3310596 3307683 3292927 3267755 3232030 3185397 3128607 3061739 2983048 2891294 2787557 2673595
56106 2673595 2550773 2422287 2294231 2172416 2059679 1957505 1867814 1791359 1726523 1671573
$$ packed form
56190I46212r701r254p925o582o180n695l878j557j92M47J279K054K427L393N670
56175I10518Q086R418J0372J1844J2946J2766J2384J2981J3558J2792J1461J0777
56163A049903J0052Q304O471N605M662K570P34Q06J790K048K387M304O943Q793
56149A115372J0717J4155J7992K0460K2646K6800L2677L8818M5943N5512O6345
56138A467437P6338Q6378R8701J12345J23878J31804J36656J37745J33635J25371
56128B630288J15630J05163R3339Q1288P0935O1603N1214M0144L0262K0929R801
56117C310596k913j4756k5172l5725m6633n6790o6868p8691r1754j03737j13962
56106B673595j22822j28486j28056j21815j12737j02174q9691p6455o4836n4950
$$ plain form
56096 1671573 1626218 1589435 1558103 1529699 1504287 1482189 1461902 1442124 1423578 1406973 1391405
56085 1391405 1376505 1363823 1354145 1345859 1337826 1331395 1327486 1324331 1320428 1317263 1316705 1318009 1319832 1322900
56071 1322900 1328187 1334685 1341376 1349227 1358921 1368875 1377927 1387656 1399618 1412600 1425090 1438135 1453234
56058 1453234 1469663 1486316 1503819 1522459 1540549 1557343 1574966 1594929 1615471 1634944 1654893
56047 1654893 1676920 1699477 1720828 1742396 1765986 1790516 1814655 1839847 1867452 1895809 1923551
56036 1923551 1952907 1986182 2021804 2057441 2094155 2133863 2175635 2218346 2264102 2315167 2370221
56025 2370221 2427367 2487821 2552820 2620044 2687170 2755783 2827703 2900776 2972650 3045340 3121532
56014 3121532 3199739 3277737 3357388 3441309 3528264 3616776 3709722 3810249 3916591 4026093 4140762
$$ packed form
56096A671573m5355l6783l1332k8404k5412k2098k0287j9778j8546j6605j5568
56085A391405j4900j2682r678q286q033o431l909l155l903l165n58J304J823L068
56071A322900N287O498O691P851R694R954R052R729J1962J2982J2490J3045J5099
56058A453234J6429J6653J7503J8640J8090J6794J7623J9963K0542J9473J9949
56047A654893K2027K2557K1351K1568K3590K4530K4139K5192K7605K8357K7742
56036A923551K9356L3275L5622L5637L6714L9708M1772M2711M5756N1065N5054
56025B370221N7146O0454O4999O7224O7126O8613P1920P3073P1874P2690P6192
56014C121532P8207P7998P9651Q3921Q6955Q8512R2946J00527J06342J09502J14669
$$ plain form
56003 4140762 4263665 4393696 4529300 4673330 4828643 4993142 5165021 5348402 5547507
55994 5547507 5759911 5982160 6217300 6469886 6738609 7021458 7323166 7649537 7999272
55985 7999272 8369713 8765648 9193840 9654073 10144866 10672878 11247223 11869816 12541240
55976 12541240 13270590 14069218 14940715 15888165 16925200 18068451 19325823 20704751 22225249
55967 22225249 23911961 25781264 27850852 30154617 32733944 35624871 38872599 42551896
55959 42551896 46759302 51601881 57220776 63822791 71680519 81137235 92664322 106916321
55951 106916321 124678858 146674415 173234066 203857680 236867713 269575197 299103799
55944 299103799 323283072 340772870 350423022 350875572 341173377 321836708 295195205
$$ packed form
56003D140762J22903J30031J35604J44030J55313J64499J71879J83381J99105
55994E547507K12404K22249K35140K52586K68723K82849L01708L26371L49735
55985G999272L70441L95935M28192M60233M90793N28012N74345O22593O71424
55976A2541240P29350P98628Q71497R47450J037035J143251J257372J378928J520498
55967B2225249J686712J869303K069588K303765K579327K890927L247728L679297
55959D2551896M207406M842579N618895O602015P857728R456716J1527087J4251999
55951A06916321J7762537K1995557K6559651L0623614L3010033L2707484K9528602
55944B99103799K4179273J7489798R650152M52550r702195j9336669k6641503
$$ plain form
55937 295195205 264569935 233073442 202923709 175402471 151070702 129991129 111948683
55930 111948683 96637108 83733861 72897389 63787814 56113889 49639340 44154590
55923 44154590 39474504 35458896 32005760 29023423 26427701 24158597 22175221 20434565
55915 20434565 18892004 17517913 16295044 15201635 14212721 13314741 12502896 11766087 11088387
55906 11088387 10462726 9889263 9362285 8871525 8414301 7993652 7605931 7242047 6899697
55897 6899697 6583051 6291288 6018019 5761157 5523198 5302368 5093011 4894289 4709652
55888 4709652 4538298 4375535 4220824 4077211 3943488 3814855 3690657 3573824 3463466
55879 3463466 3355670 3250934 3153346 3062778 2975123 2889776 2809832 2735222 2662673 2592369 2527849
$$ packed form
55937B95195205l0625270l1496493l0149733k7521238k4331769k1079573j8042446
55930A11948683j5311575j2903247j0836472r109575p673925o474549n484750
55923D4154590m680086m015608l453136k982337k595722k269104j983376j740656
55915B0434565j542561j374091j222869j093409r88914q97980q11845p36809o77700
55906A1088387o25661n73463n26978m90760m57224m20649l87721l63884l42350
55897F899697l16646k91763k73269k56862k37959k20830k09357j98722j84637
55888D709652j71354j62763j54711j43613j33723j28633j24198j16833j10358
55879C463466j07796j04736r7588r0568q7655q5347p9944p4610p2549p0304o4520
$$ plain form
55868 2527849 2469215 2412865 2358073 2307554 2261285 2215852 2170387 2127514 2088041 2050137 2014157
55857 2014157 1983040 1957472 1935349 1915963 1899852 1884603 1865865 1842749 1817556 1790198 1757731
55846 1757731 1719606 1678745 1637162 1595019 1554052 1517332 1485169 1455395 1427781 1404037 1383513
55835 1383513 1363351 1343096 1324847 1308554 1291437 1272477 1253384 1234627 1214523 1192793 1171164
55824 1171164 1149935 1127596 1104360 1082466 1062516 1042933 1023350 1005031 987730 969686 951158
55813 951158 934529 920583 908054 897035 889290 884780 881379 878431 877212 877529 877379 876555 877187 880038
55799 880038 883380 886023 888221 889182 887052 882013 876185 869836 860835 848487 834713 820793 806144
55786 806144 791078 777537 766137 755485 745269 737033 731003 725195 718730 713068 708851 704336 698167
$$ packed form
55868B527849n8634n6350n4792n0519m6269m5433m5465m2873l9473l7904l5980
55857B014157l1117k5568k2123j9386j6111j5249j8738k3116k5193k7358l2467
55846A757731l8125m0861m1583m2143m0967l6720l2163k9774k7614k3744k0524
55835A383513k0162k0255j8249j6293j7117j8960j9093j8757k0104k1730k1629
55824A171164k1229k2339k3236k1894j9950j9583j9583j8319j7301j8044j8528
55813I51158j6629j3946j2529j1019p745m510l401k948j219L17j50q24O32K851
55799H80038L342K643K198R61k130n039n828o349r001j2348j3774j3920j4649
55786H06144j5066j3541j1400j0652j0216q236o030n808o465n662m217m515o169
$$ plain form
55773 698167 691024 683261 673525 661009 646817 631923 616058 599650 584590 571864 560416 549303
55761 549303 538969 529641 520641 512081 505041 499221 492613 484429 476132 468685 461039 452461 444198 437529
55747 437529 431933 426360 420755 415374 410165 405640 402796 401402 399872 397416 394793 392640 390791 389573
55733 389573 389819 391059 391589 390823 389722 388521 386134 382374 378640 375689 372674 369007 365214 361343 356611
55718 356611 351304 346975 343983 340879 336976 333459 331135 329232 327411 326837 328108 330041 331706 333930
55704 333930 337585 341935 345763 348696 350554 350925 350229 349712 349654 349124 348080 347893 349077 350420 351198 352411
55688 352411 354812 357549 359792 361966 364317 365965 366471 366718 367119 366611 364547 362036 360289 359055 357787
55673 357787 356842 356463 356073 355670 356468 359032 362190 364838 367414 370558 373791 376636 379597 382888 385612
$$ packed form
55773F98167p143p763r736j2516j4192j4894j5865j6408j5060j2726j1448j1113
55761E49303j0334r328r000q560p040n820o608q184q297p447p646q578q263o669
55747D37529n596n573n605n381n209m525k844j394j530k456k623k153j849j218
55733C89573K46J240N30p66j101j201k387l760l734k951l015l667l793l871m732
55718C56611n307m329k992l104l903l517k324j903j821n74J271J933J665K224
55704C33930L655M350L828K933J858L71o96n17n8n30j044j87J184J343P78J213
55688C52411K401K737K243K174K351J648N06K47M01n08k064k511j747j234j268
55673C57787r45l79l90m03P98K564L158K648K576L144L233K845K961L291K724
$$ plain form
55658 385612 387328 389009 391290 393214 393983 394591 396321 398732 400446 400858 399934 397418 393390 388644 383442
55643 383442 376890 368474 359195 350269 341853 333826 326570 319969 312940 305023 297267 290567 284363 277924
55629 277924 271587 265650 259438 252656 246340 241218 236390 230933 225552 221288 217731 213952 210182 207171
55615 207171 204758 202378 200143 198256 196324 194364 193433 194026 194856 194504 193259 192086 190874 189142 187423
55600 187423 186354 185291 183398 181371 180467 180374 179658 177895 175951 174456 173306 172412 171739 170833 169264 167283
55584 167283 165302 163307 161550 160986 161970 163231 163238 161974 160347 158618 156590 154717 153720 153555 153764 154367
55568 154367 155398 156148 156032 155630 155752 155993 155414 154183 153380 153483 154092 154804 155307 155030 153764 152385 151957
55551 151957 152406 152911 153271 153920 154987 156218 157566 158981 159940 159957 159288 158444 157471 156445 156101 157107 159096
$$ packed form
55658C85612J716J681K281J924P69O08J730K411J714M12r24k516m028m746n202
55643C83442o552q416r279q926q416q027p256o601p029p917p756o700o204o439
55629B77924o337n937o212o782o316n122m828n457n381m264l557l779l770l011
55615B07171k413k380k235j887j932j960r31N93Q30l52j245j173j212j732j719
55600A87423j069j063j893k027r04r3p16j763j944j495j150q94o73r06j569j981
55584A67283j981j995j757n64R84J261Pj264j627j729k028j873r97j65K09O03
55568A54367J031P50j16m02J22K41n79j231q03J03O09P12N03k77j266j379m28
55551A51957M49N05L60O49J067J231J348J415R59J7o69q44r73j026l44J006J989
$$ plain form
55534 159096 161265 163538 166383 169889 173748 177773 181769 185319 188276 190963 193365 194823 195152 195247 195790
55519 195790 196116 195133 192637 188927 183977 177982 171934 166638 161757 156789 152249 148919 146657 144963 143965
55504 143965 143742 143395 142001 139874 137793 135651 133045 130471 128607 126967 124619 121780 119392 117513 115470
55489 115470 113225 111284 109460 107003 103759 100160 96352 92441 89203 87309 86092 84292 81741 79198
55475 79198 76848 74332 72002 70755 70592 70593 70366 70404 70965 71676 72319 72905 73023 72228 71205 71457 73468 76036
55457 76036 77650 77856 77173 76395 76094 76268 76330 75872 75217 74809 74423 73658 72856 72703 73187 73732 74128 74536 74774
55438 74774 74465 73752 73186 72938 72736 72398 71896 71143 70241 69612 69452 69423 69258 69069 68695 67624 66113 65386 65956
55419 65956 66763 66868 66862 67472 67954 67387 66545 66780 67757 68082 67681 67705 68419 68984 69223 69847 70858 71343 70991 70434
$$ packed form
55534A59096K169K273K845L506L859M025L996L550K957K687K402J458L29R5N43
55519A95790L26r83k496l710m950n995o048n296m881m968m540l330k262j694r98
55504A43965k23l47j394k127k081k142k606k574j864j640k348k839k388j879k043
55489A15470k245j941j824k457l244l599l808l911l238j894j217j800k551k543
55475G9198k350k516k330j247j63Jk27L8N61P11O43N86J18p95j023K52K011K568
55457G6036J614K06o83p78l01J74O2m58o55m08l86p65q02j53M84N45L96M08K38
55438G4774l09p13n66k48k02l38n02p53r02o29j60k9j65j89l74j071j511p27N70
55419F5956Q07J05oO10M82n67q42K35R77L25m01K4P14N65K39O24J011M85l52n57
$$ plain form
55399 70434 69991 69449 69112 69656 70778 71336 70985 70446 70064 69397 68404 67722 67562 67447 67188 67026 66725 65738 64310
55380 64310 63237 62519 61550 60610 60736 61864 62538 61830 60340 58964 57928 57329 57414 57905 58158 58348 59387
55363 59387 61395 63399 64824 66077 67309 67869 67476 66817 66491 66388 66535 67349 68555 68983 68119 66892 66276
55346 66276 66000 65266 64015 62803 62057 61885 62098 62128 61525 60674 60358 60578 60661 60461 60460 60592 60134 58966 57789
55327 57789 56872 55704 54194 53018 52381 51621 50528 49882 50163 50785 51133 51305 51344 50864 50011 49720 50407 51391
55309 51391 52151 53036 54171 54858 54822 54876 55498 55849 55171 54123 53673 53557 52914 51760 50748 50071 49590 49519 50006
55290 50006 50468 50291 49853 50069 51175 52588 53628 53889 53358 52673 52793 53878 55020 55459 55380 55077 54207 52613
55272 52613 51063 50366 50358 50533 50931 51528 51507 50259 48637 48104 48884 49874 50177 49819 49206 48812 49291 51030 53500
$$ packed form
55399G0434m43n42l37N44J122N58l51n39l82o67r93o82j60j15k59j62l01r87j428
55380F4310j073p18r69r40J26J128O74p08j490j376j036n99Q5M91K53J90J039
55363E9387K008K004J425J253J232N60l93o59l26j03J47Q14J206M28q64j227o16
55346F6276k76p34j251j212p46j72K13L0o03q51l16K20Q3k00jJ32m58j168j177
55327E7789r17j168j510j176o37p60j093o46K81O22L48J72L9m80q53k91O87R84
55309E1391P60Q85J135O87l6N4O22L51o78j048m50j16o43j154j012o77m81p1M87
55290E0006M62j77m38K16J106J413J040K61n31o85J20J085J142M39p9l03q70j594
55272E2613j550o97qJ75L98N97k1j248j622n33P80R90L03l58o13l94M79J739K470
$$ plain form
55253 53500 55691 57171 58179 58847 58988 58545 57664 56371 54737 53301 52798 53406 54630 55883 56838 57357
55237 57357 57457 57261 56694 55416 53373 51193 49653 48912 48576 48384 48436 48889 49676 50481 50885 50736 50464 50705
55219 50705 51494 52201 52483 52879 54134 56241 58448 59959 60432 60127 59710 59587 59347 58281 56573 55387 55496
55202 55496 56417 57169 57360 57099 56449 55544 54890 55003 55887 57171 58481 59474 59847 59655 59290 58950 58471 57861
55184 57861 57522 57594 57563 56881 55652 54367 53318 52523 51933 51462 51069 50920 51108 51219 50737 49977 49893 50737 51524
55165 51524 51157 49547 47330 45092 43201 41834 40811 39902 39473 40135 41521 42219 41426 39964 39130 39210 39673
55148 39673 40193 40821 41623 42736 44352 46230 47639 48189 48194 47907 47134 46028 45432 45727 46052 45466 44328 43682
55130 43682 43775 44050 44283 44852 45942 47222 48288 48997 49486 50194 51641 53813 56047 57802 59195 60492
$$ packed form
55253E3500K191J480J008O68J41m43q81j293j634j436n03O08J224J253R55N19
55237E7357J00j96n67j278k043k180j540p41l36j92N2M53P87Q05M04j49k72K41
55219E0705P89P07K82L96J255K107K207J511M73l05m17j23k40j066j708j186J09
55202E5496R21P52J91k61o50r05o54J13Q84J284J310R93L73j92l65l40m79o10
55184E7861l39P2l1o82j229j285j049p95n90m71l93j49J88J11m82p60q4Q44P87
55165E1524l67j610k217k238j891j367j023r09m29O62J386O98p93j462q34Q0M63
55148C9673N20O28Q02J113J616J878J409N50Nk87p73j106n96K95L25n86j138o46
55130D3682R3K75K33N69J090J280J066P09M89P08J447K172K234J755J393J297
$$ plain form
55114 60492 61594 62352 62946 63555 64087 64485 64795 64700 63714 62115 60840 60046 58723 56366 54031 52967 53065
55097 53065 53610 54661 56510 58458 59411 59352 59073 58735 57885 56711 56105 56435 57180 57858 58465 58990 59282 59519
55079 59519 60134 61184 62320 63373 64444 65503 66445 67458 68773 70097 70828 70799 70398 70043 69973 70329 71016
55062 71016 71590 71718 71571 71479 71459 71410 71347 71097 70223 68787 67715 67784 68692 69651 70418 71042 71087 70027 68172 66360
55042 66360 64885 63438 61959 60853 60406 60552 61134 61895 62374 62311 62024 61964 62141 62310 62429 62579 62819 63389
55024 63389 64567 65977 66689 66454 66066 66035 65841 65171 64857 65555 66438 66434 66028 66534 68114 69877 71428 72896
55006 72896 73820 73571 72754 72695 73473 73823 73115 72089 71408 70737 69628 68260 66910 65611 64622 64399 64828 65175
54988 65175 64980 64342 63384 62245 61522 61809 62714 63197 62871 62207 61556 60968 60878 61884 63768 65709 67442 69258
$$ packed form
55114F0492J102P58N94O09N32L98L10r5r86j599j275p94j323k357k335j064R8
55097E3065N45J051J849J948R53n9k79l38q50j174o06L30P45O78O07N25K92K37
55079E9519O15J050J136J053J071J059R42J013J315J324P31k9m01l55p0L56O87
55062G1016N74J28j47r2k0m9o3k50q74j436j072O9R08R59P67O24M5j060j855j812
55042F6360j475j447j479j106m47J46N82P61M79o3k87o0J77J69J19J50K40N70
55024F3389J178J410P12k35l88l1j94o70l14O98Q83mm06N06J580J763J551J468
55006G2896R24k49q17n9P78L50p08j026o81o71j109j368j350j299r89k23M29L47
54988F5175j95o38r58j139p23K87R05M83l26o64o51n88r0J006J884J941J733J816
$$ plain form
54970 69258 71017 72375 73890 76493 79774 82201 83326 84326 85979 87658 88925 90673 93717 97505
54956 97505 101210 105151 110112 116162 123101 131313 141129 151918 162795 173825 185609 198018 210109
54943 210109 221024 230176 236781 239989 239540 235887 229621 221090 210491 198199 185093 172441 161094
54930 161094 150802 140831 131222 122810 116026 110522 106117 103128 101339 99595 97090 94379 92432 91303
54916 91303 90480 90027 90554 92293 94929 98201 102107 106611 111678 117635 125065 134241 144814 156083 167517
54901 167517 179009 190499 201207 209546 214221 215287 213684 209957 204035 196047 186509 175638 163385
54888 163385 150382 138074 127493 118465 110303 102705 95740 89601 84575 80687 77184 73118 68669
54875 68669 65177 63544 63302 63555 63960 64314 64004 62637 60760 59322 58756 58901 59391 59783 59777 59613 59740 59940
$$ packed form
54970F9258J759J358J515K603L281K427J125J000J653J679J267J748L044L788
54956I7505L705L941M961O050O939Q212R816J0789J0877J1030J1784J2409J2091
54943B10109J0915R152O605L208m49l653o266q531j0599j2292j3106j2652j1347
54930A61094j0292r971r609q412o784n504m405k989j789j744k505k711j947j129
54916I1303q23m53N27J739K636L272L906M504N067N957P430R176J0573J1269J1434
54901A67517J1492J1490J0708Q339M675J066j603l727n922p988r538j0871j2253
54888A63385j3003j2308j0581r028q162p598o965o139n026l888l503m066m449
54875F8669l492j633k42K53M05L54l10j367j877j438n66J45M90L92oj64J27K00
$$ plain form
54857 59940 59406 57918 56130 54424 52408 50044 48252 47625 47405 46620 45583 45322 46029 46984 47667 48089 48251
54840 48251 48072 47706 47380 47067 46781 46805 47121 47002 45897 44425 43853 44724 46516 48420 49964 51129 52334
54823 52334 54048 56039 57348 57449 57013 57057 57765 58631 59272 59535 59290 58844 59108 60659 63038 65659 68849
54806 68849 73059 77571 81146 83795 86751 90709 95195 99890 105499 112843 121850 131915 142686 154054
54792 154054 165841 177915 190292 202761 214592 224853 232882 238318 240914 240504 237072 230801 222224
54779 222224 212316 202214 192661 183663 174764 165716 157047 149896 144978 141786 139146 136568 134553 133487
54765 133487 132923 132323 131923 132299 133569 135592 138569 142713 147652 152918 158986 167002 177462 189803 203484
54750 203484 218812 236308 255613 275481 294713 312765 329391 343900 355094 361967 364250 362044
$$ packed form
54857E9940n34j488j788j706k016k364j792o27k20p85j037k61P07R55O83M22J62
54840D8251j79l66l26l13k86K4L16j19j105j472n72Q71J792J904J544J165J205
54823E2334J714J991J309J01m36M4P08Q66O41K63k45m46K64J551K379K621L190
54806F8849M210M512L575K649K956L958M486M695N609P344R007J0065J0771J1368
54792A54054J1787J2074J2377J2469J1831J0261Q029N436K596m10l432o271q577
54779B22224r908j0102r553q998q899r048q669p151m918l192k640k578k015j066
54765A33487n64o00m00L76J270K023K977M144M939N266O068Q016J0460J2341J3681
54750B03484J5328J7496J9305J9868J9232J8052J6626J4509J1194O873K283k206
$$ plain form
54738 362044 355215 343637 328005 309839 290650 271510 253298 236569 221004 205873 191377 178725
54726 178725 168474 159646 151149 143183 136411 130533 124834 119572 115579 112713 109967 107068 104770 103369
54712 103369 102060 100205 98372 97504 97631 97976 97989 97877 98214 99238 100421 100759 99713 97842 96237 95470
54696 95470 95351 95532 95841 96077 96026 95798 95752 96014 96375 96605 96571 96136 95401 94947 95307 96131 96422 95739 94798 94735
54676 94735 96061 98471 101355 104339 107466 110918 114519 117764 120469 123096 126113 129343 132470 135845
54662 135845 140094 145001 149494 152840 155320 157627 160203 163290 166990 170988 174662 177834 181028 184720
54648 184720 188699 192563 196638 201924 209128 217968 227584 237549 248379 261015 275863 292489 310143
54635 310143 328188 345907 362330 376573 388054 396023 399277 396858 388881 376254 359859 340569
$$ packed form
54738C62044o829j1578j5632j8166j9189j9140j8212j6729j5565j5131j4496j2652
54726A78725j0251q828q497p966o772n878n699n262l993k866k746k899k298j401
54712A03369j309j855j833q68J27L45J3j12L37J024J183L38j046j871j605p67
54696I5470j19J81L09K36n1k28m6K62L61K30l4m35p35m54L60Q24K91o83r41o3
54676I4735J326K410K884K984L127L452L601L245K705K627L017L230L127L375
54662A35845M249M907M493L346K480K307K576L087L700L998L674L172L194L692
54648A84720L979L864M075N286P204Q840R616R965J0830J2636J4848J6626J7654
54635C10143J8045J7719J6423J4243J1481P969L254k419p977j2627j6395j9290
$$ plain form
54623 340569 319812 299236 279672 260986 243232 227284 214032 203323 194170 185838 178422 172344
54611 172344 167529 163249 158920 154911 152260 151413 151559 151435 150476 148930 147207 145573 144144 142607 140127
54596 140127 136139 131192 126474 122514 118873 115123 111563 108743 106709 104964 102950 100489 97881 95571
54582 95571 93582 91457 88891 86139 83528 80983 78526 76833 76577 77316 77726 76970 75331 73578 72282
54567 72282 71710 71774 72011 72093 72310 73065 74073 74707 75028 75671 76773 77876 78952 80518 82492 83873 84131
54550 84131 84071 84719 85948 86919 87408 88010 89312 91460 94384 97880 101492 104665 107091 108854 110442 112660
54534 112660 116167 120906 126268 132005 138561 146319 154910 163616 172106 180395 188276 195195 200525 203810
54520 203810 204864 203858 201141 196875 191065 184024 176437 168751 160834 152416 143587 134641 125799 117429
$$ packed form
54623C40569k0757k0576j9564j8686j7754j5948j3252j0709r153q332p416o078
54611A72344m815m280m329m009k651q47J46j24r59j546j723j634j429j537k480
54596A40127l988m947m718l960l641l750l560k820k034j745k014k461k608k310
54582I5571j989k125k566k752k611k545k457j693k56P39M10p56j639j753j296
54567G2282n72O4K37Q2K17P55J008O34L21O43J102J103J076J566J974J381K58
54550H4131o0O48J229R71M89O02J302K148K924L496L612L173K426J763J588K218
54534A12660L507M739N362N737O556P758Q591Q706Q490Q289P881O919N330L285
54520B03810J054j006k717m266n810p041p587p686p917q418q829q946q842q370
$$ plain form
54506 117429 110205 104612 100411 96863 93480 90416 88274 87578 88206 89200 89443 88636 87356 86096 84737
54491 84737 83196 82015 81804 82444 83394 84553 86222 88277 89988 90869 91260 91810 92635 93249 93312 93171 93536
54474 93536 94696 96259 97762 99333 101444 104079 106463 107754 107856 107508 107711 108972 110810 111986 111536
54459 111536 109649 107360 105488 104193 103408 103073 102832 102161 101138 100549 100775 101010 100176 98276 96276 94769
54443 94769 93379 91527 89238 86935 84814 82792 80984 79875 79835 80539 81127 81079 80700 80537 80483 79910 78634
54426 78634 77316 76723 76966 77648 78394 78978 79324 79709 80721 82561 84531 85636 85687 85494 85974 87391 89476
54409 89476 91932 94556 97122 99468 101718 104175 106837 109222 110910 112186 113813 116142 118758 121179
54395 121179 123517 126182 129212 132284 135114 137395 138564 138214 136706 134856 133031 131015 128701 126315
$$ packed form
54506A17429p224n593m201l548l383l064k142o96O28R94K43q07j280j260j359
54491H4737j541j181k11O40R50J159J669K055J711Q81L91N50Q25O14O3j41L65
54474I3536J160J563J503J571K111K635K384J291J02l48K03J261J838J176m50
54459A11536j887k289j872j295p85l35k41o71j023n89K26K35q34j900k000j507
54443I4769j390j852k289k303k121k022j808j109m0P04N88m8l79j63n4n73j276
54426G8634j318n93K43O82P46N84L46L85J012J840J970J105N1j93M80J417K085
54409H9476K456K624K566K346K250K457K662K385J688J276J627K329K616K421
54395A21179K338K665L030L072K830K281J169l50j508j850j825k016k314k386
$$ plain form
54381 126315 123908 121256 118389 115651 113025 110038 106587 103323 100841 99034 97570 96447 95618 94592
54367 94592 92989 91133 89554 88234 86925 85860 85500 85708 85866 85769 85826 86344 87186 88197 89431 90797 91934
54350 91934 92710 93466 94490 95512 96043 96082 96234 97171 99126 101850 104856 107655 109909 111563 112850 114092
54334 114092 115376 116506 117332 118070 119057 120150 120587 119647 117387 114611 112134 110125 108098 105428 101825
54319 101825 97442 92723 88307 84916 82981 82151 81397 79861 77509 74875 72426 70431 69091 68293 67368
54304 67368 65696 63617 62210 62046 62540 62746 62385 61883 61718 61961 62280 62178 61427 60334 59438 58959 58760 58764
54286 58764 58986 59180 58945 58343 57903 57856 57790 57346 56781 56480 56238 55515 54259 53114 52840 53694 55337 57210
54268 57210 59023 60908 62950 64759 65848 66445 67449 69402 71796 73558 73993 73161 71678 70250 69183
$$ packed form
54381A26315k407k652k867k738k626k987l451l264k482j807j464j123q29j026
54367I4592j603j856j579j320j309j065l60K08J58r7N7N18Q42J011J234J366J137
54350I1934P76P56J024J022N31L9J52R37J955K724L006K799K254J654J287J242
54334A14092J284J130Q26P38R87J093M37r40k260k776k477k009k027k670l603
54319A01825m383m719m416l391j935q30p54j536k352k634k449j995j340p98r25
54304F7368j672k079j407j64M94K06l61n02j65K43L19j02p51j093q96m79j99M
54286E8764K22J94k35o02m40m7o6m44n65l01k42p23j256j145k74Q54J643J873
54268E7210J813J885K042J809J089N97J004J953K394J762M35q32j483j428j067
$$ plain form
54253 69183 68282 67437 67108 67768 69053 70147 70952 72050 73371 73865 72963 71533 70728 70527 70159 69462 69033
54236 69033 69240 69790 70195 70217 69949 69808 70273 71353 72566 73620 74668 75623 75883 75267 74573 74503 74491 73511 71731
54217 71731 70410 70279 70855 71428 71881 72399 73017 73715 74461 75025 75164 75058 75107 75284 75195 74839 74705 74993 75269
54198 75269 75121 74711 74370 74083 73676 73180 72631 71724 70106 67983 66153 65366 65761 66941 68356 69495 69810
54181 69810 68842 66689 64168 62166 60814 59608 58311 57270 56685 56125 55162 54138 53760 54109 54532 54491 54124
54164 54124 53908 54150 54898 56084 57546 58957 59921 60327 60571 61179 62020 62243 61416 60383 60316 61029 61128 59951
54146 59951 58456 57801 57884 57882 57522 57122 56903 56971 57568 58646 59502 59479 58729 57850 57143 56724 56814 57199 56992 55759
54126 55759 54445 54217 54753 54706 53633 52396 51738 51556 51607 51863 51909 51010 49185 47496 46911 47381 48203 48697
$$ packed form
54253F9183r01q45l29O60J285J094Q05J098J321M94r02j430q05k01l68o97m29
54236F9033K07N50M05K2k68j41M65J080J213J054J048R55K60o16o94p0j2r80j780
54217G1731j321j31N76N73M53N18O18O98P46N64J39j06M9J77q9l56j34K88K76
54198G5269j48m10l41k87m07m96n49r07j618k123j830p87L95J180J415J139L15
54181F9810r68k153k521k002j352j206j297j041n85n60r63j024l78L49M23m1l67
54164E4124k16K42P48J186J462J411R64M06K44O08Q41K23q27j033o7P13R9j177
54146E9951j495o55Q3kl60m00k19O8N97J078Q56k3p50q79p07m19R0L85k07j233
54126E5759j314k28N36m7j073j237o58j82N1K56M6q99j825j689n85M70Q22M94
$$ plain form
54108 48697 48383 47242 46079 45982 47118 48512 49186 48932 47945 46478 45126 44734 45527 46848 48065 49288
54092 49288 50804 52342 53275 53298 52641 51897 51798 52708 54143 55195 55585 55902 56610 57351 57522 57073 56394 55767
54074 55767 55239 54823 54513 54276 54151 54153 54073 53724 53378 53592 54537 55850 57139 58226 59005 59531 60218 61322 62326
54055 62326 62559 62415 63074 64850 66751 67994 69017 70411 71728 72169 71926 71969 72828 74218 75685 77032
54039 77032 78222 79327 80527 81967 83743 86071 89120 92585 95979 99517 104104 110060 116471 122215
54025 122215 127115 131650 136182 140990 146476 152566 158388 163174 167091 170573 173406 175287 176847 179007
54011 179007 181523 183131 183178 182223 180984 179597 178132 177058 176750 176998 177243 176911 175422 172397 168138 163507
53995 163507 159149 155070 151017 146856 142556 138285 134641 132210 130694 129010 126569 123960 121977 120448
$$ packed form
54108D8697l14j141j163r7J136J394O74k54r87j467j352l92P93J321J217J223
54092D9288J516J538R33K3o57p44r9R10J435J052L90L17P08P41J71m49o79o27
54074E5767n28m16l10k37j25Kq0l49l46K14R45J313J289J087P79N26O87J104J004
54055F2326K33j44O59J776J901J243J023J394J317M41k43M3Q59J390J467J347
54039G7032J190J105J200J440J776K328L049L465L394L538M587N956O411N744
54025A22215M900M535M532M808N486O090N822M786L917L482K833J881J560K160
54011A79007K516J608M7r55j239j387j465j074l08K48K45l32j489l025m259m631
53995A63507m358m079m053m161m300m271l644k431j516j684k441k609j983j529
$$ plain form
53981 120448 118592 116207 113867 112033 110603 109429 108705 108578 108767 108925 109175 109844 110778 111281 110871 109812
53965 109812 108793 108277 108290 108614 108960 109141 109277 109758 110791 112118 113357 114470 115610 116736 117769 118988
53949 118988 120739 122786 124490 125671 126812 128215 129549 130487 131333 132617 134478 136841 139877 143821 148528
53934 148528 153565 158560 163164 166903 169500 171171 172258 172683 172152 170831 169452 168723 168910 169934 171640
53919 171640 173904 176654 179816 183194 186557 189951 193775 198362 203620 209156 214567 219528 223954 228277
53905 228277 233263 239215 245561 251472 256610 260996 264528 267105 268978 270442 271311 271204 270263 269117 268131
53890 268131 267130 265802 263901 261039 256826 251393 245422 239425 233332 226889 220157 213457 207097 201316
53876 201316 196180 191271 185774 179218 172087 165454 160062 155925 152724 150257 148374 146699 144707 142174
$$ packed form
53981A20448j856k385k340j834j430j174p24j27J89J58K50O69R34N03m10j059
53965A09812j019n16J3L24L46J81J36M81J033J327J239J113J140J126J033J219
53949A18988J751K047J704J181J141J403J334R38Q46J284J861K363L036L944M707
53934A48528N037M995M604L739K597J671J087M25n31j321j379p29J87J024J706
53919A71640K264K750L162L378L363L394L824M587N258N536N411M961M426M323
53905B28277M986N952O346N911N138M386L532K577J873J464Q69j07r41j146r86
53890B68131j001j328j901k862m213n433n971n997o093o443o732o700o360n781
53876B01316n136m909n497o556p131o633n392m137l201k467j883j675j992k533
$$ plain form
53862 142174 139357 136613 133964 131202 128342 125668 123286 120890 118119 114983 111785 108797 106150 103934
53848 103934 102215 100938 99873 98649 96975 95019 93465 92878 93016 93151 93048 93139 93619 93923 93457 92333
53832 92333 91019 89739 88715 88516 89462 90875 91598 91223 90302 89460 88897 88709 89067 89912 90938 92029 93302
53815 93302 94703 95992 97197 98606 100174 101393 102024 102543 103599 105285 107218 109138 111164 113569 116438
53800 116438 119462 122037 123774 124956 126354 128575 131797 135994 140995 146203 150791 154470 157801 161461
53786 161461 165423 169080 171986 174190 176055 178005 180326 182865 185027 186302 186735 186606 185774 183767 180613
53771 180613 177200 174485 172510 170450 167601 164046 160367 156972 153890 151079 148664 146847 145666 144897
53757 144897 144099 142882 141250 139655 138525 137816 137194 136630 136424 136600 136592 135794 134195 132328 130770 129832 129475
$$ packed form
53862A42174k817k744k649k762k860k674k382k396k771l136l198k988k647k216
53848A03934j719j277j065j224j674j956j554n87J38J35j03R1M80L04m66j124
53832I2333j314j280j024j99R46J413P23l75r21q42n63j88L58Q45J026J091J273
53815I3302J401J289J205J409J568J219O31N19J056J686J933J920K026K405K869
53800A16438L024K575J737J182J398K221L222M197N001N208M588L679L331L660
53786A61461L962L657K906K204J865J950K321K539K162J275M33j29q32k007l154
53771A80613l413k715j975k060k849l555l679l395l082k811k415j817j181p69
53757A44897p98j217j632j595j130p09o22n64k06J76qp98j599j867j558r38l57
$$ plain form
53740 129475 129266 128598 127221 125487 123918 122749 122041 121891 122141 122209 121684 120984 120871 121353 121627 121194 120496 120159
53722 120159 120035 119389 117896 116075 114659 113729 112673 111055 109438 109044 110473 112976 115225 116616 117506
53707 117506 118373 119221 119860 120320 120843 121763 123477 126225 129657 132895 135224 136638 137638 138740 140309 142598
53691 142598 145621 149004 152182 154771 156764 158449 160240 162471 165179 168022 170375 171639 171739 171493 172294
53676 172294 174948 178749 181955 183358 183245 182767 182722 183110 183579 183832 183592 182583 180779 178598 176626 175162
53660 175162 174128 173412 173117 173345 173852 174160 174001 173445 172626 171653 170874 170852 171749 172903 173380 172838 171677 170509
53642 170509 169828 170040 171284 173120 174763 175792 176375 176729 176713 176187 175503 175308 175876 176829 177483 177452 177011 176984
53624 176984 178209 180880 184343 187527 189658 190679 191162 191863 193202 195013 196740 197922 198636 199544 201478
$$ packed form
53740A29475k09o68j377j734j569j169p08j50K50O8n25p00j13M82K74m33o98l37
53722A20159j24o46j493j821j416r30j056j618j617l94J429K503K249J391Q90
53707A17506Q67Q48O39M60N23R20J714K748L432L238K329J414J000J102J569K289
53691A42598L023L383L178K589J993J685J791K231K708K843K353J264J00k46Q01
53676A72294K654L801L206J403j13m78m5L88M69K53k40j009j804k181j972j464
53660A75162j034p16k95K28N07L08j59n56q19r73p79k2Q97J154M77n42j161j168
53642A70509o81K12J244J836J643J029N83L54j6n26o84j95N68R53O54l1m41k7
53624A76984J225K671L463L184K131J021M83P01J339J811J727J182P14R08J934
$$ plain form
53609 201478 204821 209235 214046 218813 223410 227641 231172 234029 236856 240347 244521 248788 252635 256050
53595 256050 259362 262873 266618 270364 273909 277405 281185 285185 288853 291842 294452 297091 299638 301741
53581 301741 303394 304646 305081 304348 303154 302885 304043 305698 306752 307109 307317 307623 307928 308224 308564 308876 309240
53564 309240 310102 311664 313252 313863 313364 312684 312727 313485 314338 314834 314916 314742 314679 315335 317111 319590 321679 322659
53546 322659 323030 324059 326529 330072 333747 336944 339665 342192 344774 347507 350252 352709 354766 356724
53532 356724 359016 361732 364648 367667 371061 375213 380261 385974 391861 397408 402383 407017 411852 417464
53518 417464 424340 432797 442822 453937 465425 476775 487965 499407 511570 524524 537858 551240
53506 551240 564998 579779 595609 611796 628048 645092 663744 683743 704101 724344 744773
$$ packed form
53609B01478L343M414M811M767M597M231L531K857K827L491M174M267L847L415
53595B56050L312L511L745L746L545L496L780M000L668K989K610K639K547K103
53581C01741J653J252M35p33j194k69J158J655J054L57K08L06L05K96L40L12L64
53564C09240Q62J562J588O11m99o80M3P58Q53M96Q2j74o3O56J776K479K089R80
53546C22659L71J029K470L543L675L197K721K527K582K733K745K457K057J958
53532C56724K292K716K916L019L394M152N048N713N887N547M975M634M835N612
53518D17464O876Q457J0025J1115J1488J1350J1190J1442J2163J2954J3334J3382
53506E51240J3758J4781J5830J6187J6252J7044J8652J9999K0358K0243K0429
$$ plain form
53495 744773 765682 787029 808895 831568 854922 878162 900504 921856 942755 963865 985565
53484 985565 1007691 1029622 1050898 1071725 1092579 1113359 1133365 1152173 1170173 1188118 1206470
53473 1206470 1225171 1243727 1261477 1278138 1294168 1310309 1326770 1343098 1358690 1373020 1385506
53462 1385506 1395837 1404468 1412235 1419289 1424889 1428369 1429714 1429050 1426192 1421057 1414076 1405802 1396471 1386177
53448 1386177 1375144 1363519 1351218 1338174 1324389 1309611 1293443 1276036 1258172 1240330 1222143
53437 1222143 1203139 1183615 1164319 1145587 1127239 1109034 1090788 1072353 1053959 1036463 1020839
53426 1020839 1007485 996260 986898 979043 972078 965440 959102 953490 948978 945622 943251 941572 940336
53413 940336 939635 939967 941854 945467 950708 957433 965443 974509 984503 995326 1006723 1018617 1031700 1047126
$$ packed form
53495G44773K0909K1347K1866K2673K3354K3240K2342K1352K0899K1110K1700
53484I85565K2126K1931K1276K0827K0854K0780K0006J8808J8000J7945J8352
53473A206470J8701J8556J7750J6661J6030J6141J6461J6328J5592J4330J2486
53462A385506J0331Q631P767P054N600L480J345o64k858n135o981q274r331j0294
53448A386177j1033j1625j2301j3044j3785j4778j6168j7407j7864j7842j8187
53437A222143j9004j9524j9296j8732j8348j8205j8246j8435j8394j7496j5624
53426A020839j3354j1225r362p855o965o638o338n612m512l356k371j679j236
53413I40336p01L32J887L613N241O725Q010R066R994J0823J1397J1894J3083J5426
$$ plain form
53399 1047126 1065298 1085383 1106365 1128094 1150947 1175030 1200379 1227567 1257290 1289361 1322729
53388 1322729 1356571 1391011 1426765 1464449 1504210 1545638 1587989 1630730 1673914 1717884 1762788
53377 1762788 1808530 1854976 1901888 1948745 1994898 2039836 2083218 2124851 2164792 2203143 2239509
53366 2239509 2273008 2303129 2330224 2354813 2376738 2395435 2410668 2422432 2430391 2434042 2433375 2428865
53354 2428865 2420813 2409147 2393845 2375135 2353254 2328315 2300406 2269577 2235838 2199455 2161145
53343 2161145 2121769 2081975 2042260 2002968 1963928 1924598 1885049 1846339 1809319 1773515 1737962
53332 1737962 1702751 1668751 1635919 1603016 1569173 1534908 1501341 1469283 1439354 1412139 1387612
53321 1387612 1364967 1343576 1323723 1305955 1290086 1275266 1260769 1246324 1231949 1217838 1204222
$$ packed form
53399A047126J8172K0085K0982K1729K2853K4083K5349K7188K9723L2071L3368
53388A322729L3842L4440L5754L7684L9761M1428M2351M2741M3184M3970M4904
53377A762788M5742M6446M6912M6857M6153M4938M3382M1633L9941L8351L6366
53366B239509L3499L0121K7095K4589K1925J8697J5233J1764P959L651o67m510
53354B428865q052j1666j5302j8710k1881k4939k7909l0829l3739l6383l8310
53343B161145l9376l9794l9715l9292l9040l9330l9549l8710l7020l5804l5553
53332A737962l5211l4000l2832l2903l3843l4265l3567l2058k9929k7215k4527
53321A387612k2645k1391j9853j7768j5869j4820j4497j4445j4375j4111j3616
$$ plain form
53310 1204222 1190935 1177330 1162998 1148460 1134788 1122543 1111433 1101087 1091867 1084644 1079780 1076595
53298 1076595 1074015 1071570 1069493 1068003 1067096 1067162 1069085 1073192 1078639 1084542 1091311 1100001 1110592 1121975
53284 1121975 1133641 1146375 1160932 1177035 1194183 1212587 1232560 1253549 1274608 1295538 1316858
53273 1316858 1338747 1360595 1381582 1401210 1419260 1435572 1449899 1461827 1470980 1477525 1482255 1485878
53261 1485878 1488424 1489617 1489561 1488596 1486597 1482900 1477009 1469030 1459392 1448410 1436177 1422636 1407729 1391656
53247 1391656 1374936 1357925 1340288 1321320 1300878 1279774 1259037 1239058 1219572 1200283 1181169
53236 1181169 1162265 1143501 1124847 1106427 1088316 1070367 1052442 1034785 1017916 1002063 986848
53225 986848 971727 956647 942136 928732 916382 904471 892416 880306 868932 859043 850530 842515
$$ packed form
53310A204222j3287j3605j4332j4538j3672j2245j1110j0346r220p223m864l185
53298A076595k580k445k077j490r07O6J923M107N447N903O769Q690J0591J1383
53284A121975J1666J2734J4557J6103J7148J8404J9973K0989K1059K0930K1320
53273A316858K1889K1848K0987J9628J8050J6312J4327J1928R153O545M730L623
53261A485878K546J193n6r65j999l697n891p979r638j0982j2233j3541j4907j6073
53247A391656j6720j7011j7637j8968k0442k1104k0737j9979j9486j9289j9114
53236A181169j8904j8764j8654j8420j8111j7949j7925j7657j6869j5853j5215
53225I86848j5121j5080j4511j3404j2350j1911j2055j2110j1374r889q513q015
$$ plain form
53213 842515 834288 825930 817883 810184 802378 794020 784927 775074 764612 753889 743097 731881 719745
53200 719745 706918 694343 682570 671066 659022 646572 634739 624223 614668 605234 595475 585331
53188 585331 574580 562810 550053 536951 523954 510710 496732 482489 469127 457031 445414
53177 445414 433669 422479 412989 405243 398145 390773 383089 375442 368010 360820 353774 346551 338926 331247
53163 331247 324177 317939 312245 306998 302446 298476 294405 289777 284908 280206 275418 270067 264427 259476
53149 259476 255875 253318 250939 248093 244652 240811 236828 232975 229537 226673 224240 221958 219842 218212
53135 218212 217147 216222 215105 214104 213697 213748 213720 213506 213420 213437 213145 212512 211994 211650 210833 209183 207349 206255
53117 206255 206086 206443 207104 208079 209245 210405 211600 212874 213892 214147 213570 212637 211957 211912 212464 213037 212805
$$ packed form
53213H42515q227q358q047p699p806q358r093r853j0462j0723j0792j1216j2136
53200G19745j2827j2575j1773j1504j2044j2450j1833j0516r555r434r759j0144
53188E85331j0751j1770j2757j3102j2997j3244j3978j4243j3362j2096j1617
53177D45414j1745j1190r490p746p098p372p684p647p432p190p046p223p625p679
53163C31247p070o238n694n247m552l970m071m628m869m702m788n351n640m951
53149B59476l601k557k379k846l441l841l983l853l438k864k433k282k116j630
53135B18212j065r25j117j001m07N1k8k14q6J7k92o33n18l44q17j650j834j094
53117B06255j69L57O61R75J166J160J195J274J018K55n77r33o80m5N52N73k32
$$ plain form
53100 212805 211453 209559 207964 206860 205741 204062 201631 198487 194788 190890 187264 184233 181797 179698
53086 179698 177596 175313 172948 170666 168352 165757 163000 160578 158727 157072 155127 152928 150940 149518
53072 149518 148619 147856 146789 145347 143958 142892 141585 139282 136428 134549 134272 134294 133041 130752 129007
53057 129007 128669 129225 129870 130152 129624 128023 126069 125159 125738 126688 126792 126193 125904 126312 126778 126490 125199 123217
53039 123217 121078 119203 117734 116720 116391 116882 117616 117435 115810 113598 112189 112062 112581 113054 113462 114046
53023 114046 114691 115029 115018 115135 115932 117396 118731 118917 117648 115721 114308 113834 113692 113020 111475 109262 106797
53006 106797 104674 103608 103902 104983 105899 106322 106669 107229 107672 107696 107604 107764 107895 107482 106717 106372 106725 107256
52988 107256 107464 107485 107725 108362 109412 110872 112529 114050 115460 117173 119315 121380 122844 123749 124385 124785
$$ packed form
53100B12805j352j894j595j104j119j679k431l144l699l898l626l031k436k099
53086A79698k102k283k365k282k314k595k757k422j851j655j945k199j988j422
53072A49518q99p63j067j442j389j066j307k303k854j879k77K2j253k289j745
53057A29007l38N56O45K82n28j601j954r10N79R50J04n99k89M08M66k88j291j982
53039A23217k139j875j469j014l29M91P34j81j625k212j409j27N19M73M08N84
53023A14046O45L38j1J17P97J464J335J86j269j927j413m74j42o72j545k213k465
53006A06797k123j066K94J081R16M23L47N60M43K4r2J60J31m13p65l45L53N31
52988A07256K08K1K40O37J050J460J657J521J410J713K142K065J464R05O36M00
$$ plain form
52972 124785 124911 125071 125768 127247 129444 132085 134662 136760 138755 141776 146449 152026 157264 161804 165987
52957 165987 169640 171943 172609 172421 172355 172690 173195 173643 173873 173765 173485 173452 173755 173827 172995 171187 168916 166725
52939 166725 164873 163409 162235 161103 159755 158226 157000 156661 157282 158202 158640 158503 158355 158584 158934 158986 158679
52922 158679 158181 157667 157512 158260 159859 161318 161661 160980 159998 158980 157784 156708 156347 156549 156408 155506 154487
52905 154487 154156 154683 155893 157646 159557 161009 161874 162700 163758 164516 164551 164438 165072 166467 167901 169012
52889 169012 170086 171414 172933 174500 176008 177304 178369 179516 180975 182393 183181 183249 182941 182341 181258
52874 181258 179975 179298 179581 180216 180463 180387 180495 180832 180985 180862 180879 181292 181873 182489 183452 184891 186099 186150 185138
52855 185138 184212 184228 184838 185213 185194 185262 185746 186701 188407 191262 195028 198769 201803 204324 206881 209676 212680
$$ packed form
52972A24785J26J60O97J479K197K641K577K098J995L021M673N577N238M540M183
52957A65987L653K303O66j88o6L35N05M48K30j08k80l3L03P2q32j808k271k191
52939A66725j852j464j174j132j348j529j226l39O21R20M38j37j48K29L50N2l07
52922A58679m98n14j55P48J599J459L43o81r82j018j196j076l61K02j41r02j019
52905A54487l31N27J210J753J911J452Q65Q26J058P58L5j13O34J395J434J111
52889A69012J074J328J519J567J508J296J065J147J459J418P88O8l08o00j083
52874A81258j283o77K83O35K47p6J08L37J53j23J7M13N81O16R63J439J208N1j012
52855A85138r26J6O10L75j9O8M84R55J706K855L766L741L034K521K557K795L004
$$ plain form
52838 212680 215976 219528 222835 225232 226442 226602 225944 224806 223762 223250 223013 222238 220310 217266 213569
52823 213569 209741 206204 203183 200627 198378 196391 194654 192977 191119 189092 187057 184909 182321 179312
52809 179312 176444 174251 172666 171262 169846 168457 166898 164714 161880 159233 157854 157970 158663 158739 157700
52794 157700 155847 153696 151619 149907 148784 148215 147897 147564 147148 146567 145642 144385 143208 142526 142212 141600
52778 141600 140022 137255 133660 130141 127760 126953 127018 126694 125406 123755 122684 122422 122410 122028 121081 119706
52762 119706 118159 116709 115440 114026 111941 109148 106345 104243 102702 100973 98810 96925 96048 95835 95159
52747 95159 93393 91039 89028 87779 87075 86563 86087 85661 85356 85179 84988 84528 83629 82267 80475 78411 76596
52730 76596 75781 76251 77333 77893 77344 76036 74689 73681 72919 72192 71507 71122 71304 72044 72988 73700 73980 73955
$$ packed form
52838B12680L296L552L307K397J210J60o58j138j044n12k37p75j928l044l697
52823B13569l828l537l021k556k249j987j737j677j858k027k035k148k588l009
52809A79312k868k193j585j404j416j389j559k184k834k647j379J16O93P6j039
52794A57700j853k151k077j712j123n69l18l33m16n81r25j257j177o82l14o12
52778A41600j578k767l595l519k381q07O5l24j288j651j071k62j2l82r47j375
52762A19706j547j450j269j414k085k793k803k102j541j729k163j885q77k13o76
52747I5159j766k354k011j249p04n12m76m26l05j77j91m60q99j362j792k064j815
52730G6596q15M70J082N60n49j308j347j008p62p27o85l85J82P40R44P12K80k5
$$ plain form
52712 73955 73893 73981 74190 74294 74079 73568 73022 72686 72695 73226 74502 76438 78440 79876 80762 81768 83559 86233
52694 86233 89362 92326 94629 96174 97336 98593 100035 101341 102273 102935 103425 103492 102737 101136 99169 97484
52678 97484 96509 96288 96537 96854 97012 97071 97144 97059 96335 94522 91616 88177 85011 82582 80617 78383 75516
52661 75516 72561 70525 69860 70003 69955 69195 67920 66593 65567 65130 65535 66685 67952 68667 68789 68867 69302
52644 69302 69955 70544 71059 71539 71756 71535 71147 71022 71170 71366 71810 72994 74773 76167 76462 76035 75658 75391
52626 75391 74741 73669 72745 72301 72039 71617 71141 70857 70741 70655 70651 70837 71152 71461 71731 71968 72133 72279 72552 72968
52606 72968 73385 73824 74543 75596 76627 77389 78174 79346 80630 81342 81291 81053 81309 82248 83628 85069 86155
52589 86155 86549 86305 85959 86180 87226 88708 89804 89905 89175 88380 88030 87906 87688 87714 88585 90158 91555 92292
$$ packed form
52712G3955o2Q8K09J04k15n11n46l36RN31J276J936K002J436Q86J006J791K674
52694H6233L129K964K303J545J162J257J442J306R32O62M90O7p55j601j967j685
52678I7484r75k21K49L17J58N9P3q5p24j813k906l439l166k429j965k234k867
52661G5516k955k036o65J43m8p60j275j327j026m37M05J150J267P15J22P8M35
52644F9302O53N89N15M80K17k21l88j25J48J96M44J184J779J394K95m27l77k67
52626G5391o50j072r24m44k62m22m76k84j16q6mJ86L15L09K70K37J65J46K73M16
52606G2968M17M39P19J053J031P62P85J172J284P12n1k38K56R39J380J441J086
52589H6155L94k44l46K21J046J482J096J01p30p95l50j24k18K6Q71J573J397P37
$$ plain form
52571 92292 92847 93875 95382 96972 98535 100262 102183 103998 105328 105998 106285 106865 108200 109916 111220
52556 111220 111993 112952 114490 116038 116994 117686 118771 120168 121382 122506 124040 125880 127383 128446 129610
52541 129610 130950 131785 131836 131869 132623 133749 134444 134704 135237 136335 137516 138275 138719 139352 140527 142154 143739
52524 143739 144733 145027 145068 145347 145877 146387 146845 147436 148121 148593 148784 149043 149613 150150 150008 148958 147448 146172
52506 146172 145486 145241 145084 144835 144627 144746 145304 145965 146030 144976 143066 141319 140646 140987 141425 141203 140445 139837
52488 139837 139813 140218 140638 140810 140738 140612 140735 141361 142478 143822 145210 146828 148964 151393 153224 153618 152673
52471 152673 151418 150872 151233 151968 152525 152780 152964 153346 153954 154546 154906 155139 155523 156057 156449 156665 157105 157894
52453 157894 158366 157783 156470 155682 156222 157595 158719 159106 159129 159367 159978 160641 160945 160852 160815 161332 162338 163157
$$ packed form
52571I2292N55J028J507J590J563J727J921J815J330O70K87N80J335J716J304
52556A11220P73R59J538J548R56O92J085J397J214J124J534J840J503J063J164
52541A29610J340Q35N1L3P54J126O95K60N33J098J181P59M44O33J175J627J585
52524A43739R94K94M1K79N30N10M58N91O85M72J91K59N70N37j42j050j510j276
52506A46172o86k45j57k49k08J19N58O61O5j054j910j747o73L41M38k22p58o08
52488A39837k4M05M20J72p2j26J23O26J117J344J388J618K136K429J831L94r45
52471A52673j255n46L61P35N57K55J84L82O08N92L60K33L84N34L92K16M40P89
52453A57894M72n83j313p88N40J373J124L87K3K38O11O63L04r3l7N17J006Q19
$$ plain form
52435 163157 163119 162161 160863 159974 159847 160135 160116 159528 158995 159335 160488 161529 161834 161786 162090 162769 163224 163104 162657
52416 162657 162187 161556 160460 159062 158016 157755 157951 157870 157178 156080 154720 152938 150886 149437 149440 150695 152086
52399 152086 152691 152386 151540 150615 150051 150041 150317 150572 151049 152210 153793 154845 154876 154452 154437 155166 156632 158811
52381 158811 161379 163597 165038 166112 167434 168994 170377 171454 172342 172983 173268 173409 173725 174218 174744 175395
52365 175395 176305 177293 178178 179219 180731 182438 183815 184947 186477 188741 191537 194708 198301 202041 205309
52350 205309 207895 210291 212940 215627 217918 219815 221655 223558 225338 226849 228185 229590 231289 233361
52336 233361 235755 238474 241659 245267 248776 251552 253566 255398 257441 259439 261002 262217 263475 264948
52322 264948 266634 268771 271801 275853 280547 285477 290687 296446 302626 308555 313644 317993 322209 326704
$$ packed form
52435A63157l8r58j298q89j27K88j9n88n33L40J153J041L05m8L04O79M55j20m47
52416A62657m70o31j096j398j046k61J96q1o92j098j360j782k052j449LJ255J391
52399A52086O05l05q46r25n64j0K76K55M77J161J583J052L1m24j5P29J466K179
52381A58811K568K218J441J074J322J560J383J077Q88O41K85J41L16M93N26O51
52365A75395R10R88Q85J041J512J707J377J132J530K264K796L171L593L740L268
52350B05309K586K396K649K687K291J897J840J903J780J511J336J405J699K072
52336B33361K394K719L185L608L509K776K014J832K043J998J563J215J258J473
52322B64948J686K137L030M052M694M930N210N759O180N929N089M349M216M495
$$ plain form
52308 326704 331503 336693 342614 349357 356465 363526 370895 379413 389467 400668 412391 424228 435949
52295 435949 447466 458975 470873 483423 496699 510841 525978 541796 557560 572787 587690
52284 587690 602750 618112 633609 649218 665154 681518 698008 714073 729326 743820 757883
52273 757883 771669 785009 797725 809899 821554 832272 841514 849263 856002 862020 867126 871091 873946
52260 873946 875685 876131 875393 874126 873029 872253 871546 870708 869636 868132 866124 863986 862332 861498 861440 862086
52244 862086 863450 865419 867664 869922 872223 874863 878345 883354 890493 899785 910459 921445 932165
52231 932165 942834 953983 965801 977989 990147 1002022 1013352 1023747 1032969 1041200 1048767 1055737
52219 1055737 1062045 1067819 1073029 1076882 1078203 1076732 1073579 1070017 1066168 1061294 1054969 1047393 1038775 1029176
$$ packed form
52308C26704M799N190N921O743P108P061P369Q518J0054J1201J1723J1837J1721
52295D35949J1517J1509J1898J2550J3276J4142J5137J5818J5764J5227J4903
52284E87690J5060J5362J5497J5609J5936J6364J6490J6065J5253J4494J4063
52273G57883J3786J3340J2716J2174J1655J0718R242P749O739O018N106L965K855
52260H73946J739M46p38j267j097p76p07q38j072j504k008k138j654q34n8O46
52244H62086J364J969K245K258K301K640L482N009P139R292J0674J0986J0720
52231I32165J0669J1149J1818J2188J2158J1875J1330J0395R222Q231P567O970
52219A055737O308N774N210L853J321j471l153l562l849m874o325p576q618r599
$$ plain form
52205 1029176 1018976 1008815 998806 988382 977273 966183 956000 946651 937271 927417 917561 908362
52193 908362 899979 892326 885570 879902 874977 870013 864545 858928 854006 850386 848039 846471 845178 843946
52179 843946 842739 841387 839572 837197 834571 831980 829224 825886 822027 818255 815054 812413 810192 808367
52165 808367 806605 804033 800019 795016 790145 785978 782160 778202 774143 770313 766904 763969 761498 759218
52151 759218 756638 753562 750345 747422 744814 742359 740191 738577 737418 736233 734645 732568 729986 726887
52137 726887 723460 720038 716768 713566 710502 707870 705711 703549 700846 697530 693807 689693 685123 680361
52123 680361 675859 671727 667812 664365 662081 661124 660634 659708 658633 658508 659704 661328 662307 662544 662808 663962
52107 663962 666631 671140 677256 684109 690840 697393 704511 713029 723374 735576 749381 764335 780116
$$ packed form
52205A029176j0200j0161j0009j0424j1109j1090j0183r349r380r854r856r199
52193I08362q383p653o756n668m925m964n468n617m922l620k347j568j293j232
52179H43946j207j352j815k375k626k591k756l338l859l772l201k641k221j825
52165H08367j762k572m014n003m871m167l818l958m059l830l409k935k471k280
52151G59218k580l076l217k923k608k455k168j614j159j185j588k077k582l099
52137G26887l427l422l270l202l064k632k159k162k703l316l723m114m570m762
52123F80361m502m132l915l447k284r57m90r26j075j25J196J624R79K37K64J154
52107F63962K669M509O116O853O731O553P118Q518J0345J2202J3805J4954J5781
$$ [...]
##END NTUPLES=NMR SPECTRUM
##END=
