
##TITLE=AC1271_CMOAH12089_6666151_nOufhXHdrs
##JCAMPDX= 6.0         $$ Bruker NMR JCAMP-DX V2.0
##DATA TYPE= NMR SPECTRUM
##DATA CLASS= NTUPLES
##ORIGIN= BRUKER
##OWNER= Administrator
$$ 1.72 TOPSPIN		Version 2.1
$$ 2012-08-13 17:02:05.343 -0500  Administrator@TOPSPIN
$$ Compression mode = diff/dup
##.OBSERVE FREQUENCY= 400.02188249412
##.OBSERVE NUCLEUS= ^1H
##.ACQUISITION MODE= SIMULTANEOUS (DQD)
##.ACQUISITION SCHEME= undefined
##.AVERAGES= 64
##.DIGITISER RES= 22
##SPECTROMETER/DATA SYSTEM= spect
##.PULSE SEQUENCE= noesygpps1d.comp
##.SOLVENT NAME= COFFEE_meoh
##.SHIFT REFERENCE= INTERNAL, COFFEE_meoh, 1, 14.96253
##AUDIT TRAIL= $$ (NUMBER, WHEN, WHO, WHERE, PROCESS, VERSION, WHAT)
$$ ##TITLE= Audit trail, TOPSPIN		Version 2.1
$$ ##JCAMPDX= 5.01
$$ ##ORIGIN= Bruker BioSpin GmbH
$$ ##OWNER= Administrator
$$ $$ C:\Bruker\TOPSPIN/data/COFFEE/nmr/AC1271_CMOAH12089_6666151_nOufhXHdrs/12/pdata/1/auditp.txt
$$ ##AUDIT TRAIL=  $$ (NUMBER, WHEN, WHO, WHERE, PROCESS, VERSION, WHAT)
(   1,<2012-08-13 17:01:31.984 -0500>,<Administrator>,<TOPSPIN>,<go>,<TOPSPIN 2.1>,
      <created by zg
	started at 2012-08-13 16:49:59.015 -0500,
	POWCHK enabled, PULCHK disabled,
       configuration hash MD5:
       6B 1B 68 BB D9 2E 58 E2 7F 35 AD 54 07 DF 0E 41
       data hash MD5: 64K
       87 DE 5D F5 CC C3 2D 92 3B AF 58 9C 23 E7 3D 2D>)
(   2,<2012-08-13 17:01:54.890 -0500>,<Administrator>,<TOPSPIN>,<proc1d>,<TOPSPIN 2.1>,
      <Start of raw data processing
       efp LB = 0.3 FT_mod = 6 PKNL = 1 PHC0 = 0 PHC1 = 0 SI = 128K 
       data hash MD5: 128K
       F5 8E 37 E5 45 79 62 60 26 43 E1 AA 48 A3 19 C2>)
(   3,<2012-08-13 17:01:57.937 -0500>,<Administrator>,<TOPSPIN>,<proc1d>,<TOPSPIN 2.1>,
      <pk PHC0 = 4.471436 PHC1 = 0 
       data hash MD5: 128K
       A1 88 8D 58 83 CB 4D AC 59 C3 68 4F D7 84 96 92>)
(   4,<2012-08-13 17:02:01.906 -0500>,<Administrator>,<TOPSPIN>,<proc1d>,<TOPSPIN 2.1>,
      <abs ABSG = 1 
       data hash MD5: 128K
       5F C5 4E 02 16 70 D8 A2 89 FD FA AC C8 EC 27 C1>)
(   5,<2012-08-13 17:02:02.421 -0500>,<Administrator>,<TOPSPIN>,<proc1d>,<TOPSPIN 2.1>,
      <abs ABSG = 2 
       data hash MD5: 128K
       4B F0 5A 10 C9 02 8F 09 3C 2F F4 C1 3A 6B FE DD>)
(   6,<2012-08-13 17:02:03.031 -0500>,<Administrator>,<TOPSPIN>,<proc1d>,<TOPSPIN 2.1>,
      <abs ABSG = 3 
       data hash MD5: 128K
       67 CD 78 C4 70 B0 CC 1B AD C1 79 15 53 D0 22 88>)
(   7,<2012-08-13 17:02:03.468 -0500>,<Administrator>,<TOPSPIN>,<proc1d>,<TOPSPIN 2.1>,
      <abs ABSG = 4 
       data hash MD5: 128K
       56 AC D5 04 08 B9 5E EC 54 78 74 89 66 21 BF A3>)
(   8,<2012-08-13 17:02:03.921 -0500>,<Administrator>,<TOPSPIN>,<proc1d>,<TOPSPIN 2.1>,
      <abs ABSG = 5 
       data hash MD5: 128K
       DB E6 2E DD AD 0C D7 07 00 51 94 96 89 16 C4 B9>)
$$ ##END=
$$ 
$$ $$ hash MD5
$$ $$ 16 53 1F 33 64 9C FD 1F D1 18 B0 94 04 4E 0F B9
##$RELAX= 
##$RELAX= 
##$RELAX= 
##$RELAX= 
##$RELAX= 
##$RELAX= 
##$RELAX= 
##$RELAX= 
$$ Bruker specific parameters
$$ [...]
##$TP07= 0
##$TPNAME0= <>
##$TPNAME1= <>
##$TPNAME2= <>
##$TPNAME3= <>
##$TPNAME4= <>
##$TPNAME5= <>
##$TPNAME6= <>
##$TPNAME7= <>
##$TPOAL= (0..7)
0.5 0.5 0.5 0.5 0.5 0.5 0.5 0.5
##$TPOFFS= (0..7)
0 0 0 0 0 0 0 0
##$TUNHIN= 0
##$TUNHOUT= 0
##$TUNXOUT= 0
##$USERA1= <user>
##$USERA2= <user>
##$USERA3= <user>
##$USERA4= <user>
##$USERA5= <user>
##$V9= 5
##$VALIST= <valist>
##$VCLIST= <CCCCCCCCCCCCCCC>
##$VD= 0
##$VDLIST= <DDDDDDDDDDDDDDD>
##$VPLIST= <PPPPPPPPPPPPPPP>
##$VTLIST= <TTTTTTTTTTTTTTT>
##$WBST= 1024
##$WBSW= 4
##$XGAIN= (0..3)
0 0 0 0
##$XL= 0
##$YL= 0
##$YMAX_a= 17684971
##$YMIN_a= -10249137
##$ZGOPTNS= <>
##$ZL1= 120
##$ZL2= 120
##$ZL3= 120
##$ZL4= 120
##$ABSF1= 14.96253
##$ABSF2= -5.595652
##$ABSG= 5
##$ABSL= 3
##$ALPHA= 0
##$AQORDER= 0
##$ASSFAC= 0
##$ASSFACI= 0
##$ASSFACX= 0
##$ASSWID= 0
##$AUNMP= <proc_prof1d_extract.lims>
##$AXLEFT= 0
##$AXNAME= <>
##$AXNUC= <1H>
##$AXRIGHT= 0
##$AXTYPE= 0
##$AXUNIT= <>
##$AZFE= 0.1
##$AZFW= 0.1
##$BCFW= 0
##$BC_mod= 0
##$BYTORDP= 0
##$COROFFS= 0
##$CY= 15
##$DATMOD= 1
##$DC= 0
##$DFILT= <>
##$DTYPP= 0
##$F1P= 0
##$F2P= 0
##$FCOR= 0.5
##$FTSIZE= 131072
##$FT_mod= 6
##$GAMMA= 0
##$GB= 0
##$INTBC= 1
##$INTSCL= 1
##$ISEN= 128
##$LB= 0.3
##$LEV0= 0
##$LPBIN= 0
##$MAXI= 10000
##$MC2= 0
##$MEAN= 0
##$ME_mod= 0
##$MI= 0
##$NCOEF= 0
##$NC_proc= -2
##$NLEV= 6
##$NOISF1= 0
##$NOISF2= 0
##$NSP= 0
##$NTH_PI= 0
##$NZP= 0
##$OFFSET= 14.96253
##$PC= 1
##$PHC0= 4.471436
##$PHC1= 0
##$PH_mod= 1
##$PKNL= yes
##$PPARMOD= 0
##$PPDIAG= 0
##$PPIPTYP= 0
##$PPMPNUM= 2147483647
##$PPRESOL= 1
##$PSCAL= 4
##$PSIGN= 0
##$PYNMP= <proc.py>
##$REVERSE= no
##$SF= 400.020009024022
##$SI= 131072
##$SIGF1= 0
##$SIGF2= 0
##$SINO= 400
##$SIOLD= 131072
##$SPECTYP= <>
##$SREGLST= <1H.CDCl3>
##$SSB= 0
##$STSI= 131072
##$STSR= 0
##$SW_p= 8223.68421052631
##$SYMM= 0
##$S_DEV= 0
##$TDeff= 65536
##$TDoff= 0
##$TI= <>
##$TILT= no
##$TM1= 0
##$TM2= 0
##$TOPLEV= 0
##$USERP1= <user>
##$USERP2= <user>
##$USERP3= <user>
##$USERP4= <user>
##$USERP5= <user>
##$WDW= 1
##$XDIM= 131072
##$YMAX_p= 474895441
##$YMIN_p= -23712
##$CURPLOT= <Network HP LaserJet P1505>
##$CURPRIN= <$Network HP LaserJet P1505>
##$DFORMAT= <normdp>
##$LAYOUT= <+/1D_H.xwp>
##$LFORMAT= <normlp>
##$PFORMAT= <normpl>
##$SURQMSG= 1
$$ End of Bruker specific parameters
$$ ---------------------------------
##NTUPLES= NMR SPECTRUM
##VAR_NAME=  FREQUENCY,     SPECTRUM/REAL,   SPECTRUM/IMAG
##SYMBOL=    X,             R,               I
##VAR_TYPE=  INDEPENDENT,   DEPENDENT,       DEPENDENT
##VAR_FORM=  AFFN,          ASDF,            ASDF
##VAR_DIM=   131072,        131072,          131072
##UNITS=     HZ,            ARBITRARY UNITS, ARBITRARY UNITS
##FACTOR=    0.0627417313425164, 1,          1
##FIRST=     8223.62146879497, -3777,        -70206
##LAST=      0,             -1993,           -71257
##MIN=       0,             -23712,          0
##MAX=       8223.62146879497, 474895441,    0
$$ Real data points
##PAGE= N=1
##DATA TABLE= (X++(R..R)), XYDATA
$$ [...]
63198A132700m7372m8786m8465m7321m5234m1834l7549l3164k8853k4424j9877
63187G09821j5258j0493n953k445o6K252N348Q636J0998J2308J3345J4625J6084
63174G59202J7504J8610J9078J8992J8841J8738J8200J7229J6715J7114J7429
63163I57652J6424J4200J1627Q819N197P51l920q584j3442j8231k2210k5071k7141
63150H96071k8608k9183k8657k7298k5654k4220k3119k1826j9545j6275j3133
63139F38553j1142j0110r296q643q581q879q612p291n340l416j802n55K22M19
63125E55527J07k79J3J364L029L692L070K371K729L856M765N176N406N526N438
63110F01790N438N840O331O489O594P134P859Q125P939P763P528O701N267L789
$$ y = [1132700, 1085328, 1036542, 988077, 940756, 895522, 853688, 816139, 782975, 754122, 729698, 709821, 694563, 684070, 678117, 675672, 675606, 677858, 683206, 691842, 702840, 715148, 728493, 743118, 759202, 776706, 795316, 814394, 833386, 852227, 870965, 889165, 906394, 923109, 940223, 957652, 974076, 988276, 999903, 1008722, 1013919, 1014670, 1010750, 1002166, 988724, 970493, 948283, 923212, 896071, 867463, 838280, 809623, 782325, 756671, 732451, 709332, 687506, 667961, 651686, 638553, 627411, 617301, 608005, 599362, 590781, 581902, 573290, 565999, 560659, 557243, 555441, 554886, 555108, 555527, 555634, 555355, 555368, 556732, 559761, 563453, 566523, 568894, 571623, 575479, 580244, 585420, 590826, 596352, 601790, 607228, 613068, 619399, 625888, 632482, 639616, 647475, 655600, 663539, 671302, 678830, 685531, 690798, 694587]
63096F94587K548J396M09q0j61l28p51j082j034o34M2Q19J306J274J089J212J532
63079G02144J784K308L604N392O886P883Q802R715J0274J0561J1151J2125J2824
63066H05453J2826J2557J2664J3392J4777J6902J9696K2796K5859K8780L1625
63055A017327L4567L7769M1086M4155M7076N0573N4908N9125O2161O4334O6740
63044A579821O9427P1282P1768P1518P0869O9029O5488O1416N8680N7830N7835
63033B304963N7670N7447N7809N8698N9175N8323N5935N1985M5712L5886K2258
63022B865861O143j0745k7596m4180n9827p3533q4823r3695r9840j02668j02149
63011B172948r8980r3871q7234p9463p0972o1960n2626m3541l5194k7319j9339
$$ y = [694587, 697135, 698531, 698940, 698860, 698699, 698371, 697620, 696538, 695504, 694870, 694912, 695731, 697037, 698311, 699400, 700612, 702144, 703928, 706236, 709840, 715232, 722118, 730001, 738803, 748518, 758792, 769353, 780504, 792629, 805453, 818279, 830836, 843500, 856892, 871669, 888571, 908267, 931063, 956922, 985702, 1017327, 1051894, 1089663, 1130749, 1174904, 1221980, 1272553, 1327461, 1386586, 1448747, 1513081, 1579821, 1649248, 1720530, 1792298, 1863816, 1934685, 2003714, 2069202, 2130618, 2189298, 2247128, 2304963, 2362633, 2420080, 2477889, 2536587, 2595762, 2654085, 2710020, 2762005, 2807717, 2843603, 2865861, 2872004, 2861259, 2833663, 2789483, 2729656, 2656123, 2571300, 2477605, 2377765, 2275097, 2172948, 2073968, 1980097, 1892863, 1813400, 1742428, 1680468, 1627842, 1584301, 1549107, 1521788, 1502449]
63000A502449j1397m224J998P859J3660J8879K2925K5843K8006K9636L0788L1442
62988A697864L1491L0982L0292K9646K8623K6753K4430K2353K0116J6294J0220
62977A969064K720n172j3405k2221l1102l9117m5971n2055n7651o2496o5968o7454
62965A509172o6766o4491o1657n8793n5568n1478m6627m1610l6907l2686k8939
62954I63650k5569k2481j9729j7415j5459j3643j2003j0821j0145r626q997q463
62942G89299q414q927r652j0109j0077r736r397r046q379p430o815o961p398p353
62928F69605o821o489o673o942o840o351n589m616l756l516l914m308m163l648
62914E95979l305l388l757m127m241l969l411k785k262j980k038k220j978j050
$$ y = [1502449, 1491052, 1486828, 1488826, 1496685, 1510345, 1529224, 1552149, 1577992, 1605998, 1635634, 1666422, 1697864, 1729355, 1760337, 1790629, 1820275, 1848898, 1875651, 1900081, 1922434, 1942550, 1958844, 1969064, 1971784, 1966612, 1953207, 1930986, 1899884, 1860767, 1814796, 1762741, 1705090, 1642594, 1576626, 1509172, 1442406, 1377915, 1316258, 1257465, 1201897, 1150419, 1103792, 1062182, 1025275, 992589, 963650, 938081, 915600, 895871, 878456, 862997, 849354, 837351, 826530, 816385, 806759, 797762, 789299, 780885, 771958, 762306, 752197, 742120, 732384, 722987, 713941, 705562, 698132, 691317, 684356, 676958, 669605, 662784, 656295, 649622, 642680, 635840, 629489, 623900, 619284, 615528, 612012, 608098, 603790, 599627, 595979, 592674, 589286, 585529, 581402, 577161, 573192, 569781, 566996, 564734, 562754, 560716, 558496, 556518, 555468]
62900E55468P5P76J136J586J941J547L90p59j483k277l575m902n439n077m316
62885E35091l501k644j833j345j324j643k090k511k704k393j508m71M4k00o25
62870E10343n20J0J72l19p26k75Q11J673J842J489R95P23R13J332J224J53j380
62853E18460k521k937k775k170j407j088j483j973j851j372j265j550j617j227
62839D93224p05k54R6J10k96n81l12r8p99k070k775k686k615k842k702j932j220
62822D71543j037j040r54j039j225q44K09R95P67j8m95m45o5N70J258J534J330
62805D71044J298K022L370M881O245P185P508P625Q270R477J0516J1123J1951
62792E62515J3396J4953J6214J7643J9581K1409K2572K3829K6467L0570L4950
$$ y = [555468, 555543, 556319, 557455, 559041, 560982, 562529, 562919, 562160, 560677, 558400, 554825, 549923, 544484, 539407, 535091, 531590, 528946, 527113, 525768, 524444, 522801, 520711, 518200, 515496, 513103, 511595, 511124, 511168, 510968, 510343, 509823, 509833, 510005, 509686, 508960, 508685, 509496, 511169, 513011, 514500, 515495, 516218, 517131, 518463, 519687, 519840, 518460, 515939, 513002, 510227, 508057, 506650, 505562, 504079, 502106, 500255, 498883, 497618, 496068, 494451, 493224, 492519, 492265, 492361, 492471, 492175, 491594, 491282, 491184, 490385, 488315, 485540, 482854, 480239, 477397, 474695, 472763, 471543, 470506, 469466, 468512, 467473, 466248, 465404, 465613, 466608, 467375, 467357, 466862, 466417, 466352, 466922, 468180, 469714, 471044, 472342, 474364, 477734, 482615, 488860, 496045, 503553, 511178, 519448, 528925, 539441, 550564, 562515, 575911, 590864, 607078, 624721, 644302, 665711, 688283, 712112, 738579, 769149, 804099]
62781H04099L8638M1802M5299M9888N5744O2349O8950P5344Q1990Q9202R6635
62770A509940J03780J10405J16201J20458J22510J22081J18866J12277J01925
62761B538443Q7996P0878N0921K8935O358j5481l5981n4916p2001q6981r9663
62750B418508j09545j16030j19238j19990j18755j15407j10308j04672r9225r3362
62740A311976q6369p8788p1731o5473n9580n3913m8643m3617l8627l4056l0502
62729G00677k7861k5417k2783k0177j7913j6087j4661j3463j2229j0888r595q288
62717E01315o658m821l489k998k661j520N51K918M938O339P274Q342J0051J2097
62703E31678J3768J5250J7595K0953K4012K5876K7567L0546L4616L8496M1806
$$ y = [804099, 842737, 884539, 929838, 979726, 1035470, 1097819, 1166769, 1242113, 1324103, 1413305, 1509940, 1613720, 1724125, 1840326, 1960784, 2083294, 2205375, 2324241, 2436518, 2538443, 2626439, 2697317, 2748238, 2777173, 2783531, 2768050, 2732069, 2677153, 2605152, 2518171, 2418508, 2308963, 2192933, 2073695, 1953705, 1834950, 1719543, 1609235, 1504563, 1405338, 1311976, 1225607, 1146819, 1075088, 1009615, 950035, 896122, 847479, 803862, 765235, 731179, 700677, 672816, 647399, 624616, 604439, 586526, 570439, 555778, 542315, 530086, 519198, 509603, 501315, 494657, 489836, 486347, 483349, 480688, 479168, 479719, 482637, 487575, 493914, 501188, 509530, 519581, 531678, 545446, 560696, 578291, 599244, 623256, 649132, 676699, 707245, 741861, 780357, 822163]
62692H22163M5260M9241N3478N7917O2617O6871O9533P0329O9768O7781O3458
62681A498416N6369M7184L6667K4916J1962j530j4659k6899l8029m7796n5945
62670A490656o2310o6770o9284o9988o9086o6739o3327n9574n5980n2349m8286
62659H06963m4026m0208l6993l3889l0467k6826k3410k0691j8914j7758j6486
62648D97295j4775j3148j2154j1442j0337r031q461q978r823j0035r333q035o620
62635C65123n522m981m838m725m505m335m351m461m408l866k707j367o05o53q21
62620C12978l91M33Q62N46j16m41L8J291K598L048K631K475L511N337O889P799
62604C49488Q421Q962R372R881J0793J1942J3106J4715J7329K0505K3176K5195
$$ y = [822163, 867423, 916664, 970142, 1028059, 1090676, 1157547, 1227080, 1297409, 1367177, 1434958, 1498416, 1554785, 1601969, 1638636, 1663552, 1675514, 1673984, 1659325, 1632426, 1594397, 1546601, 1490656, 1428346, 1361576, 1292292, 1222304, 1153218, 1086479, 1023152, 963578, 907598, 855249, 806963, 762937, 722729, 685736, 651847, 621380, 594554, 571144, 550453, 531539, 513781, 497295, 482520, 469372, 457218, 445776, 435439, 426408, 417947, 408969, 399146, 389111, 379778, 371743, 365123, 359601, 354620, 349782, 345057, 340552, 336217, 331866, 327405, 322997, 319131, 316424, 315057, 314452, 313799, 312978, 312587, 313020, 313882, 314428, 314312, 313871, 313909, 315200, 317798, 320846, 323477, 325952, 329463, 334800, 341689, 349488, 357909, 366871, 376243, 386124, 396917, 408859, 421965, 436680, 454009, 474514, 497690, 522885]
62592E22885K7643L1348L5913M0471M4739M8950N3228N7382O1036O3731O5093
62581A052419O4946O3082N9118N2871M4715L5153K4322J2389J94j1279k1860l1906
62569A344164m1073m8228n2711n4938n5549n4712n2592m9840m7111m4483m1701
62558H01226l8703l5645l2711l0147k8133k6504k4851k3111k1692k0866k0409
62547D98454j9927j9179j7913j5942j3663j1990j1291j0720r181o835n044m728
62535C52041n257n268m222k786j765j171m60O34J875K957L786M334M546M512M510
62520C58266M820N601O983Q908J0979J2702J4010J5257J6683J8271K0175K2785
62508E15440K6150K9702L2778L5170L7032L8511L9577L9892L8858L6126L2038
$$ y = [522885, 550528, 581876, 617789, 658260, 702999, 751949, 805177, 862559, 923595, 987326, 1052419, 1117365, 1180447, 1239565, 1292436, 1337151, 1372304, 1396626, 1409015, 1409209, 1397930, 1376070, 1344164, 1303091, 1254863, 1202152, 1147214, 1091665, 1036953, 984361, 934521, 887410, 842927, 801226, 762523, 726878, 694167, 664020, 635887, 609383, 584532, 561421, 539729, 518863, 498454, 478527, 459348, 441435, 425493, 411830, 399840, 388549, 377829, 368648, 361813, 356769, 352041, 346784, 341516, 337294, 334508, 332743, 331572, 331112, 331746, 333621, 336578, 340364, 344698, 349244, 353756, 358266, 363086, 368687, 375670, 384578, 395557, 408259, 422269, 437526, 454209, 472480, 492655, 515440, 541590, 571292, 604070, 639240, 676272, 714783, 754360, 794252, 833110, 869236, 901274]
62497I01274K7237K1909J5937R528K992m010j1940k0079k6747l1161l4047l6058
62485H14835l6775l5878l4180l2631l1041k8748k5798k2677j9545j6558j4176
62474E16828j2374j0278p501n090m086l879l129j726n97m4M48J113J817K779M191
62459D78472N353N425M869M981O113P454Q464R294R873R813R349R265R720J0113
62445E88558J0129R879R032O912L629R0l319o942j0665j3637j5532j7030j8643
62432E42461j9868j9988j8937j7071j4753j2501j0830r665q448o979n518m115
62420C93788k536r28K98J262K509L984N012N460O022P205Q732J0167J1268J1715
62406D63958J1314J0613J0362J0282R374P596O056N238M199K091n99l001n031
$$ y = [901274, 928511, 950420, 966357, 975885, 978877, 974867, 962927, 942848, 916101, 884940, 850893, 814835, 778060, 742182, 708002, 675371, 644330, 615582, 589784, 567107, 547562, 531004, 516828, 504454, 494176, 486675, 481585, 477499, 473620, 470491, 468765, 468168, 468124, 468572, 469685, 471502, 474281, 478472, 483825, 489250, 494119, 499100, 505213, 512667, 521131, 530425, 540298, 550111, 559460, 568725, 578445, 588558, 598687, 608566, 617598, 624510, 628139, 628229, 624910, 617968, 607303, 593666, 578134, 561104, 542461, 522593, 502605, 483668, 466597, 451844, 439343, 428513, 418848, 410400, 403421, 397903, 393788, 391252, 390324, 390622, 391884, 394393, 398377, 403389, 408849, 414871, 422076, 430808, 440975, 452243, 463958, 475272, 485885, 496247, 506529, 515903, 523499, 529555, 534793, 538992, 541083, 540484, 537483, 532452]
62393E32452o881q146q384q036p913q116q109p645o997o340n390l767j533O10
62379D45805J948K646L750N936Q667J1095J3253J5613J8021K0209K2904K7100
62367E96947L2254L6604L9476M1919M4863M7945N0585N2946N5134N6580N6870
62356A112123N6260N4716N1323M5316L7056K7486J7251O833l231j2565k0766k6925
62344A344877l0380l2105l4120l7074l9649m0829m1306m1837m1582l9359l5617
62333I31019l1898k9008k6778k5067k3881k2906k1803k0674j9589j8169j6269
62322F74977j4454j3091j1627r528p287n651m421k914j223j40j77j329l319n460
62308E94356o777p070p339q390r631r997r593r317r400r355r066q805q280o796
$$ y = [532452, 525571, 517425, 509041, 501005, 493092, 484976, 476867, 469222, 462225, 455885, 450495, 446728, 445195, 445805, 447753, 450399, 454149, 460085, 468752, 479847, 493100, 508713, 526734, 546943, 569847, 596947, 629201, 665805, 705281, 747200, 792063, 840008, 890593, 943539, 998673, 1055253, 1112123, 1168383, 1223099, 1274422, 1319738, 1356794, 1384280, 1401531, 1408364, 1405133, 1392568, 1371802, 1344877, 1314497, 1282392, 1248272, 1211198, 1171549, 1130720, 1089414, 1047577, 1005995, 966636, 931019, 899121, 870113, 843335, 818268, 794387, 771481, 749678, 729004, 709415, 691246, 674977, 660523, 647432, 635805, 626277, 618990, 613339, 608918, 606004, 604781, 604641, 604464, 603135, 599816, 594356, 587579, 580509, 573170, 564780, 555149, 545152, 535559, 526242, 516842, 507487, 498421, 489616, 481336, 474540]
62294D74540m442k253r38k05N33J392K245L190M424N818O834P024O696O838Q007
62279E19703R467J0027R661R462R943J0469J0662J1150J2287J3308J3774J4708
62267F54621J7103K0077K1998K2964K4659K7831L1371L4168L6712M0347M5649
62256I77500N1891N7588O1329O2380O0734N6476M9352L9284K7041J3957J178j0413
62244A448297k0008k7291l2946l8055m2908m6764m8792m8904m7710m5903m3653
62233A005363m0544l6291l1493k7163k3509j9873j6106j3110j1483j0464r029
62222G66298p436o692o882o988o283n087m187m058m659n494n884n492m516l302
62208F89338k074j108n82l8J370L717O045P598Q598R410R974J0602J2287J5316
$$ y = [474540, 470098, 467845, 466907, 466702, 467235, 468627, 470872, 474062, 478486, 484304, 491138, 498162, 504858, 511696, 519703, 529170, 539197, 548858, 558320, 568263, 578732, 589394, 600544, 612831, 626139, 639913, 654621, 671724, 691801, 713799, 736763, 761422, 789253, 820624, 854792, 891504, 931851, 977500, 1029391, 1086979, 1148308, 1210688, 1271422, 1327898, 1377250, 1416534, 1443575, 1457532, 1458710, 1448297, 1428289, 1400998, 1368052, 1329997, 1287089, 1240325, 1191533, 1142629, 1094919, 1049016, 1005363, 964819, 928528, 897035, 869872, 846363, 826490, 810384, 797274, 785791, 775327, 766298, 758862, 752170, 745288, 738300, 732017, 726930, 722743, 718685, 714026, 708532, 702648, 697156, 692640, 689338, 687264, 686156, 685574, 685536, 686906, 690623, 696668, 704266, 712864, 722274, 732248, 742850, 755137, 770453]
62194G70453J8529K1014K3554K7192L1204L4026L5623L7225L8908L9115L6741
62183A113584L2313K6826K0716J4319Q299L068j435n056p277p944p454n920k962
62170A181077J451O620J1914J7366K3090K8539L2672L4606L4091L1675K8290K4265
62158A455656J8969J2057M815o24l531n213p196r570j1580j3077j4658j6646j8521
62145A390881j9421j8914j7225j4869j2256r653p394n719m458l246k204j923k497
62132A271102l029k499q00J439L661N640P315Q878J0626J2395J3635J4423J5795
62119A358581J8323K1006K2372K2346K2144K2587K3473K4442K5546K6771K7780
62108A615371K8300K8463K8648K9251L0363L1487L1914L1723L1900L2984L4234
$$ y = [770453, 788982, 809996, 833550, 860742, 891946, 925972, 961595, 998820, 1037728, 1076843, 1113584, 1145897, 1172723, 1193439, 1207758, 1216057, 1219125, 1217690, 1212634, 1205357, 1197413, 1189959, 1184039, 1181077, 1182528, 1189148, 1201062, 1218428, 1241518, 1270057, 1302729, 1337335, 1371426, 1403101, 1431391, 1455656, 1474625, 1486682, 1491497, 1490873, 1487342, 1482129, 1474933, 1465363, 1453783, 1440706, 1426048, 1409402, 1390881, 1371460, 1352546, 1335321, 1320452, 1308196, 1298543, 1291149, 1285430, 1280972, 1277726, 1275522, 1273599, 1271102, 1268073, 1265574, 1264774, 1266213, 1269874, 1275514, 1282829, 1291707, 1302333, 1314728, 1328363, 1342786, 1358581, 1376904, 1397910, 1420282, 1442628, 1464772, 1487359, 1510832, 1535274, 1560820, 1587591, 1615371, 1643671, 1672134, 1700782, 1730033, 1760396, 1791883, 1823797, 1855520, 1887420, 1920404, 1954638]
62097A954638L4761L4874L5542L7003L8836M1005M3875M7436N1353N5428N9172
62086B433923O1315O0896N8682N6525N5458N5426N6605N9619O4068O7846O8430
62075C098793O4466N6366M6202L7081L1525L0023L1350L4200L7802M1351M3981
62064C553140M5509M6437M6950M6523M4533M0772L5544K9873K5248K2343K0179
62053C957051J7390J3987J0857P928M190n36n281r535j3727j7830k0784k1969
62041C921741k2054k1852k1349k0545k0122k0428k0622j9849j8582j7911j7883
62030C700544j7479j6080j4210j2827j2349j2404j2273j1562j0542r736r190q396
62018C553496o940m923k727o81J044K537M132O067Q205J0381J2701J5212J7573
$$ y = [1954638, 1989399, 2024273, 2059815, 2096818, 2135654, 2176659, 2220534, 2267970, 2319323, 2374751, 2433923, 2495238, 2556134, 2614816, 2671341, 2726799, 2782225, 2838830, 2898449, 2962517, 3030363, 3098793, 3163259, 3219625, 3265827, 3302908, 3334433, 3364456, 3395806, 3430006, 3467808, 3509159, 3553140, 3598649, 3645086, 3692036, 3738559, 3783092, 3823864, 3859408, 3889281, 3914529, 3936872, 3957051, 3974441, 3988428, 3999285, 4007213, 4011403, 4010867, 4005586, 3996051, 3982324, 3964494, 3943710, 3921741, 3899687, 3877835, 3856486, 3835941, 3815819, 3795391, 3774769, 3754920, 3736338, 3718427, 3700544, 3683065, 3666985, 3652775, 3639948, 3627599, 3615195, 3602922, 3591360, 3580818, 3571082, 3561892, 3553496, 3546556, 3541633, 3538906, 3538225, 3539269, 3541806, 3545938, 3552005, 3560210, 3570591, 3583292, 3598504, 3616077]
62005C616077J9585K1636K4022K6203K7512K8280K9248L0002K8937K4844J7719
61994C894065Q033l656j6294k8450l9272m8609n6117o1066o3316o3713o3170o1959
61982C396476o0099n7833n5413n2985n0796m8997m7178m4730m1745l9004l7035
61971B860661l5739l4864l4172l3231l1770l0141k8696k6967k4423k1743k0180
61960B538735j9720j9132j7863j6543j5451j3981j2095j0851j0717j0564r205
61949B382613o982m965l427j918j20K135N012Q113J0415J1527J2303J3574J4986
61936B443266J5908J6752J8308K0240K1393K1455K1364K1994K3239K4574K5924
61925B674417K7659L0105L3425L7829M3664N1141O0150P0580Q2840R7657J15223
$$ y = [3616077, 3635662, 3657298, 3681320, 3707523, 3735035, 3763315, 3792563, 3822565, 3851502, 3876346, 3894065, 3902098, 3898442, 3882148, 3853698, 3814426, 3765817, 3709700, 3648634, 3585318, 3521605, 3458435, 3396476, 3336377, 3278544, 3223131, 3170146, 3119350, 3070353, 3023175, 2978445, 2936700, 2897696, 2860661, 2824922, 2790058, 2755886, 2722655, 2690885, 2660744, 2632048, 2605081, 2580658, 2558915, 2538735, 2519015, 2499883, 2482020, 2465477, 2450026, 2436045, 2423950, 2413099, 2402382, 2391818, 2382613, 2375631, 2370666, 2367239, 2365321, 2365201, 2367336, 2372348, 2380461, 2390876, 2402403, 2414706, 2428280, 2443266, 2459174, 2475926, 2494234, 2514474, 2535867, 2557322, 2578686, 2600680, 2623919, 2648493, 2674417, 2702076, 2732181, 2765606, 2803435, 2847099, 2898240, 2958390, 3028970, 3111810, 3209467, 3324690]
61914C324690J35025J56770J80942K08050K37975K70752L07342L48772L95168
61905E565486M46694N04786N70809O43495P18755P91412Q54900Q98721R08011
61896A1903069Q67423P66248O02067L83071J28626j34322l78559n83019p35304
61887A2819300q31899q77652q83081q59511q15756p58667o94591o28799n64382
61878E904962n03031m46399l95699l50709l10338k73942k41467k12860j88079
61869B982438j67101j49215j32906j17280j02931r0684q0089p0075o0447n1713
61859A959997m3858l6341k9082k2474j6502j0709n007J41M427Q041J1253J3935
61847A833821J5504J5209J2761Q842M683R85k432n857r052j1451j2499j1679q877
$$ y = [3324690, 3459715, 3616485, 3797427, 4005477, 4243452, 4514204, 4821546, 5170318, 5565486, 6012180, 6516966, 7087775, 7731270, 8450025, 9241437, 10096337, 10995058, 11903069, 12770492, 13536740, 14138807, 14521878, 14650504, 14516182, 14137623, 13554604, 12819300, 11987401, 11109749, 10226668, 9367157, 8551401, 7792734, 7098143, 6469344, 5904962, 5401931, 4955532, 4559833, 4209124, 3898786, 3624844, 3383377, 3170517, 2982438, 2815337, 2666122, 2533216, 2415936, 2313005, 2222321, 2142232, 2072157, 2011710, 1959997, 1916139, 1879798, 1850716, 1828242, 1811740, 1801031, 1796024, 1796165, 1800592, 1808633, 1819886, 1833821, 1849325, 1864534, 1877295, 1886137, 1890820, 1891805, 1889373, 1883516, 1874464, 1863013, 1850514, 1838835, 1829958]
61834A829958m829o31L305P133J0515J2676J3593J3993J3884J2233Q586L878q65
61821A923429n510r936j3390j5507j6906j7941j7856j6009j3037r840o349k113
61809A779035K721P856J3360J8923K3642K7509L2022L8212M5116N1441N7593O4585
61797B162015P1997P8856Q5805R4360J04420J14437J24124J35096J48602J64251
61787C283963J81583K01378K24618K51224K80716L13611L51464L95803M47428
61778E931788N06559N73491O49146P34967Q32119R40914J060817J190019J323891
61769A3743711J453451J564781J638846J651794J578028J397546J104641P13238
61761B4846036K56402k19623o65657j041278j322895j504713j594228j606632
$$ y = [1829958, 1825129, 1824498, 1827803, 1834936, 1845451, 1858127, 1871720, 1885713, 1899597, 1911830, 1920416, 1924294, 1923429, 1917919, 1907983, 1894593, 1879086, 1862180, 1844239, 1826383, 1810374, 1797337, 1787497, 1781148, 1779035, 1781756, 1789612, 1802972, 1821895, 1845537, 1873046, 1905068, 1943280, 1988396, 2039837, 2097430, 2162015, 2234012, 2312868, 2398673, 2493033, 2597453, 2711890, 2836014, 2971110, 3119712, 3283963, 3465546, 3666924, 3891542, 4142766, 4423482, 4737093, 5088557, 5484360, 5931788, 6438347, 7011838, 7660984, 8395951, 9228070, 10168984, 11229801, 12419820, 13743711, 15197162, 16761943, 18400789, 20052583, 21630611, 23028157, 24132798, 24846036, 25102438, 24882815, 24217158, 23175880, 21852985, 20348272, 18754044, 17147412]
61753A7147412j560348j473569j362033j238514j112991r92268q79855p77206
61745G750628o85203o04271n33730m72103m18121l70903l29442k92578k59462
61736C784815k29720k03288j80208j60211j42319j25537j10026r6790q5968p6457
61726B374291o7691o0580n5875n2811n0317m8534m7942m7882m7259m6080m4993
61715A804327m3868m2064l9617l7029l4289l1192k8173k5773k3767k1817k0387
61704A456351j9909j9643j8679j7521j7319j8023j8610j8776j8941j8923j8073
61693A251934j6620j5492j4906j4328j3666j3271j2859j1817j0422r517r092q430
61681A101514p553p088o792n649l644k112j988k788l475l436k632j750j982l552
$$ y = [17147412, 15587064, 14113495, 12751462, 11512948, 10399957, 9407689, 8527834, 7750628, 7065425, 6461154, 5927424, 5455321, 5037200, 4666297, 4336855, 4044277, 3784815, 3555095, 3351807, 3171599, 3011388, 2869069, 2743532, 2633506, 2536716, 2450748, 2374291, 2306600, 2246020, 2190145, 2137334, 2087017, 2038483, 1990541, 1942659, 1895400, 1849320, 1804327, 1760459, 1718395, 1678778, 1641749, 1607460, 1576268, 1548095, 1522322, 1498555, 1476738, 1456351, 1436442, 1416799, 1398120, 1380599, 1363280, 1345257, 1326647, 1307871, 1288930, 1270007, 1251934, 1235314, 1219822, 1204916, 1190588, 1176922, 1163651, 1150792, 1138975, 1128553, 1119036, 1109944, 1101514, 1093961, 1086873, 1080081, 1074432, 1070788, 1068676, 1066688, 1063900, 1060425, 1056989, 1054357, 1052607, 1050625, 1047073]
61667A047073m801m030k001j113k239m079n534o820p931p944o652n322m889m731
61653I78987m054l260l003k893k205j079j33M99J046J508J798J991K009J636J187
61638I74034J543L056N026O675Q081R706J1593J3504J5435J7480J9356K0357J9694
61625A125540J6989J2709Q007L707l57m639q824j2125j4364j5926j6835j6692
61613A077190j5549j4056j2720j1697j1177j1313j1782j2107j2309j2627j2880
61602I38973j2784j2582j2508j2021j0520q522p140o583o225n781n353m621l198
61589H31135j585n29L05J753L566M871N938P791J0115J1388J1402J1875J3971
61576I11996J6821J9119K0803K2449K4242K6201K8410L0461L1715L2433L3521
$$ y = [1047073, 1042272, 1038242, 1036241, 1035128, 1032889, 1028810, 1023276, 1016456, 1008525, 1000581, 993929, 988607, 983718, 978987, 974933, 971673, 968670, 965777, 963572, 962493, 962360, 962859, 963905, 965413, 967211, 969202, 971211, 972847, 974034, 975577, 978633, 983659, 990334, 998415, 1008121, 1019714, 1033218, 1048653, 1066133, 1085489, 1105846, 1125540, 1142529, 1155238, 1163245, 1166952, 1166595, 1161956, 1153132, 1141007, 1126643, 1110717, 1093882, 1077190, 1061641, 1047585, 1034865, 1023168, 1011991, 1000678, 988896, 976789, 964480, 951853, 938973, 926189, 913607, 901099, 889078, 878558, 870036, 862896, 856313, 850088, 844307, 838954, 834333, 831135, 829550, 829021, 829326, 831079, 834645, 839516, 845454, 853245, 863360, 874748, 886150, 898025, 911996, 928817, 947936, 968739, 991188, 1015430, 1041631, 1070041, 1100502, 1132217, 1164650, 1198171]
61565A198171L4794L4814L2994L0573K8834K7654K6460K5368K4510K3303K1389
61554A508864J9466J8379J8028J7816J7407J6584J5030J2750J0014O649K226k825
61542A660388p376j1225j5333j9961k3755k5368k5019k3785k2361k1149k0520
61531A444536k0092j8609j5367j1223p541m777k498j17K860O656J0868J4952J9184
61518A418832K4340L0318L6260M2145M9026N7366O6488P6124Q7072R9614J12766
61507B100351J25962J40300J57102J76309J97128K19183K41980K64166K84117
61498C906598L00297L10172L09780K95602K66496K23435J68534J05279L8743k5695
61488E899241q3699j32109j69134j95236k12546k22441k24538k18882k07733j93963
$$ y = [1198171, 1232965, 1267779, 1300773, 1331346, 1360180, 1387834, 1414294, 1439662, 1464172, 1487475, 1508864, 1528330, 1546709, 1564737, 1582553, 1599960, 1616544, 1631574, 1644324, 1654338, 1660987, 1663213, 1660388, 1653012, 1641787, 1626454, 1606493, 1582738, 1557370, 1532351, 1508566, 1486205, 1465056, 1444536, 1424444, 1405835, 1390468, 1379245, 1371704, 1366927, 1364429, 1364312, 1367172, 1373828, 1384696, 1399648, 1418832, 1443172, 1473490, 1509750, 1551895, 1600921, 1658287, 1724775, 1800899, 1887971, 1987585, 2100351, 2226313, 2366613, 2523715, 2700024, 2897152, 3116335, 3358315, 3622481, 3906598, 4206895, 4517067, 4826847, 5122449, 5388945, 5612380, 5780914, 5886193, 5924936, 5899241, 5815542, 5683433, 5514299, 5319063, 5106517, 4884076, 4659538, 4440656, 4232923, 4038960]
61478D038960j78720j61966j44357j27094j10497r4127p7987o2581m7999l3986
61468B999646k0593q089L485J4118K3641L2151L9938M6641N1316N3872N5370N6359
61456C347855N6092N4135N1459M9002M6337M2974L9922L8633L9236M1003M3710
61445C850358M7331N1148N4433N7330N9971O1536O1321N9887N7967N4968M9910
61434D466160M3053L5235K6367J5951M550o746j7792k8943l9545m8334n4939n9770
61422D335247o2804o3723o2870o0766n7076n1375m4525l7932l1689k4830j7197
61411C820460r729l077K855Q002J1978J4617J5758J4702J1002N548k63o074j2167
61398C873612j7898k1829k3275k2516j9687j4596p433J614J3213K8066M5356O3311
$$ y = [4038960, 3860240, 3698274, 3553917, 3426823, 3316326, 3222199, 3144212, 3081631, 3033632, 2999646, 2979053, 2970964, 2974449, 2988567, 3012208, 3044359, 3084297, 3130938, 3182254, 3236126, 3291496, 3347855, 3403947, 3458082, 3509541, 3558543, 3604880, 3647854, 3687776, 3726409, 3765645, 3806648, 3850358, 3897689, 3948837, 4003270, 4060600, 4120571, 4182107, 4243428, 4303315, 4361282, 4416250, 4466160, 4509213, 4544448, 4570815, 4586766, 4591316, 4584570, 4566778, 4537835, 4498290, 4449956, 4395017, 4335247, 4272443, 4208720, 4145850, 4085084, 4028008, 3976633, 3932108, 3894176, 3862487, 3837657, 3820460, 3810731, 3807654, 3810509, 3818511, 3830489, 3845106, 3860864, 3875566, 3886568, 3892116, 3891853, 3885779, 3873612, 3855714, 3833885, 3810610, 3788094, 3768407, 3753811, 3746378, 3747992, 3761205, 3789271, 3834627, 3897938]
61386C897938Q1337J00450J21670J45103J70532J97585K25193K51975K77183L00321
61376E769287L19816L32951L37006L29625L08595K72761K23389J63838R8222L1245
61366H186735l1660q6247j31830j70442k03585k31107k52937k69898k82270k89230
61356F237529k90444k86895k79578k68606k54408k38593k22801k07481j92384
61347C996339j77479j62771j48044j33345j19096j05262r1182p6593o2235m8923
61337B871409l6741k5482j5136n481M149J4059K3637L1972L8733M4084M8216N1260
61325C044679N3213N3798N2765N0568M8179M6000M3483M0071L6120L2438K9383
61314C530697K6806K4731K3627K3833K4846K5409K4466K1899J8057J2830N912
$$ y = [3897938, 3979275, 4079725, 4201395, 4346498, 4517030, 4714615, 4939808, 5191783, 5468966, 5769287, 6089103, 6422054, 6759060, 7088685, 7397280, 7670041, 7893430, 8057268, 8155490, 8186735, 8155075, 8068828, 7936998, 7766556, 7562971, 7331864, 7078927, 6809029, 6526759, 6237529, 5947085, 5660190, 5380612, 5112006, 4857598, 4619005, 4396204, 4188723, 3996339, 3818860, 3656089, 3508045, 3374700, 3255604, 3150342, 3059160, 2982567, 2920332, 2871409, 2834668, 2809186, 2794050, 2788569, 2792718, 2806777, 2830414, 2862386, 2901119, 2945203, 2993419, 3044679, 3097892, 3151690, 3204455, 3255023, 3303202, 3349202, 3392685, 3432756, 3468876, 3501314, 3530697, 3557503, 3582234, 3605861, 3629694, 3654540, 3679949, 3704415, 3726314, 3744371, 3757201, 3763113]
61303C763113k092r810j6701k3610l1229l8906m5708n1649n6992o1231o3949o5881
61291C295355o7790o8886o7810o4760o1100n7111n1751m4720l7248l0466k4262
61280B719451j8174j2273o800j894J876L596L093J312p23k728m821o953q846j0060
61266B656056j0123r087p766o813n894m382k434m48K201O681J3220K1249L0880
61253B683340M2937N7290P2455Q7224J01732J16465J31004J44086J54095J59229
61243C749857J57765J48507J30553J02993O5746K0926k7327p4505j16856j51447
61233D006212j76376j91235j96754j94152j85365j73353j60767j48228j34903
61224B445079j20690j06803r4318q3404p4047o6270n9426n2474m5393l9254l4626
$$ y = [3763113, 3761021, 3751211, 3734510, 3710900, 3679671, 3640765, 3595057, 3543408, 3486416, 3425185, 3361236, 3295355, 3227565, 3158679, 3090869, 3026109, 2965009, 2907898, 2856147, 2811427, 2774179, 2743713, 2719451, 2701277, 2689004, 2682204, 2680310, 2682186, 2685782, 2688875, 2690187, 2689464, 2686736, 2681915, 2674962, 2666116, 2656056, 2645933, 2636846, 2629080, 2622267, 2616373, 2611991, 2609557, 2609109, 2611310, 2617991, 2631211, 2652460, 2683340, 2726277, 2783567, 2856022, 2943246, 3044978, 3161443, 3292447, 3436533, 3590628, 3749857, 3907622, 4056129, 4186682, 4289675, 4355421, 4376347, 4349020, 4274515, 4157659, 4006212, 3829836, 3638601, 3441847, 3247695, 3062330, 2888977, 2728210, 2579982, 2445079, 2324389, 2217586, 2123268, 2039864, 1965817, 1899547, 1840121, 1787647, 1742254, 1703000, 1668374]
61213A668374l0791k6876k2754j8529j4080r535n352j559K354O504J0276J3211
61201A571243J5511J7516J9297K0810K1759K1249J8492J3973R146M869R34k847
61189A731952o015q182r602j0813j2252j4252j6788j9305k1347k3190k5177k6865
61177A538164k7685k8036k8694k9470k9554k8933k8254k7569k6500k5448k5306
61166A232715k6008k6617k6785k6888k6902k6499k6121k6445k6840k5809k3061
61155I44740j9736j6691j4061j2403j2468j3715j4779j5625j7430k0072k1631
61144G66129k0918j8826j6519j4098j1643r862q812p488n469l639k531j380M29
61131F45373K291L594M713O048P263Q119Q963R841J0302J0479J1108J2114J2609
$$ y = [1668374, 1637583, 1610707, 1587953, 1569424, 1555344, 1545809, 1540457, 1538898, 1541252, 1547756, 1558032, 1571243, 1586754, 1604270, 1623567, 1644377, 1666136, 1687385, 1705877, 1719850, 1728996, 1733865, 1734799, 1731952, 1725937, 1717755, 1708153, 1697340, 1685088, 1670836, 1654048, 1634743, 1613396, 1590206, 1565029, 1538164, 1510479, 1482443, 1453749, 1424279, 1394725, 1365792, 1337538, 1309969, 1283469, 1258021, 1232715, 1206707, 1180090, 1153305, 1126417, 1099515, 1073016, 1046895, 1020450, 993610, 967801, 944740, 925004, 908313, 894252, 881849, 869381, 855666, 840887, 825262, 807832, 787760, 766129, 745211, 726385, 709866, 695768, 684125, 674263, 665451, 657963, 652494, 648855, 646324, 644944, 645373, 647664, 651258, 655971, 662019, 669282, 677401, 686364, 696205, 706507, 716986, 728094, 740208, 752817]
61118G52817J2610J3144J4249J4652J4008J3603J4081J4337J3598J2741J2459
61107I02299J1762R637O617L548K23l546o883r131j0973j3102j4978j5904j6163
61094H43406j6111j5426j4210j3464j3432j2925j1330r923j0053j1281j2402j2966
61082F89883j2807j1511r474q092p818p405o046m601l709k487m31J171J243P08
61068F18624Q22J256J298J368J777J638N56k10J56M38m55j497j546j432k105k470
61052F18218j329J65L14l43k90L64Q88K011M512P035P890P854Q760J0402J1350
61037F77801J1640J2116J2232J1185J0129J0568J1544J1146R825R375R655R178
61025H06394Q087P603P409O574O179P760J0014J0385R278R291J0772J1734J1790
$$ y = [752817, 765427, 778571, 792820, 807472, 821480, 835083, 849164, 863501, 877099, 889840, 902299, 914061, 923698, 930315, 933863, 934086, 930540, 923657, 914526, 903553, 890451, 875473, 859569, 843406, 827295, 811869, 797659, 784195, 770763, 757838, 746508, 736585, 726532, 715251, 702849, 689883, 677076, 665565, 656091, 647999, 640181, 632776, 626730, 622129, 618420, 615933, 615502, 616673, 617916, 618624, 619446, 620702, 622000, 623368, 625145, 626783, 627339, 627129, 627285, 627723, 627268, 625771, 624225, 622793, 620688, 618218, 616889, 617054, 617368, 617025, 616735, 617099, 617987, 619998, 624510, 631545, 639435, 647289, 656049, 666451, 677801, 689441, 701557, 713789, 724974, 735103, 745671, 757215, 768361, 778186, 787561, 797216, 806394, 814481, 822084, 829493, 836067, 842246, 850006, 860020, 870405, 879683, 888974, 899746, 911480, 923270]
61012I23270J2554J4330J5814J7037J9132K1429K2368K2987K5785L0384L4346
61001A159436L8028M4142N2414N9350O3673O7323P0630P1745P1800P5254Q3563
60990A857358R3681J04321J18006J34810J50037J61119J71413J84539K01054K23830
60980C400168K59483L09983L69906M37461N20693O26860P55759R13524J123175
60971H717012J408098J775388K230580K782853L377103L804402L748242L015056
60963C0858734J752718M06545n75523r99119r15861m53509K53273R73561J344242
60954C2645061J050882Q3884j214730k382983l122755l393714l312038l019048
60946A7334559k627563k220274j847447j525063j250459j020914q34880o85142
$$ y = [923270, 935824, 950154, 965968, 983005, 1002137, 1023566, 1045934, 1068921, 1094706, 1125090, 1159436, 1197464, 1241606, 1294020, 1353370, 1417043, 1484366, 1554996, 1626741, 1698541, 1773795, 1857358, 1951039, 2055360, 2173366, 2308176, 2458213, 2619332, 2790745, 2975284, 3176338, 3400168, 3659651, 3969634, 4339540, 4777001, 5297694, 5924554, 6680313, 7593837, 8717012, 10125110, 11900498, 14131078, 16913931, 20291034, 24095436, 27843678, 30858734, 32611452, 33017997, 32442474, 31443355, 30527494, 30073985, 30327258, 31300819, 32645061, 33695943, 33779827, 32565097, 30182114, 27059359, 23665645, 20353607, 17334559, 14706996, 12486722, 10639275, 9114212, 7863753, 6842839, 6007959, 5322817]
60938E322817n61884m60779l81865l22736k78214k44722k20115k00605j82377
60929B469520j65265j51080j39061j26434j12425r8458q5106p2212o1513n5684
60919A402282n4631n5387n5743n5484n4196n0762m5535m0667l7388l4806l1831
60908H85852k8520k5143k1550j8124j5774j4504j3270j1579r924q430o569m525
60896G07940l216k516j069J485L679M485M867O011P409P933P734P676P642O847
60882G66907N353L905K549N70k172m824o580p456p987q692r803j1037j1740j1569
60868F97424j0928j0403r990r307q185o700m876k891j264l15L39J248K352L274
60854F39778M079N172O666Q315R948J1408J2410J2991J3867J5684J8074K0095
$$ y = [5322817, 4760933, 4300154, 3918289, 3595553, 3317339, 3072617, 2852502, 2651897, 2469520, 2304255, 2153175, 2014114, 1887680, 1775255, 1676797, 1591691, 1519479, 1457966, 1402282, 1347651, 1292264, 1236521, 1181037, 1126841, 1076079, 1030544, 989877, 952489, 917683, 885852, 857332, 832189, 810639, 792515, 776741, 762237, 748967, 737388, 727464, 719034, 712465, 707940, 704724, 702208, 701139, 702624, 706303, 710788, 715655, 721666, 729075, 737008, 744742, 752418, 760060, 766907, 772260, 776165, 778714, 779284, 777112, 772288, 765708, 758252, 750265, 741573, 731770, 720733, 708993, 697424, 686496, 676093, 666103, 656796, 648611, 641911, 637035, 634144, 632880, 632565, 632904, 634152, 636504, 639778, 643857, 649029, 655695, 664010, 673958, 685366, 697776, 710767, 724634, 740318, 758392, 778487]
60842G78487K1353K2054K2199K1589K0527J9649J8916J7572J5243J2408R690P280
60830I86967N259L813L016K883L601N048O070N226K459p06k955m381n635o806
60816A003859p695q483r408j0254j0819j1430j2486j3727j4508j4526j3933j2974
60804H63616j1872j0796r758q705p824p277o613n018k447J31J972L419N133P067
60790H11028Q758J0144J1553J3192J5061J7070J8815J9666J9416J8501J7356J5954
60778I96514J4224J2315J0173P540M781K945K476K548K326K106K541L349L774
60765A067612L853M232M989N441N091M153L165K503K145J619N56n71q25k16J29
60750A103876l63q03l19N22Q22R14J598K401K089N35j216k545l646m484m629m230
$$ y = [778487, 799840, 821894, 844093, 865682, 886209, 905858, 924774, 942346, 957589, 969997, 979687, 986967, 992226, 996039, 999055, 1001938, 1005539, 1010587, 1016657, 1021883, 1024342, 1023636, 1020681, 1016300, 1010665, 1003859, 996164, 987681, 978273, 968019, 957200, 945770, 933284, 919557, 905049, 890523, 876590, 863616, 851744, 840948, 831190, 822485, 814661, 807384, 800771, 795753, 793306, 793437, 795409, 798828, 803961, 811028, 819786, 829930, 841483, 854675, 869736, 886806, 905621, 925287, 944703, 963204, 980560, 996514, 1010738, 1023053, 1033226, 1040766, 1045547, 1048492, 1050968, 1053516, 1055842, 1057948, 1060489, 1063838, 1067612, 1071465, 1075697, 1080686, 1086127, 1091218, 1095371, 1098536, 1101039, 1103184, 1104803, 1105359, 1104788, 1103963, 1103747, 1103876, 1103513, 1102710, 1102391, 1102913, 1103735, 1104649, 1106247, 1108648, 1110737, 1111272, 1110056, 1107511, 1103865, 1099381, 1094752, 1090522]
60734A090522l981m024l891l625l876m713n310n111m446l858l535l619m261n135
60720A031137n636n707n857o259o520o511o658p272q119q839r268r321q982q438
60706I27750p769o704n104l428k129r27N52J907K526K619K707K508J422k23j744
60691I13963l556o548j0095j2385j2945j3244j4304j5351j5543j5452j5750j5694
60679G63096j4245j1882j0000q966p856n973l638j556l7J045J963K904L876M846
60665G13577N851O758P101O622N817N343N045M236K911J863J554J664J833K085
60651G72260K410K772L592N380P703R403J0011R997R600Q485O858N730N579N848
60637H65628O290P587J0006J2516J4197J5546J7431J9523K0809K1031K0646J9823
$$ y = [1090522, 1086541, 1082517, 1078626, 1075001, 1071125, 1066412, 1061102, 1055991, 1051545, 1047687, 1044152, 1040533, 1036272, 1031137, 1025501, 1019794, 1013937, 1007678, 1001158, 994647, 987989, 980717, 972598, 963759, 954491, 945170, 936188, 927750, 919981, 913277, 908173, 904745, 902616, 901689, 902241, 904148, 906674, 909293, 912000, 914508, 915930, 915707, 913963, 910407, 903859, 893764, 881379, 868434, 855190, 840886, 825535, 809992, 794540, 778790, 763096, 748851, 736969, 726969, 718003, 710147, 704174, 700536, 698980, 698943, 699988, 701951, 704855, 708731, 713577, 719428, 726186, 733287, 739909, 745726, 751069, 756114, 760350, 763261, 765124, 766678, 768342, 770175, 772260, 774670, 777442, 781034, 786414, 794117, 803520, 813531, 823528, 833128, 841613, 848471, 854201, 859780, 865628, 871918, 879505, 889511, 902027, 916224, 931770, 949201, 968724, 989533, 1010564, 1031210, 1051033]
60625A051033J8407J6547J4517J2229R553O771M035Q09l310p612j0948j3165j5016
60612A083850j6783j7802j7498j6167j4598j3254j1941j0047p074l188Q44M351
60600I60693P207R427J0616J0173P931M395M80k985n677p816r567j0440r761p683
60586I56993n207l142j568m31J07J84L93R62J359J190R90J558K801L818L949L392
60570I67348K822K624K416J364q50l453n383o582p908r836j1910j3557j4680j5280
60556H87135j5184j4524j3801j3172j2163j0372p962n313k747p44L41R71K105
60543G94570L916N621O902Q587J1468J5253J9332K3764K8880L4637M0918M7715
60531A041563N4113N7747N6300M9422L8516K5059R890o019k0912l2592l9342m0755
$$ y = [1051033, 1069440, 1085987, 1100504, 1112733, 1122286, 1129057, 1133092, 1133901, 1130591, 1122979, 1112031, 1098866, 1083850, 1067067, 1049265, 1031767, 1015600, 1001002, 987748, 975807, 965760, 958686, 955498, 956342, 960693, 967900, 977327, 987943, 998116, 1006047, 1010442, 1010922, 1007937, 1002260, 994444, 984877, 974437, 964676, 956993, 951786, 948644, 947076, 946645, 946752, 946936, 947329, 948291, 949650, 950840, 951830, 953388, 956189, 960007, 963956, 967348, 970170, 972794, 975210, 976574, 975724, 972271, 966888, 960306, 952398, 942562, 930652, 917095, 902415, 887135, 871951, 857427, 843626, 830454, 818291, 807919, 799957, 794644, 791897, 791153, 791494, 792465, 794570, 798486, 804107, 811009, 819596, 831064, 846317, 865649, 889413, 918293, 952930, 993848, 1041563, 1095676, 1153423, 1209723, 1259145, 1297661, 1322720, 1332610, 1326591, 1305679, 1273087, 1233745, 1192990]
60519A192990l7967l2781k6356j8994j1145l808K342P453J1637J4341J5123J4483
60507A127318J3238J1579R403P103N352M486M740O672J0647J6272K2988L0844
60495A270642M0110N0444O1404P3467Q7614J03816J20863J37874J55379J74596
60485B276209J96383K21400K50937K86880L30640L82071M38440M92906N33351
60476E409217N44306N12864M34767L15381J65732r51j69100l20715m39385n15917
60466E936199n50068n47979n19162m74466m23459l71957l22511k77029k37431
60457B212137k03941j74947j49319j27358j09041r3152p9129o7987o0199n4068
60447A092996m7566m0623l4389k9350k5522k3325k2786k2607k1518j9885j8756
$$ y = [1192990, 1155023, 1122242, 1095886, 1076892, 1065747, 1061939, 1064281, 1071734, 1083371, 1097712, 1112835, 1127318, 1140556, 1152135, 1161538, 1168641, 1173993, 1178479, 1183219, 1189891, 1200538, 1216810, 1239798, 1270642, 1310752, 1361196, 1422600, 1496067, 1583681, 1687497, 1808360, 1946234, 2101613, 2276209, 2472592, 2693992, 2944929, 3231809, 3562449, 3944520, 4382960, 4875866, 5409217, 5953523, 6466387, 6901154, 7216535, 7382267, 7381316, 7212216, 6891501, 6452116, 5936199, 5386131, 4838152, 4318990, 3844524, 3421065, 3049108, 2726597, 2449568, 2212137, 2008196, 1833249, 1683930, 1556572, 1447531, 1354379, 1275250, 1207263, 1147064, 1092996, 1045430, 1004807, 970418, 941068, 915546, 892221, 869435, 846828, 825310, 805425, 786669]
60436G86669j8023j6946j5753j5147j4690j3339j1262r648q750p654o026m667
60424F44764m089l803l380l041k816k096o40Q06J458J494J602J973K351K792L660
60409F41035M848N554N250M524M420M948N061M376M024M938O136N950M526L621
60395G09211M042M880N457O319P640Q259P266N365L752K634J728J199J119Q58
60381G69729o6j273k389l668n118n924n660n006m446l375j540j20p3m39K74J853
60365G32759K948L139L011K773K164J395Q39K90m10n36N29K050K891L171L735
60350G60748M537M930N069N666O783Q033R498J1154J2025J1405J0332J0218J0455
60337H70853R191O301L648K331J463J11j182j442o21P48K378M191O140Q347J0799
$$ y = [786669, 768646, 751700, 735947, 720800, 706110, 692771, 681509, 671861, 663111, 655457, 649431, 644764, 640675, 636872, 633492, 630451, 627635, 625539, 624899, 625705, 627163, 628657, 630259, 632232, 634583, 637375, 641035, 645883, 651437, 656687, 661211, 665631, 670579, 675640, 680016, 684040, 688978, 695114, 701064, 705590, 709211, 713253, 718133, 723590, 729909, 737549, 745808, 753074, 758439, 762191, 764825, 766553, 767752, 768871, 769729, 769663, 768390, 766001, 762333, 757215, 751291, 745631, 740625, 736179, 732804, 731264, 731144, 731071, 730632, 730906, 732759, 735707, 738846, 741857, 744630, 746794, 748189, 749028, 749318, 748908, 748372, 748901, 750951, 753842, 757013, 760748, 765285, 770215, 775284, 780950, 787733, 795766, 805264, 816418, 828443, 839848, 850180, 860398, 870853, 880044, 886345, 889993, 892324, 893787, 893898, 892716, 891274, 890653, 891401, 893779, 897970, 904110, 912457, 923256]
60322I23256J2919J3954J3710J2274R438N178L19m218q344j2054j4393j4497j3171
60309I24371j2009j1174r642p353n516m617l842k766k103k193k131j057O82K368
60295H63018M031O056Q218R736J0037R314Q376P852P276N489K358n74j945k327
60281I36915l090m257m828m674m548m430l437j491M10J727K908M208N260O104
60267I26777P428R435J1511J3287J5046J6897J8571K0290K2886K6673L0973L5000
60255A154774L8518M1691M5017M9333N5051O1447O7627P3987Q1683R0746R9875
60244A859749J08160J15899J23572J30958J37425J42209J44352J43150J38662
60235C044136J31174J20509J06804R1440P5980O0438M3769K5872P818r588k5990
$$ y = [923256, 936175, 950129, 963839, 976113, 985551, 990729, 991048, 986830, 978486, 966432, 952039, 937542, 924371, 912362, 901188, 891546, 884193, 878677, 874060, 870218, 867452, 865349, 863156, 861025, 859968, 860650, 863018, 867049, 873105, 881323, 891059, 901096, 910410, 918786, 926638, 933914, 939403, 941761, 941187, 939242, 936915, 933825, 929568, 924740, 920066, 915518, 911088, 907651, 906160, 906570, 908297, 911205, 915413, 920673, 926777, 934205, 943640, 955151, 968438, 983484, 1000381, 1018952, 1039242, 1062128, 1088801, 1119774, 1154774, 1193292, 1234983, 1280000, 1329333, 1384384, 1445831, 1513458, 1587445, 1669128, 1759874, 1859749, 1967909, 2083808, 2207380, 2338338, 2475763, 2617972, 2762324, 2905474, 3044136, 3175310, 3295819, 3402623, 3494063, 3570043, 3630481, 3674250, 3700122, 3707940, 3698352, 3672362]
60224C672362m0509n2076o0745o7181p0893p0561o6244n9627n1783m2208l0459
60213C060076j7228l339J0999K5551L9954N4648P0554Q7333J03173J16778J28418
60202C676917J38573J46663J51565J52373J48296J38965J25238J08688R0047O9081
60192D946406M6026K1906k673k7583n1835p3562r1741j06673j18401j26052j29142
60181D286676j28117j23128j13689j00154q4218o7279m9387l0396j0919Q351K7228
60170C614968M5415O2349P7975R2482J04887J13163J16177J14370J08284R7895
60160D547965Q3828O7675N0380L1741J2061p093k4527m0322n4224o4446o9167
60149D533871o8219o2541n3019m0500k5853r204R906L1045N2716P4258R6652J20797
$$ y = [3672362, 3631853, 3579777, 3519032, 3451851, 3380958, 3310397, 3244153, 3184526, 3132743, 3090535, 3060076, 3042848, 3039509, 3050508, 3076059, 3116013, 3170661, 3241215, 3328548, 3431721, 3548499, 3676917, 3815490, 3962153, 4113718, 4266091, 4414387, 4553352, 4678590, 4787278, 4877325, 4946406, 4992432, 5014338, 5011665, 4984082, 4932247, 4858685, 4766944, 4660271, 4541870, 4415818, 4286676, 4158559, 4035431, 3921742, 3821588, 3737370, 3670091, 3620704, 3590308, 3579389, 3587740, 3614968, 3660383, 3722732, 3800707, 3893189, 3998076, 4111239, 4227416, 4341786, 4450070, 4547965, 4631793, 4699468, 4749848, 4781589, 4793650, 4786557, 4762030, 4721708, 4667484, 4603038, 4533871, 4465652, 4403111, 4350092, 4309592, 4283739, 4274535, 4284441, 4315486, 4368202, 4442460, 4539112, 4659909]
60137D659909J46269J72537K00091K29415K59958K90948L22068L52472L80355
60128G014022M04369M24318M39540M47883M47425M38118M20681L94923L60391
60119A0791670L17812K68670K14014J54766R2534K9045l4859r8783j61719k22020
60109A1351130k77875l27247l67814l97575m15247m20142m12506l94109l67524
60100G971091l34549k96234k54252k10896j67489j24159q1359m0028o7L9330P7207
60089F578595J10671J37973J59798J76344J85169J83506J71179J49744J20369
60080G973348Q4507M5433O959k9041o2439r2848j19358j41909j61599j79492j95723
60069G127838k09374k18831k22937k22166k17949k10652j99531j84908j68793
$$ y = [4659909, 4806178, 4978715, 5178806, 5408221, 5668179, 5959127, 6281195, 6633667, 7014022, 7418391, 7842709, 8282249, 8730132, 9177557, 9615675, 10036356, 10431279, 10791670, 11109482, 11378152, 11592166, 11746932, 11839466, 11868511, 11833652, 11734869, 11573150, 11351130, 11073255, 10746008, 10378194, 9980619, 9565372, 9145230, 8732724, 8338615, 7971091, 7636542, 7340308, 7086056, 6875160, 6707671, 6583512, 6502153, 6462125, 6462058, 6501388, 6578595, 6689266, 6827239, 6987037, 7163381, 7348550, 7532056, 7703235, 7852979, 7973348, 8057855, 8103288, 8110247, 8081206, 8018767, 7925919, 7806561, 7664652, 7503053, 7323561, 7127838, 6918464, 6699633, 6476696, 6254530, 6036581, 5825929, 5626398, 5441490, 5272697]
60060E272697j52539j35475j16735r6912p6825n6170l4635j2983Q236K9730N2020
60049D680409P4194R5223J15134J33537J48363J57604J61122J59390J51754J37545
60039F014275J17757R4015O6888L6719N013k6564n7621q7938j16016j40204j60214
60028E746110j75952j86030j89257j86599j79918j69650j55563j38835j21311
60019D242995j03366q4343o4532m4905k5441n463J4867L5079N5821P8050J01302
60008D200064J24429J47398J70580J92751K11661K26061K35451K38330K32734
59999E979459K18409J96715J68779J35539R9238O2734K7104q470m4369p9569j12816
59988F642753j43016j68364j86760j97380k00771j97535j88257j74427j57946
$$ y = [5272697, 5120158, 4984683, 4867948, 4771036, 4694211, 4638041, 4603406, 4590423, 4598659, 4628389, 4680409, 4754603, 4849826, 4964960, 5098497, 5246860, 5404464, 5565586, 5724976, 5876730, 6014275, 6132032, 6226047, 6292935, 6329654, 6334667, 6308103, 6250482, 6162544, 6046528, 5906324, 5746110, 5570158, 5384128, 5194871, 5008272, 4828354, 4658704, 4503141, 4364306, 4242995, 4139629, 4055286, 3990754, 3945849, 3920408, 3914945, 3929812, 3964891, 4020712, 4098762, 4200064, 4324493, 4471891, 4642471, 4835222, 5046883, 5272944, 5508395, 5746725, 5979459, 6197868, 6394583, 6563362, 6698901, 6798139, 6860873, 6887977, 6879507, 6835138, 6755569, 6642753, 6499737, 6331373, 6144613, 5947233, 5746462, 5548927, 5360670, 5186243, 5028297]
59979E028297j39531j18946r6570p3470n0045k6032j745K1910M4477O5707Q4672
59968D738724J00492J13625J24932J33659J38059J37851J34388J28335J18866
59959E868931J05532Q9390P1856N3593L4994J6818m6j4715k6175l3626l6824l5517
59947F094211k8994j6960j87K0603M5866P6082J10300J47153J86601K29212K74315
59936G138202L20545L67592M15492M62326N04246N37634N59623N66720N54789
59927A1427169N20747M63198L81841K78223J57474K7902j01566k22952l29277
59918A2602759m15262m78553n19342n38872n39273n24126m97359m61626m19084
59909H209262l73140l27395k82875k38173j92526j47154j03432o1570k1379J7223
$$ y = [5028297, 4888766, 4769820, 4673250, 4599780, 4549735, 4523703, 4521958, 4543868, 4588345, 4654052, 4738724, 4839216, 4952841, 5077773, 5211432, 5349491, 5487342, 5621730, 5750065, 5868931, 5974463, 6063853, 6135709, 6189302, 6224296, 6241114, 6241068, 6226353, 6200178, 6166552, 6129728, 6094211, 6065217, 6048257, 6048070, 6068673, 6114539, 6190621, 6300921, 6448074, 6634675, 6863887, 7138202, 7458747, 7826339, 8241831, 8704157, 9208403, 9746037, 10305660, 10872380, 11427169, 11947916, 12411114, 12792955, 13071178, 13228652, 13256554, 13154988, 12932036, 12602759, 12187497, 11708944, 11189602, 10650730, 10111457, 9587331, 9089972, 8628346, 8209262, 7836122, 7508727, 7225852, 6987679, 6795153, 6647999, 6544567, 6482997, 6461618, 6478841]
59899F478841N4934R2729J30251J65660J97315K24513K46411K61326K67213K61851
59889H381044K42794K08551J60021R9889L1000m3339j18141j87806k48661k99214
59879H226138l38194l64245l77529l79850l72842l57497l35580l09742k81895
59870E108764k52852k23664j95796j69719j44912j21561j00848q3382o8883n7713
59860C689434n1061m9186n0691n3893n7714o1043o2611o1844n8749n2999m4344
59849C085299l3838k3108j2557j855P852J4064J5519J3017P471j107j2327k4779
59837C033651l7168m8645n7787o2844o3560o1373n7471n1996m5225l7981l0471
59826B479130k2254j3638n646J707R575J8487K7908L7785M8717O0101O9751P6014
$$ y = [6478841, 6533775, 6626504, 6756755, 6922415, 7119730, 7344243, 7590654, 7851980, 8119193, 8381044, 8623838, 8832389, 8992410, 9092299, 9123299, 9079960, 8961819, 8774013, 8525352, 8226138, 7887944, 7523699, 7146170, 6766320, 6393478, 6035981, 5700401, 5390659, 5108764, 4855912, 4632248, 4436452, 4266733, 4121821, 4000260, 3899412, 3816030, 3747147, 3689434, 3638373, 3589187, 3538496, 3484603, 3426889, 3365846, 3303235, 3241391, 3182642, 3129643, 3085299, 3051461, 3028353, 3015796, 3013941, 3021793, 3035857, 3051376, 3064393, 3071864, 3070757, 3058430, 3033651, 2996483, 2947838, 2890051, 2827207, 2763647, 2702274, 2644803, 2592807, 2547582, 2509601, 2479130, 2456876, 2443238, 2437592, 2439299, 2448874, 2467361, 2495269, 2533054, 2581771, 2641872, 2711623, 2787637]
59814B787637P9081P9957P9546P8831P8312P6926P2978O6189N7295M5823L0570
59803C533145J2557m697j8485k8478l4562l5610l1518k4350j6081o630M817J8085
59791C368193L2706M8903O6866Q6230J07069J30374J56929J87004K21487K61714
59781D667475L07578L57321M09398M62191N10539N43855N48824N13681M31470
59772H752332L03622J43243k6777j82111l05447l89165m33667m44954m31746m02171
59762F583159l62469l18146k74206k33300j95279j59593j26884r7732p1686m8527
59752D695337k8723j1623M989K2328L9293N4910P0372Q7176J04890J22369J39896
59741E301214J58519J78399J99364K22066K47230K74595L03833L35581L70491
$$ y = [2787637, 2866718, 2946675, 3026221, 3105052, 3183364, 3260290, 3333268, 3399457, 3456752, 3502575, 3533145, 3545702, 3541005, 3522520, 3494042, 3459480, 3423870, 3392352, 3368002, 3351921, 3345291, 3350108, 3368193, 3400899, 3449802, 3516668, 3602898, 3709967, 3840341, 3997270, 4184274, 4405761, 4667475, 4975053, 5332374, 5741772, 6203963, 6714502, 7258357, 7807181, 8320862, 8752332, 9055954, 9199197, 9172420, 8990309, 8684862, 8295697, 7862030, 7417076, 6985330, 6583159, 6220690, 5902544, 5628338, 5395038, 5199759, 5040166, 4913282, 4815550, 4743864, 4695337, 4666614, 4654991, 4659980, 4682308, 4721601, 4776511, 4846883, 4934059, 5038949, 5161318, 5301214, 5459733, 5638132, 5837496, 6059562, 6306792, 6581387, 6885220, 7220801, 7591292]
59732G591292M08219M48437M91672N37926N85311O31089O73116P09208P35961
59723A2812231P49347P46054P24024O83228O27102N62350M96544M36464L88577
59714A8225921L58851L50698L64016L96914M46925N09894N79533O49369P13883
59705B2596004P67046Q01560Q10906P90946P38991O53666N37507L98212K45817
59696B8340655Q9865n9941j92990l00560l78644m26503m43854m31349l92536l32882
59686B5471261k56992j68027o8804L8374J52575K73470M00193N32010O69049Q10818
59676B7853927R54181J093522J221629J328895J402377J427203J389208J276760
59668C7947702J082959Q09365M68727Q3886l15817o98442j034234j301182j488014
$$ y = [7591292, 7999511, 8447948, 8939620, 9477546, 10062857, 10693946, 11367062, 12076270, 12812231, 13561578, 14307632, 15031656, 15714884, 16341986, 16904336, 17400880, 17837344, 18225921, 18584772, 18935470, 19299486, 19696400, 20143325, 20653219, 21232752, 21882121, 22596004, 23363050, 24164610, 24975516, 25766462, 26505453, 27159119, 27696626, 28094838, 28340655, 28430520, 28370579, 28177589, 27877029, 27498385, 27071882, 26628028, 26196679, 25804143, 25471261, 25214269, 25046242, 24977438, 25015812, 25168387, 25441857, 25842050, 26374060, 27043109, 27853927, 28808108, 29901630, 31123259, 32452154, 33854531, 35281734, 36670942, 37947702, 39030661, 39840026, 40308753, 40392639, 40076822, 39378380, 38344146, 37042964, 35554950]
59659C5554950j592915j620960j582902j493506j368292j221912j069941r30277
59651B4674245q20924p56341p44796p85140q63481r55398j035703j088001j106432
59642A6518029j092080j050456r90123r19523q44101p67293o92840o23970n61211
59633H976432n03291m49884m01836l59282l21358k87346k56694k28456k02062
59624E966223j77949j56219j35720j15677r7155q1338o7629n5136m4725l7730
59614D996945l3722l1643l2206l6970m5603n6102o7232p8849r0259j00123j07679
59603D316557j12636j14357j12633j08625j03590r7397q9581q0892p2196o2987
59593C361663n2745m2674l4146k6381j7810q835j109N205J1242J7103K1891K5565
$$ y = [35554950, 33962035, 32341075, 30758173, 29264667, 27896375, 26674463, 25604522, 24674245, 23853321, 23096980, 22352184, 21567044, 20703563, 19748165, 18712462, 17624461, 16518029, 15425949, 14375493, 13385370, 12465847, 11621746, 10854453, 10161613, 9537643, 8976432, 8473141, 8023257, 7621421, 7262139, 6940781, 6653435, 6396741, 6168285, 5966223, 5788274, 5632055, 5496335, 5380658, 5283503, 5202165, 5134536, 5079400, 5034675, 4996945, 4963223, 4931580, 4899374, 4862404, 4816801, 4760699, 4693467, 4614618, 4524359, 4424236, 4316557, 4203921, 4089564, 3976931, 3868306, 3764716, 3667319, 3577738, 3496846, 3424650, 3361663, 3308918, 3266244, 3232098, 3205717, 3187907, 3179072, 3177963, 3183168, 3194410, 3211513, 3233404, 3258969]
59581C258969K8687L0718L0644K8821K6359K3294J9397J6101J5308J6744J8801
59570C513843K1613K6804L4405M2597N0587N9413O9603Q0354R1389J03580J17217
59559D211405J31577J46679J63650J82809K03056K23636K44946K67097K89068
59550F063923L09804L28903L45697L58883L67461L71098L69394L61907L49199
59541I226269L32912L14367K93863K71739K49578K29816K13737J99473J82661
59532A1514415J60781J37184J19298J12074J14597J23334J35885J49874J60652
59523A2728094J62947J53702J31348R4002M1068k4414r7584j75106k54569l31788
59513A2427700m01540m60408n06498n37403n51450n50719n39918n22197m98264
$$ y = [3258969, 3287656, 3318374, 3349018, 3377839, 3404198, 3427492, 3446889, 3462990, 3478298, 3495042, 3513843, 3535456, 3562260, 3596665, 3639262, 3689849, 3749262, 3818865, 3899219, 3990608, 4094188, 4211405, 4342982, 4489661, 4653311, 4836120, 5039176, 5262812, 5507758, 5774855, 6063923, 6373727, 6702630, 7048327, 7407210, 7774671, 8145769, 8515163, 8877070, 9226269, 9559181, 9873548, 10167411, 10439150, 10688728, 10918544, 11132281, 11331754, 11514415, 11675196, 11812380, 11931678, 12043752, 12158349, 12281683, 12417568, 12567442, 12728094, 12891041, 13044743, 13176091, 13270093, 13311161, 13286747, 13189163, 13014057, 12759488, 12427700, 12026160, 11565752, 11059254, 10521851, 9970401, 9419682, 8879764, 8357567, 7859303]
59504G859303m69171m37216m03968l69774l35385l01920k69346k37133k06222
59495D829168j78301j53433j30588j09994r2507p6996o1081m4320k8157j2918
59485C940873K499J8035L2467M6098O0664P6431R2171J08207J26530J47374J68662
59474D820011J89543K11558K35362K59101K81107L01529L19878L33277L38551
59465G289917L34144L18848K90817K49204J95284J31088N8712j8128r3895j63900
59455H592091k25820k78054l18525l46232l62292l68361l65435l55018l39698
59446E632656l21409l00453k77144k53086k30000k08471j88563j70337j53262
59437C529931j36456j20166j05612r2966q1041o9403n9075n0496m2509l4313k6764
$$ y = [7859303, 7390132, 6952916, 6548948, 6179174, 5843789, 5541869, 5272523, 5035390, 4829168, 4650867, 4497434, 4366846, 4256852, 4164345, 4087349, 4026268, 3981948, 3953791, 3940873, 3943372, 3961407, 3993874, 4039972, 4100636, 4177067, 4269238, 4377445, 4503975, 4651349, 4820011, 5009554, 5221112, 5456474, 5715575, 5996682, 6298211, 6618089, 6951366, 7289917, 7624061, 7942909, 8233726, 8482930, 8678214, 8809302, 8868014, 8849886, 8755991, 8592091, 8366271, 8088217, 7769692, 7423460, 7061168, 6692807, 6327372, 5972354, 5632656, 5311247, 5010794, 4733650, 4480564, 4250564, 4042093, 3853530, 3683193, 3529931, 3393475, 3273309, 3167697, 3074731, 2993690, 2924287, 2865212, 2814716, 2772207, 2737894, 2711130]
59426B711130k0750j5582j0111m381Q18N227R099J2614J5828J8756K1307K3621
59414B767576K6430L0554L6360M3923N2530N9068N8889N0583L9104L1785L1882
59403C228684L7964M8244O2366P9617R8926J20657J44995J68316J85025J94356
59393D369150K02445K16426K39020K69676L07635L51798M00111M51206N05082
59384G312549N60647O14149O61127O98156P21811P28053P14539O82214O33904
59375A3327149N73061N04644M34902L68522L07199K51742K03493J62367J25390
59366A6258469Q8768N0192Q021m0052r5809j58812k26694k95966l61619m17350
59356A4809148m57541m78820m80063m62573m30679l90586l47965l07612k74740
$$ y = [2711130, 2690380, 2674798, 2664687, 2660306, 2661124, 2666351, 2675450, 2688064, 2703892, 2722648, 2743955, 2767576, 2794006, 2824560, 2860920, 2904843, 2957373, 3016441, 3075330, 3125913, 3165017, 3196802, 3228684, 3266648, 3314892, 3377258, 3456875, 3555801, 3676458, 3821453, 3989769, 4174794, 4369150, 4571595, 4788021, 5027041, 5296717, 5604352, 5956150, 6356261, 6807467, 7312549, 7873196, 8487345, 9148472, 9846628, 10568439, 11296492, 12011031, 12693245, 13327149, 13900210, 14404854, 14839756, 15208278, 15515477, 15767219, 15970712, 16133079, 16258469, 16347237, 16397429, 16405450, 16365398, 16269589, 16110777, 15884083, 15588117, 15226498, 14809148, 14351607, 13872787, 13392724, 12930151, 12499472, 12108886, 11760921, 11453309, 11178569]
59347A1178569k54001k46612k50453k63251k83630l08857l34369l56551l73823
59338H507022l84490l86274l79031l65381l47432l25239k99455k72786k47184
59329E499750k21971j96365j71675j49418j29261j10436r3227p7557o2171m6708
59319D240961l2580k0277p963N580J8763K9822L9755N0482O1720P1654P9359Q4686
59307D621962Q7060Q6072Q2345P6340O7476N5560M1819K7419J2429k746j6518
59296E139218k7820l6992m3874m7013m5858m1852l5964k7179j4897p47J3652K8908
59284D859582M6133O4796Q3853J03256J22741J40889J56981J72003J86125J96995
59274F133354K02066K00901J93576J79055J57151J30193J00755O9530L7261O636
$$ y = [11178569, 10924568, 10677956, 10427503, 10164252, 9880622, 9571765, 9237396, 8880845, 8507022, 8122532, 7736258, 7357227, 6991846, 6644414, 6319175, 6019720, 5746934, 5499750, 5277779, 5081414, 4909739, 4760321, 4631060, 4520624, 4427397, 4349840, 4287669, 4240961, 4208381, 4188104, 4180141, 4185721, 4204484, 4234306, 4274061, 4324543, 4386263, 4457917, 4537276, 4621962, 4709022, 4795094, 4877439, 4953779, 5021255, 5076815, 5118634, 5146053, 5158482, 5155736, 5139218, 5111398, 5074406, 5030532, 4983519, 4937661, 4895809, 4859845, 4832666, 4817769, 4817022, 4830674, 4859582, 4905715, 4970511, 5054364, 5157620, 5280361, 5421250, 5578231, 5750234, 5936359, 6133354, 6335420, 6536321, 6729897, 6908952, 7066103, 7196296, 7297051, 7366581, 7403842, 7410478]
59264G410478k0303m4908o9527r3475j13503j26982j32715j30215j20786j08278
59254F449786r6523q6620p8153p1721o8164o6611o5429o4233o3167o1239n7126
59243E670800n0680m2016l0263j4700M133K5955N1877Q2397J15993J51528J90390
59232F155414K34079K81215L29083L76541M22793M64344M95662N12220N10962
59223I782313M88990M44332L77767K92151J90544P6556m4333j65570k81074l84903
59213A0776773m70883n34620n75293n94369n93771n76509n47416n11209m70662
59204E902041m27813l85368l45268l07476k71811k39506k11365j86200j62871
59195C364363j42155j24767j09377r4749q2045p2708o5716n9273n3613m9709m6671
$$ y = [7410478, 7390175, 7345267, 7275740, 7182265, 7068762, 6941780, 6809065, 6678850, 6558064, 6449786, 6353263, 6266643, 6188490, 6116769, 6048605, 5981994, 5916565, 5852332, 5789165, 5727926, 5670800, 5620120, 5578104, 5547841, 5533141, 5537274, 5563229, 5615106, 5697503, 5813496, 5965024, 6155414, 6389493, 6670708, 6999791, 7376332, 7799125, 8263469, 8759131, 9271351, 9782313, 10271303, 10715635, 11093402, 11385553, 11576097, 11652653, 11608320, 11442750, 11161676, 10776773, 10305890, 9771270, 9195977, 8601608, 8007837, 7431328, 6883912, 6372703, 5902041, 5474228, 5088860, 4743592, 4436116, 4164305, 3924799, 3713434, 3527234, 3364363, 3222208, 3097441, 2988064, 2893315, 2811270, 2738562, 2672846, 2613573, 2559960, 2510251, 2463580]
59184B463580m2861l8365l4110k9804k4920k0293j6630j2849q028l359N1L537
59172B235949Q615J4152J8415K2147K6867L1798L5447L8632M2896M7440N0821
59161B573179N4298O0097O7489P3970P9302Q5026R0814R4806R7089R9473J02053
59150C477596J02981J01435R7896R1856Q2127O9255N5055M0089K3960P589p371
59139D142468k0756l3025m2923m8688n0859n1189m9536m4654l7202k8939j9588
59128C715109p579O631K1084L5694N1948O9637Q7128J04657J24088J45395J66453
59117D520245J86446K06526K26964K46613K65475K84934L04895L23056L37232
59108F902386L45951L46625L35611L10615K71280K17946J52275P9080N099o4387
$$ y = [2463580, 2420719, 2382354, 2348244, 2318440, 2293520, 2273227, 2256597, 2243748, 2235720, 2232361, 2232412, 2235949, 2244564, 2258716, 2277131, 2299278, 2326145, 2357943, 2393390, 2432022, 2474918, 2522358, 2573179, 2627477, 2687574, 2755063, 2829033, 2908335, 2993361, 3084175, 3178981, 3276070, 3375543, 3477596, 3580577, 3682012, 3779908, 3871764, 3953891, 4023146, 4078201, 4118290, 4142250, 4149839, 4142468, 4121712, 4088687, 4045764, 3997076, 3946217, 3895028, 3845492, 3800838, 3763636, 3734697, 3715109, 3707530, 3714161, 3735245, 3770939, 3822887, 3892524, 3979652, 4084309, 4208397, 4353792, 4520245, 4706691, 4913217, 5140181, 5386794, 5652269, 5937203, 6242098, 6565154, 6902386, 7248337, 7594962, 7930573, 8241188, 8512468, 8730414, 8882689, 8961769, 8966868, 8902481]
59098H902481j26217j77723k17006k44728k63336k74879k81337k85779k90463
59089F741013k94441k95694k94624k92724k88985k81118k69664k57393k44973
59080D221397k30801k14859j99330j85152j71274j57445j44700j32954j21146
59071B663736j09799j00490r2779q4678p6168o9098o3731n8425n2834m8140m4102
59060A863492l9214l3970l0633k9424k8147k5954k4354k4111k4307k4795k6399
59049A552184k8356k8642k7210k5823k4545k1712j7529j4146j1781q469m277j894
59037A337800k058j998K57L378N874Q517J2275J6628K1269K6785L2464L5963L6194
59024A533348L4158L0348K4092J6109Q758K893k706q055j1059j0856r131p134
$$ y = [8902481, 8776264, 8598541, 8381535, 8136807, 7873471, 7598592, 7317255, 7031476, 6741013, 6446572, 6150878, 5856254, 5563530, 5274545, 4993427, 4723763, 4466370, 4221397, 3990596, 3775737, 3576407, 3391255, 3219981, 3062536, 2917836, 2784882, 2663736, 2553937, 2453447, 2360668, 2275990, 2199822, 2130724, 2066993, 2008568, 1955734, 1907594, 1863492, 1824278, 1790308, 1759675, 1730251, 1702104, 1676150, 1651796, 1627685, 1603378, 1578583, 1552184, 1523828, 1495186, 1467976, 1442153, 1417608, 1395896, 1378367, 1364221, 1352440, 1343971, 1339694, 1337800, 1335742, 1333744, 1334001, 1337379, 1343253, 1351770, 1364045, 1380673, 1401942, 1428727, 1461191, 1497154, 1533348, 1567506, 1597854, 1621946, 1638055, 1646813, 1649706, 1647000, 1638945, 1627886, 1617030, 1607899, 1600765]
59012A600765m192r9L909P537J2012J7342K1605K3832K4904K4881K2338J7193
59000A772027J1381N874j42o475j1312j4204j6604j8693j8745j6481j3906j1912
58988A660808r324o100m061l369j770J364L737M260M971P208R272R773J0154J1876
58974A698799J4027J5605J7520K0486K3504K6012K9091L3001L6211L8179M0380
58963A992815M3193M4662M3850M2545M2093M1427L9815L8656L8819L9066L8884
58952B445825M0135M4020M9046N3699N8659O4674P0956P7233Q4849R4157J03508
58941C186761J12262J22117J33923J46015J57302J69162J82650J96831K11573
58932D618596K29074K50618K74606K99725L27304L58750L93373M30618M71703
$$ y = [1600765, 1596573, 1596474, 1600383, 1607920, 1619932, 1637274, 1658879, 1682711, 1707615, 1732496, 1754834, 1772027, 1783408, 1789282, 1789140, 1782665, 1771353, 1757149, 1740545, 1721852, 1703107, 1686626, 1672720, 1660808, 1651484, 1645384, 1641323, 1637954, 1636184, 1637548, 1641285, 1645545, 1650516, 1657724, 1666996, 1676769, 1686923, 1698799, 1712826, 1728431, 1745951, 1766437, 1789941, 1815953, 1845044, 1878045, 1914256, 1952435, 1992815, 2036008, 2080670, 2124520, 2167065, 2209158, 2250585, 2290400, 2329056, 2367875, 2406941, 2445825, 2485960, 2529980, 2579026, 2632725, 2691384, 2756058, 2827014, 2904247, 2989096, 3083253, 3186761, 3299023, 3421140, 3555063, 3701078, 3858380, 4027542, 4210192, 4407023, 4618596, 4847670, 5098288, 5372894, 5672619, 5999923, 6358673, 6752046, 7182664, 7654367]
58923G654367N17178N65543O15993O69682P26483P83357Q37550Q88218R32849
58914A4191220R65141R78535R68936R32180Q62532P56696O16981M48668K57496
58905B0978385N2199j54000l47909n20817o66971p81347q61990r11984r35979
58896A5849587r36768r17274q83086q39974p90886p37531o82549o27904n73604
58887H860011n20320m70765m26481l86065l48664l16229k89915k67456k46706
58878E587410k28661k14169k00848j86462j72398j60531j49431j37048j24554
58869D013308j14035j04750r5119q6155p9446p3814o7367o0925n6093n1817m6063
58858C177724l9325l3315k7876k1920j5816j0139l887L527J0476J5859K1388K8616
$$ y = [7654367, 8171545, 8737088, 9353081, 10022763, 10749246, 11532603, 12370153, 13258371, 14191220, 15156361, 16134896, 17103832, 18036012, 18898544, 19655240, 20272221, 20720889, 20978385, 21030584, 20876584, 20528675, 20007858, 19340887, 18559540, 17697550, 16785566, 15849587, 14912819, 13995545, 13112459, 12272485, 11481599, 10744068, 10061519, 9433615, 8860011, 8339691, 7868926, 7442445, 7056380, 6707716, 6391487, 6101572, 5834116, 5587410, 5358749, 5144580, 4943732, 4757270, 4584872, 4424341, 4274910, 4137862, 4013308, 3899273, 3794523, 3699404, 3613249, 3533803, 3459989, 3392622, 3331697, 3275604, 3223787, 3177724, 3138399, 3105084, 3077208, 3055288, 3039472, 3029333, 3025446, 3028973, 3039449, 3055308, 3076696, 3105312]
58846C105312L6039M1955M7708N5043O2760O9109P5261Q3110R1887J00200J09201
58835C877585J20380J32450J43789J55844J70656J87111K03225K20065K39777
58826E450882K61634K83882L07786L36157L69274M05773M46029M91196N40326
58817H892939N91816O46216P04092P62614Q17418Q66253R07217R35013R42591
58808A6066169R25180Q79542Q01144O86452N37645L62067J68118l5275k36858
58799B0154184m24734n89862p26054q28622q96387r33479r45864r37136r10217
58790A2961829q70756q24924p75203p21874o67229o14742n65306n17859m72729
58781F931207m31224l93043l57213l24400k95431k69007k43910k21810k04772
$$ y = [3105312, 3141351, 3183306, 3231014, 3286057, 3348817, 3417926, 3493187, 3576297, 3668184, 3768384, 3877585, 3997965, 4130415, 4274204, 4430048, 4600704, 4787815, 4991040, 5211105, 5450882, 5712516, 5996398, 6304184, 6640341, 7009615, 7415388, 7861417, 8352613, 8892939, 9484755, 10130971, 10835063, 11597677, 12415095, 13281348, 14188565, 15123578, 16066169, 16991349, 17870891, 18672035, 19358487, 19896132, 20258199, 20426317, 20391042, 20154184, 19729450, 19139588, 18413534, 17584912, 16688525, 15755046, 14809182, 13872046, 12961829, 12091073, 11266149, 10490946, 9769072, 9101843, 8487101, 7921795, 7403936, 6931207, 6499983, 6106940, 5749727, 5425327, 5129896, 4860889, 4616979, 4395169, 4190397]
58772D190397j91642j80038j69945j62020j54349j44680j34115j24931j16467
58763B812210j06831r6865q8487q0791p1826o2672n5661m9993m3297l6161l1037
58752B088589k7797k4428k1025j9006j7525j4703j1442j0058j0093r284p725p273
58740A908230q001q967j1233j6133k1779k5254k7055k9422l1671l1512k9713k9040
58728A638450k9577k9400k8936l0137l2254l2797l1995l2008l2494l1348k9076
58717A298428k8071k8057k6585k3575k1182j9683j7547j5058j3854j3444j2149
58706A079223j0690j0899j1759j0829q659p573p132n164k376j366j870j514n20
58693I98872j102k979m134n343r107j4581j8239j9200j9402j9084j6879j3849
$$ y = [4190397, 3998755, 3818717, 3648772, 3486752, 3332403, 3187723, 3053608, 2928677, 2812210, 2705379, 2608514, 2520027, 2439236, 2367410, 2304738, 2249077, 2199084, 2155787, 2119626, 2088589, 2060792, 2036364, 2015339, 1996333, 1978808, 1964105, 1952663, 1942605, 1932512, 1923228, 1915503, 1908230, 1900229, 1891262, 1880029, 1863896, 1842117, 1816863, 1789808, 1760386, 1728715, 1697203, 1667490, 1638450, 1608873, 1579473, 1550537, 1520400, 1488146, 1455349, 1423354, 1391346, 1358852, 1327504, 1298428, 1270357, 1242300, 1215715, 1192140, 1170958, 1151275, 1133728, 1118670, 1104816, 1091372, 1079223, 1068533, 1057634, 1045875, 1035046, 1026387, 1018814, 1011682, 1006518, 1004142, 1002776, 1000906, 999392, 998872, 997770, 994791, 990657, 985314, 976207, 961626, 943387, 924187, 904785, 885701, 868822, 854973]
58681H54973j2562j2403j0486o953m663l950k336P52L502N531P704Q679O413K601
58667H36802R69J639J932J915L994P447Q720P051M796K506j232n429p389p557
58653H56164q561r857q701n846m509l884K39Q145J5346J9541K2808K6411K9013
58640I36309L0696L3292L6210L7133L7171L9859M4880M8555N0702N5038O2214
58629A412059O8683P3412P9665Q9009R9438J10550J24799J42271J59988J77595
58619B537469J98206K22351K46597K69114K90779L09631L20079L19051L07189
58610E020466K82959K41907J83648J13959L8434m0076j16297j81484k30361k64051
58600E049104k84410k91063k85813k74062k59248k40795k19366j98833j81095
$$ y = [854973, 842411, 830008, 819522, 812569, 807906, 803956, 801620, 802372, 805874, 811405, 819109, 827788, 834201, 836802, 837771, 839410, 841342, 843257, 847251, 854698, 863418, 870469, 875265, 877771, 876539, 871110, 863721, 856164, 847603, 837746, 829045, 823199, 818690, 814806, 815045, 823190, 838536, 858077, 880885, 907296, 936309, 967005, 1000297, 1036507, 1073640, 1110811, 1150670, 1195550, 1244105, 1294807, 1349845, 1412059, 1480742, 1554154, 1633819, 1722828, 1822266, 1932816, 2057615, 2199886, 2359874, 2537469, 2735675, 2958026, 3204623, 3473737, 3764516, 4074147, 4394226, 4713277, 5020466, 5303425, 5545332, 5728980, 5842939, 5881373, 5841297, 5725000, 5543516, 5313155, 5049104, 4764694, 4473631, 4187818, 3913756, 3654508, 3413713, 3194347, 2995514, 2814419]
58591B814419j64245j47617j33391j21491j08522r3632q0074o9193n8413m6876
58581A790965l7325l0546k3793j6735j3053j4028j6277j7979k1356k6718l0059
58570A543096k9214k6779k4409k0018j3169p504n102l838k810m731j0356j6112
58558A379054j9848k3436k7280k8143k5105k1985k0990j9562j6157j3461j3156
58547A149931j3095j2382j3590j7231j9726j9533j9637k1387k1789j9471j7450
58536I54640j7208j6095j3167j1440j1658j0298o593m902p057q975q139p710r784
58523H21614j1299j0398j0257j2672j4222j2698j0982j0906r619n926l574m341
58511G04720m435j701L38l81k47K833N057M084L823P023R954R524Q979J1334J3684
$$ y = [2814419, 2650174, 2502557, 2369166, 2247675, 2139153, 2045521, 1965447, 1896254, 1837841, 1790965, 1753640, 1723094, 1699301, 1682566, 1669513, 1655485, 1639208, 1621229, 1599873, 1573155, 1543096, 1513882, 1487103, 1462694, 1442676, 1429507, 1422003, 1416901, 1413063, 1410253, 1405522, 1395166, 1379054, 1359206, 1335770, 1308490, 1280347, 1255242, 1233257, 1212267, 1192705, 1176548, 1163087, 1149931, 1136836, 1124454, 1110864, 1093633, 1073907, 1054374, 1034737, 1013350, 991561, 972090, 954640, 937432, 921337, 908170, 896730, 885072, 874774, 868181, 863279, 856222, 847247, 839108, 831398, 821614, 810315, 799917, 789660, 776988, 762766, 750068, 739086, 728180, 718561, 712635, 709061, 704720, 700285, 698584, 698922, 698541, 698294, 701127, 706184, 710268, 714091, 721114, 731068, 740592, 749571, 760905, 774589]
58496G74589J3378J3418J6363J9113J9040J9095K1429K2271J8622J3974J1936
58485I63228J0132N810J361j106m514j0738j5908j7105j7564j9920k0846j7925
58473H54905j5233j6154j7186j4787j1934j1866j1859r370p740r541j0788q198
58461G10249n607o654p833n559l387n071p054n178k482k859l340j80L478L657
58447F62180L172N675Q161P190O507J0491J5792J7430J7610K0513K3831K3501
58435H22053K1446K0808J8912J2717N870K612K67m684q942q659p344r464j2150
58422H53442j1273r728j1372j2876j0129o575o621o970l237J085J327R35M795
58409G82803R618J0394J0158J3574J7051J5195J0980R367P080p09r528j2322j1438
$$ y = [774589, 787967, 801385, 817748, 836861, 855901, 874996, 896425, 918696, 937318, 951292, 963228, 973360, 979170, 980531, 979425, 974911, 964173, 948265, 931160, 913596, 893676, 872830, 854905, 839672, 823518, 806332, 791545, 779611, 767745, 755886, 746516, 738776, 729235, 718447, 710249, 704642, 697988, 690155, 684596, 681209, 676138, 669084, 663906, 661424, 658565, 655225, 655045, 658523, 662180, 665352, 671027, 679188, 686378, 692885, 703376, 719168, 736598, 754208, 774721, 798552, 822053, 843499, 864307, 883219, 895936, 901806, 904418, 904685, 900001, 891059, 882400, 875056, 865592, 853442, 842169, 832441, 821069, 808193, 798064, 791489, 784868, 777898, 774661, 775746, 777073, 778008, 782803, 792421, 802815, 812973, 826547, 843598, 858793, 869773, 879140, 886220, 885511, 875983, 863661, 852223]
58396H52223j3140j5693j3885j0012r321r642o422k796l731n557k503J822R04
58383G62247k216p29L036K614K07K220O764P872P612J1591J6934J7094J4307J4934
58369H64487J6796J3738Q405P695R732Q071M678N787Q966P452L466M081P751Q007
58355I79112O602R639J4530J4285J0961J1323J3076R108J633j763k268o140j0911
58342A049187r649n074m955p217m206K041L663K207M945R826R490O493Q897J4302
58328A079950J4201J0529J1714J5797J4157Q767Q948J3865J4931J2745J4836J9670
58316A240110J9764J7471K0559K5522K2870J5385J3062J3756P767j970m016L15
58304A390595r8m748l376L119M269P31K769R704J1440Q789J1519J7918J7408J1800
$$ y = [852223, 839083, 823390, 809505, 799493, 790172, 780530, 774108, 771312, 767581, 762024, 759521, 761343, 762247, 760031, 759302, 762338, 764952, 765159, 767379, 774143, 782015, 789627, 801218, 818152, 835246, 849553, 864487, 881283, 895021, 903426, 911121, 920853, 928924, 933602, 939389, 948355, 955807, 959273, 963354, 971105, 979112, 985714, 995353, 1009883, 1024168, 1035129, 1046452, 1059528, 1068636, 1070269, 1068506, 1066238, 1060098, 1049187, 1039538, 1034464, 1029509, 1022292, 1018086, 1020127, 1023790, 1025997, 1030942, 1040768, 1050258, 1056751, 1065648, 1079950, 1094151, 1104680, 1116394, 1132191, 1146348, 1155115, 1164063, 1177928, 1192859, 1205604, 1220440, 1240110, 1259874, 1277345, 1297904, 1323426, 1346296, 1361681, 1374743, 1388499, 1396266, 1394296, 1390280, 1390595, 1390497, 1385749, 1382373, 1385492, 1389761, 1390492, 1393261, 1402965, 1414405, 1423194, 1434713, 1452631, 1470039, 1481839]
58290A481839J2553J8640J8932J4708J7391K5542K7052K2732K4588L2048L3524
58279A729549L0136L3764M2907M5024M1397M4526N2419N1365M2679M0060M2142
58268B195968L5396K2741K0318K6840K5863J7823J9220L0133L3994L0057L3963
58257B492316M5383M7918M2363M6504O0473O6400O3873P0360Q4966Q8397Q1065
58246C190018Q3511R6550R9917R3195R7614J13784J19390J13019J17465J34824
58236D259287J42506J38716J46344J66299J74310J69821J79072K03468K16081
58227E795904K15838K31572K65129K86393K92678L14396L53560L78460L88431
58218H522361M18783M71693N11018N36075N87178O66669P32984P85676Q72194
$$ y = [1481839, 1494392, 1513032, 1531964, 1546672, 1564063, 1589605, 1616657, 1639389, 1663977, 1696025, 1729549, 1759685, 1793449, 1836356, 1881380, 1922777, 1967303, 2019722, 2071087, 2113766, 2153826, 2195968, 2231364, 2254105, 2274423, 2301263, 2327126, 2344949, 2364169, 2394302, 2428296, 2458353, 2492316, 2537699, 2585617, 2627980, 2674484, 2734957, 2801357, 2865230, 2935590, 3020556, 3108953, 3190018, 3273529, 3370079, 3469996, 3563191, 3660805, 3774589, 3893979, 4006998, 4124463, 4259287, 4401793, 4540509, 4686853, 4853152, 5027462, 5197283, 5376355, 5579823, 5795904, 6011742, 6243314, 6508443, 6794836, 7087514, 7401910, 7755470, 8133930, 8522361, 8941144, 9412837, 9923855, 10459930, 11047108, 11713777, 12446761, 13232437, 14104631]
58209A4104631R96353J110962J217139J373011J586728J808545K049564K390983
58201B6637916K851960L376159L973151M728342N648246O668004P850725R390766
58193G1125269J1388359J3863725J7047447K1358004K7004575L3942344M2157470
58186B37887193N1067499N7943708N7744573M6222818K4029650k688677k6235223
58179D45971541m1919693m9257802n0133410m6835425m1364013l5274166k9464198
58172A51722834k4239062j9706848j5974507j3011105j0626136q680542p151824
58165E2332810n971801m989321m129004l423132k859311k348004j858657j437882
58157B5315698j074216o86672k57272J70426O31524J229532J987440K868514L911446
$$ y = [14104631, 15100984, 16211946, 17429085, 18802096, 20388824, 22197369, 24246933, 26637916, 29489876, 32866035, 36839186, 41567528, 47215774, 53883778, 61734503, 71125269, 82513628, 96377353, 113424800, 134782804, 161787379, 195729723, 237887193, 288954692, 346898400, 404642973, 450865791, 474895441, 472206764, 445971541, 404051848, 354794046, 304660636, 257825211, 216461198, 181187032, 151722834, 127483772, 107776924, 91802417, 78791312, 68165176, 59484634, 52332810, 46361009, 41371688, 37242684, 33819552, 30960241, 28612237, 26753580, 25315698, 24241482, 23554810, 23297538, 23467964, 24099488, 25329020, 27316460, 30184974, 34096420]
58148C4096420N080941N916126N621527L765128Q12245k183775m366265n488064
58140D3254283n736176n412655m793188m089039l414041k802917k274240j846465
58132A2885562j509801j235785j014687q48613p19898o03535m99987m22832l66667
58123E663757l17041k77149k55509k42212k24325k08985k05812k03254j87311
58114C542159j66659j55079j46064j28388j09514j00138r2343p5998o0769n9579
58104B447628o5712o7296o8702p6950q2744p5902o4930o1410n9494n0064m0482
58093A733942m0936m5103m3163m0466m5063n0060m6345m0071m0126m1000l4866
58082A266743k8114k9105l1861k8225k3971k6764l0253k6283k1012k2940k6378
$$ y = [34096420, 39177361, 45093487, 50715014, 54480142, 55292387, 53108612, 48742347, 43254283, 37518107, 32105452, 27312264, 23223225, 19809184, 17006267, 14732027, 12885562, 11375761, 10139976, 9125289, 8276676, 7556778, 6953243, 6453256, 6030424, 5663757, 5346716, 5069567, 4814058, 4571846, 4347521, 4138536, 3932724, 3729470, 3542159, 3375500, 3220421, 3074357, 2945969, 2836455, 2736317, 2643974, 2567976, 2507207, 2447628, 2381916, 2314620, 2245918, 2168968, 2086224, 2010322, 1945392, 1883982, 1824488, 1774424, 1733942, 1693006, 1647903, 1604740, 1564274, 1519211, 1469151, 1422806, 1382735, 1342609, 1301609, 1266743, 1238629, 1209524, 1177663, 1149438, 1125467, 1098703, 1068450, 1042167, 1021155, 998215, 971837]
58071I71837k2688j6792j6905j8609j4572r616j1004j3824j0808o765q794j1959
58059H09501q990m659o418j0152r065p407j1487j6225j4343j0220j1113j3276
58047F86146j0084n372n530o706k875J642N15j936P95M453K353j300P90N411N676
58032F73978M080O229Q773N986J591J883L865J969l34K487O334M680Q04J060K601
58017G25986k86m206k947L12r58m385l997k048l887o767n261k317l515n780l253
58002F76691R59L51k842k499n37k565o338n941l120l360n014l204l10j685n017
57987F35569m614k167k701m087j322K878K647J75J566N240N354L232M407P463
57973F53640O655K848J354J577r36m733n006l212m290o815n904l205l923o472
$$ y = [971837, 949149, 932357, 915452, 896843, 882271, 872655, 861651, 847827, 837019, 830254, 821460, 809501, 800511, 795852, 789434, 779282, 770217, 762810, 751323, 735098, 720755, 710535, 699422, 686146, 676062, 670690, 665160, 658454, 655579, 657221, 657736, 655800, 656595, 661048, 663401, 662101, 662891, 668302, 673978, 678058, 684287, 693060, 699046, 700637, 702520, 706385, 708354, 708020, 710507, 716841, 721521, 722325, 723385, 725986, 725700, 721494, 718547, 718859, 717901, 713516, 709519, 707471, 703584, 696817, 691556, 689239, 685724, 679944, 676691, 677650, 678001, 675159, 672660, 672123, 669558, 663220, 657279, 654159, 650799, 645785, 642581, 642271, 640586, 635569, 630955, 628788, 626087, 622000, 620678, 623556, 626203, 626378, 627944, 633184, 638538, 641770, 646177, 653640, 660295, 663143, 664497, 666074, 665138, 660405, 655399, 652187, 647897, 641082, 635178, 631973, 628050, 621578]
57959F21578n169j065J8j817j669K09o53l675m387l302m452o696n604k323j622
57944E79371k833j623J059Q11j356j089J95k380p404r056p381p445r496r286p185
57929E14902p688j0530j1189r723j0298j2477j1755q280o536o660m546k59J964
57916D16925J810K901N100M876K989L704O639P411O084O958J0200J1638J0726
57903D97961J0780J1553R525N600M552O644P459N967N126M652J261l808n552l977
57889E57743m218p432r314q346p821q710q099n736n017o285o051l767k734l560
57875D70653l313j658j233j580M14L841M562K931L510O662P864O063N268O752
57861E10736P029N001L891M630M086J482k0M83J87j442j712p34j811m709n245
$$ y = [621578, 616409, 615344, 615362, 613545, 611876, 612085, 611432, 607757, 603370, 600068, 595616, 588920, 583316, 580993, 579371, 576538, 574915, 575974, 576785, 575429, 574340, 574535, 572155, 564751, 555695, 548314, 540869, 531373, 522087, 514902, 507214, 496684, 485495, 475772, 465474, 452997, 441242, 432962, 426426, 419766, 415220, 414961, 416925, 418735, 421636, 426736, 431612, 434601, 438305, 444944, 452355, 458439, 465397, 475597, 487235, 497961, 508741, 520294, 529819, 535419, 539971, 546615, 554074, 560041, 565167, 569819, 571080, 567272, 561720, 557743, 553525, 546093, 536779, 528433, 520612, 511902, 503803, 498067, 493050, 486765, 480714, 476947, 474213, 470653, 467340, 465682, 464449, 462869, 463283, 467124, 471686, 474617, 478127, 484789, 492653, 498716, 503984, 510736, 517765, 522766, 526657, 531287, 535373, 536855, 536835, 537318, 537505, 536063, 534351, 533617, 531806, 527097, 521852]
57846E21852k840j759l421m226k574j419k088k098r36j595m392n585m079l348
57832D81492m804n452m111l847o026p895q175r298j1933j3055j1628j0607j1257
57819C73404j0969q792p560q462q829p399o454o821o079l713k656l827m331k871
57805B84641j642j325L14L159L890K157J836M170N616M610M436O891R060R259
57791C37072J0365J4099J7276J6999J4720J2275Q761M106R75K67o75k994m153
57778D29093l265l441o216q595q483q136r293r733p762n581n102m750l248k285
57764C43203k647k039M90K318K016J983L690M823L842K907L430L271J231j59P51
57749C69110J699J057R31K706L940K846J602K088K553J715J828M263O251N525
$$ y = [521852, 519012, 517253, 513832, 509606, 507032, 505613, 503525, 501427, 500491, 498896, 494504, 488919, 484840, 481492, 476688, 471236, 467125, 463278, 457252, 449357, 441182, 431884, 419951, 406896, 395268, 384661, 373404, 362435, 353643, 346083, 337621, 328792, 321393, 314939, 308118, 302039, 298326, 295670, 291843, 287512, 284641, 282999, 281674, 281988, 285147, 289037, 291194, 293030, 297200, 302816, 307426, 311862, 318753, 327813, 337072, 347437, 361536, 378812, 395811, 410531, 422806, 431567, 435673, 436648, 436915, 436240, 433246, 429093, 425828, 422387, 416171, 407576, 399093, 390957, 381664, 371931, 364169, 358588, 353486, 348736, 345488, 343203, 340556, 338517, 339007, 341325, 343341, 345324, 349014, 353837, 357679, 360586, 364016, 367287, 368518, 368359, 369110, 370809, 371866, 372797, 375503, 379443, 382289, 383891, 385979, 388532, 390247, 392075, 396338, 402589, 408114]
57735D08114M286N124O813P525Q426J0561J1937J1068J0062J0956J2437J3271
57723E20580J5236J9456K3398K4705K4559K4346K2768J9317J6783J6890J7244
57712G45282J5884J5096J7261K0678K3055K5553K9781L4339L7997M2751N0072
57701A057749N7614O3407O9901P9938R2033J03522J15348J29747J46200J63465
57691B078924J82807K05464K29544K52885K76008K98761L16905L25436L22358
57682D489092L06017K72569K20320J53943Q0855O501o3646j21575j61186j82588
57672E000302j88108j77138j48907j06984n7111n071L7838N2034K1508n0211j40205
57661D237947k21835k77897l02796l00030k78925k49125k16082j82418j51221
$$ y = [408114, 412400, 417524, 424337, 431862, 440288, 450849, 462786, 473854, 483916, 494872, 507309, 520580, 535816, 555272, 578670, 603375, 627934, 652280, 675048, 694365, 711148, 728038, 745282, 761166, 776262, 793523, 814201, 837256, 862809, 892590, 926929, 964926, 1007677, 1057749, 1115363, 1178770, 1248671, 1328609, 1420642, 1524164, 1639512, 1769259, 1915459, 2078924, 2261731, 2467195, 2696739, 2949624, 3225632, 3524393, 3841298, 4166734, 4489092, 4795109, 5067678, 5287998, 5441941, 5522796, 5529297, 5465651, 5344076, 5182890, 5000302, 4812194, 4635056, 4486149, 4379165, 4322054, 4316983, 4354821, 4406855, 4428363, 4378152, 4237947, 4016112, 3738215, 3435419, 3135389, 2856464, 2607339, 2391257, 2208839, 2057618]
57652B057618j24787j02077q1150o2657m7867l5245k2663j1090k337M974J3381
57641A586100K2339K9992L7491M7447N9484P1309Q3009R6512J11842J27674J44517
57630B417716J63773J84624K05137K25115K44599K60863K70135K70818K61778
57621D504558K39357K00193J45889Q1641J1770n9851j26910j82806k25057k54464
57611D334320k71268k75767k71151k61530k47956k29882k09300j89627j71644
57602B206195j54262j38227j25178j14052j02402r0555q0790p3168o5870n8820
57592A202871n3350m8979m4100l9183l5751l3098k9491k5702k3689k2717k0495
57581H26316j7380j5560j4882j3334j1077j0148j0545j0320r147q236p193m649
$$ y = [2057618, 1932831, 1830754, 1749604, 1686947, 1639080, 1603835, 1581172, 1570082, 1567745, 1572719, 1586100, 1608439, 1638431, 1675922, 1723369, 1782853, 1854162, 1937171, 2033683, 2145525, 2273199, 2417716, 2581489, 2766113, 2971250, 3196365, 3440964, 3701827, 3971962, 4242780, 4504558, 4743915, 4944108, 5089997, 5171638, 5183408, 5123557, 4996647, 4813841, 4588784, 4334320, 4063052, 3787285, 3516134, 3254604, 3006648, 2776766, 2567466, 2377839, 2206195, 2051933, 1913706, 1788528, 1674476, 1572074, 1481519, 1400729, 1327561, 1261691, 1202871, 1149521, 1100542, 1056442, 1017259, 981508, 948410, 918919, 893217, 869528, 846811, 826316, 808936, 793376, 778494, 765160, 754083, 743935, 733390, 723070, 713923, 705687, 698494, 693845]
57569F93845j550j69k04N90K315L204L463N130Q159J0363J1232J2418J4418J6047
57555G79261J7099J8475J9920K0661K1746K4660K8346L0860L3230L8040M4849
57544A077147N0870N5718O1644O9395P7691Q6657R7950J11438J25422J39970J56448
57533B110350J73885J89494K02583K14076K22120K22045K10895J88439J54114
57524C888001J07334N1341p259o3448j14835j57992j88423k05294k12350k12960
57514B884115k07551j96564j82232j66260j48974j31696j16756j04322r2278q0003
57504A457479o9181o0323n1889m3496l6699l1715k6582k0600j5413j1817q450
57493A081314m527r93J835N015Q687J1863J4988J9749K5928L1604L6891M4163
$$ y = [693845, 692295, 692126, 691922, 692512, 694827, 698031, 701494, 706624, 714783, 725146, 736378, 748796, 763214, 779261, 796360, 814835, 834755, 855416, 877162, 901822, 930168, 961028, 994258, 1032298, 1077147, 1128017, 1183735, 1245379, 1314774, 1392465, 1479122, 1577072, 1688510, 1813932, 1953902, 2110350, 2284235, 2473729, 2676312, 2890388, 3112508, 3334553, 3545448, 3733887, 3888001, 3995335, 4046676, 4039417, 3975969, 3861134, 3703142, 3514719, 3309425, 3097075, 2884115, 2676564, 2480000, 2297768, 2131508, 1982534, 1850838, 1734082, 1629760, 1537482, 1457479, 1388298, 1327975, 1276086, 1232590, 1195891, 1164176, 1137594, 1116994, 1101581, 1089764, 1081314, 1076787, 1075794, 1077629, 1082644, 1091331, 1103194, 1118182, 1137931, 1163859, 1195463, 1232354, 1276517]
57481A276517N3925O3828P2566Q1629R2332J04269J17456J32842J49783J65948
57471B311095J80460J94018K05372K10824K07776J95518J72200J35098Q5180K8013
57461C925554l0826q7832j38661j77754k02982k17236k23640k22471k14213k01924
57451B208015j88258j73121j56326j39790j25122j11716r8969q7897p8875p0416
57441I77525o1796n4378m8940m4307l9866l6620l4463l1482k7425k4671k4121
57430E49456k3285k0422j7344j6011j5354j3852j2445j2323j2357j1212r878r662
57418C75311r734q883p820p508p099n686m340m351n058n247n202n590n823n184
57404B87786m165l362k498j657j649k260k003o44J83k22n05O2L40p7K09J485J738
$$ y = [1276517, 1330442, 1394270, 1466836, 1548465, 1640797, 1745066, 1862522, 1995364, 2145147, 2311095, 2491555, 2685573, 2890945, 3101769, 3309545, 3505063, 3677263, 3812361, 3897541, 3925554, 3894728, 3806896, 3668235, 3490481, 3287499, 3070263, 2846623, 2624152, 2409939, 2208015, 2019757, 1846636, 1690310, 1550520, 1425398, 1313682, 1214713, 1126816, 1047941, 977525, 915729, 861351, 812411, 768104, 728238, 691618, 657155, 625673, 598248, 573577, 549456, 526171, 505749, 488405, 472394, 457040, 443188, 430743, 418420, 406063, 394851, 384973, 375311, 365577, 356694, 348874, 341366, 334267, 328581, 324241, 319890, 314832, 309585, 304383, 298793, 292970, 287786, 283621, 280259, 277761, 276104, 274455, 272195, 270192, 269548, 269731, 269509, 269004, 269066, 269406, 269329, 269538, 271023, 272761]
57387B72761L0j622j543r14j183j506r19n18j314k097j650r69j213j488p42Q2
57371B55195j48p06o73q25j940l055l207l094l409l479l054l269m199l886j583
57356B18668M14K11q88j041q65j411j611l34J083J034N43J355K840L312K893K713
57340B28916K661K197J969K488K645J498P9m28n85j031q41M82J393Q31L79J680
57324B44333L591M201L753L366K764J672J511L121M669M340L366L741M800M876
57310B94104M546N309O504O578O142O816Q066Q099P051O676P552Q997J0871J3268
57296D00579J5255J6041J6523J7784J9226K0019K0992K3111K5513K7075K8431
57285F30549L0336L1748L1731L1532L2427L3181L2012K9360K6272K1871J5158
$$ y = [272761, 272791, 271169, 269626, 268712, 267529, 266023, 265104, 264586, 263272, 261175, 259525, 258556, 257343, 255855, 255113, 255195, 255047, 254341, 253668, 252843, 250903, 247848, 244641, 241547, 238138, 234659, 231605, 228336, 224137, 220251, 218668, 219082, 219293, 218405, 217364, 216499, 215088, 213477, 213143, 214226, 215260, 215803, 217158, 219998, 223310, 226203, 228916, 231577, 233774, 235743, 238231, 240876, 242374, 242453, 242025, 241440, 240409, 239568, 240050, 241443, 242274, 242653, 244333, 247924, 252125, 255878, 259244, 262008, 263680, 265191, 268312, 272981, 277321, 280687, 284428, 289228, 294104, 298650, 303959, 310463, 317041, 323183, 329999, 338065, 346164, 353215, 359891, 367443, 376440, 387311, 400579, 415834, 431875, 448398, 466182, 485408, 505427, 526419, 549530, 575043, 602118, 630549, 660885, 692633, 724364, 755896, 788323, 821504, 853516, 882876, 909148, 931019, 946177]
57274I46177P558Q95n488j2850j9983k5002k8495l1935l4459l4446l2789l1509
57262F97674l0398k8158k5442k3638k2010j9313j6747j5979j5659j3518j0621
57251D76191r670j0131r098o260m121l651l539l407m095m886m002j849n33k69
57237D10680M69J522J169m07j092l08N47J006J777K306J382RM40K416L588L512
57221D29016L860M765M568L434L579N354O479N869N123N464O145O514O983P397
57207E04550P031O534P268Q599Q607P498P364Q471Q951Q424Q568R698J0065R299
57193F20927R345J1049J2796J3379J3470J3455J2612J1288J1154J2434J3425J3463
57181G68797J3821J5032J6009J6533J7922K0449K2594K3630K4499K5596K6149
$$ y = [946177, 953735, 954630, 949142, 936292, 916309, 891307, 862812, 830877, 796418, 761972, 729183, 697674, 667276, 639118, 613676, 590038, 568028, 548715, 531968, 515989, 500330, 486812, 476191, 466521, 456390, 447292, 441032, 436911, 433260, 429721, 426314, 422219, 417333, 413331, 411482, 410949, 410680, 411149, 412671, 413840, 413433, 412341, 412033, 412580, 413586, 415363, 417669, 419051, 419060, 419500, 421916, 425504, 429016, 432876, 437641, 442209, 445643, 449222, 454576, 461055, 466924, 472047, 477511, 483656, 490170, 497153, 504550, 511581, 518115, 525383, 533982, 542589, 550087, 557451, 565922, 574873, 583297, 591865, 601563, 611628, 620927, 630272, 641321, 654117, 667496, 680966, 694421, 707033, 718321, 729475, 741909, 755334, 768797, 782618, 797650, 813659, 830192, 848114, 868563, 891157, 914787, 939286, 964882, 991031]
57170I91031K6294K7076K7937K7000K4367K2359K1878K1398K0164J9472J9949
57159A248925K0522K0949K2509K5189K7065K7567K8650L1581L5097L7699L9333
57148A565086M0106L9825L9586M1028M3411M4262M3439M3506M5319M6656M6243
57137B038467M5690M6120M6191M5021M3968M3827M3247M1595M0556M1126M1841
57126B517649M1621M1739M3310M5502M7789N1138N5400N8410N9406O0554O3204
57115C085722O5580O6051O5962O7143O9557P3548Q1496R4688J10843J27270J44439
57104D052299J64453J88405K17363K53672K99049L53713M19316N00241N99713
57095G048224P17057Q50746J001213J168059J347118J532810J720451J903429
$$ y = [991031, 1017325, 1044401, 1072338, 1099338, 1123705, 1146064, 1167942, 1189340, 1209504, 1228976, 1248925, 1269447, 1290396, 1312905, 1338094, 1365159, 1392726, 1421376, 1452957, 1488054, 1525753, 1565086, 1605192, 1645017, 1684603, 1725631, 1769042, 1813304, 1856743, 1900249, 1945568, 1992224, 2038467, 2084157, 2130277, 2176468, 2221489, 2265457, 2309284, 2352531, 2394126, 2434682, 2475808, 2517649, 2559270, 2601009, 2644319, 2689821, 2737610, 2788748, 2844148, 2902558, 2961964, 3022518, 3085722, 3151302, 3217353, 3283315, 3350458, 3420015, 3493563, 3575059, 3669747, 3780590, 3907860, 4052299, 4216752, 4405157, 4622520, 4876192, 5175241, 5528954, 5948270, 6448511, 7048224, 7765281, 8616027, 9617240, 10785299, 12132417, 13665227, 15385678, 17289107]
57087A7289107K071337K214540K328027K407387K444124K429064K356558K218998
57079C5759142K000117J684125J276391Q10931L32740j28185n67563r97197j426703
57070C8743798j849448k239379k559325k775783k871603k850419k732628k546777
57062A8318436k321084k078586j836194j605329j392634j201295j032666q86573
57054E964075p60712o51638n56931m75519m06030l46575k96251k54881k20994
57045A994544j92049j67013j46517j30009j15357j01897r1099q3225p6081o8425
57035H22872o1714n6991n2777m7813m3226l9993l6864l2818k9105k6743k4417
57024C70411k1096j8285j7311j6712j4736j2226j0536q813n932k968j179M47L033
$$ y = [17289107, 19360444, 21574984, 23903011, 26310398, 28754522, 31183586, 33540144, 35759142, 37759259, 39443384, 40719775, 41530706, 41863446, 41735261, 41167698, 40170501, 38743798, 36894350, 34654971, 32095646, 29319863, 26448260, 23597841, 20865213, 18318436, 15997352, 13918766, 12082572, 10477243, 9084609, 7883314, 6850648, 5964075, 5203363, 4551725, 3994794, 3519275, 3113245, 2766670, 2470419, 2215538, 1994544, 1802495, 1635482, 1488965, 1358956, 1243599, 1141702, 1050603, 967378, 891297, 822872, 761158, 704167, 651390, 603577, 560351, 520358, 483494, 450676, 421571, 394828, 370411, 349315, 331030, 313719, 297007, 282271, 270045, 259509, 250696, 244764, 241796, 240617, 241064, 244097]
57011B44097N309N883N914O949Q166Q526R354J2171J6114K0293K6188L4990M5458
56998D49412N7430P4159R7847J27069J62611K09134K61357K91740K65189J71930
56988B167878M0785q3063j69500k13379k23552k11129j86114j57490j32230j14095
56978G18111j03166r6430r0044q1991p2388o1842n0867m0461l1397k3028j4560
56967E1937p158k693n92J788N636R667J2763J5472J8617K2564K7921L4680M0063
56954B30665L9449L0543J5500j210j5630k5239k9294k9151k6965k3685j9228j4233
56942A31522r976o677l464j11K731N077P919J1897J6806K2478K9046L6450M4138
56929B87836N0463N1693M3432K5019J716j9220l3885m2111m4621m2524l8288l4246
$$ y = [244097, 249406, 255289, 261203, 268152, 276318, 284844, 294198, 306369, 322483, 342776, 368964, 403954, 449412, 506842, 581001, 678848, 805917, 968528, 1177662, 1439019, 1730759, 1995948, 2167878, 2208663, 2125600, 1956100, 1742721, 1519169, 1308040, 1121926, 964436, 832206, 718111, 614945, 518515, 428471, 346480, 274092, 212250, 161383, 120922, 89525, 66497, 51937, 44779, 42086, 41494, 43282, 48918, 58585, 71348, 86820, 105437, 128001, 155922, 190602, 230665, 270114, 300657, 316157, 314947, 299317, 274078, 244784, 215633, 188668, 164983, 145755, 131522, 121546, 114869, 111405, 111294, 114025, 119102, 127021, 138918, 155724, 178202, 207248, 243698, 287836, 338299, 389992, 433424, 458443, 460159, 440939, 407054, 364943, 320322, 277798, 239510, 205264]
56917B05264l0353k5566k0574j6880j4099j0921p966o834o932o129m245k969k577
56904D9219j693k48L23l1K46J442K189K254L056N010O898Q302J0232J2978J5758
56889A15935J8820K3439K9536L5609M1120M6143M8385M3740L1132J4539q14j2310
56877D35274j9583k2881k3123k1697j9158j5312j0936p506m924j449L674R451
56865C01830J5374K2316L0668L9726M9693O2231P7458R1217R6234Q5986N8777
56854I31510K0070j9330m9563o7098p3853p2733o5988n6375m6510l6810k6390
56843D36930j5746o268K393J1903K2546L3698M6441O2754Q2444J03880J26699
56832I07674J49072J61943J51440J10635M7259k1347p8984j16702j33277j33348
$$ y = [205264, 174911, 149345, 128771, 111891, 97792, 86871, 78905, 72071, 65139, 59010, 54765, 51796, 49219, 47526, 47278, 47601, 47570, 47816, 49258, 51447, 53701, 56757, 61767, 68665, 76967, 87199, 100177, 115935, 134755, 158194, 187730, 223339, 264459, 310602, 358987, 402727, 433859, 448398, 447584, 435274, 415691, 392810, 369687, 347990, 328832, 313520, 302584, 295078, 290154, 288705, 292379, 301830, 317204, 339520, 370188, 409914, 459607, 521838, 599296, 690513, 786747, 872733, 931510, 951580, 932250, 882687, 815589, 741736, 669003, 603015, 546640, 500130, 463320, 436930, 421184, 414916, 417309, 429212, 451758, 485456, 531897, 594651, 677095, 780975, 907674, 1056746, 1218689, 1370129, 1480764, 1528023, 1506676, 1427692, 1310990, 1177713, 1044365]
56822A044365j23821j09743r3356p6372o0732m6850l3680k1158j0388r40R488
56811D76813K1998L5529M9747O6393Q6291J06233J19182J16538R1958M6840p369
56800A210153n5469q8348j05541j09879j03968r1691p8037o5318n2622l9993k9741
56789C89546k2533j5901q117k79O815J4381K2930L1351M0059N0853O1408O3880
56777F34393N2278K8725M88k6150m7041n9134o2184n9617n4912m8738m1207l4181
56765B82720k8960k4326j9289j5366j3673j2282r252n966m670m751m235l100k422
56752A34428j926j004n34j236j833j148l61q64j681j358p11j152j966j790j255
56737A15609j667k392k064j101q25j145j308j656k573k991j963n18o9l59o06j220
$$ y = [1044365, 920544, 810801, 717445, 641073, 580341, 533491, 499811, 478653, 468265, 467325, 476813, 498811, 534340, 584087, 650480, 736771, 843004, 962186, 1078724, 1170682, 1217522, 1210153, 1154684, 1066336, 960795, 850916, 746948, 655257, 577220, 511902, 459280, 419287, 389546, 367013, 351112, 342995, 342716, 349531, 363912, 386842, 418193, 458252, 509105, 570513, 634393, 686671, 715396, 715884, 689734, 642693, 583559, 521375, 461758, 406846, 358108, 316901, 282720, 253760, 229434, 210145, 194779, 181106, 168824, 159572, 153606, 148936, 144185, 139950, 136850, 134428, 132502, 131498, 130964, 129728, 127895, 126747, 126386, 125522, 123841, 122483, 121772, 120620, 118654, 116864, 115609, 113942, 111550, 109486, 108385, 107560, 106415, 105107, 103451, 100878, 97887, 95924, 95406, 95337, 94978, 94372, 93152]
56721I3152k408k847j644q4M58O49J345J606O43j74M71J383J013K12M52R84M19
56704I5630m76k13O14N86K13P73J681J535P32N17N33k22j052o08N87J072R32J248
56686A04082J951K326K652L332L433K191Q08P21J183O47o22j369j642k159k480
56671A15054j884r86o61m46K31N63j00o74j91L05l39j220j070m59k86M9R42R75
56653A09803o30j952j254N8m5p24j94Q15O50L7N46J321O21o96n13Q59J585J738
56635A12025K597L498K752R57K50Q26J152R72J208J548J001J85L65R37N53j31
56619A30695L33J253R39l9J57J209J275M35M36J408J782J181O79N06J7m60j20
56602A41686M34P0p72r94r42j382j593q09k30j061j974j204K58M22k36r0L67k01
$$ y = [93152, 90744, 87897, 86253, 86169, 86627, 87276, 88621, 90227, 90870, 90696, 91167, 92550, 93563, 93775, 94227, 95211, 95630, 95154, 94941, 95555, 96141, 96354, 97127, 98808, 100343, 101075, 101592, 102125, 101903, 100851, 100243, 100830, 101902, 102834, 104082, 106033, 108359, 111011, 114343, 117776, 119967, 120775, 121496, 122679, 123326, 122704, 121335, 119693, 117534, 115054, 113170, 112184, 111523, 111077, 111308, 111871, 111771, 111097, 110906, 111211, 110872, 109652, 108582, 108123, 107837, 107886, 108828, 109803, 109173, 107221, 105967, 106025, 105980, 105256, 105062, 105877, 106527, 106564, 107110, 108431, 109052, 108356, 107843, 108702, 110287, 112025, 114622, 118120, 120872, 121829, 122079, 122905, 124057, 125029, 126237, 127785, 128786, 128971, 129336, 130273, 130826, 130695, 131028, 132281, 133220, 133181, 133338, 134547, 135822, 136257, 136693, 138101, 139883, 141064, 141743, 142249, 142266, 141806, 141686, 142120, 142190, 141418, 140424, 139482, 138100, 136507, 135698, 135468, 134407, 132433, 131229, 131487, 131909, 131673, 131583, 131950, 131749]
56584A31749r14k21Q62M72m61Q7J268R17j77M75K500L351K752K491K600J742P50
56567A50243J562L237L169J779J801L312L786K926K928L979L940K724K648L922
56553A91956M094K588J680K215K329J259O17R26N89q47j837k010k804m268m616
56538A91871l702l481m352m419l087j996j776j225l63q32k474k956j600l54j80
56523A59074J32Q61N23r79j641q35l62j124j808j662j642j984j639p89r58k076
56507A43091k381j697j704k574k590j573j309k077k144j253j103j795j363L27
56493A19855Q85m57j445p41J55L6k0R07J958K387K544K382J508R59K118L882L927
56476A40840K601K236K819K239P89J149L492M865M097L284L580L550K604K136
$$ y = [131749, 130835, 130614, 131476, 131948, 131487, 131574, 132842, 133759, 133582, 134057, 136557, 139908, 142660, 145151, 147751, 149493, 150243, 151805, 155042, 158211, 159990, 161791, 165103, 168889, 171815, 174743, 178722, 182662, 185386, 188034, 191956, 196050, 198638, 200318, 202533, 204862, 206121, 206738, 207664, 208253, 207406, 205569, 203559, 200755, 196487, 191871, 188169, 184688, 180336, 175917, 172830, 170834, 169058, 167833, 167470, 166638, 164164, 161208, 159608, 159254, 159074, 159206, 160067, 160590, 159611, 157970, 157135, 156773, 155649, 153841, 152179, 150537, 148553, 146914, 146125, 145167, 143091, 140710, 139013, 137309, 134735, 132145, 130572, 129263, 127186, 125042, 123789, 122686, 120891, 119528, 119855, 120740, 120283, 118838, 118097, 118252, 118288, 118268, 119175, 121133, 123520, 126064, 128446, 129954, 130913, 133031, 136913, 140840, 143441, 145677, 148496, 150735, 151524, 152673, 156165, 161030, 165127, 168411, 171991, 175541, 178145, 180281]
56462A80281K362J806O95R64K289K153M98J4J084R70j066k342j705j229j742j227
56446A83805P14J376k42j484o57M89N87Q90J914J911M31n50n66j682m071m908
56430A77957l278j955k539l175k786l112m654n071l606k760l614l895k720k603
56416A32189m583n982n398n305p206q771q385q052q871q133l915J484N523Q828
56402G3423J2004J3222J1890J0642J0935J0557Q216O384O803P327O138M941N190
56389A87672N123L471K064K015J499j48m69J325K268J102J001L758O166N582M159
56374B26588L989L003k55k681j693J76J9n18O67J588K40j009J76J399Jj670l59
56357B29661K220K621J474J340J711Q94M1Q59J989J680J391K821M273L853L217
$$ y = [180281, 182643, 184449, 185144, 186108, 188397, 190550, 191048, 191062, 192146, 193116, 192050, 189708, 188003, 186774, 185032, 183805, 184519, 185895, 185653, 184169, 183512, 184001, 184588, 185478, 187392, 189303, 189734, 189184, 188618, 186936, 182865, 177957, 174679, 172724, 170185, 167010, 164224, 161112, 156458, 151387, 147781, 145021, 141407, 137512, 134792, 132189, 127606, 121624, 116226, 110921, 103715, 94944, 86559, 78507, 69636, 61503, 57588, 59072, 64595, 73423, 85427, 98649, 110539, 121181, 132116, 142673, 150889, 157273, 164076, 171403, 177541, 182482, 187672, 192795, 196266, 198330, 200345, 201844, 201696, 201227, 202552, 204820, 205922, 206923, 210681, 216847, 222429, 226588, 230577, 233580, 233325, 230644, 228951, 229127, 229146, 228628, 229295, 230883, 231123, 230114, 230290, 231689, 231690, 230020, 229661, 231881, 234502, 235976, 237316, 239027, 239921, 239962, 240821, 242810, 244490, 245881, 248702, 252975, 256828, 260045]
56342B60045M366N788N572N166O369P733P700P868R465J0170Q208O094O485P808
56328C58837P839P871R490J0952J0616J0202J1011J0935Q874P566Q249P394L033
56315D72869p87o21M24j491m206m287l562m976o468n201l607m869o424m413q81
56300D21500k2q04K72K339K585K304M159O375N917M524N551P683P911P635R766
56285D87695J2689J3312J3148J5313J8420J9622K0484K3706K7190K7749K7594
56274G06922L0626L5466L8645M1584M7594N5060O0471O5356P3320Q3060R1211
56263A329315R9354J11161J25314J38216J51003J66790J83581J97073K07864K18883
56253B928554K28296K32095K30930K27265K18632K01129J76851J50301J20434
$$ y = [260045, 264411, 270199, 275771, 280937, 287306, 295039, 302739, 310607, 320072, 330242, 338450, 344544, 351029, 358837, 366676, 374547, 384037, 394989, 405605, 415807, 426818, 437753, 446627, 454193, 462442, 469836, 472869, 472082, 471461, 471885, 470394, 466188, 461901, 458339, 453363, 446895, 441694, 438087, 433218, 426794, 422381, 421500, 421478, 420674, 420946, 423285, 425870, 428174, 432333, 438708, 444625, 449149, 454700, 462383, 470294, 477929, 487695, 500384, 513696, 526844, 542157, 560577, 580199, 600683, 624389, 651579, 679328, 706922, 737548, 773014, 811659, 853243, 900837, 955897, 1016368, 1081724, 1155044, 1238104, 1329315, 1428669, 1539830, 1665144, 1803360, 1954363, 2121153, 2304734, 2501807, 2709671, 2928554, 3156850, 3388945, 3619875, 3847140, 4065772, 4266901, 4443752, 4594053, 4714487]
56244D714487Q4070M4436Q186k3577n3293p8883r6158j06957j16351j23746j25181
56233D127033j22330j20563j19929j16717j12244j11451j14208j16502j18636
56224C074453j23681j29461j30966j29389j29952j32093j30683j25725j21863
56215A920640j19218j13687j05525r8799r3114q4629p4512o7565o3339n7315m9882
56204I93055m5307m2759l7621l0796k7470k7253k4900k0164j7680j7544j5489
56193F86072j1871j1052j2143r863m509j609j833n88K626L840L298N151Q765R710
56179F65994Q866J0961J4749J4602J1230J0502J2200J0534N614L469M563L161
56167G76445j481m031l632m854p689p375m558m805p544o555j929k16k124j499
$$ y = [4714487, 4798557, 4842993, 4851179, 4827602, 4774309, 4695426, 4599268, 4492311, 4375960, 4252214, 4127033, 4004703, 3884140, 3764211, 3647494, 3535250, 3423799, 3309591, 3193089, 3074453, 2950772, 2821311, 2690345, 2560956, 2431004, 2298911, 2168228, 2042503, 1920640, 1801422, 1687735, 1582210, 1483411, 1390297, 1305668, 1231156, 1163591, 1100252, 1042937, 993055, 947748, 904989, 867368, 836572, 809102, 781849, 756949, 736785, 719105, 701561, 686072, 674201, 663149, 651006, 641143, 636634, 635025, 633192, 632604, 635230, 639070, 642368, 647519, 656284, 665994, 674860, 685821, 700570, 715172, 726402, 736904, 749104, 759638, 765252, 768721, 773284, 776445, 774964, 770933, 767301, 762447, 754758, 747383, 742825, 738020, 730476, 723921, 721992, 721776, 719652, 718153]
56153G18153K539M230K897M347R279J1904J1552J4029J9982K3587K4313K8437
56141H75249L7292M5726N3506O6421Q4543J01491J16534J34868J54339J64828
56131A834797J62754J53813J40020J17788R0911P1365O3654O0846N8315N7952
56121B812215N6591M5050K2880R49j4177k5672l4346l5742l2802l6890n1817p0007
56109B636232q7387j07547j28033j38177j35301j28550j22451j11512r5214q2484
56099A499576p6159o8406n6724m9044m7663m3985l4960k8940k9184k7432k0194
56088A016885j5436j6589j5772r616n897p695o972p99K230j214k358K682N567
56075I45016K546J808O661Q484M016K428P378R577N159L592R023J1984Q206P110
$$ y = [718153, 720692, 724922, 727819, 732166, 741445, 753349, 764901, 778930, 798912, 822499, 846812, 875249, 912541, 958267, 1011773, 1078194, 1162737, 1264228, 1380762, 1515630, 1669969, 1834797, 1997551, 2151364, 2291384, 2409172, 2500083, 2571448, 2635102, 2695948, 2754263, 2812215, 2868806, 2913856, 2936736, 2937685, 2923508, 2897836, 2863490, 2827748, 2794946, 2758056, 2706239, 2636232, 2548845, 2441298, 2313265, 2175088, 2039787, 1911237, 1788786, 1677274, 1582060, 1499576, 1423417, 1355011, 1298287, 1249243, 1201580, 1157595, 1122635, 1093695, 1064511, 1037079, 1016885, 1001449, 984860, 969088, 959472, 953575, 945880, 938908, 938109, 940339, 939125, 936767, 939449, 945016, 947562, 949370, 956031, 964515, 968531, 970959, 978337, 987914, 993073, 996665, 1005688, 1017672, 1025878, 1032988]
56061A032988J2723J5073R888P568J2976J5756J0881Q852J4941J8463J3736J1434
56049A185279J7491K1301J6866J4931K1700K6330K2287K0127K6096K9457K4328
56038A426193K2268K9436L3596K7958K5162L2848L8582L4313L2133L9786M4748
56027A787023L9201L6223M3998M8849M1834L6729M3108M7456M0346L5833M3702
56016B244302M9470M2905L9096M9378N9248N7497N8649P3011Q3855P9007P5313
56005B911731Q6344R6220R1878Q9855J03346J14836J10383J08311J23738J38300
55995C974942J36340J36339J53859J69227J66193J65476J84257K01094J98511
55986E486238K00053K25369K50543K54960K63681K98715L34055L46697L64465
$$ y = [1032988, 1045711, 1060784, 1070672, 1078240, 1091216, 1106972, 1117853, 1126705, 1141646, 1160109, 1173845, 1185279, 1202770, 1224071, 1240937, 1255868, 1277568, 1303898, 1326185, 1346312, 1372408, 1401865, 1426193, 1448461, 1477897, 1511493, 1539451, 1564613, 1597461, 1636043, 1670356, 1702489, 1742275, 1787023, 1826224, 1862447, 1906445, 1955294, 1997128, 2033857, 2076965, 2124421, 2164767, 2200600, 2244302, 2293772, 2336677, 2375773, 2425151, 2484399, 2541896, 2600545, 2673556, 2757411, 2836418, 2911731, 2998075, 3094295, 3186173, 3276028, 3379374, 3494210, 3604593, 3712904, 3836642, 3974942, 4111282, 4247621, 4401480, 4570707, 4736900, 4902376, 5086633, 5287727, 5486238, 5686291, 5911660, 6162203, 6417163, 6680844, 6979559, 7313614, 7660311, 8024776]
55977H024776M12572M62729M89412N23988N94986O70184P20378P82009Q89204
55968A3570238J006251J100996J218868J404328J620549J835368K110337K507235
55960B6374170K988591L516902M159601M976880N914581O952403Q243241R948999
55952G3075368J2089276J4759059J8323704K3133180K9230917L6597352M5129100
55945B52337956N3374617N7318512N1870183L4948943J0180664j5034004l4294825
55938D10702046m5220777m8818212m7299224m2784342l7017759l1200572k5874712
55931A32486448k1182599j7215088j4020851j1479846r407798p731913o434936
55924D5013417n418996m563755l848591l296465k858696k462076k111049j842423
$$ y = [8024776, 8437348, 8900077, 9389489, 9913477, 10508463, 11178647, 11899025, 12681034, 13570238, 14576489, 15677485, 16896353, 18300681, 19921230, 21756598, 23866935, 26374170, 29362761, 32879663, 37039264, 42016144, 47930725, 54883128, 63126369, 73075368, 85164644, 99923703, 118247407, 141380587, 170611504, 207208856, 252337956, 305712573, 363031085, 414901268, 449850211, 460030875, 444996871, 410702046, 365481269, 316663057, 269363833, 226579491, 189561732, 158361160, 132486448, 111303849, 94088761, 80067910, 68588064, 59180266, 51448353, 45013417, 39594421, 35030666, 31182075, 27885610, 25026914, 22564838, 20453789, 18611366]
55916A8611366j629552j422131j232869j098710r98752q89834p83628p13904o64202
55907I177784n98322n28310m85729m57212m11584l61083l35457l23098k95088
55898E381901k61488k48807k46284k27210k00600j91191j90042j73553j50701
55889C492025j44554j46378j33383j13332j07997j10175r9514q3768q3018q9216
55879B380690q1566o6676o4305o8237n9642m5245m4541n2112m9162m0128m2064
55868A767012m9592m5392l4732l5369m3377m1975l4511l6198m2510l7699k6028
55857A339629k3482k6605k0060p287l619o025Q41J4718K0134J6498J4613J1668
55845A331023l044k3136l2510l2509l6533m3399m1624l4450l4908m0705l8949
$$ y = [18611366, 16981814, 15559683, 14326814, 13228104, 12229352, 11339518, 10555890, 9841986, 9177784, 8579462, 8051152, 7565423, 7108211, 6696627, 6335544, 6000087, 5676989, 5381901, 5120413, 4871606, 4625322, 4398112, 4197512, 4006321, 3816279, 3642726, 3492025, 3347471, 3201093, 3067710, 2954378, 2846381, 2736206, 2636692, 2552924, 2469906, 2380690, 2299124, 2232448, 2168143, 2099906, 2040264, 1995019, 1950478, 1898366, 1849204, 1809076, 1767012, 1717420, 1672028, 1637296, 1601927, 1558550, 1516575, 1482064, 1445866, 1403356, 1365657, 1339629, 1316147, 1289542, 1269482, 1262195, 1258576, 1252551, 1253392, 1268110, 1288244, 1304742, 1319355, 1331023, 1327979, 1304843, 1272333, 1239824, 1203291, 1159892, 1118268, 1083818, 1048910, 1008205, 969256]
55834I69256l1357l0278l4050l0618k1770j9824k3645k1396j3891j2270j5482
55823G14675j2746n706n856j2238j3381r179r609j3867j1874m667k708n578l467
55810F03799K995M198R38K703Q316P795J916O81L827J999m124n009j339k914r454
55795F16327j1196p985r209j5119j6572j3117j3378j7381j6399j0554r004j2293
55783D64120j1765o940o250r920r122l046j58j757p94K182j378j1153j6986j6317
55769C70716j6801k0104j9027j2682r030j0089r312n549n042p857o917k244j629
55756B44433n491n600n95J815p4O75N104N753J244q05J783K211j517l003o51j009
55740B44273n647p697m768k787l894k938J046K153o18j054K032K325j573l375
$$ y = [969256, 937899, 907621, 873571, 842953, 821183, 801359, 777714, 756318, 742427, 730157, 714675, 701929, 696223, 690367, 678129, 664748, 655569, 645960, 632093, 620219, 615552, 612844, 607266, 603799, 606794, 610992, 611930, 614633, 622949, 630744, 632660, 633341, 637168, 639167, 635043, 630034, 628695, 625781, 616327, 605131, 597146, 587937, 572818, 556246, 543129, 529751, 512370, 495971, 485417, 476413, 464120, 452355, 445415, 439165, 429245, 420123, 417077, 416919, 415162, 414368, 416550, 415172, 404019, 387033, 370716, 353915, 333811, 314784, 302102, 293072, 282983, 273671, 268122, 263080, 255223, 248306, 246062, 244433, 238942, 233342, 232747, 234562, 234488, 235163, 240267, 246020, 247264, 246459, 248242, 250453, 248936, 245933, 245282, 244273, 238626, 230929, 226161, 223374, 219480, 216542, 217588, 219741, 219123, 218069, 220101, 222426, 220853, 217478]
55726B17478j474j929o244q193n876m987p154o900l185j984m289l622J227L131
55712A65999j69j824J287L298J207L96L780O440N705O067R533J1251R013P243
55698B29226P558N476K86j990N32J809j079l105j544r60l712n274l358k167l453
55683B18245k748J383L794K526K675O419Q710P091O320Q753R454N614J848J548
55669B81632J554j70k43K472L418Q14q11O17J030j157j588J044J745j108k175
55654B87074O14J686j777m553l352k719n841q575q088q383j1662j3051r728o875
55640B04770q442j0325q724p103q683r839p342m768n487o380m566l319n305o838
55626A07649m836k709l522m033j327J222M12q57K36Q57j348l008j516l05k084
$$ y = [217478, 216004, 214075, 207831, 199638, 193762, 188775, 181621, 174721, 171536, 169552, 165263, 161641, 162868, 165999, 165830, 164006, 165293, 168591, 169798, 170194, 173974, 180414, 186119, 192186, 201719, 212970, 221983, 229226, 236784, 242260, 242546, 240556, 241088, 242897, 241818, 238713, 237169, 236209, 232497, 227223, 223865, 221698, 218245, 215497, 216880, 220674, 223200, 225875, 232294, 241004, 248095, 254415, 263168, 272622, 278236, 280084, 281632, 283186, 283016, 282773, 285245, 288663, 289477, 288666, 289283, 290313, 289156, 287568, 288612, 290357, 289249, 287074, 287688, 289374, 287597, 283044, 279692, 276973, 271132, 262557, 254469, 246086, 234424, 221373, 211645, 204770, 196328, 186003, 177279, 170176, 161493, 151654, 144312, 139544, 134057, 127677, 123111, 119792, 114487, 107649, 102813, 100104, 96582, 92549, 91222, 92444, 92856, 91999, 92235, 93092, 91744, 88736, 87220, 86915, 84831]
55611H4831l365j379J72j855l788j917O60R3j406p64j50j848k910q96P55j025
55595F5208l001j800k04j308k205K79L048K296L70P96J632q5k140j586n70j762
55579E8968k739q87Q91o51k892k228m96p24j155N91K029N43r57Q40L263K531O43
55562E7570J297L068K860K049L120M002J899r93j432j157l088n203m134j424m23
55547E8011k71J429L336L216K762M289N950N305M115M608M848K906J524L294N314
55532A10636M193K247K952M422L328J348J444J656r76m044l875k509l868o220
55518A10734n375k607k434m761n877n325n522o269n653m664n373o332n065l065
55504D2412l100l949l042j889l310n748n873m453m089C296q16K405K425O33J047
$$ y = [84831, 81466, 80087, 80259, 78404, 74616, 72699, 73359, 73452, 72046, 71282, 71132, 69284, 66374, 65478, 66233, 65208, 62207, 60407, 60203, 58895, 56690, 56969, 60017, 62313, 62683, 63479, 65111, 65026, 62886, 61300, 60730, 58968, 56229, 55342, 56233, 55582, 52690, 50462, 49966, 49242, 48087, 48678, 50707, 51250, 50293, 51133, 54396, 56927, 57570, 58867, 61935, 64795, 66844, 69964, 73966, 75865, 74872, 73440, 72283, 69195, 63992, 59858, 58434, 58011, 57740, 59169, 62505, 65721, 68483, 72772, 78722, 84027, 88142, 92750, 97598, 100504, 102028, 105322, 110636, 114829, 117076, 120028, 124450, 127778, 129126, 130570, 132226, 131250, 127206, 123331, 120822, 116954, 110734, 105359, 102752, 100318, 95557, 89680, 84355, 78833, 72564, 66911, 62247, 56874, 50542, 45477, 42412, 39312, 35363, 32321, 30432, 27122, 21374, 15501, 11048, 6959, 3296, 2480, 4885, 7310, 7943, 8990]
55489H990L353M148L381L716M927M663L643M660P417R218R566R412P575K738k635
55474H4772n198n807p139q325o956m439m107n522n640m086k697j477M23J578O26
55459B6006l94P02K037J158j80M96J244n69k570j270J242P37j575j412P96J209
55443B7657j40l8J236O25j368j422K57M50r66j327q03j774l363k565j88K33j147
55426A5357r87P84J025m41n64R93J341n5o54Q0N5q76o79M82M52n02j03J389J705
55407A8802J075J491K190R10j139p56J365J655m1n94L31k1j766k044n23Q5o87
55390B0333m66Q73P76r70j714q44m54q57k56R59M46j395j777p15q87k223j869
55373H960K51J018j31l34J132J589K56k19J230K229J408M95O55P21J14k14l90
$$ y = [8990, 12343, 16491, 19872, 23588, 28515, 33178, 36821, 41481, 48898, 58116, 67682, 77094, 84669, 87407, 84772, 79574, 73767, 66628, 58303, 51347, 46908, 42801, 37279, 31639, 27553, 24856, 23379, 23802, 25380, 26006, 25612, 26314, 28351, 29509, 29329, 29825, 31069, 30500, 27930, 26660, 27902, 28639, 27064, 25652, 26448, 27657, 27517, 27479, 28715, 29340, 27972, 26550, 26807, 27257, 26291, 24964, 24161, 22387, 19024, 16459, 16271, 16504, 15357, 14370, 15154, 16179, 15738, 15174, 16167, 17508, 17453, 16799, 16879, 16934, 16058, 15379, 15861, 16313, 15811, 15708, 17097, 18802, 19877, 21368, 23558, 24468, 23329, 22573, 23938, 25593, 25552, 24958, 25289, 25268, 23502, 21458, 20935, 21020, 20333, 19867, 20740, 21516, 20546, 18832, 17988, 17534, 16677, 16421, 17380, 17826, 16431, 14654, 13939, 13052, 10829, 8960, 9211, 10229, 10098, 9764, 10896, 12485, 12741, 12522, 13752, 15981, 17389, 17884, 18539, 19260, 19374, 19160, 18770]
55356A8770j576k901k263l18K52n80l42J157J604P43O50J299M84j547k047p08
55340A2677o7o21k16J275J396j32p60O7R6j074j126L52R17j02m74N06Q58Mk36
55321A3340M24Q9j242j257K76R78L83N89J710J244j077k372j520o83r64q86j11
55304H921l10j396j219J82M18m99R1K258K837J048k00K54N4j605k171o74L28m29
55286G888p33N97J494Q35M47J069O51j317k114m83J043N58l82l00l07j141j444
55269F361p54n62r51l1J918J983k60j501k74P05l05j078K02J796K060K136K691
55252A4136J991l96j816q83J72l35p63J47O89k89r96k77R6r46j475l10O19J8k76
55233I106R23J655O44J1J388K770K090O45K08r6j266j847o69O77P23O49J545K012
$$ y = [18770, 17194, 14293, 12030, 11712, 11964, 11384, 11042, 12199, 13803, 14546, 15196, 16495, 16979, 15432, 13385, 12677, 12610, 11989, 11773, 13048, 14444, 14312, 13552, 13619, 13715, 12641, 11515, 11867, 12784, 12682, 12208, 12714, 13572, 13576, 13340, 13764, 13853, 12611, 11354, 11630, 12608, 12991, 13580, 15290, 16534, 15457, 13085, 11565, 10882, 9918, 9032, 8921, 8611, 7215, 5996, 6178, 6596, 6097, 6188, 8446, 11283, 12331, 12131, 12385, 12439, 10834, 8663, 7989, 8317, 7888, 7155, 7752, 9246, 10081, 10528, 11597, 12248, 10931, 8817, 8334, 9377, 9935, 9553, 9253, 8946, 7805, 6361, 5607, 5045, 4094, 4063, 5981, 7964, 7704, 6203, 5929, 6634, 6329, 5251, 5453, 7249, 9309, 11445, 14136, 16127, 15731, 13915, 13032, 13204, 12869, 12106, 12253, 12942, 12653, 11657, 11380, 11476, 10530, 9055, 8745, 9364, 9382, 9106, 10029, 11684, 12328, 12339, 13727, 16497, 18587, 19232, 19440, 19344, 18078, 16231, 15562, 16239, 16962, 17611, 19156, 21168]
55215B1168R69J1N10J138O02L9N04Q06L2n50j26k8q50r55K80R09K9l69P57J373
55195B6249K23p25q8K74r87j853o10R74R52M73R25J031k52j079Q4J492J212L54
55177B8649L97K58j092k013j128j45q14j804j436q20j393k054j539r57j293j093
55161A1723N88J812J061P6N74J158L53l12O37J450L24j133r03k18q58j515l62
55144A4455J293J404P83J044J318M30j80R56K180J593O48J377K473J758K88K52
55128C2072Q99L63m87K10J520J323K13J32P46M92k35k65l87j686k832k158q12
55111B9108o76r59o0J074Q18K34J113K321J704P6k06P38J126R92J512K165J788
55094D2868J198J648K116J157p0K97J403J322N02L96L29r01j955r48R92J531J017
$$ y = [21168, 22137, 22148, 22658, 23796, 24398, 24437, 24941, 25747, 25779, 25229, 25103, 25075, 24225, 23270, 23550, 24459, 24488, 24119, 24876, 26249, 26472, 25747, 25659, 25933, 24946, 23093, 22483, 23457, 24409, 24882, 25807, 26838, 26586, 25507, 25591, 27083, 28295, 28649, 29046, 29304, 28212, 26199, 25071, 24926, 24112, 22308, 20872, 20052, 18659, 16605, 15066, 14109, 12816, 11723, 12311, 14123, 15184, 15260, 15834, 16992, 17345, 17033, 17670, 19120, 19444, 18311, 17408, 17190, 16332, 14817, 14455, 15748, 17152, 17935, 18979, 20297, 20727, 20547, 21503, 23683, 25276, 25924, 27301, 29774, 31532, 31820, 32072, 32971, 33334, 32847, 33057, 34577, 35900, 36113, 36245, 36991, 37483, 37248, 36983, 36596, 34910, 32078, 29920, 29108, 28432, 27473, 27413, 28487, 29305, 29539, 30652, 32973, 34677, 34753, 34547, 35285, 36411, 37403, 38915, 41080, 42868, 44066, 45714, 47830, 48987, 48917, 49214, 50617, 51939, 52441, 52837, 53166, 52265, 50310, 49362, 50354, 51885, 52902]
55077E2902J239J818J348N78R58J414J91j501j327KO5j032j382j014j203j292
55061E1764O0J518Q65r16j119M3J76p79p19M70Q79K53R0L29m42j786j844p58l50
55042D7734p27l90O08Q18K83K52M51k65j144n86O35L93j057j601r18m95m80K12
55024D3723J207J189O61J080J924J608O32N98J011L72m80K38J450O35j598k306
55008E1944j136m15o56j08J199J085o82j799j391j025j317j055k27m19j553j572
54992D0873l7J098R68Q91J447J463O07J29L50J47n35l11J005J964K080K335K906
54975E7380K892K464K623K883J837J24p9J424K592K544K375K534K355K245L481
54960H9674N559O621O641P339Q939R997J0601J2530J5887J8653J9879K0383J9970
$$ y = [52902, 54141, 55959, 57307, 57885, 58843, 60257, 60448, 58947, 57620, 57622, 57687, 56655, 55273, 54259, 53056, 51764, 51824, 53342, 54207, 53291, 52172, 52215, 52391, 51612, 50893, 51363, 52242, 52495, 52585, 52914, 52472, 50686, 48842, 48084, 47734, 47007, 46617, 47225, 48043, 48326, 48578, 49029, 48764, 47620, 47034, 47669, 48062, 47005, 45404, 44486, 43991, 43511, 43723, 44930, 46119, 46780, 47860, 49784, 51392, 52024, 52622, 53633, 54005, 53525, 53763, 55213, 55848, 54250, 51944, 50808, 50393, 49737, 49629, 50828, 51913, 51231, 49432, 48041, 47016, 45699, 44644, 44417, 43998, 42445, 40873, 40836, 41934, 42902, 43793, 45240, 46703, 47310, 47439, 47789, 47936, 47401, 47090, 48095, 50059, 52139, 54474, 57380, 60272, 62736, 65359, 68242, 70079, 70203, 70124, 71548, 74140, 76684, 79059, 81593, 83948, 86193, 89674, 95233, 101854, 108495, 115834, 124773, 134770, 145371, 157901, 173788, 192441, 212320, 232703, 252673]
54947B52673J7142J2043O626J467m588j1159j5912j8034j9084j9751j8829j6212
54935A66382j3939j3161j2713j1549j0132q740o853m859l922l719k707r47o5j68
54921G2908K95J457J789J369K192M589O440O805P309R018J0883J2293J4358J7448
54907A69153K0000K0806K0154J7995J3492P216J304l395p982j2736j6267j7982
54895B11758j8875j9158j7805j5062j2729j1334r621p414o133n836m759k603j342
54882G9087j763k219j725j470k043k095j036l53r37j670j783k128k883k622r68
54867E3392K94K8o93q69j026j377j026p8q5j268j772q06J7l92r14o50n63j326
54849D0886j927j661j292j157m37P14P80l48q10K1N00n6O2J733L150K766J569
$$ y = [252673, 269815, 281858, 288484, 289951, 285363, 274204, 258292, 240258, 221174, 201423, 182594, 166382, 152443, 139282, 126569, 115020, 104888, 96148, 89295, 84436, 80514, 76795, 74088, 73141, 73076, 72908, 73203, 74660, 76449, 77818, 80010, 84599, 91039, 97844, 105153, 114171, 125054, 137347, 151705, 169153, 189153, 209959, 230113, 248108, 261600, 268816, 270120, 266725, 258743, 246007, 229740, 211758, 192883, 173725, 155920, 140858, 128129, 116795, 107174, 99760, 93627, 87791, 83032, 80429, 79087, 77324, 75105, 73380, 71910, 69867, 67772, 66736, 66383, 65446, 63776, 61993, 59865, 56982, 54360, 53392, 53686, 53714, 53021, 52152, 51126, 49749, 48723, 48645, 48560, 47292, 45520, 44714, 44731, 44339, 43425, 42775, 42212, 40886, 38959, 37298, 36006, 34849, 34412, 35126, 35906, 35558, 34748, 34769, 35269, 35213, 35275, 37008, 40158, 42924, 44493]
54832D4493Q56K34o11o65L17Q30K43O7J063J668Q71J38P13J407J008N43J161J961
54814E6297J842J635K370L278L318L046L281L565L477L820N070O359P291Q940
54800A13589J1809J4589J6249J7436J8718J9397J9146J8637J7504J4002P988J787
54788B90851l155p926j3075j6688j7335j6440j5777j4907j3089j1262j0150q618
54776A42429n986l807l338l355k580j994k556k798j154J222K411K731L449M177
54762A28851M095M211N878Q326R946J0966J2691J5090J7206J8938K0616K1657
54750B78471K1273J9568J6620J1705M767k638r140j4901j9931k2872k2963k1560
54738B38399k0218j8801j6872j5137j3965j2325r799p833p319o831n039l038k365
$$ y = [44493, 45349, 45583, 44972, 44307, 44624, 45454, 45697, 45764, 46827, 48495, 49366, 49504, 50217, 51624, 52632, 53175, 54336, 56297, 58139, 59774, 62144, 65422, 68740, 71786, 75067, 78632, 82109, 85929, 90999, 97358, 104649, 113589, 125398, 139987, 156236, 173672, 192390, 211787, 230933, 249570, 267074, 281076, 289064, 290851, 287696, 279770, 266695, 250007, 232672, 216232, 200455, 185548, 172459, 161197, 151047, 142429, 136443, 132636, 129298, 125943, 123363, 121369, 118813, 116015, 114861, 116083, 118494, 121225, 124674, 128851, 132946, 137157, 143035, 151361, 161307, 172273, 184964, 200054, 217260, 236198, 256814, 278471, 299744, 319312, 335932, 347637, 352404, 349766, 340626, 325725, 305794, 282922, 259959, 238399, 218181, 199380, 182508, 167371, 153406, 141081, 131282, 123449, 116130, 109299, 104260, 101222, 98857]
54725I8857k476k107j517j389j161l67q6j112k163j790o63j98l35l72m69o90j42
54708H1820J315K106J329L29L39M59k95j004p38m22q50q32N21J691J121j74n40
54691H6175l20l82m6J173J747N84o14lJ238J135M13Q84J956J791O53J71M38N29
54673I7522P59J773K576K104J587K654M381M881M545M929N657N398M806N376O304
54658A55252N590L551K301K250K018J341J289J946K463L015M234N291M977M176
54644A99694M741O489P769Q312Q947R180P840N575L874K130j469o416j0102j1572
54630B34992j2249j2965j2969j2135j1491j1124r872p605n735n023m701m122l579
54617A21422l162k392j201OJ131K150K466J854J384K038L042L125K527K206J981
$$ y = [98857, 96381, 94274, 92757, 91368, 90207, 89840, 89754, 88642, 86479, 84689, 84026, 83828, 83493, 83121, 82652, 81962, 81820, 83135, 85241, 86570, 86899, 87238, 87697, 87402, 86398, 85660, 85238, 84388, 83556, 84077, 85768, 86889, 86715, 86175, 85855, 85473, 85427, 86600, 88347, 88931, 88317, 88314, 89552, 90687, 91100, 91984, 93940, 95731, 96384, 96555, 96993, 97522, 98281, 100054, 102630, 104734, 106321, 108975, 113356, 118237, 122782, 127711, 133368, 138766, 143572, 148948, 155252, 160842, 164393, 166694, 168944, 170962, 172303, 173592, 175538, 178001, 181016, 185250, 190541, 195518, 199694, 204435, 210924, 218693, 227005, 235952, 245132, 252972, 258547, 262421, 264551, 263082, 256666, 246564, 234992, 222743, 209778, 196809, 184674, 173183, 162059, 152187, 144582, 138847, 133824, 129123, 125001, 121422, 118260, 115868, 114667, 114673, 115804, 117954, 120420, 122274, 123658, 125696, 128738, 131863, 134390, 136596, 138577]
54602A38577J262O66R28J105j15k074l200l519m064m674m533m087m209m260l248
54587A04555k064k210l132l205k584k536k731j930p65j014k485l332l122k999
54573G0446l089k479j551j559j999j119Q74J808R88P6J83N62N93P65J213J208
54557F6920N98k5o35j565k105j218M65J275R92Q04J046J061R88J584K428K409
54541G5022J787J758K266K405K561L813N513N943N151M735M944M548L530L239
54527A27215L647L009P40j650k922l381l547l515l790m914o114o129n209m550
54513H8890m100l053j956k017k668k311j125o04o15K58J648J631J49o86m8N79
54497G3972K58j60j14j47j87N99J836K151J624J685K443K584K106K424L566L949
$$ y = [138577, 139839, 140505, 141433, 142538, 142423, 140349, 137149, 133630, 129566, 124892, 120359, 116272, 112063, 107803, 104555, 102491, 100281, 97149, 93944, 91360, 88824, 86093, 84163, 83398, 82384, 79899, 76567, 73445, 70446, 67357, 64878, 63327, 61768, 59769, 58650, 59524, 61332, 62320, 62396, 62579, 63141, 63734, 64499, 65712, 66920, 67518, 67493, 66858, 65293, 63188, 61970, 62435, 63710, 64702, 65506, 66552, 67613, 68601, 70185, 72613, 75022, 76809, 78567, 80833, 83238, 85799, 89612, 95125, 101068, 106219, 110954, 115898, 120446, 123976, 127215, 130862, 133871, 134611, 132961, 130039, 126658, 123111, 119596, 115806, 110892, 104778, 98649, 93440, 88890, 84790, 81737, 79781, 77764, 75096, 72785, 71660, 71056, 70441, 70699, 72347, 73978, 74127, 73441, 73393, 73972, 74230, 74070, 73956, 73809, 73622, 74221, 76057, 78208, 79832, 81517, 83960, 86544, 88650, 91074, 94640, 98589]
54481I8589L299K996L191K450P91J09Q37J191M47J02P91J017J28k70P29J582R61
54464A18940j86o42p81j096r36j03K85l11r16j041j589k824l414k627j551j081
54448A00127o77k2M4p15j182q96r25j753k281j864j404j460j259n10j78n54n53
54431H3938R0P4r64j447n18M18J75j89P02K381L618M039L509J690o40j552m59
54414I4865R75J428J589K249K659K113J414J436J806K095K714L534L417K296J853
54399A26443K944M032L581K342J854K165K366K138J564O03l35n20k67p72k053
54384A46085k720k379k261k842k974k288k178l273m098l624l075l723m756m826
54370A01068m044l032j670j83K99m36r48l97J39j53k68O21J484J234N56M10M22
$$ y = [98589, 101888, 104884, 108075, 110525, 111316, 111425, 112262, 113453, 113900, 114002, 114793, 115810, 115938, 115668, 116397, 117979, 118940, 118754, 118112, 117331, 116235, 115299, 115196, 115481, 115170, 114254, 113213, 111624, 108800, 105386, 102759, 101208, 100127, 99450, 99428, 99472, 98757, 97575, 96679, 95754, 94001, 91720, 89856, 88452, 86992, 85733, 85223, 85045, 84491, 83938, 84028, 84102, 83138, 81691, 81173, 81591, 81766, 81577, 82279, 84660, 88278, 92317, 95826, 97516, 96876, 95324, 94865, 95840, 97268, 98857, 101106, 103765, 105878, 107292, 108728, 110534, 112629, 115343, 118877, 122294, 124590, 126443, 129387, 133419, 137000, 139342, 141196, 143361, 145727, 147865, 149429, 150032, 149697, 149177, 148910, 148138, 146085, 143365, 140986, 138725, 135883, 132909, 130621, 128443, 125170, 121072, 117448, 114373, 110650, 105894, 101068, 97024, 93992, 92322, 92139, 92438, 92002, 91054, 90657, 90796, 90643, 90375, 90996, 92480, 93714, 94270, 94680, 95102]
54353I5102J30J93Q61J013J48l19O99K106K562K618L243L854L550K945L023L449
54337A25177L487L421L594L311K017M17p34j610k166j736q34j361l675n423m876
54322A19009l463l247l833l785l306l363l598l265k990l529l998l230j861j288
54308G4253j501j688j847k230k216j339l88q5J31O56N74n79j430q63Jl15j199
54291E9935j260o78l85j79M30P10l1q16n13K03K51J82R18J619J069M9J39J022
54273F2665J148L98qL33Q08J246J804K002J429Q39J046J433J033K89K30O49O41
54256G7985K11m2j23k69k42r7n56j534j631k83J040J122P84R46P46n49j601j099
54238G4808j66l82r98n37K99o5j083j082k82j57o33m84J02l0n84l15M67L43o03
$$ y = [95102, 95232, 95425, 96286, 97299, 97447, 97128, 97827, 99933, 102495, 105113, 108356, 112210, 115760, 118705, 121728, 125177, 128664, 132085, 135679, 138990, 141007, 141424, 140690, 139080, 136914, 135178, 134344, 132983, 129308, 123885, 119009, 115546, 112299, 108466, 104681, 101375, 98012, 94414, 91149, 88159, 84630, 80632, 77402, 75541, 74253, 72752, 71064, 69217, 66987, 64771, 63432, 63044, 62959, 63090, 63746, 64320, 63741, 62311, 61448, 61449, 61134, 59935, 58675, 57997, 57612, 57433, 57863, 58573, 58542, 57726, 57213, 57416, 57667, 57849, 58767, 60386, 61455, 61504, 61643, 62665, 63813, 64211, 64203, 64536, 65344, 66590, 68394, 70396, 71825, 72664, 73710, 75143, 76176, 76465, 76695, 77344, 77985, 78196, 78154, 78031, 77762, 77520, 77423, 76867, 75333, 73702, 73419, 74459, 75581, 76365, 77311, 78057, 77508, 75907, 74808, 74642, 74260, 73262, 72725, 73024, 72959, 71876, 70794, 70512, 70355, 69722, 69238, 69340, 69310, 68726, 68411, 68878, 69221, 68618]
54219F8618r12k20N11R91J679K188J673O41L87Q72R83N25K23Q2l92q47o97o01
54201G5704j504k704k729j611m90L86J379J866J018l85q82o56q48j219o08P11
54185F7428J260O35l51j304k119j892j30J542J155n67j264n29l9m42o88l87l93
54168F1915q42q53l46j85m24l72k49q27j503r17N97J321Q50L88L76J09k72L09
54150E9075J616K041J142K20Jk39p86p59J08P57N05o5l46m42l65J31O53M70k09
54131F3508n94p56j339k047k009j395j074r63m31K2n30j427j180l9L73j38k16
54114D9765L62K68q10j438q26J50Q04J521K248K067Q66k25n85o98p35l03J40m56
54096E2115j699j940r23k83q68j445r00J02N30N15N33M26N6j66o0Om2J19L11M
$$ y = [68618, 67706, 67486, 67997, 68988, 70667, 72855, 74528, 75169, 75556, 76428, 77411, 77936, 78159, 78241, 77849, 77002, 76305, 75704, 74200, 71496, 68767, 67156, 66666, 67052, 68431, 70297, 71315, 70930, 70048, 69392, 68544, 67325, 66717, 67428, 68688, 69323, 68972, 67668, 65549, 63657, 63527, 65069, 66224, 65657, 64393, 63864, 63825, 63383, 62695, 62308, 61915, 61073, 60220, 59874, 59689, 59265, 58893, 58644, 57817, 56314, 55397, 55994, 57315, 58165, 58553, 58929, 59038, 58766, 59075, 60691, 62732, 63874, 64094, 64095, 63856, 63070, 62311, 62419, 63176, 63681, 63616, 63270, 62828, 62463, 62594, 63247, 63717, 63508, 62914, 62158, 60819, 58772, 56763, 55368, 54294, 53331, 52900, 52922, 52392, 50965, 49785, 49746, 50119, 49981, 49765, 50127, 50395, 49585, 48147, 47321, 47471, 48275, 49796, 52044, 54111, 54977, 54752, 54167, 53469, 52734, 52431, 52571, 52115, 50416, 48476, 47553, 47270, 46402, 44957, 44057, 44159, 44689, 45204, 45737, 46163, 46219, 46053, 45993, 45999, 45957, 46076, 46387, 46391]
54076D6391n32m56K29P41R28J291J623J236L79l6r6n62j068n00Q57J468J033Q58
54058E3784J455J763J253Q61J256J795J812J456Q38k03j110r41O4P21Q38J315
54042F6957K192K394J680J106J193J364J457K067L037L375L004K927L412L713
54028I9878L826M637O013O691O410O247O502O245N368M977N196M722L247K228
54014A72187K386K485J622P70Q85J208P14j69n10l75m10q76j762k889l577l227
53998A68462k504k643l573m130m171m595n221m605k514o39j96n69q93j279j839
53983A29091k148k170k327k260j213J86L69o98j448j280j191j518j332n01j47
53968A11413m46k86M20M04l59k40J102J897J302P29J043J098K77r3P10J267O56
$$ y = [46391, 45859, 45403, 45632, 46373, 47301, 48592, 50215, 51451, 51830, 51794, 51698, 51136, 50068, 49568, 50425, 51893, 52926, 53784, 55239, 57002, 58255, 59116, 60372, 62167, 63979, 65435, 66273, 66070, 64960, 64019, 64083, 64804, 65642, 66957, 69149, 71543, 73223, 74329, 75522, 76886, 78343, 80410, 83447, 86822, 89826, 92753, 96165, 99878, 103704, 108341, 114354, 121045, 127455, 133702, 140204, 146449, 151817, 156794, 161990, 166712, 169959, 172187, 174573, 177058, 178680, 179450, 180335, 181543, 182257, 182088, 181578, 181203, 180793, 179917, 178155, 175266, 171689, 168462, 165958, 163315, 159742, 155612, 151441, 146846, 141625, 137020, 134506, 133867, 133671, 133102, 132209, 130930, 129091, 126943, 124773, 122446, 120186, 118973, 119159, 119528, 118830, 117382, 116102, 114911, 113393, 112061, 111560, 111413, 110967, 110681, 111101, 111505, 111146, 110906, 112008, 113905, 115207, 115936, 116979, 118077, 118354, 118261, 118971, 120238, 120894]
53951A20894J94R21J613J155P31J621K818K878K469L014M265N154N716O426O829
53936A66698O449N843N351M149J937L8o26j109k483l888m096l576l307k970j972
53921A66438q81k46P00K515M053M186L689L826M271M143L880M357N231N729O084
53906B17975O693O979O539O223O674O971O185M923L955K698O98q48q43k95p34
53891B73793j857k498k767l313l651l149k708l470m791n401n607o457p501p480
53877B13143o614o236o600o820o579o195n568m560l969m469n092m348k496j216
53863A42381j313k107k720k828k485k190k623l512l599k558j776k198k766k276
53849A07430j432j403j656j101l04o07j720k174j584p26P3R06J234M96n48p21
$$ y = [120894, 121088, 122009, 123622, 124777, 125508, 127129, 129947, 132825, 135294, 138308, 142573, 147727, 153443, 159869, 166698, 173147, 178990, 184341, 188490, 190427, 190465, 189839, 188730, 186247, 182359, 178263, 174687, 171380, 168410, 166438, 165557, 165311, 166011, 168526, 172579, 176765, 180454, 184280, 188551, 192694, 196574, 200931, 206162, 211891, 217975, 224668, 231647, 238186, 244409, 251083, 258054, 264239, 269162, 273117, 275815, 276513, 275665, 274822, 274527, 273793, 271936, 269438, 266671, 263358, 259707, 256558, 253850, 250380, 245589, 240188, 234581, 228124, 220623, 213143, 206529, 200293, 193693, 186873, 180294, 174099, 168531, 163971, 160002, 155533, 150441, 146093, 143597, 142381, 141068, 138961, 136241, 133413, 130928, 128738, 126115, 122603, 119004, 116446, 114670, 112472, 109706, 107430, 105998, 104595, 102939, 101838, 101534, 100927, 99207, 97033, 95449, 94723, 94796, 95702, 96936, 97432, 96884, 96163]
53833I6163k02j3k30j44K30L15J66J87J36l35p06m35j26n53j232j255q75q16p89
53814H9486j17P39Q34L24N6J12J18L72J268K232K485K325K395K495K310K450L394
53797A13278M328M400M257M767N319N017M565N132O126O034M877L948L637L262
53783A78947K669K223J711Q28K72Q08J762J934J481J298J188L72q02j385j555
53768A91751k138k944l199l154l569m164m104l545l159k840k375k459l394l829
53754A46878k735j536k030l207k676n62P72N06J8m0n50j548j726q60l85r17j293
53737A28109p27j9P2j73n22j276k078j843m89P18R76P64N16l6q21j130p49k57
53719A21035J06P07J526K040K150K133J763P25l03l32L57O63M90O49J185J408
$$ y = [96163, 95961, 95948, 95718, 95574, 95804, 96119, 96285, 96472, 96608, 96273, 95567, 95132, 95006, 94453, 93221, 91966, 91091, 90275, 89486, 89369, 90108, 90942, 91266, 91322, 91434, 91552, 91924, 93192, 95424, 97909, 100234, 102629, 105124, 107434, 109884, 113278, 117606, 122006, 126263, 131030, 136349, 141366, 145931, 151063, 157189, 163223, 168100, 172048, 175685, 178947, 181616, 183839, 185550, 186378, 186650, 187458, 189220, 191154, 192635, 193933, 195121, 195493, 194691, 193306, 191751, 189613, 186669, 183470, 180316, 176747, 172583, 168479, 164934, 161775, 158935, 156560, 154101, 150707, 146878, 144143, 142607, 140577, 137370, 134694, 134132, 134904, 135410, 135428, 135388, 134838, 133290, 131564, 130704, 130319, 129402, 128109, 127382, 127363, 127435, 127262, 126740, 125464, 123386, 121543, 121054, 121772, 122748, 123512, 124028, 123992, 123171, 122041, 121292, 121035, 121141, 121848, 123374, 125414, 127564, 129697, 131460, 132185, 131882, 131550, 131907, 132570, 133060, 133709, 134894, 136302]
53703A36302J401J848K502K491K109K487L518L862L220K754L021L268L069L023
53689A74875L375L503L233L208L539L489K838K280K138K034K028K730L931M500
53675B17701M003L252K943K872K684K298J509K61o86n46J79L51KK8L68O8r14j516
53657B34857j331r81p62m65m86j429k504k143m08R23J007Q25J055Q74l30j646
53641B27056j965j430q25n02n06q54j238j170o68j25M17J031J250P19J57M71J243
53624B23061J429J144J264J638J424R48J369K545L061K530K092K434L019L448
53610B51406L906M086L328K177K081L254M395M781N069N761O445O809O975O685
53596C17158N625M602M771N699N922N416N575O631P134O429N616N625O007O170
$$ y = [136302, 137703, 139551, 142053, 144544, 146653, 149140, 152658, 156520, 159740, 162494, 165515, 168783, 171852, 174875, 178250, 181753, 184986, 188194, 191733, 195222, 198060, 200340, 202478, 204512, 206540, 209270, 213201, 217701, 221704, 224956, 227899, 230771, 233455, 235753, 237262, 237523, 236837, 236291, 236470, 236821, 236823, 236851, 237219, 237287, 236373, 234857, 233526, 232545, 231783, 231318, 230832, 229403, 226899, 224756, 224348, 225271, 226278, 227103, 228158, 229032, 228702, 227056, 225091, 223661, 222836, 222334, 221828, 220974, 219736, 218566, 217898, 217773, 218190, 219221, 220471, 221190, 221347, 221818, 223061, 224490, 225634, 226898, 228536, 229960, 230908, 232277, 234822, 237883, 240413, 242505, 244939, 247958, 251406, 255312, 259398, 262726, 264903, 266984, 270238, 274633, 279414, 284483, 290244, 296689, 303498, 310473, 317158, 322783, 327385, 332156, 337855, 343777, 349193, 354768, 361399, 368533, 374962, 380578, 386203, 392210, 398380]
53582C98380O138N648M246K614K118K746L153K924K903L136K611J374Q04J236
53568D40031J433R13O92J085R85R1l33J93L93m59j290j273j184j567j573p00J3
53551D37450j53l42J93P53O40M11N84O59L94M92J062J039J68j79P44J708J602
53534D47225J225J642K305K251J828J808J979J917K139L289N046O720Q035Q742
53520D96151Q568Q117Q409R170R086Q262Q489J0365J2208J2794J3170J4485J6001
53507F35275J6666J7001J7864J8889J9566K0506K2195K3869K4825K5590K6637
53496H68883K7399K7720K8629L0472L1878L1927L1720L2301L2788L2163L1349
53485A207229L1647L2485L2565L2098L2022L2112L1629L0993L1136L1899L2532
$$ y = [398380, 404518, 410166, 414412, 417026, 419144, 421890, 425043, 427967, 430870, 434006, 436617, 437991, 438795, 440031, 441464, 442377, 443069, 444154, 445139, 445230, 444897, 445090, 445483, 445024, 443734, 442461, 441277, 439710, 438137, 437437, 437450, 437297, 436955, 437148, 437901, 438541, 438952, 439536, 440195, 440589, 441081, 442143, 443182, 443350, 443171, 443915, 445623, 447225, 448450, 450092, 452397, 454648, 456476, 458284, 460263, 462180, 464319, 467608, 472654, 479374, 487409, 496151, 504719, 512836, 521245, 530415, 539501, 547763, 556252, 566617, 578825, 591619, 604789, 619274, 635275, 651941, 668942, 686806, 705695, 725261, 745767, 767962, 791831, 816656, 842246, 868883, 896282, 924002, 952631, 983103, 1014981, 1046908, 1078628, 1110929, 1143717, 1175880, 1207229, 1238876, 1271361, 1303926, 1336024, 1368046, 1400158, 1431787, 1462780, 1493916, 1525815, 1558347]
53474A558347L2994L3462L3391L2360L0999K9909K8624K6798K5248K4599K3923
53463A880654K2109J9564J7323J5493J3776J2481J1796J1100J0069R267Q631O769
53451B039032L008j237m493p118r892j2282j3728j5227j7826k0762k2755k4012
53439A892708k5413k6951k8439l0395l2609l3412l2177l1042l2087l4213l5030
53428A550940l4442l3958l3548l1865k8932k6099k3684k0983j8303j6825j6522
53417A265779j6093j4899j3317j1416q902o174l941k026J63K500M653P102J0278
53404A213707J3436J5850J8166K1110K3791K4968K5188K5844K7037K8144K9623
53393A466864L2251L5335L7686L9717M2498M5485M7344M8501N0631N3897N6908
$$ y = [1558347, 1591341, 1624803, 1658194, 1690554, 1721553, 1751462, 1780086, 1806884, 1832132, 1856731, 1880654, 1902763, 1922327, 1939650, 1955143, 1968919, 1981400, 1993196, 2004296, 2014365, 2023632, 2032263, 2039032, 2042040, 2040803, 2036310, 2029192, 2019300, 2007018, 1993290, 1978063, 1960237, 1939475, 1916720, 1892708, 1867295, 1840344, 1811905, 1781510, 1748901, 1715489, 1683312, 1652270, 1620183, 1585970, 1550940, 1516498, 1482540, 1448992, 1417127, 1388195, 1362096, 1338412, 1317429, 1299126, 1282301, 1265779, 1249686, 1234787, 1221470, 1210054, 1201152, 1194978, 1191037, 1189011, 1189174, 1191674, 1196327, 1203429, 1213707, 1227143, 1242993, 1261159, 1282269, 1306060, 1331028, 1356216, 1382060, 1409097, 1437241, 1466864, 1499115, 1534450, 1572136, 1611853, 1654351, 1699836, 1747180, 1795681, 1846312, 1900209, 1957117]
53382A957117N9225O1810O5060O8288P1082P3502P5127P5692P6219P7685P9062
53371B739869P8691P7212P6803P7699P7825P5959P2962O9489O4793N8462N1500
53360C521264M5065L9465L4847L1333K8179K4148J9061J3736Q423K700l192q389
53348C756640j2853j7337k2024k6761l2484m0590n0729o0741o8944p5002p8763
53337C270412q0058p9768p9227p8405p6320p3385p1350p0689o9904o8064o6087
53326B457155o4870o3858o2345o0719n9462n8139n6176n3630n0560m6702m2298
53315A838396l8259l4955l1819k8583k5951k4626k4497k5035k5576k5156k3149
53304A530790k0322j8077j6544j4555j1750r271p872o708m717k166n7J227J943
$$ y = [1957117, 2016342, 2078152, 2143212, 2211500, 2282582, 2356084, 2431211, 2506903, 2583122, 2660807, 2739869, 2818560, 2895772, 2972575, 3050274, 3128099, 3204058, 3277020, 3346509, 3411302, 3469764, 3521264, 3566329, 3605794, 3640641, 3671974, 3700153, 3724301, 3743362, 3757098, 3765521, 3768221, 3765029, 3756640, 3743787, 3726450, 3704426, 3677665, 3645181, 3604591, 3553862, 3493121, 3424177, 3349175, 3270412, 3190354, 3110586, 3031359, 2952954, 2876634, 2803249, 2731899, 2661210, 2591306, 2523242, 2457155, 2392285, 2328427, 2266082, 2205363, 2145901, 2087762, 2031586, 1977956, 1927396, 1880694, 1838396, 1800137, 1765182, 1733363, 1704780, 1678829, 1654203, 1629706, 1604671, 1579095, 1553939, 1530790, 1510468, 1492391, 1475847, 1461292, 1449542, 1440271, 1432399, 1425691, 1420974, 1418808, 1418751, 1419978, 1421921]
53291A421921K286K371K480K920L823N279P346R915J2830J6017J9220K2032K4591
53278A553031K7613L1123L3904L5055L5433L6336L7460L7441L6115L4761L4273
53267A932545L4263L3934L2745L0410K7217K4172K1900J9820J7310J4996J3669
53256B202981J2621J0539P462M244P60l617q170j1492j3768j6536k0150k3476
53244B141398k6097k8968l2440l5540l7603l9057m0183m0651m0675m1084m1827
53233A737273m1874m0982m0097l9593l8655l6909l5262l4413l3770l2500l0685
53222A332533k8915k7724k7643k8818l0250l0476k9235k7510k5951k4327k2566
53211A029118k0964j9319j7251j5422j5082j6125j7062j7128j7087j7610j8297
$$ y = [1421921, 1424207, 1426578, 1429058, 1431978, 1435801, 1441080, 1448426, 1458341, 1471171, 1487188, 1506408, 1528440, 1553031, 1580644, 1611767, 1645671, 1680726, 1716159, 1752495, 1789955, 1827396, 1863511, 1898272, 1932545, 1966808, 2000742, 2033487, 2063897, 2091114, 2115286, 2137186, 2157006, 2174316, 2189312, 2202981, 2215602, 2226141, 2233603, 2237847, 2238607, 2234990, 2226820, 2215328, 2201560, 2185024, 2164874, 2141398, 2115301, 2086333, 2053893, 2018353, 1980750, 1941693, 1901510, 1860859, 1820184, 1779100, 1737273, 1695399, 1654417, 1614320, 1574727, 1536072, 1499163, 1463901, 1429488, 1395718, 1363218, 1332533, 1303618, 1275894, 1248251, 1219433, 1189183, 1158707, 1129472, 1101962, 1076011, 1051684, 1029118, 1008154, 988835, 971584, 956162, 941080, 924955, 907893, 890765, 873678, 856068, 837771]
53200H37771j8722j9119j9603j9815j9704j9509j8886j7206j4905j3287j2783
53189F44232j2737j2899j3655j4655j4893j4458j4618j5722j6598j6535j6262
53178D81200j6315j6012j4788j3252j2118j1234j0372r844r731r481q893q426
53166C40734q113p335o069n280n475n946n952n673n525n493n458n387m887l610
53152B60531k152j555j868k285k544k950l148k423j234p88j049q48r6Np55j062
53136B35779l44L67N03R40K140L066K977K617K683K634K076J786K247K568J922
53121B63961Q33Nr50k500m004m557m207l526k868k618l175m115m400l880l482
53106B20517l562l451l024l111l768l795k791k083k632l576l854l788l917l754
$$ y = [837771, 819049, 799930, 780327, 760512, 740808, 721299, 702413, 685207, 670302, 657015, 644232, 631495, 618596, 604941, 590286, 575393, 560935, 546317, 530595, 513997, 497462, 481200, 464885, 448873, 434085, 420833, 408715, 397481, 387109, 377265, 367534, 358053, 349160, 340734, 332621, 325286, 319217, 313937, 308462, 302516, 296564, 290891, 285366, 279873, 274415, 269028, 264141, 260531, 258379, 256824, 254956, 252671, 250127, 247177, 244029, 241606, 240372, 239584, 238535, 237687, 237591, 237596, 236841, 235779, 235435, 235802, 236305, 237245, 239385, 242451, 245428, 248045, 250728, 253362, 255438, 257224, 259471, 262039, 263961, 264794, 264799, 263849, 261349, 257345, 252788, 248581, 245055, 242187, 239569, 236394, 232279, 227879, 223999, 220517, 216955, 213504, 210480, 207369, 203601, 199806, 197015, 194932, 192300, 188724, 184870, 181082, 177165, 173411]
53092A73411k942k316k523k699j915q84q67j728k352k342k165k103j973j599r18
53077A44085n4M51J47m88o03l94p44j477j484p35m13p56o70j5j45j364j943q38
53059A32560O27J065J075J483J417kj561j566l52M88M82K22p7m52m20J86M76j57
53041A35494q14n01J77J03o03j173j674k433k888k383j439q96n53J22P60Q31P87
53024A22917J182J407O63n00r66p36o56r80j347j605j680j244l94J09NM8N36N78
53006A17337k69r08l86N53Q90R81J409J456L78q80r64j98K24K89P74J543J934
52989A24163K120K600K945K571K097K434L246L724M101M862N295M548L380L065
52975A71151L240K636J350N39K86l68j505k275k507k710k670j695j73O38L48m17
$$ y = [173411, 170469, 168153, 165630, 162931, 161016, 160132, 159265, 157537, 155185, 152843, 150678, 148575, 146602, 145003, 144085, 144031, 144482, 144629, 144141, 143538, 143144, 142400, 140923, 139439, 138704, 138291, 137535, 136865, 136850, 136705, 135341, 133398, 132560, 133187, 134252, 135327, 136810, 138227, 138225, 136664, 135098, 134746, 135234, 135716, 135938, 135861, 135409, 134989, 135175, 135651, 135494, 134680, 134179, 134356, 134459, 133856, 132683, 131009, 128576, 125688, 123305, 121866, 120970, 120417, 120539, 121299, 122130, 122917, 124099, 125506, 126169, 125669, 124703, 123967, 123311, 122331, 120984, 119379, 117699, 116455, 116061, 116170, 116175, 116223, 116759, 117337, 117068, 116160, 115774, 116327, 117217, 118198, 119607, 121063, 121441, 120561, 119597, 119399, 119623, 119912, 120686, 122229, 124163, 126283, 128883, 131828, 134399, 136496, 138930, 142176, 145900, 150001, 154863, 160158, 164706, 168086, 171151, 174391, 177027, 178377, 178916, 179202, 178834, 177329, 175054, 172547, 169837, 167167, 165472, 165299, 165937, 166285, 165868]
52959A65868j371k567l348k820j358k26J58K79R3q21j865j777n35N35O85M75M28
52942A51833L14n3m45q34j390j707j124J30J063J246J188J365J752K194K502K320
52926A60354J605R49P08L04p55j718j583p10k28k46O2Q80J491J535J388J247R34
52909A66217N23L41L40K25L7j5j9n5J74P81J356J708K184K647K135M94p99n50
52891A77724L79N16Kj01K20K65J90O44J324J509J438J746K004J403L67m0J80L17
52873A90087M25Q47R93L39l9J140K938L290K184J626K420L229L015K419K206K182
52857B19301K188K639L455L767L152K138J215L57l58p39j027j483j658j152o56
52842B31139j005j641j471q02p94j387j542j264j527k303k534k073j819j916j622
$$ y = [165868, 164497, 161930, 158582, 155762, 154404, 154178, 154336, 154615, 154708, 153887, 152022, 150245, 149710, 150245, 150930, 151405, 151833, 152147, 152094, 151649, 150815, 149425, 147718, 146594, 146724, 147787, 149033, 150221, 151586, 153338, 155532, 158034, 160354, 161959, 162908, 163616, 163920, 163165, 161447, 159864, 159154, 158926, 158680, 158742, 159622, 161113, 162648, 164036, 165283, 166217, 166740, 167081, 167421, 167646, 167683, 167668, 167649, 167594, 167768, 168549, 169905, 171613, 173797, 176444, 178579, 179073, 178274, 177724, 178103, 178619, 178621, 178520, 178740, 179005, 179195, 179839, 181163, 182672, 184110, 185856, 187860, 189263, 189630, 189590, 189770, 190087, 190512, 191359, 192352, 192691, 192652, 193792, 196730, 200020, 202204, 203830, 206250, 209479, 212494, 214913, 217119, 219301, 221489, 224128, 227583, 231350, 234502, 236640, 237855, 238212, 237854, 237115, 236088, 234605, 232947, 231795, 231139, 230134, 228493, 227022, 226220, 225426, 224039, 222497, 221233, 219706, 217403, 214869, 212796, 210977, 209061, 207439]
52827B07439j084j259j962j913j013o31j231j738j715k187l488m300l750k766
52813A78402k336j951r27N9Qq72j674k008j918j333l57M80P97O03j81j626l082
52796A62084l515k843k031j683j545j498j886k559k725k081j169m17K05M72K6
52781A38835o90p92l96m59j110j419j070r07j440k072k265k200j982j369p09q75
52765A19080j827k413k120j746j866j875j181l42k47r63j959k768l003k400j244
52750I3126k06L46M22o8j019j667j503j300k078l252l235j799l71Q4rj53n58j191
52732G5569j436j036l89L13J154J724J543J151J402J807J208M2P0J582K827K608
52716I0139J729J228R48N25K97M75P48J237K437L780L802K308Q32L41Q2o69j388
$$ y = [207439, 206355, 205096, 203134, 201221, 200208, 199577, 198346, 196608, 194893, 192706, 189218, 184918, 181168, 178402, 176066, 174115, 173188, 173247, 173255, 172383, 170709, 168701, 166783, 165450, 165093, 165573, 166370, 166973, 166792, 165166, 162084, 158569, 155726, 153695, 152012, 150467, 148969, 147083, 144524, 141799, 139718, 138549, 138132, 138337, 138809, 138835, 138145, 137353, 136957, 136498, 135388, 133969, 132899, 131992, 130552, 128480, 126215, 124015, 122033, 120664, 119955, 119080, 117253, 114840, 112720, 110974, 109108, 107233, 106052, 105710, 105463, 104500, 102541, 99773, 96770, 94370, 93126, 92920, 93266, 93688, 93620, 92601, 90934, 89431, 88131, 86053, 82801, 79566, 77767, 77396, 77480, 77471, 77318, 76760, 75569, 74133, 73097, 72708, 73021, 74175, 75899, 77442, 78593, 79995, 81802, 83010, 83052, 83122, 84704, 87531, 90139, 91868, 93096, 94044, 94569, 94866, 95341, 96089, 97326, 99763, 103543, 107345, 109653, 110485, 110826, 110908, 110239, 108851]
52699A08851j592j817k379k626k276k083k366k281j464r18j335j890j703j246
52685H2875j233j368j217j229j807k355k257j877j731j573j111o50l43K50J152
52670F5526J521R34J25k99p27j466j891j457n92J45Q35J454J433O18k71p89j281
52653F3818j812j620m32P85J085O17m4o11p03M5R83P81o79j861j601l67Q62J707
52635F0953J962J499J090J853L330L682K243L90o67j222j650j468p04l40n59l22
52619G0070M62L26j117j998j010M84O80j25o86q23p57J0J449K168J382L63M40
52602G1318R86R66Q30J197J225J96p35l64L42l3p12m5J531K192J643J145J166
52585H2848J121J015J343J742J443Q09P93J292J545J671K209K716K463J967K134
$$ y = [108851, 107259, 105442, 103063, 100437, 98161, 96078, 93712, 91431, 89967, 89049, 87714, 85824, 84121, 82875, 81642, 80274, 79057, 77828, 76021, 73666, 71409, 69532, 67801, 66228, 65117, 64467, 64124, 64374, 65526, 67047, 67981, 68106, 67807, 67080, 65614, 63723, 62266, 61674, 61819, 62654, 64108, 65541, 66159, 65888, 65099, 63818, 62006, 60386, 59954, 60739, 61824, 62441, 62397, 61786, 61083, 61128, 62111, 62892, 62213, 60352, 58751, 58384, 59246, 60953, 62915, 64414, 65504, 67357, 70687, 74369, 76612, 77002, 76335, 75113, 73463, 71995, 71291, 70951, 70392, 70070, 70532, 70858, 69741, 67743, 66733, 67217, 67897, 67772, 67086, 66263, 65506, 65516, 66965, 69133, 70515, 70878, 71318, 72304, 73270, 74100, 75297, 76522, 76718, 75983, 75619, 75961, 75928, 75216, 75171, 76702, 78894, 80537, 81682, 82848, 83969, 84984, 86327, 88069, 89512, 90321, 91114, 92406, 93951, 95622, 97831, 100547, 103010, 104977, 107111]
52570A07111K410J592J05l77N56J691K216K504K812K748K221J658J166N16m4L9
52554A28924O78J243J402J217P30K07J79O00O15k5j97R21K387K775K118J380R01
52537A46055O24Q73J578J581K29j197j200l91m27j299j501n04O72J198J196R20
52521A48407M69J62J01l01j361k233k076j420j192j141n48K73N40L57J21n13j624
52504A38021j926m83J363J646O70K95R44J417J274J278J604J584J122P12J95p57
52488A48959j251j41J711K212J030j07j56J11l5j84PJ02j16k54k76o35j225j355
52470A48397q65k02N66J604K385K140J143L27q5l81k62N80J258P66j40L0R91J156
52452A59408M01J66P23O47n62j495j221o90r27j429j364j063j289k001k580k554
$$ y = [107111, 109521, 111113, 111218, 110841, 111397, 113088, 115304, 117808, 120620, 123368, 125589, 127247, 128413, 128929, 128885, 128924, 129602, 130845, 132247, 133464, 134194, 134401, 134580, 135180, 135795, 135770, 135573, 136494, 138881, 141656, 143774, 145154, 146055, 146679, 147552, 149130, 150711, 150940, 149743, 148543, 148152, 147725, 146426, 144925, 144421, 145093, 146291, 147487, 148407, 148876, 149038, 149139, 148838, 147477, 145244, 143168, 141748, 140556, 139415, 138867, 139140, 139680, 140037, 140158, 139645, 138021, 136095, 135612, 136975, 138621, 139291, 139586, 140530, 141947, 143221, 144499, 146103, 147687, 148809, 149521, 149716, 148959, 147708, 147567, 149278, 151490, 152520, 152413, 152257, 152368, 152333, 152149, 152156, 152258, 152142, 151888, 151612, 150977, 149752, 148397, 147532, 147330, 147896, 149500, 151885, 154025, 155168, 155495, 155410, 155029, 154767, 155347, 156605, 157371, 157231, 157261, 158252, 159408, 159809, 159975, 160698, 161345, 160783, 159288, 158067, 157377, 156450, 155021, 153657, 152594, 151305, 149304, 146724, 144170]
52436A44170j765n60P1n61j741k231j976j776j536m51J110J689R62K01J76J49
52420A35931m48r81q55n34n25n17j77J39J23R3L34N90N65K67k56q94j161p47j44
52401A30803L3J16Q04J868K482K463K051J066m38j230k88J378J968J505J318J446
52385A47345P99k88j97J084J705J060P65J700K443J773P11P55J695K505K969L308
52369A70132L349L179L475M262M517L761K925K761K656J884R48O72R63J326J738
52354B08548K187K252J869J722K214K740K685K280K045K045K159K405K607K508
52340B40266K315K372K410K021J760K443L471L386K176J382J689K114J966J889
52326B71660K307K510K073J629J549J251O23O42J699K716K821K640K980L529L766
$$ y = [144170, 142405, 141845, 141916, 141355, 139614, 137383, 135407, 133631, 132095, 131644, 132754, 134443, 135405, 135606, 135782, 135931, 135483, 134502, 133647, 133113, 132588, 132071, 131894, 132033, 132156, 132249, 132583, 133173, 133738, 134005, 133749, 132855, 131694, 130947, 130803, 130836, 130952, 131756, 133624, 136106, 138569, 140620, 141686, 141248, 140018, 139730, 141108, 143076, 144581, 145899, 147345, 148144, 147856, 147659, 148743, 150448, 151508, 152273, 153973, 156416, 158189, 158900, 159655, 161350, 163855, 166824, 170132, 173481, 176660, 180135, 184397, 188914, 192675, 195600, 198361, 201017, 202901, 203849, 204521, 205484, 206810, 208548, 210735, 212987, 214856, 216578, 218792, 221532, 224217, 226497, 228542, 230587, 232746, 235151, 237758, 240266, 242581, 244953, 247363, 249384, 251144, 253587, 257058, 260444, 262620, 264002, 265691, 267805, 269771, 271660, 273967, 276477, 278550, 280179, 281728, 282979, 283602, 284244, 285943, 288659, 291480, 294120, 297100, 300629, 304395]
52311C04395L961M338M411M067M214N434P009Q067Q723R341R764J0005J0648J1698
52297D06075J2145J1452J0564J0652J1767J3345J5030J6401J6964J6977J7306
52286E58678J8029J8330J8124J8357J9208J9602J9194J9212K0361K1481K1434
52275G72010K0847K0765K0895K0449J9561J8640J7411J5733J4398J3866J3186
52264I67761J1325Q697O351M515K982J965J526R79j42j311j986k544l417m307
52250I92394m967n778o753p154o794o456o305n309l220j539j250j126L58K738
52236I38839M745O471Q678J0992J2523J3483J4620J5686J5977J5742J5697J5738
52224A089191J5432J5126J5304J5423J4648J3162J1691J0341Q907P536O149M082
$$ y = [304395, 308356, 312694, 317105, 321172, 325386, 330820, 337829, 345896, 354619, 363960, 373724, 383729, 394377, 406075, 418220, 429672, 440236, 450888, 462655, 476000, 491030, 507431, 524395, 541372, 558678, 576707, 595037, 613161, 631518, 650726, 670328, 689522, 708734, 729095, 750576, 772010, 792857, 813622, 834517, 854966, 874527, 893167, 910578, 926311, 940709, 954575, 967761, 979086, 987783, 994134, 998649, 1001631, 1003596, 1005122, 1006101, 1005959, 1004648, 1002662, 1000118, 996701, 992394, 987427, 981649, 974896, 967742, 960948, 954492, 948187, 942878, 939658, 938119, 936869, 935743, 936101, 938839, 943584, 950055, 958733, 969725, 982248, 995731, 1010351, 1026037, 1042014, 1057756, 1073453, 1089191, 1104623, 1119749, 1135053, 1150476, 1165124, 1178286, 1189977, 1200318, 1209225, 1216761, 1222910, 1226992]
52212A226992J375o76j427k228m441p278r088r902j0925j2361j3460j4156j5024
52199A127401j6017j6684j7242j8024j8431j7769j6553j5648j4778j3283j1691
52188I51281j0968j0777r992q558p325o576o080o074o687o953n967m514m012m351
52174H52447m385l968l784l693l061k375k617l342l241k432k250k838l015k562
52160H08884k628l537m148l848l438l514l591l381l380l607l262k270j735k146
52146G64399k484j946j301j662k868l985m598m847m837m727m857n182n149m513
52132G11443l816l606l700l634l346l115l121l355l614l554l075k631k701l107
52118F65068l338l368l502l552k959j793q61o45p16m19M02J480K540L502M491
$$ y = [1226992, 1228367, 1227691, 1226264, 1224036, 1219595, 1212317, 1203229, 1193327, 1182402, 1170041, 1156581, 1142425, 1127401, 1111384, 1094700, 1077458, 1059434, 1041003, 1023234, 1006681, 991033, 976255, 962972, 951281, 940313, 929536, 919544, 910986, 903661, 897085, 891005, 884931, 878244, 871291, 865324, 860810, 856798, 852447, 848062, 844094, 840310, 836617, 833556, 831181, 828564, 825222, 821981, 819549, 817299, 814461, 811446, 808884, 806256, 802719, 798571, 794723, 791285, 787771, 784180, 780799, 777419, 773812, 770550, 768280, 766545, 764399, 761915, 759969, 758668, 757006, 754138, 750153, 745555, 740708, 735871, 731144, 726287, 721105, 715956, 711443, 707627, 704021, 700321, 696687, 693341, 690226, 687105, 683750, 680136, 676582, 673507, 670876, 668175, 665068, 661730, 658362, 654860, 651308, 648349, 646556, 645695, 645050, 644334, 643915, 644317, 645797, 648337, 651839, 656330]
52103F56330N674O896P736Q111Q484R211J0127J1119J2543J4548J6577J8119J9425
$$ y = [656330, 662004, 668900, 676636, 684747, 693231, 702442, 712569, 723688, 736231, 750779, 767356, 785475, 804900]
$$ [...]
##END NTUPLES=NMR SPECTRUM
##END=
