
##TITLE=AC1273_CCJAH12091_6652516_R2AUVQvvqU
##JCAMPDX= 6.0         $$ Bruker NMR JCAMP-DX V2.0
##DATA TYPE= NMR SPECTRUM
##DATA CLASS= NTUPLES
##ORIGIN= BRUKER
##OWNER= Administrator
$$ 1.72 TOPSPIN		Version 2.1
$$ 2012-08-10 15:45:49.703 -0500  Administrator@TOPSPIN
$$ Compression mode = diff/dup
##.OBSERVE FREQUENCY= 400.02188249412
##.OBSERVE NUCLEUS= ^1H
##.ACQUISITION MODE= SIMULTANEOUS (DQD)
##.ACQUISITION SCHEME= undefined
##.AVERAGES= 8
##.DIGITISER RES= 22
##SPECTROMETER/DATA SYSTEM= spect
##.PULSE SEQUENCE= zg30
##.SOLVENT NAME= COFFEE_meoh
##.SHIFT REFERENCE= INTERNAL, COFFEE_meoh, 1, 14.98509
##AUDIT TRAIL= $$ (NUMBER, WHEN, WHO, WHERE, PROCESS, VERSION, WHAT)
$$ ##TITLE= Audit trail, TOPSPIN		Version 2.1
$$ ##JCAMPDX= 5.01
$$ ##ORIGIN= Bruker BioSpin GmbH
$$ ##OWNER= Administrator
$$ $$ C:\Bruker\TOPSPIN/data/COFFEE/nmr/AC1273_CCJAH12091_6652516_R2AUVQvvqU/10/pdata/1/auditp.txt
$$ ##AUDIT TRAIL=  $$ (NUMBER, WHEN, WHO, WHERE, PROCESS, VERSION, WHAT)
(   1,<2012-08-10 15:45:42.187 -0500>,<Administrator>,<TOPSPIN>,<go>,<TOPSPIN 2.1>,
      <created by zg
	started at 2012-08-10 15:44:35.718 -0500,
	POWCHK enabled, PULCHK disabled,
       configuration hash MD5:
       6B 1B 68 BB D9 2E 58 E2 7F 35 AD 54 07 DF 0E 41
       data hash MD5: 64K
       18 CD 28 C5 59 DC 5E E0 C1 E9 A0 16 8C A2 12 C4>)
(   2,<2012-08-10 15:45:45.093 -0500>,<Administrator>,<TOPSPIN>,<proc1d>,<TOPSPIN 2.1>,
      <Start of raw data processing
       efp LB = 0 FT_mod = 6 PKNL = 1 PHC0 = 0 PHC1 = 0 SI = 32K 
       data hash MD5: 32K
       4E A8 16 68 93 76 AE 7C 4A 9D 2F A4 CE 75 6F FF>)
(   3,<2012-08-10 15:45:45.468 -0500>,<Administrator>,<TOPSPIN>,<proc1d>,<TOPSPIN 2.1>,
      <pk PHC0 = 182.785 PHC1 = 0 
       data hash MD5: 32K
       E7 0D C1 EA BE A6 9D AB B0 68 1E 05 4E 1A 22 55>)
(   4,<2012-08-10 15:45:45.515 -0500>,<Administrator>,<TOPSPIN>,<proc1d>,<TOPSPIN 2.1>,
      <abs ABSG = 1 
       data hash MD5: 32K
       A0 DF B7 19 6F FC 76 DF 16 D0 22 D0 50 3F 07 76>)
(   5,<2012-08-10 15:45:45.546 -0500>,<Administrator>,<TOPSPIN>,<proc1d>,<TOPSPIN 2.1>,
      <abs ABSG = 2 
       data hash MD5: 32K
       E9 16 EE 26 D8 5E CA 78 68 24 EA 7A EE 61 99 0E>)
(   6,<2012-08-10 15:45:45.578 -0500>,<Administrator>,<TOPSPIN>,<proc1d>,<TOPSPIN 2.1>,
      <abs ABSG = 3 
       data hash MD5: 32K
       EC 3D 9A E3 D7 29 05 F8 CD 4C E5 66 50 69 22 CF>)
(   7,<2012-08-10 15:45:45.609 -0500>,<Administrator>,<TOPSPIN>,<proc1d>,<TOPSPIN 2.1>,
      <abs ABSG = 4 
       data hash MD5: 32K
       12 05 43 4E A0 1E EF 00 92 DD C0 3F A1 48 C8 B8>)
(   8,<2012-08-10 15:45:45.640 -0500>,<Administrator>,<TOPSPIN>,<proc1d>,<TOPSPIN 2.1>,
      <abs ABSG = 5 
       data hash MD5: 32K
       E2 0E 04 FF FE 19 5F 0E 90 C1 03 82 BF F9 80 1A>)
$$ ##END=
$$ 
$$ $$ hash MD5
$$ $$ EA 77 59 52 03 7A ED 74 E8 6B D1 33 0A D8 5C 0D
##$RELAX= 
##$RELAX= 
##$RELAX= 
##$RELAX= 
##$RELAX= 
##$RELAX= 
##$RELAX= 
$$ Bruker specific parameters
$$ --------------------------
$$ [...]
##$TP= (0..7)
150 150 150 150 150 150 150 150
##$TP07= 0
##$TPNAME0= <>
##$TPNAME1= <>
##$TPNAME2= <>
##$TPNAME3= <>
##$TPNAME4= <>
##$TPNAME5= <>
##$TPNAME6= <>
##$TPNAME7= <>
##$TPOAL= (0..7)
0.5 0.5 0.5 0.5 0.5 0.5 0.5 0.5
##$TPOFFS= (0..7)
0 0 0 0 0 0 0 0
##$TUNHIN= 0
##$TUNHOUT= 0
##$TUNXOUT= 0
##$USERA1= <user>
##$USERA2= <user>
##$USERA3= <user>
##$USERA4= <user>
##$USERA5= <user>
##$V9= 5
##$VALIST= <valist>
##$VCLIST= <CCCCCCCCCCCCCCC>
##$VD= 0
##$VDLIST= <DDDDDDDDDDDDDDD>
##$VPLIST= <PPPPPPPPPPPPPPP>
##$VTLIST= <TTTTTTTTTTTTTTT>
##$WBST= 1024
##$WBSW= 4
##$XGAIN= (0..3)
0 0 0 0
##$XL= 0
##$YL= 0
##$YMAX_a= 489992
##$YMIN_a= -643833
##$ZGOPTNS= <>
##$ZL1= 120
##$ZL2= 120
##$ZL3= 120
##$ZL4= 120
##$ABSF1= 14.98509
##$ABSF2= -5.573092
##$ABSG= 5
##$ABSL= 3
##$ALPHA= 0
##$AQORDER= 0
##$ASSFAC= 0
##$ASSFACI= 0
##$ASSFACX= 0
##$ASSWID= 0
##$AUNMP= <proc_prof1d_extract_pilot.lims>
##$AXLEFT= 0
##$AXNAME= <>
##$AXNUC= <1H>
##$AXRIGHT= 0
##$AXTYPE= 0
##$AXUNIT= <>
##$AZFE= 0.1
##$AZFW= 0.1
##$BCFW= 0
##$BC_mod= 0
##$BYTORDP= 0
##$COROFFS= 0
##$CY= 15
##$DATMOD= 1
##$DC= 0
##$DFILT= <>
##$DTYPP= 0
##$F1P= 0
##$F2P= 0
##$FCOR= 0.5
##$FTSIZE= 32768
##$FT_mod= 6
##$GAMMA= 0
##$GB= 0
##$INTBC= 1
##$INTSCL= 1
##$ISEN= 128
##$LB= 0
##$LEV0= 0
##$LPBIN= 0
##$MAXI= 10000
##$MC2= 0
##$MEAN= 0
##$ME_mod= 0
##$MI= 0
##$NCOEF= 0
##$NC_proc= -8
##$NLEV= 6
##$NOISF1= 0
##$NOISF2= 0
##$NSP= 0
##$NTH_PI= 0
##$NZP= 0
##$OFFSET= 14.98509
##$PC= 1
##$PHC0= 182.785
##$PHC1= 0
##$PH_mod= 1
##$PKNL= yes
##$PPARMOD= 0
##$PPDIAG= 0
##$PPIPTYP= 0
##$PPMPNUM= 2147483647
##$PPRESOL= 1
##$PSCAL= 4
##$PSIGN= 0
##$PYNMP= <proc.py>
##$REVERSE= no
##$SF= 400.02
##$SI= 32768
##$SIGF1= 0
##$SIGF2= 0
##$SINO= 400
##$SIOLD= 32768
##$SPECTYP= <>
##$SREGLST= <1H.CDCl3>
##$SSB= 0
##$STSI= 32768
##$STSR= 0
##$SW_p= 8223.68421052631
##$SYMM= 0
##$S_DEV= 0
##$TDeff= 65536
##$TDoff= 0
##$TI= <>
##$TILT= no
##$TM1= 0
##$TM2= 0
##$TOPLEV= 0
##$USERP1= <user>
##$USERP2= <user>
##$USERP3= <user>
##$USERP4= <user>
##$USERP5= <user>
##$WDW= 1
##$XDIM= 32768
##$YMAX_p= 451608425
##$YMIN_p= -745075
##$CURPLOT= <Network HP LaserJet P1505>
##$CURPRIN= <$Network HP LaserJet P1505>
##$DFORMAT= <normdp>
##$LAYOUT= <+/1D_H.xwp>
##$LFORMAT= <normlp>
##$PFORMAT= <normpl>
##$SURQMSG= 1
$$ End of Bruker specific parameters
$$ ---------------------------------
##NTUPLES= NMR SPECTRUM
##VAR_NAME=  FREQUENCY,     SPECTRUM/REAL,   SPECTRUM/IMAG
##SYMBOL=    X,             R,               I
##VAR_TYPE=  INDEPENDENT,   DEPENDENT,       DEPENDENT
##VAR_FORM=  AFFN,          ASDF,            ASDF
##VAR_DIM=   32768,         32768,           32768
##UNITS=     HZ,            ARBITRARY UNITS, ARBITRARY UNITS
##FACTOR=    0.250966925370066, 1,           1
##FIRST=     8223.43324360094, -282841,      130351
##LAST=      0,             -66292,          -114477
##MIN=       0,             -745075,         0
##MAX=       8223.43324360094, 451608425,    0
$$ Real data points
##PAGE= N=1
##DATA TABLE= (X++(R..R)), XYDATA
$$ [...]
23774 -343093 -332135 129347 110305 151596 -50527 8770 -89010 163814 -18405 81139 -78350
23762 5356 -146414 -6648 -218885 41883 84744 -35269 -113542 104777 -85196 62381 -319572
23750 142527 -122195 155720 29908 -6351 93590 315273 70786 -30630 -88113 -238678 172779
23738 192620 149400 -94561 -1162 30065 51488 -301183 -50491 84001 -276181 -153915 -63322
23726 10637 65226 -272842 143139 78963 -178413 -29771 23646 -8073 -44715 126986 -58316
23714 -37895 149658 -57330 196983 35495 -130690 -23386 89769 282790 -143645 -117702 200731
23702 101803 -152724 -170204 31718 -147276 -125725 -200698 -171804 72344 -190272 -242225 -90008
23690 56747 34271 -59374 64879 -171625 -23451 -306922 -262486 -228404 -16170 292282 70851
23678 -49683 -308929 -382978 -8476 -295838 -62806 42909 -83711 252490 -51247 130388 55891
23666 38806 -95608 -349903 -41814 -7684 55179 107881 157002 -51417 -112951 -104011 94134 10766
23653 -82130 -410280 84695 -49258 -18058 -166809 -31613 -9793 32768 -46139 -128167 130444
23641 -53674 -108773 188859 163545 141960 -44707 87905 410259 -40147 188310 -277639 54833
23629 -147193 -20528 -271330 70533 163111 -198818 -191629 174110 -196335 166297 -82542 -69622
23618 -69622 -124714 -84465 -230526 -142482 115921 -113531 -82534 169580 69054 26897 -85359
23606 -4366 -155852 84483 168250 -59391 -65920 57144 -123183 56544 42307 240233 -175477
23594 237454 -10202 -46803 186087 99444 208265 273505 122431 309437 -28237 372085
23583 484649 49027 185877 -121843 77467 161470 37358 -124875 -18351 55209 -10166 81648
23571 -223113 -131001 -76031 -26036 -142288 -44869 35698 -266540 9554 -31277 89081 -54301
23559 -49608 -163435 103359 -8476 -212043 81275 95735 -311987 -121939 86156 -260187 103012
23547 55873 -12783 48977 15045 -37724 -18648 -1054 141342 23149 -397864 -1137 193862
23535 249428 27830 18931 256071 -180823 62553 -45470 65399 -355334 77599 60300 34674
23524 34674 -45489 -17200 -42253 3756 63412 -257973 15727 -228721 -185700 -82573 92323
23512 -128854 10099 -151645 -42494 -101623 82150 271221 -199045 -156578 -7760 -98562 -95140
23501 -95140 73260 103098 -148458 14483 -92699 -26813 84627 39377 163574 -30907 -214296
23490 -214296 -391319 76854 -97402 -203426 -49406 -447009 236328 13090 -111641 -47712
23479 -7963 91556 57011 -20879 -121619 363129 -52750 -334117 8211 -358772 -75126 71797
23467 -31315 36919 -326335 -126516 291983 -65439 -92297 -83179 -920 103383 -208470 199498
23455 -92260 117516 -134283 -82695 -78497 58330 -119959 -18073 -25525 -110327 -136027 285037
23443 -50900 41322 180757 -155199 -6201 -5689 77097 7698 -100305 -2068 -149286 94778 87729
23431 87729 -49211 -54801 -380088 30739 -61966 18378 -141393 -115923 -213906 -51556 -84622
23420 -84622 -127510 -197018 -38725 -205852 -95059 264064 140862 -218620 -219778 -70032 -260444
23409 -260444 -43361 -14137 -41282 -118955 -5357 48143 -499115 114563 154791 107983 21926
23397 171460 -251472 294688 -6675 160969 -196118 227796 148043 212152 308945 219182 -141192
23385 45713 105407 -192280 117332 64570 9429 32758 32073 -101953 108289 -170355 173994
23373 203469 -254521 87264 -41721 -50620 65527 -182072 -412480 -255706 -497330 -144470
23362 117527 -1818 -105296 -148840 -170790 166558 -27663 -88883 96595 136409 -268796 -92287
23350 17476 98689 18264 208144 -194872 -26843 161714 -288358 -242901 2533 -140805 62722
23338 61847 -89498 273844 65768 6257 109938 27016 207326 165449 -119743 -78162 135369
23326 77530 -68869 161426 -292090 -21145 203295 38963 -197349 29653 -198639 75988 -364417
23314 261531 -122309 -8811 86695 -81443 18385 132228 143652 -76681 252112 -112520 197642
23302 -308352 -204693 55814 58151 -25403 236236 99332 -105865 -196519 -358296 -196806 29610
23290 9461 -128690 -49384 869 -7177 -10774 -124478 -13326 -165025 62635 -263988 6748 32122
23278 32122 10381 -104632 194762 -166527 -156224 -209729 -32093 -53564 52215 84898 1472
23266 19905 318765 -22077 -185660 -72222 -123319 -95417 40136 -9092 -143258 -4997 170750
23254 -8876 110475 -116038 -214346 -148493 -11706 -48563 -44517 362038 -12801 -150553 -11814
23242 -122713 -136291 -72467 -91357 -5713 29802 293622 -4305 -45779 -67001 -73590 370226 -329207
23229 -86445 -91923 -356970 -267748 -94530 583236 -7246 -11048 -275041 -208887 -300449 -271917 9169
23216 -129752 -12348 -124126 21086 -232516 -134281 163029 71858 -76910 -245543 369844
23205 -119105 137626 234259 316172 -30277 -191181 18695 46113 33177 -93804 -129276 33399
23193 -2472 165114 4214 27663 -42007 -4544 16731 123283 117689 -89137 18895 114428 -104675
23180 171828 -60069 51011 -214434 -136150 -11174 112100 -38114 -198933 239245 -211843
23169 -276762 -158515 17302 -48244 31652 -253867 70256 -295436 -329605 -172841 -440746
23159 -440746 10808 244926 39282 -96704 -231381 -258515 93093 56648 197571 201938 222257
23148 222257 -481614 -153862 -37426 -35061 93935 -347770 -28471 338634 115451 263241
23138 263241 -156905 -63176 -149131 219765 87160 97735 -27256 29872 385685 -244463 129727
23126 248933 7786 -184602 -49009 -304507 40166 71867 54586 236845 -20380 -30165 -243304
23115 -243304 114733 188205 -114669 -55139 -120680 310112 25590 367472 -224608 -51918
23104 82311 266030 -258510 50262 218983 -7303 -74078 -297222 33353 -229153 233279 363127
23093 363127 23005 26745 -106829 -292141 359844 -323719 26312 69757 29139 -50179 237527
23081 -26835 -100603 -194752 -139520 -277586 113644 138665 -13944 -33345 -145494 -155598 -21906
23069 74002 40925 -173651 -85423 248853 -98120 107341 51748 -190852 83513 105747 145211
23058 145211 125686 7844 45818 -27861 -62061 396044 182710 261611 -2003 105863 287208
23047 287208 -35905 135357 -53095 183714 -55396 492240 -315589 -127782 4853 -218399
23036 -50634 -30229 124066 -113405 9091 189074 189078 238237 -178795 -169472 73522 190582 259394
23024 259394 -126645 29097 -41557 -29624 294602 -152884 -126819 15870 -235071 -221113 86088
23012 -199816 268842 -25495 76997 -90074 56360 -9951 131778 60916 23661 -301106 126037
23000 59323 186141 -484918 -56971 21092 -274504 -167715 -82885 -135241 -14940 7290 116478
22989 116478 -34410 140849 323460 40324 -273070 293906 23395 -296981 77859 -185321
22978 178006 33034 87538 -165700 -147960 118682 -18754 -102024 -33265 158553 15258 -53500
22966 -138730 -60479 12732 114433 28410 -98480 273173 -106682 -89539 364964 88673 -155803
22954 8896 1637 -107169 31937 -57020 -307668 -262643 -225841 -119534 -202415 43724 65500
22943 65500 -370910 17132 -191274 221571 -376959 121092 -15622 -395951 91903 187223
22933 187223 363731 87890 -154917 62752 62938 -70919 295054 83235 94696 340383 31981
22921 64019 170265 -188852 317484 -63192 351311 -7631 -44318 -270975 380221 -274245
22910 28177 -265894 -302884 -187263 -345172 -23393 -158774 -120508 -182810 -203429 -203686 50404
22898 -101110 -208656 116936 -479081 -243404 153657 58665 4242 -3793 -69803 55227 -78603
22886 -266997 123658 109704 -89101 -94470 152353 108732 -8131 70418 131863 -374787 38130
22874 -76695 -326130 9180 341219 -8005 -148236 131810 -226113 118681 -313619 227565
22863 -273368 -174626 -100445 -131670 -150565 -24077 -159581 141285 -127783 -205128 -196114 -194060
22852 -194060 -64782 45230 227947 -31465 -90645 17745 -83224 211005 118706 -201582 -106284
22841 -106284 97549 188215 -170586 -105342 29504 139872 -20023 66639 -126938 140172 136295
22830 136295 77786 44201 -63024 -52565 47443 -114835 244961 -24985 315654 -119366 -148064
22819 -148064 78792 151661 -114969 3485 -85392 -85291 -100370 42930 111604 -130652 -39022 -64928
22807 -64928 64839 4552 -126324 2245 -251683 -22763 -389878 -46519 -196608 149708 156629
22796 156629 -260050 333249 -228282 170476 79956 -71441 105386 -551964 -271841 -55989
22785 4395 -190863 -78057 30835 16346 -33473 38580 138311 155137 67801 -83595 48226 12034
22772 -141417 -20723 -142442 -301383 106666 -184710 257072 -26085 -50774 -24585 -41894
22762 -41894 -28714 148427 -337209 -57201 -120972 -90871 30335 -149848 228546 -258453 62948
22750 40479 23056 -149591 -69456 80983 -226001 173249 -357958 -123302 -149798 -45383 22322
22738 -51022 -88713 -111305 -44067 -184924 -288871 -146197 -129946 -8307 173380 -277354 201927
22726 -53307 99037 -40370 111769 214228 55537 -68711 -112717 77861 -123118 -183467 82227
22714 52876 -17866 -205377 -36466 37673 41727 -171683 -258090 -22188 -82519 -42446 23788
22702 -204434 -32692 -214898 172638 231464 -339231 -282917 -39439 -113615 -67961 -8274 51581
22690 -17306 193866 -194081 66472 212022 -122427 90804 17510 -157175 -196656 -138724 87341
22678 382692 86598 108339 -122660 -4205 -49333 -137420 -162373 -200302 -69173 -193704 -51987
22666 -243059 80500 -50171 -96272 -41866 162478 8283 134356 43694 131148 42153 185551
22655 185551 26971 -132841 -264330 -60462 6602 -180998 -132627 -161338 -145154 -258255 12427
22643 -116785 1311 132683 15686 92808 -382485 -199813 -190618 -206867 273882 163355 -210458
22631 102727 131889 176214 -231569 5239 53760 30727 -101806 213428 -35146 27286 -416033
22619 -15904 -311358 -129472 62762 275817 -502423 -70993 -288735 -139312 -79487 -135139
22609 -135139 -216219 -455873 -49209 -321293 32561 -81033 35824 -45250 -209312 -149005 96230
22597 91746 167648 -140093 174465 -105935 -186358 -174872 -275734 4009 121913 9056 -391161
22585 -252371 -226315 204408 2160 -147369 -51915 -195645 -135975 41245 -274306 -307469 22251
22573 154332 167328 -111345 -137113 -185634 -256500 -40614 -148891 176444 93345 48459 -195292
22561 188217 10730 190098 146625 -41868 -351031 -50966 -239023 -79348 -77866 -161511 -11355
22549 15577 152994 348734 -238358 -81434 18192 -196489 -25604 -767 -162469 -81808 -160361
22538 -160361 13946 139783 -93518 -84679 3803 5105 12580 320780 -62185 -42170 75963 87179
22526 87179 -241250 -205855 -213107 -40174 -31336 -19278 -150571 -62301 278256 -380705 -338516
22515 -338516 -99257 92309 -61822 51890 -177255 243288 -156736 130824 208453 -12796 -146993
22504 -146993 107113 199090 -311820 -159115 73312 -95929 61091 139066 88391 378536 -350486
22492 -100373 -344873 20990 -137364 5550 -17431 -263665 -89177 35477 243371 -231067 -54139
22480 -214642 15388 -266166 -75123 -275622 -380451 115079 -212096 -88601 -40683 -127524
22470 -127524 -64369 -187983 258418 -89207 81839 17572 -43877 -82164 222960 35152 83990
22459 83990 -213306 -100339 206273 44249 -148315 -118980 258014 48016 -333062 127535
22448 -223187 -244980 -87327 182863 -123313 5839 35971 93318 178418 177314 -135846 -100296
22437 -100296 -224137 107692 -67322 -89648 151700 17583 68344 -105558 -145175 -20676 -330263
22426 -330263 11395 -235879 -259688 -59346 -102402 494900 -303261 -100382 -43722 -66063 -166146
22415 -166146 -585 -42465 -109836 -16137 -62682 -109783 106945 340193 -215973 7074 -385642
22403 -44199 -217318 -101813 139244 -14821 -167910 -219645 136792 351496 123130 -9651
22392 -157335 -19419 371862 31436 -289823 -18813 231838 -273943 107860 2529 505903
22382 505903 -91191 -387646 -68819 -181804 66720 12638 -183006 20579 6499 -109002 -224695
22371 -224695 217163 87881 -260622 -275617 -45643 288764 -166201 -266135 105235 -240775
22360 -131702 -336681 -32414 229762 -26953 -4257 -107159 -24691 -390522 100882 4091 210161
22349 210161 -92257 -257135 -191094 322978 -90545 8352 104497 -105412 -54816 41392 -171013
22337 -9069 187478 45321 -137079 375207 267140 85940 68329 -93082 36099 -49015 91550
22325 11333 -301534 189325 236958 -288679 -126199 -26061 -42731 -86285 -42308 -126609 -9515
22313 25449 -151956 -243745 -53848 12545 64297 -18840 -171948 106445 306487 -237198 191371
22301 -67036 203010 -149690 -191000 44434 -183634 134102 -74791 11160 153227 -156593
22290 -53876 -128018 166748 222515 5508 -33771 -12874 227370 258656 102313 -15717 -130803
22279 -130803 32969 122906 -98597 211641 -123570 31023 -177160 -200754 -317341 -160091
22269 -160091 -56035 53259 -67483 -193581 269964 -105711 -346368 15999 116781 -52312
22258 -80388 211427 248939 154497 90988 -185178 -53131 -40836 -24890 -117600 82081 -139460
22246 1445 4281 -221803 -208434 216583 -342893 -26405 -181765 -24586 120912 -35462 -123843
22235 -123843 -119874 -151604 13620 -216097 -135011 -183913 -5646 -135948 -70480 -105752 75574
22223 67534 5717 1391 -76929 -313527 -162211 -32983 261179 -159024 184821 -268287 113542
22211 330744 59630 -260038 376506 -219006 160294 38317 48694 -234808 -170816 -140577
22201 -140577 -267583 314324 17503 -51067 19659 117356 -58950 -286733 -53283 285476 -44839
22189 -240980 -204774 -7382 29077 -319225 243245 -13557 186396 -84017 -188241 -48851 -203980
22178 -203980 6117 -154586 -301399 -22662 286446 -20028 -31587 10636 -157116 134534 -4347
22166 -198055 -253134 -390599 -226013 -237745 200584 69263 -293133 -112939 -241155 -145164
22156 -145164 -53116 -182645 -292940 -217996 124223 184592 -247497 -43212 -11185 358652
22145 -277745 -17760 -48116 -115229 53455 145693 102200 -274140 -113673 -328517 -196341 50021
22133 -112168 -67623 110105 347989 -54560 -71726 96032 386646 221277 45362 -174438
22122 -240972 86090 36051 -216828 324285 -148917 -70429 150351 257994 62437 -85753
22111 -174579 220656 18015 -113951 -125161 -105198 -385920 -101271 -17619 -25566 37672 -78265
22099 27873 67261 -221332 35808 170017 -408143 -296404 -87922 -75321 -228087 -191801 -204047
22088 -204047 203026 -46297 -265929 -34628 89290 -51873 -115304 -59327 17791 138989 -88134
22076 188673 48144 -157863 -27966 -52186 -119059 -151268 -152074 257976 177916 -117482 67596
22064 -11959 -185517 21422 -75638 -9471 -158499 -256267 -18427 275578 -16947 33791 -117736
22052 47157 80280 -306589 17193 -214027 -4457 -275155 -152080 43908 -207535 -127839 9221
22040 313113 161564 48524 -59100 -111607 157575 -42260 -147964 -215742 1036 -191913 -206053
22029 -206053 -251244 169905 91923 77606 -230543 -84163 2543 127376 -35726 -231986 -84366
22017 -99336 -89787 -345177 -214251 8210 -226939 -121210 -66856 -42243 -57443 -101344 -242759
22006 -242759 -139911 -199649 -245187 -20751 -166419 101023 243841 -192997 294276 -161972
21995 -36525 25143 -144182 12016 16969 -189149 119149 244 -176368 56352 100351 -363937
21983 174247 -192296 132576 -72900 -74071 -386255 -3917 20991 -17902 37838 -95059 176563
21971 -80410 -369635 -33347 -186544 163039 -73523 -71842 -280761 -285647 110272 -296451 -124111
21959 182491 -86918 28236 170007 -394247 97325 95468 -233646 -75308 -112947 -412116 361624
21947 28601 26027 801 278973 106097 -49647 -278915 88518 -45513 -71566 -178389 165578
21935 253240 -73348 160239 -127475 -110345 -147093 -87726 93833 26455 -178049 97514 -82099
21923 -220014 -186602 -120472 -35856 -119088 -6144 -157530 -74080 82890 4760 -226506 2217 127083
21911 127083 190192 -191949 39388 13899 -104306 57904 18768 -92401 -150029 -181855 28525
21899 207197 -188447 -181325 60814 129941 -274988 14586 60046 156932 -286942 -273037 -163446
21888 -163446 -213718 159511 200664 82330 -100815 -171124 79504 76630 -180335 -333566 -256002
21877 -256002 48872 276585 -57157 -18534 -30760 -206274 244998 248231 91288 125393 -266574
21865 -402918 7276 42046 -116569 196907 160921 -974 -126798 -67481 46208 252110 96717
21853 161046 -284700 166113 -297177 34607 -112186 9100 -171935 -103007 50441 -276191
21842 -62519 -23653 59979 -197965 -62001 -5515 101594 226138 1742 49002 -289644 32234
21830 -220112 31586 -343276 -320136 227236 -279436 -134254 101256 -283699 103979 -383079
21819 301711 272344 -98870 -359862 84923 -164764 5129 -78601 -55945 -87139 -99576 -256843
21808 -256843 127392 -31096 -98706 194691 133095 140469 14155 117354 -106593 239487 -202725
21796 195735 -82696 -133583 -15933 45280 323569 -177180 239726 163312 -124609 67820 -50725
21784 -53630 294156 75450 124226 42579 -218825 96371 -714 -67825 -92471 -372478 124154
21772 -96556 -14984 -30467 39545 154857 166343 39935 67320 415768 404074 229898 99074
21760 179342 15530 -139661 -98121 144609 237797 108455 235953 102371 -136702 90821
21749 -291598 -32388 -220981 78685 -38962 -281947 82555 -223003 143202 48302 -177647
21738 -75179 60644 -49949 -161535 -170554 162599 -191545 65510 297866 -157885 34925 215531
21727 215531 -33241 206368 -55605 -36481 7621 121231 69294 80305 65229 -479320 -94392
21715 -171568 -92587 -205453 -17378 54118 -304207 -38713 -45850 -93725 180087 -24159 -214867
21704 -214867 -108806 -8524 -249676 -287423 230186 228392 -295727 114450 -19607 33556 -292224
21692 -71423 -79553 -274196 -220275 -239139 39475 110548 -70004 -162422 -100890 127384 -173426
21680 -147685 -125061 70895 14554 -503943 84162 -211260 -140134 -248696 1027 -160946 -161173
21669 -161173 23075 -21821 345377 -59226 38308 -82308 -70750 54302 -50425 73100 97859
21658 97859 -174348 -68519 -195551 120028 57817 -151407 -57411 -141592 -53160 -180034 223398
21646 -101373 -48163 -269931 -297901 168670 -70284 -146990 -179109 65955 213102 -309184 40330
21634 19309 -146609 -115031 116858 -8433 -222694 47592 -120936 -38213 -96070 -27726 18271
21622 -243589 19610 15013 190457 -5874 -177344 -79151 -405340 -109346 16849 -151215 315190
21610 47129 -54962 299457 29202 -356842 -77534 -157298 79801 -160826 -161880 212433 116217
21599 116217 -213861 -269494 275939 34157 -5423 -369073 -238773 64003 -137568 -137501 113917
21587 -357455 133532 125317 -229000 -75234 43870 -175973 76968 34475 -240006 -265619 285847
21575 -84641 31826 -122311 -329834 232479 -87946 145023 -54723 298220 22188 -309536
21564 -75344 -112423 -18265 169964 99798 327485 266945 -72532 -28429 -261910 -87273 -71940
21553 -71940 -260111 -400080 -100850 269786 -2424 246204 -172170 293209 -63469 -317427
21543 -317427 23102 -138474 -117521 152091 -332605 -110756 210229 -23891 77492 -96306
21532 -83570 -176411 -123847 -406852 7840 16880 -28044 -243248 123738 80553 110329 7900 -38673
21519 -147061 18113 107920 -160693 -172705 -135922 67385 -85935 -158672 -125258 -336722 52695
21507 -340630 404784 -90203 289651 -34196 63580 -88208 -283452 106780 -230630 -58278
21496 -148497 -22303 204815 176000 -171324 139912 -184180 65313 -13126 186986 289353
21486 289353 62879 -6097 -59585 9912 -274691 200629 133061 68662 -69571 -135905 -81313
21475 -81313 4777 213290 -47392 -197615 -211208 -42579 -130941 219287 56631 -76557 -372951
21464 -372951 -71752 287497 -73321 38524 -228006 13731 124613 159279 -125758 163331
21453 -306 -48280 -107710 -29267 200900 131525 60120 25853 -15128 -24415 10396 46413 -282060
21440 -138779 114309 32046 370769 122677 474787 373466 167413 425717 185095 399078
21430 399078 107860 -165199 218243 223019 -156813 235130 -73837 565892 -78887 -376519
21420 -376519 -395805 -276831 507683 -231938 -39967 145456 -198603 -156849 -55370 -245077
21410 -245077 340955 -300524 210593 -50919 -52016 -33087 -163407 -330211 10160 -23405 -79661
21399 -79661 -275822 -310832 -406346 -304033 166133 -139623 39147 -126008 -72560 -36217 -190678
21388 -190678 -169420 -69129 -93850 -85341 -175834 -387232 -158580 219106 -84266 -54644 -184257
21377 -184257 77631 -157647 1050 61913 20776 -367633 34067 -80413 -142514 -2065 132151
21365 11133 -215298 -219352 80413 -184262 20203 38570 -406585 -278730 -185898 -362489 -238830
21354 -238830 23559 128047 -73227 -150423 -471 -93966 112231 -194 -925 1733 -401499 -201992
21342 -201992 -434639 -6452 9072 -215516 -144162 146709 -126667 -395271 -380192 129668 -451655
21330 -266506 226925 -227471 -129496 -179266 -50936 -150267 144111 147522 -278457 36631 -2082
21318 -35120 -11457 -154823 -405341 70612 -77820 126411 -242296 -123980 138286 135329 -110870
21306 -41697 -114890 -111817 44471 -119942 122498 87842 -205755 1229 -228356 -146700 177588
21294 31430 -336524 57568 -171707 -339299 -159563 -106083 -185959 -110290 -167482 125291 16621
21282 108586 169861 -269363 -118618 -43412 2848 -341579 65853 -61904 47228 -638 182189
21270 109414 285291 16956 52046 -20250 -106184 -300565 -155190 10238 -361601 -431766 -213700
21258 -327922 -72056 33129 -90626 114398 -19160 239127 -433027 361219 17585 -172025
21247 263170 179191 107085 -81536 79746 133642 -115561 -27329 -229659 131528 -193758 -50522
21235 34824 -94542 61564 77772 -425113 -198918 68744 182902 -344780 -186740 -167555 -226761
21224 -226761 -11450 78524 -62069 -41743 -33491 -13072 -335240 184852 -331388 -41159 -13114
21212 -304888 -16982 149541 -275808 -166321 -29936 138247 -200163 -83992 -100477 -77205
21202 -77205 -142149 1390 -173418 -82463 -262818 -30410 59937 33944 -120979 204570 -513747
21190 148795 -195917 -69680 366306 -34282 -68702 -254079 -45975 4054 -235878 152292 -296246
21178 707 -238858 136982 231439 -180484 -9520 -131676 76679 -237213 1020 124146 -57797
21166 35360 -169158 -247079 -9510 -236249 -100497 -120759 338404 -21126 -109393 -210511 -64553
21154 -147318 -387880 -204624 79202 -162110 -44947 -97414 91723 177033 -132926 76954 129128
21143 129128 -18724 234 -123407 -7909 100168 141334 128325 188030 -46510 -103403 176384
21131 -111487 121064 -322697 -45065 -295743 137934 90112 -127959 -565423 277776 -113209
21120 -105183 182973 -108109 -155747 115313 -41511 47193 -129125 -31252 -259161 183321
21109 -9600 142675 218476 88915 -347936 -540535 238629 -107100 -10706 -50495 -291418 -149596
21098 -149596 107770 -146679 -122233 375609 -254635 -201913 139392 -455052 70720 -130280
21087 -4139 -194374 -92357 140471 43503 -3598 -17282 267026 -101837 -64683 -222145 -218634
21076 -218634 -202098 -24991 9411 -76523 190517 -61789 -261367 -136185 107724 210966 541
21064 -154418 -200490 92900 -156694 -52402 -157322 234204 -291968 14404 -344984 225413
21053 -348671 -323039 -47242 9717 -372575 -170338 -9772 29750 99363 -128765 -20504 299730
21041 -44492 -281370 -148239 75386 44735 -189945 -166287 69769 -117295 -10863 -172415 305998
21029 180953 25837 -187156 57325 -100193 269042 106661 -258999 -53909 129066 -215515
21018 -87023 12171 104724 99210 -48336 -259724 169174 81449 -23502 -120736 30972 205230
21007 205230 386873 182763 690725 372275 570019 -33550 -35866 94521 140381 -195545
20996 -22368 -60030 -81597 38250 135116 148587 -70965 3416 133344 -93436 24377 125559
20985 125559 -4134 120365 -159213 -134000 -54946 17640 -134529 -38954 92153 -167110 -54521
20973 255766 -182744 -173061 110850 179873 20896 13404 -25183 51148 -272222 -40523 -194014
20962 -194014 -6468 119374 -13947 49449 67661 -98875 158799 155686 -97262 -383150 94194
20950 -132399 -20149 -272989 -122650 -25544 49765 125276 121783 420013 331284 84197 437901
20939 437901 432886 -97788 -40132 108662 -285106 49728 -50228 60654 -360778 36121 99737
20928 99737 -119987 268291 239059 -461986 -124159 99998 -156195 159911 -259222 -15069
20917 -149217 111567 -81655 41850 32823 168630 -630721 -126064 -124526 -421623 196776 -34843
20905 84593 -58942 -63016 -215280 -154432 -144959 -82524 -143043 -35034 -94765 -359116 56610 280725
20893 280725 -116445 31335 -367304 -218936 40361 -254183 -139643 57493 -179622 254359
20882 -49470 -9456 324233 -280177 -82997 -12001 98185 -327099 -360946 -94185 -39798 73879
20870 -69796 -36012 -120602 -36588 75342 766 -204276 -164503 6264 -246960 75869 -214814 51746
20857 202332 -268834 43305 -375295 127276 68608 -109542 -381830 138358 -67993 8591
20846 44072 119299 219037 219137 100479 -26287 -107556 -190470 -85631 -210341 -161930 -293316
20835 -293316 226727 -31915 83422 -61277 -87622 159991 -366457 83551 -45794 80527 28824
20823 -106364 86630 -170173 -110664 514397 91414 -165331 -133320 -745075 -71621 104854
20812 143317 -124033 -261133 -59010 -99553 45765 -129051 -118662 251530 -163621 -287713
20802 -287713 25087 -8430 -400612 -228470 -134281 -185616 -162393 -462397 107581 33573 32766
20791 32766 -49551 -77057 177766 -283847 -107072 87231 10797 22951 109583 -236338 -82309
20779 -56304 -421901 -229213 -22963 114235 5092 -94022 -37730 244851 -68450 87138 -224371
20767 -261767 -112984 133874 -167514 -111217 166045 -166723 -97208 -50461 180470 -212527
20756 -116273 241143 33106 -162113 -62949 -191225 -60424 122808 -133420 -221860 157324
20745 -54217 -67923 -11972 -166145 -228907 -143881 82964 -31545 -76945 111055 310619 -409326
20733 -64770 72631 -406350 -62008 -32282 70642 10109 143079 -244541 14557 267951 187916
20722 187916 24854 231381 81721 -318115 -171082 -106017 -76026 -33058 -307296 -168943
20712 -168943 34186 -376690 94776 49303 -189822 -82727 136385 -72232 -144550 -230691 -90772
20700 -332067 -35118 -172520 163908 -152870 266927 5359 112743 -99312 -8741 -178472 111053
20688 65030 -284730 -206739 -240603 -239825 -93913 -400430 299824 -132266 100994 -443044 69030
20676 -278250 -4165 -97322 -173534 305345 -140257 284413 -76161 -333917 -139382 -113249 66070
20664 305547 -59743 54174 -137954 170683 402196 -239649 -8149 102092 171201 -357727
20653 -86492 277522 187695 -286892 -8413 -227146 -71524 -105349 -57104 -124132 -50842 -35282
20642 -35282 249741 -123500 -164159 -219946 39971 56759 -147267 71631 -70814 -72876 -178722
20631 -178722 -7291 -229046 -272651 80170 -121075 170981 -3125 -60989 -366458 113692 145937
20620 145937 -126515 149055 146485 150266 -60677 -46531 -188778 -371240 -289731 -146128 -84109
20609 -84109 -117905 -204342 222145 -35322 76305 -135883 -15220 -291907 24568 267943 -99123
20597 118022 -147693 151581 17404 253607 -47094 78359 63690 -230866 171248 -256317
20586 279719 -85861 -125933 139797 -23046 79396 -163642 161915 116442 265491 28385 53627
20575 53627 -212254 106120 -242622 5007 -102595 20 -163703 -186081 -115800 13181 -20739
20563 13875 -111835 -168568 -25607 -357854 75107 -27665 -71633 -189181 114705 -127755 87883
20551 -216316 -2378 -70404 -39409 -364591 228047 -47245 127709 -1778 -285043 86118 280062
20540 280062 -85708 -121240 112918 -213556 -172148 175583 -3831 291075 -106213 -91808 -75696
20529 -75696 320122 58872 200366 56984 -128161 -130276 -146412 -380567 -207121 -32385 -60273
20518 -60273 5569 -235013 -258983 102680 -97811 -60798 -127089 -122244 42264 105291 4065 -102776
20505 180578 -187898 176419 126836 286106 -302648 225558 -206432 -8472 -200080 -159496
20495 -159496 -14730 34768 -12015 8371 -16468 22323 177738 -92133 1999 -103016 -307924
20484 -307924 31665 -484449 166615 -161046 -67492 -190547 -129799 -119357 78876 -15758 -115072
20473 -115072 27646 -104014 -325612 276732 -100914 -224446 -160258 57665 -182558 -272894
20463 -272894 -14422 -246876 143110 -25922 -88848 -124459 20204 -75997 306888 -12794 -92319
20452 -92319 118217 -114572 -103756 -285367 -118973 -67476 -89299 33318 84840 69625 -230348
20440 -125608 40843 -167801 -40444 216783 -31499 -179875 124221 -529702 -3545 178966
20429 -116959 65047 -213537 158900 -173694 -302665 -281932 -164557 -57428 151766 152799
20419 152799 -97986 146412 -208928 -95682 55817 -105387 61671 -122569 205304 -5312 -250771
20408 -250771 -193615 -1858 -76297 -166414 -261154 -88037 4574 -62904 -304181 -252909 -47208 139431
20395 -385659 22305 -218916 207136 -316672 -93850 -38847 -94841 231535 105631 -138622
20384 226530 141877 -267894 27135 -137662 -152843 -140089 -452679 291675 -143881 -83113
20374 -83113 -103097 -231385 176474 -174242 89964 171840 -191345 -136374 72367 -48613 208043
20362 14762 -88844 152318 -25187 142931 -38129 -132221 -90562 11701 236188 48123 63142
20351 63142 -221184 255576 141652 -117808 104133 42566 -195938 -187973 -57969 -312228
20341 -312228 42606 -5013 89096 -101337 -13547 162654 -183356 -242379 -277370 -72453 150794
20329 237387 -165949 -82471 1808 -331542 -145352 -62302 174506 54960 -214210 -99305 -88782
20318 -88782 400008 177506 57813 -403126 -312785 -73271 99683 181535 113531 -60049 39039
20306 -463396 -462475 -62974 -819 -99920 145624 -20868 278485 -135843 -110381 -215854 -292494
20295 -292494 -132872 -242609 -105249 48676 -168530 36886 1984 -18311 -23633 4618 -132226
20283 -135617 204831 -239640 612 -217768 179989 -19415 288491 -141569 -25392 -138269
20273 -138269 -95466 -25995 41022 -261047 75911 -65888 -979 -119231 45929 -189676 -111011
20262 -111011 237 -112403 342901 -365105 -58430 -332143 -135199 -162575 -289908 -108717
20251 -216744 145009 -145621 -67254 130770 -4411 -178158 69148 -211222 -171587 95719 -60190
20239 10735 -63231 7950 13346 -98537 -36931 38978 292836 24191 -68314 203792 -120836
20227 -178492 117305 -3744 160693 35595 194603 61542 125667 -8840 -6055 -155937 -124508
20216 -124508 -184844 86891 -202924 -315177 139524 -232818 179984 -137599 146573 188875
20206 188875 23546 -181648 -14237 178559 321585 -25791 -70008 -58201 112534 53132 109857
20195 109857 7272 61946 5317 138188 118776 -425 72041 -189164 -101738 6437 -85739 43147
20182 248605 109710 -29968 -70015 -164116 -65990 26108 -327974 -76909 76220 -133317 -58649
20170 94794 439421 34477 49071 -152777 222554 179978 46301 -153875 189416 -37484 172234
20158 -253233 -209809 85770 88669 20000 -4083 -176292 -67899 -239028 327428 241407 21063
20146 507054 201391 611119 283961 126702 373020 212939 84914 335556 322680 570606
20136 570606 393951 368215 257392 -83131 60890 -46039 -82279 44376 215403 -354981 -341582
20125 -341582 -172171 -142369 -33961 -113683 -50624 -212500 -70972 -43053 226471 -42012 60251
20113 -160780 -260495 16211 -185997 180601 -165005 102135 100993 -197738 -28022 95562 -223886
20101 112925 -60535 202065 -94058 -44170 34025 -35301 -7557 -397308 -101105 9981 -67071
20089 319513 12332 99613 5060 -388037 -310096 105202 -3097 -175258 -278749 -85436 -203610
20078 -203610 107627 62526 -92051 120012 -115782 -139390 25332 90615 -43026 44524 34936
20067 34936 -176842 138653 -14791 -61937 -57864 83322 -118121 -141965 32213 -104812 -139610
20056 -139610 -194216 88758 38235 -103413 -40616 -161111 -238143 163070 -126557 -49611 354606
20044 67110 -113300 70814 -40973 58208 -263679 -44831 -279515 -23391 -134967 -48093 -111697
20033 -111697 15944 85890 261824 -294098 -474116 35425 -245025 239262 -252141 -898 27748
20021 -214593 36627 -46162 -202531 -5278 144110 -23665 -200384 100756 232679 -207745
20010 -6266 -97825 -40919 56925 -1866 447495 -204320 214740 -67641 -284792 -118847 -63784
19999 -63784 -150817 27331 92094 -286269 -159991 318002 207354 432363 199721 119396
19989 119396 110591 -80964 -141501 94528 100001 280572 -49581 164339 446887 249515 208802
19978 208802 -141600 7981 87561 -100538 -209173 434562 153126 -112883 80643 -272469
19967 52402 -271299 194257 -27980 -119991 239795 450652 186161 -115649 458866 194653
19956 -195377 92554 195172 326902 184941 -335614 72654 97612 133344 271362 -31099
19945 300694 233836 -100063 -30175 25146 -157631 -29239 46419 -180483 24845 362 170350
19934 170350 -37065 -191151 -78739 107624 -133453 -69247 224961 -389930 176666 46546
19923 -312579 -427485 7819 153288 -172897 108153 108617 132041 151050 88367 -153316 -28318
19911 -72750 14959 50125 -122572 -117498 -279659 -47485 -7784 75167 -411277 -169721 -280556
19900 -280556 -385287 120410 -115663 -61191 153469 -282058 105994 -213422 -178195 179115
19889 24159 -18484 66931 -38387 -84645 -442451 -229043 7732 123993 164631 -92133 69721
19877 -31421 144679 -129756 -82293 -98007 -33286 106939 55202 -285603 -141187 -21903 -112412
19866 -112412 38738 79229 -68915 -246171 -296204 311433 -118982 -148967 133247 -14346 266205
19854 -254133 -208996 -93900 307179 15500 -96186 -237939 -219137 -22376 -72697 -129170 -222178
19843 -222178 -76437 249658 -90626 -116515 -223389 -332299 -357176 -418572 197402 -108672
19832 -306680 -176731 -127426 -38852 -162542 -56965 -272635 -215218 -27946 49271 40254 142292
19821 142292 -261795 -173901 56552 37665 24817 -324466 109534 -210065 182112 -211836
19810 372102 -220060 -44226 -464302 -34803 88958 46345 -334428 219421 -202396 -222224
19800 -222224 615346 267121 88848 -170153 175822 159235 -189822 84324 -234862 183466
19789 -460297 17267 70915 -72895 -248177 -187287 100556 -19191 -24612 318906 165448 197155
19778 197155 -142574 -218526 -121265 -178087 448797 12347 -236334 163552 29431 -15342 239885
19766 -44196 180504 193443 -82576 -135424 -37055 77777 138551 -279193 202254 145138 -7332
19754 -111796 -121228 250323 -107047 500641 -231740 17502 -193596 -55498 -215234 -70296
19743 -28906 -135301 -105281 -120566 -333236 -73339 -99113 254477 -142827 339981 -36803 -18359
19731 -39400 213784 -60914 451830 443960 417470 84311 249374 -84188 149933 -7571 -87561
19720 -87561 206386 142391 -121675 -11073 -356868 -278712 -128937 -192922 165458 -263618
19709 142775 159507 -3851 342164 -79200 -210356 13522 149578 81924 147429 41213 236494
19698 236494 66391 166937 398220 270219 10021 198303 93767 287122 -91082 128766
19687 -12506 -183238 -313179 -20472 -267227 12006 -167799 -368593 -231732 -30301 -101692
19677 -101692 -14664 7307 62262 -222087 -136749 -433398 -34775 93011 -173795 -333311 -90045
19665 15422 112832 46143 -77405 -221724 -155023 -390565 230207 -70667 -68431 -123878 -117604
19654 -117604 -78500 -25367 -42446 -208119 -182062 -21441 64433 -251044 50594 -26154 27378
19642 -19607 -78575 27886 -80417 -174599 129454 70974 -87072 -540843 35461 87367 172539
19631 172539 -253056 93344 -126194 -215151 326297 -304299 -229179 -40294 -145888 57433
19620 189097 -204852 -301160 -77279 28943 -138099 -151038 -589838 125679 -181599 51601
19609 -83451 -126220 -187667 -64866 80235 -182804 -5071 -179850 -110644 -32441 -19151 -215023
19598 -215023 -84557 17276 66622 -177475 -11087 -162748 -273217 70857 39464 -64579 -194619
19587 -194619 257896 -20400 -20775 -51561 -33462 80259 -90763 -171776 -171787 30898 175630 -163979
19574 50326 -139545 -187298 -292192 172487 -80860 208948 -69042 -43826 -322082 -47880 -127855
19563 -127855 -87277 -60577 346655 -66957 157711 86312 132107 -264699 -159986 170831
19552 -165704 -276623 232346 -197727 -125607 -268924 268333 -11502 92221 -274998 1079
19541 -65127 73806 -13525 -91668 -97909 -3723 -298642 -198700 -174604 -265992 29051 -135275 -61374
19528 243520 -40691 -193230 30516 79785 35158 -13419 42575 37912 -10942 -102549 -74886
19517 -74886 -387100 -278400 -76305 -479587 158904 171108 -193034 48036 -116615 -322829
19507 -322829 -210149 -243309 -113557 -95148 123820 -300632 -93168 141902 -95411 121812
19496 -54146 -449027 -198918 -133280 -203167 -59941 152805 275322 -99866 -191730 -119939 100877
19484 -67756 -236144 -239947 -147751 -189612 122221 -150251 -118150 -275808 -82331 -18359 -194141
19473 -194141 -68379 -158193 -118401 -154972 -173261 165386 -6780 -346072 -161258 114416 -364067
19461 -128016 -170889 212125 -12610 -115042 114201 -216073 11129 -233548 16803 -154187
19450 -51589 55751 -274918 -12822 -64135 218992 -125026 -119277 -39243 149268 -35761 -83775
19439 -83775 -240742 -188640 -27775 87965 -34585 -56432 29629 -212799 -37052 37695 309293
19428 309293 -144614 -114033 -99995 122740 26429 -55705 341587 93838 -19750 -108814 -252614
19417 -252614 -149192 -238799 -238811 -52379 249857 -344857 -15612 57892 40626 -2915 -31330 -121642
19405 -121642 -258090 28595 -349858 -322166 -123012 -75668 -92325 77422 -238904 -188829 -143664
19394 -143664 11382 -15873 31495 -59541 -11787 -262404 -179547 12329 -168443 -207193 285825
19382 35018 -386800 -337161 -156538 -2542 -199395 -84143 -109356 -43654 -93535 -155276 -171712
19371 -171712 -63565 -305873 113367 -126109 -178830 112880 50706 -56021 -136856 -89619 -7956
19359 110560 -67838 6342 -207546 -155635 -219063 -91130 -143828 -94456 -354792 -113159 -99768
19348 -99768 214048 -44626 -288206 -158743 -259677 -322376 -301783 -117922 -63022 -222586
19338 -222586 -72316 -115458 149781 97820 55087 -448347 -6466 -53221 -40778 -84567 -144195
19327 -144195 -2802 -163529 -225011 -224286 -233107 -203326 -94596 -228236 68844 -149448 -43257 113767
19314 -172590 -311731 104725 -120343 -89965 -7755 33322 -47212 -401181 -13120 57048 120008
19303 120008 36361 -33671 -162262 44026 63491 35625 -239786 -131539 -240005 183398
19292 -64615 140961 -174862 40253 -37312 145017 -254935 199310 134698 -78860 -292266
19282 -292266 34084 31602 13559 8411 -285706 -29406 -66269 128373 -26824 -25121 185404
19270 -228353 168389 -61381 49536 19885 -259614 -457681 -115051 -127873 -339963 -90443
19259 -169349 64068 216872 -42532 -55657 178806 -20503 -60016 -232011 -64624 35 103324
19248 103324 -171743 -219489 160834 18177 -120385 -197692 -807 -81544 113550 331050 -90827
19236 -133694 -64402 -43578 -92471 -46878 -31418 105021 -65263 -99961 446229 -373920 -395218
19225 -395218 112543 -61872 -273645 -219239 -59309 52571 -224157 -301854 131336 -90577 -135395
19214 -135395 -520049 -98256 -25663 -106637 -70279 28092 -66928 -111421 -145806 -133722 -12019
19202 45358 409848 358219 122224 -459529 -112468 142329 166547 431466 207232 -153864
19191 -119044 -25681 100718 -199503 243960 -54358 -282804 -158908 -117409 125315 143160
19181 143160 -10574 -177290 -131601 288629 79220 -51387 163230 -69612 -150146 121013 39263
19169 -47580 64643 36249 -272022 40396 -327004 -85921 74951 51527 -164971 -209461 27332
19157 136143 -160821 11652 -99790 212057 244434 -215635 -158058 -48021 -71786 -199116 44805
19145 -90492 -123906 -255789 49043 -134391 -153900 64275 -66952 -117948 -228979 -268065 -424291
19134 -424291 410916 -200530 -22680 110313 -101220 483396 -90121 -326330 -198181 -337911
19124 -337911 -288125 14050 111477 -94443 47361 77617 81073 -67978 79788 -315159 -235175
19113 -235175 174336 42448 85669 28098 71768 -422128 78797 -569561 77705 170172 12518
19101 87260 -167579 -32538 26888 190287 230112 -36033 -212773 -292111 -25131 -23312 -124972
19090 -124972 -54840 -11551 -25317 542241 -90619 1969 -173594 -310084 54535 -101318 79508
19078 144223 -49836 -47748 -168114 139251 -61881 -36239 -165360 132937 -12446 85448 -208343
19066 -308462 115392 -220928 -61077 -189673 89501 46770 -102143 -192129 -68880 -30699 25090
19054 94328 -274768 -95610 161746 111003 -352548 116157 82342 -64830 -131189 -185658 174019
19042 -40525 -258255 -185449 66275 -8922 -332392 7134 -114154 52427 -198834 -98218 55883
19030 -287149 -4202 -6132 193897 -164871 -144596 224711 86463 -146993 5990 54530 -92071
19018 -39465 -52734 190321 135798 88411 -2720 -122932 -272482 186248 51036 -51603 17983
19006 -95683 24133 -39505 377855 -90203 157852 -138603 -79723 -28471 -176138 -175341 117712
18994 1851 201175 -154443 267504 -226721 23642 95912 97285 123458 -254751 -78057 -162430
18983 -162430 -115830 -186835 89608 15236 10345 -15991 -88672 -1332 -248555 22889 273072
18972 273072 -95433 -143709 642684 599398 -779 80903 -151975 -88244 149720 -76832 -53690
18961 -53690 -152621 -199864 -55713 -26232 -145656 64076 -311901 -22015 -131716 6932 5583
18950 5583 -115113 331881 45715 -100106 -42106 292630 -180778 -195384 145840 -285579
18939 -62595 65364 -244170 22778 116095 118999 -85039 198728 -297854 241434 -104443 81582
18927 -10138 103365 -22690 136457 5159 45822 27481 36834 79753 227388 -89939 -146368
18916 -146368 -35951 -280233 -82800 -196869 180095 -41234 -226207 4000 -115463 472893
18905 507804 -94007 -90369 -109505 70730 -215489 -86822 -241245 227302 294373 -236248 -269628
18894 -269628 -100607 -315351 4237 -210790 -66621 202187 151412 31786 -208931 -123756 -284515
18883 -284515 25447 59319 -103265 -81650 171906 15563 236939 -112420 -139723 -55009 -358247
18872 -358247 -65716 -172624 -425952 21029 97374 159003 -170651 -625717 388090 -167786
18861 -64770 42761 -238455 234525 -245010 -178438 3804 63779 -68871 37602 -173538 -38059
18849 142185 146524 90926 316307 -175851 -266077 -215452 -80615 -403533 -437760 -369469 -129414
18837 1974 22481 -3367 -257631 -38218 -175371 77044 -111110 -418916 65869 -339128 28880
18825 15652 288597 -478129 -133807 159118 -120678 165991 -120693 -152539 -16810 136575
18814 53495 -113381 -71231 -131533 55140 53652 -199607 191300 -13808 174007 -14811 -94596
18803 -94596 -4628 -64494 20479 -238018 -228111 -422794 -7016 -60647 -78304 142340 78161 -187797
18790 340708 245425 -211440 161775 181550 -189682 -103578 44491 -173835 -176574 -164677 186199
18778 -148893 151587 -50512 -151511 213595 -58660 21713 -259388 162054 -156949 54895
18767 -204245 -87991 16578 -164897 21747 121951 -107239 -171811 63025 36333 36122 174238
18756 174238 -77104 -289040 238954 -127860 -17559 -204654 -124896 27243 18337 -173550 -20547
18744 339199 -33083 -309174 290727 -64699 329137 -240751 -103046 159342 -242747 -41143
18733 -154279 -121536 -239948 23056 -117820 62169 247937 -64355 48815 -101298 -113330 206584
18721 -51937 -191450 -370580 -146187 23260 -48099 188158 145487 -91842 -140460 140278 54819
18709 -49685 -87529 -82571 102418 224441 89747 -74640 -256281 235357 85659 1982 63617
18698 63617 17076 16476 -181567 51689 -248102 -302140 25745 273850 -158794 -290529 -161653
18687 -161653 129204 -287139 -44537 -178385 -6216 306260 84564 -161773 -102045 -151344 -158580
18676 -158580 67492 25530 108340 48274 -27697 -97623 131425 -56356 -202589 -180109 -248408
18665 -248408 -300837 -271835 67159 -337876 -10670 -92467 162037 -59655 215862 -84347 -356453
18654 -356453 -370491 59243 319518 -112128 -268619 33208 -12163 -372193 162213 -323130
18643 4925 -256577 214074 166416 139457 -227939 -73676 -92701 -210060 99776 -80781 -289614
18632 -289614 -14714 50155 21066 -176890 -92309 -75529 318245 -212221 -38957 -149954 -125608
18621 -125608 -190073 -90032 175568 76208 -60047 -41848 -1730 -37004 46013 129416 -11776
18609 126726 -129642 -185389 -20121 -221098 -481559 60501 -61972 -352267 -162204 -135672
18599 -135672 -333516 154548 78184 -172320 -15146 11329 -73979 142654 110530 -500221
18588 55550 109300 -173772 41908 -125683 -90352 214150 -350255 -80994 -149979 38861 165008
18577 165008 157621 243413 50115 -232649 -207255 1086 -205610 -252148 -37536 -204931 -293393
18566 -293393 317972 -45086 78939 -248753 -218452 21112 -220278 -344017 78348 -97224 208999
18554 -332552 138165 19002 -248120 -97077 41431 -155817 -351024 -180731 -195187 -38277
18543 152126 -26406 15325 -106228 -186512 -3042 -166786 215219 368426 -83858 -433862 -13861
18531 -133876 36012 179138 127134 175367 -199533 209760 -153357 -67562 -4009 -121875 -81599
18520 -81599 -96951 -142517 -56518 -364951 75006 -98961 -136877 -26560 -146453 134888 -278270
18508 -117231 141924 -217939 479032 -309474 -279853 -251504 155324 63026 -330121 -81201
18497 324582 -168376 64964 110635 -108638 -143934 -142695 69685 5434 -349658 -508157 -180494
18485 -267391 -125410 161293 -81252 -75464 -181678 -59545 223340 107431 -124615 -187749
18475 -187749 140580 -39728 -165202 -74929 -74631 189140 338360 -106465 -202159 36058 -19114
18463 71031 78944 -192881 75007 -478372 -4686 -2915 170729 28930 -34996 -327371 -6610 -165750
18451 -165750 -292527 39494 -58909 -107894 41736 17631 -140385 -220801 -34358 63308 -233390
18439 -34761 -187792 -76607 53128 76568 9580 -284778 260005 -158138 27303 -5585 -379511
18428 -379511 247418 -98124 74290 94446 39517 29589 -12619 -253809 38942 -257785 6355
18416 80170 -191667 63131 329959 99175 92224 61490 -123751 -382448 23123 335245 -42540
18404 39070 -204693 -70953 -64725 392894 203949 39064 345866 131450 371033 248653
18394 248653 370997 -113200 5437 61542 415275 -35725 -93872 -629391 30881 -48743 -223869
18383 -223869 -253676 -9143 -84247 -32227 33946 -144116 130677 -37920 -116288 -214025 159447
18371 -3978 8066 65027 -258028 -67867 114844 -70581 -42294 -176485 109667 -192233 58814
18359 181174 92499 -42328 -120647 -180698 106976 143677 124459 23037 31806 -306440 -100825
18347 -113701 -12361 -113267 -8405 83940 -55119 -110927 -274126 41690 -129116 -227732 252792
18335 -30606 -80267 217508 -58945 -25392 -110236 -122787 109419 -219247 -28363 -177853 -56790
18323 -286451 -37365 -492842 -196672 127060 111197 -194093 67330 254161 -191009 -93539
18312 -169966 -195237 191114 -185180 -250294 60056 -34823 32695 -190624 -53523 324888 10755
18300 -82228 -219594 -49724 152194 99706 347477 -186546 -394862 -107788 -173232 -84221
18289 164215 -33001 5958 150924 198523 -182444 -101199 352190 -203172 -90825 -55751 119635
18277 -90551 18903 133288 -300114 -177057 -196568 -20965 30905 -103395 -5508 -139608 64870
18265 -181809 132238 -9675 -96492 1648 -162329 -139054 -271577 59882 30763 -2969 70330
18253 260481 -91301 20965 224777 -177092 -149651 78699 -93130 -368487 -157828 -51282 89576
18241 99299 -52033 125452 -202338 13339 141690 -5838 263967 88478 -227573 -68519 -10094
18229 63987 -172262 -218958 76063 117246 -109935 -134835 -358196 -27245 -51378 75711 30963
18217 161600 41411 -176819 335116 -175178 180318 -31617 180486 180808 -297753 70432 -88136
18205 -385367 -56338 128652 -176803 33232 -141088 112847 207263 272219 -27598 -66903 -89196
18194 -89196 11802 -1475 195862 -201760 -24782 9502 -289548 171735 138047 -119775 104782
18182 3326 -417695 -22954 -114670 126230 31979 -52300 -163705 399476 11279 17742 103077
18171 103077 411513 -151284 -235406 -157104 -281152 146149 -333425 52254 -82813 -2324 -462832
18160 -462832 92772 -40145 94837 -134460 127239 143775 87382 250714 39853 55672 -223203
18148 439499 220368 -155986 359198 -2139 123581 50383 1685 101328 97396 -66022 78150
18136 127286 -16850 -3969 -242072 -9641 -183394 -181710 -363851 337069 -569027 -54908 42190
18124 -47269 -254832 -47834 -64147 67855 -179942 131515 186231 -191760 18798 -52824 27427
18112 -233789 -261337 -31984 264072 -283078 120320 -161759 32632 122376 23659 104117 -179277
18100 -71722 58506 442855 -273945 85738 -132845 -133978 -174633 68768 52588 6618 53236
18089 53236 -71983 -254932 232100 -155969 -38605 -154469 326830 -13628 156103 -39131
18078 66095 28507 -245909 91975 311699 187301 -65134 67119 236960 -322435 58188 109533
18067 109533 165726 -228060 170449 -213032 233887 193971 -137022 -165699 382333 148454
18056 -11991 -185149 172274 -132900 -16830 77335 -3121 155459 182127 -206489 -259949 183671
18044 -403601 126183 49817 262313 18299 10661 -24883 -9058 78167 -294359 92645 -142411
18032 291878 -355433 -295375 -215932 -162554 72166 284654 -281643 266270 380428 185391
18021 204820 -34827 62126 -35783 86498 -182813 29593 110884 339095 222493 -228420 -213772
18010 -213772 47649 -158846 311290 -53466 -95605 90225 165584 -56668 42942 81934 -508633
17998 86606 -127937 -106115 260977 -140496 -306803 -328637 333764 -115462 106642 216288
17988 216288 16744 -5879 -5549 393743 247593 -253331 -67399 -99839 232998 371405 311253
17977 311253 13336 -248223 145283 273167 -168951 -90969 258824 133742 -149048 349806
17966 -29811 -314515 93189 -29728 286074 -152924 -83689 407683 -69401 372255 68422 -172405
17954 239266 -277732 -76828 61165 37830 35010 -182807 -102432 -188749 31836 80700 -203333
17942 171260 -265420 -59629 300637 250852 275939 -203189 -100466 -138248 -126632 119621
17931 288679 67341 3680 102350 210682 412041 -153558 177309 56231 -54625 172297 -137928
17919 -228454 12425 60584 -60152 185727 -6346 24584 -484377 88832 -50009 146077 -43841
17907 -112872 188074 -244560 73842 118424 -3592 153321 -128180 -188977 -210925 234333 283861
17896 283861 76568 87278 304316 252393 254944 83556 -57184 353084 276539 -98099 162444
17884 64071 -196651 195792 99192 -9643 -193574 -58045 316885 181657 -131704 -248139
17874 -248139 -117891 -130860 103670 -178463 59720 85856 120439 15612 -196061 -79983 85383
17862 121406 -124320 326864 377233 -150975 138719 59685 333556 -46559 251852 70507
17851 137756 307514 168387 318400 511184 136260 166487 -106937 11431 398519 -40968
17840 122634 32910 -66657 -67482 -109924 50104 -95269 83001 -112230 1095 149108 -19228 -49845
17828 -49845 4818 76743 296208 -79147 63718 -41846 109004 -276793 -190950 -85159 -11234
17816 -11411 -235556 -145985 91968 -15307 393410 204014 11200 -292569 72875 -89774 -136644
17805 -136644 384864 425635 245321 -38842 -51275 64196 820 314919 182108 147095 63926
17793 137124 134622 141319 144783 -268463 -70092 216085 127501 -140216 3111 -15937 247180
17781 277818 24923 158507 -68897 -262209 33652 62736 -150103 261623 68164 74608 63981
17770 63981 -23746 79873 96837 313450 83672 408859 -22199 259988 259647 263401 49935 -239969
17757 -28734 9957 249576 -19042 215383 -293028 -120727 189059 336065 -237210 -32363
17746 26560 -118847 -112557 -152284 -25437 167911 299353 -179625 119966 -117345 196854
17735 -77126 182492 66704 -79588 14871 -95240 -79360 65830 52066 40417 361919 88900
17723 16550 -58066 15080 -155032 167548 -56377 -11874 -14820 39899 113508 80277 125780
17712 125780 -2698 116617 -104697 305097 -93739 -30302 172298 163691 194072 -57831 -76568
17701 -76568 110867 -337023 69229 166102 23555 -205629 347252 331932 24727 -288712 -197762
17690 -197762 64071 145375 158358 -31046 10441 5472 -315207 270368 92282 -97933 -23947
17678 -90946 228069 -355323 -15930 132599 73794 -264986 17517 64178 96509 101070 253662
17667 253662 -147664 -93024 8530 290475 -12989 220117 223637 12871 68559 130421 144436
17656 144436 -41055 202699 252828 -41060 -78272 -44326 186698 200269 114658 -169801 169635
17644 358096 -53374 57194 131280 -46472 300985 -115463 447342 76881 182684 280043 -95221
17632 236454 -49107 319 251386 302602 364529 -119523 175483 -176906 123827 105968 116789
17621 116789 209523 -195111 -24160 35982 247233 21593 -27591 179581 173287 184923 315319
17610 315319 28304 31644 315609 44682 172473 166122 -26326 259126 79479 137680 165036
17599 165036 97357 299389 66076 -125363 -119441 164006 390116 402568 128545 -34033 223353
17587 288942 310271 52706 189244 -182253 492907 203126 315379 182938 36280 82094
17577 82094 407979 171686 -88447 411864 114152 173804 285163 323920 40386 219178
17567 219178 318299 23459 70387 248118 386725 333667 242352 143586 380982 175794 585691
17556 585691 18240 27501 132796 159249 -37002 428313 317976 295320 198795 186306 130894
17545 130894 329073 330355 192960 64540 175991 413421 359525 -301899 292252 365862
17535 365862 127947 381466 113438 329627 293702 377708 35628 310928 190230 737305
17525 737305 750168 1087937 1357705 747717 889865 631147 592977 483495 93239 352104
17515 352104 236315 526987 592824 492896 472506 853788 800883 957271 1297355 947525
17505 947525 983642 435265 391925 701871 292814 369571 318705 143401 93564 181266 554010
17494 554010 204483 535909 613446 152944 -155052 196707 332840 521866 185482 499937
17484 499937 580035 157859 297089 67360 544648 326407 103636 258666 337546 119733
17473 82058 186098 528714 438244 91263 235783 256616 25785 640128 295365 170125
17463 170125 111661 145374 169854 78985 156494 557463 142535 51836 154462 421607 175644
17451 37248 360141 466493 397321 173497 234744 64241 300381 416267 667263 387391
17441 387391 99395 346424 375134 166966 145732 226410 355888 381750 304324 617209 571444
17430 571444 688951 366046 546608 515276 326304 195401 343599 432248 337382 482776
17420 482776 267821 539498 138083 490293 97151 232602 -46274 124804 353096 173668
17409 158408 266607 -4694 233429 -84905 493054 244620 492665 445625 287436 302673
17399 302673 561736 290005 407075 116210 211787 29743 156642 311533 163786 267054
17389 267054 236634 -16157 293755 167223 319233 69089 113056 561491 93810 247065
17379 247065 341589 447917 375792 336630 61949 293918 400654 171626 403909 365511
17369 365511 232085 346382 402964 542961 308833 332037 204028 233451 367475 175825
17358 120020 192319 76025 343157 165128 159088 229116 266508 218670 406291 -77717 101480
17346 -241305 357724 402221 400825 189032 287058 -9532 189481 315368 293987 396232 591275
17335 591275 515883 340292 528444 260814 426246 15058 381976 162398 403763 406450
17325 406450 377039 159789 212097 362528 513302 252203 381295 91322 351815 156196
17314 407817 47851 246704 369100 340430 351913 273714 621797 20066 271204 578999
17304 578999 299429 362540 222634 30792 468062 650843 323274 441951 339019 407732
17294 407732 -11343 366213 378963 277217 311070 393844 380237 371936 385643 537885 77951
17282 121280 264954 -9338 264554 646919 542643 464677 302914 277022 315963 185797
17272 185797 298767 240842 461892 540374 233881 516609 316397 512611 136318 365442
17262 365442 491211 150075 259536 502797 722525 186066 242448 240492 661106 166810
17251 210729 186121 -53831 451204 561508 592065 315826 543685 211984 89714 843224
17241 843224 -63962 389209 128066 294357 463869 264284 614132 397887 610589 581924
17231 581924 292468 560879 411745 537430 453053 456720 298368 483470 280554 137357
17220 696841 391536 358040 275709 271590 273032 307138 302455 486171 43934 151772 754427
17209 754427 167487 649290 318855 611084 301715 217625 423678 219707 400629 448085
17199 448085 465154 378336 290847 516167 570183 302505 533074 406576 227010 523336
17189 523336 367523 758568 756934 397528 390335 532378 721212 497040 111960 689017
17179 689017 397992 399680 687102 305682 258828 699115 566050 426115 474272 300672
17169 300672 785316 570545 777540 555330 882045 488035 690643 385463 534392 685580
17159 685580 583292 640043 149949 369145 402146 410432 254152 736556 491722 661855
17149 661855 589667 295823 716625 386758 260816 489670 335770 470417 532940 695995
17139 695995 436813 702147 356774 673209 604288 547945 206406 518288 959852 568447
17129 568447 520806 611565 655261 308579 292377 642352 705970 653566 515542 456420 660764
17118 660764 468484 425053 484759 469263 516613 822394 464816 766452 294494 498981
17108 498981 1044503 620520 821301 841434 394723 506951 575637 731812 565141 350170
17098 350170 549786 651956 440958 878695 293083 526571 568821 568441 753465 713596
17088 713596 812158 601397 846071 690283 756601 673351 349250 765736 712149 807954
17078 807954 709481 740195 502155 514053 938910 1134475 1121792 635655 686221 704651 551740
17067 551740 795492 829706 717778 552726 571519 1022141 543509 1084462 1084893 538242
17056 900350 904098 872639 698721 873186 542055 647968 985289 997369 1300933 763924
17046 763924 960020 851082 711578 976477 702454 887751 926705 904857 981177 1208458
17036 1208458 976481 1078888 736208 1231143 1037960 539524 1163403 1020839 1012934 697275
17026 697275 1111522 975838 954915 872716 946043 1125449 1086995 1291446 906150 1082333
17016 1082333 1247154 1092041 1088759 1012248 762210 805873 1202069 1324565 1181137 1375716
17006 1375716 1106064 1298068 1244406 966410 956546 954174 1363293 1277870 971070 1228509
16996 1228509 1489222 1309737 1491679 1407806 1149044 1405559 1234969 1264537 1209156 1363419
16986 1363419 1421921 1306718 1425590 1254714 1383454 1368090 1273872 1484692 1474885 1645733
16976 1645733 1488422 1676504 1688211 1255478 1119513 1664331 1831231 1382479 1533992 1572805
16966 1572805 1300276 1583226 1476842 1400631 1680564 1563566 1697936 1652031 1745833 1447390
16956 1447390 1495965 1677890 1992087 1570532 1894215 1521074 1575234 1499226 1671810 2321573
16946 2321573 1731155 1849736 1869715 1729928 1821661 2211872 1998837 2106758 1689512 1972358
16936 1972358 2096379 2042287 2093366 2089534 1830908 2090635 2428016 1979244 1811526 2203459
16926 2203459 2428380 2400253 2413310 2330942 2367598 2344394 2639234 2359545 2475608 2179306
16916 2179306 2475408 2565221 2530940 2612083 2659957 2751720 2822059 2476957 2595572 2723839
16906 2723839 2513235 2481033 2745894 2471696 2965843 3024157 2674304 3055572 2889781 3002781
16896 3002781 3059525 3380572 2816319 3065721 3561002 3065651 3299785 3107833 3095675 3043831
16886 3043831 3347238 3602512 3437186 3593189 3609462 3441882 3297716 3592353 3605887 3697432
16876 3697432 3863240 3477212 3788218 3775427 3803816 3918995 4204710 4225702 4285477 4296415
16866 4296415 4372780 4209252 4163459 4469120 4555862 4415214 4603576 4632969 4608911 4970826
16856 4970826 4877844 4944031 4771350 5119048 4947819 4848398 5498934 5562502 5606544 5543498
16846 5543498 5864913 5414575 5718145 5990401 5855514 5934411 6073774 6635386 6345403 6287580
16836 6287580 6744512 6697851 6497474 7084294 7181997 7249068 7414489 7334595 7827268 7864530
16826 7864530 7661617 8311880 8102705 8179649 7993590 8424017 8566736 9113069 8681089 9203165
16816 9203165 9560903 9480675 9608408 9977347 10061985 10432169 10814359 10690620 10830562 11401578
16806 11401578 11620123 11981790 12069007 12129880 12502096 12554844 13128636 13432590 13730284 14246819
16796 14246819 14249811 14524384 15127361 15373755 15745536 16242219 16458162 16864630 17552210 18008862
16786 18008862 18489829 18923116 19450561 19852249 20615759 21155159 21438354 22218084 22761884
16777 22761884 23661048 24429761 25014413 25496684 26490401 27071941 27950883 28822700 29875839
16768 29875839 30754448 31876245 32696141 33632258 35051091 36308067 37253924 38701681 39922537
16759 39922537 41369222 42782950 44292179 45894897 47773971 49410848 50997139 52951778
16751 52951778 55120606 56737127 58882764 61052919 63395460 65757665 68122498 70742801
16743 70742801 73405020 76022397 78500052 81397435 84227313 86888559 89772621 92893806
16735 92893806 95733966 98381772 101415209 104252164 106472963 109300990 111416253 114175192
16727 114175192 115751681 117435586 119181576 119995782 121197926 121621809 121817167 122294492
16719 122294492 121723563 120776784 119850378 118503365 116734654 115097031 113155018 110789047
16711 110789047 108243409 105758151 102883932 100163000 97285152 94274691 91356034 88679172
16703 88679172 85610882 82689448 79747935 76718151 74015537 71589499 68633728 66499184
16695 66499184 63835595 61422928 59467327 56996308 54952103 53046793 51140133 49040466
16687 49040466 47634814 45580168 43993075 42743020 41144301 39745085 38342898 36613713
16679 36613713 35326628 34436260 33579148 32372836 31148112 30013479 29170112 28203547 27191917
16670 27191917 26655079 25810603 25064109 24059811 23280600 22999140 22001375 21726698 20930333
16661 20930333 20270830 19769441 19421494 18482129 18016327 17962007 17065548 16717961 16642448 15932232
16651 15932232 15560322 15461922 14842082 14483915 14078552 13700436 13403378 13055392 12714830
16642 12714830 12245937 12200723 11934888 12061421 11310729 11213050 11108352 10732287 10414749 10227423
16632 10227423 9947422 9703820 9859855 10097028 9106031 8935258 8894642 8502446 8739739
16623 8739739 8315759 8398517 7832496 7856087 8163268 7615349 7702902 7658103 7361780 7400248
16613 7400248 6949128 6641596 6838906 6605356 6523207 6184404 6402714 6205006 5929579 5800264
16603 5800264 5742052 5835589 5590062 5743320 5645826 5514907 5153240 5141949 5331570 5503276
16593 5503276 4922964 4999810 5132311 4722518 4820985 4579218 4633421 4438464 4422978 4560821
16583 4560821 4675752 4605563 4340013 4361077 4149604 3955517 3851732 3876169 3941266 3807832
16573 3807832 3960149 3756606 3354413 3867837 3658788 3424593 3625398 3303490 3285492 3396197
16563 3396197 3390377 3166842 3467786 3323867 3087973 3069572 2956842 3147551 2925073 2875697
16553 2875697 2670371 2783207 2750432 2694755 2505687 2775232 2615815 2737464 2868926 2590754
16543 2590754 2610046 2645543 2647474 2547676 2703447 2589654 2489080 2270940 2410575 2522026
16533 2522026 2259371 2405022 2170005 2403200 2115565 2479780 2277435 2062670 1992181 2351518
16523 2351518 2206314 2310614 2024290 2058388 1905657 2316822 2128153 1991704 1854452 2070245
16513 2070245 2155971 2151770 1920205 1917648 1327929 1885067 1905574 1719739 1679462 1579621 1718267
16502 1718267 1707395 1746321 1555449 1712397 1738132 1780221 1797166 1968007 1681200 1574931
16492 1574931 1419800 1429165 1758962 1464311 1529767 1673519 1479477 1514425 1366893 1267740
16482 1267740 1417438 1372151 1365706 1609639 1427326 1592795 1363030 1340165 1621765 1178732
16472 1178732 1220267 1462844 1596073 1308679 1649292 1139823 1388919 1392093 1326457 1520147
16462 1520147 1322843 1299602 1222414 1371445 1191770 951972 973955 955848 1332658 1091128
16452 1091128 1410299 1279759 1310400 1203398 959519 1213494 1301975 1084396 1004922 851436
16442 851436 1055412 1034204 1030261 1168956 1053489 1197098 1023301 1025137 1011798 792093 747121
16431 747121 1279045 1150282 1151952 966206 940778 862163 780272 603650 893539 1132953
16421 1132953 848312 1008173 1163300 877374 855353 1336608 715668 967363 754831 722585
16411 722585 902048 1068177 493656 1367363 734343 1088542 797076 895529 1059873 952500
16401 952500 873370 975377 976336 865388 691318 1013211 1100731 516734 654316 817490
16391 817490 553113 833706 853644 827329 672657 812233 691938 1078025 766977 469852
16381 469852 690830 698651 794631 862982 747268 1003503 1007130 1059833 467605 743106 659833
16370 659833 571273 498680 433620 790124 766697 894245 614054 459989 667190 466991
16360 466991 885383 568691 659972 570648 615447 833466 396961 485167 877953 665997
16350 665997 764876 600578 653384 527508 797535 601654 930242 746904 432703 643063
16340 643063 205011 -34364 773625 649951 544463 834781 617147 639097 626702 543967
16330 543967 794291 385227 304087 591782 827289 755681 723838 623246 579818 518476
16320 518476 462859 611584 586562 487300 548601 735444 345458 378253 882855 541194
16310 541194 456906 405667 490991 275083 370831 647305 727877 566715 -263434 420055
16299 162031 444772 652476 408135 434681 134150 335936 545088 604554 90022 356166
16289 356166 180236 424294 643213 82735 598057 327491 708124 219708 484949 235392
16278 211736 615462 600719 845910 575844 387816 415581 55443 637603 224768 473228
16268 473228 412214 481638 446929 647376 470316 287889 64128 221541 350869 652767
16258 652767 569699 640541 545848 381420 476051 44160 126611 518949 427249 318955 320587
16247 320587 447849 309149 202739 506366 155940 412977 586131 413580 124064 119916
16237 119916 424005 466425 456310 549051 118946 347569 423465 6013 273816 157660 598359
16226 598359 -11941 705055 196618 229001 676374 317273 346606 -47915 280527 80887
16215 293025 125783 41084 413944 248343 221344 345451 258852 211688 69092 161258 55598
16203 119027 497841 223450 164187 276409 83278 293851 208286 185291 195609 39547 106820
16192 106820 489502 487905 -108875 256514 258255 -113138 368505 203397 261123 143377
16182 143377 519827 230190 260580 284150 307031 233647 -47103 268177 422262 417650 322926
16171 322926 8180 263371 249682 241116 168483 21459 398436 309956 279452 352762 -68038
16159 419967 295050 341023 351075 466415 27264 -63313 367047 342190 190071 114957 261811
16148 261811 202131 246594 534876 79021 -59752 302096 97627 -172327 -230133 179963 35846
16136 109472 510168 71422 171020 236792 172654 36850 1128 115878 471918 131266 438644
16125 438644 -83202 98626 217846 328724 168094 152135 175765 208284 150003 199135 172504
16114 172504 212057 21223 -50515 87403 177512 296860 219849 64956 -10788 141237 207878
16103 207878 55533 225444 324180 49543 -237916 272185 78647 84325 143162 315660 171475
16092 171475 370402 100866 -17335 -19023 -227393 48206 174921 44353 -134231 154025
16081 -32454 -28161 -41873 254221 168538 103582 18325 72258 -81206 233603 -168902 100733
16069 52736 110920 38989 66848 -128017 -155468 -47147 199155 94480 -80182 421691 -3763
16057 359829 65087 233472 177456 140994 -111830 102026 72237 14862 405999 52028 44255
16046 44255 -182819 99920 -90380 -37998 195236 34270 220086 -47539 141778 25771 -418732
16034 32721 271000 200432 407703 132339 91959 -87959 14939 118733 -63276 187491 145490
16023 145490 199582 39602 33645 101847 7329 -156489 -100546 -237007 -182302 203493 58947
16011 15957 216727 20774 224883 367328 105701 -168859 101576 75319 -139325 -199058
16001 -199058 21495 170701 -241528 240750 211494 -70168 -62295 165947 23715 -154940 344303
15989 -22296 106707 373050 530961 412057 889240 1420131 1022021 827125 641649 565169
15979 565169 234663 193744 334946 -183174 231371 281082 -106063 -221964 286571 -16633
15968 149244 -18065 -64047 -20739 -32101 73052 -23804 -295625 289323 33710 -88482 -234774
15957 -234774 -151950 -274420 129247 76011 -49145 -173186 -203042 -130381 180004 16360 -111475
15945 252251 -122577 69569 124659 278206 119953 162966 -132576 -97034 68575 -114697
15934 -358245 -130950 -62342 -360532 183926 204478 -27266 -172615 -4688 -206067 159429
15923 -79781 14579 -170745 -185819 -198586 -49364 -25349 -18022 -108915 -36113 -144178 -194121
15912 -194121 66754 -362232 -86900 190042 -124815 -125648 -19047 143244 120439 123980 170868
15901 170868 263760 -95101 241405 177019 -217334 241673 -416225 -253371 193524 18658
15890 -30091 -286289 255852 311394 182346 141917 11068 -255207 120361 -43162 -3213 17260
15878 -81904 287698 16048 523 -201341 -275749 -327779 83066 231795 -72444 -107331 -226187
15867 -226187 -50677 14288 -89546 74005 443862 -89920 -302210 -200833 228303 -11467 54949
15855 -182975 -123363 -74522 114885 185836 -908 -37832 232928 578701 -85241 -41110 9229
15843 -118103 15563 150593 -165469 -155076 -209765 9520 303910 92269 -361386 28379 -104944
15831 314938 -146096 -29158 141621 -273059 -107586 166113 -119191 -92030 -148333 -21645
15820 -70527 -87111 230203 137249 -328434 -256940 -124747 -47410 -253947 67299 170453 -79758
15808 -116258 60785 -99572 -31853 205925 143364 -211157 67138 -18188 -10493 111278 -25153
15796 -120342 -15299 22199 74506 -87143 167512 -60782 159706 222245 -187232 -91266 17859
15784 59422 240155 109562 1279 63386 -188746 265187 -223855 -221423 -151196 59429 -143539
15772 -99861 -155541 -104227 -191502 -143762 -142968 -14428 72777 -134962 42233 -197568 44767 481947
15760 481947 62622 -122084 -219178 -61759 284226 -114917 -65648 251536 -39355 250433
15749 30692 -185357 -172026 -231718 23208 83059 198684 -61152 169891 -379 -98124 -48635
15737 -274431 -10621 -156973 -269402 -136986 -52450 -68418 53532 -316257 -126320 312403
15726 168870 -27807 264052 -126007 83563 119997 -337216 89931 -59391 -112350 -96006 -252231
15715 -252231 -263012 -359559 138544 5572 -346157 28949 -94727 81570 81309 -335375 239778
15703 -154237 140128 -57706 -95685 -251218 -206542 110737 -160418 -16029 -279772 18090
15692 148995 251532 259281 233226 356991 -27234 51506 215511 -312665 7112 283621 -34886
15680 -119558 89255 113906 106310 81076 268457 54791 -40110 268077 -105958 -67881 27081
15668 120200 -57806 151148 -24849 -149328 259287 67248 123237 -67335 -48697 375544 -273143
15656 -60877 -383832 -110881 10588 -27400 -258175 26889 -240368 310393 84153 -4485 184043
15644 -121758 223460 -209834 142347 54036 -263071 78306 -24650 196091 122531 84410
15634 84410 30665 -44872 23065 -251789 160096 -311815 -98410 247169 35838 -70584 107040
15622 -88628 -35694 -342194 68361 -474801 -441016 36452 154778 -10247 -45243 121165 -93049
15610 -104771 258838 -153903 225756 231808 57987 225331 -187474 24207 -300166 -76650
15599 128906 111243 276669 -473083 -204987 -93261 86621 72565 -17207 -185272 404784
15588 133733 -264500 -119765 -38664 327615 -111833 134543 -8 -290955 -13929 98756 168778
15577 168778 -65081 6738 -331546 -239008 31368 181424 -217364 61771 281977 69001 85412
15566 85412 -132110 44015 -102453 164623 -108182 -120696 -71821 -443010 -135842 72213
15555 -404321 -191159 154383 -401481 102795 -252134 -373992 -84511 -39687 50729 -7504
15544 316700 -153109 147201 366763 35276 72499 -265672 -16114 19509 138127 -204468
15533 143090 214379 -135776 -35922 -61855 221150 -291331 -122728 -129885 -223493 20619 2602
15521 94974 -89281 241258 -136290 35286 -43128 228646 165769 340055 -170932 111541
15510 118095 112225 142865 261699 154992 45437 147778 110595 -69706 311643 208718 218929
15499 218929 -156999 268145 392819 -34570 -7765 197564 159738 -104809 -97415 -165950 64327
15487 241071 46054 96385 -231852 20184 23488 49246 481252 55547 209433 407118 404686
15476 404686 463970 284072 290072 592860 721088 400228 574618 186832 68499 232819
15466 232819 -91144 -174792 -80453 156336 230168 2002 -65199 -125635 -2368 -95411 251713
15454 22936 12323 -109623 239555 -112042 185154 -72300 -116486 45092 41542 305378 189585
15443 189585 500727 412437 1113706 1250133 1201505 708393 550415 769159 -17774 271367
15432 -72575 263062 -74714 -158644 46951 147331 138468 -55666 270821 205014 -33582 134666
15420 -277370 -121092 5302 -226389 132147 -222210 -168668 177719 -77586 207339 -147725
15409 -171584 -113338 257348 -198681 -186748 -331808 -45669 -269100 77807 263168 95059
15398 8683 -108466 -116687 41660 74085 18363 197856 -98231 -94600 268483 -4692 -289411 -13758
15385 -172398 79838 10849 -93167 109346 -185437 -43008 363522 110107 63987 116800 146348
15374 146348 2117 -143847 128370 166744 90804 153027 399393 49015 87705 176419 536918
15363 536918 130684 -13661 362890 -53345 -20457 243263 505013 528099 371587 182943
15352 64166 142360 413479 358069 175316 147834 101992 242906 58332 233215 163533 546725
15341 546725 626554 370624 174654 194614 64320 -29255 281100 283731 -234158 355282 181216
15330 181216 22145 209435 391469 204943 40229 76433 483134 234338 280735 108311
15319 90945 -241712 279489 149912 -31456 20809 173380 -9881 177018 -7586 294468 -104370
15307 -12960 125523 -266553 45303 -94711 -43974 332238 190875 -13091 -80428 102545 176950
15296 176950 148436 395622 67221 -98506 3573 -110746 396746 -86570 84102 -60145 41843
15284 129844 190044 72374 -232718 42700 -16393 11134 203057 176318 -34099 25044 111016
15273 111016 21513 -45258 -225513 59605 -57432 -21051 83478 -177081 -11099 179419 -161981
15261 -15970 191230 132382 -199749 153130 -272892 405712 301211 -342852 294888 -107703
15250 -198261 281932 -277154 40548 89406 129642 247585 378058 852623 1407648 1648364
15240 1648364 1792628 1547141 1782625 998870 498506 427113 297514 130759 -84298 -239834
15230 -239834 119746 216696 204194 204768 -87089 -164479 -253541 -149091 -187755 16491 -58263
15218 -131177 -15929 37847 -165348 76778 116568 17774 184531 51049 291443 263881 116410
15206 21584 -109353 -161384 172930 -92404 -13930 185340 77662 236681 -96515 107928 41093
15194 -14815 -100213 174561 -11987 127662 88066 -12215 -42213 -57647 -218542 -63930 137005
15182 529807 -23430 -33990 189958 120734 160751 -163849 -119809 437103 127719 490377
15172 490377 -176461 -135271 -294076 -32826 131032 42434 302108 213860 67752 86814 -135676
15160 40756 -112579 77925 143781 189948 119652 -330293 323431 22854 66892 266102 163953
15149 163953 160083 79243 212126 312770 98790 317580 419171 147349 240186 158619 206661
15138 206661 251527 164148 331790 197613 270912 -209946 334219 326228 25517 -196712 199530
15126 200394 72448 560508 -113227 316611 435280 600600 742330 272573 312147 517148
15116 517148 286261 170155 -79231 282340 74599 34572 -693 373623 46853 83562 205706
15105 205706 -149803 219348 100074 479623 100935 44939 -36828 -172134 -18120 82349
15094 216602 66259 211852 373165 112365 178609 79011 -120503 422844 199067 -102771
15083 244090 365005 96307 270642 137135 311635 -20538 182483 -92430 24911 247663
15073 247663 86751 -91817 408174 172638 378826 194133 121990 405056 -132331 200490
15062 313898 144814 181525 327090 -232962 257857 129856 465348 193684 313106 488645
15052 488645 262362 372614 415092 283626 135161 616267 336699 506161 374028 87088
15041 526690 677442 497980 -29049 329916 377888 23629 345996 418259 168536 283402
15031 283402 892809 874143 645754 729547 850471 725350 650193 267463 823680 137258
15020 375210 678963 721134 603744 651203 184624 488806 309379 498330 51400 385025
15010 385025 435276 353466 357499 615645 968775 286057 239349 282386 568376 67359 148330
14999 148330 290030 462239 534022 534332 512348 553650 466953 191483 527914 122347 80548
14988 80548 242892 626661 352192 260912 440665 546748 663609 824235 901970 1112324
14978 1112324 865506 1014990 730260 680057 810757 669598 756297 688493 450901 623506
14968 623506 515311 394485 356198 207510 776678 343498 436188 479046 394084 782983
14958 782983 239950 61242 581343 287444 293996 441634 323275 394153 418975 612305
14948 612305 409640 508452 275520 457828 905995 636160 729833 719852 506328 425522
14938 425522 276020 483147 510380 593281 431770 762744 531504 961454 799393 1222229
14928 1222229 1406264 1419312 1499340 1493915 1765689 1969217 1509428 1616522 1644349 1530271
14918 1530271 2105976 2043015 2309068 2065820 2360997 1600326 1254896 1085325 1232770 1317211
14908 1317211 930679 679952 684942 654513 587239 663599 272613 405751 322397 553538
14898 553538 310141 412784 362177 472436 715319 351904 589298 310124 691323 209293
14887 434178 665759 869357 809296 546690 679099 893487 572135 865436 912852 1075372
14877 1075372 673611 497298 373351 325226 410615 335673 322528 856266 621585 446396
14867 446396 655778 830149 918306 663418 1042883 557656 516283 680226 434003 824675
14857 824675 449522 561890 244679 376672 369823 690750 730497 495404 607604 727215
14847 727215 596810 862916 743374 841705 1166255 1225944 855640 910367 1109831 1347228
14837 1347228 1123638 1088089 1162383 722838 798388 822754 313777 619591 919165 446131
14826 364120 590376 751565 1036141 435377 542709 1052749 702200 869772 286807 767335
14816 767335 724973 693791 831119 727952 658705 732373 520246 638824 592387 214183
14805 895510 527885 969021 1106052 1182809 877881 666845 768463 727428 662018 384006
14795 384006 434686 605368 695092 668083 541669 692850 713819 724682 696178 564253 792148
14784 792148 942585 429811 562352 876792 746904 372223 753779 987635 999187 1176624
14774 1176624 1083496 819099 910322 787158 561999 722250 793824 451155 443477 463281
14764 463281 544888 666515 764911 625297 700925 587922 505417 691289 899161 330219
14753 553482 655930 443728 601636 704425 473166 573937 437063 660745 746897 798753
14743 798753 771233 783552 754181 763923 662292 1091675 703402 893395 911332 813958 919029
14732 919029 1018481 1155426 1301424 1236584 1434735 1603268 1611995 1604780 1475217 1584659 1306668
14721 1306668 1176339 1200341 1325293 1167629 993289 821432 811560 975417 544132 996200
14711 996200 950005 950246 1165217 1008248 847714 1166127 1067663 1263748 1429793 1711693
14701 1711693 1383743 1640528 2260471 1750233 1632793 1614868 1072446 1097044 1177151 814676
14691 814676 843289 947463 1112022 770926 821979 769227 986679 1207439 663746 1127680
14681 1127680 1108277 1028280 1234331 1095467 926269 1096840 892884 1080613 1109434 1121417
14671 1121417 791447 1119853 995579 1138192 1123960 786351 663879 998172 885773 1180657
14661 1180657 1079046 1241334 1060979 1403806 733899 1310313 907911 893045 1335967 903630
14651 903630 1394936 1333941 1308223 1054186 1256310 1332069 1155702 1221373 1243103 1305767 1191420
14640 1191420 1320928 1059617 1212086 1277553 1200318 1270040 1187286 1026887 1698653 1170056
14630 1170056 1213683 1375376 1313295 1449026 1670455 1286967 1109732 1470167 1229106 1541816
14620 1541816 1213215 1545915 1254482 1561416 1887231 1474009 1031334 1315601 1287363 1412406
14610 1412406 1637913 1471549 1659742 1628238 1788721 1594855 1388912 1779290 1506175 1832376
14600 1832376 1758936 1840632 1583265 1369140 1952010 1742397 1578279 1793886 1612175 1576070
14590 1576070 2114830 1617684 1748251 1907297 1691215 1893377 1874319 1880627 1765753 2038642
14580 2038642 1904693 2111212 1899515 2129232 2442326 2203618 2305823 2197568 2268189 2315210
14570 2315210 2360488 2279635 2111547 2375944 2505741 2294523 2392298 2962791 2488203 2750182
14560 2750182 2660753 2523965 3244544 2675786 3305333 3194775 3378527 3932235 4038605 4576120
14550 4576120 5392112 7118114 10739622 18396397 34593256 37478118 23175489 12210717
14542 12210717 6731608 4523954 3317974 3274762 3548046 5454422 4801207 3324099 2436315
14533 2436315 2178495 2130698 2367172 2333672 2397967 2305500 2068553 2350835 2417326 2115878
14523 2115878 2456486 2292217 2468131 2210529 2620373 2278851 2368872 2485149 2681385 2991204
14513 2991204 2536970 2867564 2638231 2899420 2785743 2746857 2844691 3143132 2848230 3124408
14503 3124408 3325006 3345110 2885871 3145316 3105213 3163506 2807038 3432046 3390783 3166390
14493 3166390 3327642 3524338 3011461 3851429 3478426 3433549 3771594 3624377 3917952 3736509
14483 3736509 3728256 4074732 3821779 3994991 4156262 3739166 4104281 3692671 3897532 4042830
14473 4042830 4087501 4239866 4376558 4088902 4480679 4359787 4340553 4360846 4404981 4510036
14463 4510036 4900510 4589083 4960067 4987120 5138293 5321888 4863202 5390416 5182692 5447326
14453 5447326 4993876 5455334 5614934 5611800 5610067 5556532 5578322 5772458 5885318 6056941
14443 6056941 5717438 6210481 5818724 6228536 6009637 6368221 6559850 6653200 6455199 6556330
14433 6556330 6588129 7194807 6271086 7129778 6904512 7495021 7432546 7707621 7670806 7724559
14423 7724559 8000766 7740596 8171583 8408287 8520550 8786402 8980747 8990845 8995941 8659225
14413 8659225 8917891 9131722 9164665 9454240 9596715 9465724 10085639 10106575 10251570 10415312
14403 10415312 10482176 10637837 10736297 10934119 11121789 11087612 11245552 11318756 11837020 11733303
14393 11733303 11967359 12290645 12192200 12603403 12781572 13241973 13163466 13474422 13681875 13957452
14383 13957452 14261333 14698203 15027152 15336402 15524705 15817107 15793703 16371705 16474134
14374 16474134 16977482 16724105 17563084 17693787 17725744 18290330 18775239 19209512 19564554
14365 19564554 20042346 20342968 21125827 21242180 21411751 21982726 22435163 23420809 23409959
14356 23409959 24497133 24512485 25227933 25811434 26524018 26754856 27874153 28657779 29099190
14347 29099190 29876848 30601540 31362316 32163892 32974418 33636078 34613030 35424403 36281269
14338 36281269 37675707 38219360 39444755 41060361 41728958 42963100 44514579 45891916
14330 45891916 47002154 48580417 49970151 52051899 53434443 55668438 57404617 59339906
14322 59339906 61139478 62920062 65421160 67816545 70225596 73002161 75187626 77964171
14314 77964171 80553403 83793576 87237611 90784492 94116116 97999587 102053602 106001674
14306 106001674 110929114 115867155 120478963 125665915 131537849 137395548 144015262 150337117
14298 150337117 157463285 164625493 172513242 181023299 189729538 199023150 208686676 219171122
14290 219171122 229581172 241065386 252673675 265199727 278242387 291568704 305446434
14283 305446434 319170489 333647146 348084209 362726400 376914466 391179053 404984826
14276 404984826 417435316 429109943 438843707 445001054 449239708 451265834 451608425 447771236
14268 447771236 446164812 444257688 438769365 430989930 423593795 414444184 404731801 393034299
14260 393034299 380254366 366793646 351791149 336771175 321668167 306493920 291790698
14253 291790698 277275242 263614567 250182453 237837920 225875668 214949693 205492899
14246 205492899 195423672 186002359 177051446 168942030 160599790 153221915 145965510 139295049
14238 139295049 133084768 127303593 121626749 116474646 111528948 106822934 102415148 98695333
14230 98695333 94830778 91061257 87225160 84022294 80749388 77793685 74825110 72184391
14222 72184391 69717842 67121140 65186396 62644109 60673182 58538173 56605487 54831187
14214 54831187 53252317 51620194 50061220 48775361 47274859 45404935 44118392 43740113
14206 43740113 42442738 41242596 39965718 38570428 37406772 36727504 36052945 34990274
14198 34990274 33917720 32810048 32027491 31240458 30477879 29839624 29068526 28198472 27806112
14189 27806112 27009775 26317178 25539873 25287378 24461249 24147131 23305744 22821608 22452638
14180 22452638 21930784 21507715 21323555 20846135 20399726 19738304 19269069 18987150 18599418
14171 18599418 18021625 18175976 17902942 17281796 16949152 16690493 16656390 15811562 15868863 15485571
14161 15485571 15293210 14607482 15052740 14524221 13900893 13760078 13640399 13526110 13003335
14152 13003335 12801550 12521259 12345293 12181917 11878875 11824636 11623998 11573982 11366289 11054753
14142 11054753 10534100 10574678 10876368 10831410 10310686 10264778 10162281 10014915 9641717 9914838
14132 9914838 9442332 9278783 9203662 9108675 8817218 8859469 9071651 8784289 8821358 8350796
14122 8350796 8259565 8307772 7962395 8082747 7693245 7631301 7653313 7320539 7639243 7281888
14112 7281888 7339195 7043598 7398994 7018281 7056476 6670105 6669575 6629829 6664905 6348863 6533769
14101 6533769 6424638 6076263 6021827 5958001 6160662 5878996 5896861 5816687 5732703 5742083 5864422
14090 5864422 5582795 5401805 5478312 5539912 5297300 5216438 5117638 5428414 4958729 5178063
14080 5178063 5383365 4752950 4962296 4791607 4623079 4593045 4746932 4302457 4589569 4878626
14070 4878626 4429158 4637656 4420602 4130059 4032261 4050815 4608770 4219870 4314559 4499222
14060 4499222 4433980 4273625 4078758 3832225 4148724 4069086 4158532 3736435 3925033 3808148
14050 3808148 4205821 3687031 3292370 3605094 3725896 3513482 3554191 3546500 3314164 3589760
14040 3589760 3460003 3245326 3434670 3196764 3409929 2965586 3145310 3298507 3358999 2877297
14030 2877297 3357177 3163047 2695648 3139719 3371728 2996518 3117269 2842345 2848521 2922226
14020 2922226 2652447 2889246 2760732 3112322 2396603 2815110 2256995 2330197 2428019 2499522
14010 2499522 2762597 2308194 2332966 2243701 2427847 2353355 2327261 2765901 2136558 2589239
14000 2589239 2201878 2164598 2140846 2100636 2395594 2254661 2205401 2464597 2219209 2420980
13990 2420980 2783860 4024452 5949480 11742650 27537436 38527667 29081186 17590979
13982 17590979 10695571 7598254 5782989 4907743 4401889 3606740 3404699 3140755 2538697
13973 2538697 3024957 2719038 2749421 2390927 2282978 2513654 2275391 2507309 2246473 2723517
13963 2723517 2413330 2112225 2220794 2077821 2379510 2141592 2147435 2174800 2250570 2051305
13953 2051305 1799141 2021468 2185842 1952121 1814553 1932446 1681181 2009755 1888343
13944 1888343 1899994 1859417 1934359 2060812 1810529 1822047 1769312 2041954 1537345 1791260
13934 1791260 1659851 1945874 1840959 1740045 1865990 1942647 1480421 1565264 1519711 1556915
13924 1556915 1703422 1442747 1716250 1653890 1848966 1652700 1612560 1558160 1665808 1729233
13914 1729233 1740190 1682332 1580793 1587648 1499297 1321463 1433959 1547800 1427116 1294339
13904 1294339 1397501 1294568 1356971 1370943 1350353 1185607 1399889 1339503 1487943 1232407
13894 1232407 1484208 1270512 1318899 1394666 1161960 1671112 1352554 944299 1119914 1343201
13884 1343201 1121173 1270813 1205562 1107340 1686618 1173348 1238043 1526752 1404407 1146826
13874 1146826 1396614 1194197 972857 1148460 1350121 1152233 1339960 1301885 1160154 962238
13864 962238 1184663 1076124 1200027 1526507 1290152 1043056 909092 1124902 1493854 1103545
13854 1103545 1010690 1055422 697737 978626 922927 1029121 1036451 1206276 1280612 1205970 1349860
13843 1349860 1199609 725823 1045063 1072999 890273 1036910 968014 984849 925710 948170
13833 948170 1075290 1196023 1207240 971771 1292466 1130758 644878 1106256 1127927 1075886
13823 1075886 1045359 603593 674017 895850 931236 823885 1066790 615886 735316 780550
13813 780550 979128 1111476 830943 730974 758544 791848 1343154 668377 953622 634229
13803 634229 691778 703329 1022502 914185 855047 1093510 979721 428425 840661 994416
13793 994416 668998 1090221 787031 473275 829986 878555 1111613 774805 615947 731731
13783 731731 793327 1093649 659097 817880 818180 564693 654455 681391 788944 690488 862471
13772 862471 803559 812714 697614 675415 954801 839493 714909 890237 574001 696080
13762 696080 588691 671235 801118 617650 233083 774980 519094 890003 772778 441851
13752 441851 438554 772079 406591 449621 614985 608505 566281 517405 683433 790191 600434
13741 600434 598339 725281 548078 888381 934551 777493 464820 200620 512983 520427
13731 520427 570533 350102 782301 585333 588781 705708 469957 854913 477182 709751
13721 709751 670603 875427 787325 840941 503210 616383 419823 680489 559167 560740
13711 560740 277622 560463 581649 767398 501597 578684 317640 601388 469035 675836
13701 675836 794682 218356 339304 613780 769606 375468 557575 645483 817743 613469
13691 613469 781162 531860 477311 618766 94576 277299 477019 61124 718315 463961
13681 463961 375456 868374 456315 520188 488538 647024 561840 350459 576658 217494
13670 430633 499380 598399 558479 238496 460159 492634 215811 531862 291357 171022
13660 171022 350200 376912 691640 706330 459644 410543 708869 403723 376549 453717
13650 453717 437086 496072 452994 495027 454047 217098 296872 85984 296255 396401 347560
13639 347560 314981 99032 288667 540804 347409 348531 14141 190953 267472 118862 412262
13628 412262 392653 375210 264109 559092 316889 378523 123623 437391 553202 -22172
13617 544095 300787 358908 405926 522484 282101 285288 534985 354906 349208 343388 505212
13606 505212 456953 237876 288166 377830 395810 806580 448679 108651 525777 410043
13596 410043 335369 145054 311793 670092 37923 406901 83744 357716 440534 260872
13586 260872 100338 608938 193073 720846 365539 493094 532205 316856 451268 293767
13576 293767 579874 334022 426750 431371 551144 303697 491590 292950 246334 436966
13566 436966 229161 491321 573845 395891 281440 520077 339737 231150 290343 230723
13556 230723 182793 210369 199069 435320 331911 -60704 392986 383620 395863 350009 312550
13545 312550 436614 56934 315484 155773 318776 470940 123103 2556 133640 50812
13534 465496 218397 345783 306651 432457 431738 321288 631274 383243 477375 186602
13523 199913 242160 355333 411582 211864 688898 311832 350948 386678 340488 234461
13513 234461 32823 400390 486247 36723 175209 388314 67394 81838 304126 224031 150116
13502 150116 156084 100319 204961 334352 207332 328882 235407 383669 26170 233871
13492 233871 178860 400005 159412 32197 236977 157254 129747 136994 107034 277474 338044
13481 338044 70011 272795 264290 360977 531056 88680 176842 340915 54246 139901 122472
13470 122472 60543 216144 -11084 235650 -5382 335857 474212 247822 70742 45035 150834
13459 150834 491979 188237 -207112 136410 329853 456333 287827 146318 498223 229199
13448 395245 292538 90772 104774 402476 139187 424583 475036 250889 298765 288538
13438 288538 315783 409880 287346 174590 426752 141164 151679 -34920 160467 323329
13428 323329 210548 156317 -27370 120188 591227 5133 135959 108741 42379 344992 94041
13416 35984 186255 378756 557244 210293 266235 298064 124311 52929 308058 -16920
13405 141790 378531 485812 123363 198130 77113 299398 -74349 379449 154659 316500
13395 316500 639372 378071 148156 229067 128023 208581 287971 247032 166088 222269 65352
13383 249210 314484 262886 69390 114752 228932 -102769 268864 283644 126663 278951
13373 278951 128802 -6097 59551 433060 278496 329614 446058 222217 213700 12336 237079
13362 237079 71532 328655 133895 346159 368935 531911 329100 196832 -74091 201314
13351 157768 122231 204900 168359 70272 142190 -144788 -43779 190873 294795 -99223 443162
13339 409556 386277 104446 504970 488582 516974 463518 34197 280851 18797 201213 405923
13328 405923 304580 344293 -79573 -86622 139216 373516 278527 149378 273300 103846
13317 153145 -102262 251551 197597 7165 162346 301706 182487 -16781 227938 239782
13307 239782 -20965 311673 163864 363383 -185327 165772 117918 4118 205012 -253198
13296 -10696 289841 305318 -2528 -145635 146581 50883 91654 41307 195084 232368 204539
13285 204539 173137 130067 97699 195675 271114 14737 98508 -6658 284055 13782 81604
13274 81604 587052 -57406 -139624 204366 370850 125352 134368 134242 -261514 -79154 354743
13262 8529 356130 -114930 11081 287834 5898 27065 -95646 106199 52602 239453 371080
13251 371080 143254 168297 72726 110172 329506 324755 -123173 117918 106512 253112 170296
13240 170296 171976 95179 -6699 214866 -78393 49465 18070 18130 -78155 41654 -816 136008
13227 169111 -70720 177 84583 -2490 496257 221790 347811 -72598 -182573 41624 -32209
13215 -130010 -150001 -91874 -29628 -132051 183404 183653 108360 -5919 133398 226676 110366
13203 -55457 198686 -68276 -104172 13625 236235 107240 159448 189512 321079 283723 308515
13192 308515 285466 -191852 184007 33112 96684 331351 118692 -10782 495624 -13325
13181 212365 51517 -7642 -109217 188610 145586 333050 -122789 -380483 192314 141713
13171 141713 387470 43498 -4039 141969 210504 332085 162017 -25346 111975 212142
13161 212142 -84790 165396 -395541 387926 39418 12412 201160 144126 135938 -48431 142191
13149 -41441 -162190 -36657 129953 -60221 542452 14839 23651 217252 209709 246647 60479
13137 -114907 125432 135765 105429 14523 87449 25881 6619 62835 49755 13289 158966
13126 158966 -81798 44908 22647 185637 231603 434809 64655 245178 137789 -66396 164185
13114 179981 351273 -9313 4295 -53649 18750 -278495 -87710 -50419 109386 119059 -88555
13102 -31452 -151271 170671 333906 365307 -200422 -117564 215971 183836 79674 177725 -123430
13090 109617 142188 -189189 207131 239436 106777 -5023 204967 87096 74538 -114082 179443
13078 -64903 72592 212869 343693 60500 111210 -27172 330332 -74874 128112 294856 178700
13067 178700 217633 46037 243220 225960 -150343 58312 22139 -226250 161818 -168030
13056 415352 333235 182832 108291 286134 254394 16390 151619 216900 -159336 -198838 96412
13044 -37262 141053 193093 113694 43018 -85 197133 88344 76485 -48450 312157 247265 78422
13031 56991 197500 -82172 84123 310177 80726 196928 -215551 161137 -31721 136979
13020 -8578 15156 -64922 65086 28441 75148 194849 -93496 -253096 47050 165853 262721
13009 262721 9351 37642 -54040 68158 392631 67118 266318 75670 211484 393 96834
12998 96834 -355009 73583 -239002 48339 52606 -199605 275002 130759 6019 -174307 -183747
12987 -183747 -20706 -156506 42393 79543 76129 -4644 164163 272351 -61395 -32047 -103776
12976 -103776 -227073 153110 263615 144895 -129425 -201842 -158138 32282 -53051 75302
12965 133568 343856 -25365 -123638 -51818 107632 -265010 65442 314225 -2153 -59458 -111858
12954 -111858 55159 -77355 238118 -124825 144217 -248694 -200804 124027 -140449 228669
12943 171604 -85124 6318 35785 178520 47395 164141 -106655 -231734 5454 65306 -61822
12931 17170 -72562 -15405 81499 -178704 198163 -123376 116710 -235381 -28542 -275100
12921 -275100 -15453 5701 186449 255556 266007 152293 -85713 -68612 269907 85844 -161620
12909 334514 -114824 -63069 165407 409591 63437 119780 -171653 -7035 285558 -98683 -200323
12898 -200323 222405 127351 166662 114143 5433 175499 -300502 127857 128216 -116870 124717
12886 221851 -11310 253798 -214418 -85757 -26982 -182439 123361 56483 308252 81660
12875 -59832 75427 -94606 -82478 -222676 -43958 57307 253922 -244553 -76871 147248 51936
12863 268828 44348 219003 126530 172037 -189359 58453 -67421 110259 -178598 -11196 312610
12851 -228121 -768 55184 -40523 196298 291745 -43370 -125333 249815 -284171 20338 -29507
12839 25871 -198009 -122269 -172483 -276198 -341114 317636 -45154 73113 98684 238407 -186674
12827 53604 150949 393227 167044 51401 -171448 37611 189257 93153 182324 -34865 -104081
12816 -104081 85008 -103309 -161308 53406 -31199 -50096 81889 -227928 206516 129076 -24
12804 -295663 311515 -332076 147925 78961 6064 -8295 241 -245369 289773 124889 -51637
12792 75656 26425 70818 -103715 2841 -74568 -78673 142385 273892 178650 161696 -38929
12780 -36075 -92580 7181 282287 122732 171992 -247749 -161306 4552 146938 -41516 -52073
12769 -52073 -310367 77496 -8798 -177810 -131410 85572 219769 -14255 142871 -43559 143359
12757 8910 97667 -174301 -35640 263422 -171702 -5022 -78038 -54167 117635 -67923 -122564
12746 -122564 26151 -5787 -270113 94381 137718 208155 -158859 -70446 -266593 229421 105877
12734 106344 -196541 12020 226108 53034 246407 75908 118833 258587 25439 166580
12724 166580 -276231 129305 232687 197562 83903 -62690 -256263 252035 235616 -70131
12713 -42848 53873 118610 285057 285330 468404 340720 70660 204154 225011 121215 350248
12702 350248 288464 159900 24251 -95363 -36160 109871 89304 -52980 279958 -150381 -86619
12691 -86619 -94046 -257009 153134 124727 11314 149104 102259 -37628 62113 336138 53914
12679 288776 192582 194868 -23357 30881 -84271 9717 190133 145186 137271 9975 27021 -17209
12666 -273304 -315834 -255185 -55471 42058 -176958 89218 281831 94025 71403 -78963 267600
12654 -323952 -136511 -22839 207505 9652 154186 217132 114170 147142 28271 -53285 173474
12642 263361 -66631 5843 -262336 -128764 68217 -198808 -34491 129713 -39224 92091 189702
12631 189702 -73424 219555 51106 209954 183046 237721 43838 142811 413071 -22562 203769
12619 -112595 133483 -74683 -169179 186703 -71019 106430 -5907 -25378 115900 106917 233812
12608 233812 -6640 182284 -58479 32704 -185855 136487 89294 -44346 -126381 109936 53046
12596 377988 -42943 92201 63260 195552 190435 -115253 -13611 153338 20712 12916 -112616
12584 -204745 -102982 -16078 122271 35191 -31409 -52185 65969 168581 -2974 -191385 -151922
12573 -151922 -110148 20901 -76409 5532 -90208 201510 22009 -57186 -90848 -257211 81263
12561 351585 -334845 -269065 -158908 -22518 -62730 -43410 206072 -45382 -105286 926 -64717
12549 -41072 112562 337570 -128445 166121 -48503 -214214 -37732 97777 -162816 -228769
12539 -228769 -112769 111312 -89727 -348289 -27781 267720 5456 218072 41662 75443 195575
12528 195575 102101 127765 -150094 -19822 -163867 -124575 9693 36804 77282 198201 204499
12517 204499 -102492 -77875 -200623 424683 -149410 43226 121443 218950 322552 -184586
12506 -6444 160259 201930 63373 -75581 -72422 -214028 12658 -27769 89102 139415 -145095
12494 -107946 -174783 31498 -263659 -346507 -8877 11771 10303 220607 339871 -50778 -161246
12483 -161246 -112604 -121456 141102 -427419 -490110 -249001 169273 -159168 -53075 178156
12472 53246 34568 -73296 -204369 190283 -29652 84816 -38916 -79297 -168 -29928 -265319
12461 -265319 -384850 -132151 -126133 -44387 -44594 -295141 -337722 -138958 -390713 -87646 226115
12449 9037 81000 241915 24173 -55687 -97265 -413167 180590 40499 102803 52070 -80917
12437 58473 449049 -3381 22837 -167271 181774 -300973 -167712 163313 201939 -122407
12426 91579 -309146 2448 -94470 -234157 31862 16893 17557 -126474 -104912 -235254 -66811
12414 42012 -48111 -26090 89538 -194274 34090 138140 -94698 -309967 260868 123844 -47905
12402 -159003 65187 85601 -44837 -138581 -167119 -399884 -42153 134798 63852 164568 179
12390 206962 227545 74668 -216055 46626 165273 309121 101792 236098 180719 163821
12380 163821 793 433915 256583 4296 595304 -142809 -18449 -77428 164518 131679 242635
12369 242635 -63808 4670 168469 111524 -91077 -22339 -383721 -5001 146546 -11288 -178877
12358 -178877 -74233 -4258 20585 11026 79289 84707 116852 55376 -208503 -175358 49890 234678
12346 234678 65664 153244 227444 15795 13901 226159 65854 -114961 -133929 64665 122181
12335 122181 156082 -18495 257463 32425 -10979 -12556 255889 199978 53599 357284 55366
12323 433743 268597 -95024 142104 99129 131985 36288 2860 140624 44962 335562 90874
12311 157760 -26039 55706 -44790 17589 -115731 319622 114174 -180623 249982 18247
12300 38378 -16760 -42984 121138 106969 -340361 -118965 18870 81539 46596 232084 178562
12289 178562 -16865 -20161 138619 -184018 298278 246572 327610 372509 246680 23517 184590
12278 184590 183368 108540 212978 50035 51077 307697 215030 5432 -31950 348786 201883
12267 201883 -369310 445986 388558 -101597 -83255 253473 -31512 52511 147126 397280
12257 397280 171073 -181733 237393 187847 55736 104743 91720 78621 100255 -23297 251666
12245 282267 -135342 50580 4981 45615 93103 -75481 -127558 121547 229199 31936 -92935
12233 97243 353914 299623 -34314 -329625 -50381 370562 48414 173117 406066 41266 49355
12222 49355 65477 284799 196272 43033 178734 -104310 440275 250482 198595 -75191 -180630
12211 -180630 33190 74582 207159 276761 419988 475809 -58935 275036 103667 -32888 151617
12199 158166 58894 -97847 501728 138383 330663 458420 222222 63176 13681 103208
12189 103208 191609 198229 229116 341893 304733 219589 -29032 -177202 -50678 93273 249348
12178 249348 245890 655346 -20373 204715 390351 19376 518196 -39242 -128683 462712 192250
12166 137727 275786 419235 421161 254869 159691 -115946 -130892 216529 146329 169190 527000
12155 527000 91853 -361203 268845 -355464 439774 225620 -173267 46267 -10592 54144
12144 -182463 -73826 -246404 96705 -23455 -36996 179701 43392 310927 62156 262108 134270
12133 134270 -75517 23882 -45758 67632 235506 -4821 224621 224276 257040 28555 -39932 41492
12120 -93023 261486 419708 117527 43497 70582 445431 1773 281510 61832 42349 20210
12108 72602 -136475 -146493 37511 12281 202744 23213 337054 305639 27009 -55735 162630
12096 -198797 47270 37968 -253863 175516 403394 139454 93932 -84730 45994 130478 494921
12085 494921 172176 405082 72334 107190 28811 247593 64021 -173288 485309 321101
12075 321101 242025 260195 -122459 416917 62245 -15988 262339 150367 -101396 328106
12064 109770 212950 330236 255435 282158 -36207 257912 -16969 -236559 -133220 114351
12053 -43982 -353133 530429 -11424 28567 111660 108504 -2754 -66562 84221 271724 -123244
12041 -103147 285295 -5536 -52090 -113898 -319836 -151245 124246 19887 75153 -74254 353250
12029 92579 354855 -101938 39925 37789 348808 -17599 -150957 -256375 -26389 238146 -37991
12017 64164 -140769 359791 -50163 99307 476613 -25050 353942 42374 90151 -161067 148940
12005 -169756 -32699 29588 -244101 -223627 13838 -217983 -416943 -292019 215745 53539
11994 -34563 -158255 -153347 495308 -43434 -123590 -16674 31965 -109426 -256299 40722 92067
11983 92067 135811 -351469 272177 -364579 -31871 -96801 64280 128235 -156667 -90787 -14936
11971 -126043 -187850 88338 -190650 -57443 -75636 -251696 55406 -287240 -254320 -316888 56730
11959 294911 112868 -90749 -20060 132337 19369 623 27735 260284 364817 139027 63661
11947 129226 -91974 51425 104015 176658 -132912 53626 105767 80305 199592 392 -450243
11935 -61320 71233 -4885 228435 260561 270479 -98770 -32474 -168104 -93557 -126001 -114162 76520
11922 140953 101060 95425 215868 55290 -73199 -130567 -30551 151081 37488 -5924 160473
11910 148751 99003 56763 38032 233512 168258 -322529 -22851 147108 122659 199548 -255032
11898 127343 231360 172747 55200 2356 90813 -160885 127191 178193 116712 -158958 -122960
11887 -122960 -58738 -278240 -53278 215950 -423733 86150 -318255 34395 134171 313542
11877 313542 -11102 -78966 -373524 -62515 -77466 199913 80550 -13777 -194578 47580 -56915
11865 -75424 83129 244059 56035 -343845 39269 -124252 -329098 141855 -147142 327343
11854 1951 141546 -326958 -48924 41339 99652 17735 -2214 -161066 252082 -142546 34272
11842 -97620 -101567 -193187 -79870 -71816 -303301 57937 -155183 -133908 185068 -114186 205915
11830 47874 162008 -40499 404906 305508 19895 -149197 47612 -60576 -208794 -221311 -192513
11819 -192513 -1475 -124484 -131992 -40000 -2472 -174362 97338 -363351 -405000 -39937 118904
11807 145044 -209826 -147315 -462342 23158 -104764 45143 130058 184172 -44369 23559 -538677
11795 -340389 254597 278319 -474388 -204159 140710 -218544 -117873 79157 -235190 545236
11784 -183019 -47296 261317 26507 109134 245270 24824 23587 23102 183653 -174552 -382785
11773 -382785 76591 -113525 -174952 -60164 -21309 -148163 -149744 -201742 51237 -78322 -126470
11762 -126470 -147484 30840 59273 -9415 85783 -21404 255150 24992 21938 51792 -91793 77971
11749 -98876 -24876 96487 -14233 70205 275140 95321 -77353 352177 -57385 104266 144614
11738 144614 -542502 285452 -128924 33887 -131939 4838 78356 257059 168603 -77556 -163488
11727 -163488 -4338 330058 -189118 22137 -234286 -113659 -302400 -132612 249541 8475
11716 -18229 -90519 6530 -58853 270041 83547 145026 94527 -146692 269642 91001 -51078
11704 -254374 28876 -251589 -88720 259192 78182 114487 -91053 183055 -50213 -49554 -103458
11693 -103458 88449 -93908 124616 151278 -44541 -6925 49420 -223932 16325 -271744 19600
11681 66366 -20271 138226 15783 147606 -13968 253608 16559 59392 113257 45034 167130
11670 167130 -39126 168821 101161 4196 -38613 131990 317653 218742 -78567 25154 28625
11659 28625 321565 84335 -85717 207329 -1068 245561 -94866 98812 -233355 -36899 58272
11647 -77137 11827 -103555 104784 -12160 -975 -279167 356436 103862 -64718 148163 34851
11635 207375 -260383 -29970 113781 -182649 29760 -97392 141796 62568 -284174 58195
11624 276689 -41255 -292423 -29960 -17037 -64104 90329 90407 315330 -36373 188139 133619
11613 133619 -70085 36188 -22756 -111288 -22539 144811 92991 -168594 -242406 27322 183661
11602 183661 -133111 -62807 228955 -22914 -105694 -12157 350824 167078 46058 -196532
11591 153846 -25225 -33390 192645 548598 -242639 -40398 246905 -50827 298303 -12664 199332
11579 12278 94685 61932 94046 303414 -279094 192862 -185995 56497 -189747 -150857 163660
11567 124250 395134 170702 -36019 194393 41074 -113416 64081 560980 159104 110829
11557 110829 -48438 33489 454742 2536 141043 -89266 -43883 -270393 121067 55649 40181
11546 40181 -2381 308547 63867 18741 131571 -86354 -21327 67483 -168786 -35791 21026
11534 -161527 -205787 173528 10607 251519 -130144 -34441 71308 260164 -18729 -80580 -98275
11523 -98275 250164 57230 -28695 155708 253408 -146889 -183299 -104312 111678 -97837 40548
11511 -58282 177464 -24986 164950 45846 274533 152166 183341 23522 -143945 52678 234700
11500 234700 211272 219346 576612 -85115 330253 125442 57602 109852 134063 193189 108098
11489 108098 172059 229198 -284216 159711 1032 30404 105016 -132885 214582 -31507 51977
11477 16890 341488 347353 174221 222981 124780 -10228 153834 47451 130559 59585 35005
11466 35005 74842 437872 -62146 238178 266672 474907 -31727 332189 13513 -111448 438122
11454 58332 31289 206823 45920 316618 -119469 -320474 98026 69400 258332 164401 -144982
11442 -16438 -341166 38875 -146697 5233 139161 116303 180914 186585 11039 194529 -176728
11430 -61302 52279 131767 304015 251834 353428 190207 122623 -17074 -58280 195261 275289
11419 275289 161387 -448419 142151 160103 -180966 -70816 250433 -104198 -41172 -9759
11408 -23970 -14434 22313 271035 111062 -36940 -55640 224897 51922 -208231 88055 139084
11397 139084 162221 -179469 54435 -365765 89747 -157976 134635 -16470 161838 73781
11386 59070 -239162 -67037 -160899 -162094 -247278 -170297 -38059 41018 62524 -84852 372813
11374 -51710 110772 -255010 -165379 187392 -37244 188199 -401414 235747 37971 118589
11364 118589 -323952 -14247 135744 -284338 247320 -161386 3062 -115103 -146882 -221870
11354 -221870 -88119 -217578 -212119 -175891 34343 -57828 -71273 72762 263809 -173408 -82894
11342 -407259 -9854 60791 -68248 -325454 -176469 33438 46931 40856 145199 -47248 -75202
11331 -75202 -181055 19373 16625 38234 -75022 135142 -28222 3062 -216271 123152 -262401
11319 -240520 -118980 113191 -100768 163284 -215295 -144362 -192872 77142 280033 -139461
11308 -100550 -9650 351888 -370454 -310011 115520 -69441 244099 -7838 -231631 -269646 -290538
11297 -290538 -148703 -283702 8790 99284 -205280 133215 151224 -149498 232946 -261007
11286 -357177 -278909 103179 200393 -116561 -315502 113520 -1957 -268102 -54282 -253668
11276 -253668 33772 86540 -153535 25123 242890 -209799 -131021 -193760 -250093 -238469 96389
11264 84326 44208 44569 54837 -52458 72907 -88229 -65973 -115539 -133435 283532 -41359 -179359
11252 -179359 -194117 -303296 -29450 -212504 -92805 110274 -49372 89867 -8624 -45852 -52060
11241 -52060 243011 -258221 22905 96825 -261641 -3624 116716 199857 -9510 -332292 -265951
11230 -265951 65319 48726 40236 -53649 -30006 -80023 104909 -170713 -39263 234741 27361
11218 -39931 -72947 -58056 -30843 234870 -175776 -13139 -27902 -250767 -263541 206356 -202690
11206 10193 -132834 -162276 -166056 -13554 108536 82427 43571 -104468 40234 151796 137658
11195 137658 -31913 102897 -321416 46641 58907 -100766 -116044 -242305 108181 130342
11185 130342 -73650 -195924 133914 -225970 224165 -10572 -136111 -224003 -20320 55031
11174 -128936 -223543 -93851 -173985 -56582 255513 363850 -170885 106786 80254 -6652 -89604
11163 -89604 -127873 -223772 154497 186251 -183968 137794 24402 -6700 -340534 137186 100086
11152 100086 -98743 47470 296501 221352 125447 134026 125448 -339727 -103931 -346327 108065
11140 9491 74028 18861 81134 224351 -54980 46917 -48396 -231003 202891 85382 -126786
11128 -125227 -5399 282829 -89698 43418 47045 -194855 370721 262318 -302553 -312950 -87568
11116 -415993 5479 -216218 205027 63172 -154870 -219283 10918 65321 77675 195355 84686
11104 235104 144545 281332 154906 197218 -494210 -55494 463552 125335 272461 247261
11094 247261 82373 -88110 138876 234798 -62004 64214 118297 26301 209314 48316 322852
11083 322852 -41333 185778 145792 359003 27670 142928 -113385 107059 147506 424616
11073 424616 198927 296154 168899 650392 418322 -5717 216280 40545 195090 343962
11063 343962 386327 -38166 405146 385106 190138 515484 492371 437427 132629 654490
11053 654490 594054 268671 644561 528157 608679 361760 257773 792239 648238 914241
11043 914241 641525 783179 501741 907412 736457 566377 1225192 749821 511422 814766
11033 814766 641387 888966 490793 417326 481547 629156 321038 728913 466164 735601
11023 735601 434620 531464 578114 756667 443883 292028 638166 574981 516102 584338
11013 584338 702245 397478 487916 886071 267915 712166 538307 873776 734659 487851
11003 487851 229504 698688 324272 400198 671734 430820 405976 573840 722196 355015
10992 772913 527530 526177 752468 474133 353417 804775 882291 831649 537229 708168
10982 708168 1237170 1230164 983477 1086990 992615 983048 1076907 1139268 1354615 1734351 1684050
10971 1684050 1868974 1917350 2425060 2526280 2323765 2539608 2314085 2134287 1928530 1440874
10961 1440874 1775966 1762560 1521096 1186539 1496103 1800579 2093657 1818600 1398941 1693355
10951 1693355 1784330 1572490 1103395 1268460 967628 1044780 1189646 692027 219931 312514
10941 312514 272708 759077 227756 23904 121487 129737 -131234 33787 165300 -118127 -87669
10930 -87669 365543 30318 29287 -230772 46780 -79240 -80176 96120 254197 147969 185749
10919 185749 -362478 78031 293555 -108708 269549 199673 430634 -136603 294493 -16799
10908 -28602 150234 -194218 205306 -93848 -98586 -100390 220078 -190380 10475 322463 122505
10896 39340 6677 -200878 166865 -36281 -286516 -190067 205971 -76178 -110531 119025 104765
10885 104765 217211 80836 92784 61202 -253079 -118953 217802 188649 281420 -4261 86365
10873 73169 247767 50107 285941 -88595 -122237 139948 -339075 121216 -90177 85071 -325919
10861 10349 -59097 324149 -38697 -62721 -187609 -269554 -85943 222291 -91309 -58464 -43264
10850 -43264 -108290 164917 -24802 388170 49097 99814 -247912 -51720 155769 -345022 -321860
10839 -321860 -179992 203982 -47192 133776 -17049 -100945 -154215 42932 194128 -177132
10828 -297795 -204147 242206 -10719 -178175 34981 17696 21741 -251729 -106740 24521 -293372
10816 -42840 -215437 163822 -174247 186534 -4608 -197399 -73146 298726 267685 32913 17813
10805 17813 -196000 59095 278532 -301382 41914 -245772 207124 111724 89838 164118 20074
10793 -79566 -164094 -26694 -24181 -182253 -315903 -46070 147538 69378 -446602 43793 246361
10782 246361 43331 -353323 -260302 -222777 -176218 111836 181183 -140310 -27648 160797 -245449
10770 -18573 -341947 25859 39086 -212761 -225258 -59822 -12977 75159 -279466 105566 -219142
10758 -144522 -99493 -113479 -239721 -24087 226684 -165947 -511730 -334465 -149513 -41365
10747 252181 -142454 118936 161374 -99328 104486 -20436 -72982 -208904 234368 -85634
10736 -94877 -248091 26488 -164529 -241117 -207549 -431861 214597 -125867 -115108 128115
10725 -178484 -17803 -115917 317714 350593 249648 246798 -145747 -22785 200951 117429 -85543
10713 81960 -439361 -109426 -14682 -16012 -74242 12295 47339 85355 -11974 -177162 -350127
10702 -350127 -106718 96156 -260669 -104999 -230333 200269 269883 -97934 25812 95983
10692 95983 -222079 -283204 145517 -243854 -84685 -161178 60913 -94179 -64532 9055 -177167
10680 -360752 -82861 -78195 -156681 120241 134158 329184 75090 -98065 38670 -224309 -78838
10668 192220 19173 -360104 62946 131317 -124 -38275 -137601 -45078 417720 -90254 -238888
10657 -238888 95562 269052 93541 -204057 -193622 130473 -239206 -201403 -432485 967 -8343
10645 75512 46123 -11024 125776 79981 -207902 -528385 -236509 228497 275724 -186999
10634 116084 249455 57785 -217362 -415682 32031 -130193 129758 -12032 -59700 -138942
10624 -138942 -104298 -72136 -215498 -203971 18010 -34118 -282952 58524 -114546 111089 -39964
10612 277778 -25077 -199882 -193962 -289648 -106244 -151695 123943 -179032 55623 -143017 171183
10600 -142563 -209962 -46753 -224492 -135474 -270312 86046 87962 128576 119305 -39524 -67965
10589 -67965 197480 -150473 164924 -121136 -101346 -90283 190026 13908 -190193 -87259
10578 52371 -218602 76 -134963 -121130 107548 144178 -296837 -1026 -3463 -123223 197536
10566 -107396 390277 -32624 -118810 -333295 -225984 -46879 297570 -216188 65359 38644
10556 38644 -54505 -5977 222934 -162310 261381 -71137 63350 10080 -294738 -1829 -76619
10545 -76619 208470 63879 32104 -248484 -139793 -330944 -164482 -91332 97051 -319975
10534 77685 -239748 146429 -142144 -140930 -155939 209958 -254521 -100611 -46250 -482911
10524 -482911 -108867 30068 186473 149855 -23317 203501 240234 -81202 64610 -195539 -68567
10512 176655 -428370 -272088 -260768 -227935 -64987 365598 -73807 -362294 101414 -217686
10501 208159 -537349 50358 -14817 -3091 -178396 -51981 32763 -106932 -169888 -132417 -2165
10489 133056 -430960 130995 -367015 -268017 93978 -103325 175015 151275 -294443 16017
10478 149136 61966 152410 530758 564755 506895 470452 176301 60659 272579 366547 197512
10467 197512 113370 -29405 265941 -63516 -111155 9564 28905 58898 -343270 121456 91974
10456 91974 114077 -119928 -121122 17512 -85746 -5779 129265 -235924 49006 -123576 -19709
10444 130638 -137864 172297 -149152 -217900 5642 -113953 -74330 184018 -22994 -237007
10434 -237007 -182893 -176700 26935 -306804 11688 -160526 -114143 283380 144655 -299510 -9625
10422 -25680 -156517 109972 15197 -103583 -95682 -109952 -218013 -360803 -177812 -127580 -180245
10411 -180245 -5216 -313960 169209 -327176 -23226 75585 -110205 -29633 -161518 19003 -228037
10399 -58869 -49418 107404 49095 -227691 -142309 225013 -178524 -147756 -117388 179842 125498
10388 125498 10244 -152568 -64296 201616 -19288 197503 1983 -13084 268273 -202506 -47914
10376 -101110 276754 211879 305876 82866 287642 230092 491461 89454 -66081 182821 590725
10365 590725 48462 350263 609329 402821 360482 292233 108721 147572 316749 97371
10354 25850 -40668 181535 -32992 194067 170912 195886 517225 532329 63433 479775 567657
10343 567657 616183 -84353 -185955 517679 247860 424322 174547 235952 142043 329095
10333 329095 211376 106438 29969 256033 37004 76695 171818 -17990 118227 271598
10323 271598 86112 31403 26454 111513 176038 52430 368213 108567 100348 140278 215496
10312 215496 179375 -89164 -10707 27412 49863 -75514 -258575 -42666 -90429 -242589 -36937
10300 -59220 58653 54682 29365 -11670 262666 8895 12485 150671 11212 -52211 -413917 29331
10287 122551 210989 -268647 8543 97772 169794 -4403 220515 -239201 -470246 -159046 -405546
10276 -405546 -295053 52266 -88106 65034 80779 -160861 -111851 8876 426668 41228 -46654
10264 -72274 -72272 73027 89797 187827 97902 -289848 187958 -145962 -114946 189731 139249 354891
10252 354891 405455 430471 74473 175402 240407 72176 112806 -136168 -44427 221897 67484
10240 29385 -279602 -189000 170290 15814 48087 -206526 82987 -5951 -85105 -17508 -131643
10229 -131643 17554 -127586 103121 278886 43696 -34606 -547801 -77862 117234 -147906
10218 -150133 -328915 -103273 -214740 -239815 -56118 -227273 176102 -53440 -52571 15344 -44872
10206 -157905 -168915 -259998 -276310 -226308 -152666 17362 65190 -254800 -14572 -160000 -176517
10195 -176517 -15295 -56360 31086 -120602 417299 40523 -172168 -141303 -225926 4063 -244721
10183 -87654 -14461 -193067 64715 -279381 -40211 169401 -111752 -126366 -238540 69245 -105103
10171 253818 13644 -115201 -38153 46637 147519 -18940 -177274 207623 178349 22547 16233
10160 16233 -80001 -13480 57408 -129647 59054 -268506 360622 61740 -193166 160208 358811
10149 358811 14620 16147 246471 145207 -166559 -193916 -309156 -307893 -76984 107473 66270
10138 66270 112670 55991 -35505 264473 -69570 -356977 141531 105015 -334407 -164113 -61042
10126 40552 120988 -43155 -496895 -42683 -134781 -168184 86365 -196695 -159579 -76766 -43156
10115 -43156 -250054 -90629 93599 -59377 -57698 -215285 -2011 88914 412232 -350529 10270
10103 -63738 189152 -196973 -194975 -139839 17959 35929 -360364 7606 -19256 -151779 -141805
10092 -141805 133944 -157897 208408 188848 -232751 -180913 -396938 145439 76152 17604
10081 -91087 -33793 79264 41919 -246777 -239379 101284 154942 -330315 -243481 157260 -317592
10069 -356598 116202 111581 -92448 -132739 -136806 -170084 -273151 -145532 69781 83975 65535
10058 65535 -210080 53512 -146947 151421 -64468 -141290 -190161 -49613 21207 -302585 -246509
10047 -246509 -54465 -131470 -44469 182028 64120 -151550 -286148 -10698 86528 -202620 -402952
10036 -402952 148300 -379724 -142109 -109438 -77305 19357 70263 -107207 -58462 -304605
10026 -304605 97441 93286 105269 -10365 -136042 -326329 -184310 -147011 -203386 -275832 -262732
10015 -262732 90584 -63693 226083 -146642 -43282 -197261 -115696 -114126 153437 -200140 62759
10003 67901 -234493 1962 135908 -210452 -75730 -277273 -67010 -237972 190360 -167708
9992 39140 -33730 -497930 -92310 -172553 -22609 -249318 73470 -266468 -179161 78580 110546
9981 110546 94726 88856 -207158 138812 -170929 -78478 4285 13471 -116148 142222 -251160
9969 -2734 -235636 -112167 -57701 -135083 -40835 -298737 77297 -217814 -36172 -15875 -246024
9958 -246024 289881 92568 -64918 -132333 -365037 -419984 -122616 -167264 96497 -12930 -190714
9947 -190714 -109104 -452551 21233 -48769 -193640 19940 245544 47011 55953 -159499 -37461
9935 -193339 -71303 8276 -174240 -228412 204556 -198633 -8076 -129654 -177045 362328 -36320
9923 136942 -64638 70232 -314328 165087 357058 -215248 51066 -56745 360019 -62861 113721
9911 -308175 -46032 50000 -16209 -250056 -86066 24674 58290 208147 30654 32519 -330621
9899 -206299 141768 -168596 98050 202490 -185986 -280819 -50708 -152793 -235393 -62598 -57762
9888 -57762 -36861 -77857 220073 -89902 30743 63772 -349032 -169204 -100642 15393 63073
9877 63073 78733 44960 -339672 -153592 -20699 24045 206463 -260281 -275697 -7136 37954
9865 -127682 -91196 -110027 -472356 -75208 72224 -145723 -4139 -230277 230487 -164861 -88311
9854 -88311 -69344 -50512 -144544 -63542 -100787 -67862 -219479 -96638 -134342 -65302 30484 3820
9841 -187975 -54180 98657 -163982 -119079 -28985 -222495 147424 137631 -100269 -127287 -10578
9829 157576 -42115 -56301 185925 -62308 -114103 254957 -185434 -91073 -94430 -70534 157139
9817 -144016 -173670 57522 118597 16758 -95734 -480799 99126 -96684 -20445 156120 77115
9805 -14033 -160066 26919 26111 -253883 -238725 -158717 144470 235937 -46078 854 307711 -318359
9792 -30386 36603 -71316 46303 200266 -223643 -453633 172386 138257 -251899 81751 -188087
9780 -6939 -198519 -329880 -77487 33235 -242461 -120485 -301073 137882 57329 -124588 -139694
9769 -139694 18552 -44729 -53271 -22433 -291628 -20119 -61383 -146432 74486 -31242 93518 35370
9756 -269341 -325016 -284186 -87514 -287084 -106232 90514 -353570 -316140 -54411 -79392 113203
9744 106900 206799 -63503 -139563 95688 -349327 -49578 -592472 -111736 -97183 -56318 -83167
9733 -83167 -170771 -168223 33417 59675 -151426 -103398 -96804 -172524 -69188 -52310 -345917 -41527
9720 -154385 108044 -98438 -100358 -168802 -104502 30469 318422 -104900 124825 -361225 -89984
9708 149733 -68484 2591 -177516 39021 -52105 -56297 -246678 125167 -132149 169998 -12483
9696 -31686 -223542 4041 -140256 -290239 244944 -283604 185420 52945 47563 -26 143512
9684 -85801 -289236 -343660 -173958 -407555 -290213 -381092 -112679 8960 -94428 82487 29141
9672 -83847 -101182 -101750 -148390 -44474 -187271 -205176 -93159 71079 27776 -156054 168604 -107646
9659 -122993 92629 222094 -62288 11545 -191159 -254118 -66206 -180776 -138381 -114925 -532589
9648 -532589 -319276 36546 181446 -167232 -140294 -247747 -77234 183178 84193 -130530
9637 9285 -105900 311974 -9225 -107368 -317661 -110312 -47799 223093 66326 170942 -139159
9625 -30547 314613 181434 -26841 -209592 -284001 -180869 -240699 -14749 -186003 -254612 -167365
9614 -167365 -328033 -192036 -122342 -184356 -144497 -252248 -65918 -106955 -58606 228328 -136006
9602 -206499 12281 -148357 -192514 -284372 -55692 143805 5937 -29827 -249046 27540 -142742
9590 59998 -152377 280059 -225280 133963 -227672 -108250 28619 -118801 -2479 152917
9579 90553 160127 -224746 -46445 -162176 -182370 -84886 74936 -72946 96789 1791 -131040
9567 284907 25183 6976 -172014 44379 63514 -36135 -344303 -181467 -196632 55557 58767
9556 58767 239452 -134194 18710 95898 7064 134454 -28526 201376 -259306 -132069 -147786
9545 -147786 266774 34236 -114501 -21178 -115761 99469 -121817 -262379 -120838 -235617
9535 -235617 -57852 -213115 -271108 -191877 314344 53696 -50524 148776 989 -27257 -71070
9524 -71070 -352755 -432988 -183514 -96774 -118745 -183093 -318459 35211 -59837 -170843 -25448
9512 93258 -169515 108572 64761 2785 -34025 65631 -53286 -164255 50664 89503 -17188
9500 -269933 -230512 85096 43453 243833 -31632 -145541 -109607 -50953 -63697 232000 -353745
9488 -140186 -79070 -41849 61741 68719 -222422 -89361 3591 127058 86870 -82105 45511 1943
9475 176391 -430041 -385031 274386 -76031 -370 -120353 -329248 -160995 37062 268246 54106
9463 -101164 -80914 129367 19550 -106891 -110036 274191 87378 108075 -153630 -250974 213233
9451 -41358 107541 -293366 65802 -165793 -217277 -95017 270776 -300839 -208441 -83816 -16547
9439 -140867 -384747 -207306 135725 -14387 -143591 -344731 -74037 -67623 -33348 -83220 -49732
9428 -49732 213876 -48490 39501 123277 -188577 48381 -143539 -69034 -313156 -99535 96918
9416 -166820 -144378 15167 -250144 253340 -248179 -186555 -247904 -233458 79297 -203894 -153692
9405 -153692 -25393 29627 -219410 -95386 -532712 113178 -303000 -87798 -169818 57486 -139397
9393 -109526 -329466 47058 -184639 -25869 112040 -50800 69688 5790 -56673 -84757 -339406
9382 -339406 310183 -82470 -28687 -282253 -125552 53236 -132925 26228 -289182 -161896
9372 -161896 43244 -104987 -88590 294955 7310 46431 -306692 -154272 62456 -174474 -450877
9361 -450877 -6798 49614 -183384 -92701 -381829 -205801 -233047 -120057 114472 53297 -227634
9349 53183 247883 10315 -197926 -308229 -333579 34173 -86399 149634 -65289 202098 20497
9337 -80874 -70897 33727 -270205 9685 69517 -8831 242339 214080 -32157 -112014 -323567 -261068
9325 -261068 196258 6397 180406 -18301 -150617 43327 -4860 63581 110836 -222630 -185448
9314 -185448 -248439 -181343 -447037 -176695 -76464 153061 -115077 -75804 4864 -352531 63825
9302 -4160 -267717 -40792 -109694 68547 21693 -3770 110870 -325875 -71050 -180134 362106
9290 217152 -11677 168205 -177865 54586 82793 -107799 -116177 34207 -398801 -50443 -200266
9279 -200266 -1395 86185 -116922 -228995 -153395 140145 24046 -297183 -100231 -192260 -50164
9267 2963 -307611 -280701 119587 -7138 -207533 -147694 213103 -167629 -174420 41619 -206469
9255 86857 -382196 67374 -246239 29987 -287055 -34466 191725 -238566 -158000 38221 49479
9244 49479 74024 -262509 -193001 316986 -85080 -119594 101945 71798 -8008 33388 -376113
9232 -94731 -149558 -100997 348299 -36071 -27579 -290713 -106287 -109107 272145 -194321 322760
9220 206918 -7292 351240 12045 5700 -73311 110160 -117944 100753 116037 -294589 110398
9208 -211623 -177596 -146011 288468 -71850 -183664 -154753 -162086 -252521 124808 -44114 -160084
9197 -160084 168464 -172720 -55986 -188412 -57856 -174149 109484 2063 -8483 -58305 -27116
9185 -239958 -125771 -150616 -304752 52615 -218319 12758 -284696 123685 42338 -127172
9174 -99505 -469027 -19024 2098 -125873 -128622 221898 77684 -27700 157041 146957 143547 43520
9161 -236630 -139694 -248951 -161471 -114836 -180294 213782 -190688 -214168 186121 -29652 -13251
9149 81676 -8898 -274343 -140347 -123524 -252186 -179898 61513 -166658 12132 -42434 -188806
9138 -188806 -71731 26500 -125270 -255564 -315455 264446 -221459 -191108 64937 -259608 19205
9126 -44181 137109 -143012 -56798 -316847 -92674 110427 -202727 112719 -54779 48487 23834
9114 87838 22320 -343271 68170 -23527 -26726 -107931 84660 102470 -295822 109777 217829
9103 217829 -88097 -41635 108374 96580 -259881 -63038 -91245 -200827 -159746 -222920 150885
9091 -152447 -408913 -388083 -35919 -19896 -272285 -87083 175352 -237065 -329133 95293 77791
9080 77791 140163 17873 -212747 96304 -315268 29777 -146320 214600 -10016 -224823 124156
9068 -128782 -38181 -29190 -269970 230465 -34600 132047 -32636 119067 -255119 2163 -111154
9056 151315 292266 -54344 115478 139105 227546 -105450 -6463 -28359 7554 176264 317097
9045 317097 156321 -458517 -117182 -268100 48385 104454 -283716 -112116 -345750 -42590
9034 -259168 -33969 159430 -282523 -169594 79435 -131022 -462546 -146586 -107421 -263431
9024 -263431 102202 -232816 -73945 -300026 -4404 -228128 32318 -43982 -49388 -239780 61070
9012 -79402 -279964 202979 -399719 -104971 45097 -133275 -83729 93547 218329 -275954
9001 66832 -83787 -220011 111917 -336186 199591 101355 -89698 77746 -240069 81757 19299
8989 -188100 -574595 27403 92135 -14567 -380609 -19448 -132242 -28056 174221 -139154 113596
8977 -89892 -59627 -92864 -126503 -196354 -34264 -224121 -269062 -40269 156038 -30838 -458010
8966 -458010 -81928 78737 -189767 -75873 -103903 -177629 -12525 171921 -149691 83747 -20749
8954 -28135 88958 123075 134252 -47914 27572 77168 -21928 -182553 229273 426691 321897
8943 321897 -55193 42571 100252 -176670 8117 367418 -72699 -102714 -131019 51316 201041
8932 201041 380426 220189 35635 -80038 84774 1355 231633 -165980 361113 454990 884672
8921 884672 1742571 6092664 11754587 7222994 3149939 1499190 951017 524380 616052
8912 616052 3074 8223 67301 -224846 232353 277800 251172 203620 319582 22254 122052
8901 122052 -102898 133984 -194232 -167274 -36046 -186061 -95064 -213090 -37107 -322249
8891 -322249 61801 -623216 -76866 -60490 -124408 216865 82637 167265 121515 -237791 6201
8879 -41368 212686 309067 -182662 91100 177222 -499994 18695 142402 -147149 16196 -46987
8867 -14517 -84830 20565 70869 -151751 -264425 101456 -86691 43770 -127707 -370819 56343
8855 -8219 122895 83313 63372 -203276 -45310 -196260 6950 20046 -172355 -167772 -121958 26493
8842 27297 123895 -207979 -45912 322394 -115508 -208619 -70598 -13205 41825 -179601 -404071
8831 -404071 2026 -155714 16002 -393107 -290047 -251704 100818 -86570 -49134 -297529 263551
8819 -84512 -13514 99318 51803 -107077 62466 203228 -307313 -291970 97036 -91230 353047
8807 -46818 54505 -228811 -116888 -211947 -23444 -176220 123705 162741 -321706 -164970 213238
8795 -207500 195850 -221293 -67417 190118 -109353 -151247 -324256 -12871 67094 -229266
8784 -183953 43925 31255 -159663 -4409 -120424 -70965 151440 -302155 -9463 -123749 278707
8772 -81265 -95642 -201098 153525 -75013 -189546 -395032 82008 2073 -124086 -276758 63548
8760 51811 -171229 -137377 25447 238381 -331353 -231953 -90706 108125 -116687 -210584 39785
8748 107241 128556 65391 131445 52688 -192467 39038 -331594 -121363 -160289 228460 -77784
8736 -80084 142920 -62615 -263626 -201112 -146929 -256989 -14806 142392 -212095 29822 -171499
8724 -124331 104437 -35640 -189215 -138634 142563 -134658 -160407 65572 -111825 -23423 -38625
8713 -38625 -2382 -80614 96448 -197679 -148834 -39165 -9871 -34346 30762 147837 -132513 -13182
8700 115694 -132247 -291792 17383 183594 293393 79483 45160 -286185 -176064 -246989
8690 -246989 -100199 34597 -74661 -223799 174564 50512 -33981 13161 -131051 55406 173942
8679 173942 111080 28717 136687 -94957 -139636 -178811 192305 -210804 -73220 -79502 -341074
8668 -341074 102525 -193459 -464996 -118068 -70900 -218606 -144469 -194233 -416216 351169
8657 -160006 -420284 -166038 -38279 108656 -156165 127156 -268982 150130 -36102 165823
8646 -58087 99441 109036 -246085 22990 71492 -294089 204292 96743 -135028 -147889 -68038
8634 -118898 -81660 111088 -61439 -148715 -76692 112891 -282517 -97766 -143243 -105086 35596
8622 4747 217501 81943 -117311 -196785 -232430 -227329 65427 213752 94474 -381296 152935
8610 -163034 -220912 140972 13509 75276 -79958 16050 -21379 -243965 -76739 224764 -95583
8598 -139577 -38580 -176026 -93800 -111926 -199698 -87444 41562 264453 72914 -127153 -3499
8586 -312458 13076 207738 -11883 -165022 -47901 -249351 -182001 52669 37982 117820 -246907
8574 211558 -203682 191603 122494 -92902 25773 57634 -560958 -415346 -38080 24648 115221
8563 115221 -151638 52962 112328 -204336 53768 -230730 92619 -355640 -230179 110443
8552 249825 -175432 -112818 87104 -134515 -80333 204634 -55013 -149649 -115495 -476135 -251572
8541 -251572 -129511 -9978 -70933 -66680 -203536 -50180 -214846 31388 -351613 176168 155689
8530 155689 50232 -14682 -132047 -286863 -26623 250759 -154161 -169307 39681 -262787 -287789
8519 -287789 -323675 -166515 305879 -12960 -178874 252074 -94491 -58999 -143645 -380570 -193710
8508 -193710 233919 110804 -184286 -19954 131592 -72127 27121 45677 -311028 -107038
8497 -75347 -134388 -209412 -118953 -264456 -397362 260977 -161615 -10880 149972 -118496 45318
8485 71085 43270 -209841 121204 735 5976 161108 -240070 77038 271593 32082 94628
8474 94628 -172960 -98072 -115409 155428 22497 -98502 87329 -51214 -196459 74322 132543
8463 132543 -295047 -442078 -197694 -201543 -129130 -155150 -146990 -179019 -426645 18396 231909
8452 231909 139714 -85295 39772 -287019 25885 56147 125500 -83605 -141263 169840 -85457
8440 97390 -264801 61790 -10579 -213669 28002 -246478 -124805 36201 -112956 -253248 -424
8428 81420 63649 -282517 44359 -158903 -155546 -87528 109802 -10620 -146083 63711 105144
8417 105144 140476 -163669 64424 -225339 -805 139706 119971 -138332 373564 -218079 87431
8405 -68214 -226022 244499 -40647 -204520 97449 -245070 -76690 -303291 -112559 129540
8394 -73100 -127164 -79340 -143051 191482 36409 143731 169801 -73977 140007 33877 46620
8383 46620 25384 113279 -8878 138993 259477 69355 24558 127286 -450968 22141 -250413
8371 39644 -158129 88956 -42609 110943 11331 120870 85702 26192 155979 18775 -161014
8359 -347557 -269760 -241485 26124 -311362 -95907 -18478 -202505 -375036 -117479 -16847 150570
8347 2573 -179324 70758 268599 142518 245228 -332859 69608 -253172 17168 -201806 -286883
8336 -286883 -233226 155169 -138335 120118 69920 -317811 20612 -154667 92151 185158 -45922
8324 69750 -32730 -214205 -134483 68015 -205216 173109 142946 -324141 -7774 -32350 -104300
8313 -104300 151236 -133972 -93003 22807 -154470 73223 -68102 -36515 98315 222643 -120822
8301 -96547 -290569 -150075 43740 -297105 -132526 104938 -347013 27272 30948 -111241 187965
8289 194688 -268226 301603 20727 -72560 -304136 39027 218297 270017 -179808 -11390 -201555
8278 -201555 163295 -246675 106784 200877 30015 236464 -39572 -134346 92836 -133176 168514
8266 -349775 -50581 -348579 102807 -187468 -92004 -58060 -339077 -63066 -158505 70578 -191819
8254 93972 174879 123674 -175795 -93214 -215840 170888 222404 67248 -149388 79906 -44759
8242 -180633 125822 -5112 -9455 -95555 204697 -60260 -103401 -75572 -100448 -44693 -280960
8231 -280960 220567 123224 48906 209591 -110444 -257004 183222 -178037 257765 79737
8220 11251 -19490 -120091 -288496 -196890 -161819 95646 473377 -112028 103136 12625 -145446
8208 268781 -37659 45702 -154463 -290295 -163572 -217685 -135177 89664 38398 -40760 -90103
8197 -90103 75897 -175617 150345 87332 -107818 -252141 124129 132716 -17291 -207748 41130
8185 -5332 40940 -451854 -214509 -188502 -258536 -24692 -403893 -23393 179408 -150963 -134720
8174 -134720 -19079 -80997 90732 -161724 74133 -31034 -49679 236076 -89116 154939 44996
8162 -341463 -42777 16116 -471528 71139 83224 -380061 -73298 -237736 -305099 -137869 1318
8150 -254243 -39113 -405649 155175 -148412 -280571 -68433 139870 -20321 -202242 -117464
8140 -117464 -84256 123399 97664 200757 51861 -29096 67035 -26090 -86733 -107292 113532
8128 -76971 252897 -84413 -50997 -112391 -83462 -103104 74462 -41295 -112571 175362 269871
8117 269871 -139227 88449 -78450 -21539 45880 -276313 -123612 -133373 109661 209425 105758
8106 105758 -179252 -95499 198089 -210233 -198077 -140043 2197 231437 89412 52660 135933
8095 135933 56849 -84962 135052 -1270 -210461 11157 -543557 -183013 -233321 22931 134654
8084 134654 44274 152932 -152559 -216119 -183647 -5843 -141229 144912 -17695 -121998 -134940
8073 -134940 65815 -52505 229545 -8494 9533 154435 -58791 -188222 18320 -94292 -125022
8062 -125022 165510 76015 -124502 -100753 -149163 -65215 153419 -176080 -121457 -300820 78808
8050 -160251 -45470 -161170 -185548 -437549 91835 -218693 24808 106299 71346 -514996 -92896
8038 -91207 321363 -308034 -316537 29669 -132844 157899 -246470 -36686 -163914 1441 -247416
8026 -69125 38340 -17526 39383 116432 -3478 -241665 -190656 53400 69499 -79699 -141685 -89767
8014 -89767 2161 -186318 71152 -17981 15612 -109841 -19543 -34471 190830 103646 -277547
8002 85276 -59834 -134059 -60967 -80049 -26985 -491588 -195509 -47117 161173 -83825 126076
7990 -17298 -262855 97451 -65157 -237107 312419 -13863 497408 296906 20470 -32529 -241539
7979 -241539 221898 -117532 -95635 -161155 23047 -199562 66547 -183909 -220631 15359 116333
7968 116333 -144411 19041 -315105 83148 287434 361510 -362675 71882 -2749 -271542 48731
7956 166633 125991 -87224 36960 209046 209218 -134303 59835 -167993 -6857 -31097 -409648
7945 -409648 -53748 -361105 -213686 -54305 -89109 52727 284407 96731 306425 -17119 -108071
7934 -108071 -100754 35175 173109 -157376 -119762 -71117 3025 -225214 26997 260316 70866
7922 125375 12342 203538 -12263 273988 -25377 -63030 -465866 51327 -25420 -38799 107638
7910 -206264 115806 -93085 13545 -409237 -68953 -114804 -248446 -101686 17310 -105944 -16124
7898 313418 -7810 -120568 68456 -217012 -130073 98532 -245978 -48444 -361229 -261595 -164701
7887 -164701 53800 -273207 -247861 72925 -183674 -184595 -119904 -222161 98216 184766 -238833
7875 -130250 -107785 -184483 -169466 151566 -125019 61676 72499 58602 21702 -95674 -177051
7864 -177051 -298869 92373 48536 18496 53033 65687 -58668 144678 -10092 -348857 -262982
7853 -262982 -40689 63836 -88598 -63982 -385105 -81374 -228029 253713 -66549 263185 -110296
7841 -490202 -222525 -129347 176173 160338 -278788 86959 187599 -5882 170042 -318990 21024
7829 263654 75034 62672 -19898 -52698 24844 -53521 321683 -11010 -108808 31158 170254
7818 170254 -133663 158728 -123070 169971 -482933 -9580 -89951 55559 -217382 -204839 -201603
7807 -201603 -182358 -73759 11068 129194 -82226 258103 -219633 466859 6873 -29651 -123921
7796 -123921 -30905 159734 -268807 201590 -156980 102833 -228311 214270 -209525 -118293
7786 -118293 -217702 354738 -301136 -327759 -360344 57811 -150636 -66849 50281 -56728 -220952
7775 -220952 -173043 -142320 -12908 244204 -200545 109652 -13982 -216092 -5926 -110691 29994
7763 -217612 -198869 -282609 12795 -59888 -158051 -176737 -43428 -486784 203493 130840 -63450
7751 85607 -124416 72283 -196137 -65348 -148317 15989 -55439 -268441 -217978 -89130 -31871
7739 -68007 -129018 162130 -179778 -216021 -99021 118638 3358 -142241 71907 132575 -148854
7727 62331 -8131 -185862 -399037 195150 200271 232682 61202 164442 -123519 -411138 -77565
7715 27494 -146117 71790 89462 -58181 -89681 -353632 210609 18777 36168 -171117 -77466
7703 175578 203366 -109738 52790 2713 30058 -193505 38032 101573 21930 -38613 99155
7691 22218 20186 -12246 313845 175809 51213 -59325 16446 140504 25172 21210 -40303 -100489
7679 -100489 -312177 166347 461900 220746 -135990 -78383 22984 11346 232017 -34841
7668 -84218 322779 247020 143909 -85367 27973 -60215 140376 -177031 -16521 -92036 -312912
7657 -312912 68085 -258683 -1319 57420 57635 30772 -306627 -15549 214941 -61369 3267 -139035
7644 68658 -145771 -350313 -137454 -100874 -106932 -253920 -79645 -9707 116469 -266529 -68004
7632 -40362 -154640 145568 -200645 84842 -110793 -73673 149240 100715 223521 -262243
7621 -286129 214582 50550 -69264 5549 -149551 25081 -268171 -10663 -42901 276639 -202483
7609 -157303 188390 -80245 -166339 76422 -55134 -148492 153285 87248 -338972 -39414 -105959
7598 -105959 -64100 -252337 38613 16104 219025 -394171 -176237 74184 -309971 -173486
7588 -173486 -242388 176487 -66890 208999 -79464 92830 344114 -263421 195168 -179290
7577 -71111 -103589 -168090 -146374 -16042 71456 -131309 171501 133010 -287725 44101 233510
7566 233510 85778 -44703 32633 -83402 33323 -321844 -249237 115177 -321906 253799 140723
7555 140723 -19430 -116493 -77920 -119484 127629 34900 -56546 28691 17523 90586 83724 -56023
7542 44278 -201722 121991 -22084 -689 120174 46062 141029 -24737 50069 118574 82478 58882
7530 58882 152470 -145860 -9617 -71829 -29300 -208044 -124107 134831 -59334 -190569 -270997
7519 -270997 -5941 -208491 -53191 24299 84648 -428093 -44596 -308257 146638 -58177 5191
7507 -51964 -103112 -17007 -232374 -43308 -360321 -86080 -50562 -247216 -42705 -90430 -138034
7496 -138034 61385 192529 199004 -65762 74981 195918 -338072 -16209 61080 -123495 -145019
7485 -145019 -336049 -165002 8145 -14108 -61435 -52240 407168 -14435 -137513 -54609 339700
7473 35590 -148442 230331 62273 -76431 -215748 100882 -20542 32501 -75093 -44625 -67820
7462 -67820 50580 169858 97363 -43454 -99008 -387789 109955 451678 -230564 263724 -8184
7450 -342458 -160451 -31739 42789 112241 37388 21699 -108479 134701 280363 -32063 197006
7438 -82105 106855 -73973 -109538 -140117 174054 242062 57962 -299429 -15622 -158373 -93742
7427 -93742 -159706 110409 135252 44879 -79837 -140991 -23037 -94025 -147844 -95814 -241104
7416 -241104 -163755 -171219 256364 -151359 -65726 -53661 -97756 -119793 -82902 -6686 147582
7404 -117835 -223776 -115356 219083 -93943 40967 183224 -122237 -158463 83314 -867 -270930
7393 -270930 173657 -13433 64559 -59506 72283 -105186 -102230 -74879 -30810 -26815 145099
7381 -194316 -217981 9052 12760 -15015 155563 -94949 -221851 -237640 43701 -155929 354621
7369 357861 -327217 -212109 136748 -145381 27359 -73721 -86992 55627 51816 154674 185089
7358 185089 300636 -138109 16230 -260860 -2162 79001 52593 -38958 5268 100335 -161878
7346 92595 -119732 -164408 106402 -46604 -166091 -67008 -13221 174168 251321 20653 -243334
7334 23020 -163507 -318860 77001 -135720 -219713 98717 -236504 -42607 82439 -116614 204381
7322 -235829 -20252 101808 -139901 -100135 -139836 -162589 113933 -308882 -159670 200411
7311 -27330 107660 5739 -230663 -12606 -74490 54877 148077 -131980 87943 149061 -315162
7299 108594 -563180 25898 -197802 -171519 -228370 138192 289776 91421 -73947 -157599 163797
7287 98994 79335 78940 -47447 -46340 87043 -97441 22773 249233 151201 -277764 71817 47670
7275 47670 19059 100230 -347439 -90182 -98333 -9296 206797 228409 94598 -302170 -59993 -145184
7263 -145184 173093 -11682 180833 -370588 -245395 96330 70323 277745 76578 -402822
7252 -38643 129825 168715 232609 138867 107097 -89924 -152211 -176512 -86661 30467 252902
7241 252902 63891 -190787 -44639 224284 384207 -92240 -41810 -57179 -102270 120573 53280
7229 75210 -54650 168907 72081 78353 20061 -182632 -86388 -277528 -7443 129024 -225790
7217 67340 -194972 -84591 -100482 151741 86788 219955 -357903 -171731 -153641 -159087 -171385
7206 -171385 -145354 -83943 -72118 -205431 -196463 -264719 -39791 -117302 -54528 -72656 79109 -312722
7193 56803 -189856 -442870 2024 -68026 -129251 -71636 234085 201687 -6204 46149 -95633 -194465
7181 -194465 -25275 70656 -34308 -110509 245876 39497 -48942 -176450 106908 -101775 373222
7169 -131326 -128021 147592 -66817 232533 286849 -35556 160208 -329600 -100837 192268 -45270
7157 -198852 -157424 280645 -310210 165746 -56144 -219318 -124440 -60521 -46897 299553 48045
7145 -144398 218448 -92150 -216869 -217143 -201451 -68803 -259085 633690 57934 313120 -44318
7133 -107340 -76090 217282 -22447 -289264 142348 31410 93477 310903 -167653 -85347 275612
7121 -6753 183808 428134 -16804 -39241 -100024 -27905 -195633 199119 91668 -343056 -126055
7109 19126 237493 -334300 43267 -54935 -9187 -115629 81260 -102310 -307295 -28169 -239658
7098 -239658 96872 30926 -107042 -311049 -81394 -39055 -224824 89198 -408530 -87524 -198076
7087 -198076 -163206 2933 -318832 178748 -23590 -73036 112881 254415 -151850 78491 -15326
7075 -182378 -191114 -58034 -444391 117057 -100828 207187 121798 100478 -226577 -102348 218311
7063 -6077 -411175 197969 54842 -156709 223242 -44776 271925 -264562 225666 -346314
7052 80144 -18984 -84436 -350145 -39854 205721 -414655 30715 118648 31281 142588 63054
7040 246130 93179 -103965 108061 -269864 266043 96275 159140 -291431 -160220 -65559
7029 468773 129705 91141 -208633 -23632 159358 16582 186522 -196904 147296 -42976
7018 -21366 -63920 356421 -273809 187414 55681 -138986 -180671 17486 -84171 -34165 -290290
7007 -290290 -124672 401206 -75049 250987 -138265 -274370 -66437 -27594 -174484 45729
6996 -145276 -115566 117754 121305 -27525 -40521 144241 -4375 100147 421150 27901 -190151
6984 122881 144044 -93487 -11109 -8299 227144 287321 -74599 -417899 62162 277173 -51679
6972 302075 -266260 -31159 -98636 -991 -214329 215775 -119802 -124536 -1971 -49467 107751
6960 10515 31613 229762 91787 -114778 200686 -168951 -68728 6483 -86602 -176870 -84293
6948 183374 67359 453624 -229828 58692 -386327 132807 -59579 16561 -272578 -80468 -97624
6937 -97624 407737 -119708 39699 -35582 68749 146515 65267 281238 224769 -190685 30246
6925 -143476 92705 -8650 300410 -43663 -12784 358949 -140181 22707 -419086 -207006 -105011
6914 -105011 -239311 -171604 162609 24254 30539 -115630 -96193 344054 76217 -62286 -52572
6903 -52572 -11289 -142458 -214903 60922 -401792 66893 130553 253250 -241422 -279119 -25899
6891 162285 -99022 -27966 109556 44459 80496 -90161 -168739 -107146 -211146 400738 357636
6880 357636 203977 -459026 3473 -6344 -73 -196369 -105046 -71592 -249529 -59733 -183164 80539
6867 14844 -118585 -215359 -201353 156748 267582 -164786 -123114 256694 137170 163707 278399
6856 278399 140855 25580 -170992 -127026 391248 -48307 156064 -390089 -190470 473857
6845 -249820 170900 -107455 118891 -201149 154412 248398 -161756 -254131 14056 -4793 -41343
6834 -41343 180388 52514 -89984 82309 62460 -219709 59475 -225478 -185968 -134503 -65881
6822 -160244 48822 -341869 33745 -279647 -302484 -49770 -313542 59973 117752 -161232 -84650
6811 -84650 -238733 -75558 129060 120743 -32442 175590 301433 -264015 159048 -144118 -468921
6800 -468921 396763 -331062 56286 -102026 236532 151530 -109352 109019 -190769 185073
6789 -171990 -150929 149767 102112 -164314 19598 123101 17130 -86254 -139184 296879 -193329
6777 -100369 -91023 26102 -189381 59637 116535 -6185 -25247 -141203 -334635 -53598 91249
6765 -274014 193124 16001 -185962 -31022 175210 -102198 -368449 -112121 1443 -38774 79122
6753 -177479 -141145 618125 39998 -36404 -170561 8778 -227478 192388 267279 -19796 -141137
6742 -141137 80349 80371 -175851 90128 13178 125698 54744 323556 46942 -301312 -254218
6731 -254218 -139382 30933 33789 72380 360859 226882 24687 110818 60891 175064 -148901
6719 -12590 3890 413872 100365 -254840 20942 58872 -48545 16388 45552 -192382 -261687
6708 -261687 -80550 -151736 -189095 -81916 3720 86646 -110069 409587 -113942 -179145 -418988
6697 -418988 57274 -52926 248652 -116744 -277309 -50526 -13797 148013 7471 -114684 -174742
6686 -174742 -184896 -141474 -156424 187055 -137619 -153698 86066 -132101 -208234 -199218 251059
6674 -157778 29664 18644 -222456 -333132 44521 -113799 8497 -190922 -189580 60448 61766
6663 61766 -109704 54554 -107604 346317 89023 -6941 -373962 -171050 44878 -67215 279686
6651 -30624 23860 225965 -173828 487 -414885 -340986 -165405 107670 -34735 37970 -120858
6639 83650 -91879 158735 -89293 -121504 3596 -25693 73815 -303655 180930 -183884 -88383
6627 263557 -305453 307281 -57574 -23156 51224 -56986 102854 147872 -405891 59434 -175950
6615 -355985 -223705 -35521 -145911 -45876 -95492 -67055 -84328 56751 115286 -148386 156105
6603 122732 17353 328609 -107145 -11910 -360328 9079 360950 -164158 -133268 -25558 -69475
6592 -69475 189607 398251 -307441 -409922 -348437 -35084 53658 -99699 -113993 -93503 -23131
6580 116557 122884 -48118 20464 -57367 -16829 -438085 207912 -12260 -188432 -179071 84117
6568 -175170 -54888 -62866 -42328 50770 -35904 -240855 347506 -213629 -90516 -334775 18213
6556 171936 2188 92810 -180290 -102780 130191 -95883 120137 -275010 -112375 -179801 -154720
6545 -154720 -103282 -160051 -197831 135339 -232303 -125710 -123469 67031 -26351 -424775 210095
6533 -34754 42040 297186 -76240 117160 163236 289752 -141332 -28091 212697 -170016 182029
6521 84584 31903 -175529 -27897 -409512 68409 75061 153453 -62131 119416 -25618 -107650
6510 -107650 406573 -268425 -74412 60406 182267 113647 45989 -112843 409980 -164070
6499 -25466 -22203 119686 50074 47743 -28120 -104390 166226 -9630 2170 -144112 -55253 45473
6486 192769 -72128 -219382 109043 208469 -106198 -47150 126196 17194 -179079 156101
6475 -77064 -99614 -52358 -171319 51792 234266 -7688 -110295 -28762 -270172 -39463 -92374
6464 -92374 126681 -45753 -56752 -151186 -197758 222001 81479 -9682 -48454 124913 -12147
6452 34902 95708 174632 89787 372533 -3356 184259 -5634 75081 -33821 39146 369505 145046
6439 -284676 -361292 61643 44475 -27791 -42899 -10421 59693 247592 66779 -426790 111881
6427 -21748 179307 -251902 -151186 -73511 26514 154994 69280 81902 156940 -108649 -72322
6416 -72322 211394 -205658 -338925 -75734 -289374 -105410 -31384 107397 -135865 -109981
6406 -109981 325663 30493 -204627 229062 -275381 193262 -268212 -169273 -2240 140671
6395 -185639 43699 -118555 243352 -288615 369388 136978 63395 -132501 -362026 -323703
6385 -323703 -234765 170003 -33093 410536 -86929 191442 -238875 51283 -56012 91639 -124344
6373 304314 -64812 19748 -277589 15043 17767 -383308 -50605 -196860 -39302 -1805 77629
6361 -119927 -42590 -403235 294966 -366744 -21668 28735 67621 35628 235804 -8543 -128181
6350 -128181 -303646 -273653 -96946 138293 -207857 -104701 -69738 166026 230 311836 121963
6338 -80951 -221806 -106251 144992 109247 -348805 -184078 -145526 -290828 81045 -131738
6327 -27834 -155226 203818 -122321 -42555 -378305 250756 48430 -145144 277515 -187905
6316 37787 -43563 -21525 147217 134107 -76836 63361 -248756 -80278 -31606 -652363 178100
6304 -109004 10424 -116079 -62942 -410179 40313 -307186 126936 49942 100476 322981 56237
6292 95411 -161530 -77919 -122150 -173745 -195525 -175765 -222029 377357 51375 132816 106892
6281 106892 -95389 -185829 407476 3997 150991 234907 121536 -56134 54710 190416 -1190
6269 444431 35794 -169877 -345365 -191683 -238550 -57122 144028 79230 80919 285913 -119046
6257 71801 39229 293433 -35677 -132608 -198640 133657 -57821 95532 -149548 302426 240161
6246 240161 251762 -193996 -63406 -68339 204501 -76513 492552 32140 -10785 119225 -9782
6234 -221930 37333 324372 -318054 -269016 314983 276851 252189 6577 14215 -89070 -39844
6222 -242855 225899 -122087 -121542 416274 -26945 -155176 149639 -52192 158098 -201552 -92677
6210 164939 -201605 96680 -212201 167167 -220377 -466867 130821 141008 -91418 -235530
6200 -235530 105584 -221634 -96139 -89294 283045 37908 83828 -45737 239988 231258 1680
6188 -204428 -201927 -4755 -47643 -86229 105170 203677 -216147 144340 180715 -88418 59182
6176 108711 -66861 355780 151752 -333588 -68035 -42996 192215 -32240 -168053 -296156
6166 -296156 -64355 201706 -101866 153048 -25458 128746 -141263 359708 -286031 -118512
6155 41608 -180861 168812 -4251 181096 -31074 216648 5402 168302 -202194 -61762 -363591
6144 -363591 -94607 -156129 116131 26433 -14030 131350 21757 -40179 212315 28318 32119
6133 32119 -218318 186507 305142 117812 -264863 70163 -33460 305703 204561 101563
6122 -85560 -87121 123910 47999 147236 -9219 -168000 -105190 -38641 -114370 202131 -37901 50453
6109 84847 -356101 123174 94964 270399 -68451 -67158 -174982 -197467 -30484 58078 101905
6098 101905 -51503 5539 -8953 52588 -168484 -7450 -8286 110595 719 -265546 270623 426448
6086 426448 -114037 -75272 163485 -199532 106782 -64972 296260 226364 -70508 -45012 -246140
6075 -246140 -328028 290520 16698 240650 -157891 14951 13099 -45919 200935 4124 10776
6064 10776 -1610 -20596 -145989 220491 52861 -238522 -17053 -193801 59815 -133944 301792
6052 255891 148156 45667 -14145 165924 -55671 -37772 -40219 53000 -66630 -268636 -18981
6040 296766 -171061 -82235 885 221038 -127138 -26650 -251021 37305 93789 -293249 -4211
6028 94212 -253368 -293930 -100477 271967 -237700 -17927 -91897 30074 -220122 74445 188629
6017 188629 103480 -142057 -101981 -146183 174713 155374 -331638 110290 -43952 -5692 -234983
6006 -234983 121132 -114428 -38443 -77807 -135936 -191869 -38721 -30686 148674 31490 169347
5995 169347 -309824 -227751 249045 -56551 -18954 -83679 97009 -175736 331065 140862 3859
5983 -139575 -63106 -63915 -231283 229211 -116470 20792 -424884 -339857 76528 100921 -52461
5971 68450 28097 32256 46329 -261856 -472556 58088 -1831 162756 169036 -98356 -136676 262100
5958 79988 101967 254228 -26015 -31711 -7507 84601 143257 17144 -190042 81715 149893 54892
5945 -89204 52551 -15540 -78435 -10181 103422 -217510 109686 -319708 95450 254875 -114167
5933 290215 -12255 -380912 91638 11978 388103 78375 40068 153468 -211454 160177 14881
5921 -193149 181269 -44522 95424 27132 -148215 -181015 -37158 -75735 -508585 398333 312141
5910 312141 -173817 30487 -127359 -24543 100470 190154 72677 50264 -9098 -171065 22173
5898 145053 -239065 85485 -215200 -6024 63713 93171 -116050 -37000 -147707 -82725 -82214
5887 -82214 -164045 -62784 117390 189485 37725 -22574 10528 -19009 -206087 -207721 -63616 -102023
5875 -102023 273545 -380696 33111 -108512 155502 28197 -329175 -136906 -42173 -206746
5865 -206746 4723 -128457 243070 663 103607 68919 162620 -163073 -29560 -93490 -18053
5853 -113846 -296236 120187 -193354 -36036 -53704 77583 259405 -101562 -73971 -102019 -156354
5842 -156354 14736 -3940 285086 43431 49282 -27421 315023 -21768 -23665 119918 -151109
5830 -82809 -93866 -21944 -67655 348710 -132889 49798 2983 -43966 -169242 -8482 62728 -322017
5817 -125321 -16591 187992 230530 127201 -167820 -233492 160749 187503 70690 1471 28088
5806 28088 -214845 204440 -192052 161673 196734 39314 123855 -106696 -42208 261796 80993
5794 -48433 -80360 -245221 44953 132146 -363005 65483 10900 17857 144316 -110722 -12704
5782 7807 -213800 -44780 -4370 -24844 -14008 -168820 282259 -187311 70494 -87150 -104222
5771 -104222 91881 -68853 -30355 123937 -240134 -160438 54169 69050 -97255 -100977 -232863
5760 -232863 130849 -147736 128339 125369 140071 -109530 364881 12007 22199 465447 -273436
5748 -32191 35153 140764 -163122 138332 37075 -61549 105258 312429 -78391 -45652 -83482
5737 -83482 -104333 3636 209853 -22404 131569 -2624 -185905 299889 -23082 184579 -436813
5725 -25740 21105 234439 -22121 135897 -194638 -23255 190731 -112942 -191093 -107586 15230
5713 150014 135679 -65559 404759 103579 8295 68552 124682 263180 -152234 -75770 -170998
5702 -170998 -168096 222880 59812 -402 -203676 440300 30307 -89650 -107958 198159 96358
5690 27116 -149322 -144839 123867 -149365 103975 -67090 -99303 65741 5078 -166656 109157
5678 -385920 -105932 499755 170841 73172 49301 12653 106523 11929 17052 31199 -128593
5666 -216515 176034 120200 79935 170724 -185953 -255035 -228161 -91651 136420 87978 57201
5655 57201 -332382 129325 -58923 -300780 -68776 120140 -502484 -30769 -284653 141454
5644 13744 -45058 -106219 -289395 134426 39713 -98327 -180872 212129 -115995 337644 -26350
5632 -46402 151938 -13075 -218996 37281 -149571 167973 -52365 92061 -97919 130586 83830
5621 83830 32183 27145 79527 -527563 -45830 135899 -99134 -268932 -200085 -169907 103018
5609 410482 22070 -83135 95469 -150297 -65947 355694 -395000 209072 -149992 -164875 -172067
5598 -172067 -103303 -79747 6654 -36129 46589 318833 257054 -94049 -327708 173211 53927
5586 204381 -8719 108222 -138740 146339 504050 -106021 86546 134083 -233705 45440 -104539
5574 191139 71118 -165282 -69102 -188488 163814 127415 -42985 20771 65577 263510 -125333
5562 -262798 25401 -56350 -183521 87558 36221 -194151 358986 28586 -388013 59868 -40323
5550 -125296 13296 238803 -270882 396604 72237 121110 -142856 11191 -61808 84003 2814
5538 -43471 37124 -80603 -66879 -32628 247097 128275 358378 -93568 188845 40190 -100150
5526 -156347 -177778 29845 61180 9700 26873 -16082 -61229 -181410 -10876 171773 -22630
5514 151783 83140 -164746 -156238 147329 -36078 -26345 182563 -354751 71913 140426 -130253
5502 -38198 -155347 276463 252022 -322645 -74926 1958 228550 -213276 -44106 -120641 -87310
5491 -87310 444362 140967 104195 147414 88338 -85517 -2112 53759 156999 148259 -95346 -61658
5479 -61658 110949 -99998 -266893 419167 28242 -108085 170967 225869 17710 -326682 -320078
5468 -320078 43551 76897 253130 202993 150562 37554 125871 -206347 158337 75630 -167827
5456 121316 -338203 -42292 -32729 25748 17880 175619 -110084 35446 130587 113754 -229035
5444 187569 110531 -68947 86508 -217548 108606 -133431 -20390 -227334 99683 -123239 -56579
5432 -300653 -131329 -113176 -121218 -176053 -154580 -69999 97332 87894 14074 -6133 240866 218
5419 224111 -110905 260602 196237 96576 289034 1104 -365033 3879 -14354 -10444 -24310
5408 -24310 -231612 -91674 -27093 -120287 233616 40751 30597 65756 135138 92390 -100881
5396 -292504 169465 62712 60133 -50700 -40832 89370 31199 135736 47266 86042 75743 -101175
5383 6438 -9592 112481 119369 181557 190171 59957 164964 272465 -16342 365725 170798 -111894
5370 47541 -7165 34720 741716 109039 10931 -174220 74628 -48186 159898 -226565 28980
5358 76616 -279656 323468 -33954 173417 -139312 132405 282544 -131745 -136585 -181963 131168
5346 45849 140103 -347848 84545 -81615 -86297 -325917 185320 62034 -71566 -131936 -143107
5335 -143107 -93198 -18349 99696 -236533 -291189 106773 96817 273868 -295901 -47497 308745
5323 185233 112612 192829 -66234 32706 22346 192436 -36748 -164926 -120426 -155331 171465
5311 210994 -17310 -110116 -13271 -26608 49203 -964 -32921 -48226 -34160 91857 134845 -147798
5298 -35656 -31504 -8634 231667 128359 -204103 22088 42801 187964 182503 -33133 -78607 -106738
5286 -106738 -56953 -177910 -2044 -545660 -69673 218510 -34888 186037 134608 134194 3284 21728
5274 21728 65052 169120 328380 -9453 63517 -277579 78793 82106 -7612 83018 -160101 35450
5261 -68805 160913 -326979 80280 339551 274724 95171 21303 33545 158125 62036 81430
5250 81430 -45233 -152250 -209811 -220482 1798 182205 14610 -134650 474351 -40342 -40976 307154
5237 390088 -134195 -291584 -97249 261519 231740 -70457 137009 -97403 -152123 44905 -320094
5225 -64708 38619 246045 58663 189984 93121 21058 68102 234644 199158 -94762 -196687
5214 -196687 -60003 271578 44696 184608 173148 140273 -44196 -90544 -66778 441496 -12898
5202 124339 -81536 99395 -54652 181821 -95697 -257022 -210430 -393353 -75527 229295 -104542
5190 2211 -170295 -184781 47040 -25462 -22140 -218448 -142014 -104291 410361 -47426 -18678 -55361
5178 -55361 -38407 48992 91092 -379055 251401 54755 334813 -185144 139637 -178789 -24059
5166 -156734 -312031 -257660 -47044 39318 -43759 -55884 -171742 192567 171505 43524 -286226
5154 -39965 -97609 -43549 -54461 -316310 232548 294174 24952 -199207 31240 -94695 99901
5142 -54289 193159 -44978 43179 -114897 142163 -122551 141422 -270433 -152665 -31307
5131 -67246 144085 206103 123075 264106 39802 109106 -134121 93514 -57537 19696 12444
5120 12444 -205674 67678 -152477 -84864 97036 -44734 57654 -45883 158301 -225646 158872
5108 202566 -74650 2821 177553 100399 156633 285830 15904 226337 -225303 -48648 365393
5096 204970 91973 -145083 -76411 54115 -363086 232414 89561 273196 -87600 35588 65986
5085 65986 115397 -17556 8724 120229 -41417 155213 -24761 142670 237823 18339 -178397
5073 -15112 -139704 60 28440 23534 26832 1107 236600 228982 -51956 130431 -296974 50987
5060 86576 122694 71518 538648 -2442 -14150 -204595 -364746 -58795 -138050 -45011 -178289
5049 -178289 127259 -47786 -125401 -267467 315484 19839 -51514 -210135 -32108 104389 -12568
5037 167555 9468 -309664 -277381 -166365 -5883 -2381 -191982 -9842 162807 -419563 -121226
5025 -35480 -32240 44036 -127089 419962 -150252 -140534 -47297 23374 230615 330621 366832
5014 366832 -284240 -97811 -175352 -64433 28558 104934 -428283 -352138 179353 204814 315214
5003 315214 175712 20446 -183385 89179 -115552 -71826 355949 35260 21651 -258578 -179381
4992 -179381 160417 -186994 -94005 109660 -261799 100891 93181 -34297 -172115 109046
4981 60157 -168376 -400422 -320678 251824 -106577 -140269 11111 251379 186467 -90088 351334
4969 -90623 95970 2540 333894 99777 31704 344695 123657 339061 202881 86929 264924
4958 264924 22776 149924 108379 -125304 285982 -148225 46101 281226 12097 -92114 -259840
4947 -259840 -161081 -36691 247932 165123 -60807 92926 -157332 190541 144986 -16563 221513
4935 35836 37738 -89103 -122696 -94256 -143599 87707 183264 25217 -89303 -186602 294871 -5136
4922 -252239 24442 -293992 -24179 -385080 -38890 -24801 66925 -113267 -2226 -244350 202118
4910 101730 273194 112553 202407 2504 166468 -121882 4869 -113991 190481 -76748 145929
4898 -201142 -170439 342220 439788 -249675 414322 24643 226118 -83813 -187807 158348
4887 47387 -268291 155147 -143714 34314 147575 -39854 176376 -64331 26120 -653 205653
4875 -119058 -66194 -62324 -122553 62858 -73755 -75165 261478 -60812 -78421 -110516 146734 128677
4863 128677 -69137 363948 -219820 -85430 49690 -218475 42347 75040 -57507 126830 109380
4852 109380 37623 -428481 -59237 64110 289058 -162399 -61113 126660 10656 -127420 -33087
4840 219098 -160208 167358 59158 186546 -77137 -315767 194838 73536 -142479 93528
4829 -164259 234718 -235005 -102469 10511 -155684 5008 -196134 -171448 128186 -27831 237121
4817 157828 -32498 -412779 -331621 202572 -252333 -83453 -246224 -162722 -152847 19824 164903
4806 164903 154417 -76579 -27552 -258137 -219067 -41863 44757 -165406 12 220820 -260615
4794 -146145 -361737 37454 164279 -384087 119313 16728 273092 -191057 -218767 102871
4783 -50533 -130693 197484 -20400 46468 78058 -44411 -50174 -45631 95836 3203 -47199 -45780
4771 -45780 -51040 250182 -87404 169638 -335 78516 116123 -174773 30354 -103519 132849
4759 21633 -53169 84801 -26127 65155 -34102 248807 195304 -342517 -96193 -4689 -26767 60588
4746 -1693 -79904 -189862 130970 -29006 108949 -56933 -167264 96881 93685 -128983 174353
4734 -191427 124699 -81866 160822 -104129 42856 166273 -273856 134330 81564 30947
4723 94870 -137904 -270699 14744 -80854 4025 109112 -210698 -103459 -192867 17146 71251
4712 71251 25651 22962 166918 131810 142875 6873 225849 233096 37346 168294 38866 -148675
4699 123317 16969 187899 -145710 -164072 485480 -9181 132525 169157 272246 243174 335844
4688 335844 256722 -275604 60324 69643 349642 -343991 -84183 16878 396843 -86840 8490
4676 78058 292150 254168 184167 242761 302096 4683 -172665 -100497 -85954 -88326 32423 -271169
4663 85148 -195106 -63106 99754 -123490 230916 -27180 -16812 -52223 285247 47591 128862
4652 128862 -119046 -138003 -14596 69377 -20319 155699 125037 245930 194253 -165632 -297065
4641 -297065 -36156 -143138 -89563 82377 -172442 99850 549000 -23283 -67699 102780 42777
4629 120933 28656 62727 -100944 52436 137893 -171363 -477141 110786 29998 -24099 23629
4617 336063 829 -101870 -318038 119356 201819 -54343 52407 -76328 -150755 211956 -199696
4605 178482 -88442 -52091 177627 46200 332522 -58954 51825 -26829 146110 -230074 163919
4593 12676 -138219 -68764 -168615 -136356 -253276 -70284 -38871 9592 -227869 9850 64160 188861
4581 188861 -168289 91617 -244841 -231078 23749 129585 66303 -38276 228948 -8326 341014
4569 -5506 -23458 -186402 101734 241019 -563 192353 -183238 3821 249843 -124204 -255896
4558 -255896 26122 357439 -302568 -182635 -3215 210362 25860 3275 -117330 -101668 -234965
4547 -234965 -19099 185921 348134 144157 255222 -97938 -132920 -212624 -21592 -190545 -233476
4536 -233476 170705 160379 -24777 -70709 -79420 76257 56249 -115330 -71899 -44677 -112356
4525 -112356 -132701 -168318 15200 33186 -36698 -260408 -26140 115831 5875 -37821 85208
4513 -112148 18100 178626 -15917 399209 -179399 -245944 42783 -213672 317510 -54908 269487
$$ [...]
##END NTUPLES=NMR SPECTRUM
##END=
