
##TITLE=AC1273_CCJAH12091_6652516_R2AUVQvvqU
##JCAMPDX= 6.0         $$ Bruker NMR JCAMP-DX V2.0
##DATA TYPE= NMR SPECTRUM
##DATA CLASS= NTUPLES
##ORIGIN= BRUKER
##OWNER= Administrator
$$ 1.72 TOPSPIN		Version 2.1
$$ 2012-08-10 15:58:52.812 -0500  Administrator@TOPSPIN
$$ Compression mode = diff/dup
##.OBSERVE FREQUENCY= 400.02188249412
##.OBSERVE NUCLEUS= ^1H
##.ACQUISITION MODE= SIMULTANEOUS (DQD)
##.ACQUISITION SCHEME= undefined
##.AVERAGES= 64
##.DIGITISER RES= 22
##SPECTROMETER/DATA SYSTEM= spect
##.PULSE SEQUENCE= noesygpps1d.comp
##.SOLVENT NAME= COFFEE_meoh
##.SHIFT REFERENCE= INTERNAL, COFFEE_meoh, 1, 14.96237
##AUDIT TRAIL= $$ (NUMBER, WHEN, WHO, WHERE, PROCESS, VERSION, WHAT)
$$ ##TITLE= Audit trail, TOPSPIN		Version 2.1
$$ ##JCAMPDX= 5.01
$$ ##ORIGIN= Bruker BioSpin GmbH
$$ ##OWNER= Administrator
$$ $$ C:\Bruker\TOPSPIN/data/COFFEE/nmr/AC1273_CCJAH12091_6652516_R2AUVQvvqU/12/pdata/1/auditp.txt
$$ ##AUDIT TRAIL=  $$ (NUMBER, WHEN, WHO, WHERE, PROCESS, VERSION, WHAT)
(   1,<2012-08-10 15:58:47.843 -0500>,<Administrator>,<TOPSPIN>,<go>,<TOPSPIN 2.1>,
      <created by zg
	started at 2012-08-10 15:47:17.468 -0500,
	POWCHK enabled, PULCHK disabled,
       configuration hash MD5:
       6B 1B 68 BB D9 2E 58 E2 7F 35 AD 54 07 DF 0E 41
       data hash MD5: 64K
       62 80 0C 42 90 79 FB 5C F7 5F 7C F7 15 11 21 C8>)
(   2,<2012-08-10 15:58:50.671 -0500>,<Administrator>,<TOPSPIN>,<proc1d>,<TOPSPIN 2.1>,
      <Start of raw data processing
       efp LB = 0.3 FT_mod = 6 PKNL = 1 PHC0 = 0 PHC1 = 0 SI = 128K 
       data hash MD5: 128K
       A9 51 83 13 93 29 9E E7 1A 81 DE D1 45 98 E6 11>)
(   3,<2012-08-10 15:58:51.984 -0500>,<Administrator>,<TOPSPIN>,<proc1d>,<TOPSPIN 2.1>,
      <pk PHC0 = 4.960327 PHC1 = 0 
       data hash MD5: 128K
       D6 66 70 46 59 76 74 02 A0 CA 6A 99 D4 00 19 60>)
(   4,<2012-08-10 15:58:52.468 -0500>,<Administrator>,<TOPSPIN>,<proc1d>,<TOPSPIN 2.1>,
      <abs ABSG = 1 
       data hash MD5: 128K
       DE 82 CE 30 61 41 AD 56 2D C3 91 7C 28 5F B0 AA>)
(   5,<2012-08-10 15:58:52.546 -0500>,<Administrator>,<TOPSPIN>,<proc1d>,<TOPSPIN 2.1>,
      <abs ABSG = 2 
       data hash MD5: 128K
       EE 28 E7 35 E7 86 8B 05 65 D3 5B A2 9B 4B E9 3B>)
(   6,<2012-08-10 15:58:52.609 -0500>,<Administrator>,<TOPSPIN>,<proc1d>,<TOPSPIN 2.1>,
      <abs ABSG = 3 
       data hash MD5: 128K
       48 5B AA 0B F0 42 B4 70 06 44 8C 55 71 E5 6A 31>)
(   7,<2012-08-10 15:58:52.671 -0500>,<Administrator>,<TOPSPIN>,<proc1d>,<TOPSPIN 2.1>,
      <abs ABSG = 4 
       data hash MD5: 128K
       E3 77 AB 67 9A 05 5D 9F D0 EA 39 AA FC 26 B6 5C>)
(   8,<2012-08-10 15:58:52.718 -0500>,<Administrator>,<TOPSPIN>,<proc1d>,<TOPSPIN 2.1>,
      <abs ABSG = 5 
       data hash MD5: 128K
       36 4A A0 33 D7 B5 6F 21 5A CA D0 F0 70 65 5C 89>)
$$ ##END=
$$ 
$$ $$ hash MD5
$$ $$ 69 3F C6 C1 B2 E1 C5 A9 9E FE 0E 14 AF D8 85 CE
##$RELAX= 
##$RELAX= 
##$RELAX= 
##$RELAX= 
##$RELAX= 
##$RELAX= 
##$RELAX= 
##$RELAX= 
$$ Bruker specific parameters
$$ [...]
150 150 150 150 150 150 150 150
##$TP07= 0
##$TPNAME0= <>
##$TPNAME1= <>
##$TPNAME2= <>
##$TPNAME3= <>
##$TPNAME4= <>
##$TPNAME5= <>
##$TPNAME6= <>
##$TPNAME7= <>
##$TPOAL= (0..7)
0.5 0.5 0.5 0.5 0.5 0.5 0.5 0.5
##$TPOFFS= (0..7)
0 0 0 0 0 0 0 0
##$TUNHIN= 0
##$TUNHOUT= 0
##$TUNXOUT= 0
##$USERA1= <user>
##$USERA2= <user>
##$USERA3= <user>
##$USERA4= <user>
##$USERA5= <user>
##$V9= 5
##$VALIST= <valist>
##$VCLIST= <CCCCCCCCCCCCCCC>
##$VD= 0
##$VDLIST= <DDDDDDDDDDDDDDD>
##$VPLIST= <PPPPPPPPPPPPPPP>
##$VTLIST= <TTTTTTTTTTTTTTT>
##$WBST= 1024
##$WBSW= 4
##$XGAIN= (0..3)
0 0 0 0
##$XL= 0
##$YL= 0
##$YMAX_a= 17124493
##$YMIN_a= -9483260
##$ZGOPTNS= <>
##$ZL1= 120
##$ZL2= 120
##$ZL3= 120
##$ZL4= 120
##$ABSF1= 14.96237
##$ABSF2= -5.595812
##$ABSG= 5
##$ABSL= 3
##$ALPHA= 0
##$AQORDER= 0
##$ASSFAC= 0
##$ASSFACI= 0
##$ASSFACX= 0
##$ASSWID= 0
##$AUNMP= <proc_prof1d_extract.lims>
##$AXLEFT= 0
##$AXNAME= <>
##$AXNUC= <1H>
##$AXRIGHT= 0
##$AXTYPE= 0
##$AXUNIT= <>
##$AZFE= 0.1
##$AZFW= 0.1
##$BCFW= 0
##$BC_mod= 0
##$BYTORDP= 0
##$COROFFS= 0
##$CY= 15
##$DATMOD= 1
##$DC= 0
##$DFILT= <>
##$DTYPP= 0
##$F1P= 0
##$F2P= 0
##$FCOR= 0.5
##$FTSIZE= 131072
##$FT_mod= 6
##$GAMMA= 0
##$GB= 0
##$INTBC= 1
##$INTSCL= 1
##$ISEN= 128
##$LB= 0.3
##$LEV0= 0
##$LPBIN= 0
##$MAXI= 10000
##$MC2= 0
##$MEAN= 0
##$ME_mod= 0
##$MI= 0
##$NCOEF= 0
##$NC_proc= -2
##$NLEV= 6
##$NOISF1= 0
##$NOISF2= 0
##$NSP= 0
##$NTH_PI= 0
##$NZP= 0
##$OFFSET= 14.96237
##$PC= 1
##$PHC0= 4.960327
##$PHC1= 0
##$PH_mod= 1
##$PKNL= yes
##$PPARMOD= 0
##$PPDIAG= 0
##$PPIPTYP= 0
##$PPMPNUM= 2147483647
##$PPRESOL= 1
##$PSCAL= 4
##$PSIGN= 0
##$PYNMP= <proc.py>
##$REVERSE= no
##$SF= 400.020009087254
##$SI= 131072
##$SIGF1= 0
##$SIGF2= 0
##$SINO= 400
##$SIOLD= 131072
##$SPECTYP= <>
##$SREGLST= <1H.CDCl3>
##$SSB= 0
##$STSI= 131072
##$STSR= 0
##$SW_p= 8223.68421052631
##$SYMM= 0
##$S_DEV= 0
##$TDeff= 65536
##$TDoff= 0
##$TI= <>
##$TILT= no
##$TM1= 0
##$TM2= 0
##$TOPLEV= 0
##$USERP1= <user>
##$USERP2= <user>
##$USERP3= <user>
##$USERP4= <user>
##$USERP5= <user>
##$WDW= 1
##$XDIM= 131072
##$YMAX_p= 322562351
##$YMIN_p= -11488
##$CURPLOT= <Network HP LaserJet P1505>
##$CURPRIN= <$Network HP LaserJet P1505>
##$DFORMAT= <normdp>
##$LAYOUT= <+/1D_H.xwp>
##$LFORMAT= <normlp>
##$PFORMAT= <normpl>
##$SURQMSG= 1
$$ End of Bruker specific parameters
$$ ---------------------------------
##NTUPLES= NMR SPECTRUM
##VAR_NAME=  FREQUENCY,     SPECTRUM/REAL,   SPECTRUM/IMAG
##SYMBOL=    X,             R,               I
##VAR_TYPE=  INDEPENDENT,   DEPENDENT,       DEPENDENT
##VAR_FORM=  AFFN,          ASDF,            ASDF
##VAR_DIM=   131072,        131072,          131072
##UNITS=     HZ,            ARBITRARY UNITS, ARBITRARY UNITS
##FACTOR=    0.0627417313425164, 1,          1
##FIRST=     8223.62146879497, -735,         -61914
##LAST=      0,             1188,            -63345
##MIN=       0,             -11488,          0
##MAX=       8223.62146879497, 322562351,    0
$$ Real data points
##PAGE= N=1
##DATA TABLE= (X++(R..R)), XYDATA
$$ [...]
63210A009936J8430J6847J4807J1994Q414M281k15m806r171j3205j6940k0160
$$ 1009936 1028366 1045213 1060020 1072014 1080428 1084709 1084494 1079688 1070517 1057312 1040372 1020212
63198A020212k2438k3682k4290k4618k4622k4095k2979k1302j9082j6442j3668
$$ 1020212 997774 974092 949802 925184 900562 876467 853488 832186 813104 796662 782994
63187G82994j1060q819o985n310l257m73K795N919Q518J0604J2296J3663J4825
$$ 782994 771934 763115 756130 750820 747563 747090 749885 755804 764322 774926 787222 800885 815710
63174H15710J5936J7004J7917J8497J8520J7965J7374J7507J8264J8435J7105
$$ 815710 831646 848650 866567 885064 903584 921549 938923 956430 974694 993129 1010234
63163A010234J4875J2970J1493R427O228K447j289n020q890j2612j5849j8555
$$ 1010234 1025109 1038079 1049572 1058999 1065227 1067674 1066385 1061365 1052475 1039863 1024014 1005459
63151A005459k0661k2002k2833k3769k4915k5569k5121k3773k2046k0148j8229
$$ 1005459 984798 962796 939963 916194 891279 865710 840589 816816 794770 774622 756393
63140G56393j6620j5386j4068j2364j0711r651r039q389p649p073o521n651m601
$$ 756393 739773 724387 710319 697955 687244 677593 668554 660165 652516 645443 638922 633271 628670
63127F28670l877l471k758j423l5O42N75M24O86J231J661J917K288K860L225K962
$$ 628670 624793 621322 618564 617141 617106 617748 618323 618747 619433 620664 622325 624242 626530 629390 632615 635577
63111F35577K245J741J841K303K677K845K978L174L289L165K882K827L324M128
$$ 635577 637822 639563 641404 643707 646384 649229 652207 655381 658670 661835 664717 667544 670868 674996
63097F74996M534M197L577L229K877J827J58j216j794k032k315k075o33J506K941
$$ 674996 679530 683727 687304 690533 693410 695237 695395 694179 692385 690353 688038 685963 685330 686836 689777
63082F89777K956K228J929K465L348L996M356M754N390O234P299Q649R969J0613
$$ 689777 692733 694961 696890 699355 702703 706699 711055 715809 721199 727433 734732 743381 753350 763963
63068G63963J0456J0375J1330J3079J4501J5134J5707J6903J8383J9459K0250
$$ 763963 774419 784794 796124 809203 823704 838838 854545 871448 889831 909290 929540
63057I29540K1570K3853K6641K9124L0910L2282L3760L5510L7314L9182M1528
$$ 929540 951110 974963 1001604 1030728 1061638 1093920 1127680 1163190 1200504 1239686 1281214
63046A281214M4327M6591M7433M7392M7801M8863M9449M8897M7954M7456M7207
$$ 1281214 1325541 1372132 1419565 1466957 1514758 1563621 1613070 1661967 1709921 1757377 1804584
63035A804584M6818M6650M7045M7440M7165M6480M5768M4341M1178L6523L1527
$$ 1804584 1851402 1898052 1945097 1992537 2039702 2086182 2131950 2176291 2217469 2253992 2285519
63024B285519K6354J9909J1628K474o242j4291k2241l0272l7752m3839m8217n1243
$$ 2285519 2311873 2331782 2343410 2345884 2339642 2325351 2303110 2272838 2235086 2191247 2143030 2091787
63012B091787n3371n4427n3775n1387m8246m5224m2027l7918l3025k8100k3189
$$ 2091787 2038416 1983989 1930214 1878827 1830581 1785357 1743330 1705412 1672387 1644287 1621098
63001A621098j7686j1699o296k007J968O491J1146J4846J7272J9096K1012K3156
$$ 1621098 1603412 1591713 1585417 1583410 1585378 1591869 1603015 1617861 1635133 1654229 1675241 1698397
62989A698397K5293K7105K8278K8607K8164K7182K5786K3907K1405J8204J4415
$$ 1698397 1723690 1750795 1779073 1807680 1835844 1863026 1888812 1912719 1934124 1952328 1966743
62978A966743J0268N808O72n563j2801k0300k7184l3030l8021m2692m7386n1780
$$ 1966743 1977011 1982819 1983491 1977928 1965127 1944827 1917643 1884613 1846592 1803900 1756514 1704734
62966A704734n5002n6495n6581n5978n4991n3491n1443m9009m6200m3025l9894
$$ 1704734 1649732 1593237 1536656 1480678 1425687 1372196 1320753 1271744 1225544 1182519 1142625
62955A142625l7359l5403l3433l1107k8677k6403k4121k1662j9279j7443j6374
$$ 1142625 1105266 1069863 1036430 1005323 976646 950243 926122 904460 885181 867738 851364
62944H51364j5903j5561j4842j3662j2569j2132j2197j2094j1520j0735j0002
$$ 851364 835461 819900 805058 791396 778827 766695 754498 742404 730884 720149 710147
62933G10147r394r162r500r913r587q673q285q818r170q288o758n906n863n577
$$ 710147 700753 691591 682091 672178 662591 653918 645633 636815 627645 619357 612599 606693 600830 595253
62919E95253m543l497l286l822m437m695m570m206l772l429l302l499l959m200
$$ 595253 590710 587213 583927 580105 575668 570973 566403 562197 558425 554996 551694 548195 544236 540036
62905E40036l549j994m75R5j00k35q1j27n42q61q14p49r35j101j059j151j633
$$ 540036 536487 534493 534018 534113 534013 533778 533697 533570 533028 532167 531353 530604 529669 528568 527509 526358 524725
62888E24725k092k042j727j693j849j619r53n13p55j378j819j858j566j086o73
$$ 524725 522633 520591 518864 517171 515322 513703 512750 512237 511482 510104 508285 506427 504861 503775 503102
62873E03102o31q68q02n0R54J373Q55k42j390k273k670k438j810j429j795k667
$$ 503102 502471 501603 500801 500751 501705 503078 503933 503691 502301 500028 497358 494920 493110 491681 489886 487219
62857D87219l258k982j963q46k18k24o37j179j754k283k523k172j242j98L31K2
$$ 487219 483961 480979 479016 478170 477952 477728 477091 475912 474158 471875 469352 467180 465938 465740 466071 466093
62841D66093q72j686j865j460j031r66j051q83n09k55r6L07R15J206R23M57J79
$$ 466093 465221 463535 461670 460210 459179 458213 457162 456279 455770 455515 455419 455726 456641 457847 458770 459227 459406
62824D59406p6m97p05k97M01P18O43P40J106J165P05L93Q76J798K257J985J598
$$ 459406 459330 458833 458128 457831 458232 458950 459593 460333 461439 462604 463309 463702 464578 466376 468633 470618 472216
62807D72216J727K304K794K824K517K304K624L682N306O955Q007Q244Q035P955
$$ 472216 473943 476247 479041 481865 484382 486686 489310 492992 498298 505253 513260 521504 529539 537494
62793E37494Q215Q672R331J0441J2065J3895J5776J7988K0672K3355K5525K7381
$$ 537494 545709 554381 563712 574153 586218 600113 615889 633877 654549 677904 703429 730810
62781G30810K9471L1836L4145L6637M0074M4671M9701N4455N9034O3791O8523
$$ 730810 760281 792117 826262 862899 902973 947644 997345 1051800 1110834 1174625 1243148
62770A243148P2653P5875P8159P9407P9496P8544P6634P3362O8022O0298N0636
$$ 1243148 1315801 1391676 1469835 1549242 1628738 1707282 1783916 1857278 1925300 1985598 2036234
62759B036234L9888K8727J7332N541o707j9015l0661m1039m9816n6872o2334o6616
$$ 2036234 2076122 2104849 2122181 2127722 2121015 2102000 2071339 2030300 1980484 1923612 1861278 1794662
62747A794662o9964p1978p2079p0540o8544o6933o5424o3346o0663n7710n4455
$$ 1794662 1724698 1652720 1580641 1510101 1441557 1374624 1309200 1245854 1185191 1127481 1073026
62736A073026n0643m6535m2814l9783l7150l4550l1865k9129k6522k4423k2952
$$ 1073026 1022383 975848 933034 893251 856101 821551 789686 760557 734035 709612 686660
62725F86660k1570j9601j7192j5204j4034j3142j1835j0021q000o052m508l709
$$ 686660 665090 645489 628297 613093 599059 585917 574082 564061 556061 550009 545501 541792
62713E41792l414k687q82J487L360M440N346O643Q234R864J1621J3723J6116J8603
$$ 541792 538378 535691 534809 536296 539656 544096 549442 556085 564319 574183 585804 599527 615643 634246
62699F34246K1191K4052K7272L0788L4511L8333M2101M5692M9073N2180N4791
$$ 634246 655437 679489 706761 737549 772060 810393 852494 898186 947259 999439 1054230
62688A054230N6747N8212N9567O0856O1458O0365N6929N1336M4410L6888K8880
$$ 1054230 1110977 1169189 1228756 1289612 1351070 1411435 1468364 1519700 1564110 1600998 1629878
62677A629878K0063J0348K10r656j8804k7028l4137l9982m4628m8251n0879n2538
$$ 1629878 1649941 1660289 1660499 1650843 1632039 1605011 1570874 1530892 1486264 1438013 1387134 1334596
62665A334596n3508n4152n4417n3891n2417n0343m8012m5435m2660l9999l7595
$$ 1334596 1281088 1226936 1172519 1118628 1066211 1015868 967856 922421 879761 839762 802167
62654H02167l5045l2043k9024k6731k5231k3925k2430k0892j9427j7918j6468
$$ 802167 767122 735079 706055 679324 654093 630168 607738 586846 567419 549501 533033
62643E33033j5494j5059j4586j3649j2601j1984j1622j0878r658q631q309q303
$$ 533033 517539 502480 487894 474245 461644 449660 438038 427160 417502 408871 400562 392259
62631C92259p752o335m674l711l793m387m698m462m040l799l614l069k046r02
$$ 392259 384507 378172 373498 369787 365994 361607 356909 352447 348407 344608 340994 337925 335879 334977
62617C34977j45R7J66M24P81Q46N82N69J329K648L891M755N360N699N666N619
$$ 334977 334832 334929 335095 335519 336300 337146 337728 338297 339626 342274 346165 350920 356280 361979 367645 373264
62601C73264O238P648R253J0730J2534J4962J7317J8733J9501K0799K3219K6244
$$ 373264 379502 387150 396403 407133 419667 434629 451946 470679 490180 510979 534198 560442
62589E60442K9251L2211L5202L7834L9669M0849M1840M2637M2623M1196L8309
$$ 560442 589693 621904 657106 694940 734609 775458 817298 859935 902558 943754 982063
62578I82063L4344K9751K4824J9680J4209Q209J733m689j0412j5313j9812k4100
$$ 982063 1016407 1046158 1070982 1090662 1104871 1113080 1114813 1110124 1099712 1084399 1064587 1040487
62566A040487k7618k9673l0371l0531l0708l0749l0397k9786k9128k8287k7013
$$ 1040487 1012869 983196 952825 922294 891586 860837 830440 800654 771526 743239 716226
62555G16226k5337k3487k1625j9947j8771j8153j7631j6751j5668j4955j4803
$$ 716226 690889 667402 645777 625830 607059 588906 571275 554524 538856 523901 509098
62544E09098j4767j4283j3164j1670j0306r464r094q766q209p561o936n997m397
$$ 509098 494331 480048 466884 455214 444908 435444 426350 417584 409375 401814 394878 388881 384484
62531C84484k394o53M84J089J184P41J46J76J215K845M320N215N561N726O307
$$ 384484 382090 381437 381921 383010 384194 384935 385081 385257 386472 389317 393637 398852 404413 410139 416446
62516D16446P828J0247J2897J5069J6584J7759J9075K0918K3370K6086K8542L0564
$$ 416446 424274 434521 447418 462487 479071 496830 515905 536823 560193 586279 614821 645385
62504F45385L2403L4164L5408L5536L4381L2238K9383K5852K1727J7329J2940
$$ 645385 677788 711952 747360 782896 817277 849515 878898 904750 926477 943806 956746
62493I56746Q392L169k897r166j4627j8737k1672k3716k4897k5283k5311k5349
$$ 956746 965138 968307 965410 956244 941617 922880 901208 877492 852595 827312 802001 776652
62481G76652k5262k4740k3893k3059k2203k1007j9483j7944j6423j4639j2628
$$ 776652 751390 726650 702757 679698 657495 636488 617005 599061 582638 567999 555371
62470E55371j0835r427q091o705n631n024m385l310k160j531j347j068m74K42
$$ 555371 544536 535109 527018 520313 514682 509658 505273 501963 499803 498272 496925 495857 495383 495625
62456D95625J007J856K559K834K989L739N216O651P254P066O717O599O564O227
$$ 495625 496632 498488 501047 503881 506870 510609 515825 522476 529730 536796 543513 550112 556676 562903
62442E62903N317L814J927oj747l264m701o244p890r293r972r920r789j0125j0571
$$ 562903 568220 572034 573961 573955 572208 568944 564243 557999 550109 540816 530844 520924 511135 501010 490439
62427D90439j0286r148q004p553p506p237o718o304n881m964l570k329j572q40
$$ 490439 480153 471005 463001 455448 447942 440705 433987 427683 421802 416838 413268 410939 409367 408527
62413D08527L50J761K834L563M429N556O428O573O237O117O581P323P784P737
$$ 408527 408877 410638 413472 417035 421464 427020 433448 440021 446258 452375 458956 466279 474063 481800
62399D81800P377O927O325N414M267L155K154J070k15j512k625l608m577n366
$$ 481800 489177 496104 502429 507843 512110 515265 517419 518489 518274 516762 514137 510529 505952 500586
62385E00586n661n347m546l432k232j258n81J40J231K469L487M535O243Q516J0430
$$ 500586 494925 489578 485032 481600 479368 478110 477529 477669 478900 481369 484856 489391 495634 504150 514580
62370E14580J1552J2771J5167J8580K1969K4975K8222L1999L5531L7971L9648
$$ 514580 526132 538903 554070 572650 594619 619594 647816 679815 715346 753317 792965
62359G92965M1649M4359M6913M8210M8057M7008M5374M2715L8536L3102K7260
$$ 792965 834614 878973 925886 974096 1022153 1069161 1114535 1157250 1195786 1228888 1256148
62348A256148K1509J5624R273K699l495r054j4145j8832k2821k5904k8352l0571
$$ 1256148 1277657 1293281 1302554 1305253 1301758 1292704 1278559 1259727 1236906 1211002 1182650 1152079
62336A152079l2472l3496l3337l2454l1599l0993l0271k9183k7914k6588k4946
$$ 1152079 1119607 1086111 1052774 1020320 988721 957728 927457 898274 870360 843772 818826
62325H18826k2918k1127k0170j9644j8520j6558j4554j3151j2101j0994r925q983
$$ 818826 795908 774781 754611 734967 716447 699889 685335 672184 660083 649089 639164 630181
62313F30181p776o077m444l580l427l542l906m657n352n381m971m958n587o267
$$ 630181 622405 616328 611884 608304 604877 601335 597429 592772 587420 582039 577068 572110 566523 560256
62299E60256o541o527o327n757m871m091l587l139k746k687k764k226p98P87J807
$$ 560256 553715 547188 540861 535104 530233 526142 522555 519416 516670 513983 511219 508993 508195 508982 510789
62284E10789K402L023L532L583L446L744M604N660O687P671Q368Q481Q343Q833
$$ 510789 513191 516214 519746 523329 526775 530519 535123 540783 547470 555141 563509 571990 580333 589166
62270E89166J0360J2312J3749J4430J4949J6030J7919K0371K3110K6028K9017
$$ 589166 599526 611838 625587 640017 654966 670996 688915 709286 732396 758424 787441
62259G87441L1772L4057L6022L8044M0173M1985M2965M2806M1313L8453L4546
$$ 787441 819213 853270 889292 927336 967509 1009494 1052459 1095265 1136578 1175031 1209577
62248A209577L0082K5204J9683J3463O904L21o192j2373j7716k2063k5773k8972
$$ 1209577 1239659 1264863 1284546 1298009 1304913 1305234 1299042 1286669 1268953 1246890 1221117 1192145
62236A192145l1188l2098l2115l1736l0858k9341k7733k6531k5147k2609j9189
$$ 1192145 1160957 1128859 1096744 1065008 1034150 1004809 977076 950545 925398 902789 883600
62225H83600j6343j4903j4174j3074j1337r288p301n928n871p057q199p933o275
$$ 883600 867257 852354 838180 825106 813769 804481 797180 791252 785381 778324 770125 762192 755917
62212G55917m421l328l043l260l775m305m332l591k483j636j164n85M42J621K459
$$ 755917 751496 748168 745125 741865 738090 733785 729453 725862 723379 721743 720579 719994 720436 722057 724516
62197G24516L098M271O351Q683J0246J0820J1183J2215J4036J6046J7557J8342
$$ 724516 727614 731885 738236 746919 757165 767985 779168 791383 805419 821465 839022 857364
62185H57364J8745J9283J9942J9966J8632J6232J3924J2583J2100J1851J1479
$$ 857364 876109 895392 915334 935300 953932 970164 984088 996671 1008771 1020622 1032101
62174A032101J1055J0874J1302J2591J4584J6852J9229K1893K4707K6935K8023
$$ 1032101 1043156 1054030 1065332 1077923 1092507 1109359 1128588 1150481 1175188 1202123 1230146
62163A230146K8372K8850K9574K9594K7861K4245J9635J5252J1778Q939N968K664
$$ 1230146 1258518 1287368 1316942 1346536 1374397 1398642 1418277 1433529 1445307 1454246 1460214 1462878
62151A462878k90k284l835o072r200j2020j3266j2941j2120j1714j1768j1811
$$ 1462878 1462588 1460304 1456469 1450397 1441197 1429177 1415911 1402970 1390850 1379136 1367368 1355557
62139A355557j1445j0573r225p439n391l572k556k375k301j664o80j10l4L90J803
$$ 1355557 1344112 1333539 1324314 1316875 1311484 1307912 1305356 1302981 1300680 1299016 1298336 1298226 1298192 1298582 1300385
62124A300385L739N273O170O974Q153R651J1145J2382J3251J3910J4775J6146
$$ 1300385 1304124 1309397 1315567 1322541 1330694 1340345 1351490 1363872 1377123 1391033 1405808 1421954
62112A421954J7793J9123J9786J9944K0086K0669K1772K2882K3301K3086K3271
$$ 1421954 1439747 1458870 1478656 1498600 1518686 1539355 1561127 1584009 1607310 1630396 1653667
62101A653667K4669K6742K8290K9052K9878L1324L2952L4196L5229L6510L8096
$$ 1653667 1678336 1705078 1733368 1762420 1792298 1823622 1856574 1890770 1925999 1962509 2000605
62090B000605L9692M0849M0866L9343L7193L6375L7783M0093M1453M1751M2166
$$ 2000605 2040297 2081146 2122012 2161355 2198548 2234923 2272706 2312799 2354252 2396003 2438169
62079B438169M3025M3388M2728M1686M0828L9756L8035L6181L5027L4683L4703
$$ 2438169 2481194 2524582 2567310 2608996 2649824 2689580 2727615 2763796 2798823 2833506 2868209
62068B868209L4967L5800L7348L9302M1172M2587M3453M3940M4124M3624M1910
$$ 2868209 2903176 2938976 2976324 3015626 3056798 3099385 3142838 3186778 3230902 3274526 3316436
62057C316436L9071L5842L2718K9467K5799K1971J8329J4646J0538O274K571l43
$$ 3316436 3355507 3391349 3424067 3453534 3479333 3501304 3519633 3534279 3544817 3551091 3553662 3553319
62045C553319k984n865q864j1441j3168j4079j4589j5088j5543j5594j5119j4425
$$ 3553319 3550335 3544470 3535606 3524165 3510997 3496918 3482329 3467241 3451698 3436104 3420985 3406560
62033C406560j3761j2971j2010j1412j1700j2455j2652j1922j1004j0691j0848
$$ 3406560 3392799 3379828 3367818 3356406 3344706 3332251 3319599 3307677 3296673 3285982 3275134
62022C275134j0736j0017r034q236p689p170o548n906n346m784l994k869j619
$$ 3275134 3264398 3254381 3245347 3237111 3229422 3222252 3215704 3209798 3204452 3199668 3195674 3192805 3191186
62009C191186o39j82j48j35L31J516L260M972N922N648M328K779J860J618J111
$$ 3191186 3190547 3190365 3190217 3190082 3190413 3191929 3195189 3200161 3206083 3211731 3216059 3218838 3220698 3222316 3223427
61994C223427o20l486o532r150j1672j4678j8205k1816k5029k7425k8775k9428
$$ 3223427 3222807 3219321 3212789 3203639 3191967 3177289 3159084 3137268 3112239 3084814 3056039 3026611
61982C026611l0171l1270l1958l1476l0316k9805l0430l1291l1250l0116k8547
$$ 3026611 2996440 2965170 2933212 2901736 2871420 2841615 2811185 2779894 2748644 2718528 2689981
61971B689981k7259k6627k6594k6695k6350k5445k4387k3440k2308k0715j9088
$$ 2689981 2662722 2636095 2609501 2582806 2556456 2531011 2506624 2483184 2460876 2440161 2421073
61960B421073j8207j8180j8197j7464j6116j4937j4325j3924j3264j2432j1855
$$ 2421073 2402866 2384686 2366489 2349025 2332909 2317972 2303647 2289723 2276459 2264027 2252172
61949B252172j1592j1263j0553r500q240o839n441m216k998j360P15K569L627
$$ 2252172 2240580 2229317 2218764 2209264 2201024 2194185 2188744 2184528 2181530 2180170 2180885 2183454 2187081
61936B187081M114M670N578O811Q588J1272J4712J8258K1486K4562K7747L1017
$$ 2187081 2191195 2195865 2201443 2208254 2216842 2228114 2242826 2261084 2282570 2307132 2334879 2365896
61924B365896L4365L8129M2779M8512N5170O2446P0156P8449Q7817R8853J12070
$$ 2365896 2400261 2438390 2481169 2529681 2584851 2647297 2717453 2795902 2883719 2982572 3094642
61913C094642J27945J46817J68477J92212K17763K45994K78011L13796L52412
$$ 3094642 3222587 3369404 3537881 3730093 3947856 4193850 4471861 4785657 5138069
61904E138069L93407M37078M82830N27956N68367N99858O18146O18494N96575
$$ 5138069 5531476 5968554 6451384 6979340 7547707 8147565 8765711 9384205 9980780
61895I980780N50160M79890L88823K81931J65777M7540o6636j72560k67475l49024
$$ 9980780 10530940 11010830 11399653 11681584 11847361 11894901 11828265 11655705 11388230 11039206
61885A1039206m15038m64231m96749n13943n17708n10163m93830m71591m46009
$$ 11039206 10624168 10159937 9663188 9149245 8631537 8121374 7627544 7155953 6709944
61876F709944m18637l90290l61906l34679l09340k85789k63823k43705k25656
$$ 6709944 6291307 5901017 5539111 5204432 4895092 4609303 4345480 4101775 3876119
61867C876119k09111j93177j77714j63341j50334j38132j26270j15226j05808
$$ 3876119 3667008 3473831 3296117 3132776 2982442 2844310 2718040 2602814 2497006
61858B497006r7920r0438q2406p3968o6064n9443n4086m9397m4719l9845l5157
$$ 2497006 2399086 2308648 2226242 2152274 2086210 2026767 1972681 1923284 1878565 1838720 1803563
61847A803563l1194k7928k4736k1286j8238j6483j5801j4934j3194j1306j0188
$$ 1803563 1772369 1744441 1719705 1698419 1680181 1663698 1647897 1632963 1619769 1608463 1598275
61836A598275r500q189o125m302l395k973k359j525p73q9P37J706K741L849M838
$$ 1598275 1588775 1580586 1574461 1570159 1566764 1563791 1561432 1559907 1559134 1559045 1559782 1561488 1564229 1568078 1572916
61821A572916N276N106M984N543O624P723Q932J0743J3056J5052J6241J7136J8676
$$ 1572916 1578192 1583298 1588282 1593825 1600449 1608172 1617104 1627847 1640903 1655955 1672196 1689332 1708008
61808A708008K1260K4601K8264L2120L6267M0665M4972M8899N2692N6943O1885
$$ 1708008 1729268 1753869 1782133 1814253 1850520 1891185 1936157 1985056 2037748 2094691 2156576
61797B156576O7230P2938P9619Q7637R6326J04840J13608J23992J36492J50253
$$ 2156576 2223806 2296744 2376363 2464000 2560326 2665166 2778774 2902766 3039258 3189511
61787C189511J64645J80444J98835K20039K43690K70135L00444L35360L75078
$$ 3189511 3354156 3534600 3733435 3953474 4197164 4467299 4767743 5103103 5478181
61778E478181M20004M70846N27777N90196O57658P30263Q07484Q86712R63246
$$ 5478181 5898185 6369031 6896808 7487004 8144662 8874925 9682409 10569121 11532367
61769A1532367J031309J084421J114845J113723J072926R87938Q59824O95081
$$ 11532367 12563676 13648097 14762942 15876665 16949591 17937529 18797353 19492434
61761A9492434N03714K96948Q5714j20134l12416m84949o33152p53293q42602
$$ 19492434 19996148 20293096 20378810 20258676 19946260 19461311 18828159 18074866 17232264
61752A7232264r00421r28995r32740r16657q85407q43317p94466p42404o89948
$$ 17232264 16331843 15402848 14470108 13553451 12668044 11824727 11030261 10287857 9597909
61743I597909o39178n91287n46517n04582m65364m29040l95548l64477l35591
$$ 9597909 8958731 8367444 7820927 7316345 6850981 6421941 6026393 5661916 5326325
61734E326325l09114k85170k63266k42728k23382k05411j88745j73141j58770
$$ 5326325 5017211 4732041 4468775 4226047 4002665 3797254 3608509 3435368 3276598
61725C276598j46107j35038j24667j14406j04835r6978r0875q5493q0031p4693
$$ 3276598 3130491 2995453 2870786 2756380 2651545 2554567 2463692 2378199 2298168 2223475
61715B223475o9953o5586o0997n6238n2036m8837m6313m3949m1568l9095l6331
$$ 2223475 2153522 2087936 2026939 1970701 1918665 1869828 1823515 1779566 1737998 1698903 1662572
61704A662572l3425l1111k9833k8960k7521k5585k4150k3620k3236k2337k1319
$$ 1662572 1629147 1598036 1568203 1539243 1511722 1486137 1461987 1438367 1415131 1392794 1371475
61693A371475k0853k0721k0163j9008j7734j6566j5277j3814j2551j1733j1139
$$ 1371475 1350622 1329901 1309738 1290730 1272996 1256430 1241153 1227339 1214788 1203055 1191916
61682A191916j0496r871r475r317r218q979q475p785p254p243p717q202q213p614
$$ 1191916 1181420 1171549 1162074 1152757 1143539 1134560 1126085 1118300 1111046 1103803 1096086 1087884 1079671 1072057
61668A072057o635n706n258n414n886o319o669p058p303o999o129n308n162n611
$$ 1072057 1065422 1059716 1054458 1049044 1043158 1036839 1030170 1023112 1015809 1008810 1002681 997373 992211 986600
61654I86600n938n580m727m040l815l586k791j650r81j015j004k39R75J831K079
$$ 986600 980662 975082 970355 966315 962500 958914 956123 954473 953492 952477 951473 951234 952209 954040 956119
61639I56119K030J893J751J966K750L445L106J930J299K107L701M876N228N077
$$ 956119 958149 960042 961793 963759 966509 969954 973060 974990 976289 978396 982097 986973 992201 997278
61625I97278M641L893K909J830O57n45j462j955k341k917l439l595l713m465n844
$$ 997278 1001919 1005812 1008721 1010551 1011208 1010663 1009201 1007246 1004905 1001988 998549 994954 991241 986776 980932
61610I80932p039p405p182p080p438q030q472q574q371p979p527p121o761o293
$$ 980932 973893 966488 959306 952226 944788 936758 928286 919712 911341 903362 895835 888714 881953 875660
61596H75660n578m697l913l343k861k373j950j479n97P81K110K955L765N244P176
$$ 875660 870082 865385 861472 858129 855268 852895 850945 849466 848869 849650 851760 854715 858480 863724 870900
61581H70900Q675R562J0555J1904J2840J2932J3109J4570J7199J9847K1790K3146
$$ 870900 879575 889137 899692 911596 924436 937368 950477 965047 982246 1002093 1023883 1047029
61569A047029K4136K4851K5613K6798K8114K8723K8304K7532K7251K7476K7520
$$ 1047029 1071165 1096016 1121629 1148427 1176541 1205264 1233568 1261100 1288351 1315827 1343347
61558A343347K6860K5630K4273K2942K1480J9932J8777J8310J7975J6800J4509
$$ 1343347 1370207 1395837 1420110 1443052 1464532 1484464 1503241 1521551 1539526 1556326 1570835
61547A570835J1746R118O668M343K250J54k574n940q873j0459j1049j1523j2029
$$ 1570835 1582581 1591699 1598367 1602710 1604960 1605114 1602540 1596600 1587727 1577268 1566219 1554696 1542667
61534A542667j2223j2228j2353j2205j1144r390p703o067l782q85J779M021O719
$$ 1542667 1530444 1518216 1505863 1493658 1482514 1473124 1465421 1459354 1455572 1454687 1456466 1460487 1467206
61521A467206J0334J4206J7823K1798K6761L2180L7341M2855N0031N9007O8513
$$ 1467206 1477540 1491746 1509569 1531367 1558128 1590308 1627649 1670504 1720535 1779542 1848055
61510A848055P7546Q6443R6184J07361J20071J34227J49510J65289J80862J95659
$$ 1848055 1925601 2012044 2108228 2215589 2335660 2469887 2619397 2784686 2965548 3161207
61500C161207K08999K19794K26671K28499K24676K14952J99099J77025J49299
$$ 3161207 3370206 3590000 3816671 4045170 4269846 4484798 4683897 4860922 5010221
61491E010221J17359Q2970M7594J2512k0658n0207p5281r6136j13145j25957j34006
$$ 5010221 5127580 5210550 5258144 5270656 5249998 5199791 5124510 5028374 4915229 4789272 4655266
61480D655266j37530j37592j35095j30235j23035j14108j04555r5122q5635p5397
$$ 4655266 4517736 4380144 4245049 4114814 3991779 3877671 3773116 3677994 3592359 3516962
61470C516962o4221n2927m2642l3673k5333j6912q452m40O919J3744J9978K5317
$$ 3516962 3452741 3399814 3357172 3323499 3298166 3281254 3272802 3272362 3279281 3293025 3313003 3338320
61458C338320K9639L3200L6275L8808M0564M1536M2005M2271M2420M2432M2403
$$ 3338320 3367959 3401159 3437434 3476242 3516806 3558342 3600347 3642618 3685038 3727470 3769873
61447C769873M2559M3030M3699M4336M4842M5296M5847M6461M6808M6316M4593
$$ 3769873 3812432 3855462 3899161 3943497 3988339 4033635 4079482 4125943 4172751 4219067 4263660
61436D263660M1788L8377L4521K9924K4463J8630J2979P393J387m931j0786j5631
$$ 4263660 4305448 4343825 4378346 4408270 4432733 4451363 4464342 4471735 4473122 4468191 4457405 4441774
61424D441774j9666k3272k6374k8686l0251l1338l1879l1419k9695k7091k4398
$$ 4441774 4422108 4398836 4372462 4343776 4313525 4282187 4250308 4218889 4189194 4162103 4137705
61413D137705k2026j9606j6514j2886r823q316q201q547q963r900j1673j3741
$$ 4137705 4115679 4096073 4079559 4066673 4056850 4048534 4040333 4031786 4022823 4012923 4001250 3987509
61401C987509j5362j6420j7239j7836j7854j6978j5037j1743o780j39P911J7257
$$ 3987509 3972147 3955727 3938488 3920652 3902798 3885820 3870783 3859040 3852260 3852121 3860032 3877289
61389C877289K7975M0026N3155O7310Q2853J00093J18688J37769J56655J75250
$$ 3877289 3905264 3945290 3998445 4065755 4148608 4248701 4367389 4505158 4661813 4837063
61379D837063J93508K10656K25234K35961K42162K43196K37868K25009K04712
$$ 4837063 5030571 5241227 5466461 5702422 5944584 6187780 6425648 6650657 6855369
61370F855369J78545J48404J15475Q0396M4012P521k7972o1744r3235j21812j46744
$$ 6855369 7033914 7182318 7297793 7378189 7422201 7429722 7401750 7340006 7246771 7124959 6978215
61359F978215j67504j84020j96635k05728k11453k13966k13808k11726k08062
$$ 6978215 6810711 6626691 6430056 6224328 6012875 5798909 5585101 5373375 5165313
61350E165313k02664j95449j86796j77234j67043j56339j45305j34087j22656
$$ 5165313 4962649 4767200 4580404 4403170 4236127 4079788 3934483 3800396 3677740
61341C677740j11014r9407q8118p7138o6234n5285m4446l4088k4654j6349q859
$$ 3677740 3566726 3467319 3379201 3302063 3235829 3180544 3136098 3102010 3077356 3061007 3052148
61330C052148j554N795J2731J8735K3909K8673L2960L6092L7628L7926L7776L7525
$$ 3052148 3050594 3056389 3069120 3087855 3111764 3140437 3173397 3209489 3247117 3285043 3322819 3360344
61318C360344L6832L5217L2789L0315K8553K7521K6530K4944K2702K0121J7372
$$ 3360344 3397176 3432393 3465182 3495497 3524050 3551571 3578101 3603045 3625747 3645868 3663240
61307C663240J4359J0900O866K244k788p871j2694j7204k1480k5601k9696l3957
$$ 3663240 3677599 3688499 3695365 3697609 3694821 3686950 3674256 3657052 3635572 3609971 3580275 3546318
61295C546318l8381m2532m5811m7977m9224m9782m9629m8669m7025m5023m2887
$$ 3546318 3507937 3465405 3419594 3371617 3322393 3272611 3222982 3174313 3127288 3082265 3039378
61284C039378m0575l7895l4726l1106k7222k3421k0205j7949j6532j5457j4505
$$ 3039378 2998803 2960908 2926182 2895076 2867854 2844433 2824228 2806279 2789747 2774290 2759785
61273B759785j4027j4382j5296j6122j6564j6682j6385j5399j3829j2144j0464
$$ 2759785 2745758 2731376 2716080 2699958 2683394 2666712 2650327 2634928 2621099 2608955 2598491
61262B598491q275n187j432K610P029J2149J8037K4679L2339M1238N1059O1211
$$ 2598491 2590216 2585029 2583597 2586207 2593236 2605385 2623422 2648101 2680440 2721678 2772737 2833948
61250B833948P1449Q1768R1697J00190J06285J09592J10013J07155J00172Q8209
$$ 2833948 2905397 2987165 3078862 3179052 3285337 3394929 3504942 3612097 3712269 3800478
61240C800478P1059M9680K5936J662k2094m4895o6170q4891j00047j11273j18932
$$ 3800478 3871537 3921217 3947153 3948815 3926721 3881826 3815656 3730765 3630718 3519445 3400513
61229C400513j23611j25553j24749j21581j17013j11804j05776r8489r0561q3476
$$ 3400513 3276902 3151349 3026600 2905019 2788006 2676202 2570426 2471937 2381376 2297900
61219B297900p7869p2764o7071o1115n6017n2081m8566m4789m0645l6197l1528
$$ 2297900 2220031 2147267 2080196 2019081 1963064 1910983 1862417 1817628 1776983 1740786 1709258
61208A709258k6922k2595j8284j3701r248n555k377J186N302Q996J1331J2309
$$ 1709258 1682336 1659741 1641457 1627756 1618508 1612953 1610576 1611762 1617064 1626060 1637391 1649700
61196A649700J2371J1752J0639R341P843N719K843k54l077n694q211j0321j1868
$$ 1649700 1662071 1673823 1684462 1693803 1701646 1707365 1710208 1709954 1706877 1701183 1692972 1682651 1670783
61183A670783j3361j5269j7163j8263j8582j8938j9851k0968k1682k1809k1604
$$ 1670783 1657422 1642153 1624990 1606727 1588145 1569207 1549356 1528388 1506706 1484897 1463293
61172A463293k1393k1320k1345k1416k1678k2305k3163k3926k4561k5326k6116
$$ 1463293 1441900 1420580 1399235 1377819 1356141 1333836 1310673 1286747 1262186 1236860 1210744
61161A210744k6337k5668k4530k3393k2152k0646j9221j8234j7376j6283j5361
$$ 1210744 1184407 1158739 1134209 1110816 1088664 1068018 1048797 1030563 1013187 996904 981543
61150I81543j5264j5792j6214j6524j7396j8841j9884j9803j8900j7753j6530
$$ 981543 966279 950487 934273 917749 900353 881512 861628 841825 822925 805172 788642
61139G88642j5330j4431j3687j2391j0242p887n992m439k905j654j011n27N23
$$ 788642 773312 758881 745194 732803 722561 714674 708682 704243 701338 699684 698673 698146 698669
61126F98669K093L527M555N350N866N930N911O479P555Q328Q447Q514R104R964
$$ 698669 700762 704289 708844 714194 720060 725990 731901 738380 745935 754263 762710 771224 780328 790292
61112G90292J0561J0920J1362J1753J1555J0508Q870P090N485M224L311K546J616
$$ 790292 800853 811773 823135 834888 846443 856951 865821 872911 878396 882620 885931 888477 890093
61099H90093L25j252k821m041m777n192n600o229p193q441r591j0009r424q377
$$ 890093 890418 889166 886345 882304 877527 872335 866735 860506 853313 844872 835281 825272 815848 807471
61085H07471p746p770p921p755p462p413p551p527p242o936o825o798o517n782
$$ 807471 799725 791955 784034 776279 768817 761404 753853 746326 739084 732148 725323 718525 712008 706226
61071G06226m808m023l444k550j049L92P98K01k77J25Q82J078O72L67N12P92Q83
$$ 706226 701418 697395 693951 691401 690352 690744 691542 691743 691466 691591 692473 693551 694223 694590 695102 695894 696777
61054F96777Q78R77J087R10L18m81j076j191q93m20J48Q58J640K339L063M107
$$ 696777 697655 698632 699719 700629 700947 700466 699390 698199 697306 696886 697034 697892 699532 701871 704934 709041
61038G09041N487O788P619P967Q012P910P890Q241R050J0145J1285J2153J2344
$$ 709041 714528 721316 728935 736902 744914 752824 760714 768955 778005 788150 799435 811588 823932
61025H23932J1826J1351J1761J2821J3472J3385J3382J4062J4902J5277J5539
$$ 823932 835758 847109 858870 871691 885163 898548 911930 925992 940894 956171 971710
61014I71710J6323J7463J8340J8895J9581K0800K2907K6154L0044L3413L5931
$$ 971710 988033 1005496 1023836 1042731 1062312 1083112 1106019 1132173 1162217 1195630 1231561
61003A231561L8732M2688M6902N0048N2459N5506N9571O4179O9693P7133Q6401
$$ 1231561 1270293 1312981 1359883 1409931 1462390 1517896 1577467 1641646 1711339 1788472 1874873
60992A874873R6345J06685J18307J31500J45709J61428J80740K05397K35808K72448
$$ 1874873 1971218 2077903 2196210 2327710 2473419 2634847 2815587 3020984 3256792 3529240
60982C529240L16665L69589M32165N07532O01518P19280Q63051J035431J243125
$$ 3529240 3845905 4215494 4647659 5155191 5756709 6475989 7339040 8374471 9617596
60973I617596J491372J767633K026050K190223K184753J984778J648310J294988
$$ 9617596 11108968 12876601 14902651 17092874 19277627 21262405 22910715 24205703
60965B4205703J035116R03796Q57415Q28703P76954O84765N25290K61723j07179
$$ 24205703 25240819 26144615 27002030 27830733 28607687 29292452 29817742 30079465 29972286
60956B9972286n13788q56834j080869j216800j339619j490765j645707j748924
$$ 29972286 29458498 28601664 27520795 26303995 24964376 23473611 21827904 20078980
60948B0078980j766767j705250j591425j450925j301006j152859j013310q85977
$$ 20078980 18312213 16606963 15015538 13564613 12263607 11110748 10097438 9211461
60940I211461p73527o78407o00934n38350m86857m43704m06955l74624l45004
$$ 9211461 8437934 7759527 7158593 6620243 6133386 5689682 5282727 4908103 4563099
60931D563099l17163k90575k64983k40908k19415k00908j84745j70298j57599
$$ 4563099 4245936 3955361 3690378 3449470 3230055 3029147 2844402 2674104 2516505
60922B516505j46586j36520j26703j17248j08640j01053r4350q8302q2393p5996
$$ 2516505 2369919 2233399 2106696 1989448 1880808 1779755 1685405 1597103 1514710 1438714
60912A438714o9107o2645n7486n3460m9545m4977m0004l5638l2652l0762k8914
$$ 1438714 1369607 1306962 1249476 1196016 1146471 1101494 1061490 1025852 993200 962438 933524
60901I33524k6495k3912k1702j9619j7206j4830j3275j2437j1346r517p471n753
$$ 933524 907029 883117 861415 841796 824590 809760 796485 784048 772702 763185 755714 749961
60889G49961m207k503p30Q08J906K464K584K723L236L786L792L390L169K924J685
$$ 749961 745754 743251 742521 743329 745235 747699 750283 753006 756242 760028 763820 767210 770379 773303 774988
60874G74988p57l210m476m704m868n461o241o796o891o540o070n851n783n448
$$ 774988 774231 771021 766545 761841 756973 751512 745271 738475 731584 725044 718974 713123 707340 701892
60860G01892m846m387m079l392k230j300j014o99M12K003L160L743M502N942P770
$$ 701892 697046 692659 688580 685188 682958 681658 680644 679945 680357 682360 685520 689263 693765 699707 707477
60845G07477R468J0935J2375J3927J5417J6445J6635J5970J4834J3691J2843J2380
$$ 707477 716945 727880 740255 754182 769599 786044 802679 818649 833483 847174 860017 872397
60833H72397J2167J1784J0868R526Q228P213O322N410M565L872L253K670K187
$$ 872397 884564 896348 907216 916742 924970 932183 938505 943915 948480 952352 955605 958275 960462
60820I60462J827J550J355J133N45n02j584k405l420n104o882p753p858q311r390
$$ 960462 962289 963839 965194 966327 966872 966370 964786 962381 958961 953857 946975 939222 931364 923053 913663
60805I13663j0103r900r592r915j0347j0174r728r590r338q272o803n920n618
$$ 913663 903560 893660 884068 874153 863806 853632 843904 834314 824976 816704 809901 803981 798363
60792G98363m960l594k132j032q7Q84J647K153K806L939N470P218R069J0716J1789
$$ 798363 793403 789809 787677 786645 786558 787442 789089 791242 794048 797987 803457 810675 819744 830460 842249
60777H42249J2392J3033J3857J4434J4462J4201J3940J3482J2541J1455J0859
$$ 842249 854641 867674 881531 895965 910427 924628 938568 952050 964591 976046 986905
60766I86905J0707J0114Q501O577N719O300P080O619M916L270K682K899L037K604
$$ 986905 997612 1007726 1016227 1022804 1028523 1034823 1041903 1048522 1053438 1056708 1059390 1062289 1065326 1067930
60752A067930J771J050Q11Q97P19N2m61j09P17R11J70p41j336k074l252m226m405
$$ 1067930 1069701 1070751 1071562 1072459 1073178 1073230 1072769 1072660 1073377 1074288 1074458 1073717 1072381 1070307 1067055 1062829 1058424
60735A058424m231m454n054n643o306p170p652p116o040n561n907o085n177l311
$$ 1058424 1054193 1049739 1044685 1039042 1032736 1025566 1017914 1010798 1004758 999197 993290 987205 982028 978717
60721I78717j356j49L5k98k35N72J483J758J415P66l01j841l095l225k564k187
$$ 978717 977361 977212 977247 976949 976714 977286 978769 980527 981942 982708 982407 980566 977471 974246 971682 969495
60705I69495k435k783l081l727m567m770m143l513l395l214k431j520j202j460
$$ 969495 967060 964277 961196 957469 952902 948132 943989 940476 937081 933867 931436 929916 928714 927254
60691I27254k032l115m692n854n858n550o540q965j1130j1668j1076j0664j0839
$$ 927254 925222 922107 917415 911561 905703 900153 893613 884648 873518 861850 850774 840110 829271
60678H29271j1107j1232j1398j1475j0910r569p964o548n251l972k938k251j596
$$ 829271 818164 806932 795534 784059 773149 763580 755616 749068 743817 739845 736907 734656 733060
60665G33060p84r4L74J086K175K698J834M05Q0J111K086K105J946K558L521L824
$$ 733060 732276 732182 732556 733642 735817 738515 740349 740754 740834 741945 744031 746136 748082 750640 754161 757985
60649G57985L327K641K150J955K232K887L293L068K750L017L696M216M559M988
$$ 757985 761312 763953 766103 768058 770290 773177 776470 779538 782288 785305 789001 793217 797776 802764
60635H02764N283N043M554M516N197O459Q291J0490J2209J2750J2569J2699J3379
$$ 802764 808047 813090 817644 822160 827357 833816 842107 852597 864806 877556 890125 902824 916203
60622I16203J4055J4476J4790J4779J4061J2942J2075J1314R943Q016O370N259
$$ 916203 930258 944734 959524 974303 988364 1001306 1013381 1024695 1034638 1042654 1049024 1054283
60610A054283M093K724J791J422P75n46j626j523o82l83j291l167n441p520q925
$$ 1054283 1058376 1061100 1062891 1064313 1065088 1064542 1062916 1061393 1060711 1060328 1059037 1055870 1050429 1042909 1033984
60595A033984r636j0087j0542j0848j0892j0819j0563r794q551p373o524n688
$$ 1033984 1024348 1014261 1003719 992871 981979 971160 960597 950803 942252 934879 928355 922667
60583I22667m738m077l848l545k897k478k820l444l398k459j226l35K3K8L5K71
$$ 922667 917929 913852 910004 906459 903562 901084 898264 894820 891422 888963 887737 887402 887425 887453 887488 887759
60567H87759O04Q79J390K464L607L968L744M023M837M668K623M6j215j231j454
$$ 887759 888363 889242 890632 893096 896703 900671 904415 908438 913275 917943 920566 920612 919397 918166 916712
60552I16712k371l131l193k906k417j275N79K434L786M967O489Q432J0751J3616
$$ 916712 914341 911210 908017 905111 902694 901419 901998 904432 908218 913185 919674 928106 938857 952473
60538I52473J7175K1359K6032L0871L5060L7640L8313L7499L5537L2300K7564
$$ 952473 969648 991007 1017039 1047910 1082970 1120610 1158923 1196422 1231959 1264259 1291823
60527A291823K1268J3485M744l677j0494j5551j9502k2326k3096k1494j8602j5595
$$ 1291823 1313091 1326576 1331320 1327643 1317149 1301598 1282096 1259770 1236674 1215180 1196578 1180983
60515A180983j2488q888n244k345q4K278M735O442P054P288P990R276J0929J2920
$$ 1180983 1168495 1159607 1154363 1152018 1151934 1154212 1158947 1165389 1172443 1179731 1187721 1196997 1207926 1220846
60501A220846J5258J7828K0855K5082L1051L8489M6759N5656O5355P5879Q7038
$$ 1220846 1236104 1253932 1274787 1299869 1330920 1369409 1416168 1471824 1537179 1613058 1700096
60490A700096R8809J11412J25131J40334J57496J76776J97798K20397K45238K72758
$$ 1700096 1798905 1910317 2035448 2175782 2333278 2510054 2707852 2928249 3173487 3446245
60480C446245L01032L25174L39257L38801L21722K88071K39555J79048J09876
$$ 3446245 3747277 4072451 4411708 4750509 5072231 5360302 5599857 5778905 5888781
60471E888781L5690l8998j08855j69353k18435k56174k83024k98928l04032k99499
$$ 5888781 5924471 5885473 5776618 5607265 5388830 5132656 4849632 4550704 4246672 3947173
60461C947173k87330k69773k49063k27309k06165j86549j68674j52341j37351
$$ 3947173 3659843 3390070 3141007 2913698 2707533 2520984 2352310 2199969 2062618
60452B062618j23807j11969j01749r2619q4199p6629p0062o4123n8366n2964m8435
$$ 2062618 1938811 1826842 1725093 1632474 1548275 1471646 1401584 1337461 1279095 1226131 1177696
60441A177696m4825m1692l8753l5959l3116l0074k7266k5332k4162k2945k1260
$$ 1177696 1132871 1091179 1052426 1016467 983351 953277 926011 900679 876517 853572 832312
60430H32312j9476j7964j6607j5298j4242j3435j2442j1047r616q482p512o553
$$ 832312 812836 794872 778265 762967 748725 735290 722848 711801 702185 693703 686191 679638
60418F79638n793n316m879m416m168l935k926r34R27J527J260J485K614L689L804
$$ 679638 673845 668529 663650 659234 655066 651131 648205 647271 648198 649725 650985 652470 655084 658773 662577
60403F62577L153K487K264K556L335M421N464O227O794P295P597P424O737N867
$$ 662577 665730 668217 670481 673037 676372 680793 686257 692484 699278 706573 714170 721594 728331 734198
60389G34198N253N003M837M438L821L169K419J291k28j665k492k644k523k611
$$ 734198 739451 744454 749291 753729 757550 760719 763138 764429 764201 762536 760044 757400 754877 752266
60375G52266l074l625l765l359k852k718k829k633j832n27J023K302K496J334
$$ 752266 749192 745567 741802 738443 735591 732873 730044 727411 725579 725052 726075 728377 730873 732207
60361G32207o8j54J143K214J857O80M8M29J363K437L477M300M892N532O261O634
$$ 732207 732139 731985 733128 735342 737199 737879 737927 738356 739719 742156 745633 749933 754825 760357 766618 773252
60345G73252O461O284O540O838O668O327O348O517O289N770N392M972M116L332
$$ 773252 779713 785997 792537 799375 806043 812370 818718 825235 831524 837294 842686 847658 851774 855106
60331H55106L620M896N979O302O667P921R729J1138J1687J1489J0717R524Q093
$$ 855106 858726 863622 869601 875903 882570 890491 900220 911358 923045 934534 945251 954775 962868
60318I62868O315L791M95k841n374o972q077q946r404r299q890q657q783q843
$$ 962868 969183 972974 973469 970628 965254 958282 950205 941259 931855 922556 913666 905009 896226 887383
60304H87383q147o487m525l280l164l608l580k439m70J339K191K310K611L446
$$ 887383 879236 872749 868224 864944 861780 858172 854592 852153 851683 853022 855213 857523 860134 863580
60290H63580M093L825L047K759L173L571L452L129L017L006K854K683K771L112
$$ 863580 867673 871498 874545 877304 880477 884048 887500 890629 893646 896652 899506 902189 904960 908072
60276I08072L476L680L619L226K663K408K920M155N520O346O514O630P472R175
$$ 908072 911548 915228 918847 922073 924736 927144 930064 934219 939739 946085 952599 959229 966701 975876
60262I75876J1161J2922J4572J6429J8477K0586K2971K5825K8800L1422L3971
$$ 975876 987037 999959 1014531 1030960 1049437 1070023 1092994 1118819 1147619 1179041 1213012
60251A213012L7322M1794M6741N1435N5897O0679O6231P2622P9562Q6511R2997
$$ 1213012 1250334 1292128 1338869 1390304 1446201 1506880 1573111 1645733 1725295 1811806 1904803
60240A904803R8978J04669J10007J14559J17907J19733J19577J17044J12378J06355
$$ 1904803 2003781 2108450 2218457 2333016 2450923 2570656 2690233 2807277 2919655 3026010
60230C026010R9375R1091Q1112O9700N7430M4615L1446J8488O544l899j2802k0202
$$ 3026010 3125385 3216476 3297588 3367288 3424718 3469333 3500779 3519267 3525811 3521912 3509110 3488908
60218C488908k5982k9958l2062l2361l0951k7878k3136j6852r390j090Q052J8262
$$ 3488908 3462926 3432968 3400906 3368545 3337594 3309716 3286580 3269728 3260338 3259248 3267300 3285562
60206C285562K9513M1392N3405O5140P6118Q5825R3998J00701J05907J09260J10349
$$ 3285562 3315075 3356467 3409872 3475012 3551130 3636955 3730953 3831654 3937561 4046821 4157170
60195D157170J08989J05070R8360Q8817P6905O3399M8818L3283J6887M5j6565
$$ 4157170 4266159 4371229 4469589 4558406 4635311 4698710 4747528 4780811 4797698 4797743 4781178
60184D781178l2207m6152n7724o6531p2677p6559p8332p7695p4382o8661o1065
$$ 4781178 4748971 4702819 4645095 4578564 4505887 4429328 4350996 4273301 4198919 4130258 4069193
60173D069193n1791m0799k8483j5746l168R374K1985L4069M4713N3386N9857O3835
$$ 4069193 4017402 3976603 3948120 3932374 3929206 3938580 3960565 3994634 4039347 4092733 4152590 4216425
60161D216425O5320O4883O2965N9005N2129M2718L2505K2811J3393L461o595j5128
$$ 4216425 4281745 4346628 4409593 4468598 4520727 4563445 4595950 4618761 4632154 4635615 4629020 4613892
60149D613892k0731k3368k3914k2925k0017j4493o304L886J5518K8637M3396N9534
$$ 4613892 4593161 4569793 4545879 4522954 4502937 4488444 4482140 4486026 4501544 4530181 4573577 4633111
60137D633111P6747R5239J15435J37283J60350J84400K09305K34453K58857K81912
$$ 4633111 4709858 4805097 4920532 5057815 5218165 5402565 5611870 5846323 6105180 6387092
60127F387092L03475L23166L40113L53488L62750L67099L65355L56749L41563
$$ 6387092 6690567 7013733 7353846 7707334 8070084 8437183 8802538 9159287 9500850
60118I500850L20670K94713K63966K28639J88988J45394R8573M9720K68m8384
$$ 9500850 9821520 10116233 10380199 10608838 10797826 10943220 11041793 11091513 11091781 11043397
60108A1043397r4927j38201j77266k11232k39057k59903k73672k80833k81668
$$ 11043397 10948470 10810269 10633003 10421771 10182714 9922811 9649139 9368306 9086638
60099I086638k76219k65050k49483k30625k08572j82965j54185j23605r2899o3377
$$ 9086638 8810419 8545369 8295886 8065261 7856689 7673724 7519539 7395934 7303035 7239658
60089G239658l5756j0182J3434L4753N2733O6201P4654P8214P7006P0972O0440
$$ 7239658 7203902 7193720 7207154 7241907 7294640 7360841 7435495 7513709 7590715 7661687 7722127
60078G722127M6558L0769J3895m044k3041m2448o1361p9479r7010j13595j28009
$$ 7722127 7768685 7799454 7813349 7809305 7786264 7743816 7682455 7602976 7505966 7392371 7264362
60067G264362j39338j48033j55191j61006j64620j65409j63643j59757j53640
$$ 7264362 7125024 6976991 6821800 6660794 6496174 6330765 6167122 6007365 5853725
60058E853725j45123j34643j22994j10576r7170q2347o5905m8110k9627j1131
$$ 5853725 5708602 5573959 5450965 5340389 5243219 5160872 5094967 5046857 5017230 5006099
60048E006099P090K4999M2363N8725P3693Q6872R7462J04479J07554J07139J03630
$$ 5006099 5013189 5038188 5080551 5139276 5212969 5299841 5397303 5501782 5609336 5716475 5820105
60037E820105R6720Q5963P1687N4888L6304J6093n545k7669m8892o8256q5561
$$ 5820105 5916825 6002788 6074475 6129363 6165667 6181760 6176215 6148546 6099654 6031398 5945837
60026E945837j00706j13075j21947j27375j30035j30192j27500j22020j14607
$$ 5945837 5845131 5732056 5610109 5482734 5352699 5222507 5095007 4972987 4858380
60017D858380j05762r4928q1782o7420n3175l8770k2952n723J1619K8728M6843
$$ 4858380 4752618 4657690 4575908 4508488 4455313 4416543 4393591 4387868 4399487 4428215 4475058
60006D475058O6681Q6944J05754J22480J37281J49765J59096J64838J66804J64508
$$ 4475058 4541739 4628683 4734437 4856917 4994198 5143963 5303059 5467897 5634701 5799209
59996E799209J57611J46543J32019J14352R3838P1313M7549K2557l694l0095n4773
$$ 5799209 5956820 6103363 6235382 6349734 6443572 6514885 6562434 6584991 6581297 6551202 6496429
59985F496429p6424r4636j09130j19618j26260j29502j29352j25513j18271j08576
$$ 6496429 6420005 6325369 6216239 6096621 5970361 5840859 5711507 5585994 5467723 5359147
59975E359147r7134q3921o8816n2200l4813j7364l67J5957L1621M6459N9872P1300
$$ 5359147 5262013 5178092 5109276 5057076 5022263 5004899 5004532 5020489 5052110 5098569 5158441 5229741
59963E229741Q0774Q8574R4488R7953R8824R7441R3923Q8026P9802O9911N9188
$$ 5229741 5310515 5399089 5493577 5591530 5690354 5787795 5881718 5969744 6049546 6119457 6178645
59952F178645M8443L8737L1147K5834K1850J8431J6259J7060K2119L1510M4615
$$ 6178645 6227088 6265825 6296972 6322806 6344656 6363087 6379346 6396406 6418525 6450035 6494650
59941F494650O0952Q0393J02965J28616J57073J87804K20127K53372K86765L19061
$$ 6494650 6555602 6635995 6738960 6867576 7024649 7212453 7432580 7685952 7972717 8291778
59931H291778L48344L72424L89543L98541L98273L87053L63115L25783K76170
$$ 8291778 8640122 9012546 9402089 9800630 10198903 10585956 10949071 11274854 11551024
59922A1551024K16777J50587Q0468R118o0752j26294j84809k34426k74520l05186
$$ 11551024 11767801 11918388 11998856 12007974 11947222 11820928 11636119 11401693 11127173 10821987
59912A0821987l26361l37773l39782l33794l21571l04314k82629k57127k28836
$$ 10821987 10495626 10157853 9818071 9484277 9162706 8858392 8575763 8318636 8089800
59903H089800j99058j68893j38717j08159p6964m5815j5809J2897M1118O8909
$$ 8089800 7890742 7721849 7583132 7474973 7398009 7352194 7336385 7349282 7390400 7459309
59893G459309R4433J15245J30256J39713J43519J40552J29822J11570Q6856N6550
$$ 7459309 7553742 7668987 7799243 7938956 8082475 8223027 8352849 8464419 8551275 8607825
59883H607825K1288j7691n8162r7580j34185j67330j96771k21834k41474k55108
$$ 8607825 8629113 8611422 8553260 8455680 8321495 8154165 7957394 7735560 7494086 7238978
59873G238978k62968k65569k63239k56416k46085k33464k19304k03843j87375
$$ 7238978 6976010 6710441 6447202 6190786 5944701 5711237 5491933 5288090 5100715
59864E100715j70556j54194j38916j25131j13025j02502r3203q4809p7410p1520
$$ 5100715 4930159 4775965 4637049 4511918 4398893 4296391 4203188 4118379 4040969 3969449
59854C969449o7419o4410o1044n6454n1257m6602m2569l8106l2603k6781k1811
$$ 3969449 3902030 3837620 3776576 3720122 3668865 3622263 3579694 3541588 3508985 3482204 3460393
59843C460393j8286j6367j6227j7738k0259k3297k7075l1781l6696m0728m3595
$$ 3460393 3442107 3425740 3409513 3391775 3371516 3348219 3321144 3289363 3252667 3211939 3168344
59832C168344m5776m7372m7860m6952m5030m2416l8783l3710k7479k0908j4525
$$ 3168344 3122568 3075196 3027336 2980384 2935354 2892938 2854155 2820445 2792966 2772058 2757533
59821B757533q261j991L960R130J3623J8143K3241K8798L4499M0325M6134N1094
$$ 2757533 2749272 2747281 2751241 2760371 2773994 2792137 2815378 2844176 2878675 2919000 2965134 3016228
59809C016228N4231N5477N5468N4370N1655M7214M1754L5777K9118K1965J5534
$$ 3016228 3070459 3125936 3181404 3235774 3287429 3334643 3376397 3412174 3441292 3463257 3478791
59798C478791J0876P756N433M046M292O232R413J3925K0355K8769L8624M9815
$$ 3478791 3489667 3497423 3502856 3506902 3511194 3517426 3526839 3540764 3561119 3589888 3628512 3678327
59786C678327O2978P8583R6357J15868J37135J60514J86367K14916K45906K78150
$$ 3678327 3741305 3819888 3916245 4032113 4169248 4329762 4516129 4731045 4976951 5255101
59776E255101L09479L36961L56890L64784L56474L29879K85944K28156J61468
$$ 5255101 5564580 5901541 6258431 6623215 6979689 7309568 7595512 7823668 7985136
59767G985136R1383K2932m0357r6667j44913j83719k11532k27755k33426k30519
$$ 7985136 8076519 8099451 8059094 7962427 7817514 7633795 7422263 7194508 6961082 6730563
59757F730563k20595k04593j83981j61416j39447j18790r8718p8969o0242m2703
$$ 6730563 6509968 6305375 6121394 5959978 5820531 5701741 5603023 5524054 5463812 5421109
59747E421109k5386p699R568K5648M1284N7729P5032R2430J10008J28683J48839
$$ 5421109 5395723 5388024 5397592 5423240 5464524 5522253 5597285 5689715 5799723 5928406 6077245
59736F077245J70131J92578K16717K42672K70109K99180L30518L64144L99214
$$ 6077245 6247376 6439954 6656671 6899343 7169452 7468632 7799150 8163294 8562508
59727H562508M35066M71586N08267N43648N76069O04314O27183O43048O50416
$$ 8562508 8997574 9469160 9977427 10521075 11097144 11701458 12328641 12971689 13622105
59718A3622105O48776O38918O22732O02817N81789N61808N44731N32422N26302
$$ 13622105 14270881 14909799 15532531 16135348 16717137 17278945 17823676 18356098 18882400
59709A8882400N26787N33537N45869N62143N79092N92760O00244N99837N89647
$$ 18882400 19409187 19942724 20488593 21050736 21629828 22222588 22822832 23422669 24012316
59700B4012316N67150N30538M79919M17137L45097K67401J87850J09897L6811
$$ 24012316 24579466 25110004 25589923 26007060 26352157 26619558 26807408 26917305 26954116
59691B6954116k7850q0865j20593j46847j59456j57751j41571j11866o9964j6919
$$ 26954116 26926266 26845401 26724808 26577961 26418505 26260754 26119183 26007317 25937353 25920434
59681B5920434M6094J17534J96104K81011L71192M64607N58429O49344P33456
$$ 25920434 25966528 26084062 26280166 26561177 26932369 27396976 27955405 28604749 29338205
59672B9338205Q06338Q63156Q98171R04563Q76188Q10187P07516N71298M06210
$$ 29338205 30144543 31007699 31905870 32810433 33686621 34496808 35204324 35775622 36181832
59663C6181832K19823K2644j74668l63696n37509o89092q12344r04323r65359
$$ 36181832 36401655 36424299 36249631 35885935 35348426 34659334 33846990 32942667 31977308
59654C1977308r97208j002370r85172r52414r12412q73488q42785q25055q21504
$$ 31977308 30980100 29977730 28992558 28040144 27127732 26254244 25411459 24586404 23764900
59645B3764900q29651q44649q61417q76508q88510q96618q98926q92762q76709
$$ 23764900 22935249 22090600 21229183 20352675 19464165 18567547 17668621 16775859 15899150
59636A5899150q51483q18540p78836p33658o85602o37477n90680n45557n02766
$$ 15899150 15047667 14229127 13450291 12716633 12031031 11393554 10802874 10257317 9754551
59627I754551m63094m26271l91283l57951l27002k98512k71612k46037k22737
$$ 9754551 9291457 8865186 8473903 8115952 7788950 7490438 7218826 6972789 6750052
59618F750052k02237j83445j65057j47505j32490j20916j12265j05803j01360
$$ 6750052 6547815 6364370 6199313 6051808 5919318 5798402 5686137 5580334 5478974
59609E478974r8739r7222r6262r6138r7381r9744j02226j04048j05067j05267
$$ 5478974 5380235 5283013 5186751 5090613 4993232 4893488 4791262 4687214 4582147 4476880
59599D476880j04324j01943r8316r3944q9158q3995p8355p2059o4973n7300m9678
$$ 4476880 4372556 4270613 4172297 4078353 3989195 3905200 3826845 3754786 3689813 3632513 3582835
59588C582835m2655l6186k9876k3596j7610j2136p108k408J954N877R272J2183
$$ 3582835 3540180 3503994 3474118 3450522 3432912 3420776 3413668 3411260 3413214 3419091 3428363 3440546
59576C440546J4833J7346J9392K0479K0884K1862K4484K8596L3307L8170M3363
$$ 3440546 3455379 3472725 3492117 3512596 3533480 3555342 3579826 3608422 3641729 3679899 3723262
59565C723262M9111N5582O3053P1526Q0415Q9380R9197J10882J24152J37784J51439
$$ 3723262 3772373 3827955 3891008 3962534 4042949 4132329 4231526 4342408 4466560 4604344 4755783
59554D755783J66003J81942J98420K14437K29848K44733K58568K70618K80419
$$ 4755783 4921786 5103728 5302148 5516585 5746433 5991166 6249734 6520352 6800771
59545F800771K87481K91178K91475K89063K84292K76685K66054K53344K39641
$$ 6800771 7088252 7379430 7670905 7959968 8244260 8520945 8786999 9040343 9279984
59536I279984K24814K08007J89042J68767J48503J29841J14583J03834R7156R3264
$$ 9279984 9504798 9712805 9901847 10070614 10219117 10348958 10463541 10567375 10664531 10757795
59526A0757795R1684R3205R8617J07329J17190J25401J29594J28426J21271J07564
$$ 10757795 10849479 10942684 11041301 11148630 11265820 11391221 11520815 11649241 11770512 11878076
59516A1878076Q6646N8231K2722j8905o5097j13616j62077k08762k52554k92022
$$ 11878076 11964722 12022953 12045675 12026770 11961673 11848057 11685980 11477218 11224664 10932642
59506A0932642l25314l51225l69804l81640l87111l86566l80597l69642l54034
$$ 10932642 10607328 10256103 9886299 9504659 9117548 8730982 8350385 7980743 7626709
59497G626709l34771l13637k91969k69874k47170k24447k02606j81830j61811
$$ 7626709 7291938 6978301 6686332 6416458 6169288 5944841 5742235 5560405 5398594
59488E398594j42493j23913j05693q7401o9285n1871l4998j7848O8J8400L6439
$$ 5398594 5256101 5132188 5026495 4939094 4869809 4817938 4782940 4765092 4765160 4783560 4819999
59477D819999N3873P1148Q9189J08458J28258J47370J65447J82960J99583K13567
$$ 4819999 4873872 4945020 5034209 5142667 5270925 5418295 5583742 5766702 5966285 6179852
59467F179852K23379K28966K30554K26956K16283J98056J73478J43841J09627
$$ 6179852 6403231 6632197 6862751 7089707 7305990 7504046 7677524 7821365 7930992
59458G930992P1282K9934j2877n5549r6285j33258j65224j91836k13311k29949
$$ 7930992 8002274 8032208 8019331 7963782 7867497 7734239 7569015 7377179 7163868 6933919
59448F933919k41844k48845k50962k48880k43729k36181k26328k14703k02700
$$ 6933919 6692075 6443230 6192268 5943388 5699659 5463478 5237150 5022447 4819747
59439D819747j91397j80524j69245j57505j45873j34497j23179j12251j02458
$$ 4819747 4628350 4447826 4278581 4121076 3975203 3840706 3717527 3605276 3502818
59430C502818r3930q5934p7781o9421o1117n3056m5419l8419l2175k6644k1589
$$ 3502818 3408888 3322954 3245173 3175752 3114635 3061579 3016160 2977741 2945566 2918922 2897333
59419B897333j6604j1424o364j970J916O205J1373J6763K1389K4715K6351K5999
$$ 2897333 2880729 2869305 2862941 2860971 2862887 2869092 2880465 2897228 2918617 2943332 2969683 2995682
59407B995682K4496K4049K6289L0557L5059L9264M4227N0895N9252O8849P9070
$$ 2995682 3020178 3044227 3070516 3101073 3136132 3175396 3219623 3270518 3329770 3398619 3477689
59396C477689Q8970R7933J06721J17067J30118J45772J63374J82482K03165K26281
$$ 3477689 3566659 3664592 3771313 3888380 4018498 4164270 4327644 4510126 4713291 4939572
59386D939572K53195K84395L18577L53819L89417M25608M61695M95486N24562
$$ 4939572 5192767 5477162 5795739 6149558 6538975 6964583 7426278 7921764 8446326
59377H446326N47230N62278N68865N67011N57416N40677N17234M88168M55242
$$ 8446326 8993556 9555834 10124699 10691710 11249126 11789803 12307037 12795205 13250447
59368A3250447M20026L83428L46026L08185K69848K30913J91666J52281J11972
$$ 13250447 13670473 14053901 14399927 14708112 14977960 15208873 15400539 15552820 15664792
59359A5664792O9551K4834k1128o7025j11752j54070j92708k26962k56569k81226
$$ 15664792 15734343 15759177 15738049 15671024 15559272 15405202 15212494 14985532 14728963 14447737
59349A4447737l00997l17005l30704l42561l52315l60330l67655l74755l81226
$$ 14447737 14146740 13829735 13499031 13156470 12804155 12443825 12076170 11701415 11320189
59340A1320189l86737l91137l93661l93249l89826l84161l76316l65505l51777
$$ 11320189 10933452 10542315 10148654 9755405 9365579 8981418 8605102 8239597 7887820
59331G887820l36458l20431l03146k84026k63805k43739k24334k05612j87803
$$ 7887820 7551362 7230931 6927785 6643759 6379954 6136215 5911881 5706269 5518466
59322E518466j71036j54962j39304j24313j10206r6743q3769p1471n9713m7820
$$ 5518466 5347430 5192468 5053164 4928851 4818645 4721902 4638133 4566662 4506949 4459129
59312D459129l5629k4044j3958n170L075J0931J7904K3545K7792L0903L3300L5015
$$ 4459129 4423500 4399456 4385498 4380328 4383403 4394334 4412238 4435783 4463575 4494478 4527778 4562793
59300D562793L5234L3103K9148K5085K1901J9012J5692J2359R845Q340P879R088
$$ 4562793 4598027 4631130 4660278 4685363 4707264 4726276 4741968 4754327 4764172 4772512 4780391 4789479
59288D789479J2468J7369K2633K8076L4650M3294N4042O6015P7931Q8869R8900
$$ 4789479 4801947 4819316 4841949 4870025 4904675 4947969 5002011 5068026 5145957 5234826 5333726
59277E333726J08615J17901J25655J30888J33410J33161J29672J22664J12326
$$ 5333726 5442341 5560242 5685897 5816785 5950195 6083356 6213028 6335692 6448018
59268F448018R8487Q0377N8098L3632R557j2703l2703m9852o3615p4339q2716
$$ 6448018 6546505 6626882 6684980 6718612 6728169 6715466 6682763 6632911 6569296 6494957 6412241
59257F412241q8536r0932q9790q6042q0707p4498o8239o2675n7762n2907m8098
$$ 6412241 6323705 6232773 6142983 6056941 5976234 5901736 5833497 5770822 5713060 5660153 5612055
59246E612055m4005m0881l8032l4665l0637k6102k0894j4513o383M069J7139L2498
$$ 5612055 5568050 5527169 5489137 5454472 5423835 5397733 5376839 5362326 5355943 5360012 5377151 5409649
59234E409649M9538O8238Q9342J13431J40212J68935J99105K30299K61450K90854
$$ 5409649 5459187 5527425 5616767 5730198 5870410 6039345 6238450 6468749 6730199 7021053
59224G021053L16810L37897L52469L58449L54110L38890L13095K76892K30195
$$ 7021053 7337863 7675760 8028229 8386678 8740788 9079678 9392773 9669665 9899860
59215I899860J73674J09400M0348l0372r9635j64443k22648k73260l15554l48298
$$ 9899860 10073534 10182934 10223282 10192910 10093275 9928832 9706184 9432924 9117370 8769072
59205H769072l70559l82910l86988l84055l74851l60668l43474l24670l04648
$$ 8769072 8398513 8015603 7628615 7244560 6869709 6509041 6165567 5840897 5536249
59196E536249k83760k62923k42920k23921k06076j89863j75379j61933j48913
$$ 5536249 5252489 4989566 4746646 4522725 4316649 4126786 3951407 3789474 3640561
59187C640561j36496j25099j14684j05033r6255q8469q1404p4708o8331o2251
$$ 3640561 3504065 3378966 3264282 3159249 3062994 2974525 2893121 2818413 2750082 2687831
59177B687831n6280n0433m5031m0091l5135k9914k4735j9712j4373q575l163J016
$$ 2687831 2631551 2581118 2536087 2495996 2460861 2430947 2406212 2386500 2372127 2363552 2360389 2361405
59165B361405M281P592J1292J5058J8813K2779K6780L0369L3687L7508M2197M7132
$$ 2361405 2365686 2373278 2384570 2399628 2418441 2441220 2468000 2498369 2532056 2569564 2611761 2658893
59153B658893N1389N4664N7304N9695O1926O3892O5407O6106O5407O2946N9089
$$ 2658893 2710282 2764946 2822250 2881945 2943871 3007763 3073170 3139276 3204683 3267629 3326718
59142C326718N4690N0074M4659L7847L0021K2228J5179R092M146L80k607n044
$$ 3326718 3381408 3431482 3476141 3513988 3544009 3566237 3581416 3590508 3594654 3595034 3592427 3587383
59130C587383o315n685l552r42K142O780J3418K1303K9823L9275M9849O1003P2337
$$ 3587383 3581068 3575383 3571831 3570889 3573031 3579811 3593229 3614532 3644355 3683630 3733479 3794482 3866819
59117C866819Q4081R6173J07977J19495J31764J45183J58582J70886J82692J95004
$$ 3866819 3950900 4047073 4155050 4274545 4406309 4551492 4710074 4880960 5063652 5258656
59107E258656K07086K16873K22957K24979K22454K14457K00493J80787J55759
$$ 5258656 5465742 5682615 5905572 6130551 6353005 6567462 6767955 6948742 7104501
59098G104501J25886R2081N5627J7876j9676n5389q8076j17308j42769j63917
$$ 7104501 7230387 7322468 7378095 7395971 7376295 7320906 7232830 7115522 6972753 6808836
59088F808836j80772j94246k04975k12453k16169k16981k16348k14679k11461
$$ 6808836 6628064 6433818 6228843 6016390 5800221 5583240 5366892 5152213 4940752
59079D940752k06644k00782j94031j86123j77374j68710j60586j52667j44610
$$ 4940752 4734108 4533326 4339295 4153172 3975798 3807088 3646502 3493835 3349225
59070C349225j36532j28622j20949j13701j07064j00884r4864q8937q3106p7202
$$ 3349225 3212693 3084071 2963122 2849421 2742357 2641473 2546609 2457672 2374566 2297364
59060B297364p1362o6353o2704n9731n6220n1919m7732m4452m2026m0061l8387
$$ 2297364 2226002 2159649 2096945 2037214 1980994 1929075 1881343 1836891 1794865 1754804 1716417
59049A716417l6987l5777l4548l2985l0954k8891k7497k6738k5694k3808k1659
$$ 1716417 1679430 1643653 1609105 1576120 1545166 1516275 1488778 1462040 1436346 1412538 1390879
59038A390879j9946j8356j6267j3844j1479q735n033j092J639K997M371O749R517
$$ 1390879 1370933 1352577 1336310 1322466 1310987 1302252 1297219 1296127 1297766 1300763 1305134 1311883 1321400
59025A321400J1482J2239J2130J1559J0793R988R024P600N681L661J950O92j03
$$ 1321400 1332882 1345121 1357251 1368810 1379603 1389591 1398615 1406215 1411896 1415557 1417507 1418199 1418096
59012A418096m47l57J53J025K072L143M364N820O995P212O739O591O923O593N001
$$ 1418096 1417649 1417292 1417445 1418470 1420542 1423685 1428049 1433869 1440864 1448076 1454815 1461406 1468329 1474922 1479923
58997A479923L369L123L802L716K324P35M9K67Q40J412J922K585L766N431O992
$$ 1479923 1483292 1486415 1490217 1493933 1496257 1496992 1497041 1497308 1498148 1499560 1501482 1504067 1507833 1513264 1520256
58982A520256Q066Q995J0076J0943J1299J1656J2486J3316J3635J4035J5373J7350
$$ 1520256 1528322 1537317 1547393 1558336 1569635 1581291 1593777 1607093 1620728 1634763 1650136 1667486
58970A667486J9044K0445K2132K3907K5104K5989K7399K9150L0256L0669L1335
$$ 1667486 1686530 1706975 1729107 1753014 1778118 1804107 1831506 1860656 1890912 1921581 1952916
58959A952916L2399L2814L2200L1692L2437L4243L6297L8279M0218M2027M3760
$$ 1952916 1985315 2018129 2050329 2082021 2114458 2148701 2184998 2223277 2263495 2305522 2349282
58948B349282M5869M8861N2959N8104O3833O9361P4377P9617Q5978R3351J00967
$$ 2349282 2395151 2444012 2496971 2555075 2618908 2688269 2762646 2842263 2928241 3021592 3122559
58937C122559J08630J16733J25414J34676J44954J56632J69266J82441J96930
$$ 3122559 3231189 3347922 3473336 3608012 3752966 3909598 4078864 4261305 4458235
58928D458235K13773K32553K52146K72856K96194L22494L50586L79994M11728
$$ 4458235 4672008 4904561 5156707 5429563 5725757 6048251 6398837 6778831 7190559
58919G190559M46444M83381N21682N61137O00940O39119O73986P04722P29687
$$ 7190559 7637003 8120384 8642066 9203203 9804143 10443262 11117248 11821970 12551657
58910A2551657P45432P48463P37008P10289O67159O06619N29039M36114L30339
$$ 12551657 13297089 14045552 14782560 15492849 16160008 16766627 17295666 17731780 18062119
58901A8062119K15332R5908k3028j37494k44150l40028m23143m92693n48180n89055
$$ 18062119 18277451 18373359 18350331 18212837 17968687 17628659 17205516 16712823 16164643 15575588
58891A5575588o15580o29178o31473o23921o08716n88827n66339n41657n14926
$$ 15575588 14960008 14330830 13699357 13075436 12466720 11877893 11311554 10769897 10254971
58882A0254971m87210m59552m32073m05012l79632l56933l36310l16561k97581
$$ 10254971 9767761 9308209 8876136 8471124 8091492 7734559 7398249 7081688 6784107
58873F784107k79956k63577k47874k32897k18983k05669j92073j78271j65288
$$ 6784107 6504151 6240574 5992700 5759803 5540820 5335151 5143078 4964807 4799519
58864D799519j53731j43299j33477j24004j14654j05318r6345q8266q1046p4029
$$ 4799519 4645788 4502489 4369012 4245008 4130354 4025036 3928691 3840425 3759379 3685350
58854C685350o6619n8778n1022m4018l7958l2129k5510j7900j0029k437N047J2512
$$ 3685350 3618731 3559953 3508931 3464913 3426955 3394826 3369316 3351416 3341387 3338950 3343997 3356509
58842C356509J9469K5670L1779L8573M5986N3520O1101O8949P7103Q5650R5037
$$ 3356509 3375978 3401648 3433427 3472000 3517986 3571506 3632607 3701556 3778659 3864309 3959346
58831C959346J05578J16877J28291J39759J51849J65293J80672J98165K17311
$$ 3959346 4064924 4181801 4310092 4449851 4601700 4766993 4947665 5145830 5363141
58822E363141K37449K58654K81754L07326L35259L65545L98588M34333M71830
$$ 5363141 5600590 5859244 6140998 6448324 6783583 7149128 7547716 7982049 8453879
58813H453879N10188N49210N88439O26232O60328O88784P09594P20069P17322
$$ 8453879 8964067 9513277 10101716 10727948 11388276 12077060 12786654 13506723 14224045
58804A4224045O99075O63644O09840N37809M49591L48360K37519J20880K910j12123
$$ 14224045 14923120 15586764 16196604 16734413 17184004 17532364 17769883 17890763 17893673 17781550
58794A7781550k20898l20444m07689m80451n38540n82847o13812o31590o37440
$$ 17781550 17560652 17240208 16832519 16352068 15813528 15230681 14616869 13985279 13347839
58785A3347839o33865o23275o07158n86487n62295n35810n08411m81376m55287
$$ 13347839 12713974 12090699 11483541 10897054 10334759 9798949 9290538 8809162 8353875
58776H353875m29865m04779l80418l57486l36165l16104k97051k79072k62340
$$ 8353875 7924010 7519231 7138813 6781327 6445162 6129058 5832007 5552935 5290595
58767E290595k46959k32777k19214k05692j92397j80138j69178j58790j48283
$$ 5290595 5043636 4810859 4591645 4385953 4193556 4013418 3844240 3685450 3537167
58758C537167j37764j27547j17543j07809r8956r1317q4306p7367p0956o5835
$$ 3537167 3399403 3271856 3154313 3046504 2947548 2856231 2771925 2694558 2623602 2557767
58748B557767o1819n8084n4314n0755m7378m3832m0129l6679l3740l1348k9697
$$ 2557767 2495948 2437864 2383550 2332795 2285417 2241585 2201456 2164777 2131037 2099689 2069992
58737B069992k8984k8928k8855k8257k7066k5672k4838k5138k6127k6542k5791
$$ 2069992 2041008 2012080 1983225 1954968 1927902 1902230 1877392 1852254 1826127 1799585 1773794
58726A773794k4769k4705k5666k6780k7535k8121k8757k9298k9482k9216k8621
$$ 1773794 1749025 1724320 1698654 1671874 1644339 1616218 1587461 1558163 1528681 1499465 1470844
58715A470844k7990k7512k6830k5411k3435k1767k0801j9965j8790j7687j7145
$$ 1470844 1442854 1415342 1388512 1363101 1339666 1317899 1297098 1277133 1258343 1240656 1223511
58704A223511j6854j6287j5630j5330j5173j4534j3287j1890j0752j0021r715
$$ 1223511 1206657 1190370 1174740 1159410 1144237 1129703 1116416 1104526 1093774 1083753 1074038
58693A074038r599r207q393p462o550n362l934l041l219l888m108l877m080n321
$$ 1074038 1064439 1055232 1046839 1039377 1032827 1027465 1023531 1020490 1017271 1013383 1009275 1005398 1001318 995997
58679I95997p219q760r072q165o995o419o148n342m171l755m387m961m685m212
$$ 995997 988778 980018 970946 962781 955786 949367 943219 937877 933706 929951 925564 920603 915918 911706
58665I11706m360m706m357l364k506k235k557l350m141m193l451k797k704k394
$$ 911706 907346 902640 898283 894919 892413 890178 887621 884271 880130 875937 872486 869689 866985 864591
58651H64591j014J131L204M968O530P718Q494R352J0538J1547J2109J2903J4546
$$ 864591 863577 864708 867912 872880 879410 887128 895622 904974 915512 927059 939168 952071 966617
58638I66617J6635J8559K0414K2393K4162K5775K8160L1705L5353L8239M1286
$$ 966617 983252 1001811 1022225 1044618 1068780 1094555 1122715 1154420 1189773 1228012 1269298
58627A269298M5843N1658N7673O4036P1762Q0785R0014R9134J09060J20555J33484
$$ 1269298 1315141 1366799 1424472 1488508 1560270 1641055 1731069 1830203 1939263 2059818 2193302
58616B193302J47313J61485J75361J88513K00754K11232K18118K19833K15881
$$ 2193302 2340615 2502100 2677461 2865974 3066728 3277960 3496078 3715911 3931792
58607C931792K05916J89031J65035J35410J01917O5266K6449j1838m6758p7518
$$ 3931792 4137708 4326739 4491774 4627184 4729101 4794367 4820816 4808978 4762220 4684702
58597D684702j04415j26638j42906j53642j60486j64016j63815j60448j55422
$$ 4684702 4580287 4453649 4310743 4157101 3996615 3832599 3668784 3508336 3352914
58588C352914j49335j41811j33303j25077j17340j09135j00269r1724q4026p6721
$$ 3352914 3203579 3061768 2928465 2803388 2686048 2576913 2476644 2384920 2300894 2224173
58578B224173o9674o3330n7551n1698m6162m2254m0263l9051l7897l7271l7404
$$ 2224173 2154499 2091169 2033618 1981920 1935758 1893504 1853241 1814190 1776293 1739022 1701618
58567A701618l7550l7255l7005l7015l6538l5106l3500l2776l3022l3484l3342
$$ 1701618 1664068 1626813 1589808 1552793 1516255 1481149 1447649 1414873 1381851 1348367 1315025
58556A315025l2121k9963k7702k6060k4776k3181k1350j9894j8786j7409j5698
$$ 1315025 1282904 1252941 1225239 1199179 1174403 1151222 1129872 1109978 1091192 1073783 1058085
58545A058085j4194j3001j1696j0282r262q740q297p789p405p068o605o318o532
$$ 1058085 1043891 1030890 1019194 1008912 999650 990910 982613 974824 967419 960351 953746 947428 940896
58532I40896o862o873p012p858q830q847p972p230p133p509q471j0118j1623j1971
$$ 940896 934034 927161 920149 912291 903461 894614 886642 879412 872279 864770 856299 846181 834558 822587
58518H22587j1410j0932j0644r999r209q847q425p043n243m436m594m299l146
$$ 822587 811177 800245 789601 779602 770393 761546 753121 746078 740835 736399 731805 727506 724360
58505G24360k271k290k437k096j576j058k71M47K61o94j303j133p92n12R0P25
$$ 724360 722089 719799 717362 715266 713690 712632 712361 712808 713069 712375 711072 709939 709147 708635 708725 709450
58489G09450N41k82n01K61J035J193J132J076P19L33P54J864K548K436K338K739
$$ 709450 709991 709709 709208 709469 710504 711697 712829 713905 714624 714957 715711 717575 720123 722559 724897 727636
58473G27636L232L665M305M775M369L554L508M004L490J495o98k088k896l265
$$ 727636 730868 734533 738838 743613 747982 751536 755044 759048 762538 764033 763335 761247 758351 755086
58459G55086k890k336k806m127m783m439m496n594o541o530o384o704o589n355
$$ 755086 752196 749860 747054 742927 738144 733705 729209 723615 717074 710544 704160 697456 690867 685512
58445F85512l927l405l536l553l247k512j066O47J560J613J939K944L574L071
$$ 685512 681585 678180 674644 671091 667844 665332 664266 664913 666473 668086 670025 672969 676543 679614
58431F79614K036J195N04l6r3R3m8q0R41K458K818K016J920L292M666M964M997
$$ 679614 681650 682845 683349 683313 683220 683313 683265 683185 684126 686584 689402 691418 693338 696630 701296 706260 711257
58414G11257N525N879N688N930P137Q214Q193P655P330O850N868M926M360L717
$$ 711257 716782 722661 728349 734279 741416 749630 757823 765478 772808 779658 785526 790452 794812 798529
58400G98529K921K534K320J313k11p65k26k33j310j868r23M00J083J717K648K888
$$ 798529 801450 803984 806304 807617 807406 806641 806415 806182 804872 803004 802081 802481 803564 805281 807929 810817
58384H10817K149J836K664L361L026K775L616M693N029N093N384N358N064N797
$$ 810817 812966 814802 817466 820827 823853 826628 830244 834937 839966 845059 850443 855801 860865 866662
58370H66662P748R101Q849Q407Q964R477Q863Q038P976P880P032O495P040P315
$$ 866662 874410 883511 892360 900767 909731 919208 928071 936109 944085 951965 958997 965492 972532 979847
58356I79847O028M190L354L291L169L304L979M203L381K682L120L939M271M626
$$ 979847 985875 990065 993419 996710 999879 1003183 1007162 1011365 1014746 1017428 1020548 1024487 1028758 1033384
58342A033384N240M977L506K553L332M672N279N806P020P988P934P903Q779R688
$$ 1033384 1038624 1043601 1047107 1049660 1052992 1057664 1062943 1068749 1075769 1083757 1091691 1099594 1108373 1118061
58328A118061R957J0569J1944J2587J1676J0745J1004J1343J0849J0790J2090
$$ 1118061 1128018 1138587 1150531 1163118 1174794 1185539 1196543 1207886 1218735 1229525 1241615
58317A241615J3299J3137J2667J2938J2991J2210J1992J2996J3477J2478J1812
$$ 1241615 1254914 1268051 1280718 1293656 1306647 1318857 1330849 1343845 1357322 1369800 1381612
58306A381612J2635J3216J2454J2385J4374J6178J5783J4939J5683J6542J5756
$$ 1381612 1394247 1407463 1419917 1432302 1446676 1462854 1478637 1493576 1509259 1525801 1541557
58295A541557J5116J6874J9502K0378K0067K0334K0506J9535J9110K0918K3245
$$ 1541557 1556673 1573547 1593049 1613427 1633494 1653828 1674334 1693869 1712979 1733897 1757142
58284A757142K3960K4313K6138K8114K8594K9290L2036L4756L4927L4329L5911
$$ 1757142 1781102 1805415 1831553 1859667 1888261 1917551 1949587 1984343 2019270 2053599 2089510
58273B089510L8597L9710L9908M1223M2714M2696M2786M5120M8035M9084M9671
$$ 2089510 2128107 2167817 2207725 2248948 2291662 2334358 2377144 2422264 2470299 2519383 2569054
58262B569054N2169N5223N6693N8216O1815O5127O5323O4765O7229P1539P4543
$$ 2569054 2621223 2676446 2733139 2791355 2853170 2918297 2983620 3048385 3115614 3187153 3261696
58251C261696P7189Q1775Q6362Q8186Q9597R4183J00099J03656J06351J11618
$$ 3261696 3338885 3420660 3507022 3595208 3684805 3778988 3879087 3982743 4089094 4200712
58241D200712J17929J22239J26844J35435J45595J52938J59381J69363J81296
$$ 4200712 4318641 4440880 4567724 4703159 4848754 5001692 5161073 5330436 5511732
58232E511732J91151K00900K14730K30495K43953K57740K76472K97114L14558
$$ 5511732 5702883 5903783 6118513 6349008 6592961 6850701 7127173 7424287 7738845
58223G738845L32637L58306L88974M17701M47021M84704N29500N74875O23582
$$ 7738845 8071482 8429788 8818762 9236463 9683484 10168188 10697688 11272563 11896145
58214A1896145O83959P54893Q29779R12482J013259J131929J262543J411902J594948
$$ 11896145 12580104 13334997 14164776 15077258 16090517 17222446 18484989 19896891 21491839
58205B1491839J815017K069490K372252K747839L205998L747537M392947N176543
$$ 21491839 23306856 25376346 27748598 30496437 33702435 37449972 41842919 47019462
58197D7019462O116162P226859Q566694J0223582J2245125J4631069J7412386
$$ 47019462 53135624 60362483 68929177 79152759 91397884 106028953 123441339
58190A23441339K0653607K4257135K7704067L0000758K9975574K6851500K0817635
$$ 123441339 144094946 168352081 196056148 226056906 256032480 282883980 303701615
58183C03701615J3166929N693807l65092m985832q985624j3007306j6884719j9909655
$$ 303701615 316868544 322562351 322197259 317211427 308225803 295218497 278333778 258424123
58175B58424123k1527998k1708881k0803082j9244825j7390798j5483889j3652940
$$ 258424123 236896125 215187244 194384162 175139337 157748539 142264650 128611710
58168A28611710j1947199j0398052r044426p905091o959392o168157n493308m890313
$$ 128611710 116664511 106266459 97222033 89316942 82357550 76189393 70696085 65805772
58160F5805772m307021l708441l091715k465142j820908j137927m10012L22010
$$ 65805772 61498751 57790310 54698595 52233453 50412545 49274618 48864606 49186616
58152D9186616R46354J289521J194028O42580j79103r74690j535293j868740k137252
$$ 49186616 50132970 51422491 52616519 53259099 53079996 52105306 50570013 48701273 46564021
58143D6564021k471096k846891l135010l234961l147772k939925k676900k399396
$$ 46564021 44092925 41246034 38111024 34876063 31728291 28788366 26111466 23712070
58135B3712070k132201j887801j665421j461846j282595j135465j018502r22929
$$ 23712070 21579869 19692068 18026647 16564801 15282206 14146741 13128239 12205310
58127A2205310q43397p77151p17804o59239o03009n54020n11318m70298m31141
$$ 12205310 11361913 10584762 9866958 9207719 8604710 8050690 7539372 7069074 6637933
58118F637933l97451l68701l41239l14859k91550k69544k45499k21140k01215
$$ 6637933 6240482 5871781 5530542 5215683 4924133 4654589 4409090 4187950 3986735
58109C986735j86064j72310j59527j49907j42533j34317j25807j20090j16561
$$ 3986735 3800671 3628361 3468834 3318927 3176394 3042077 2916270 2796180 2679619
58100B679619j11575j04714r8797r4129q8254q1180p5472p1288o6400o0976n7347
$$ 2679619 2568044 2463330 2364533 2270404 2182150 2100970 2025498 1954210 1887810 1826834 1769487
58089A769487n5165n1692m6951m3802m2771m1440l9075l7429l6735l5240l2986
$$ 1769487 1714322 1662630 1615679 1571877 1529106 1487666 1448591 1411162 1374427 1339187 1306201
58078A306201l1878l1776l0544k8114k6580k6094k4651k2038k0174j9387j8195
$$ 1306201 1274323 1242547 1212003 1183889 1157309 1131215 1106564 1084526 1064352 1044965 1026770
58067A026770j6763j6676j7192j5781j2623j0616j0549j0246q906q283q896r012
$$ 1026770 1010007 993331 976139 960358 947735 937119 926570 916324 907418 899135 890239 881227
58055H81227q202q212r331r523q207p428q184q807q199p567p730p566o385n243
$$ 881227 873025 864813 855482 845959 837752 830324 822140 813333 805134 797567 789837 782271 775886 770643
58041G70643m806m236l172k467k201j284L30J318J406J757K518K409J282O58J105
$$ 770643 765837 761601 758429 755962 753761 752477 752807 754125 755531 757288 759806 762215 763497 764155 765260
58026G65260J464J152R15P73l25k267l488l454l272l433l262k907l430m528m602
$$ 765260 766724 767876 768791 769564 769239 766972 763484 760030 756758 753325 750063 747156 743726 739198 734596
58011G34596l565l128l897m574m484m422m534l850k571k205k850k757j316j1K93
$$ 734596 731031 727903 724006 719432 714948 710526 705992 702142 699571 697366 694516 691759 690443 690432 690725
57996F90725N47J217J290M53p5J57m7j208k181k268k178k056r17J057J956J018
$$ 690725 691272 692489 693779 694232 694157 694314 694267 693059 690878 688610 686432 684376 683459 684516 686472 687490
57980F87490r1O2P67R58R28J144J179Q57P37P04j00j343j512n09r2r54j640j219
$$ 687490 687399 687461 688228 689186 690114 691258 692437 693294 694031 694735 694635 693292 691780 691271 691179 690225 688585 687366
57962F87366p41r82j086n98n98j556k217j968k101l348m296l790k904k930l260
$$ 687366 686625 685643 684557 683959 683361 681805 679588 677620 675519 672171 667875 664085 661181 658251 654991
57947F54991k944k508k537k136m85J508K645L128L452L203K348K057K739K867
$$ 654991 652047 649539 647002 644866 644381 645889 648534 651662 655114 658317 660665 662722 665461 668328
57933F68328J269j003k639m210o575q860r923j0406j1278j1713j0557q763q157
$$ 668328 669597 668594 665955 661745 655170 646310 636387 625981 614703 602990 592433 583670 575513
57920E75513q579q355o993n440m183k895j637q17k04P39J848K731L642M795N538
$$ 575513 566934 558579 551586 546146 541963 539068 537431 536614 536410 537149 538997 541728 545370 550165 555703
57905E55703N387N085N423N857N583N069N137N350M821L869L329K918J913P72
$$ 555703 561090 566175 571598 577455 583038 588107 593244 598594 603415 607284 610613 613531 615444 616216
57891F16216L78J86j140l499n388o068o177o249o074n607n236m997m494l699k971
$$ 616216 616594 616780 615640 612141 606753 600685 594508 588259 582185 576578 571342 566345 561851 558152 555181
57876E55181k333j540p06j08M07J021J401J358J671L171N312O686O778O306N928
$$ 555181 552848 551308 550602 550494 550901 551922 553323 554681 556352 559523 564835 571521 578299 584605 590533
57861E90533N611N280N157N294N346M903L754J980J34j026j377j597k171k811
$$ 590533 596144 601424 606581 611875 617221 622124 625878 627858 627992 626966 625589 623992 621821 619010
57847F19010l259l903m980n867n914n403m991m718m330m008m032m205m273m394
$$ 619010 615751 611848 606868 601001 595087 589684 584693 579975 575645 571637 567605 563400 559127 554733
57833E54733m600m380l527k742k696l144l578m136n055n933o330o461o594o482
$$ 554733 550133 545753 542226 539484 536788 533644 530066 525930 520875 514942 508612 502151 495557 489075
57819D89075o120o193o926p315o538n301m727m683m354l677l082k474j699j301
$$ 489075 482955 476762 469836 462521 455983 450682 445955 441272 436918 433241 430159 427685 425986 424685
57805D24685j602j713p80M80R32J007J858L164L676L717N021P878J0315J0765
$$ 424685 423083 421370 420590 421070 422002 423009 424867 428031 431707 435424 440445 448323 458638 469403
57791D69403J0000R665J0076J0396J0065R293Q506P940P537O992O065M802L332
$$ 469403 479403 489068 499144 509540 519605 528898 537404 545344 552881 559873 565938 570740 574072
57778E74072J709K78l76l69q22k437m316n177n235n782p138q259q281p398o093
$$ 574072 575781 576059 575683 575314 574492 572055 567739 562562 557327 551545 544407 536148 527867 520469 514376
57763E14376m530k867j375m7J246K194K354J913J532J466J481J497J608J654J503
$$ 514376 509846 506979 505604 505557 506803 508997 511351 513264 514796 516262 517743 519240 520848 522502 524005
57748E24005J551K227L157L584L410L082K749K322K082K365K919L344L799M364
$$ 524005 525556 527783 530940 534524 537934 541016 543765 546087 548169 550534 553453 556797 560596 564960
57734E64960M285L057J756J951L414M445M370M273N039O117O676O740O702O711
$$ 564960 569245 572302 574058 576009 579423 583868 588238 592511 597550 603667 610343 617083 623785 630496
57720F30496P053Q169R907J1505J2586J3413J4038J4252J4497J5689J7764J9459
$$ 630496 637549 645718 655625 667130 679716 693129 707167 721419 735916 751605 769369 788828
57708G88828K0121K0730K2555K5572K8811L1527L3574L5262L7390M0826M5566
$$ 788828 808949 829679 852234 877806 906617 938144 971718 1006980 1044370 1085196 1130762
57697A130762N0732N5771O1109O7357P4588Q2756R2098J02676J14083J26068J38874
$$ 1130762 1181494 1237265 1298374 1365731 1440319 1523075 1615173 1717849 1831932 1958000 2096874
57686B096874J52612J66811J80875J94436K06910K17103K23576K25020K20279
$$ 2096874 2249486 2416297 2597172 2791608 2998518 3215621 3439197 3664217 3884496
57677C884496K08789J91263J69430J44935J19142R4014P2141N5081M1946K9556
$$ 3884496 4093285 4284548 4453978 4598913 4718055 4812069 4884210 4939291 4981237 5010793
57667E010793J3623r653m1234p7452j11505j37965j56057j68583j78510j86880
$$ 5010793 5024416 5014763 4973529 4896077 4784572 4646607 4490550 4321967 4143457 3956577
57657C956577j92801j94386j90087j80094j66428j51394j36286j21611j07835
$$ 3956577 3763776 3569390 3379303 3199209 3032781 2881387 2745101 2623490 2515655
57648B515655r5246q3696p3101o3743n5606m7903l9931l1881k4258j6968r558
$$ 2515655 2420409 2336713 2263612 2199869 2144263 2096360 2056429 2024548 2000290 1983322 1973764
57637A973764j943N784J3884K2684L2062M1785N2047O3047P4397Q5677R7256J09824
$$ 1973764 1971821 1977605 1991489 2014173 2046235 2088020 2140067 2203114 2277511 2363188 2460444 2570268
57625B570268J23136J36009J47438J57131J64865J69886J71059J67181J57196
$$ 2570268 2693404 2829413 2976851 3133982 3298847 3468733 3639792 3806973 3964169
57616C964169J40649J18105R0926O0556K8298m452l6166o5521r1517j13386j30644
$$ 3964169 4104818 4222923 4313849 4374405 4402703 4398251 4362085 4296564 4205047 4091661 3961017
57605C961017j43309j51718j56156j56893j54476j49704j43257j35733j27956
$$ 3961017 3817708 3665990 3509834 3352941 3198465 3048761 2905504 2769771 2641815
57596B641815j20786j14387j08061j01104r3735q6886q1133p6179p1418o6680
$$ 2641815 2521029 2406642 2298581 2197477 2103742 2016856 1935723 1859544 1788126 1721446
57586A721446o2147n7807n3460m9223m5558m2611l9876l6830l3572l0523k7846
$$ 1721446 1659299 1601492 1548032 1498809 1453251 1410640 1370764 1333934 1300362 1269839 1241993
57575A241993k5476k3499k1959k0473j8543j6213j4005j2277j0931r742q524p106
$$ 1241993 1216517 1193018 1171059 1150586 1132043 1115830 1101825 1089548 1078617 1068875 1060351 1053245
57563A053245n534m155l149k187r39L67J411K464L901N340O131O607P851J0203
$$ 1053245 1047711 1043556 1040407 1038220 1037281 1037648 1039059 1041523 1045424 1050764 1056895 1063502 1071353 1081556
57549A081556J2918J5412J7929K0777K3820K7077L0948L5458M0063M4572M9483
$$ 1081556 1094474 1109886 1127815 1148592 1172412 1199489 1230437 1265895 1305958 1350530 1400013
57538A400013N5099O1138O7608P5091Q3627R2212J00145J08060J16777J25842
$$ 1400013 1455112 1516250 1583858 1658949 1742576 1834788 1934933 2042993 2159770 2285612
57528B285612J34060J40783J45698J47802J45729J38886J27524J11867R2045O8741
$$ 2285612 2419672 2560455 2706153 2853955 2999684 3138570 3266094 3377961 3470006 3538747
57518C538747M3265J7017q671l2457n3494p1760q7249r9136j06556j09986j11000
$$ 3538747 3582012 3599029 3590358 3557901 3504407 3432647 3345398 3246262 3139706 3029720 2918720
57507B918720j10617j08681j04912r9725r3707q6981p9550p1934o5026n9330n4479
$$ 2918720 2808103 2699422 2594510 2494785 2401078 2314097 2234547 2162613 2097587 2038257 1983778
57496A983778m9607m4280l9022l4581l0808k6797k2281j8062j4574j0898o073
$$ 1983778 1934171 1889891 1850869 1816288 1785480 1758683 1736402 1718340 1703766 1692868 1686795
57485A686795p37L711P242J1275J6628K2490K7804L2672L7968M4253N1536N9599
$$ 1686795 1686058 1689769 1697011 1708286 1724914 1747404 1775208 1807880 1845848 1890101 1941637 2001236
57473B001236O8113P6759Q5584R4935J04816J14615J23498J30852J36129J38601
$$ 2001236 2069349 2146108 2231692 2326627 2431443 2546058 2669556 2800408 2936537 3075138
57463C075138J37318J31218J19467J02204Q0785N6845L1216M351k2425m7053o8315
$$ 3075138 3212456 3343674 3463141 3565345 3646130 3702975 3734191 3738542 3716117 3669064 3600749
57452C600749q6368j01382j12553j19128j21743j21903j20457j17335j12512j06488
$$ 3600749 3514381 3412999 3300446 3181318 3059575 2937672 2817215 2699880 2587368 2480880
57442B480880r9859r3026q6425q0498p5254p0242o5174o0280n5907n1984m8167
$$ 2480880 2381021 2287995 2201570 2121072 2045818 1975576 1910402 1850122 1794215 1742231 1694064
57431A694064m4334m0708l7428l4256l0900k7599k5015k3425k2198k0458j8139
$$ 1694064 1649730 1609022 1571594 1537338 1506438 1478839 1453824 1430399 1408201 1387743 1369604
57420A369604j6015j4646j3700j2528j1050r709q797q154p509o735n759m514l116
$$ 1369604 1353589 1338943 1325243 1312715 1301665 1291956 1283159 1275005 1267496 1260761 1255002 1250488 1247372
57407A247372j943j361j384j607j485p69K95J164J551J721K156K944L714M212
$$ 1247372 1245429 1244068 1242684 1241077 1239592 1238823 1239118 1240282 1241833 1243554 1245710 1248654 1252368 1256580
57393A256580M717N661O905P746P706P123O703O665O622O318O087O396P144P724
$$ 1256580 1261297 1266958 1273863 1281609 1289315 1296438 1303141 1309806 1316428 1322746 1328833 1335229 1342373 1350097
57379A350097P759P516P495P817Q102P937P302O535N999N885O293P201Q305R074
$$ 1350097 1357856 1365372 1372867 1380684 1388786 1396723 1404025 1410560 1416559 1422444 1428737 1435938 1444243 1453317
57365A453317R165Q723Q115P589P329P675Q767J0111J0918J1011J1006J1361J1769
$$ 1453317 1462482 1471205 1479320 1486909 1494238 1501913 1510680 1520791 1531709 1542720 1553726 1565087 1576856
57352A576856J1767J1540J1659J2155J2379J1878J1016J0571J0904J1681J2336
$$ 1576856 1588623 1600163 1611822 1623977 1636356 1648234 1659250 1669821 1680725 1692406 1704742
57341A704742J2614J2720J2902J3156J3394J3701J4149J4467J4318J3967J4166
$$ 1704742 1717356 1730076 1742978 1756134 1769528 1783229 1797378 1811845 1826163 1840130 1854296
57330A854296J5093J5861J5530J4278J3111J2607J2577J2856J3676J4951J5822
$$ 1854296 1869389 1885250 1900780 1915058 1928169 1940776 1953353 1966209 1979885 1994836 2010658
57319B010658J5522J4504J4136J5173J6952J8292J8790J8927J9119J9287J9368
$$ 2010658 2026180 2040684 2054820 2069993 2086945 2105237 2124027 2142954 2162073 2181360 2200728
57308B200728J9675K0406K1179K1534K1626K2004K2797K3682K4518K5525K6823
$$ 2200728 2220403 2240809 2261988 2283522 2305148 2327152 2349949 2373631 2398149 2423674 2450497
57297B450497K8268K9754L1234L2451L3200L3828L4974L6667L8370L9960M1865
$$ 2450497 2478765 2508519 2539753 2572204 2605404 2639232 2674206 2710873 2749243 2789203 2831068
57286B831068M4045M5714M6506M7099M8059M8865M8794M8143M7570M6740M4605
$$ 2831068 2875113 2920827 2967333 3014432 3062491 3111356 3160150 3208293 3255863 3302603 3347208
57275C347208M0820L6026L0815K5345J9811J4571R697N180J489p78j847k590l334
$$ 3347208 3388028 3424054 3454869 3480214 3500025 3514596 3524293 3529473 3530962 3530184 3528337 3525747 3522413
57262C522413l481k585j074L41J408K218K894L634M643N755O581P167Q072R542
$$ 3522413 3518932 3516347 3515273 3515614 3517022 3519240 3522134 3525768 3530411 3536166 3542747 3549914 3557986 3567528
57248C567528J1052J1948J2205J2289J2620J3365J4551J6100J7911J9896K1787
$$ 3567528 3578580 3590528 3602733 3615022 3627642 3641007 3655558 3671658 3689569 3709465 3731252
57237C731252K3080K3545K3618K3815K3916K3349K2300K1563K1283K0762J9867
$$ 3731252 3754332 3777877 3801495 3825310 3849226 3872575 3894875 3916438 3937721 3958483 3978350
57226C978350J9530K0328K1440K1885K2075K3145K5107K6811K7565K7742K7703
$$ 3978350 3997880 4018208 4039648 4061533 4083608 4106753 4131860 4158671 4186236 4213978 4241681
57215D241681K7127K5842K4579K4124K4229K3929K2849K1670K1305K1978K3260
$$ 4241681 4268808 4294650 4319229 4343353 4367582 4391511 4414360 4436030 4457335 4479313 4502573
57204D502573K4682K6026K7220K8178K8885K9444K9973L0461L0792L0816L0484
$$ 4502573 4527255 4553281 4580501 4608679 4637564 4667008 4696981 4727442 4758234 4789050 4819534
57193D819534K9960K9577K9436K9138K8209K6877K5992K5921K5996K5420K4389
$$ 4819534 4849494 4879071 4908507 4937645 4965854 4992731 5018723 5044644 5070640 5096060 5120449
57182E120449K3741K3753K3894K3676K3177K2685K2397K2522K3166K3903K3934
$$ 5120449 5144190 5167943 5191837 5215513 5238690 5261375 5283772 5306294 5329460 5353363 5377297
57171E377297K2920K1304J9725J8477J7608J7103J6658J5756J4248J2572J1125
$$ 5377297 5400217 5421521 5441246 5459723 5477331 5494434 5511092 5526848 5541096 5553668 5564793
57160E564793R754Q223O814O058N827N115K892q89n182q802j1460j3762j6269
$$ 5564793 5574547 5582770 5589584 5595642 5601469 5606584 5609476 5608587 5603405 5594603 5583143 5569381 5553112
57147E553112j8807k0849k2146k2680k2381k1361k0097j8888j7384j5285j3149
$$ 5553112 5534305 5513456 5491310 5468630 5446249 5424888 5404791 5385903 5368519 5353234 5340085
57136E340085j1694j0608r004p147o670q811j3279j9036k5361l1698l7312m1681
$$ 5340085 5328391 5317783 5308779 5301632 5294962 5286151 5272872 5253836 5228475 5196777 5159465 5117784
57124E117784m4647m5829m4558m0795l5508k9743k4002j8826j5092j3066j1735
$$ 5117784 5073137 5027308 4982750 4941955 4906447 4876704 4852702 4833876 4818784 4805718 4793983
57113D793983r837p072l799r1M294R533J6092K5041L7414N3453P2977R6289J24451
$$ 4793983 4784146 4777074 4773275 4773184 4777478 4787011 4803103 4828144 4865558 4919011 4991988 5088277 5212728
57100E212728J58956K01295K52460L12715L82279M61905N52047O51762P59633
$$ 5212728 5371684 5572979 5825439 6138154 6520433 6982338 7534385 8186147 8945780
57091H945780Q75401R98767J126301J251243J366312J464583J537950J578409
$$ 8945780 9821181 10819948 11946249 13197492 14563804 16028387 17566337 19144746
57083A9144746J581742J546392J468827J348211J200401J057573R38665Q18401
$$ 19144746 20726488 22272880 23741707 25089918 26290319 27347892 28286557 29104958
57075B9104958O38510L59813K444l66801o81620r10216j056062j141222j190316
$$ 29104958 29743468 30103281 30105725 29738924 29057304 28147088 27091026 25949804 24759488
57066B4759488j219037j228986j213210j167905j097567j010022r11501q08779
$$ 24759488 23540451 22311465 21098255 19930350 18832783 17822761 16911260 16102481
57058A6102481p12123o31596n70761n25968m91067m61386m34374m09223l86692
$$ 16102481 15390358 14758762 14188001 13662033 13170966 12709580 12275206 11865983 11479291
57049A1479291l68295l55034l46946l43366l43067l44423l45946l46512l44970
$$ 11479291 11110996 10755962 10409016 10065650 9722583 9378160 9032214 8685702 8340732
57040H340732l40274l32394l22601l12404l02753k94416k88202k84038k80613
$$ 8340732 8000458 7668064 7345463 7033059 6730306 6435890 6147688 5863650 5583037
57031E583037k76762k72789k69574k66926k63674k58924k52385k43734k32804
$$ 5583037 5306275 5033486 4763912 4496986 4233312 3974388 3722003 3478269 3245465
57022C245465k20339k07641j95277j82829j69958j56989j44332j31988j19929
$$ 3245465 3025126 2817485 2622208 2439379 2269421 2112432 1968100 1836112 1716183
57013A716183j08403r7645q7681p8434o9600o0469n0552m0352l0770k1614j1519
$$ 1716183 1607780 1510135 1422454 1344020 1274420 1213951 1163399 1123047 1092277 1070663 1059144
57002A059144M23J3921K8808M6071O6452Q8106J06183J14693J09138Q9063N9354
$$ 1059144 1059567 1073488 1102296 1148367 1214819 1302925 1409108 1523801 1632939 1722002 1781356
56991A781356K8088J161k1445m3264o5457q4615r6451j00117r8095r3157q6761
$$ 1781356 1809444 1810605 1789160 1745896 1680439 1595824 1499373 1399256 1301161 1208004 1121243
56980A121243p9738p2922o6722o0848n5012m9567m5229m2237l9952l7385l4139
$$ 1121243 1041505 968583 901861 841013 786001 736434 691205 648968 609016 571631 537492
56969E37492l0684k7474k4066j9692j4563r903o460l690p57K361N222P705R655
$$ 537492 506808 479334 455268 435576 421013 411110 404650 400960 400203 402564 407786 415491 425146
56956D25146J0287Q826N606J893j303l758n683p468r531j1764j3276j3325j2345
$$ 425146 435433 444259 449865 451758 450455 446697 441014 433546 424015 412251 398975 385650 373305
56943C73305j1347j0498r099o885m379j880R68M294P536J0262J2759J5304J7305
$$ 373305 361958 351460 342361 335476 331097 329217 330185 334479 342015 352277 365036 380340 397645
56930C97645J7643J5630J1437O008P01l528o811r902j2907j5159j6402j7275j8149
$$ 397645 415288 430918 442355 448363 449064 445536 438725 428823 415916 400757 384355 367080 348931
56917C48931j8322j7061j4817j2639j0806q877o855n475n214n672o040n832n041
$$ 348931 330609 313548 298731 286092 275286 266409 259554 254079 248865 243193 237153 231321 226280
56904B26280l932k879k151j765j487r76KJ342K596L455M151N106O272P325Q409
$$ 226280 222348 219469 217318 215553 214066 213090 213092 214434 217030 220485 224636 229742 236014 243339 251748
56889B51748J0095J2458J4880J6889J8423J8993J7521J3804R384O077M061K154
$$ 251748 261843 274301 289181 306070 324493 343486 361007 374811 384195 390272 394333 396487
56877C96487l48k965m919n805n423l737j185J564M252P042R975J2910J6001J9696
$$ 396487 396139 393174 388255 382450 377027 373290 372105 373669 377921 384963 394938 407848 423849 443545
56863D43545K4171K9044L3591L6838L7583L4959K9155K1370J3060N366j075o308
$$ 443545 467716 496760 530351 567189 604772 639731 668886 690256 703316 708682 707607 701299
56851G01299j0940j5362j9087k1173k1100j8916j4962r908m707K75N767J2532
$$ 701299 690359 674997 655910 634737 613637 594721 579759 569851 565144 565419 571186 583718
56839E83718K0114K7567L5112M3753N3025O0215O2383N8380M8814L5250K0110
$$ 583718 603832 631399 666511 710264 763289 823504 885887 944267 993081 1028331 1048441
56828A048441O229m832j3841k2514l1209l8564m3022m4101m2308l8531l3611k8011
$$ 1048441 1054670 1049838 1035997 1013483 982274 943710 900688 856587 814279 775748 742137 714126
56816G14126k1744j4778p401j2P256J4419K1382K7988L3972L8303L8868L3782
$$ 714126 692382 677604 670203 670191 677447 691866 713248 741236 775208 813511 852379 886161
56804H86161K3424J0767p28r573j6543k2982k9265l4791l8830m0871m0508l7665
$$ 886161 909585 920352 919624 910051 893508 870526 841261 806470 767640 726769 686261 648596
56792F48596l3098k8184k3767j9512j4683r285l959R75N771J0524J4662J7261
$$ 648596 615498 587314 563547 544035 529352 520067 516108 517083 522854 533378 548040 565301
56780E65301J7526J5000R880L308l159q564j2938j6642j9797k2380k4392k5631
$$ 565301 582827 597827 607707 611015 607856 599292 586354 569712 549915 527535 503143 477512
56768D77512k5750k4786k3348k1922k0332j8154j5479j2975j1329j0735j0754
$$ 477512 451762 426976 403628 381706 361374 343220 327741 314766 303437 292702 281948
56757B81948j0520r338p293n151l643l020l188l830m346m163l373k666k496k679
$$ 281948 271428 262090 254797 249646 246003 242983 239795 235965 231619 227456 224083 221417 218921 216242
56743B16242k976l458l992m016l332k638k657l096l102k514j953j852k022k178
$$ 216242 213266 209808 205816 201800 198468 195830 193173 190077 186975 184461 182508 180656 178634 176456
56729A76456k290k360k355k440k794l177l093k464j734j191p14k85j81m36n18
$$ 176456 174166 171806 169451 167011 164217 161040 157947 155483 153749 152558 151844 151559 151378 150942 150424
56714A50424J3Q33J277J179R02O49K74k51n82m13R0N16O37N17K94J38K99Q61J503
$$ 150424 150437 151270 152547 153726 154628 155277 155551 155300 154718 154305 154395 154911 155548 156065 156359 156497 156796 157657 159160
56695A59160J757J636J636J954K026J188l15j397j258j59R88J606J867K269K909
$$ 159160 160917 162553 164189 166143 168169 169357 169042 167645 166387 166228 167216 168822 170689 172958 175867
56680A75867L266K756J552N66M87R95J252R39M52J30j42n36r50j286j676k182
$$ 175867 179133 181889 183441 184007 184494 185489 186741 187680 188132 188262 188120 187584 186634 185348 183672 181490
56664A81490k509k339j765j233j114j429j839j885j450r86j068j631k041j942
$$ 181490 178981 176642 174877 173644 172530 171101 169262 167377 165927 164941 163873 162242 160201 158259
56650A58259j732j954k514k872k742k337j993j807j651j406j135r97r74p67k14
$$ 158259 156527 154573 152059 149187 146445 144108 142115 140308 138657 137251 136116 135119 134145 133378 133164
56635A33164L63N35M69P70J556K124J848J029N35P73J346J554J031M3o76n45K53
$$ 133164 133527 134062 134531 135301 136857 138981 140829 141858 142393 143166 144512 146066 147097 147140 146464 145919 146172
56618A46172R15Q82L62j48m92p84r99r70p11m44l00k39k34l55o08p83n58R6P33
$$ 146172 147087 147969 148331 148183 147691 146907 145908 144938 144227 143783 143483 143244 143010 142655 142047 141264 140706 140802 141535
56599A41535Q09L63L5J69K97j31q30j055p29m13k83J27R46J527J375Q89P98J245
$$ 141535 142344 142707 142742 142911 143208 143077 142247 141192 140463 140050 139767 139894 140840 142367 143742 144631 145429 146674
56581A46674J783J921J452O33K20P69J766K022J244N02O78J278J335R37R30J579
$$ 146674 148457 150378 151830 152463 152683 153452 155218 157240 158484 158986 159664 160942 162277 163214 164144 165723
56565A65723K303K639K682K635K529K433K542K922L412L672L316K313J366J380
$$ 165723 168026 170665 173347 175982 178511 180944 183486 186408 189820 193492 196808 199121 200487 201867
56551B01867K276K894K499J714J408J331P42j23l55P2R7q45k016k415j971j303
$$ 201867 204143 207037 209536 211250 212658 213989 214731 214608 214253 214325 214422 213577 211561 209146 207175 205872
56535B05872q51o78p85j175j658j840j465p53k97l84n62k00M69N04l74j264j368
$$ 205872 205021 204343 203558 202383 200725 198885 197420 196667 196370 195986 195424 195224 195693 196197 195823 194559 193191
56518A93191j138j378j841j656q55m59r53j630j668j209r39j124j418j486j440
$$ 193191 192053 190675 188834 187178 186323 185864 184911 183281 181613 180404 179465 178341 176923 175437 173997
56503A73997j597j862j564k91J132J228k81j816j768m21O55O85K86J41K07K59
$$ 173997 172400 170538 168974 168683 169815 171043 170762 168946 167178 166757 167412 168097 168383 168524 168731 168990
56487A68990M06P30J049J275J559J827J720J240R92J473K376K970K976K797K880
$$ 168990 169396 170126 171175 172450 174009 175836 177556 178796 179788 181261 183637 186607 189583 192380 195260
56472A95260L093K959K459K195K507K815K444J836K101L317M333M463M319M477
$$ 195260 198353 201312 203771 205966 208473 211288 213732 215568 217669 220986 225319 229782 234101 238578
56458B38578M471L907L488L840M216L589K337J532J104J64j166j759j264n43k20
$$ 238578 243049 246956 250444 254284 258500 262089 264426 265958 267062 267226 266060 264301 263037 262494 262274
56443B62274j15j66p23j607k084j974j854j903j614r01m14l79k11L75P61M48j89
$$ 262274 262159 261993 261270 259663 257579 255605 253751 251848 250234 249333 248919 248540 248329 248704 249465 249913 249724
56426B49724o52r60j159r66m69l72j023j815k070j888j689j519j346j439j852
$$ 249724 249072 248112 246953 245987 245518 245146 244123 242308 240238 238350 236661 235142 233796 232357 230505
56411B30505k020j443m28K75L36qm09o96r52j370j893k011j368m70k55q83j495
$$ 230505 228485 227042 226614 226889 227225 227217 226808 226112 225160 223790 221897 219886 218518 218048 217793 216910 215415
56394B15415j287l39O12Q26K5j244j839j170R7J019J643K451K925K072K62p73
$$ 215415 214128 213789 214401 215227 215252 214008 212169 210999 211096 212115 213758 216209 219134 221206 221468 220695
56378B20695j60J105J717J549J104N93J68K69J015J878K378K565K577K366K031
$$ 220695 220535 221640 223357 224906 226010 226603 226771 227040 228055 229933 232311 234876 237453 239819 241850
56363B41850J766J353N71mL28R16L89j080j672o18O40P54M35R64K077K773L103
$$ 241850 243616 244969 245540 245536 245864 246780 247169 246089 244417 243799 244439 245193 245628 246592 248669 251442 254545
56346B54545L678M182L851K981K573K788K954K926L226L888M247M005L712L966
$$ 254545 258223 262405 266256 269237 271810 274598 277552 280478 283704 287592 291839 295844 299556 303522
56332C03522M740N566N990N878N550N486N734N847N630N447N622O095O877Q212
$$ 303522 308262 313828 319818 325696 331246 336732 342466 348313 353943 359390 365012 371107 377984 386196
56318C86196R797J0611J0045Q761P845P598P538P094N867L830J701N88P26J128
$$ 386196 395993 406604 416649 425410 433255 440853 448391 455485 461352 465182 466883 467471 468197 469325
56304D69325Q10j48j104j669j648r68j30P3k83k40N03J109J179J607K973M281
$$ 469325 470135 469987 468883 467214 465566 464598 464468 464541 464258 464018 464521 465630 466809 468416 471389 475670
56288D75670M515M405N303P058Q453R297J0543J2491J4227J5050J5427J6248J7829
$$ 475670 480185 484590 489893 496951 505404 514701 525244 537735 551962 567012 582439 598687 616516
56275F16516J9856K1870K3797K6102K9217L2698L5589L7916M1017M5874N1854
$$ 616516 636372 658242 682039 708141 737358 770056 805645 843561 884578 930452 982306
56264I82306N7818O3655P0007P7115Q4870R3401J02723J12170J20966J28995J36391
$$ 982306 1040124 1103779 1173786 1250901 1335771 1429172 1531895 1644065 1765031 1894026 2030417
56253B030417J42852J47998J51891J54508J55176J53135J48093J39807J27868
$$ 2030417 2173269 2321267 2473158 2627666 2782842 2935977 3084070 3223877 3351745
56244C351745J12622R5512P7844N9917M2043K5336J0516l049j6060k7899l7637
$$ 3351745 3464367 3559879 3637723 3697640 3739683 3765019 3775535 3772486 3756426 3728527 3690890
56233C690890m5593n2580n8424o2523o5362o8092p1115p4241p7746q1929q6127
$$ 3690890 3645297 3592717 3534293 3471770 3406408 3338316 3267201 3192960 3115214 3033285 2947158
56222B947158q9473r2212r5051r7654r9213r9988j00778j01126r9707r6460r2815
$$ 2947158 2857685 2765473 2670422 2572768 2473555 2373567 2272789 2171663 2071956 1975496 1882681
56211A882681q9661q6417q2420p7908p3320o8634o3883n9450n5527n1827m8054
$$ 1882681 1793020 1706603 1624183 1546275 1472955 1404321 1340438 1280988 1225461 1173634 1125580
56200A125580m4195m0314l6587l3375l0844k8646k6433k4352k2589k0789j8582
$$ 1125580 1081385 1041071 1004484 971109 940265 911619 885186 860834 838245 817456 798874
56189G98874j6186j4010j1992r936q034o532n341m424l909l398j995L73K630M085
$$ 798874 782688 768678 756686 746750 738716 732184 726843 722419 718510 715112 713117 713490 716120 720205
56175G20205N380P140Q858R900J0477J0734J0148Q865Q285Q966R313P852N564
$$ 720205 725585 732725 741583 751483 761960 772694 782842 791707 799992 808958 818271 826123 831687
56162H31687M248L747K771J479J125J688J929J554J511K244L299M493O142Q244
$$ 831687 835935 839682 842453 843932 845057 846745 848674 850228 851739 853983 857282 861775 867917 876161
56148H76161J0654J3625J7144K0389K3061K6412L1703L8524M6043N4797O5566
$$ 876161 886815 900440 917584 937973 961034 987446 1019149 1057673 1103716 1158513 1224079
56137A224079P7520Q9316J01019J12908J23313J29825J32016J31030J27309J21004
$$ 1224079 1301599 1390915 1491934 1604842 1728155 1857980 1989996 2121026 2248335 2369339
56127B369339J13907J08305J04025R8752R1150Q1715P0945N8910M6501L5060K4717
$$ 2369339 2483246 2591551 2695576 2794328 2885478 2967193 3038138 3097048 3143549 3178609 3203326
56116C203326J4688M785n034j5955k9098m3555n7482p0416q2564r2805r9763j04076
$$ 3203326 3218014 3222799 3217765 3201810 3172712 3129157 3071675 3001259 2918695 2825890 2726127 2622051
56104B622051j07105j08231j06104j01682r7115r2163q4877p5569o6983o0494
$$ 2622051 2514946 2406715 2300611 2198929 2101814 2009651 1924774 1849205 1782222 1721728
56094A721728n5080n0085m6132m3118m0036l6957l4712l2718k9771k6683k5260
$$ 1721728 1666648 1616563 1570431 1527313 1487277 1450320 1415608 1382890 1353119 1326436 1301176
56083A301176k4911k3287k0140j7390j5444j2758r288o902o059n166l663k633
$$ 1301176 1276265 1252978 1232838 1215448 1200004 1187246 1177958 1171056 1164997 1159831 1156168 1153535
56071A153535j993l31K114L487L751M854P118Q650Q899R477J0913J1875J2117
$$ 1153535 1151542 1151211 1153325 1156812 1160563 1165417 1172535 1181185 1190084 1199561 1210474 1222349 1234466
56058A234466J2920J4154J4246J3506J4069J6062J7290J7154J7287J7996J7808
$$ 1234466 1247386 1261540 1275786 1289292 1303361 1319423 1336713 1353867 1371154 1389150 1406958
56047A406958J7012J7703J9788K0898K0796K1711K3842K4951K5024K6643K9862
$$ 1406958 1423970 1441673 1461461 1482359 1503155 1524866 1548708 1573659 1598683 1625326 1655188
56036A655188L1590L1165L1666L4321L6502L6906L7710L9924M1465M1721M3175
$$ 1655188 1686778 1717943 1749609 1783930 1820432 1857338 1895048 1934972 1976437 2018158 2061333
56025B061333M6524M9071M9913N1755N5475N8057N8144N8557O0822O2446O2182
$$ 2061333 2107857 2156928 2206841 2258596 2314071 2372128 2430272 2488829 2549651 2612097 2674279
56014B674279O2812O5857O8735O9997P2269P7053Q1683Q4368Q7254R1606R5251
$$ 2674279 2737091 2802948 2871683 2941680 3013949 3091002 3172685 3257053 3344307 3435913 3531164
56003C531164R7616J01837J08901J15272J19235J23957J31264J38493J44460J52224
$$ 3531164 3628780 3730617 3839518 3954790 4074025 4197982 4329246 4467739 4612199 4764423
55993D764423J62881J73149J82261J94133K09423K23130K33800K46997K65531
$$ 4764423 4927304 5100453 5282714 5476847 5686270 5909400 6143200 6390197 6655728
55984F655728K84659L01488L20447L44468L69873L95342M26498M65775N07566
$$ 6655728 6940387 7241875 7562322 7906790 8276663 8672005 9098503 9564278 10071844
55975A0071844N49601N98956O60223P28761Q02678Q89777R94999J113738J246216
$$ 10071844 10621445 11220401 11880624 12609385 13412063 14301840 15296839 16410577 17656793
55966A7656793J404997J599112J826067K090407K413667K813659L292136L857420
$$ 17656793 19061790 20660902 22486969 24577376 26991043 29804702 33096838 36954258
55958C6954258M538910N362979O340682P504354Q929112J0682992J2780538J5229753
$$ 36954258 41493168 46856147 53196829 60701183 69630295 80313287 93093825 108323578
55950A08323578J8090482K1374836K4795316K7588013K8637371K6940401K2224919
$$ 108323578 126414060 147788896 172584212 200172225 228809596 255749997 277974916
55943B77974916J5331384P937005J614493l101723o801310j0358557j4024099
$$ 277974916 293306300 301243305 302857798 299756075 292954765 282596208 268572109
55936B68572109j7295465j9500205k0355681k0035300j8912006j7341793j5592793
$$ 268572109 251276644 231776439 211420758 191385458 172473452 155131659 139538866
55929A39538866j3837312j2167347j0637124r294197q167682p250122o510388
$$ 139538866 125701554 113534207 102897083 93602886 85435204 78185082 71674694
55922G1674694n913290n418064m978267m562325m166109l796015l451224l130529
$$ 71674694 65761404 60343340 55365073 50802748 46636639 42840624 39389400 36258871
55914C6258871k841480k589533k367678k166603j985824j825926j679614j540003
$$ 36258871 33417391 30827858 28460180 26293577 24307753 22481827 20802213 19262210
55906A9262210j409598j292413j184924j082882r89485r08727q37147p69736p07816
$$ 19262210 17852612 16560199 15375275 14292393 13302908 12394181 11557034 10787298 10079482
55897A0079482o54129o06006n60102n18263m82456m49187m15024l82487l54781
$$ 10079482 9425353 8819347 8259245 7740982 7258526 6809339 6394315 6011828 5657047
55888E657047l29695l04224k80234k60157k41737k22342k03979j89059j75545
$$ 5657047 5327352 5023128 4742894 4482737 4241000 4018658 3814679 3625620 3450075
55879C450075j61170j48067j38491j30138j20398j11076j04352r8138r0110q2352
$$ 3450075 3288905 3140838 3002347 2872209 2751811 2640735 2536383 2438245 2348135 2265783
55869B265783p7482p3841o8925o3934o0653n7448n2617m8150m5997m4041l9878
$$ 2265783 2188301 2114460 2045535 1981601 1920948 1863500 1810883 1762733 1716736 1672695 1632817
55858A632817l5096l1768k8254k2673j7125j4236j2895j1542j2193j6626k1784
$$ 1632817 1597721 1565953 1537699 1515026 1497901 1483665 1470770 1459228 1447035 1430409 1408625
55847A408625k3718k3418k4251k6223k7224k7450k8127k8052k5716k2839k1762
$$ 1408625 1384907 1361489 1337238 1311015 1283791 1256341 1228214 1200162 1174446 1151607 1129845
55836A129845k1384j9672j7986j8733k0766k1276k0473k0363k0626j9768j8707
$$ 1129845 1108461 1088789 1070803 1052070 1031304 1010028 989555 969192 948566 928798 910091
55825I10091j9167k0032j9140j7359j6917j7172j5953j3817j3056j3412j2680
$$ 910091 890924 870892 851752 834393 817476 800304 784351 770534 757478 744066 731386
55814G31386j0727r344q857q234p772q297q617p050m673l731l744k528k96P76
$$ 731386 720659 711315 702458 694224 686452 678155 669538 662488 657815 654084 650340 647812 647516 648292
55800F48292M86O02J252O83j431l448m582n589o706p433q147r559j0890j0890
$$ 648292 648778 649380 650632 651315 649884 646436 641854 636265 629559 622126 613979 604420 593530 582640
55786E82640j0180j0249j0703r975q155o735n937m829l620l459m273n065n837
$$ 582640 572460 562211 551508 541533 533378 526643 520706 515877 512257 508798 504525 499460 493623
55773D93623p108q143p979p557q456j0189j1095j1159j1491j1725j0572q524p283
$$ 493623 486515 478372 470393 462836 454380 444191 433096 421937 410446 398721 388149 379625 372342
55760C72342o886n976m576m037m382m202l155k251j869j663k063l639n304n499
$$ 372342 365456 359480 354904 350867 346485 342283 339128 336877 335008 333345 331282 327643 322339 316840
55746C16840m767m840n666n779n177n149n555n024l751l274l590l222k220k206
$$ 316840 312073 307233 301567 295788 290611 285462 279907 274883 271132 267858 264268 261046 258826 256620
55732B56620l240l429k192j088r05o00J05k27k091l812m136l919m152m301l713
$$ 256620 253380 249951 247759 246671 245766 245166 245271 245044 242953 239141 235005 231086 226934 222633 218920
55717B18920k981k784k856k901l143l293k470q01L89N96Q03J653K531L019L546
$$ 218920 215939 213155 210299 207398 204255 200962 198492 197691 198080 198676 199479 201132 203663 206682 210228
55702B10228L999L354J628N57J332K971L872L781L325K749K044J470J148Q50O73
$$ 210228 214227 217581 219209 219766 221098 224069 227941 231722 235047 237796 239840 241310 242458 243308 243981
55687B43981J052J781J966J389R27J208J755J900J666J385J188J111J036N45l64
$$ 243981 245033 246814 248780 250169 251096 252304 254059 255959 257625 259010 260198 261309 262345 262890 262526
55672B62526o71M01J826J891P48K52J143K117K070J578J494J556J353J354K024
$$ 262526 261855 262256 264082 265973 266721 266973 268116 270233 272303 273881 275375 276931 278284 279638 281662
55657B81662K834L057K777K458K112J582J026O63M20J54k41j031k396l939n077
$$ 281662 284496 287553 290330 292788 294900 296482 297508 298171 298591 298745 298504 297473 295077 291138 286061
55642B86061n787o404o873o961o996p424p844p547o796o545o969p383p460p414
$$ 286061 280274 273870 266997 260036 253040 245616 237772 230225 223429 216884 209915 202532 195072 187658
55628A87658p146o384n565n298n169m352l222k879l195l040k434k652l891m592
$$ 187658 180512 174128 168563 163265 158096 153744 150522 147643 144448 141408 138974 136322 132431 127839
55614A27839l763k364j701j797k109k496k794k480j570q99r35j162j102j035j237
$$ 127839 124076 121712 120011 118214 116105 113609 110815 108335 106765 105866 104931 103769 102667 101632 100395
55599A00395j430j423j418j393j046o07o96j227j468j320j387j635j326n06j32
$$ 100395 98965 97542 96124 94731 93685 93078 92382 91155 89687 88367 86980 85345 84019 83513 83381
55584H3381l98l69L00P51N99O39J177J206J68p98m93O03J284J361J408J674K230
$$ 83381 82983 82614 82914 83665 84264 84903 86080 87286 87454 86656 86163 86766 88050 89411 90819 92493 94723
55567I4723L364M866N567M648K806J411R57J040J189J043K88r17j853k061j745
$$ 94723 98087 102953 108520 113168 115974 117385 118342 119382 120571 121614 121902 120985 119132 117071 115326
55552A15326j199n59l00r60k036k207j175j52Q3L12J269K168K038J484J745K693
$$ 115326 114127 113568 113268 112308 110272 108065 106890 106738 106821 107133 108402 110570 112608 114092 115837 118530
55536A18530L130K711K311K561L125L490L664L913M263M412L995L062K316K502
$$ 118530 121660 124371 126682 129243 132368 135858 139522 143435 147698 152110 156105 159167 161483 163985
55522A63985L379L869L333K154Q77m64j846k822l085k913k712k624k889l776m889
$$ 163985 167364 171233 174566 176720 177597 177133 175287 172465 169380 166467 163755 161131 158242 154466 149577
55507A49577n231m497l645l748m854o327p571q062p401n900m533l882l632l381
$$ 149577 144346 139849 136204 132456 127602 121275 113704 105642 98241 92341 87808 83926 80294 76913
55493G6913l173k961k401j604j343j946k764l115l060k764k017r21k50m51r91
$$ 76913 73740 70779 68378 66774 65431 63485 60721 57606 54546 51782 49765 48844 48594 48143 47152
55478D7152j212j180j175j093r10r97j393j534j239j156j617j870j221k23J49
$$ 47152 45940 44760 43585 42492 41582 40585 39192 37658 36419 35263 33646 31776 30555 30332 30481
55463C0481j73n49o85p36q39j093j594k001j678o53K31M83N55Q26R34O60N12P09
$$ 30481 30308 29759 29074 28338 27499 26406 24812 22811 21133 20480 20711 21194 21749 22575 23509 24169 24681 25390
55445B5390N88j71o95k24N98P36L44K39M47L97Q9m7p7m08r42j191r52k83P91J862
$$ 25390 25978 25807 25112 24888 25486 26222 26566 26805 27252 27649 27738 27691 27614 27206 26264 25073 24121 23838 24629 26491
55425B6491K084J232K71P4K41qm68m98k75l48m67o0N26M53j79m77k08P0J70M84
$$ 26491 28575 29807 30078 30152 30393 30385 29917 29419 29144 28796 28329 28269 28795 29248 29069 28592 28384 28454 28624 29108
55405B9108J042J408J512J677J755J209K02l73j74P5l03r76j184q00l92m61r10
$$ 29108 30150 31558 33070 34747 36502 37711 37913 37540 37366 37441 37138 36162 34978 34178 33786 33325 32415
55388C2415j228j094p43o60r21j188j287j340j248o94J23M52Q7j96J76O51M12
$$ 32415 31187 30093 29350 28690 27769 26581 25294 23954 22706 22012 22135 22587 22674 22478 22654 23305 23717
55371B3717m23j102j238q72r6P34R16K24n43n16J46O89Q16P01M32R1pK31L95K88
$$ 23717 23294 22192 20954 20082 19986 20720 21636 21860 21317 20801 20947 21636 22452 23153 23585 23676 23669 23900 24295 24583
55351B4583L21O94Q32L78j5L22R03Q77L48j9j63m30o63m71m4K29M71Q47Q50O3
$$ 24583 24904 25598 26430 26808 26793 27115 28018 28895 29243 29224 29061 28631 27968 27497 27453 27682 28153 29000 29850 29913
55331B9913q93j173r69r56j013o05J3J48j31k50k69n69q73p30n60r68j428j052
$$ 29913 29020 27847 26878 25922 24909 24304 24317 24465 24334 24084 23815 23246 22373 21643 21083 20115 18687 17635
55313A7635k85k28o42k67R25J612J320J019J199J112M44O9M30O18n7q62q46j90
$$ 17635 17350 17122 16480 16213 17138 18750 20070 21089 22288 23400 23844 23913 24343 24961 24904 24042 23196 23006
55295B3006M88J178J912K058J191Nn31m33l53m31l07O8K94R3l55o33m00K73Q06
$$ 23006 23494 24672 26584 28642 29833 29838 29307 28874 28521 28090 27783 27851 28145 28238 27883 27250 26850 27123 27929
55276B7929O93J09l80n96p15o45j63M05N04K86L66O62M96q0j85M14Q16M31j34
$$ 27929 28622 28731 28351 27755 27040 26395 26232 26637 27141 27427 27793 28455 28951 28871 28686 29100 29916 30347 30213
55257C0213j72J07K65M39P45P14P9n25m03K05O58R21J262J388P31n93j674j720
$$ 30213 30041 30148 30413 30852 31597 32311 32390 31865 31462 31667 32325 33246 34508 35896 36627 36034 34360 32640
55239C2640p56M13Q25K21n81n92N8L68mk74M5K65l13j138j191m71J01lm31n70
$$ 32640 31884 32297 33122 33343 32762 32170 32228 32596 32592 32318 32363 32628 32315 31177 29986 29515 29616 29613 29182 28612
55219B8612j35O80J287J183O54N09R16J063M94p0J21N53K67n72r30n31n7J22M00
$$ 28612 28477 29157 30444 31627 32281 32790 33706 34769 35263 35193 35314 35867 36134 35562 34632 34101 34044 34166 34566
55200C4566Q93R61K17p27j038o74j54K58O54R78R16L29m93j109j281j023m84J11
$$ 34566 35459 36420 36637 35910 34872 34198 34044 34302 34956 35934 36850 37179 36686 35577 34296 33273 32789 32900
55182C2900M87M47O9l31n19n29m67k79L9J83j43p18r41o06j56l4j43j66j30l03
$$ 32900 33387 33834 33903 33572 33053 32524 32057 31778 31817 32000 31857 31139 30198 29592 29436 29402 29259 29093 28963 28660
55162B8660p05j041j059p88l67J29O61J060J044M87k69n73j02P64J369J497J400
$$ 28660 27955 26914 25855 25067 24700 24829 25490 26550 27594 28081 27812 27239 27137 27901 29270 30767 32167
55145C2167J270J008M97r7m32j80P10J681J758M83j317k232j794q38k59L1O41
$$ 32167 33437 34445 34942 34845 34413 34233 34943 36624 38382 38865 37548 35316 33522 32684 32425 32456 33097
55128C3097J634K398K420J812J134Q43R22R85P62N05O36J103J329R29J71l84m67
$$ 33097 34731 37129 39549 41361 42495 43338 44260 45245 46007 46512 47148 48251 49580 50509 50680 50296 49829
55111D9829j66L41Q15R24M61l19q27p33l60k90o02p58l43L28P32R37J330J686
$$ 49829 49663 50004 50819 51743 52204 51885 51058 50325 49965 49675 49073 48315 47972 48300 49032 49969 51299 52985
55093E2985J319L52j05N10J273J075K19j25L76J006J225J105O91q7p57m76P68
$$ 52985 54304 54656 54551 55061 56334 57409 57628 57503 57879 58885 60110 61215 61906 61819 61062 60586 61354
55076F1354J839J677M35q75j417j046j98N12P29N58K05k38m98n4J042J778J289
$$ 61354 63193 64870 65305 64430 63013 61967 61769 62281 63010 63568 63773 63535 63037 62983 64025 65803 67092
55059F7092J26m43j37J95Ml29l66j85N4K62J09o23j321j109k21J51l66q27m51
$$ 67092 67218 66775 66638 66833 66837 66508 66142 65957 66011 66273 66382 65759 64438 63329 63108 63259 62893 62066 61615
55040F1615L73J033J565K014J928J161L63j2l32q38r35k38M86L66k54m85l30m20
$$ 61615 61988 63021 64586 66600 68528 69689 70052 70040 69708 68870 67935 67697 68183 68549 68295 67810 67480 67060
55022F7060p00n09J88O63N41K84M13Q68J214J071L81m09n60J18Q70Q48K05k22
$$ 67060 66360 65851 66039 66702 67243 67527 67940 68808 70022 71093 71474 71065 70505 70623 71493 72341 72546 72324
55004G2324j37k5k59n75n62k50L0M3k32o60j018j073p67k50J96L62L03K63L04
$$ 72324 72187 72162 71903 71328 70766 70516 70546 70589 70357 69697 68679 67606 66839 66589 66785 67147 67450 67713 68017
54985F8017J44l63p79n60J09N14M22L34O09R96J218J411J662J657J195N52Q1j25
$$ 68017 68161 67798 67019 66459 66568 67082 67504 67838 68447 69443 70661 72072 73734 75391 76586 77138 77219 77094
54967G7094N7Q22J871K418K167J731J781K316L144M309N524O007N616N433O381
$$ 77094 77151 77973 79844 82262 84429 86160 87941 90257 93401 97710 103234 109241 114857 120290 126671
54952A26671P845Q659Q931R735J1174J2081J1702J0652R761Q861P233M722J942
$$ 126671 134516 143175 152106 161841 173015 185096 196798 207450 217211 226072 233305 238027 239969
54939B39969l84j951l041m354o424q986j1050j1801j1279j0202r178q319p513
$$ 239969 239585 237634 234593 230239 223815 214829 203779 191978 180699 170497 161319 153000 145487
54926A45487o802o322n895n093l889k902k561k382j644o39l61q96j053J5J685
$$ 145487 138685 132363 126468 121375 117486 114584 112023 109641 107997 107358 106997 106101 105048 105063 106748
54911A06748K923L756M881O323P409P937Q545R809J1438J2521J2290J0618Q026
$$ 106748 109671 113427 118308 124631 132040 139977 148522 158331 169769 182290 194580 205198 213224
54898B13224N217K599K49j752l342m781o446q213r503j0039j0061r711q889p891
$$ 213224 218441 221040 221289 219537 216195 211414 204968 196755 187252 177213 167152 157441 148552 140661
54884A40661p399p500p408o599n568m907m370l467k420j776j575j501j432j265
$$ 140661 133262 125762 118354 111755 106187 101280 96910 93443 91023 89247 87672 86171 84739 83474
54870H3474o91K11O41P6q88j342j240j116j086j021j207j883k495k319j631j306
$$ 83474 82783 82994 83635 83711 82823 81481 80241 79125 78039 77018 75811 73928 71433 69114 67483 66177
54854F6177j443j369q70m54l57k20J53M43L72j2o29j349j723j354n36Q4L96O90
$$ 66177 64734 63365 62495 62041 61684 61464 61617 62060 62432 62420 61791 60442 58719 57365 56829 56913 57309 57999
54836E7999Q18K73q08j543j380o83o0K86M04L16J41J22L79Q93J577K118K018J236
$$ 57999 58817 59090 58282 56739 55359 54676 54616 54902 55306 55622 55763 55885 56264 57157 58734 60852 62870 64106
54818F4106N14N21R50J111J076J431K115K373J869J038L52%L03J533L227M395
$$ 64106 64620 65141 66091 67202 68278 69709 71824 74197 76066 77104 77456 77456 77759 79292 82519 86914
54802H6914M667M567M613M859N389O486Q050R518J0572J1365J1885J1798J1123
$$ 86914 91581 96148 100761 105620 111009 117495 125545 135063 145635 157000 168885 180683 191806
54789A91806J0385R786Q816O997M566K082j32k049l708n174o352o934o852o621
$$ 191806 202191 211977 220793 227790 232356 234438 234306 232257 228549 223375 217023 210089 203237 196616
54775A96616o665o552n623m289l695m105m531m153l230k267j280k93L15M83P98
$$ 196616 189951 183399 177776 173487 169792 165687 161156 157003 153773 151506 150226 149933 150248 150731 151529
54760A51529J623K595L509M897P054R133J0106J0232J0727J2155J3926J5289J6146
$$ 151529 153152 155747 159256 164153 171207 180340 190446 200678 211405 223560 237486 252775 268921
54747B68921J6753J7051J6634J5163J2658R471N941K237j532n132q410j1400j3929
$$ 268921 285674 302725 319359 334522 347180 356651 362592 364829 363297 358165 349755 338355 324426
54734C24426j5397j5454j4768j4394j4456j4081j2803j1236j0137r448q679p723
$$ 324426 309029 293575 278807 264413 249957 235876 223073 211837 201700 192252 183573 175850
54722A75850o831o212n980o115o239n759m594l366k696k582k678k741k596k192
$$ 175850 169019 162807 156827 150712 144473 138714 134120 130754 128058 125476 122798 120057 117461 115269
54708A15269j873k136k821l031k249j116o26r61j486j614j228m59M60J199J444
$$ 115269 113396 111260 108439 105408 103159 102043 101417 100456 98970 97356 96128 95669 96129 97328 98772
54693I8772J092L49k71j87N98J185P00m35q17J62J481J799J009N1l56k21J46N49
$$ 98772 99864 100213 99942 99755 100353 101538 102238 101803 100986 101148 102629 104428 105437 105488 105132 104911 105057 105606
54675A05606R75J560K315K894K897K607K810L644M162L533K293J731K283L123
$$ 105606 106581 108141 110456 113350 116247 118854 121664 125308 129470 133003 135296 137027 139310 142433
54661A42433L344L022K907L383L962L909L200K687L107M178N007N189N039M903
$$ 142433 145777 148799 151706 155089 159051 162960 166160 168847 171954 176132 181139 186328 191367 196270
54647A96270M804M842N331O355P656R093J0774J2557J4014J4996J5753J6360J6483
$$ 196270 201074 205916 211247 217602 225258 234351 245125 257682 271696 286692 302445 318805 335288
54634C35288J5889J4596J2438R160N135J211k351o035r823j2698j3974j4309j4704
$$ 335288 351177 365773 378211 387371 392506 393717 391366 385331 375508 362810 348836 334527 319823
54621C19823j5149j5050j4447j3828j3111j1736r727p914o999o870o874o409n315
$$ 319823 304674 289624 275177 261349 248238 236502 226775 218861 211862 204992 198118 191709 186394
54608A86394l962k908k339k033j852j959k288k479k510k864l692m355m283l746
$$ 186394 182432 179524 177185 175152 173300 171341 169053 166574 164064 161200 157508 153153 148870 145124
54594A45124l290k922k424j992j954k222k577l100l765m100l850l514l574l626
$$ 145124 141834 138912 136488 134496 132542 130320 127743 124643 120878 116778 112928 109414 105840 102214
54580A02214l122k428k308k635k609k046j504j244r70o38o09q55q51m06N0K15
$$ 102214 99092 96664 94356 91721 89112 87066 85562 84318 83348 82710 82101 81246 80395 79989 80039 80254
54564H0254L08M97N66L99K94M98Q56J112J184J050P19M49N71R83J197J002P49
$$ 80254 80562 81059 81625 82024 82318 82816 83672 84784 85968 87018 87737 88186 88757 89740 90937 91939 92688
54547I2688Q01J117J427J470J086L67j49J54J285K596L521M035M355M570M759
$$ 92688 93489 94606 96033 97503 98589 98956 98807 98961 100246 102842 106363 110398 114753 119323 124082
54532A24082N121N813O743P695Q455Q857Q808Q375P681O719N333L419J040j417
$$ 124082 129203 135016 141759 149454 157909 166766 175574 183949 191630 198349 203682 207101 208141 206724
54518B06724l281m086m204m578n605o622o927o804o972p392p374o657n655m694
$$ 206724 203443 199357 195153 190575 184970 178348 171421 164617 157645 150253 142879 136222 130567 125873
54504A25873l816l296l503m074m059l237k481k433k538j964r10j80R6M31Q42O67
$$ 125873 122057 118761 115258 111184 107125 103888 101407 98974 96436 94472 93562 93382 93478 93909 94751 95418
54488I5418k67j080q94M8Q35J079J120J224J250J157J186J321J074K73m70m97
$$ 95418 95151 94071 93177 93225 94060 95139 96259 97483 98733 99890 101076 102397 103471 103744 103274 102777
54472A02777K5N74J199K199L114K979J734M84O7J28lk87l24j17J02K93L81J6q44
$$ 102777 102802 103376 104575 106774 109888 112867 114601 115085 115152 115280 115277 114990 114666 114549 114651 114944 115325 115341 114497
54453A14497j569j591j155q09n90k79r0l76r53j299j234r02m49j91o81j944l063
$$ 114497 112928 111337 110182 109373 108783 108504 108414 108038 107085 105786 104552 103650 103201 103010 102329 100385 97322
54436I7322l217k704k242j722o51N89J063O97L44M37O74R29J375J563P20p35j188
$$ 97322 94105 91401 89159 87437 86786 87375 88438 89135 89479 89916 90590 91519 92894 94457 95177 94442 93254
54419I3254N1J642J976J137L25R3Q9P0K10N26P93J011J401J949K331K379K259
$$ 93254 93305 94947 96923 98060 98385 98478 98567 98637 98847 99373 100166 101177 102578 104527 106858 109237 111496
54402A11496K200K266K399K497K475K341K190K108K151K355K564K414J734R50
$$ 111496 113696 115962 118361 120858 123333 125674 127864 129972 132123 134478 137042 139456 141190 142140
54388A42140O06O03K63p49j985k756k739k023j051o12j306k761l770l585k694
$$ 142140 142746 143349 143612 142863 140878 138122 135383 133360 132309 131697 130391 127630 123860 120275 117581
54373A17581k067k045k240k261k015j556j064r06j268j752j703r93k93l30j037
$$ 117581 115514 113469 111229 108968 106953 105397 104333 103427 102159 100407 98704 97711 97418 97088 96051
54358I6051j604j415p11j92j11r5J56M91P26R84J326J489J375J422J986K692K922
$$ 96051 94447 93032 92321 92129 92018 91923 92079 92570 93296 94280 95606 97095 98470 99892 101878 104570 107492
54341A07492K659K320K009J611J366J634K174K354K018J421N52o75j642j469m00
$$ 107492 110151 112471 114480 116091 117457 119091 121265 123619 125637 127058 127610 126935 125293 123824 123424
54326A23424K17l33j270j613j526j817k726l733m158l643k412j359j333k113k640
$$ 123424 123641 123308 122038 120425 118899 117082 114356 110623 106465 102822 100410 99051 97718 95605 92965
54311I2965k443k121k154k039j241k72j21r64k082k711k540j741r41q27j332j594
$$ 92965 90522 88401 86247 84208 82967 82695 82574 81610 79528 76817 74277 72536 71595 70768 69436 67842
54295F7842j039j27L24J34l57q18j003p26k42j40m81n98j80J96J55L33J190J883
$$ 67842 66803 66676 67000 67134 66777 65959 64956 64230 63988 63848 63367 62769 62589 62785 62940 63273 64463 66346
54277F6346J356R4m90m4N14O31P09J002J141R98J026J383J554J262R86J090J171
$$ 66346 67702 67796 67306 67262 67776 68407 69116 70118 71259 72257 73283 74666 76220 77482 78468 79558 80729
54260H0729P31n2o85j012j132j031p11l56n8L57R32J317J192O43l7o81j075q48
$$ 80729 81460 81408 80723 79711 78579 77548 76837 76481 76423 76780 77712 79029 80221 80864 80827 80146 79071 78223
54242G8223N9J055J384R15J90j97r3K49M36K55j89o28r53j226j365j115m64J31
$$ 78223 78282 79337 80721 81636 81826 81629 81536 81785 82221 82476 82287 81659 80706 79480 78115 77000 76536 76667
54224G6667J74k89p15o64j86L50P16R60J113R80M47j17j40L71P02M38R7L31Q04
$$ 76667 76841 76552 75837 75173 74987 75337 76053 77013 78126 79106 79553 79436 79296 79667 80369 80807 80904 81235 82039
54205H2039O65n0l65J00M40k05j325j725j074o4P29J316J679J451N01o67j428
$$ 82039 82704 82654 82289 82389 82829 82624 81299 79574 78500 78436 79165 80481 82160 83611 84112 83445 82017
54188H2017j644j562j325r30m56j28j56n89j231j612j290l50N28P55M00p2m56
$$ 82017 80373 78811 77486 76556 76100 75972 75816 75227 73996 72384 71094 70744 71272 72027 72427 72355 71899
54171G1899q53j160j045n26j44k93o48o64l99m20r46j474j423q06r1M29Q48J293
$$ 71899 71046 69886 68841 68315 68171 67878 67230 66566 66167 65747 64801 63327 61904 61098 61007 61436 62284 63577
54153F3577J610J530J093P27P81J040R82M69o2k53l13n54p80n42P2M40J73n22
$$ 63577 65187 66717 67810 68537 69318 70358 71340 71809 71747 71494 71181 70627 69847 69305 69377 69817 69990 69468
54135F9468j334k133k651k420j365r2P50J108J237J144P49L17J77J43k52j005
$$ 69468 68134 66001 63350 60930 59565 59473 60223 61331 62568 63712 64461 64778 64955 65098 64846 63841
54119F3841j561j595j338j100q58n12j34K76Q73J502J525O30m38n83K47R67Q02
$$ 63841 62280 60685 59347 58247 57389 56877 56743 57019 57892 59394 60919 61549 61111 60528 60775 61742 62544
54102F2544K17L2J57q1p10r88n72L2L47N78R28R52K78m94m05N16J236J094M48
$$ 62544 62761 62793 62950 62869 62159 61171 60599 60631 60978 61556 62484 63436 63714 63220 62815 63331 64567 65661 66109
54083F6109j06m63p49r24r95j117j170p38J50O82K54n65o54K16J178J478J296
$$ 66109 66003 65540 64791 63867 62872 61755 60585 59847 59997 60679 60933 60368 59714 59930 61108 62586 63882
54066F3882J184J216J092P64M74K43k37r65j300o42O60J589J632J260J014P51
$$ 63882 65066 66282 67374 68138 68612 68855 68618 67653 66353 65711 66371 67960 69592 70852 71866 72617
54050G2617K06k03J53J096J836K108K320K513K140J158M85Q20J644K069K153K586
$$ 72617 72823 72620 72773 73869 75705 77813 80133 82646 84786 85944 86429 87249 88893 90962 93115 95701
54034I5701L424L927L697L244L254L739M175M175L895L820M231M864N225N246
$$ 95701 99125 103052 106749 109993 113247 116986 121161 125336 129231 133051 137282 142146 147371 152617
54020A52617N352N728N917N410M426L624L252K971K487J894J387R65N48J38j98
$$ 152617 157969 163697 169614 175024 179450 183074 186326 189297 191784 193678 195065 196030 196578 196716 196518
54005A96518m11n15o58j065j787k587l154l356l214k817k401k271k448k597k512
$$ 196518 196107 195592 194934 193869 192082 189495 186341 182985 179771 176954 174553 172282 169834 167237 164725
53990A64725k437k625k883k875k671k603k703k685k454k212k083j964j791j670
$$ 164725 162288 159663 156780 153905 151234 148631 145928 143243 140789 138577 136494 134530 132739 131069
53976A31069j631j535j304j109j122j217r88k17O95R15J23r08j063k46O05Q92
$$ 131069 129438 127903 126599 125490 124368 123151 122163 121946 122641 123556 123679 122771 121708 121462 122067 122959
53960A22959J038J435J583J016M07O93J428J210j92j283q14O55J726J983K074
$$ 122959 123997 125432 127015 128031 128438 129131 130559 131769 131577 130294 129480 130135 131861 133844 135918
53945A35918K416K652K297J405M83J34O59J825K960L564L661L467K950K079J306
$$ 135918 138334 140986 143283 144688 145171 145305 145964 147789 150749 154313 157974 161441 164391 166470 167776
53930A67776J215J661J805J238N71O08J216J596J461J305J449J544J288J116J605
$$ 167776 168991 170652 172457 173695 174266 174874 176090 177686 179147 180452 181901 183445 184733 185849 187454
53915A87454K576L374L801M141M409M340M098M282M984N533N492N262N309N353
$$ 187454 190030 193404 197205 201346 205755 210095 214193 218475 223459 228992 234484 239746 245055 250408
53901B50408M886M009L241K823K641K572K449J993J253P71Q01O99k67j819l027
$$ 250408 255294 259303 262544 265367 268008 270580 273029 275022 276275 277046 277847 278546 278279 276460 273433
53886B73433l516l652l684l532l383l690m475n284n926o587p132p019o189n321
$$ 273433 269917 266265 262581 259049 255666 251976 247501 242217 236291 229704 222572 215553 209364 204043
53872B04043m920m734m436m239m330m305l815l329l556m282m551l974l175k840
$$ 204043 199123 194389 189953 185714 181384 177079 173264 169935 166379 162097 157546 153572 150397 147557
53858A47557k846k710k397k226k157j799j186j054j909l189l789l374k623k120
$$ 147557 144711 142001 139604 137378 135221 133422 132236 131182 129273 126084 122295 118921 116298 114178
53844A14178j664r59l88m93j055j301j011p13q40j200j404j347j114p81n04m74
$$ 114178 112514 111555 111167 110674 109619 108318 107307 106594 105754 104554 103150 101803 100689 99908 99404 98930
53828I8930o04n53k05R5o7o24j012o44N51J932K640K388J704J192Q54L99o6j75
$$ 98930 98326 97773 97568 97663 97596 96972 95960 95316 95867 97799 100439 102827 104531 105723 106577 106976 106910 106735
53810A06735M0J51J1o4J95P43J454K146K443K097J560J672K655L903M779N176
$$ 106735 106775 106926 106937 106873 107068 107811 109265 111411 113854 115951 117511 119183 121838 125741 130520 135696
53794A35696N226N064N015N353N642N086L775K868L003L306K712J620J282J923
$$ 135696 140922 145986 151001 156354 161996 167082 170857 173725 176728 180034 182746 184366 185648 187571
53780A87571K477K154J320O20J18l50o14m42o7O6j62n84j114j725k220k416k496
$$ 187571 190048 192202 193522 194142 194260 193910 193296 192854 192787 192853 192691 192107 190993 189268 187048 184632 182136
53763A82136k837l440l848l727l198k508j729j009p24j003j351j249r43j039j408
$$ 182136 179299 175859 172011 168284 165086 162578 160849 159840 159116 158113 156762 155513 154570 153531 152123
53748A52123j278n35j25o80j508j600j137j071j591j875j426p54n58q79j327j617
$$ 152123 150845 150310 150185 149505 147997 146397 145260 144189 142598 140723 139297 138543 137985 137106 135779 134162
53732A34162j610j295q86o57n05n1O52R70M06p69j825k217j868j079l06K34P35
$$ 134162 132552 131257 130371 129714 129209 129158 129810 130780 131186 130417 128592 126375 124507 123428 123122 123356 124091
53715A24091J378J905J963J786J872K058J594L66p61j036p03l62n9M35R27J078
$$ 124091 125469 127374 129337 131123 132995 135053 136647 137013 136252 135216 134513 134151 134092 134527 135454 136532
53699A36532J079J453K236K882K963K598K216K141K431K892L197L145K753K128
$$ 136532 137611 139064 141300 144182 147145 149743 151959 154100 156531 159423 162620 165765 168518 170646
53685A70646J402Q76R38J626K469K902K747K224J732J615J908K233K161J671J023
$$ 170646 172048 172924 173862 175488 177957 180859 183606 185830 187562 189177 191085 193318 195479 197150 198173
53670A98173K94n24j048q17j01K50J9j08K49M77N1m69l43P4j13q97j465j528j544
$$ 198173 198467 197943 196895 196078 195977 196227 196246 196138 196387 196864 196915 196446 196103 196177 196064 195167 193702 192174 190630
53651A90630j631j304m70J85K31J41M80J026J176P99J75m86j020j061l87O34J409
$$ 190630 188999 187695 187225 187410 187641 187782 188262 189288 190464 191263 191438 190952 189932 188871 188484 189118 190527
53634A90527J805K005J865J063j46r02p54j42M69J252K349K989K227M92n40J78
$$ 190527 192332 194337 196202 197265 197119 196217 195463 195321 195790 197042 199391 202380 204607 205099 204559 204737
53618B04737J898L114L108K197J065M38Q35K029L014L169L005L256L614L296K534
$$ 204737 206635 209749 212857 215054 216119 216557 217392 219421 222435 225604 228609 231865 235479 238775 241309
53603B41309K382L090L747L740L590L915M472M726M604M228L564K941L172M376
$$ 241309 243691 246781 250528 254268 257858 261773 266245 270971 275575 279803 283367 286308 289480 293856
53589B93856N294M630K765J342J265K011K765L360L831L860L183K176J535J456
$$ 293856 299150 303780 306545 307887 309152 311163 313928 317288 321119 324979 328162 330338 331873 333329
53575C33329J537J445J339J404J314N78n39j037m57L57L00m82q70l98K83O47J065
$$ 333329 334866 336311 337650 339054 340368 340946 340407 339370 338913 339270 339570 339088 338218 337820 338103 338750 339815
53558C39815J885K477J959N15p01q35r3P17J090J186J421J758J632Q13P8L78J487
$$ 339815 341700 344177 346136 346651 345950 345115 345022 345739 346829 348015 349436 351194 352826 353639 353717 354095 355582
53541C55582K152J767J042Q67J222J610J881K161K507L045L923M777M914M390
$$ 355582 357734 359501 360543 361410 362632 364242 366123 368284 370791 373836 377759 382536 387450 391840
53527C91840M161M711N325N315N112N350N661N435N141N762P262Q738R805J0781
$$ 391840 396001 400712 406037 411352 416464 421814 427475 432910 438051 443813 451075 459813 469618 480399
53513D80399J1656J1952J1681J1477J1699J2166J2869J4048J5468J6466J6894
$$ 480399 492055 504007 515688 527165 538864 551030 563899 577947 593415 609881 626775
53502F26775J7316J8049J8721J9028J9251J9747K0449K1215K2162K3320K4267
$$ 626775 644091 662140 680861 699889 719140 738887 759336 780551 802713 826033 850300
53491H50300K4532K4176K3792K3908K4449K4740K4259K3398K3135K3755K4345
$$ 850300 874832 899008 922800 946708 971157 995897 1020156 1043554 1066689 1090444 1114789
53480A114789K3979K2910K2040K1675K1492K1376K1458K1511K1153K0537K0090
$$ 1114789 1138768 1161678 1183718 1205393 1226885 1248261 1269719 1291230 1312383 1332920 1353010
53469A353010J9722J9071J8377J8137J8031J7195J5641J4311J3490J2284J0177
$$ 1353010 1372732 1391803 1410180 1428317 1446348 1463543 1479184 1493495 1506985 1519269 1529446
53458A529446P996O671N842M453K171n02l050n204o764p805q863j0306j1729j2454
$$ 1529446 1537442 1544113 1549955 1554408 1556579 1556077 1553027 1547823 1541059 1533254 1524391 1514085 1502356 1489902
53444A489902j2505j2631j3468j5006j6776j8218j8981j9223j9522k0249k1054
$$ 1489902 1477397 1464766 1451298 1436292 1419516 1401298 1382317 1363094 1343572 1323323 1302269
53433A302269k1259k0739k0095j9894j9927j9412j7896j5801j4038j3145j2868
$$ 1302269 1281010 1260271 1240176 1220282 1200355 1180943 1163047 1147246 1133208 1120063 1107195
53422A107195j2541j1683j0301q812p791p452p290o521m969l236j836o03P97K248
$$ 1107195 1094654 1082971 1072670 1063858 1056067 1048615 1041325 1034804 1029835 1026599 1024763 1024160 1024957 1027205
53408A027205L504M673N974P310Q582J0029J1789J3444J4628J5676J7122J8836
$$ 1027205 1030709 1035382 1041356 1048666 1057248 1067277 1079066 1092510 1107138 1122814 1139936 1158772
53396A158772K0357K1741K3358K5142K6773K8375L0286L2381L4284L6076L7937
$$ 1158772 1179129 1200870 1224228 1249370 1276143 1304518 1334804 1367185 1401469 1437545 1475482
53385A475482L9515M0490M1453M3142M5162M6598M7594M8952N0334N0458M9270
$$ 1475482 1514997 1555487 1596940 1640082 1685244 1731842 1779436 1828388 1878722 1929180 1978450
53374A978450M8306M8454M8899M8795M8488M8265M7375M5295M2847M0855L8751
$$ 1978450 2026756 2075210 2124109 2172904 2221392 2269657 2317032 2362327 2405174 2446029 2484780
53363B484780L5597L1693K7937K4336K0352J6199J2529R171N270N85m279q763
$$ 2484780 2520377 2552070 2580007 2604343 2624695 2640894 2653423 2662594 2667864 2668449 2664170 2655407
53351B655407j2721j6094j8993k1900k5173k8473l1321l3851l6340l8390l9395
$$ 2655407 2642686 2626592 2607599 2585699 2560526 2532053 2500732 2466881 2430541 2392151 2352756
53340B352756l9551l9639l9936m0134m0131m0181m0326m0413m0557m0910m1073
$$ 2352756 2313205 2273566 2233630 2193496 2153365 2113184 2072858 2032445 1991888 1950978 1909905
53329A909905m0423l9035l7594l6441l5321l4089l2943l1884l0593k9020k7594
$$ 1909905 1869482 1830447 1792853 1756412 1721091 1687002 1654059 1622175 1591582 1562562 1534968
53318A534968k6573k5581k4049k1945j9913j8752j8708j9128j9048j8199j7148
$$ 1534968 1508395 1482814 1458765 1436820 1416907 1398155 1379447 1360319 1341271 1323072 1305924
53307A305924j6345j5514j4334j3145j2418j1899j1006r705q370p022n451l926
$$ 1305924 1289579 1274065 1259731 1246586 1234168 1222269 1211263 1201558 1193188 1186166 1180715 1176789
53295A176789k953k349j353K30J669K368K716L603N420P771R898J1370J2458J3812
$$ 1176789 1173836 1171487 1170134 1170364 1172033 1174401 1177117 1180720 1186140 1193911 1203809 1215179 1227637 1241449
53281A241449J5558J7032J7706J8053J8911K0295K1483K2168K2679K3105K2961
$$ 1241449 1257007 1274039 1291745 1309798 1328709 1349004 1370487 1392655 1415334 1438439 1461400
53270A461400K1989K0619J9347J8122J6723J5221J3718J2012R915P634N570L816
$$ 1461400 1483389 1504008 1523355 1541477 1558200 1573421 1587139 1599151 1609066 1616700 1622270 1626086
53258A626086K166M87j121k559l975n727p995j0470j2540j3914j4826j5543j6011
$$ 1626086 1628252 1628739 1627618 1625059 1621084 1615357 1607362 1596892 1584352 1570438 1555612 1540069 1524058
53245A524058j6288j6877j8191j9854k1077k1623k1853k1945k1659k0934k0162
$$ 1524058 1507770 1490893 1472702 1452848 1431771 1410148 1388295 1366350 1344691 1323757 1303595
53234A303595j9682j9446j9353j9509j9972k0533k0955k1145k0959k0106j8504
$$ 1303595 1283913 1264467 1245114 1225605 1205633 1185100 1164145 1143000 1122041 1101935 1083431
53223A083431j6585j5054j4402j4618j5221j5489j4899j3509j1941j0943j0830
$$ 1083431 1066846 1051792 1037390 1022772 1007551 992062 977163 963654 951713 940770 929940
53212I29940j1207j1284j0729j0148j0416j1467j2253j2178j1992j2701j4023
$$ 929940 918733 907449 896720 886572 876156 864689 852436 840258 828266 815565 801542
53201H01542j4647j3860j2334j1245j1204j2063j3233j4000j3886j2945j1619
$$ 801542 786895 773035 760701 749456 738252 726189 712956 698956 685070 672125 660506
53190F60506j0397r719r913j0880j1984j2672j3025j3350j3563j3450j3214j3144
$$ 660506 650109 640390 630477 619597 607613 594941 581916 568566 555003 541553 528339 515195
53178E15195j2949j2183j1160j0623j0504r876q439p195p252q484r813j0360r947
$$ 515195 502246 490063 478903 468280 457776 447900 439461 432266 425014 416530 406717 396357 386410
53165C86410q922p864p232p016o910o833o923o980o503n523m782m721m821m409
$$ 386410 377488 369624 362392 355376 348466 341633 334710 327730 321227 315704 310922 306201 301380 296971
53151B96971l687l385l693m134m335m351m212l682k723j850j677k210k762k673
$$ 296971 293284 289899 286206 282072 277737 273386 269174 265492 262769 260919 259242 257032 254270 251597
53137B51597k016j493j634k239k704k743k606k622k753k592j809n46O10J126J013
$$ 251597 249581 248088 246454 244215 241511 238768 236162 233540 230787 228195 226386 225840 226450 227576 228589
53122B28589O44J86l91q14n85J96O83M28R6M96J351J770J554J229J024P02L08
$$ 228589 229233 229419 229028 228214 227629 227825 228508 228936 229032 229528 230879 232649 234203 235432 236456 237158 237466
53105B37466J30n9q33k083k955l012k652k248j731j249j319j906k233k012j999
$$ 237466 237596 237537 236704 234621 231666 228654 226002 223754 222023 220774 219455 217549 215316 213304 211305
53090B11305k753l636l790l419l275l368l148k663k532k894l139k839k245j779
$$ 211305 208552 204916 201126 197707 194432 191064 187916 185253 182721 179827 176688 173849 171604 169825
53076A69825j508j292j080r05q25r39j273j638j802j763j701j677j598j424j240
$$ 169825 168317 167025 165945 165040 164215 163276 162003 160365 158563 156800 155099 153422 151824 150400 149160
53061A49160j136j087r64o54k73j74n04q24n93K4K58k19q35r38n59j10J83K14
$$ 149160 148024 146937 145973 145319 145046 144872 144368 143544 142951 142975 143233 143014 142179 141241 140682 140572 140755 140969
53043A40969k11r69j421j145o33p23j459k043j915j310p61m50k36p0j17m96j012
$$ 140969 140758 139789 138368 137223 136590 135867 134408 132365 130450 129140 128379 127929 127693 127623 127506 127010 125998
53026A25998j213r11m76m00o00n55j62O0j78m34k73K8j4k77l05j44k40o26q40
$$ 125998 124785 123874 123398 122998 122398 121843 121681 121741 121563 121129 120856 120884 120870 120593 120288 120144 119904 119278 118438
53007A18438o33k29J60O08J128J442J299Q27L87K48L70M17N5o32j121r82l30L84
$$ 118438 117805 117576 117736 118344 119472 120914 122213 123040 123427 123675 124045 124462 124517 123885 122764 121782 121452 121836
52989A21836Q15Q12L43l81r12j043j033j058p51K29J416J907J515R96J049J556
$$ 121836 122651 123463 123806 123425 122513 121470 120437 119379 118628 118857 120273 122180 123695 124691 125740 127296
52973A27296J972K060K014K111K432K799K955K863K805L082L635M127M231L754
$$ 127296 129268 131328 133342 135453 137885 140684 143639 146502 149307 152389 156024 160151 164382 168136
52959A68136K694J431O24N45O97M80M9oL40M83J45k43k59q1k9n4L5Q2j98p65j297
$$ 168136 170830 172261 172885 173430 174127 174607 174656 174650 174990 175473 175618 175375 175116 175035 175006 174952 174987 175069 174871 174106 172809
52938A72809j535j394q98l05j16n95j313j500q97n0L75L31K91N53Q60P73K36l32
$$ 172809 171274 169880 168982 168677 168561 167966 166653 165153 164256 164206 164581 164912 165203 165756 166616 167389 167625 167293
52920A67293m20R9Q28J131P14K1j51L96Q88N84j44k24N99J360J183M08n8k2%j90
$$ 167293 166873 166972 167800 168931 169645 169666 169515 169911 170799 171383 171239 171015 171614 172974 174157 174565 174507 174485 174485 174295
52900A74295j48M83J423K026J922J305P57O83Q66P27J56k47K1O66J065J121J182
$$ 174295 174147 174630 176053 178079 180001 181306 182063 182746 183612 184339 184495 184248 184269 184935 186000 187121 188303
52883A88303J407J628J701J469O74n84j578j665j107n40J8Q52J550J360N46K99
$$ 188303 189710 191338 193039 194508 195182 194598 193020 191355 190248 189708 189726 190578 192128 193488 194034 194333
52867A94333R98J644J397P59N53O77N81L48M00O24O14M90O50R72J047R80J231
$$ 194333 195331 196975 198372 199131 199684 200361 200942 201290 201690 202314 202928 203418 204068 205040 206087 207067 208298
52850B08298J687J712J189P51Q38J169J402J754K594L736M555M580L783K462J132
$$ 208298 209985 211697 212886 213637 214475 215644 217046 218800 221394 225130 229685 234265 238048 240510 241642
52835B41642L17J93M07M17M2m07n68n40p85j524k313k527k219k118k663l375l543
$$ 241642 241959 242152 242559 242976 243018 242611 242043 241503 240718 239194 236881 234354 232135 230017 227354 223979 220436
52818B20436l183k852k725k409j690r69p76j135j618j810j650j472j728k514l309
$$ 220436 217253 214401 211676 209267 207577 206608 205832 204697 203079 201269 199619 198147 196419 193905 190596
52803A90596l460k887k117j631j419j289j200j235j417j702j981k062j863j620
$$ 190596 187136 184249 182132 180501 179082 177793 176593 175358 173941 172239 170258 168196 166333 164713
52789A64713j599j642j330o71j94k45o52j229k063k956l151k213q65k46n14q17
$$ 164713 163114 161472 160142 159471 159277 159032 158380 157151 155088 152132 148981 146768 145903 145657 145143 144326
52773A44326o69n87j132j907j987j109qM19J1o65j039j105j255j694k235k642
$$ 144326 143657 143070 141938 140031 138044 136935 136927 137346 137357 136692 135653 134548 133293 131599 129364 126722
52757A26722k948l231l340l086k592k148j856j632j468j354j104n71L7M05O08
$$ 126722 123774 120543 117203 114117 111525 109377 107521 105889 104421 103067 101963 101392 101429 101834 102442
52742A02442Q50Q41Rj473k509k281j251n89q37j502j796j438p81l94m67n97l08
$$ 102442 103292 104133 104142 102669 100160 97879 96628 96039 95202 93700 91904 90466 89685 89291 88824 88227 87919
52725H7919K83N49J54o37j457k146k391j658mJ512J839J181O58Q86J415J515R93
$$ 87919 88202 88751 88905 88268 86811 84665 82274 80616 80612 82124 83963 85144 85802 86688 88103 89618 90611
52708I0611J75n05p40m74L4M18N57O04P51J050J404J582J437J206J306J716J905
$$ 90611 90786 90281 89541 89067 89101 89519 90076 90680 91431 92481 93885 95467 96904 98110 99416 101132 103037
52691A03037J652J468J824K378K478K085J593J042K34n61q30o93p95j289j654
$$ 103037 104689 106157 107981 110359 112837 114922 116515 117557 117791 117230 116400 115707 114912 113623 111969
52676A11969j645j617j700j440o09K24L19m25j553k517k824k304j441r90j016
$$ 111969 110324 108707 107007 105567 104958 105182 105501 105076 103523 101006 98182 95878 94437 93447 92431
52661I2431q75l36o6n97j437j726j332p53l20p4o2k35k94j08lk52n12l43Rj17
$$ 92431 91556 91220 91154 90557 89120 87394 86062 85309 84989 84915 84853 84618 84324 84216 84213 83961 83449 83106 83115 82998
52641H2998q13j425j337n78L19P84O49L22M34J131J899K246K181J838J114L7q82
$$ 82998 82185 80760 79423 78845 79164 79948 80597 80919 81353 82484 84383 86629 88810 90648 91762 91799 90917
52624I0917j223j220j288j302r38m58m34q49j095r53q94j250j595j267k06R17
$$ 90917 89694 88474 87186 85884 84946 84488 84054 83205 82110 81157 80263 79013 77418 76151 75945 76862
52608G6862J357J009N00M83Q56R52N50K18L72N77K47l13k82M80J258J416J048
$$ 76862 78219 79228 79728 80211 81067 82019 82569 82787 83159 83736 83983 83670 83388 83868 85126 86542 87590
52591H7590O38N40P76J048J018P89Q76J375J605R88k7n70m93k27J76R41J702J740
$$ 87590 88228 88768 89544 90592 91610 92399 93275 94650 96255 97243 97216 96646 96153 95926 96102 97043 98745 100485
52573A00485J106O59P63Q64N70L57P80J669K504K962K819J967R00N48J134J736
$$ 100485 101591 102250 103013 103877 104447 104804 105584 107253 109757 112719 115538 117505 118405 118953 120087 121823
52557A21823J525R49R72J610J947J493P73N28Q23J194J314J298J382J477J224
$$ 121823 123348 124297 125269 126879 128826 130319 131092 131620 132443 133637 134951 136249 137631 139108 140332
52542A40332N63R1M41J380J929J512O18J07J78L48J95k38o32p26m34J63Q65J432
$$ 140332 140895 140986 141427 142807 144736 146248 146866 146973 147151 147499 147694 147456 146824 146098 145664 145827 146692 148124
52524A48124J618J288O26R4%K05M61Q36J380J705J428Q97P84R71O44l77j255j421
$$ 148124 149742 151030 151656 151750 151750 151955 152416 153252 154632 156337 157765 158662 159446 160417 161061 160684 159429 158008
52506A58008j358j588j622p63N86J283R24J23n27r83j244j094n90k03j80j63K37
$$ 158008 156650 155062 153440 152677 153263 154546 155470 155593 155066 154083 152839 151745 151155 150952 150772 150609 150846
52489A50846Q24J082Q47M73L68N91Q27P02J62l92m38J30Q92J355J416J301J184
$$ 150846 151670 152752 153599 154072 154440 155031 155858 156560 156722 156330 155892 156022 156914 158269 159685 160986 162170
52472A62170J056R14Q76J020J250J425J521J498J170M94r1K2P85J406J254N77
$$ 162170 163226 164140 165016 166036 167286 168711 170232 171730 172900 173394 173303 173325 174110 175516 176770 177347
52456A77347K8k17m19o25n75k24J29L47O37J062J251Q02j14q16p64j76R2n60j681
$$ 177347 177375 177158 176739 176114 175539 175315 175444 175791 176428 177490 178741 179543 179429 178613 177849 177673 177765 177205 175524
52437A75524k180j638p76l81k87N7N48O47L55J81K41K43K23M96Q44O73K9m03m41
$$ 175524 173344 171706 170930 170549 170262 170319 170867 171514 171869 172050 172291 172534 172757 173253 174097 174770 174799 174396 173955
52418A73955o44j107j130n22k37r60j884j793p92j7j8k45l3O02J165J122L40o39
$$ 173955 173311 172204 171074 170552 170315 169355 167471 165678 164886 164869 164851 164606 164573 165175 166340 167462 167802 167163
52400A67163r45l88K68L12o8l71o14j005j239r20l41r1j49r9K6n7lQ82K358L153
$$ 167163 166218 165830 166098 166410 166342 165971 165357 164352 163113 162193 161852 161761 161612 161513 161539 161482 161479 162361 164719 167872
52380A67872K482J049J58L44J144J822K012J826J579J341Q32o5q44q06J16J274
$$ 167872 170354 171403 171561 171905 173049 174871 176883 178709 180288 181629 182461 182396 181552 180746 180862 182136
52364A82136K056K322K156J647J036P33R66J669K680L803M642M756M097L051J958
$$ 182136 184192 186514 188670 190317 191353 192086 193052 194721 197401 201204 205846 210602 214699 217750 219708
52349B19708Q87l2l08N03K164L696M104L265K046J453J659K078K311K556K973
$$ 219708 220595 220563 220255 220758 222922 226618 230722 233987 236033 237486 239145 241223 243534 246090 249063
52334B49063L140K627J700J010P76P72R12J375K134K866L341L603L728L684L443
$$ 249063 252203 254830 256530 257540 258316 259088 260000 261375 263509 266375 269716 273319 277047 280731 284174
52319B84174L010K421J861J656J933K476L097L831M570M914M784M789N401O200
$$ 284174 287184 289605 291466 293122 295055 297531 300628 304459 309029 313943 318727 323516 328917 335117
52305C35117O549O647P163P983Q294P921P744Q517R987J1392J2272J2571J2426
$$ 335117 341666 348313 355476 363459 371753 379674 387418 395935 405922 417314 429586 442157 454583
52292D54583J2200J2300J2802J3496J4366J5534J6738J7408J7387J7051J6616
$$ 454583 466783 479083 491885 505381 519747 535281 552019 569427 586814 603865 620481
52281F20481J5907J5069J4827J5614J6851J7555J7333J6515J5541J4648J3919
$$ 620481 636388 651457 666284 681898 698749 716304 733637 750152 765693 780341 794260
52270G94260J3285J2592J1760J0851R903Q956Q189P750P368O497M972L252J909
$$ 794260 807545 820137 831897 842748 852651 861607 869796 877546 884914 891411 896383 899635 901544
52257I01544J148Q19N37j43j260k153k166j626j468j872k016j420o90m70l83L39
$$ 901544 902692 903511 904048 903905 902645 900492 898326 896700 895232 893360 891344 889924 889234 888764 888381 888720
52241H88720J688L005L913M534N005N387N875O625P509Q456R747J1495J3076J3704
$$ 888720 890408 893413 897326 901860 906865 912252 918127 924752 932261 940717 950464 961959 975035 988739
52227I88739J3395J2812J2236J1333R991Q736Q098P930P645O867N689M498L615
$$ 988739 1002134 1014946 1027182 1038515 1048506 1057242 1065340 1073270 1080915 1087782 1093471 1097969 1101584
52214A101584L004K255J072k52j140j553k214l808o119q153r114r120q938r139
$$ 1101584 1104588 1106843 1107915 1107663 1106523 1104970 1102756 1098948 1092829 1084676 1075562 1066442 1057504 1048365
52200A048365r581r787r638r477r609r929j0116r965r442q640p830p285o955o480
$$ 1048365 1038784 1028997 1019359 1009882 1000273 990344 980228 970263 960821 952181 944351 937066 930111 923631
52186I23631n710m994m748m860m863m507l966l554l453l639l868l825l439k999
$$ 923631 917921 912927 908179 903319 898456 893949 889983 886429 882976 879337 875469 871644 868205 865206
52172H65206k851l027l328l578l650l432k988k645k589k522k057j402j274k029
$$ 865206 862355 859328 856000 852422 848772 845340 842352 839707 837118 834596 832539 831137 829863 827834
52158H27834l173l905l983l835l916m157m104l489k569j911j812k062k253k344
$$ 827834 824661 820756 816773 812938 809022 804865 800761 797272 794703 792792 790980 788918 786665 784321
52144G84321k710l609m628m898m021k680k093k753l946m604m388l731l158k886
$$ 784321 781611 778002 773374 768476 764455 761775 759682 756929 752983 748379 743991 740260 737102 734216
52130G34216k957l236l341l012k586k669l297l831l828l524l327l256l155l087
$$ 734216 731259 728023 724682 721670 719084 716415 713118 709287 705459 701935 698608 695352 692197 689110
52116F89110l144l126k757k026j099j19O57R01P15P80J667L126M464N395O090
$$ 689110 685966 682840 680083 678057 676958 676839 677496 678397 679112 679892 681559 684685 689149 694544 700634
$$ [...]
##END NTUPLES=NMR SPECTRUM
##END=
