
##TITLE=AC1289_SALAH11099_6534879_mr8djbPAXF
##JCAMPDX= 6.0         $$ Bruker NMR JCAMP-DX V2.0
##DATA TYPE= NMR SPECTRUM
##DATA CLASS= NTUPLES
##ORIGIN= BRUKER
##OWNER= Administrator
$$ 1.72 TOPSPIN		Version 2.1
$$ 2012-07-16 21:25:52.578 -0500  Administrator@TOPSPIN
$$ Compression mode = diff/dup
##.OBSERVE FREQUENCY= 400.02188249412
##.OBSERVE NUCLEUS= ^1H
##.ACQUISITION MODE= SIMULTANEOUS (DQD)
##.ACQUISITION SCHEME= undefined
##.AVERAGES= 8
##.DIGITISER RES= 22
##SPECTROMETER/DATA SYSTEM= spect
##.PULSE SEQUENCE= zg30
##.SOLVENT NAME= COFFEE_meoh
##.SHIFT REFERENCE= INTERNAL, COFFEE_meoh, 1, 14.98509
##AUDIT TRAIL= $$ (NUMBER, WHEN, WHO, WHERE, PROCESS, VERSION, WHAT)
$$ ##TITLE= Audit trail, TOPSPIN		Version 2.1
$$ ##JCAMPDX= 5.01
$$ ##ORIGIN= Bruker BioSpin GmbH
$$ ##OWNER= Administrator
$$ $$ C:\Bruker\TOPSPIN/data/COFFEE/nmr/AC1289_SALAH11099_6534879_mr8djbPAXF/20/pdata/1/auditp.txt
$$ ##AUDIT TRAIL=  $$ (NUMBER, WHEN, WHO, WHERE, PROCESS, VERSION, WHAT)
(   1,<2012-07-16 21:25:44.078 -0500>,<Administrator>,<TOPSPIN>,<go>,<TOPSPIN 2.1>,
      <created by zg
	started at 2012-07-16 21:24:37.140 -0500,
	POWCHK enabled, PULCHK disabled,
       configuration hash MD5:
       6B 1B 68 BB D9 2E 58 E2 7F 35 AD 54 07 DF 0E 41
       data hash MD5: 64K
       37 DF 1F 2A 3E A8 B0 99 15 62 FC EE FF 3D EF 0B>)
(   2,<2012-07-16 21:25:48.359 -0500>,<Administrator>,<TOPSPIN>,<proc1d>,<TOPSPIN 2.1>,
      <Start of raw data processing
       efp LB = 0 FT_mod = 6 PKNL = 1 PHC0 = 0 PHC1 = 0 SI = 32K 
       data hash MD5: 32K
       21 83 47 7A F3 0C 8C B9 A1 04 77 0C 68 44 35 43>)
(   3,<2012-07-16 21:25:48.687 -0500>,<Administrator>,<TOPSPIN>,<proc1d>,<TOPSPIN 2.1>,
      <pk PHC0 = 177.0502 PHC1 = 0 
       data hash MD5: 32K
       EC B6 BD 11 D6 F4 49 08 7E 49 D5 A8 C4 1E 42 E8>)
(   4,<2012-07-16 21:25:48.781 -0500>,<Administrator>,<TOPSPIN>,<proc1d>,<TOPSPIN 2.1>,
      <abs ABSG = 1 
       data hash MD5: 32K
       6B 47 B9 D2 44 FD 82 AB A4 C1 2F 69 F4 65 53 AF>)
(   5,<2012-07-16 21:25:48.812 -0500>,<Administrator>,<TOPSPIN>,<proc1d>,<TOPSPIN 2.1>,
      <abs ABSG = 2 
       data hash MD5: 32K
       D0 36 D9 92 FF 2E 5A F3 55 F0 DA 06 E9 3F E0 D4>)
(   6,<2012-07-16 21:25:48.843 -0500>,<Administrator>,<TOPSPIN>,<proc1d>,<TOPSPIN 2.1>,
      <abs ABSG = 3 
       data hash MD5: 32K
       1E 82 42 71 A6 4E F7 D3 FD 19 B8 5B FE D2 5B 66>)
(   7,<2012-07-16 21:25:48.875 -0500>,<Administrator>,<TOPSPIN>,<proc1d>,<TOPSPIN 2.1>,
      <abs ABSG = 4 
       data hash MD5: 32K
       8A 88 1C 60 E9 C0 2E 06 72 57 6A 8F BB 65 45 CE>)
(   8,<2012-07-16 21:25:48.890 -0500>,<Administrator>,<TOPSPIN>,<proc1d>,<TOPSPIN 2.1>,
      <abs ABSG = 5 
       data hash MD5: 32K
       FD 5D 4F 77 F8 16 4A 3D FA 38 C4 B9 7E 3C 92 11>)
$$ ##END=
$$ 
$$ $$ hash MD5
$$ $$ C0 7E 65 9C 85 6E F7 8B CF 91 22 DC A1 DA 2A 99
##$RELAX= 
##$RELAX= 
##$RELAX= 
##$RELAX= 
##$RELAX= 
##$RELAX= 
##$RELAX= 
$$ Bruker specific parameters
$$ --------------------------
$$ [...]
150 150 150 150 150 150 150 150
##$TP07= 0
##$TPNAME0= <>
##$TPNAME1= <>
##$TPNAME2= <>
##$TPNAME3= <>
##$TPNAME4= <>
##$TPNAME5= <>
##$TPNAME6= <>
##$TPNAME7= <>
##$TPOAL= (0..7)
0.5 0.5 0.5 0.5 0.5 0.5 0.5 0.5
##$TPOFFS= (0..7)
0 0 0 0 0 0 0 0
##$TUNHIN= 0
##$TUNHOUT= 0
##$TUNXOUT= 0
##$USERA1= <user>
##$USERA2= <user>
##$USERA3= <user>
##$USERA4= <user>
##$USERA5= <user>
##$V9= 5
##$VALIST= <valist>
##$VCLIST= <CCCCCCCCCCCCCCC>
##$VD= 0
##$VDLIST= <DDDDDDDDDDDDDDD>
##$VPLIST= <PPPPPPPPPPPPPPP>
##$VTLIST= <TTTTTTTTTTTTTTT>
##$WBST= 2048
##$WBSW= 25
##$XGAIN= (0..3)
0 0 0 0
##$XL= 0
##$YL= 0
##$YMAX_a= 507294
##$YMIN_a= -646477
##$ZGOPTNS= <>
##$ZL1= 120
##$ZL2= 120
##$ZL3= 120
##$ZL4= 120
##$ABSF1= 14.98509
##$ABSF2= -5.573092
##$ABSG= 5
##$ABSL= 3
##$ALPHA= 0
##$AQORDER= 0
##$ASSFAC= 0
##$ASSFACI= 0
##$ASSFACX= 0
##$ASSWID= 0
##$AUNMP= <proc_prof1d_extract_pilot.lims>
##$AXLEFT= 0
##$AXNAME= <>
##$AXNUC= <1H>
##$AXRIGHT= 0
##$AXTYPE= 0
##$AXUNIT= <>
##$AZFE= 0.1
##$AZFW= 0.1
##$BCFW= 0
##$BC_mod= 0
##$BYTORDP= 0
##$COROFFS= 0
##$CY= 15
##$DATMOD= 1
##$DC= 0
##$DFILT= <>
##$DTYPP= 0
##$F1P= 0
##$F2P= 0
##$FCOR= 0.5
##$FTSIZE= 32768
##$FT_mod= 6
##$GAMMA= 0
##$GB= 0
##$INTBC= 1
##$INTSCL= 1
##$ISEN= 128
##$LB= 0
##$LEV0= 0
##$LPBIN= 0
##$MAXI= 10000
##$MC2= 0
##$MEAN= 0
##$ME_mod= 0
##$MI= 0
##$NCOEF= 0
##$NC_proc= -8
##$NLEV= 6
##$NOISF1= 0
##$NOISF2= 0
##$NSP= 0
##$NTH_PI= 0
##$NZP= 0
##$OFFSET= 14.98509
##$PC= 1
##$PHC0= 177.0502
##$PHC1= 0
##$PH_mod= 1
##$PKNL= yes
##$PPARMOD= 0
##$PPDIAG= 0
##$PPIPTYP= 0
##$PPMPNUM= 2147483647
##$PPRESOL= 1
##$PSCAL= 4
##$PSIGN= 0
##$PYNMP= <proc.py>
##$REVERSE= no
##$SF= 400.02
##$SI= 32768
##$SIGF1= 0
##$SIGF2= 0
##$SINO= 400
##$SIOLD= 32768
##$SPECTYP= <>
##$SREGLST= <1H.CDCl3>
##$SSB= 0
##$STSI= 32768
##$STSR= 0
##$SW_p= 8223.68421052631
##$SYMM= 0
##$S_DEV= 0
##$TDeff= 65536
##$TDoff= 0
##$TI= <>
##$TILT= no
##$TM1= 0
##$TM2= 0
##$TOPLEV= 0
##$USERP1= <user>
##$USERP2= <user>
##$USERP3= <user>
##$USERP4= <user>
##$USERP5= <user>
##$WDW= 1
##$XDIM= 32768
##$YMAX_p= 476623790
##$YMIN_p= -682218
##$CURPLOT= <Network HP LaserJet P1505>
##$CURPRIN= <$Network HP LaserJet P1505>
##$DFORMAT= <normdp>
##$LAYOUT= <+/1D_H.xwp>
##$LFORMAT= <normlp>
##$PFORMAT= <normpl>
##$SURQMSG= 1
$$ End of Bruker specific parameters
$$ ---------------------------------
##NTUPLES= NMR SPECTRUM
##VAR_NAME=  FREQUENCY,     SPECTRUM/REAL,   SPECTRUM/IMAG
##SYMBOL=    X,             R,               I
##VAR_TYPE=  INDEPENDENT,   DEPENDENT,       DEPENDENT
##VAR_FORM=  AFFN,          ASDF,            ASDF
##VAR_DIM=   32768,         32768,           32768
##UNITS=     HZ,            ARBITRARY UNITS, ARBITRARY UNITS
##FACTOR=    0.250966925370066, 1,           1
##FIRST=     8223.43324360094, -164449,      -223178
##LAST=      0,             -122768,         55155
##MIN=       0,             -682218,         0
##MAX=       8223.43324360094, 476623790,    0
$$ Real data points
##PAGE= N=1
##DATA TABLE= (X++(R..R)), XYDATA
$$ [...]
19549F2905B0393N4065e773A72444D6581i5337I9735K4499e6271I5268D5943c1112
19536g1432j2833j73769J20790H3983K38898o5127b85476c1859j46316c2767j06440
19525a39207A9874d5146J785k4819A05348a42385j94231h2614A35192b18789B16076
19513a05977k14306i7204p0570j12224A2561R0546b29259i6241K2462m2621k08876
19502c25276D5585a17391l0538d7451l61885H1857b81540h4410c902D4708a13539
19490A77975a77620o2685C1381M1031b04734j30471E8247a1256B27211g7589k95080
19479c72669J38180M2260j13931a26439q8166F5862a1581j59297d6891m89092
19469e35983C2509K28305b50600o0492a24851j41589J02063j531A53018G503d5413
$$ plain form
19549 62905 20393 74458 -5773 172444 46581 -95337 99735 124234 -56271 95268 45943 -31112
19536 -71432 -84265 -258034 -137244 83983 322881 257754 -285476 -31859 -178175 -32767 -139207
19525 -139207 19874 -45146 -43361 -68180 105348 -142385 -336616 -82614 135192 -218789 216076
19513 -105977 -320283 -97204 -167774 -279998 12561 103107 -229259 -96241 -73779 -116400 -325276
19502 -325276 45585 -117391 -147929 -47451 -409336 81857 -281540 -84410 -3902 44708 -113539
19490 177975 -177620 -240305 31381 72412 -204734 -335205 58247 -11256 227211 -77589 -372669
19479 -372669 -234489 -192229 -306160 -126439 -214605 65862 -11581 -170878 -46891 -535983
19469 -535983 32509 260814 -250600 -311092 -124851 -266440 -164377 -165908 153018 7503 -45413
19457A90723a5883A01187a81755j31913C72970c51440A63279i9758d2072k07597
19447b49669k9739a37977b9381r3147l76928A82931L47667A08235a61146B41654
19436b95164J33468A18603a19939o007N7402l40295J3362a47413A82016a81603
19425b35107d5159q9980K5315A67016a84979A26685h0720A7236f2966j80628B72482
19413A3970e1834Q282G8819F969K26741b21320A75177p3232a53444A05956c1428
19401A64741a08147A58794a09941r6067L824L5782C5886b74236E7090c63203c8677
19389A85741d16232a21919J4705G5380a27820j630E1286h9800k03197B22922a80688
19377a5474G8053k483l6557b74653d5323C6698g7353N420C45561H4378b66272
$$ plain form
19457 190723 -15883 101187 -181755 -313668 372970 -351440 163279 -99758 -42072 -249669
19447 -249669 -279408 -137977 -29381 -122528 -499456 182931 530598 108235 -161146 241654
19436 -295164 -161696 118603 -119939 -125946 -68544 -408839 -395477 -147413 182016 -181603
19425 -235107 -45159 -135139 -109824 167016 -184979 126685 -80720 17236 -62966 -243594 272482
19413 13970 -51834 -43552 78819 6969 233710 -221320 175177 101945 -153444 105956 -31428
19401 164741 -108147 158794 -109941 -206008 -202184 -166402 35886 -274236 57090 -363203 -38677
19389 185741 -416232 -121919 -107214 75380 -127820 -129450 51286 -89800 -292997 222922 -180688
19377 -15474 78053 75570 39013 -274653 -45323 36698 -77353 -71933 345561 84378 -266272
19365f846j92941P8581k3848d102A33228c3815H2522b8876l8775j61515r7471
19354c26637J45016A92698d3139A56135b48412A12389d91021K23610q7334n9735
19344d14480K4445F8575d81697A5299b57527C3917f944A95586a18183a6786k14153
19333b30939A4182c4051J333o4776A92154a26497b0417b199l481k42443R2912
19322a55211d5564j82330g7837O703J0969r0379j30603J17779K1609F0346b82722
19310A00572P5238c33481A37120F1010a14028j73484D7290c18050b9226A0395
19299F34f2098k93068h3158L9602k395j54085l5085f2603C14532c46042E8926
19287A24145a7573j80764j40508j23361A52292a27281l65646B36286e1271A7883
$$ plain form
19365 -6846 -199787 -121206 -145054 -4102 133228 -33815 82522 -28876 -67651 -229166 -326637
19354 -326637 -181621 192698 -43139 156135 -248412 112389 -491021 -267411 -354745 -414480
19344 -414480 -390035 68575 -481697 15299 -257527 33917 -6944 195586 -118183 -16786 -230939
19333 -230939 14182 -34051 -32718 -97494 192154 -126497 -20417 -2199 -5680 -248123 -155211
19322 -155211 -45564 -227894 -77837 -71134 -60165 -150544 -281147 -163368 -141759 60346 -282722
19310 100572 175810 -333481 137120 61010 -114028 -287512 47290 -318050 -29226 10395
19299 634 -62098 -355166 -83158 -43556 -45951 -200036 -235121 -62603 314532 -346042 58926
19287 124145 -17573 -198337 -338845 -462206 152292 -127281 -492927 236286 -51271 17883
19276b50993A76538c63998f4959p5497e8306j87586C3728J435J4245q169J01222
19265A42461a25487A14309b13251J4802k1464A43833N2242C6481i7372C11795
19254A06597i604k79376J05362F638c77833h1074m072A63604b96659J22753A36009
19242a63224Q397D9044J08659b83892a945k34898E7721O9991A5161C005M5130
19231D8135M7875g590F7516e5583q1503d2006r9986B5104L6036b29648m5617C993
19218C4023J50354a8649k96611k1445A40705F3592m960J8070J4745c41722a66785
19206c39246J54118A91772a51577B72299c88141A70748L84420a19766I0528a7029
19195a6266l22204B61979f4974A58268a33311B45621a95611E2838b43478J14941
$$ plain form
19276 -250993 176538 -363998 -64959 -140456 -58306 -245892 33728 35163 49408 41239 142461
19265 142461 -125487 114309 -213251 -198449 -219913 143833 196075 36481 -97372 311795
19254 106597 -9604 -288980 -183618 6638 -377833 -81074 -85146 163604 -296659 -173906 136009
19242 -163224 -154827 49044 157703 -283892 -1945 -236843 57721 127712 15161 3005 48135
19231 48135 96010 -7590 67516 -55583 -137086 -42006 -141992 25104 61140 -229648 -275265 3993
19218 34023 184377 -18649 -315260 -336705 140705 63592 58632 76702 91447 -341722 -166785
19206 -339246 -185128 191772 -151577 272299 -388141 170748 555168 -119766 90528 -17029
19195 -16266 -338470 261979 -64974 158268 -133311 245621 -195611 52838 -243478 -128537
19185a28537q1132k0083l893F3122b08971D3191a29380C7105a88826c8782k1467
19174f0249A80924d08676J99452O9651A27504d19272K04984a7444j62277M6481
19164a33240L9233j45019a08408L4623j30812i8266l9756p4370c2759k46421r88
19153b80168O0093A16936g7496k89053B51957c5510q0644e7668B89777a6678k72387
19142b89065J4775k8716J28515k9156E5708K36381f4151I992b84046B38431i3731
19130a18727A35084i0479B35427Q2629a43944d5742D0009c29878A11353c60384
19119f9135b9618A77726D3538K42600A09275a38056i162n2579j21041E01305f6334
19107C41395h2369B8455a66838I5310B9148d15580h0467c9470C08161d8703o4029
$$ plain form
19185 -128537 -209669 -229752 -233645 63122 -208971 43191 -129380 37105 -188826 -38782 -60249
19174 -60249 180924 -408676 -209224 -139573 127504 -419272 -214288 -17444 -179721 -133240
19164 -133240 -94007 -239026 -108408 -73785 -204597 -98266 -138022 -212392 -32759 -279180 -280168
19153 -280168 -220075 116936 -77496 -366549 251957 -35510 -116154 -57668 289777 -16678 -289065
19142 -289065 -274290 -303006 -174491 -203647 55708 292089 -64151 9992 -284046 238431 -93731
19130 -118727 135084 -90479 235427 318056 -143944 -45742 40009 -329878 111353 -360384
19119 -69135 -29618 177726 43538 286138 109275 -138056 -9162 -61741 -182782 501305 -66334
19107 341395 -82369 28455 -166838 95310 29148 -415580 -80467 -39470 308161 -48703 -112732
19096a12732c4061B22301i7536C95036A97423a17668j94741N9368B03647e6662
19085B41882C2587L7583a02500b9260F5207I168J22471a29407B379h894o4069
19074g2963j99731O037Q5092C0628J2956b23698R3438D836h7870l3825A76894
19062B92627a45020e0889o247F8467J00240c9098j18254I0319a19873j05131A42244
19050a11697A23529h9460B72391F561O0957J66089A00222c10102O9732A19231
19039b03768j22429E3204a79646P9488I7583h8818d3968A6026b3748A14893b58696
19027a16053m9043b1779m3787p4366E6357g3356E4106a59796I3434a2381G2738
19015D1155a01046l5665B06801c78349A99967C7975b93396a26432b0232c436j29475
$$ plain form
19096 -112732 -34061 222301 -97536 395036 197423 -117668 -312409 -253041 203647 -56662
19085 241882 32587 70170 -102500 -29260 65207 9168 131639 -129407 2379 -8894 -72963
19074 -72963 -272694 -266657 -181565 30628 43584 -223698 -130260 4836 -87870 -121695 176894
19062 292627 -145020 -50889 -57136 68467 168707 -39098 -157352 90319 -119873 -225004 142244
19050 -111697 123529 -89460 272391 6561 67518 233607 100222 -310102 -240370 119231
19039 -203768 -326197 53204 -179646 -100158 97583 -88818 -43968 16026 -23748 114893 -258696
19027 -116053 -165096 -21779 -65566 -139932 56357 -73356 54106 -159796 93434 -12381 72738
19015 41155 -101046 -136711 206801 -378349 199967 37975 -293396 -126432 -20232 -3436 -132911
19004a32911M7345a7495k61342a14768H798b24088B382b90086I399b31338H1898
18992b46351H1060g8931J3391p588C3910a42282j29713a14829k13362G1460f3164
18980c4627C3870b3241F3249b29308j5115A22079d1529j10259L2342e6147j02525
18969a58672j58083A98181o2234e80524J77035m7287F845L66151A36821a59349
18958A26986a10909J2544C48564a36750A87919c55170A36961J4340K70366A87451
18947A49082C353d4901K1991l3888p8269M5092j7340a4471n9525C70866G1216
18935e1187j50631P5465l5941l9799L3402B04939g8776A8787N2810m764M4121
18924A10954m8028R4914E2147N3794b60787I6291e2039B0246b61585D8205J50644
$$ plain form
19004 -132911 -85566 -17495 -278837 -114768 8798 -224088 2382 -290086 9399 -231338 81898
18992 -246351 81060 -78931 -65540 -73128 33910 -142282 -271995 -114829 -328191 71460 -63164
18980 -34627 33870 -23241 63249 -229308 -244423 122079 -41529 -151788 -119446 -56147 -158672
18969 -158672 -316755 198181 135947 -580524 -403489 -450776 6845 372996 136821 -159349
18958 126986 -110909 -98365 348564 -136750 187919 -355170 136961 151301 421667 187451
18947 149082 3353 -44901 -22910 -56798 -135067 -89975 -107315 -14471 -73996 370866 71216
18935 -51187 -201818 -126353 -162294 -202093 -168691 204939 -78776 18787 71597 66833 110954
18924 110954 62926 157840 52147 105941 -260787 96291 -52039 20246 -261585 48205 198849
18913A98849b09039O6447B870h6231b4853H2967a35064k48652f3547N662B53614
18901e8948B21446a74763k5291B12130a4443A31385H618c4158r4203A08383B2560
18889A43299F5251M1543c41743O0666m9025R3168g1282I3492i5496j32952K8835
18878a99613P4847a3360A49615b5224r7171j81472e3919A33337a32337M6769D666
18866H8051i6577G9646a66547g4633l7624j02018A22460P4264q2313f6114A77820
18854A64347b4257I8234D0768L44104b70919l4792G9067g744A66039a99204A34362
18842c9895A68108a5835k2516C0129a14824k4447h263I2627J59165j15426O8818
18831B05184o1291d32319a22487Q237C6619e814j16184l0706j45940g1193A89261
$$ plain form
18913 198849 -209039 -142592 2870 -86231 -24853 82967 -135064 -383716 -63547 -57885 253614
18901 -58948 221446 -174763 -200054 212130 -14443 131385 8618 -34158 -128361 108383 22560
18889 143299 65251 106794 -341743 -281077 -330102 -236934 -71282 93492 -95496 -228448 -199613
18878 -199613 -124766 -13360 149615 -25224 -122395 -303867 -53919 133337 -132337 -85568 4666
18866 88051 -96577 79646 -166547 -74633 -112257 -214275 122460 196724 114411 -66114 177820
18854 164347 -24257 98234 40768 384872 -270919 -305711 79067 -7744 166039 -199204 134362
18842 -39895 168108 -15835 -38351 30129 -114824 -139271 -8263 92627 251792 136366 205184
18831 205184 143893 -432319 -122487 -114250 36619 -5814 -121998 -152704 -298644 -71193 189261
18819c5692A09105D2841O7463k742N6947C8322M5727a3743C60913e1662D9161
18807G8597m16L2801f5057i536j31313E2342d1134l8810q7358d2092D74124b47959
18794A00465c15412A32305J64731b71142A03009P3517a91336H9452i0567b1554
18783B3658g44A36480D5230b08214e5885A67731j5645a339k42023A12257a15019
18771a822o039m6148H2211B2721G686a20574H5578h0860F3149b06267A09374a90646
18758b86661d7392C9253J11226k8124h0550k5106M0578p8532A15938F326a12806
18746b3608I4487b66736j05202H368c93235c8210a3117o0287E3093K85920a49437
18734c49166k32228D5922e707G960f2582k57562G792a73497k6788g4468k753o4395
$$ plain form
18819 -35692 109105 42841 110304 107562 164509 38322 84049 -13743 360913 -51662 49161
18807 78597 78181 110982 -65057 -9536 -140849 52342 -41134 -79944 -167302 -42092 474124 -247959
18794 100465 -315412 132305 297036 -271142 103009 176526 -191336 89452 -90567 -21554
18783 23658 -744 136480 45230 -208214 -55885 167731 152086 -1339 -243362 112257 -115019
18771 -1822 -7861 -54009 82211 22721 7686 -120574 85578 -80860 63149 -206267 109374 -190646
18758 -286661 -47392 39253 150479 122355 -80550 -105656 -65078 -143610 115938 6326 -112806
18746 -23608 94487 -266736 -371938 8368 -393235 -38210 -13117 -73404 53093 339013 -149437
18734 -349166 -581394 45922 -5707 7960 -62582 -320144 7792 -173497 -200285 -74468 -77221 -141616
18722a41616p7182j805k8937j40215f4435C35446i3876A6193e5950j87502J20833
18711a22619B08886b7961k61326A1419d5544B04163b62194J16508o7656k64642
18701d77984C7825J91448p7916l2707B4637b29936h5836a5265N073m8971q0728
18690a39891k3364D2049b9004C4066R7575e1326H2874j3079b8099k33365k54300
18679e15764i2043b5455A88389N5276M4949A36308a12737J7157k79422h7045F7592
18667d7000B8867N5073O2774c1146A43705a75141j87627G0152b47852m7768c0677
18655G7326e4188A92578B9802b54791A31734c75107h711B9186l149f0152F1870
18643b56923P5792L5544j79437a25310B40571d6341A7800a5818A1050e8223C09767
$$ plain form
18722 -141616 -218798 -220603 -249540 -389755 -64435 335446 -93876 16193 -55950 -243452 -122619
18711 -122619 208886 -27961 -289287 11419 -45544 204163 -262194 -145686 -213342 -477984
18701 -477984 37825 229273 151357 118650 24637 -229936 -85836 -15265 -10192 -59163 -139891
18690 -139891 -163255 42049 -29004 34066 131641 -51326 82874 69795 -28099 -261464 -515764
18679 -515764 -92043 -25455 188389 243665 288614 136308 -112737 -95580 -375002 -87045 67592
18667 -47000 28867 83940 146714 -31146 143705 -175141 -362768 70152 -247852 -295620 -30677
18655 77326 -54188 192578 29802 -254791 131734 -375107 -8711 29186 26037 -60152 61870
18643 -256923 -181131 -145587 -325024 -125310 240571 -46341 17800 -15818 11050 -58223 309767
18631e8162r2204m3824g6233q4246A9488L27888c90425D2698K34283n2537m6871
18620A77573M6646d03500a9712j00531K696m39707A2875L57819d7088A2142J02945
18609A15087Q5316g9509j20469h4690D77879b49206K9136d1231a5398A31378m819
18598A26559f8k8988C40136H8684d7486f483j27318e9758n9570j76084c6808A44215
18585E5028e0089j47403J8738I565b79149j18968O5057A13765a91522R0571m6070
18574a47021d0795A73235f2899h824G2558O6703c07001J00233J2268c7778c731
18562C29751G2946Q9537R436I425c88219B65729B9734J29030a34274k62618G9121
18550F9166b59526f2061l65358f8361j14485K802a3827j93668J01580H3210a11609
$$ plain form
18631 -58162 -150366 -194190 -76233 -160479 19488 347376 -390425 42698 276981 224444 177573
18620 177573 224219 -403500 -19712 -120243 -117547 -557254 12875 370694 -47088 12142 115087
18609 115087 200403 -79509 -199978 -84690 477879 -249206 -220070 -41231 -15398 131378 126559
18598 126559 -68 -29056 340136 88684 -47486 -6483 -133801 -59758 -119328 -295412 -36808 144215
18585 55028 -50089 -197492 -178754 9565 -279149 -398117 -333060 113765 -191522 -100951 -147021
18574 -147021 -40795 173235 -62899 -8824 72558 139261 -307001 -206768 -194500 -37778 -3731
18562 329751 72946 162483 171919 9425 -388219 265729 29734 158764 -134274 -396892 79121
18550 69166 -259526 -62061 -427419 -68361 -182846 -180044 -13827 -207495 -105915 83210 -111609
18538c14613b4276j1341j20703l8270B0355a91536d4046C47033E7938b78047D534
18526b49056i638j28253F2333c1432c596k131p1508a4297A52416L85D2827b02399
18513c46212J38904o5716K6360c57j43532j01420J12844E0494a50682C39329c08932
18501c842k2237B78490q4570a29686j58134O9367d4029k03436M4212A55765J50113
18490C05878d3926A28228c1261q3178c8638j9200B28794Q9459a78919B4774K139
18479B6913D241K17343h2353n9150J9130K7807A4736h1637B4567K1087d2220l09366
18467c51586B47264d6338j42012L1371G3899a52669c6949k69476E8904a83980
18456a20241r7119o7897A94264b07410A97654E8946d4174E7681M1205h6434g787
$$ plain form
18538 -314613 -24276 -35617 -156320 -194590 20355 -191536 -44046 347033 57938 -278047 4534
18526 -249056 -9638 -137891 62333 -31432 -3596 -5727 -77235 -14297 152416 152801 42827 -202399
18513 -346212 -207308 -273024 -246664 -357 -143889 -245309 -132465 50494 -150682 339329 -308932
18501 -3842 -26079 278490 193920 -129686 -287820 -218453 -44029 -247465 -203253 155765 305878
18490 305878 -43926 128228 -31261 -114439 -38638 -57838 228794 318253 -178919 24774 26913
18479 26913 4241 221584 -82353 -141503 -122373 -94566 14736 -81637 24567 45654 -42220 -351586
18467 -351586 247264 -46338 -188350 -156979 73899 -152669 -36949 -306425 58904 -183980
18456 -120241 -217360 -285257 194264 -207410 197654 58946 -44174 57681 98886 -86434 -7787
18444d06144e9415p7052A74879a60080A92830e9438A55392C2871b28177I4826
18433B54951F3740a53915A53862n8967h094G9648O195a66451E4294G555i5611
18421b46527a04966K5573j86327b9228j9119A17758a9089j75651B56521a13657
18410A7691P2560A0092a17532O62g079A52559M35G2545k5139a80405g1550m5280
18398a16830G0113e5466n5173B87964a23042B05606g5077o5948F3724a65030e8421
18386f7170a1658A34762n5474i9995A02867b61468a26707k91081H3589a88164
18375H321Q8155a07369g509B11415b5465j75348j60613C53002A69380J4116B8592
18363a25535B4939b90094L5528A66669J35742c4575l09086b8984k20533A68096
$$ plain form
18444 -406144 -59415 -136467 174879 -160080 192830 -59438 155392 32871 -228177 94826
18433 254951 63740 -153915 153862 94895 -8094 79648 85843 -166451 54294 7555 -95611
18421 -246527 -104966 -79393 -265720 -29228 -48347 117758 -19089 -194740 256521 -113657
18410 17691 90251 10092 -117532 -116870 -7079 152559 152994 72545 47406 -180405 -71550 -116830
18398 -116830 70113 -55466 -110639 287964 -123042 205606 -75077 -141025 63724 -165030 -58421
18386 -67170 -11658 134762 79288 -99995 102867 -261468 -126707 -417788 83589 -188164
18375 8321 96476 -107369 -7509 211415 -25465 -200813 -361426 353002 169380 183496 28592
18363 -125535 24939 -290094 -254566 166669 302411 -34575 -343661 -28984 -249517 168096
18352a19892A13566O8123f8301q2567A27624k266a28301A97657c9361j3494A27649
18340A29525a98321A7658P2917a87932L9609J9548q3626l1702n3916B02613I8182
18328h746n8876B40480D1571j9656r147a74318r4957j0211A32706o4311a96408
18316A14704O2304a66832H1762P5415b9902k72151A98553o7261K6166h7698A34998
18304b09772K9244k42543C71750e700j36327j57227Q4045M9332F2284d3313k72162
18293c15475B03645C0968L26218H3774b72801G0922k7714b2162j67629H9655c5500
18281B35328G5417K2441h2869H0172R2228h5307C8338a21299C68246I3565l6302
18270E7263B7564a09930k68L593r0418A61076a32672D1653O7892b27812B98450
$$ plain form
18352 -119892 113566 181689 -68301 -150868 127624 125358 -128301 197657 -39361 -52855 127649
18340 129525 -198321 17658 90575 -187932 -148323 -128775 -212401 -244103 -298019 202613 98182
18328 -8746 -67622 240480 41571 21915 12768 -174318 -269275 -279486 132706 68395 -196408
18316 114704 177008 -166832 81762 157177 -29902 -302053 198553 131292 157458 -87698 134998
18304 -209772 -180528 -423071 371750 -5700 -142027 -299254 -215209 -165877 62284 -43313 -315475
18293 -315475 203645 30968 357186 83774 -272801 70922 43208 -22162 -189791 89655 -35500
18281 235328 75417 97858 -82869 80172 172400 -85307 38338 -121299 368246 93565 57263
18270 57263 27564 -109930 -110198 -106605 -197023 161076 -132672 41653 109545 -227812 298450
18258d07874A65399b77691n9249A64064c5341q947H6905d5789j54170B8654a36627
18246a24789r4082Q2049B35746f7583A45483a59957E0223g0989A7831M1576a68106
18234h8693l2217B07863e9872k6162c5022j00797A55692P6930a2008C291O5853
18223F9144a46949N7645A5784b73974Q8862C581g5336j42483K3794A27312R9124
18212B26436L8188c28783A36730b02114R1349B71560A28047e0680k80436a51019
18201e0176A23410d9724k74638I3046h2412j47783M8176B5413e2525j54222Q6039
18190a20708l71110a3637j22555A77333B2526J05488i4623a7183G8709a18999
18179a25335d9433A00560D2928a20389A13058C4596a71633f3698B270J14388J94898
$$ plain form
18258 -407874 165399 -277691 -336940 164064 -35341 -44288 86905 -45789 -199959 28654 -136627
18246 -124789 -218871 -136822 235746 -67583 145483 -159957 50223 -70989 17831 59407 -168106
18234 -88693 -120910 207863 -59872 -86034 -35022 -135819 155692 232622 -12008 3291 69144
18223 69144 -146949 -89304 15784 -273974 -185112 3581 -75336 -217819 -194025 127312 226436
18212 226436 264624 -328783 136730 -202114 -110765 271560 128047 -50680 -331116 -151019
18201 -50176 123410 -49724 -324362 93046 -82412 -230195 -182019 25413 -52525 -206747 -120708
18190 -120708 -491818 -13637 -136192 177333 22526 128014 -94623 -17183 78709 -118999
18179 -125335 -49433 100560 42928 -120389 113058 34596 -171633 -63698 2270 116658 311556
18168C11556A33622a22404k93696C3861a335r562D1947a96103c6081B78607c0693
18156a41237F6444d8531F0990c00659a03018r59o5545C59837J22478A72266M1308
18145B13574a05573F4586b07765n8821F6823c37521I7688c27470J63098j96549
18135c60921A16133a39697Q067m7121a5959A47716d56086H5977a56196m4577g3308
18123E3773d2355k35046D3042b00416j5182B28726I5747a27324H7973J55625a9724
18111h898C1985J74509d3927r5614I3299C1966a73125j44705I3268A2837K28139
18100B40976b8728E4747h6710a8119G4550k0291K30197a26631K8723I5524a03288
18088a78728j09728D5777I267P1259L30617a79753A27902a6802A5442E102c83700
$$ plain form
18168 311556 133622 -122404 -416100 33861 -1335 -10897 41947 -196103 -36081 278607 -30693
18156 -141237 66444 -48531 60990 -300659 -103018 -103977 -169522 359837 482315 172266 213574
18145 213574 -105573 64586 -207765 -266586 66823 -337521 97688 -327470 -164372 -360921
18135 -360921 116133 -139697 -131630 -178751 -15959 147716 -456086 85977 -156196 -200773 -73308
18123 53773 -42355 -277401 43042 -200416 -215598 228726 95747 -127324 87973 243598 -19724
18111 -8898 31985 206494 -43927 -139541 93299 31966 -173125 -317830 93268 12837 240976
18100 240976 -28728 54747 -86710 -18119 74550 54259 284456 -126631 -97908 95524 -103288
18088 -178728 -288456 45777 9267 80526 411143 -179753 127902 -16802 15442 5102 -383700
18076c20016P9589K8305M1467D02493g5145B8143b39155A69752i8163j5331C2489
18064H7071L0330b47446j23016a68389C7339P5310d9591D846a3174A9909J31585
18053A51494b1126j90869A53614N342G8035b2160j03107a4099M337k94560a04680
18041i1072B6270h8176o767j05130B00857I773i293o5726I6677b34010J14156
18030a19854A02433k7784b53222I6124O6691f9334H9267c8090m5134J7684l01099
18019c66639B99928e9944J4673D2327a66591q0567f6340I0241J29439a19983B46012
18007b89097D4083a73728B32137q9615f0818p2694e9146l6912B6954a3339B29959
17995f2796D3031a8561B7862a29122p3182h3227c8052j80985m282B00940a44372
$$ plain form
18076 -320016 -240427 -212122 -170655 402493 -75145 28143 -239155 169752 -98163 -113494 32489
18064 87071 117401 -247446 -370462 -168389 37339 112649 -49591 4846 -13174 19909 151494
18053 151494 -21126 -211995 153614 158956 78035 -22160 -125267 -14099 -9762 -304322 -104680
18041 -91072 26270 -88176 -94943 -200073 200857 9773 -9293 -75019 96677 -234010 -119854
18030 -119854 102433 74649 -253222 96124 162815 -69334 89267 -38090 -83224 -65540 -366639
18019 -366639 299928 -59944 -45271 42327 -166591 -247158 -66340 90241 219680 -119983 246012
18007 -289097 44083 -173728 232137 142522 -60818 -133512 -59146 -96058 26954 -13339 229959
17995 -62796 43031 -18561 27862 -129122 -202304 -83227 -38052 -219037 -223319 200940 -144372
17983B526e0553j35938l2576F693K18881r2998d36990g9832A84895d3387C39553
17971b29913h47A73214b5083j22872L4090G6506a3674k67297J37737k30697G8449
17959g2217I7370b59214C30930j36239G8016h1817q5524B61199Q2538b86162J35257
17948a50905d4454A6633P683a9679B9921q962J13587j9467r7h5133a9244B38340
17935g3244J9779I4740h747k6971C02482b64257j9440C39666D8756J12992A0365
17923a4752j88440E9151a73187B88123j23721j8618k3149A6399b26994i0731C6197
17911g4980m4170a2079o2567C0171a22423l6958B6697J19766h0638E6330e1571
17899a19025H3591A6114a65530b5034B45471b0368k86066A48153b02076C6947
$$ plain form
17983 2526 -50553 -186491 -219067 6693 225574 132576 -436990 -79832 184895 -43387 339553
17971 -229913 -847 173214 -25083 -147955 -113865 76506 -13674 -280971 -143234 -373931 78449
17959 -72217 97370 -259214 330930 194691 78016 -81817 -167341 261199 343737 -286162 -150905
17948 -150905 -44454 16633 24316 -19679 29921 20959 134546 115079 114982 -85133 -19244 238340
17935 -73244 -53465 94740 -8747 -35718 302482 -264257 -283697 339666 48756 161748 10365
17923 -14752 -203192 59151 -173187 288123 164402 145784 122635 16399 -226994 -90731 36197
17911 -74980 -119150 -12079 -74646 30171 -122423 -159381 26697 146463 -80638 56330 -51571
17899 -119025 83591 16114 -165530 -25034 245471 -20368 -306434 148153 -202076 36947
17888F443b25390B96090i9751A95594N3975b6399R186A51311a49336A23195B4664
17876d62013f5961A01052c57113D6565d10896B95367a60280A15730J79845A6034
17865A11172e1529C9137C177b8861A44924b10299j07783C0517J78103b51275O1099
17854a90176F3661N5617j729J49471a15356R727C61573l2604H3644c0073k3453
17843e3526E07169A77249b1758A6646K01853a16936e4562G7894L0683J88741b67108
17831b65080A92338i3914D1899d39876a26400k23756b0070k29690I6601e232j74202
17820a79434b7625q3879G98f1659A86465o3976b66252A13660N847O0296E2592
17808B35496i8121L6313k2646B42609f1567k23143G8280b8466A90700b71299A45618
$$ plain form
17888 6443 -225390 296090 -99751 195594 249569 -26399 -17213 151311 -149336 123195 24664
17876 -462013 -65961 101052 -357113 46565 -410896 295367 -160280 115730 295575 16034
17865 111172 -51529 39137 3177 -28861 144924 -210299 -318082 30517 208620 -251275 -190176
17854 -190176 63661 119278 117549 267020 -115356 -105629 361573 328969 83644 -30073 -53526
17843 -53526 507169 177249 -21758 16646 218499 -116936 -54562 77894 108577 297318 -267108
17831 -265080 192338 -93914 41899 -439876 -126400 -350156 -20070 -249760 96601 -5232 -179434
17820 -179434 -27625 -111504 798 -61659 186465 122489 -266252 113660 119507 179803 52592
17808 235496 -98121 -61808 -84454 242609 -61567 -284710 78280 -28466 190700 -271299 145618
17796b78878A09261B714b84407a37781C04229b77635g6879B14140A1099e0423
17785f3283j78111c4425A99667d92453a02446E1069a97367d4512a4200A1032b00278
17773e3945j1800A2988K21524J82521a86923O5522B20322J74319b37661O6891
17763a70770b423j57927c5283k15254B50942a77043c3537F6077J30282d4837l3984
17752g8821L6456l4351a0463A73026i0357H2576f4633j24922D05888a7009k05838
17741b22847F7858R9372E5510h1412I8562f3720E2038J61938J01676G0236g1648
17729C204K2803J06496E4057a9929n7533K9957n2074C0837c3315j57119B54175
17717A21629N7957m7184a01171A39327B2986m565b05048f5683j04238A26031M963
$$ plain form
17796 -278878 109261 2714 -284407 -137781 304229 -277635 -76879 214140 11099 -50423
17785 -63283 -241394 -34425 199667 -492453 -102446 51069 -197367 -44512 -14200 11032 -200278
17773 -53945 -65745 12988 234512 417033 -186923 -121401 220322 394641 -237661 -170770
17763 -170770 -2423 -160350 -35283 -250537 250942 -177043 -33537 66077 196359 -44837 -78821
17752 -78821 -42365 -76716 -10463 173026 -90357 82576 -64633 -189555 405888 -17009 -222847
17741 -222847 67858 167230 55510 -81412 98562 -63720 52038 213976 315652 70236 -71648
17729 3204 26007 132503 54057 -19929 -77462 -47505 -99579 30837 -33315 -190434 254175
17717 121629 179586 132402 -101171 139327 22986 18421 -205048 -65683 -169921 126031 130994
17706A30994B2051L4682m833A6050a0028D1641K37119j6054f9966B8530c33845
17694F8886a45041C5086L55157l3287A52774p5847J4159N3893E9183M2859P6247
17683A78289c2394B02605A0631J24662F4177L10520e3676o8926C3188b42851J12983
17672a29868a3504G029J1772J70318G8092k5720A3191e7777a6255k31100E08230
17660A60670a72723I5199j7575P9101E9109A1516N7192b36839a07827A65448j2259
17649A53189e8424J1885B36128a78575c0318B70901j3987E4955b12343B10272
17638h0816l4547B01817B9327a87855A13212K40269c44226C28333n9471d1831
17627B76155b01910A66135a20586k4499L0231c7589A55677a22396A99535a84237
$$ plain form
17706 130994 22051 56733 51900 16050 -10028 41641 278760 262706 -69966 28530 -333845
17694 68886 -145041 35086 390243 356956 152774 76927 91086 144979 59183 102042 178289
17683 178289 -32394 202605 10631 135293 64177 374697 -53676 -122602 33188 -242851 -129868
17672 -129868 -13504 7029 18801 189119 78092 52372 13191 -57777 -16255 -247355 508230
17660 160670 -172723 95199 77624 156725 59109 11516 68708 -236839 -107827 165448 153189
17649 153189 -58424 -46539 236128 -178575 -30318 270901 256914 54955 -212343 210272
17638 -80816 -115363 201817 29327 -187855 113212 353481 -344226 328333 268862 -41831
17627 276155 -201910 166135 -120586 -145085 -114854 -37589 155677 -122396 199535 -184237
17616a51528D3376f4299j41975B7122e5797K2739A2114N7781a19159B80628H9129
17604c13407A88007q8913A6755L73256b5584C14143A5765J70728b11256B5353
17593A67700b4839A23205b77008R9950b2581l7012I5075D7205g4382C5889a23827
17581A38248n0881a45071L599p0512A46770a10223D30872A11574J89912B7773
17570I2492A3805b16564H7968J02712a60713F6077J50981D5480Q6995j5149g9694
17558G9983h3826D57845c8465A4347i8152A46825E8560K00172G3148R9469o6258
17547A06359a01906E2087N5686b99420A42776E1871a54441f1571k89750a23895
17536A64764B3428L51829P016j42777G802K89866d0183H2670J53271L09319a50698
$$ plain form
17616 -151528 43376 -64299 -206274 27122 -55797 -33058 12114 69895 -119159 280628 89129
17604 -313407 188007 99094 16755 390011 -25584 314143 15765 186493 -211256 25353
17593 167700 -24839 123205 -277008 -177058 -22581 -59593 95075 47205 -74382 35889 -123827
17581 138248 87367 -145071 -141472 -211984 146770 -110223 430872 111574 301486 27773
17570 92492 13805 -216564 87968 190680 -160713 66077 217058 45480 132475 117326 -79694
17558 79983 -83826 457845 -38465 14347 -98152 146825 58560 258732 73148 172617 106359
17547 106359 -101906 52087 107773 -299420 142776 51871 -154441 -61571 -351321 -123895
17536 164764 23428 375257 382273 239496 7802 297668 -40183 82670 235941 545260 -150698
17524a33759B12991k9161K7225E1360K03847I6313m0605E194K61467l155a00984
17512b939p7220D6451O3926g5087M851B4192Q1312D3372J56358a96890g1305B8773
17499B51094R645C2362r843a65260D618J68489f9899B62075J78940G4165d133
17487B76098J03688q0142a7047A87109F5272l1876h7735B82845p7337G3389J64213
17476B37602H9038a24735e9209j36402e0263D00114E7555K28103q7729q8048a8524
17464a8536j8797A00572J63317g1289A75990l3572J75546D6222Q6369R3928H6132
17452C75389A78934L16818B11737J09630q0005P8121J90858G4333J92743K7943
17442B95019N6225j57578a3851C62601o0761f0835A83602H3047Q1519g4382F3138
$$ plain form
17524 -133759 212991 183830 211055 51360 255207 96313 55708 5194 266661 263506 -100984
17512 -2939 -80159 46451 110377 -75087 -70236 24192 105504 43372 199730 -196890 -71305 28773
17499 251094 260739 32362 22519 -165260 4618 173107 -69899 262075 441015 74165 -4133
17487 276098 379786 299644 -17047 187109 65272 33396 -87735 282845 205508 73389 237602
17476 237602 89038 -124735 -59209 -195611 -50263 400114 57555 285658 197929 109881 -18524
17464 -18536 -37333 100572 263889 -71289 175990 142418 317964 46222 132591 226519 86132
17452 375389 178934 495752 211737 321367 241362 319483 510341 74333 267076 295019
17442 295019 351244 193666 -13851 362601 301840 -60835 183602 83047 164566 -74382 63138
17430B09874J25367j1031A54228n7098J92500p3483a03451K4525B98777G5419
17419C36098k1528b9297A63265K44573J67120A21149Q4195o0142l9751Q0686C692
17407H3389N9551j5814a3584C26025A57621j7030n5086Q1256L26790A28573J03147
17396B31720j09099J14960j5617D0846L10578r7924b823G6515O2369C4649J85916
17385B20565a0297j6269A10057E3325P7028L1548k810a26147A90320b284B20825
17373A16783J6038J06588M9666l4784C4795L87850A60176J98014p9293a38892
17362B2747J19726D5265Q0198J90398c3311C35655j32461H9716a0128r7247A64621
17350e4700A07199A7463a53084a9931B40413p8388M0219p7656L9446K36253A61529
$$ plain form
17430 209874 335241 324210 154228 97130 289630 216147 -103451 -78926 298777 75419
17419 336098 314570 -29297 163265 407838 574958 121149 205344 145202 105451 186137 3692
17407 83389 142940 127126 -13584 326025 157621 140591 85505 166761 493551 128573 231720
17396 231720 122621 237581 221964 40846 351424 253500 -2823 76515 138884 34649 220565
17385 220565 -10297 -26566 110057 53325 130353 161901 159091 -126147 190320 -2284 220825
17373 116783 132821 239409 289075 254291 34795 422645 160176 358190 278897 -138892
17362 22747 142473 45265 125463 315861 -33311 335655 203194 89716 -10128 -107375 164621
17350 -54700 107199 17463 -153084 -19931 240413 162025 202244 124588 164034 400287 161529
17338D0156K04313I2293m127a87364A03420L16072d3138A64415J63623j20851
17328B07187N1432l7488r5616M4255J2873F2263a68344C48937E8265K55548A21885
17316C20034A05016D272K2074M25496A34615D6282a77095D9013a15918B48113
17305B39542a2432D79647B8963P0078J12029m6554j826J93916j57140g8484C22611
17293C80505A53539F6568K74645J80512D4565K71366O8795J06161A74464M64066
17283F38530i5821D18404j15930a1795A20384d2611A79622J45796j16101A5385
17272A21984J78605I5370D1344J66717K46119A34084c4826B73960J3519j2067
17262B75412p4197M2856J12791F9307M0417J51743A03099K33852j25739l5243
$$ plain form
17338 40156 244469 92293 88166 -187364 103420 419492 -43138 164415 328038 207187
17328 207187 258619 221131 125515 169770 182643 62263 -168344 348937 58265 313813 121885
17316 320034 105016 4272 26346 451842 134615 46282 -177095 49013 -115918 248113
17305 239542 -12432 479647 28963 99041 211070 164516 162690 356606 199466 -78484 322611
17293 380505 153539 66568 341213 521725 44565 315931 384726 490887 174464 638530
17283 638530 -95821 418404 302474 -11795 120384 -42611 179622 325418 209317 15385
17272 121984 300589 95370 41344 208061 454180 134084 -34826 273960 287479 275412
17262 275412 201215 244071 356862 69307 109724 261467 103099 336951 211212 175969
17252A75969e7990D06191J95873B85021J24946j96180K8853d1089B45991Q339
17242B54330a3050o2187B93236l7161e3j7904C47660q8514O0316L3178K5010j02289
17230B75361B0924R3069K24525N8727h73C06393G17P3560R3997J30138j9918n7864
17218B20630E6425O6097J38499O4128o741j01508a03663A70634J39811M3754J75705
17207E29904D5726L85027A27920L25164k21058B046M39207C3101P278K98501H0068
17195D20070E4509L5649P8090M1567G7943J1823J93626k191N3489m4160A07105
17183A64311D6297P8522Q9139L99150k77329J18527A48138J4149N0564p3566n5039
17172H4246K61133B0658L46963p2971J00756A06797A2494J88412N934k2833J73630
$$ plain form
17252 175969 -57990 406191 602064 285021 409967 213787 242640 -41089 245991 254330
17242 254330 -13050 -75237 293236 256075 -53 -17957 347660 259146 319462 352640 377650 275361
17230 275361 20924 113993 338518 397245 -873 306393 717 74277 168274 298412 278494 220630
17218 220630 56425 122522 261021 325149 318408 216900 -103663 170634 310445 354199 529904
17207 529904 45726 430753 127920 453084 232026 2046 441253 33101 40379 338880 80068
17195 420070 54509 90158 168248 209815 77943 89766 283392 281201 334690 290530 107105
17183 164311 46297 124819 213958 613108 335779 454306 148138 162287 212851 139285 84246
17172 84246 345379 20658 367621 294650 395406 106797 12494 200906 206840 184007 357637
17161C57637o5699j01544o283K55313j61990N8194K07881I6732J30622c1144B27519
17149B84985P1300p7236L3998j48180Q4703A9712M26037j04065e6248E27877M6022
17138E73899g9151F01768k94835J19444k04843l3780O2970O4651J59339j11615
17128C63099j19185r8664M23856p0808R2480q210k84326Q73k6475J86474J01604
17117E60718j72696n9694K46427n907C0747L90208l2543j12656J38122A91803
17106C45347J85868k51152K23804j77005M5989M05000l86542K03539A62619J51888
17096C14507A02935L28436J0094R8689A83241K95890N5613j32375O3890m7854
17086D18405j76980R128k7829J84817N2148K41956l28044L05594j0746k24079
$$ plain form
17161 357637 291938 190394 184111 439424 277434 335628 543509 96732 227354 -31144 227519
17149 284985 356285 279049 313047 164867 249570 19712 445749 341684 -56248 527877 573899
17138 573899 -79151 601768 306933 426377 221534 187754 250724 315375 474714 363099
17128 363099 243914 145250 569106 498298 590778 582568 298242 299115 272640 459114 560718
17117 560718 388022 328328 574755 568848 30747 420955 388412 275756 413878 191803
17106 345347 531215 280063 503867 326862 372851 777851 391309 594848 162619 314507
17096 314507 102935 431371 441465 540154 183241 479131 534744 402369 466259 418405
17086 418405 241425 250553 222724 407541 459689 701645 373601 679195 668449 444370
17076D44370I9535M92057j21758q1225j33926J37631J14306J65000k2269j65853
17066D83498j33616K45644o7882j78459I0123K25139L21256k70383J68958B38596
17055D95443n0736A78486K85069K72874j74600j72365J40734k30786J85642j16811
17045C68243K37401A86122J92175A61870L16424J23796j37098L14057k47406n178
17035E26465R3612j73430N44624m40870k67521N51496k01518M5635j15792r1383
17025D71318J31172p4234K39301j55419j83827J69567O6374m2708K13356C60213
17014E84083J89460j0092k82523J23325j13093K03421p7600J50937j33978J68185
17004H02125B01326Q23052D24656K88879L7799l03515J81156L18739j8707K0540
$$ plain form
17076 444370 99535 591592 469834 388609 254683 392314 506620 671620 649351 483498
17066 483498 349882 595526 527644 349185 90123 315262 636518 366135 535093 238596
17055 495443 444707 178486 463555 736429 561829 389464 530198 299412 485054 368243
17045 368243 605644 186122 378297 161870 478294 602090 464992 779049 531643 526465
17035 526465 620077 446647 991271 550401 282880 834376 632858 678493 562701 471318
17025 471318 602490 528256 767557 612138 428311 597878 664252 621544 834900 360213
17014 584083 773543 763451 480928 604253 491160 694581 616981 767918 633940 802125
17004 802125 201326 1024378 424656 713535 751334 447819 628975 947714 929007 949547
16994I49547J01549r2350C75109K75348L8292J61501l07441K63141J05583j21686
16984G89847L4132k47317K63375K02591k80265J6726N0157j87148J6224M26603
16974A084925k67780k4445J73524l42076L54004k60281R7228J24605R6768j91355
16964H45117O0351n0933J76509m43335M90607l08632K51890K2245k18488L6851
16954H62182J11978k53022K12965P6582J20607K39145k61888j42626J07376J09277
16944A182576K36926k13833L9614k04069M08726l25471Q3056P1625K1328J6742
16934A317220M06992l31683P7311Q0260m58209L89625j2823k98644J60051K29095
16924A559195r9824l82156L96965N3581j72857j12853N68078m83788Q6411q5880
$$ plain form
16994 949547 1051096 958746 375109 650457 688749 850250 542809 805950 911533 789847
16984 789847 823979 576662 840037 1042628 762363 779089 829246 642098 658322 1084925
16974 1084925 817145 792700 966224 624148 978152 717871 815099 939704 1036472 845117
16964 845117 905468 854535 1031044 587709 1078316 769684 1021574 1043819 825331 862182
16954 862182 974160 721138 934103 1010685 1131292 1370437 1108549 965923 1073299 1182576
16944 1182576 1419502 1205669 1245283 1041214 1449940 1124469 1207525 1279150 1300478 1317220
16934 1317220 1724212 1392529 1469840 1550100 1091891 1481516 1468693 1170049 1330100 1559195
16924 1559195 1459371 1077215 1474180 1527761 1354904 1242051 1810129 1326341 1412752 1326872
16914A326872j0673L24338j03930j20934J13474J79924J53727k83782q0950M91392
16904A989458l57529N4492N3468j38861p6991K50987J00968k35331M40651j84933
16894A896379n64746L05885L0950M37114m24615L35611k57926J88473P3017k04444
16884A815698L83501M10648l69116p2260Q4164J33801o60901O62357j63409M9431
16874B273914n2966R3025m2445K16482o7635K19954k94579J88126J77623k31863
16864B479636P9150P296K98161K2339k30444q9135k96526K87634O55051n7042
16854C156120K44060j70367J9490o0883j27208K02444k77952N56936J17807J41749
16844C802196l87975J61264L62000j43015L61337l18806K76754J97339m41471
$$ plain form
16914 1326872 1316199 1640537 1536607 1415673 1529147 1709071 1862798 1579016 1498066 1989458
16904 1989458 1631929 1686421 1739889 1601028 1524037 1775024 1875992 1640661 2081312 1896379
16894 1896379 1331633 1637518 1668468 2105582 1680967 2016578 1758652 1947125 2020142 1815698
16884 1815698 2199199 2609847 2240731 2168471 2252635 2386436 1725535 2387892 2224483 2273914
16874 2273914 2220948 2313973 2271528 2488010 2420375 2640329 2345750 2533876 2711499 2479636
16864 2479636 2558786 2566082 2864243 2886582 2656138 2567003 2270477 2558111 3213162 3156120
16854 3156120 3400180 3229813 3249303 3188420 3061212 3263656 2985704 3542640 3660447 3802196
16844 3802196 3414221 3575485 3937485 3794470 4155807 3837001 4113755 4311094 3869623
16835C869623L59085J13411j59180R3002J79263O2857J62339J50610j00318j7059
16825D713633j54091M30324M2099K56411K89874j89711O12372o28679M62254N01819
16815F336305k83454k563K93045J51436J11289j89721M52294M36901j46739j24
16805G158669M37673j80536K81464L85655k85885K62104M76893J94689K47325
16796H978051L94169K49256k38361L47511L00841j029N12473P48808R2877K52100
16786A1636696K7077N92763M5631O32029M66572R3633P45918M6883Q85864N11669
16776A5684735L14677Q69338L73476L68290O69207P11703L94862Q43892Q83592
16767B1113772L14368R20930R28655O23013J121512J365362P53986J149133J433427
$$ plain form
16835 3869623 4228708 4342119 4182939 4275941 4455204 4518061 4680400 4831010 4730692 4713633
16825 4713633 4559542 4989866 5031965 5288376 5578250 5388539 6000911 5372232 5834486 6336305
16815 6336305 6052851 6050288 6343333 6494769 6606058 6416337 6868631 7305532 7158793 7158669
16805 7158669 7596342 7415806 7697270 8082925 7797040 8059144 8536037 8730726 8978051
16796 8978051 9372220 9621476 9383115 9730626 10031467 10030438 10542911 11291719 11384596 11636696
16786 11636696 11663773 12256536 12302167 12934196 13400768 13494401 14240319 14287202 15173066 15684735
16776 15684735 15999412 16868750 17242226 17610516 18279723 18991426 19386288 20230180 21113772
16767 21113772 21428140 22349070 23277725 23900738 25022250 26387612 27141598 28290731 29724158
16758B9724158P41212J683822J380224J394050J713357J695136J807767K037541
16750D2177267K170652K364817K088072K366153L151476K284731L363072L362382
16742F3328622L574115L834597M064794M474067M822168M988665N288276N683099
16734A00058403O360112O527418O635489P415855P445433P579328Q125545P957389
16726A58104972Q120087P634220P723244O712475O136876N070744L965529K301632
16718B05769779J120740m65347j529338l439772n105050n367245o674680p746000
16710A76563087p832581q331479q396024p857522q523738p869070p472515p279560
16702A13000598o760548o690552n901634n792750n254196n045715m343976m642788
$$ plain form
16758 29724158 30465370 32149192 33529416 34923466 36636823 38331959 40139726 42177267
16750 42177267 44347919 46712736 48800808 51166961 54318437 56603168 59966240 63328622
16742 63328622 66902737 70737334 74802128 79276195 84098363 89087028 94375304 100058403
16734 100058403 106418515 112945933 119581422 126997277 134442710 142022038 150147583 158104972
16726 158104972 166225059 173859279 181582523 188294998 194431874 199502618 203468147 205769779
16718 205769779 206890519 206425172 204895834 201456062 196351012 190983767 184309087 176563087
16710 176563087 168730506 160399027 152003003 144145481 135621743 127752673 120280158 113000598
16702 113000598 106240050 99549498 93647864 87855114 82600918 77555203 73211227 68568439
16694F8568439l687662l744397l212032l328534k867559k568438k789460k234266
16686D4136091k372997k192953j937350j460539j749798j358834j851072j293414
16678B9919134j504195j160524j111327j172879p83681j118041p50711q99777
16670B1417999j143372r12329k56364q04073l77810n50248r38837p51653l22979
16661A5360334k90775m53437q21062l14650l09133k70598o96701p5129n68468
16652A1560381m02969l10156n59916p7142k05476o16622j46068q7548l52258k06982
16642H595244k33094O1130m71303j94502J23672n14938j77944P4506k23299j67287
16632F872185l56273n4786j44731L185J7981k54436m27284j44442l5049r8676
$$ plain form
16694 68568439 64880777 61136380 57924348 54595814 51728255 49159817 46370357 44136091
16686 44136091 41763094 39570141 37632791 36172252 34422454 33063620 31212548 29919134
16678 29919134 28414939 27254415 26143088 24970209 24186528 23068487 22317776 21417999
16670 21417999 20274627 19362298 19105934 18301861 17924051 17373803 16434966 15683313 15360334
16661 15360334 15069559 14616122 13795060 13480410 13171277 12900679 12203978 12128849 11560381
16652 11560381 11157412 10847256 10287340 10210198 10004722 9388100 9242032 9154484 8802226 8595244
16642 8595244 8362150 8423280 7951977 7757475 7881147 7366209 7188265 7262771 7039472 6872185
16632 6872185 6515912 6461126 6316395 6319580 6337561 6083125 5655841 5511399 5476350 5377674
16622E377674j55796j43414J25715p36111L24552k97939K27155j11411k9952n3675
16612D526798k99874n6127m4351j2367k27484K46470l68871M3577j7832j43087
16602C646852p990k98828J15162p3467N6670l56426K42775J24590n96588J13976
16592B966726Q6043L02388j38875n62553K10867k74344K16981l80645K11911j53602
16582B484897k25427L5858R3686K36959l8689k27913n9412L75087k38899k75169
16572B160978L06349j21669J18226k45047m54011J58042k30151J96413J01499
16563A990629j39654J66650n7612L13355m69207J03775o4000l1921l66300L52474
16553A798189j83292J44565J05679m07805M19021k88871j17421n7285l1205O2374
$$ plain form
16622 5377674 5221878 5078464 5204179 4468068 4792620 4494681 4721836 4610425 4580473 4526798
16612 4526798 4226924 4170797 4126446 4114079 3886595 4133065 3764194 3807771 3789939 3646852
16602 3646852 3638862 3340034 3455196 3381729 3438399 3081973 3324748 3449338 2852750 2966726
16592 2966726 3052769 3355157 3216282 2653729 2864596 2590252 2807233 2426588 2638499 2484897
16582 2484897 2259470 2295328 2389014 2625973 2587284 2359371 2299959 2675046 2436147 2160978
16572 2160978 2467327 2345658 2463884 2218837 1764826 1922868 1692717 1889130 1990629
16563 1990629 1850975 2017625 1960013 2273368 1804161 1907936 1843936 1812015 1445715 1798189
16553 1798189 1614897 1759462 1865141 1457336 1876357 1587486 1470065 1412780 1381575 1443949
16543A443949N8926K7291j47813n658k28356L7643O0769J30439O2584o0745j22675
16532A256354J33487J11525j84225K0871k4366K57910q065o41040L10692L20291
16522A553434m29745Q2938m4815j16630R9816M65053m63595J75973l90899J384
16512I32914O1439K6195J78898l48891J02023k16338O0187K84428K4474l04257
16502H01072K61203l22660J74024j70245L41763J04289r4273m40133L54256R1975
16492A101271m42604J83477j6911q3847L9354p476j26523J07878P8177J31250
16482I64046m21350L68729r8097k42482J71582k77694N30283j93499L28936k85622
16472H44832k36732K53260k51106J40217k09193J31571O9531K48450D71243R4444
$$ plain form
16543 1443949 1502875 1530166 1382353 1376695 1148339 1185982 1246751 1377190 1439774 1379029 1256354
16532 1256354 1389841 1501366 1317141 1338012 1313646 1571556 1563491 922451 1233143 1553434
16522 1553434 1123689 1206627 1161812 1045182 1144998 1610051 1146456 1322429 931530 932914
16512 932914 994353 1020548 1199446 850555 952578 736240 796427 1080855 1105329 801072
16502 801072 1062275 739615 913639 743394 1085157 1189446 1095173 655040 1009296 1101271
16492 1101271 658667 842144 825233 741386 780740 773264 646741 754619 832796 964046
16482 964046 542696 911425 813328 570846 742428 464734 995017 801518 1130454 844832
16472 844832 608100 861360 610254 750471 541278 672849 742380 990830 471243 565687
16462E65687K10324j01830j88875M5919N34504l89926J82436q6812l77786J22441
16452E16082L27673k44716j7266J75862k04555K68058l371C45837N30139k87257
16442E88719K2420J23398n5461C17514L4040J55667J68444p1146J38665k14180
16432E29004K56017l29577A67006N70560B59540L29801J80404l07179k15189M35331
16422F82708k87572M94840m22666j74391j2881j28712N31885C05742O7079R1008
16412D63829k20708J75212j73193L38583B45186m925O981M31448k94812J62087
16402E45965A98650J94870l5618A72974D6442O71867A92293K09380K0485A87939
16391B90801Q27m8309K85534B01046J51973K9915l1208K2486q3869J35321j73506
$$ plain form
16462 565687 776011 674181 485306 531225 1065729 675803 858239 771427 393641 516082
16452 516082 843755 599039 581773 757635 553080 821138 817767 345837 875976 588719
16442 588719 611139 734537 679076 317514 351554 507221 675665 604519 743184 529004
16432 529004 785021 455444 167006 737566 259540 589341 769745 462566 247377 682708
16422 682708 395136 889976 467310 292919 280038 151326 683211 305742 372821 463829
16412 463829 243121 418333 245140 583723 245186 240261 247242 678690 383878 545965
16402 545965 198650 393520 357902 172974 46442 718309 192293 401673 422158 187939
16391 290801 291628 243319 528853 201046 353019 382934 351726 374212 290343 425664 252158
16380B52158J88647A82625J05386K10956j86529J22941k7195j94015J44250o7053
16370B91366K94017L0465B61799J90971F2499M30355P4720N8825B22410P938h9372
16358C13020K41494j87595L5509j37694J93118j99775h794B67843A0445K39563
16348B50008N1872M3764J25227j31623A56982D2362N825J32644H7044P0040J69182
16337C26266F0937L33774M7530A14844J85977A38729M04459k26381j41531R1187
16327B66463J5980N7368A08313D5357L2769J89938R7250E8638K85983J1654J14860
16316D71135j13348A75216I642R7017L77979a71277B75023j35949g8327K3303
16306e5024C92562A43477j7777f8416C51554A26960K46096j1887D3167K93766
$$ plain form
16380 252158 440805 182625 288011 498967 312438 435379 408184 214169 358419 291366
16370 291366 585383 615848 261799 452770 62499 492854 567574 626399 222410 230348 -89372
16358 313020 554514 366919 402428 264734 457852 258077 -8794 267843 10445 250008
16348 250008 301880 345644 470871 339248 156982 42362 48187 180831 87044 157084 326266
16337 326266 60937 394711 442241 114844 300821 138729 543188 316807 175276 266463
16327 266463 282443 339811 108313 45357 78126 268064 365314 58638 344621 356275 471135
16316 471135 357787 175216 9642 106659 484638 -171277 275023 139074 -78327 -55024
16306 -55024 392562 143477 125700 -68416 351554 126960 373056 361169 43167 336933
16296C36933j53952L1496a2519A27003J6401o0614J39396p8039P4881I516g4985
16284A63836K01554c10516A180b06568A67710E5143K20785c4313J3080B23082
16273a18688D8792K88615A44057J29040H7175O9418R1167b09021A18740K1112
16263A39852F8532M9917P5499l1565r455a8420C12655j48819R0576a51349B17489
16251B7263O7942i8640A26166L6707J701l1607J02982o1982J24278j06963J37665
16240C28947J50523J6275A50287J54503k3795A13213a83904A19280b40411A31816
16229A07936J52262b40783h294G5621J49569L5972A3267a80466N0905E5194A2894
16217E20292b6717A86557J70918F1222O8027J18382b08435F1121d1049A53954
$$ plain form
16296 336933 182981 214477 -12519 127003 143404 82790 222186 144147 219028 9516 -74985
16284 163836 365390 -310516 1180 -206568 167710 55143 275928 -34313 -21233 223082
16273 -118688 48792 337407 144057 273097 87175 156593 247760 -209021 118740 139852
16263 139852 68532 118449 193948 162383 152928 -18420 312655 163836 254412 -151349 217489
16251 27263 95205 -98640 126166 162873 164574 132967 235949 173967 298245 191282 328947
16240 328947 479470 495745 150287 304790 280995 113213 -183904 119280 -240411 131816
16229 107936 260198 -240783 -8294 75621 225190 261162 13267 -180466 -129561 55194 12894
16217 520292 -26717 186557 357475 61222 129249 247631 -208435 61121 -41049 153954
16206D4306a8396C25095F5521h5855A81687a68140k5249c3104F9616d9803B05303
16194A48263a19125p2616b7295j8962q3897A00319a16766b8350B1521o187Q2886
16183I8220b01760A13287K78254A24908m4444E532J44100K47907A43405J24017
16173B67422a09621F91J08467C9283J09828O1032K87821a229A59359l0699a75636
16161I0784f9814A04348A0149K66677J36482F1536M1747J48593b21666Q3631l5176
16150a73211Q2939p9263g4203p4180A06877L05904B04719c0228A9681K05080c9936
16138a55942H0433K1634P8106n8138b80960A749N63990B06144d05565D7911B2938
16126E74051c40062E1542a2728k4528A03601k5134N2315K4342J88928f9987l1195
$$ plain form
16206 44306 -18396 325095 65521 -85855 181687 -168140 -193389 -33104 69616 -49803 205303
16194 148263 -119125 -191741 -27295 -46257 -130154 100319 -116766 -28350 21521 15334 98220
16183 98220 -201760 113287 391541 124908 80464 5532 149632 397539 143405 267422
16173 267422 -109621 691 109158 39283 149111 210143 497964 -1229 159359 128660 -175636
16161 90784 -69814 104348 10149 276826 413308 61536 103283 251876 -221666 -138035 -173211
16150 -173211 -90272 -169535 -74203 -148383 106877 412781 204719 -30228 19681 224761 -39936
16138 -155942 80433 102067 180173 122035 -280960 1749 565739 206144 -405565 47911 22938
16126 574051 -340062 51542 -12728 -37256 103601 78467 130782 155124 344052 -69987 -101182
16115a01182d1531B7046j0049J17617e2046A77429J15192n1673F0570g3418k04987
16104b78405A29260L8590j4287J62431j7725q9441b60029C7879b920j4045O125
16093a0840j75065I6294a21643d8391k6242o503H536a07055b4759B83420b97150
16081h2548E5135K10825G4665C1942e4763K5243C07881o2861H8824g1790A03688
16069a43976M8396d1200k7270l5836D6351J75241m8261n8842C1563a58333A78808
16057C17805g1900F0955a85752J2786A23674c9860j69549A0676L40381d1950a3985
16045a34397D8772J4317k4023i7193j24352O5885F9189A9872K26375C9737b16229
16033c0749k95219a06525m9954l5570a6212N097k1860k04386O7140j250H908J4765
$$ plain form
16115 -101182 -41531 27046 16997 134614 -52046 177429 292621 240948 60570 -73418 -278405
16104 -278405 129260 167850 153563 315994 298269 208828 -260029 37879 -2920 -16965 -10840
16093 -10840 -185905 96294 -121643 -48391 -74633 -81136 8536 -107055 -24759 283420 -297150
16081 -82548 55135 265960 74665 31942 -54763 -29520 307881 245020 88824 -71790 103688
16069 -143976 -95580 -41200 -68470 -104306 46351 221592 173331 114489 31563 -158333 178808
16057 317805 -71900 60955 -185752 -172966 123674 -39860 -209409 10676 351057 -41950 -13985
16045 -134397 48772 63089 39066 -97193 -221545 -155660 69189 19872 246247 39737 -216229
16033 -30749 -325968 -106525 -156479 -192049 -16212 -11115 -32975 -237361 -170221 -171471 8908 23673
16021B3673A841c27451J61761N0615j43128H1304i6245G7373a79107F1120J48772
16010B09892c8350j39910j59727g4477k35038K9037A34752B0357d1468A04115
15999a14180k08190A50356k2500c6295B83408D0297b08901g5904A4306h6338A41169
15987e948B5597K1875l612j9081L09770L0406I5546Q3578B7056f7495A58441b97333
15974A8649b31309B61219G7933f0267F8553J25632f9026k3107j68545G672K12905
15963B20577j01035J5938l8442g7062H4507K02784d60361C1953d27489a9134F3521
15951h4835A43092a44821d5309A9012J3026d68379b28025f8634L0542A03125e5728
15939f1793m25573A3869g6310C03255D8765j5568c5798k07681B06999l5364f0014
$$ plain form
16021 23673 1841 -327451 -165690 -115075 -258203 81304 -96245 77373 -179107 61120 209892
16010 209892 -38350 -178260 -337987 -74477 -309515 -280478 134752 20357 -41468 104115
15999 -114180 -322370 150356 127856 -36295 283408 40297 -208901 -75904 14306 -86338 141169
15987 -5948 25597 47472 43860 24779 334549 364955 95546 179124 27056 -67495 158441 -297333
15974 18649 -231309 261219 77933 -60267 68553 194185 -69026 -92133 -260678 7672 220577
15963 220577 119542 135480 97038 -77062 84507 287291 -460361 31953 -427489 -19134 63521
15951 -84835 143092 -144821 -45309 19012 32038 -468379 -228025 -68634 -38092 103125 -55728
15939 -61793 -487366 13869 -76310 303255 48765 33197 -35798 -243479 206999 171635 -60014
15927g0163b6754m04443d654k922k61526n7325a02874m0777J9271l696I6718d56243
15914e66119F9621b5285p4727C7394b45113A31998f7088p2438N1692j88650M6662
15903b29822B55716d4201q996B95206c00405A22997O5599c13997E0724N5450N2074
15892A58248c50558a7495E2231e616k75641I3957c0350k3748E7934g2348E4641
15880A97841c9285l89607A49104a52026L0056j20162g6896c3627A0809a89738
15869e4453D5967O9537c2709B0023b9843j93848B60340c85431a81392d293k46481
15858b50774a07796A81523A6266c85217C75756a88415K5126C57088b73143a02040
15847B14481D4543a31800D07366e2312N747C41423c2918k07375R9104L6600d6043
$$ plain form
15927 -70163 -26754 -431197 -4654 -7576 -269102 -326427 -102874 -143651 -124380 -128076 96718 -456243
15914 -566119 69621 -25285 -100012 37394 -245113 131998 -67088 -139526 -87834 -276484 -229822
15903 -229822 255716 -44201 -53197 295206 -300405 122997 188596 -313997 50724 106174 158248
15892 158248 -350558 -17495 52231 -5616 -281257 93957 -30350 -54098 57934 -72348 54641
15880 197841 -39285 -428892 149104 -152026 -121970 -242132 -76896 -33627 10809 -189738
15869 -54453 45967 115504 -32709 20023 -29843 -223691 260340 -385431 -181392 -4293 -250774
15858 -250774 -107796 181523 16266 -385217 375756 -188415 -163289 357088 -273143 -102040
15847 214481 44543 -131800 407366 -52312 -46565 341423 -32918 -240293 -141189 -104589 -46043
15835g6691j71702A75128N6450F850g7287A63772c67425A50912a51976A45854
15824A04646c89813b8204j32773c3235k41977R8697j30004B7665L5451J71952
15814B35068a09318k54179E2822c60056I1221i1850j04613B25776F9862d8083
15803a59265r2281F2633K52585e603B9166Q1271c62174J8249J12412j43458c7692
15791d7298n055n2971B19498h2382j7544j27974P847i6658h392k40291D6232a86459
15778a10739r1192k1296h5735l9097k2868H9232K30122a2954I508a55660H7587
15766c2421j82457g1231A0697b82609A14961Q577R942n5338m845K8331j9935b48212
15753B72481K3158b42739j13465d1669j27048D5417J19289k3849o295D4468j5624
$$ plain form
15835 -76691 -248393 175128 231578 6850 -77287 163772 -367425 150912 -151976 145854
15824 104646 -389813 -28204 -160977 -33235 -275212 -176515 -306519 27665 63116 235068
15814 235068 -109318 -363497 52822 -360056 91221 -91850 -196463 225776 69862 -48083
15803 -159265 -251546 62633 315218 -5603 29166 110437 -362174 -343925 -231513 -374971 -37692
15791 -47298 -52353 -105324 219498 -82382 -99926 -227900 -220053 -96658 -8392 -248683 46232 -186459
15778 -110739 -201931 -223227 -85735 -124832 -147700 89232 319354 -12954 9508 -155660 87587
15766 -32421 -214878 -71231 10697 -282609 114961 123538 133480 78142 73297 101628 81693 -248212
15753 272481 295639 -242739 -356204 -41669 -168717 45417 164706 140857 134562 44468 28844
15742B8844J20408p226a1903k63417D6276m883K5631J49739J13273j04354a7851
15730C13673c8296j00935I9008b56540N5363A74255b57630A36816a72617j51946
15720c24563N4811d9322A31156B4207K0881b82699g4239j17951E361d977q641
15709a3618k59046A8166a30987G6396e564l4062B94339A14095a3985C4733a46145
15697c26916R6479i3195j6263A69115a41422A25327b5318C51534F9482b02220
15686a74605A36157A6360R662G956f4730a0612l64265A54494f95j91289j5387
15675b07371A23915B555b65366c2196A07146D8817G472K61352E3596L5796R3967
15664A83359R925j9207D2057B0691g9421C08144c4730A00831r820a47585N211
$$ plain form
15742 28844 149252 142026 -11903 -275320 46276 41393 67024 216763 330036 225682 -17851
15730 313673 -38296 -139231 99008 -256540 -201177 174255 -257630 136816 -172617 -324563
15720 -324563 -269752 -49322 131156 24207 45088 -282699 -74239 -192190 5361 -4977 -13618
15709 -13618 -272664 18166 -130987 76396 -5564 -39626 294339 114095 -13985 34733 -146145
15697 -326916 -230437 -93195 -109458 169115 -141422 125327 -25318 351534 69482 -202220
15686 -174605 136157 16360 26022 7956 -64730 -10612 -374877 154494 -695 -191984 -207371
15675 -207371 123915 2555 -265366 -32196 107146 48817 7472 268824 53596 89392 183359
15664 183359 193284 174077 42057 20691 -79421 308144 -34730 100831 91011 -147585 -142374
15653a42374j4975P069b6247j74666B397R7595j9242P827a03162j1859j98169
15642c13190a48016F5431B1445a11230c8896F0286N3688l1607g9194j5918m9144
15631a44256b4575k8649b6098H5751c40512D0775A6154M5588j6676C765b80508
15619C62266a96613j06768B1014a67306k14323A6724b82466h5824j7541j66130
15609b69495P5458a3116m07045a60738E9772b8449D4919a92512D5377a6103E923
15597e7497n2669C7795b38649E2994a55168m2544c4613A7648b96979p7342J37928
15586b36393a05855a123B70136H9173b88294F3266b03410B74700a79427q1396
15576b60823G8245K42478b18484B36005b80588a6103F2359d9945j47827r1307
$$ plain form
15653 -142374 -157349 -150280 -26247 -200913 2397 99992 80750 88577 -103162 -115021 -313190
15642 -313190 -148016 65431 21445 -111230 -38896 60286 113974 82367 -79194 -95112 -144256
15631 -144256 -24575 -53224 -26098 85751 -340512 40775 16154 61742 45066 3765 -280508
15619 362266 -196613 -303381 21014 -167306 -381629 16724 -282466 -85824 -103365 -269495
15609 -269495 -194037 -13116 -420161 -160738 59772 -28449 44919 -192512 45377 -16103 5923
15597 -57497 -110166 37795 -238649 52994 -155168 -197712 -34613 17648 -296979 -374321 -236393
15586 -236393 -105855 -1123 270136 89173 -288294 63266 -203410 274700 -179427 -260823
15576 -260823 78245 320723 -218484 236005 -280588 -16103 62359 -49945 -197772 -289079
15566b89079C7895j2510f9058j93129k32659f0847H5461h0478M648a5417A09210
15554a90079N9659A78853b7329A2813P8705h0953J4889A09382a94026g7099o1086
15543a38185r8573f7427A11531M9173J36085j6327C3540j3548M862b16734A09669
15531a70989F6883J61779I3695R5519a94640F8648J71910a80130G3928e8194I7593
15519H0532f0112n6409D2482L47294j67108l2630K18791k02973b61793B27114
15508a06034B41411J06593l812F0689f1274A16283l6631a29396G7734a07793D57682
15496C0706c14669M9922F3237c26295G3676b99372J11105A87708E0637a82046
15485A29277A720a69627O2382a049A63998E8518M7319e0411B36813a22715B60250
$$ plain form
15566 -289079 37895 25385 -69058 -262187 -494846 -60847 85461 -80478 -75830 -15417 109210
15554 -190079 -130420 178853 -27329 12813 91518 -80953 -66064 109382 -194026 -77099 -138185
15543 -138185 -236758 -67427 111531 160704 296789 280462 33540 19992 24854 -216734 109669
15531 -170989 66883 228662 93695 189214 -194640 68648 240558 -180130 73928 -58194 97593
15519 80532 -60112 -116521 42482 389776 222668 190038 408829 205856 -261793 227114
15508 -106034 241411 348004 344192 60689 -61274 116283 79652 -129396 77734 -107793 457682
15496 30706 -314669 -264747 63237 -326295 73676 -299372 -188267 187708 50637 -182046
15485 129277 1720 -169627 -107245 -1049 163998 58518 105837 -50411 236813 -122715 260250
15473b23853H3592b5532j93608j50117J38046r4074a39083H5536m2502L9820j1670
15462G1184f4591I7425b65067H0905m0089K712f5120q7563d7974E5467d4524j78181
15450b22705J04568F2939h7269j7236E22886a00327B28355e02374A65255a32705
15439a03076a7984l5376k12786f4574D23801j13681b17984Q0232d2550A9992K41847
15428B61839a14084B2204e9869A14463M0905a88505g6535B53762a53038E5743
15417A89593a19522j96855B23188c0470B15226G5423d27568A01527J02959k3163
15407A81323a51598B27429g2154C92120a03998A31608L03471C1349K87618g2116
15396A1783J8516J30458n7298M9461i4746A024J06812K5593b27327I0885a56576
$$ plain form
15473 -223853 83592 -25532 -219140 -369257 -231211 -325285 -139083 85536 43034 82854 71184
15462 71184 -64591 97425 -265067 80905 40816 43528 -65120 -152683 -47974 55467 -44524 -222705
15450 -222705 -118137 62939 -87269 -104505 522886 -100327 228355 -502374 165255 -132705
15439 -103076 -17984 -53360 -266146 -64574 423801 310120 -217984 -137752 -42550 19992 261839
15428 261839 -114084 22204 -59869 114463 155368 -188505 -76535 253762 -153038 55743
15417 189593 -119522 -316377 223188 -30470 215226 75423 -427568 101527 204486 181323
15407 181323 -151598 227429 -72154 392120 -103998 131608 435079 31349 318967 -72116
15396 11783 30299 160757 103459 152920 -94746 1024 107836 133429 -227327 90885 -156576
15384H4185J37948b92618C3334a10782A69287a9908j06830l000J7016j12980G3104
15372A98701J7305h4808A86175b6198C464O1050K25980a92941B47023n5728o0144
15361A31151P7738H4654N5583o8299J7686d8441A12312k2214c6555N490M498c566
15348E743L1759j982Q4280N8488q5794h1976B27281g605l6730n4690A19967L7041
15336A57008L5410R8590a18545A72670b53017R3628G6092a98659A39957J38979
15326B78936a17928A04511a96894d866j68268B3280J67405n9290J59402o3615
15316B27182a93724A73632C0037O1781r957b04148C08080C865J83677G4630C0557
15304C09043G7888J42371I366J67d3248A35875b24730k7372a5979E4114b6903
$$ plain form
15384 84185 222133 -292618 33334 -110782 169287 -19908 -126738 -129738 -112722 -225702 73104
15372 198701 216006 -84808 186175 -26198 3464 64514 290494 -192941 247023 191295 131151
15361 131151 208889 84654 140237 71938 89624 -48441 112312 90098 -36555 -31065 -26567 -3566
15348 5743 37502 35520 119800 178288 92494 -81976 227281 -7605 -44335 -99025 119967 157008
15336 157008 192418 291008 -118545 172670 -253017 -159389 76092 -198659 139957 278936
15326 278936 -117928 104511 -196894 -4866 -173134 23280 190685 131395 290797 227182
15316 227182 -193724 173632 30037 91818 81861 -204148 308080 3865 187542 74630 30557
15304 309043 77888 220259 9366 9533 -43248 135875 -224730 -252102 -15979 54114 -26903
15292b7777A65504c0836p9032A24640d7989j47204r8967h6685c9640k6086B60345
15280c23162a10854A56067a59845D6098a4305B5932e5442A84296b1680r120A0595
15268A07049c24235H9950j2718O7547F216J82409l9886l2951g1494A6040K2988
15257C9028K3600K47374A06564m6285A013J10225B8551L12552K53704J328863
15247A923670o66607J68459J6653D56090A54595b51928B5908b60006a07302E4296
15236A0108K68460j13942G0073c8696q9840B20653o7572p4669a15A95011F7219
15224A69733L426g2730B8109M4534b27436B31069D5895L1479B2972K99049f1053
15212D89810A77811l2368B0312Q3126O5880A6888n95K19705M3431b5102C9781
$$ plain form
15292 -27777 165504 -30836 -109868 124640 -47989 -195193 -294160 -86685 -39640 -65726 260345
15280 -323162 -110854 156067 -159845 46098 -14305 25932 -55442 184296 -21680 -30800 10595
15268 107049 -324235 89950 77232 144779 6216 188625 148739 115788 -71494 16040 39028
15257 39028 62628 310002 106564 60279 1013 111238 28551 341103 594807 1923670
15247 1923670 1257063 1425522 1442175 456090 154595 -251928 25908 -260006 -107302 54296
15236 10108 278568 164626 70073 -38696 -128536 220653 153081 78412 -115 195011 67219
15224 169733 173159 -72730 28109 72643 -227436 231069 45895 77374 22972 322021 -61053
15212 489810 177811 145443 20312 103438 169318 16888 16293 235998 279429 -25102 39781
15200b4775b064A30911L85079c0984A74442K7940M6455j1315c65319A43886R4080
15189B37966O1813J79628I1411l6821J70108G0536h5686l5421B7558K06522a34742
15177a86008A12022a45657L6427r5160a01999A05845L00029j22018j39780K62531
15167D06607m3780j53439E8711J44441r884J92897N882b60953A5942J46973J40002
15156C02917n4431G9478c5624B0733K85778i596C31231c502A05903K05951e0518
15144C30328m9948b40748B22571c39142a52036K8447B35760L9032A19918E7908
15133f9883k0646A91584E2657M35012a57424j28794g357B23344a31302B05848
15122A96208i0565d1804B00464m0327R687p3997l6461J55727p7106A2966K09161
$$ plain form
15200 -24775 -2064 130911 515990 -30984 174442 202382 248837 237522 -365319 143886 237966
15189 237966 299779 479407 91411 54590 224698 70536 -85686 -121107 27558 234080 -134742
15177 -186008 112022 -145657 -109230 -204390 -101999 105845 405874 283856 144076 406607
15167 406607 362827 209388 58711 203152 193268 386165 392047 -260953 15942 162915 302917
15156 302917 248486 79478 -35624 20733 306511 -9596 331231 -3502 105903 311854 -50518
15144 330328 280380 -240748 222571 -339142 -152036 -123589 235760 274792 119918 57908
15133 -69883 -90529 191584 52657 487669 -157424 -286218 -7357 223344 -131302 205848
15122 196208 -90565 -41804 200464 160137 169824 95827 59366 215093 137987 12966 222127
15111B22127b7978G69231a21287B83460a30613C27156b4633r587A8320K35820
15101B54140j25241O4872o7277M7081K17218A63312K06455p6430j40704J58042
15091C10675A20134K11840A15527a13127d2802C43529d3673C7909J30126m4858
15081A23177L357H087K36948j07364J91369A16070e6219A07173K45028i3928A11548
15069B33126l9933J339m5221i6716B89732d50150A82400j5104N7407F0089N971
15058F6060b5355A17482M75685B43757h2785k8792A00379l4708K13657I1409J4421
15047A05830K3387a70196K1147C72431A18404J49422M6542K14925k51054I0211
15036C28660b6128A7420c8448j59041A46622b21135D41979A65717Q006J63872
$$ plain form
15111 222127 -27978 769231 -121287 283460 -130613 327156 -24633 -34220 18320 254140
15101 254140 128899 193771 126494 173575 390793 163312 369767 293337 152633 310675
15091 310675 120134 331974 115527 -113127 -42802 343529 -43673 37909 168035 123177
15081 123177 126534 8087 245035 137671 329040 116070 -56219 107173 352201 -93928 111548
15069 233126 193193 194532 149311 -96716 289732 -450150 182400 167296 224703 60089 66060
15058 66060 -25355 117482 593167 243757 -82785 -111577 100379 65671 279328 91409 105830
15047 105830 129217 -170196 -149049 372431 118404 267826 314368 529293 278239 90211
15036 328660 -26128 17420 -38448 -197489 146622 -221135 441979 165717 173723 337595
15026C37595A12289O3543O25756B56858F6756J62207L11950j87467J03459d8937
15015D01177J48783B63169j19563J0615b4203B45185J0768J19081O0639K6778
15005D62451B21473A09118l6062j0296L73108A68724l3198O0457f3675B8343M19934
14994D48277G2143K13908P0158A26399L4743m1776K37178A66696J17357j10176
14984A73877K71461j23226L06614k29305A45914K12850K0001c3524C47052K72231
14974F19283A07924K28480l9718q1561F5200L7543N8789N1955l0943d4851C6144
14962A69854o8397B5859K68581a544B47523J64797A38441n1249M14374k03262
14952B98304K86927A06230K9750J18629J44342j78193K95814D5473J30906J70035
$$ plain form
15026 337595 112289 175832 801588 256858 66756 228963 540913 353446 456905 -48937
15015 401177 549960 263169 143606 154221 -24203 245185 255953 375034 435673 462451
15005 462451 221473 109118 73056 62760 435868 168724 135526 195983 -63675 28343 448277
14994 448277 72143 286051 356209 126399 161142 119366 356544 166696 284053 173877
14984 173877 445338 322112 628726 399421 145914 358764 378765 -33524 347052 619283
14974 619283 107924 336404 296686 215125 65200 102743 161532 213487 182544 -44851 36144
14962 169854 101457 25859 294440 -1544 247523 412320 138441 87192 501566 298304
14952 298304 585231 106230 135980 254609 398951 220758 516572 45473 176379 346414
14942C46414M105j73978q373N1756n3609K05836R4933a02498B59428K08064i1577
14930D79312A39733b7673F54730I4567K99996A36022J89231A28819L57368k20567
14920B65620J08201L591A58718C9938K87060J20639A65554L14804M4546h95F80524
14908B38863P6628M70620C04057j9939L50040H7718L65665b3824D54938j83544
14898B71394k0198L09539j83627J09418A77326J05507k0921K39540M1987B11030
14887C19268q5995K38293o6949q1815L28078k87090J9216A82597R3651O4868j55334
14876A85782K33503q3865K07783A23794L22444A73278J23742L20918D8444M81516
14866E29960B17769M30899B47566J14492L66604B02715K28960L32322k72935K49900
$$ plain form
14942 346414 350519 176541 168168 219924 166315 372151 467084 -102498 259428 467492 -91577
14930 479312 139733 -27673 654730 94567 394563 136022 325253 128819 486187 265620
14920 265620 373821 377412 158718 39938 326998 447637 165554 480358 524904 -895 680524
14908 238863 315491 786111 304057 284118 634158 87718 453383 -23824 454938 271394
14898 271394 251196 560735 377108 486526 177326 282833 261912 501452 543439 211030
14887 319268 233273 471566 404617 322802 650880 363790 383006 182597 276248 341116 185782
14876 185782 419285 335420 543203 123794 446238 173278 297020 617938 48444 529960
14866 529960 217769 648668 247566 362058 728662 202715 431675 763997 491062 740962
14856G40962o0735k30241j3663J64673k85536A33594J84537L11166J71391A07516
14845E43646m1214j09739l6390G0763M69365A67691L15583j61421K98332q3546
14835E36639J42711k67257M0122j22177K7722J16602j81591L891K27990j30302
14825C94350J18159O5332p9983p459J77832L07687l84780B26433M46243j32933
14815E39743J75963C33941K34926P7229n2228n6881B13220J08242N19839k03354
14805F37947B59267L22618n1824q2525j97626Q8328K31706k04188K82607K46869
14795H95232o3447l28677Q5446L6891N5315k61921J48011J42580p3814n4728l7303
14784E43585j80632K33471J17068k50202K93379j27643j56938K27441k0616R1193
$$ plain form
14856 740962 680227 449986 436323 600996 315460 133594 318131 629297 800688 107516
14845 543646 502432 392693 356303 70763 540128 167691 483274 321853 620185 536639
14835 536639 679350 412093 452215 330038 357760 474362 292771 296662 524652 394350
14825 394350 512509 577841 497858 490399 668231 975918 591138 226433 672676 539743
14815 539743 715706 333941 568867 646096 593868 536987 213220 321462 841301 637947
14805 637947 259267 581885 530061 447536 249910 338238 569944 365756 648363 895232
14795 895232 831785 503108 588554 625445 680760 418839 566850 709430 635616 580888 543585
14784 543585 362953 596424 713492 463290 756669 629026 472088 699529 678913 770106
14774G70106j96536J37864Q5575B99549L30444J72604k98369r7786L66947j83912
14764E89477K53457L90736m80318J9445Q9097m2131D00614K17747j92786M52208
14754H77783J49140o0851l0507j32061j17839o1911J23342j66854L27332l11917
14744E95657J08026P0345n4318p459l4088K44238k09994k6524M6341J44127j07510
14733G68841k30183j11450L19960J19712j4663J31723m8897J42j95789K9115N7122
14722H25633m5211n1444K13214J8321k15033p5725K51859j95977J87060k64275
14712F48422K47584J22528k27476L1754J34976K55098n77313K53179r844K52374
14702A131282k35401K58200k23938m1369j46413J92346K43564l59760j5066P0407
$$ plain form
14774 770106 573570 711434 797009 299549 629993 802597 504228 406442 773389 589477
14764 589477 842934 1233670 753352 772797 861894 819763 400614 618361 425575 877783
14754 877783 1026923 966072 935565 803504 685665 623754 747096 580242 907574 595657
14744 595657 703683 774028 719710 712251 678163 922401 712407 685883 732224 876351 768841
14733 768841 538658 427208 747168 866880 852217 983940 935043 935185 739396 768511 825633
14722 825633 780422 728978 942192 960513 745480 669755 921614 725637 912697 648422
14712 648422 896006 1018534 791058 822812 957788 1212886 635573 888752 878908 1131282
14702 1131282 895881 1154081 930143 888774 742361 934707 1178271 818511 803445 873852
14692H73852N1908j45434L93265p9209n14114L5856K54642L58552j14492k90931
14682H23895O3018m843K42736m342J3264J42652k63475K72169j61968r1597r2294
14671I39215r5097J41303o9169K13292n8828L0273o6318Q2662j74782K33877k04933
14660I71495j5018K19809J27785l01476M37228l12072j03701L33543J01987k36995
14650A222585k77474M25677J13376l76522L86702l35586M5682K9884K76723k67974
14640A243073j05181L35754k1693l4404o5806O6604J10989o1509J19445P2257
14630A659529m86325J8020j34692N61889j07522K318L940J59714m6266m6636j17020
14619A466949J66219k02798K16738j75209R7751p1602L18173k79790J27646J89106
$$ plain form
14692 873852 925760 780326 1173591 1094382 580268 616124 870766 1229318 1114826 823895
14682 823895 886913 882070 1124806 1120464 1133728 1276380 1012905 1285074 1123106 1031509 939215
14671 939215 844118 985421 916252 1129544 1070716 1100989 1034671 1117333 942551 1176428 971495
14660 971495 956477 1176286 1304071 1002595 1439823 1127751 1024050 1357593 1459580 1222585
14650 1222585 945111 1370788 1484164 1107642 1494344 1158758 1204440 1234324 1511047 1243073
14640 1243073 1137892 1473646 1451953 1417549 1351743 1418347 1529336 1467827 1587272 1659529
14630 1659529 1173204 1191224 1056532 1618421 1510899 1513217 1517157 1676871 1630605 1583969 1466949
14619 1466949 1633168 1430370 1647108 1471899 1569650 1498048 1816221 1536431 1664077 1853183
14609A853183q9526k12919J48719J21368j04714j70287J62823J11075j79452l8705
14599A601565K41809k05300q1560M82819j7680m04246K98432m4388j55420J67917
14589A883948K63148n33435O06388q7794n20906M10262J4400L16063O0361k79443
14579B132992j03836N8398K09504j48135N5589K43337j53390Q8938J30259l15507
14569B198149J60691K53999k59165L60093l14722K13532j5744N55403j62170j24680
14559B865386J24638J27824K43846J94230k17435O05471K07150O29452J84740
14550D965302J174392J766890M401733R487712K2847255Q72051B1328457H008400
14541D343242j242256o49341k11774K0446k29346K45361l55611J41830J17949
$$ plain form
14609 1853183 1763657 1550738 1699457 1820825 1716111 1545824 1708647 1819722 1640270 1601565
14599 1601565 1843374 1638074 1556514 2039333 2021653 1617407 1915839 1871451 1716031 1883948
14589 1883948 2147096 1613661 2220049 2132255 1611349 2021611 2036011 2352074 2412435 2132992
14579 2132992 2029156 2087554 2297058 2148923 2204512 2447849 2294459 2383397 2513656 2198149
14569 2198149 2358840 2612839 2353674 2713767 2399045 2612577 2596833 3152236 2990066 2865386
14559 2865386 2990024 3117848 3361694 3555924 3338489 3943960 4151110 4780562 4965302
14550 4965302 6139694 7906584 12308317 21796029 44643284 45515335 21328457 8008400
14541 4343242 3100986 2451645 2239871 2260317 2030971 2276332 1920721 2062551 2180500
14532B180500o6848M36895k81451N7213J11937Q8407K1160M29761m97615K41522
14522B721481J84120m48199J40922K61642k1162J10680k92054J64840L47473j42847
14512C026896j99442j10897N152M30775K09829k74257q2144M56122l67224j80147
14502B914663M32917k14005K28686J91169J6902r3632o9490J80431J33173J25079
14492C845893o72572M30260J48458j01239K47045R1100n6155M33286k90165r0078
14482C985833L18408k1915J18484j81999J78528j60108j89923K30674N8526L14510
14472D651018K6551j21814M53556o81394O15230o21578O55180J15007k88565J30055
14462D933246K20743M6617K17685k97078K64035R4641K1295k34826K42246L74763
$$ plain form
14532 2180500 2113652 2550547 2269096 2326309 2438246 2526653 2547813 2977574 2479959 2721481
14522 2721481 2905601 2457402 2598324 2859966 2838804 2949484 2657430 2822270 3169743 3026896
14512 3026896 2827454 2716557 2721709 3152484 3362313 3088056 3005912 3462034 3094810 2914663
14502 2914663 3347580 3133575 3362261 3553430 3570332 3476700 3407210 3587641 3720814 3845893
14492 3845893 3173321 3603581 3752039 3650800 3897845 3988945 3932790 4366076 4075911 3985833
14482 3985833 4304241 4282326 4400810 4218811 4397339 4237231 4047308 4277982 4336508 4651018
14472 4651018 4677569 4555755 5009311 4327917 4943147 4321569 4976749 5091756 4803191 4933246
14462 4933246 5153989 5200606 5418291 5121213 5385248 5479889 5501184 5266358 5508604 5883367
14452E883367O3387k20092L9751k9622k110K17324j41740P61421k79080l70265
14442E922341O41405j12943L40616l61757O63350m1004o9972K11311K2566J53891
14432G369804J71672k7486j31900J12957J47461N8615J023J84898Q0212P2246
14422H039502J65519j99850N54961j5038R5799J45127M43656k71626M25462k2745
14412I360767L27630K35267J69443n69240O78988q577K57606J1895K04965J29027
14402A0797771L22687K13874K09549J15561J59148L10057J68931L06078o711j94219
14392A2402726R06805l8257N93751J03139r6946J72017L86051L81728M54145K81418
14382A5546577k67046K65948P07584P4925j6215N12610O75252J96954M80980L55536
$$ plain form
14452 5883367 5946754 5726662 5766413 5736791 5734681 5952005 5810265 6571686 6292606 5922341
14442 5922341 6563746 6450803 6791419 6429662 7093012 7052008 6982036 7193347 7215913 7369804
14432 7369804 7541476 7513990 7382090 7495047 7642508 7701123 7702146 7887044 7967256 8039502
14422 8039502 8205021 8005171 8560132 8545094 8640893 8786020 9229676 8958050 9383512 9360767
14412 9360767 9688397 9923664 10093107 9523867 10202855 10194278 10451884 10463779 10668744 10797771
14402 10797771 11120458 11334332 11543881 11659442 11818590 12128647 12297578 12603656 12596945 12402726
14392 12402726 13309531 13271274 13865025 13968164 13871218 14043235 14429286 14811014 15265159 15546577
14382 15546577 15279531 15545479 16253063 16327988 16311773 16824383 17499635 17696589 18177569 18533105
14372A8533105K87931K88860J88730N98816Q53618o9747P93633L44201L40899
14363B2160046N32292K19249O44314O20224O37329L73562M92990P96494L47559
14354B6824059N61813O39130Q01014M76799J255569M35858Q45400O90776P59820
14345C3290238J054933R53694R80902Q87834J133401R86177J042349J033782J197576
14336D2560886J460122R99544J148964J233074J859775J187143J698729J944116
14328E4092353J221437J890380J736874K234037K078873J857543K289612K425513
14320F9826622K784521K485975K525375L087856L112174L386468L261124L083860
14312I3553975M459712L596830M248979M319349M513785N259490M922012N426295
$$ plain form
14372 18533105 18821036 19109896 19298626 19897442 20751060 20681313 21474946 21819147 22160046
14363 22160046 22692338 22911587 23555901 24176125 24813454 25187016 25680006 26476500 26824059
14354 26824059 27385872 28025002 28826016 29302815 30558384 30994242 31839642 32530418 33290238
14345 33290238 34345171 35298865 36279767 37167601 38301002 39287179 40329528 41363310 42560886
14336 42560886 44021008 45020552 46169516 47402590 49262365 50449508 52148237 54092353
14328 54092353 55313790 57204170 58941044 61175081 63253954 65111497 67401109 69826622
14320 69826622 72611143 75097118 77622493 80710349 83822523 87208991 90470115 93553975
14312 93553975 98013687 101610517 105859496 110178845 114692630 119952120 124874132 130300427
14304A30300427N416291O286624O514698O676764P464434P168784P936969Q517619
14296A86282610R295839R259187J0081652J0377966J0906935J1789800J2306282
14289B60300271J2276034J3253652J3330743J4208216J4615799J4454116J4627996
14282C57066827J5001681J5116822J3809075J4396752J3439192J2173205J1175509
14275D52179063R746590P866325N170656J661156j06291j434027l238483m222953
14267D67622036n994804r100589j0424966j2460227j3816438j4693527j5400376
14260C85731109j5859094j5943443j5891529j5642741j5396663j3801072j3915684
14253B79280883j3901554j2980205j2514868j2053271j0927173j0564123j0204673
$$ plain form
14304 130300427 135716718 142003342 148518040 155194804 162659238 169828022 177764991 186282610
14296 186282610 195578449 204837636 214919288 225297254 236204189 247993989 260300271
14289 260300271 272576305 285829957 299160700 313368916 327984715 342438831 357066827
14282 357066827 372068508 387185330 400994405 415391157 428830349 441003554 452179063
14275 452179063 461925653 469791978 474962634 476623790 476517499 475083472 471844989 467622036
14267 467622036 461627232 452526643 442101677 429641450 415825012 401131485 385731109
14260 385731109 369872015 353928572 338037043 322394302 306997639 293196567 279280883
14253 279280883 265379329 252399124 239884256 227830985 216903812 206339689 196135016
14246A96135016r323837q704390q415560p863987p395323p327023o692416o081202
14238A34331278n360373n610522n468940m855572m784321m280897l914077m050563
14230I6006013l812375l488426l390282l187641l020364k877072l040706k460941
14222G0728206k564632k036854j954415k232988k230637k125093j664428j932250
14214E3986909r83521j425627k105781j952404q57148j406693j205039n07171
14206D3543525j298088j554485j190813j406362p11529q14826n93240j230929
14198C4743253j304985n36905j082915q32119m64091p94006n25267r76055p18660
14189B7508250o94120l23414q28665p54545l79295n55706m01852p67370o88123
$$ plain form
14246 196135016 186811179 178106789 169691229 161827242 154431919 147104896 140412480 134331278
14238 134331278 128970905 123360383 117891443 113035871 108251550 103970653 100056576 96006013
14230 96006013 92193638 88705212 85314930 82127289 79106925 76229853 73189147 70728206
14222 70728206 68163574 66126720 64172305 61939317 59708680 57583587 55919159 53986909
14214 53986909 53003388 51577761 49471980 47519576 46662428 45255735 44050696 43543525
14206 43543525 42245437 40690952 39500139 38093777 37382248 36567422 35974182 34743253
14198 34743253 33438268 32901363 31818448 30986329 30522238 29728232 29202965 28226910 27508250
14189 27508250 26814130 26490716 25662051 24907506 24528211 23972505 23570653 22803283 22115160
14180B2115160j93116j48469o71758n04893k13564m17057o07818j7864n92937
14171A8747684j79646o99383m20680j50848m11903l59184l3803m86360k3125m12952
14161A5569800l28695n70381n7599j8996j52106k71027m99074l0883n07219J73444
14151A3307264l14990k47019k26266j73858k75001k97542k47066K63444n43587
14142A1245379k0159k51784k78651J50090l85829l62759M20649k38338m79048
14133I799550l93386K69252j49314k94617K50039j75062j85531k96387K45496
14124I070040l91134l07554J94883m41896K01445l18335p2098J00367n00025m8770
14114G486923O7083J1796k86796J67070l77855r6166J0274j81901q495k59611
$$ plain form
14180 22115160 21922044 21773575 21101817 20596924 20383360 19966303 19358485 19340621 18747684
14171 18747684 18568038 17868655 17447975 17297127 16885224 16526040 16492237 16005877 15982752 15569800
14161 15569800 15241105 14670724 14613125 14594129 14442023 14170996 13671922 13641039 13133820 13307264
14151 13307264 12992274 12745255 12518989 12345131 12070130 11772588 11525522 11788966 11245379
14142 11245379 11225220 10973436 10694785 10844875 10459046 10096287 10516936 10278598 9799550
14133 9799550 9406164 9675416 9526102 9231485 9481524 9306462 9120931 8824544 9070040
14124 9070040 8678906 8371352 8566235 8124339 8325784 8007449 7935351 8035718 7535693 7486923
14114 7486923 7554006 7565802 7279006 7446076 7068221 6972055 6982329 6800428 6791933 6532322
14104F532322J67773K2561j39421k67033J85533j52672k12168r6147k46625N8509
14094E852632L52572l73326j53835M3827J23248l28421N4947k98786q839J14724
14084E378743K78511l24444q6149P118o0030k07434m8756l04317K39335K43802
14074E116379k19896m14576l0751K83239j53041n9487q3985j46211j38275L87182
14064D540578k74093K72668K5554n72470p7314L98649m2755j59936O4213l21619
14054C853475o970L60262l92666q139J72058m34437K81488j73491J02186l89378
14044C364388j14874L12463l2514K5718j98777J58490J11783k48277j97080k4005
14034C157315L31566l49745K21103j03482J7512j27362K2695k7028j90397O6719
$$ plain form
14104 6532322 6700095 6722656 6583235 6316202 6501735 6349063 6136895 6040748 5794123 5852632
14094 5852632 6205204 5831878 5678043 5721870 5845118 5516697 5571644 5272858 5264019 5378743
14084 5378743 5657254 5332810 5246661 5253779 5193749 4986315 4937559 4633242 4872577 5116379
14074 5116379 4896483 4481907 4451156 4734395 4581354 4521867 4437882 4291671 4153396 4540578
14064 4540578 4266485 4539153 4564707 3992237 3914923 4313572 4270817 4110881 4175094 3853475
14054 3853475 3846505 4206767 3814101 3805962 3978020 3543583 3825071 3651580 3753766 3364388
14044 3364388 3249514 3561977 3529463 3555181 3356404 3514894 3626677 3378400 3181320 3157315
14034 3157315 3488881 3139136 3360239 3256757 3274269 3146907 3169602 3142574 2952177 3018896
14024C018896n3558j66234R1408j84384K02443l52428J94906Q7959k87683K16396
14014B767721j27055M3825j20278l3039K66256k76917j28590L4802L8038M05227
14004B869990l68726j72782j17353J3630K33655j16110J79076k28981k10432N09638
13994B591605m68699K95538K30429J41100K1938Q24016L051624P667899K2467099
13985C6822549J0610508k2844779j1839173m650277k097624j181768q31066k52129
13977C736241j07916m11968l30677J04609l43719J37200l02857N3643P9917k85593
13967B328880j93738J00561n0627j33510M6387M07224k57013M8109k98494m0190
13957A957589L79501j49005j21319J32365o31433N29288P0523L6226l28383L89775
$$ plain form
14024 3018896 2965338 2799104 2890512 2706128 2908571 2556143 2751049 2839008 2551325 2767721
14014 2767721 2640666 2684491 2564213 2531174 2797430 2520513 2391923 2426725 2464763 2869990
14004 2869990 2501264 2328482 2211129 2224759 2458414 2342304 2521380 2292399 2081967 2591605
13994 2591605 2122906 2418444 2648873 2789973 2811911 3635927 6687551 14355450 36822549
13985 36822549 47433057 24588278 12749105 8098828 6001204 4819436 3988370 3736241
13977 3736241 3628325 3216357 2885680 2990289 2646570 2783770 2480913 2534556 2614473 2328880
13967 2328880 2135142 2235703 2185076 2051566 2097953 2505177 2248164 2296273 1997779 1957589
13957 1957589 2337090 2188085 2066766 2199131 1567698 2096986 2167509 2203735 1875352 2265127
13947B265127l4465j7907l67185r2780R1923j39887J67260K68088n67317L03734
13937A876591Q2545j17595K22375l99291K08399L3183L37755r00799P04779o58258
13927A389684K19261K58212K42840n94291O8441k53K55349k59661J36837L0716
13917A747135k29906N9054K73784l12981L1246p0811k8031N5076R3506j0421l0443
13906A577208j6752k44557J41968j69097Q9026J45074k71480K96469j27234J34948
13896A555573j24351j57532K07848l8319r3833L42536k14306q6227k8503K33392
13886A596278n36572K92898L8638J73268m66485K5728K14227j38144J06807K16366
13876A523009p8037p4133k33039q2666J03194j47112Q9225O0363r5138J7405R3174
$$ plain form
13947 2265127 2230662 2212755 1845570 1752790 1844713 1704826 1872086 2140174 1572857 1876591
13937 1876591 1959136 1841541 2063916 1664625 1873024 1906207 2243962 1343163 2047942 1389684
13927 1389684 1608945 1867157 2109997 1515706 1584147 1583894 1839243 1579582 1716419 1747135
13917 1747135 1517229 1576283 1850067 1537086 1568332 1497521 1469490 1524566 1618072 1607651 1577208
13906 1577208 1560456 1315899 1457867 1288770 1377796 1522870 1251390 1547859 1420625 1555573
13896 1555573 1431222 1273690 1481538 1443219 1349386 1691922 1477616 1391389 1362886 1596278
13886 1596278 1059706 1352604 1391242 1564510 1098025 1123753 1337980 1199836 1306643 1523009
13876 1523009 1444972 1370839 1137800 1055134 1158328 1011216 1100441 1160804 1065666 1083071 1176245
13865A176245j64080J00305J22251J5922m7319k36661j06528K07339j30123J57786
13855A095137O946o4693j6022m5540J53742L06623l99628J29315k31408N1966
13845I86438J72465J56850n33501K83242J11171j72331J40632J64112k00055n8608
13835A050415J82260n9497l14189N11578o35610N72958n37285o8776K38234J28822
13825A068910j09488p9222K15122J49847m19481Q0518j07731M04626m80009M41477
13815A164569l56758L06104k71812R2100k01956l876J35769K77395j94317j40758
13805H06460k4224j40618L68806j19282O1971j17646j41948l6336L58224l31938
13795F83469q6974K85557J09280k89715J74844J18075l46016J17240N0907j4307
$$ plain form
13865 1176245 1012165 1112470 1234721 1250643 1203324 966663 860135 1067474 937351 1095137
13855 1095137 1102083 1037390 1021368 975828 1129570 1436193 1036565 1165880 934472 986438
13845 986438 1158903 1315753 782252 1065494 1176665 1004334 1144966 1309078 1109023 1050415
13835 1050415 1232675 1173178 858989 1370567 734957 1307915 770630 701854 940088 1068910
13825 1068910 959422 880200 1095322 1245169 825688 906206 798475 1203101 723092 1164569
13815 1164569 807811 1113915 842103 934203 732247 728371 864140 1141535 947218 806460
13805 806460 782236 641618 1010424 891142 953113 835467 693519 657183 1015407 683469
13795 683469 596495 882052 991332 701617 876461 994536 648520 765760 816667 802360
13785H02360Q3327l85377L42314k87437J6739J48863j50857o0405O4054L49561
13775I23142m3305l71736Q4201M1886j79022L33069n1499J53490D19382N06573
13765I25955l75245K05377k24329N7609Q2536r786J4842l38443K47817J52074
13755G38407P2632k22011K42578r9472k18859K42501C08228K66775K14586k54806
13745E34783N1527K17000K15607k68873k09455N4714k63687L71024J16124j56982
13735F61782j10306k2261K51025j99388j08805K01526J63611k93817J10882j39250
13725E14999J89031m6745j20271K83431M0521C07586N86511l68590J83332j73134
13715E35705J39954B78966K03257M2746j77062K80495N6853k92245L27355B33264
$$ plain form
13785 802360 885687 500310 842624 555187 571926 720789 569932 509527 573581 923142
13775 923142 879837 508101 592302 634188 455166 788235 736736 890226 419382 925955
13765 925955 550710 756087 531758 589367 671903 662117 676959 338516 586333 738407
13755 738407 811039 589028 831606 732134 513275 755776 308228 575003 789589 534783
13745 534783 586310 803310 1018917 750044 540589 595303 331616 702640 818764 661782
13735 661782 551476 529215 780240 580852 472047 673573 837184 543367 654249 514999
13725 514999 704030 657285 537014 820445 860966 307586 894097 525507 708839 535705
13715 535705 675659 278966 482223 524969 347907 628402 685255 393010 720365 233264
13704C62989J42362K9893L5720J00187k96506K84820J86805l02499k2730J07414
13694F28455j14729J26352k11256J81736n0483K51094R863C17247L21987k09698
13684D29536j23033M71288o3040p7803j60954R2480K04233l62712j16078M17411
13674G11328A77580D6775L04166j03626L52033J03865j75208l6115J40274j17411
13664E14753j48081N6360j02296K01993R5588j61992L7996A09754N01316N1709
13654F62779q301k05156j70270J42047o7748K51878m1986j95001R4576K50912
13644G13730B04855M37294B12806K4198J76301j96510J75234J98617k81130J74388
13634D83904d1118G23346C47100L26530j28081K07727K24477B45133M05940r9467
$$ plain form
13704 362989 505351 535244 570964 671151 374645 659465 846270 543771 521041 628455
13694 628455 513726 640078 428822 610558 560075 811169 821032 317247 639234 429536
13684 429536 306503 777791 714751 636948 475994 568474 772707 409995 293917 711328
13674 711328 177580 46775 350941 247315 599348 703213 528005 491890 632164 514753
13664 514753 366672 423032 320736 522729 618317 456325 494321 109754 611070 662779
13654 662779 654478 449322 279052 421099 353351 605229 563243 368242 462818 713730
13644 713730 204855 642149 212806 237004 413305 216795 392029 590646 309516 483904
13634 483904 -41118 723346 347100 673630 545549 753276 977753 245133 651073 551606
13624E51606k10584J71065j31193K39311k48571O2267j76762I1146K98846J21099
13614E11091j87809L27343j02630k38095L43704k29056J60382k28883j43807J67645
13604C79885n9357D3694K31192a07830D56333A96242J53910K72131k04148j4497
13594D03638J21287b379D64866j66156H389N33623l9603B11537R6169O4404P5757
13583D47867K28517C32644J44188J527j04498m890J89045k52130J92120B28869
13572C59222P8366H8224M68395A34706K5203J55199J08347C9539K64397O3415
13562C67351J88741A10131K12105r3319Q0987l6693G2261K56604A19082J65412
13552B84494q8475K77137k00908r636J65428H438Q2637J06604L59090B43684J16323
$$ plain form
13624 551606 341022 512087 380894 620205 371634 433901 257139 91146 389992 511091
13614 511091 323282 650625 547995 309900 653604 424548 584930 356047 212240 379885
13604 379885 320528 43694 274886 -107830 456333 196242 350152 622283 418135 403638
13594 403638 524925 -2379 464866 298710 8389 542012 502409 211537 307706 372110 447867
13583 447867 676384 332644 476832 478359 373861 368971 558016 305886 498006 228869
13572 359222 437588 88224 556619 134706 159909 315108 423455 39539 303936 367351
13562 367351 556092 110131 322236 228917 309904 273211 72261 328865 119082 284494
13552 284494 196019 473156 272248 262612 428040 8438 91075 197679 556769 243684 360007
13541C60007I5337K59496m9010m7597L85107a07386D46764K52126B51337K02242
13531D53579o2702l9969A01136J49380J41729j19481J9259G4436L08785j54665
13521B28556J02739j60387O8137n2162K09013j58886M0970b968B53955A05512
13510B25466J88573P3072J34950C00265j1806K5013l4767r9427m3802P3597J0668
13499B19741A04188O3927c0298B82888J37025J05949A46773N3222P6176G8754
13488C27823J77050c2855j1853B09998J52523k3369j24874N55280H2513L24756
13478D07269A62652p6776M29124H3806R4127K68761j54694A29100L54959N3583
13468E37642k00437j09226J04407D2076P2556a3174A71249L55214M6452A48033
$$ plain form
13541 360007 95337 354833 305823 258226 643333 -107386 446764 698890 251337 453579
13531 453579 390877 350908 101136 250516 392245 272764 292023 74436 383221 228556
13521 228556 331295 170908 239045 186883 395896 237010 277980 -2968 253955 105512
13510 225466 414039 487111 622061 300265 288459 313472 278705 179278 135476 209073 219741
13499 219741 104188 168115 -30298 282888 419913 525862 146773 199995 276171 78754
13488 327823 504873 -32855 -44708 209998 362521 339152 214278 769558 82513 407269
13478 407269 162652 85876 515000 83806 177933 446694 292000 129100 484059 537642
13468 537642 337205 227979 332386 42076 114632 -13174 171249 526463 572915 148033
13457i8947D28564A63385D7922L14685o4246J01326J41651B01657r5300L704J71223
13446B81284j30420K50334j32379R3470C970L24988L3848j03722L0171o8427J09122
13435C29950j59199j1677L91132j67146A58635Q130J07889j19851k0560J4070
13425A48313b6644B88230j26289K71045A82193Q8623J54631A49270N5726R6728
13415C01724a07050B99216r9114J71812g807B0647K06000b28945A50875Q7207
13405B38082J25391B6479K63322A41980O0837d4885H3980K84456A44564K65360
13395D09924k0326q1340A0956M22754O1029A95780m6145L4951J85585A82459O9150
13384B51609A15490J75505K6219D3416R0317J68895j25315b03499L9305B69423
$$ plain form
13457 -98947 428564 163385 47922 362607 298361 399687 541338 201657 106357 110061 281284
13446 281284 150864 401198 268819 362289 3970 328958 362806 259084 289255 220828 329950
13435 329950 170751 159074 550206 383060 158635 166765 274654 154803 134243 148313
13425 148313 -26644 288230 161941 432986 182193 270816 425447 149270 204996 301724
13415 301724 -107050 299216 200102 371914 -7807 20647 226647 -228945 150875 238082
13405 238082 363473 26479 289801 141980 202817 -44885 83980 368436 144564 409924
13395 409924 389598 308258 10956 433710 494739 195780 149635 184586 370171 182459 251609
13384 251609 115490 290995 317214 43416 133733 302628 177313 -203499 -164194 269423
13373A91800K47209j25733O926j43418q8290J8812K37365m8792Q9011H4582L71482
13362D56064j10307j42233J8447A6753K94460N6298g3410C41141H2225l1570J38265
13351A88920E0070Q8149m9480N00726B86963A06382L4948J0015K5989O5311J78827
13340D21472j35289d6328D04285C4929L11650K0170j81470O1676j07462K71292
13330D10785a7739I0715N08145k93846a11207a4417D97125e6889a983D01916A62216
13318B30515k3088f3947C84724q5119p1920O5046k147L5861k7997j3961a541m6522
13306d8063B01027K01436n3671r2759f0918j2051C04183a5484B0395L09489j17761
13295B12123D3867A8382A141K98918d7972C2136b76637a32047A06737K10737o3852
$$ plain form
13373 191800 439009 313276 320202 176784 88494 107306 344671 295879 384890 84582 456064
13362 456064 345757 203524 221971 16753 311213 367511 -73410 341141 82225 50655 188920
13351 188920 50070 138219 88739 589465 286963 106382 141330 151345 177334 242645 421472
13340 421472 286183 -46328 404285 34929 346579 366749 185279 246955 139493 410785
13330 410785 -17739 90715 598860 305014 -111207 -14417 497125 -56889 -1983 401916 162216
13318 230515 207427 -63947 384724 299605 227685 292731 290584 326445 298448 284487 -1541 -48063
13306 -48063 201027 402463 348792 256033 -60918 -72969 304183 -15484 20395 329884 212123
13295 212123 43867 18382 1141 300059 -47972 32136 -276637 -132047 106737 317474 253622
13284B53622j26014K75990A8873J21752b6323C51847j64612A8861J51991n5067
13274A15785Q0534L9453b09802A93817a6574D43230N0896H9722K28282E2244d3171
13262B05464k7342E5695k2954R4291R192K56099D3775h8884h237H1661R2620a42516
13249B9434J25635K38926g7131A62208a10326C3567Q6592d2531a5262B27498N851
13238B33349J05507d4932A67572n9982C5282J09831j3502K19007J6192h7276j29656
13227b16932A7083M342a06339C55877a35519A75208C4513f3882G4K28425j08865
13216A19634i4614o8788B6695J93526a50603C04445j26322h7449L6344A64179
13205B36125E5057h4222l6430e2524N645B35864A010e9037D3244M2892N5856p0553
$$ plain form
13284 253622 127608 403598 18873 140625 -26323 351847 187235 18861 170852 115785
13274 115785 196319 235772 -209802 193817 -16574 443230 494126 89722 318004 52244 -43171
13262 205464 178122 55695 32741 127032 136224 392323 43775 -88884 -8237 81661 174281 -142516
13249 29434 155069 393995 -77131 162208 -110326 33567 120159 -42531 -15262 227498 233349
13238 233349 338856 -44932 167572 107590 35282 145113 131611 350618 366810 -87276 -216932
13227 -216932 17083 21425 -106339 355877 -135519 175208 34513 -63882 74 228499 119634
13216 119634 -94614 -163402 26695 220221 -150603 304445 178123 -87449 -51105 164179
13205 236125 55057 -84222 -120652 -52524 -46879 235864 1010 -59037 43244 86136 141992 71439
13193G1439J37571J18920e529j37924l7169C03242A9374K38516Q4912a93841A61159
13181A50846a91018E88756b07640a9083j88806A47149o6602M7734c1454r8793
13171a30247A50558K8682N0183O6392a20771A79583A4040K02716j07193a28930
13160B57372d1804A40Q1276k6049k5220O5692l1824J56487J02637F6204M40536
13149E06740A15661K08898a79621B85387D3876J10459D4334L282j916a30651C89927
13137A15837k7107b9912k89347b0256B9349R7868l7443a65014A02095J44748a15680
13125D7038f295D47051F1722L10238a10709A68854A9436K58730C4896a2056k12846
13114b24902f8835k50544B41923J7284l5075a02888B1231i3139k6814H6095M60423
$$ plain form
13193 71439 209010 327930 -5529 -143453 -180622 303242 19374 257890 342802 -193841 161159
13181 150846 -191018 588756 -207640 -19083 -207889 147149 80547 128281 -31454 -130247
13171 -130247 150558 179240 229423 295815 -120771 179583 14040 216756 109563 -128930
13160 257372 -41804 140 81416 55367 30147 95839 64015 220502 323139 66204 506740
13149 506740 115661 324559 -179621 285387 43876 154335 44334 47616 45700 -130651 389927
13137 115837 88730 -29912 -319259 -20256 29349 127217 89774 -165014 102095 246843 -115680
13125 47038 -6295 447051 61722 371960 -110709 168854 19436 278166 34896 -12056 -224902
13114 -224902 -68835 -319379 241923 259207 224132 -102888 21231 -93139 -119953 86095 546518
13103E46518a47549A20210J4885o1670j8519b36050A70801b02705d8428A27801
13092a73037j2211A43534R7721B2924L70270f5909G8665A1709J5238J19866a1924
13080E4141i3460H8141B2011J98377B1021J56002J98426E0822c7054A02413i9138
13068A78506K45562b18107e3986D9942K09181J3239A2570J79953e3028B13929
13057B11418b31920C79229e3108j43327G4583g2099l6593m8970G9497J55162K8393
13046B63052d587D84183h2721F1424P011i4262A92214L590a07866C64092b54291
13034B85886L6594C8772D363J7300g9255B34305o0004b24209a8781C71714A57812
13022B33210B6390a58833C18664A0027N8358B213L45706c7942C912J93393J87099
$$ plain form
13103 546518 -147549 120210 135095 73425 54906 -236050 170801 -202705 -48428 127801
13092 -173037 -185248 143534 241255 22924 393194 -65909 78665 11709 26947 146813 -11924
13080 54141 -93460 88141 22011 220388 21021 177023 375449 50822 -37054 102413 -99138
13068 178506 424068 -218107 -53986 49942 259123 272362 12570 192523 -53028 213929
13057 211418 -231920 379229 -53108 -196435 74583 -72099 -108692 -157662 79497 234659 263052
13046 263052 -4587 484183 -82721 61424 68435 -94262 192214 195804 -107866 364092 -254291
13034 285886 322480 38772 4363 21663 -79255 234305 174301 -224209 -18781 371714 157812
13022 233210 26390 -158833 318664 10027 68385 2213 347919 -37942 3912 197305 384404
13011C84404j59632A9243r142a5009C27570R7197h8449A49345j9101b0357k1323
13000d1680J9971j9603B33919I2230J23320b24428E6130J2027J38359n3506k863
12989A50147b61871d7914o0065A26711b59511D24279k3427p4052b79787B00660
12978A24983l2877L1422a5288e022B5275R175L21075j24092d0864B09491Q7051
12967B96542j31352e3469B2257K34230D3810a71503A05085b85108A28291A0026
12956a04428A62805a5216k1828H5503b33649A13581a50963D2052a34163K0655
12946a13508O577I9487b0098H7125J85671a10316e4796C59629j71630l5205k6480
12935A26314e7417E5682K36694a48242J1754b3849k40369B30887C1157J1316a37823
$$ plain form
13011 384404 224772 19243 10101 -15009 327570 424767 -88449 149345 130244 -20357 -41680
13000 -41680 -21709 -41312 233919 92230 215550 -224428 56130 68157 206516 153010 150147
12989 150147 -261871 -47914 -107979 126711 -259511 424279 400852 326800 -279787 200660
12978 124983 92106 123528 -15288 -5022 25275 34450 355525 231433 -40864 209491 296542
12967 296542 165190 -53469 22257 256487 43810 -171503 105085 -285108 128291 10026
12956 -104428 162805 -15216 -37044 85503 -233649 113581 -150963 42052 -134163 -113508
12946 -113508 -106931 99487 -20098 87125 272796 -110316 -54796 359629 187999 152794 126314
12935 126314 -57417 55682 292376 -148242 -136488 -23849 -264218 230887 31157 42473 -137823
12923A00060b07838B27232a09512A90474E326a06740L0483E7377P9015j7826h9600
12911a67878B36985b7882n5043A03785a24781K7825D8887a06161C93524A62640
12900b4688A1759R0651d0120k0252l8979A55521E6932R5766a02298c4461D2147
12888a02312l157A58868c55132B43375h4152B7371a81698a4506j82488A00033
12877a10513j51592C16929A32589D2712J20215C9420Q6871b754A46310b39123
12866a95466N9030k1380A52294J36782J45137c1440B32145a30562A50778b20630
12855g6326k31950M3605B11074G5281a4822F1667J1971b04899B60124h9236j01686
12844a90922H5660O5439k4591a08147G0706A2104c10590A04626b32529R6939B43233
$$ plain form
12923 100060 -207838 227232 -109512 190474 5326 -106740 -76257 57377 136392 118566 -89600
12911 -167878 236985 -27882 -82925 103785 -124781 -96956 48887 -106161 393524 162640
12900 -24688 11759 102410 -40120 -60372 -99351 155521 56932 152698 -102298 -34461 42147
12888 -102312 -105469 158868 -355132 243375 -84152 27371 -181698 -14506 -196994 100033
12877 -110513 -262105 316929 132589 42712 162927 39420 126291 -2754 146310 -239123
12866 -195466 -136436 -157816 152294 289076 434213 -31440 232145 -130562 150778 -220630
12855 -76326 -308276 -264671 211074 75281 -14822 61667 73638 -204899 260124 -89236 -190922
12844 -190922 85660 151099 126508 -108147 70706 12104 -310590 104626 -232529 -135590 243233
12832i2002B89181I5472a37541J5375C26524A32033K7741K80779A47350l811g582
12820B35889o4623P8980F4608a86364Q2131L2913A08063l1103L1205D3917B100
12808A10121D1618O4912A4872a00315k59369A27226Q8106b173k5889j45479c4118
12796A37220a34352D87854k28216A5745L82963F7529A6215E003L0070a37624A78846
12784F6412a48814b0100I3939C1205J21734c4489k9043j33556q1540A36231b34438
12772a65830c855l23875C47569a33416j5032A00086a50381i504r0645j47374b8251
12760B1925P7044K98718a12297A65456o1437M0429C8455g533A60743m2449C9363
12748d0777H6363M5844J75432f0150A42521a02319F0502K81198C499M75100e413
$$ plain form
12832 -92002 289181 95472 -137541 -122166 326524 132033 159774 440553 147350 143539 -7582
12820 235889 171266 250246 64608 -186364 -104233 -71320 108063 76960 108165 43917 2100
12808 110121 41618 106530 14872 -100315 -359684 127226 215332 -2173 -28062 -173541 -34118
12796 137220 -134352 487854 259638 15745 398708 67529 16215 5003 35073 -137624 178846
12784 66412 -148814 -20100 93939 31205 152939 -34489 -63532 -197088 -278628 136231 -234438
12772 -165830 -3855 -327730 347569 -133416 -148448 100086 -150381 -9504 -100149 -247523 -28251
12760 21925 98969 397687 -112297 165456 104019 144448 38455 -7533 160743 118294 39363
12748 -40777 86363 132207 307639 -60150 142521 -102319 60502 341700 3499 478599 -5413
12736C71371I3147K45189j28878a98644F041b9363C78997A15401m9375f628B25435
12724i3492L5286C99800B545a53836l6008h1778b4905M093H659c8150B8016g0101
12711A38631J01149C5399M5542J3559J3046J06321p160P4177J34534r4634n9573
12700B61211n7647b638B0411K75579A21375J55495A19709e9305J2497H2849i4492
12688a14388j4621o7444C5058a56030P7408C00126A04836a48073D71217A44060
12677b28367B74117p8826r7012J07602F915J53618J10887g4177J7078B17020g2941
12665a72483A87092O2537F5239a9776E1540N7539n2902f573A07179L37499E0062
12653A73924K47096I994J33432C4208a28370C05739a53119A43608i4789m6445
$$ plain form
12736 371371 93147 338336 209458 -198644 6041 -29363 378997 115401 66026 -6628 225435
12724 -93492 -58206 399800 2545 -153836 -189844 -81778 -24905 -20812 8659 -38150 28016 -70101
12711 138631 239780 35399 80941 94500 107546 213867 206707 280884 415418 320784 261211
12700 261211 203564 -2638 20411 295990 121375 276870 119709 -59305 -46808 82849 -94492
12688 -114388 -129009 -196453 35058 -156030 -78622 300126 104836 -148073 471217 144060
12677 -228367 274117 195291 98279 205881 6915 160533 271420 -74177 -57099 217020 -72941
12665 -172483 187092 249629 65239 -19776 51540 109079 56177 -6573 107179 444678 50062
12653 173924 421020 9994 143426 34208 -128370 305739 -153119 143608 -94789 -141234
12643a41234J5629N3012F5558g7760G4009i0713c4222B00999l2688a32133d3782
12631E6772b6187A23215J22977J45557A14364A1127L62010r2228D5270c91489
12620A83773g4321j04840Q6089q3432Q3126G6430a31440B18509D0697a38294L3153
12609a05141M4877A07082d1880D2099H276K72018b21530a9285I7494M3082o0814
12598G9762L25044E1728b31763A50979J17615l6737A00142J31650H1880i8700
12587C34298b7165k29362G9441a22896A27715M6667k1821J57927m7672A9852L6397
12576E6249J83092B3685a45520E31602A75716l2801a40756B51258j13007D7586
12565g4855A64569o4526a98707N8977k7972N399A92829m6937J07458a03411j34983
$$ plain form
12643 -141234 -125605 -72593 65558 -77760 74009 -90713 -34222 200999 168311 -132133 -43782
12631 56772 -26187 123215 246192 391749 114364 11127 373137 280909 45270 -391489
12620 183773 -74321 -179161 -93072 -176504 -93378 76430 -131440 218509 40697 -138294 -105141
12609 -105141 -60264 107082 -41880 42099 8276 280294 -221530 -19285 97494 140576 79762
12598 79762 404806 51728 -231763 150979 268594 231857 100142 231792 81880 -98700
12587 334298 -27165 -256527 79441 -122896 127715 174382 152561 310488 262816 19852 56249
12576 56249 239341 23685 -145520 531602 175716 142915 -140756 251258 138251 47586
12565 -74855 164569 100043 -198707 -139730 -167702 -162303 192829 145892 253350 -103411 -238394
12554b38394i7097A18413p527a24689A5503K01201P6562H4790L06832A14836J87876
12543C02712K25220a28613B68920a38366c7439l10736b5716E1748a13907q27C8686
12531d801r7555j34662J10381A80317b74211I4954f3769r9040A44113h6805H3639
12519I0891b5247l8912A6306o116J38208J51895o6132c152A50616a29492A79196
12507h0624D5366a87827B6808J07636f9316D9713a76745D1133c30893B6549f9257
12495e018q7759a0349A42847F9899d5294A31652b8910D0498J03154c1897B48652
12483I8821B1357O1704J06788b3890A74256C4224O5863a848A13885j7768k9268
12472F6849h4569E8420K1781l4724R7347c9550D54477H8187J36246E6662j369
$$ plain form
12554 -238394 -97097 118413 110886 -124689 15503 216704 293266 84790 391622 114836 302712
12543 302712 527932 -128613 268920 -138366 -37439 -348175 -25716 51748 -113907 -114734 38686
12531 -4801 -102356 -237018 -126637 180317 -274211 94954 -63769 -162809 144113 -86805 83639
12519 90891 -25247 -64159 16306 10190 148398 300293 234161 -3152 150616 -129492 179196
12507 -80624 45366 -187827 26808 134444 -69316 49713 -176745 41133 -330893 26549 -69257
12495 -5018 -92777 -10349 142847 69899 -45294 131652 -28910 40498 143652 -31897 248652
12483 98821 21357 83061 189849 -23890 174256 34224 100087 -1848 113885 96117 66849
12472 66849 -84569 58420 80201 45477 142824 -39550 454477 88187 224433 56662 55293
12461E5293M2419g1972B06860A01212c5860A74877F4225a1250D72697A63833b25182
12449A1609a42602G6490g3566A58115J44423a69648F8035i4413C1689b68845l348
12438b72193a25137N9143A61747E6518N5564a87112j09774h5078l41457i0385
12427a67753f6119C1379a51368E5419k0263K0717J1518A668Q9777L4704J478a93501
12414d2400A1986N66548a76455D4156M50533d3324r640k15083B1564a97258B889
12402E1157f5311N324k2808o0687f7932C2798P3707m2306Q9501g1033K4968B69750
12389I490b56642f4348r3596A15209k3259a5016C93927h7930A0234c55438c6606
12377C34894c08143e0694B18678I1478d35506H7072K31961b30782C73402a55462
$$ plain form
12461 55293 97712 -71972 206860 101212 -35860 174877 64225 -11250 472697 163833 -225182
12449 11609 -142602 76490 -73566 158115 302538 -169648 68035 -94413 31689 -268845 -272193
12438 -272193 -125137 -65994 161747 56518 112082 -187112 -296886 -85078 -426535 -90385
12427 -167753 -66119 31379 -151368 55419 35156 55873 67391 1668 91445 126149 127627 -193501
12414 -42400 11986 578534 -176455 44156 494689 -43324 -52964 -268047 21564 -197258 2889
12402 51157 -65311 -59987 -82795 -143482 -67932 32798 106505 64199 153700 -71033 -46065 269750
12389 9490 -256642 -64348 -157944 115209 91950 -15016 393927 -87930 10234 -355438 -36606
12377 334894 -308143 -50694 218678 91478 -435506 87072 319033 -230782 373402 -155462
12366E5959a07265b9976j00870c6502A76768a35911I2401J0660N1214a43457A01272
12354h5231B18300C7672k938c6267J0930j30151A84524b38244A91322a1484D10901
12342H2215c0266q3809D42214A33516d563C84267a0584C7914K70334b59254A34892
12330a51844C5245a14227C43956j63358C5567Q0676c13607A60639K1590F2751
12319b04547M5470P797P4076B51718G8647K8511b83437g2676l0998C4941Q7036
12308A21977k2369b8107j68888k81100A9048J61708J08208E2116c7389j47628
12298a85017C57443f8116A89030b10251D54922a44779N720C34961h0338B45522
12287g474F6499b1475o370n3135B48498A172Q8787K28773j05995d2518F0305f3601
$$ plain form
12366 55959 -107265 -29976 -130846 -36502 176768 -135911 92401 103061 154275 -143457 101272
12354 -85231 218300 37672 34734 -36267 -25337 -155488 184524 -238244 191322 -11484 410901
12342 82215 -30266 -114075 442214 133516 -4563 384267 -10584 37914 308248 -259254 134892
12330 -151844 35245 -114227 343956 180598 35567 116243 -313607 160639 182229 62751
12319 -204547 -159077 -151280 -77204 251718 78647 107158 -283437 -72676 -103674 34941 121977
12308 121977 99608 -28107 -196995 -478095 19048 180756 288964 52116 -37389 -185017
12298 -185017 357443 -68116 189030 -210251 454922 -144779 -139059 334961 -80338 245522
12287 -7474 66499 -21475 -27845 -80980 248498 1172 89959 318732 212737 -42518 60305 -63601
12274H3145L15911j07506G0945C2521O3325Q1217K36406A12485N7101b75823g1876
12262d2791l1013E1486f6331B35459E7255A6094K35990R0622a44864a8947A90666
12250d542j44001B5703c09661B07800a19198A04024R6397G2253b17345C14550
12239e8470A32469Q4925O9268J0197c6996A39779E7609J67770A07647J66402j36192
12228A37857m6269J38800J28324A04217K9980E8606b05321B6293P1294q77P5691
12217A72401b40785D13228L0681a82916E5316J86929n0374l2812F2928B5018g1608
12205A33788Q0588J42421F1093K78883A60491J05030k9026J41094n0001k3145
12195C04443e7903A80491J22467A38488o0514a59652m5965G8200L44038a05554
$$ plain form
12274 83145 399056 291550 70945 32521 95846 177063 413469 112485 169586 -275823 -71876
12262 -42791 -73804 51486 -66331 235459 57255 16094 252084 342706 -144864 -18947 190666
12250 -4542 -148543 25703 -309661 207800 -119198 104024 200421 72253 -217345 314550
12239 -58470 132469 217394 286662 296859 -36996 139779 57609 225379 107647 274049 137857
12228 137857 91588 230388 358712 104217 134197 58606 -205321 26293 97587 96710 172401
12217 172401 -240785 413228 443909 -182916 55316 242245 191871 159059 62928 25018 -71608
12205 133788 214376 356797 61093 339976 160491 265521 236495 377589 327588 304443
12195 304443 -57903 180491 302958 138488 77974 -159652 -205617 78200 422238 -105554
12184A72335J28014e5366A38615Q4528J68636A58220d5739A32084K14245K90693
12174F37022A12414J40750F2725J80969E0333M5739j0228A7101L9288K18298B0423
12162B11428a65442A33948K3961n4365B0103K05293L907g649A23269Q5628h5536
12150a6988B75460b29229A79241b5543A11986K45908A69457c2816B37704b4831
12139e7410k09043F1527K62479G1299O745d4044l8762A86818f0697l1625B11481
12127D9848P2742h1211L9669a4249E2070L3603J45634a52144r6043J02537n9578
12116b05228f5296o3037A64984E8651J80974P226a28294a4986B07766J153A8114
12104a27364A64442B514Q0459B0177e1810l2769D00873a29842O3794C257b36307
$$ plain form
12184 172335 300349 -55366 138615 223143 391779 158220 -45739 132084 346329 637022
12174 637022 112414 253164 62725 243694 50333 96072 85844 17101 56389 274687 20423
12162 211428 -165442 133948 157909 103544 20103 225396 229303 -7649 123269 208897 -85536
12150 -16988 275460 -229229 179241 -25543 111986 357894 169457 -32816 237704 -24831
12139 -57410 -266453 61527 324006 71299 78044 -44044 -82806 186818 -60697 -92322 211481
12127 49848 122590 -81211 -41542 -14249 52070 85673 231307 -152144 -248187 -145650 -205228
12116 -205228 -65296 -128333 164984 58651 239625 246851 -128294 -14986 207766 208919 18114
12104 -127364 164442 2514 82973 20177 -51810 -84579 400873 -129842 -66048 3257 -236307
12092C79685c7161k6023H192J31078b00758A49246c48007H7958c6033F3301f1084
12080A33780a32579A26000D9958a84771C6899b2463C2620Q4142c56423A45873
12069H7416H041J67750a90718h2853c383E51907k14428J110604j83489E15543
12058A37887J82141a23666p8429A30809D8946j105g5748H1254a45852e4488B08642
12046b2305A16523j7992a77497j30130a29641n3160b623C410J88596a36213k5782
12035a61995O1983j48886B24200A01891a7407I7354f319A50566D2879a48777B74944
12023d5301G0644k6397K30159D2410g24k40135C71812b86622k4918a08640c191
12011b27743e3362C23367I0290b21044N3287M4420A21173f0164A60191J80682
$$ plain form
12092 379685 -37161 -63184 8192 139270 -200758 149246 -348007 87958 -36033 63301 -61084
12080 133780 -132579 126000 49958 -184771 36899 -22463 32620 116762 -356423 145873
12069 87416 8041 175791 -190718 -82853 -3383 551907 337479 1448083 1264594 515543
12058 137887 320028 -123666 -202095 130809 48946 47841 -75748 81254 -145852 -54488 208642
12046 -22305 116523 98531 -177497 -307627 -129641 -182801 -2623 3410 192006 -136213 -161995
12035 -161995 -100012 -248898 224200 101891 -17407 97354 -6319 150566 42879 -148777 274944
12023 -45301 70644 44247 274406 42410 -724 -240859 371812 -286622 -311540 -108640 -3191
12011 -227743 -53362 323367 90290 -221044 -167757 -123337 121173 -60164 160191 340873
12001C40873d4035j43425O8839I8739k8595b57080a01340d2160A60311G5827b50518
11989c55377D2444a67042c9781G7197a47021a7005D6469J69597r1968a11992j68940
11978b80932G9506b33224F9192a94369d8390j63217A55785a7886A07489c32577
11967B88673A15056a60604B04359n6761a95154B30963a38642A41969b11773L3852
11957a77921d4775j1539E4739N8291h0741q8507B37830i8927K5845B79259b3239
11945b36663B98981J6163r5118m7748M1483p6732K7143g7017k5924B70081A4949
11933c227j34849j37859D6297j0798h484k73172B5729a41487L3380j6761L7969
11922h6899A49948b08331A84460p8882N940a28910n5141C31777G5576C4169b82252
$$ plain form
12001 340873 -44035 -187460 -118621 98739 70144 -257080 -101340 -42160 160311 75827 -250518
11989 -355377 42444 -167042 -39781 77197 -147021 -17005 46469 216066 124098 -111992 -280932
11978 -280932 79506 -233224 69192 -194369 -48390 -211607 155785 -17886 107489 -332577
11967 288673 115056 -160604 204359 147598 -195154 230963 -138642 141969 -211773 -177921
11957 -177921 -44775 -56314 54739 113030 -80741 -169248 237830 -98927 -73082 279259 -23239
11945 -236663 298981 315144 220026 172278 213761 137029 164172 -77017 -102941 270081 14949
11933 -3227 -138076 -275935 46297 35499 -8484 -281656 25729 -141487 -108107 -124868 -86899
11922 -86899 149948 -208331 184460 105578 111518 -128910 -184051 331777 75576 34169 -282252
11910B42773D5132N3222b69143L9895A41111F3223K98941F0828a50931A51021
11899B6908g7894m2524A91904C7641d5558l07164f3609l65455A48911e9031l39392
11888c98423n6271J53387f3703B0073f9126e432j4440n2231K8123A64583a95766
11876A79255a72762h3289n9595O0111E7797g6008D3645b52896R8830K7811F0213
11864e6390F9794J35152a94914B07156a93499h0058K4915B59438J0477a11634
11853B19504J1505c66291B60679F2732k307c17040f7336j80517H0950h5526J5039
11842g0487q8733j67495J20849E6769a14845H7813a47654A98809d05957A8423
11831C4695a34189C22282b04619Q9309B3165e8876J4385A95373d14122c0917C6621
$$ plain form
11910 242773 45132 98354 -269143 -229248 141111 63223 362164 60828 -150931 151021
11899 26908 -77894 -120418 191904 37641 -45558 -352722 -63609 -429064 148911 -59031 -398423
11888 -398423 -454694 -301307 -63703 20073 -69126 -5432 -19872 -72103 -43980 164583 -195766
11876 179255 -172762 -83289 -142884 -82773 57797 -76008 43645 -252896 -154066 -126255 60213
11864 -56390 69794 204946 -194914 207156 -193499 -80058 -55143 259438 269915 -111634
11853 219504 231009 -366291 260679 62732 60425 -317040 -67336 -247853 80950 -85526 -70487
11842 -70487 -159220 -326715 -205866 56769 -114845 87813 -147654 198809 -405957 18423
11831 34695 -134189 322282 -204619 -115310 23165 -58876 -44491 195373 -414122 -30917 36621
11819b95138G8528K67352a92186p1005q4849J72205N766B451d39370B0157L7475
11808E7632K72657e34q4185D5595a1451p9383B75243H4105L9447j2495j9983a04719
11795e048A29624a67723A63220a08833c7525k1471A72049a36878O4076b9519k8612
11784e8131K3254A16193m7825H722K73888a48468j03735A30990K9701E5113a06155
11772A97117J51208b342j78174j12442A4590f66j14395q3672j9477a2091A42672
11760e848j15670A14279a97284H8592c1536m995k6789K969K01B21110a33805f1440
11747a37313B61670a98488J4860E4913L1243e1808n6236C35929a42391c8316j64029
11736b02345k2355A2821b13176A63910e2310A15741b0257A04057a16124j54347
$$ plain form
11819 -295138 78528 345880 -192186 -263191 -348040 -175835 -170069 2451 -439370 20157 57632
11808 57632 330289 -534 -84719 45595 -11451 -90834 275243 84105 123552 111057 91074 -104719
11795 -5048 129624 -167723 163220 -108833 -37525 -58996 172049 -136878 -72802 -29519 -58131
11784 -58131 -34877 116193 68368 8722 282610 -148468 -252203 130990 160691 55113 -106155
11772 197117 348325 -2342 -180516 -292958 14590 -666 -115061 -198733 -218210 -12091 142672
11760 -5848 -121518 114279 -197284 88592 -31536 -36531 -63320 -60351 -60150 221110 -133805 -61440
11747 -137313 261670 -198488 -183628 54913 86156 -51808 -108044 335929 -142391 -38316 -202345
11736 -202345 -224700 12821 -213176 163910 -52310 115741 -20257 104057 -116124 -270471
11726b70471O9603o1909C07873j02498Q4964Q363b13100R4795p3319A96905i5819
11714c09455P1926c9153k8019F2683J84704d1748A00086b66030H0600K8280m2241
11703F6639K50586a68776H4790R473J0536A0619g0569A89928n2420e8712R012
11692d9700J0868j07934A32809a22109B51470l0435K34986k6259A3213a0195B01770
11680H7121C4008J31830M6634e5500A22770b31748q7188C9638B833R9974J3969
11669A16776h2164H4151a28000b3933C3911A5061K54043h9109B44501b24208A21730
11657a2185B98426G3961a02868A05372a49801b9095A05839J663M9233E5032A7534
11645B86156h3341r6570B58160A8793K95348h145l8370A86784G7333l3872b25526
$$ plain form
11726 -270471 -200868 -262777 307873 205375 290339 298702 -213100 -118305 -191624 196905 -95819
11714 -309455 -237529 -39153 -67172 62683 247387 -41748 100086 -266030 80600 108880 66639
11703 66639 317225 -168776 84790 94263 104799 10619 -70569 189928 137508 -58712 -49700
11692 -49700 -38832 -146766 132809 -122109 251470 221035 456021 429762 13213 -10195 201770
11680 87121 34008 165838 212472 -55500 122770 -231748 -318936 39638 2833 102807 116776
11669 116776 -82164 84151 -128000 -23933 33911 15061 269104 -89109 244501 -224208 121730
11657 -12185 298426 73961 -102868 105372 -149801 -29095 105839 107502 156735 55032 17534
11645 286156 -83341 -179911 258160 18793 314141 -8145 -46515 186784 77333 43461 -225526
11633a03670B0210J57666K62744A11360g2531A30141b6675A94105a90178g7361
11622G5466O7711J8708a57017L5735F9320d48452K20689k6000g7028i65l5763
11611c6728n0195F848N4054c9069B44481A15528J11038b3656k92180c9406A15047
11599a57649B9295j3644a47800C56273q9168J52330C5114J79366B0697c3359j61172
11588a94531a9728B83324b32047B52245A12178J37622J5829A12356l6742J15525
11578A91139N0984a26736H2713J42565j02627J80169a52796i16C7127J70738c8251
11566B95404P9437K0456n5494q3775a22038b2931j08626C84359A15382g6058B86574
11554C89208e3442a1559A7201a25303j8587O8356p7110L9675C71779c50536e5920
$$ plain form
11633 -103670 20210 177876 440620 111360 -72531 130141 -26675 194105 -190178 -77361
11622 75466 143177 161885 -157017 -121282 69320 -448452 -227763 -253763 -77028 -965 -36728
11611 -36728 -86923 6848 60902 -39069 244481 115528 226566 -23656 -315836 -39406 115047
11599 -157649 29295 15651 -147800 356273 267105 419435 35114 214480 20697 -33359 -194531
11588 -194531 -19728 283324 -232047 252245 112178 249800 265629 112356 75614 191139
11578 191139 242123 -126736 82713 225278 122651 302820 -152796 -916 37127 207865 -38251
11566 295404 374841 395297 339803 256028 -122038 -22931 -131557 384359 115382 -76058 286574
11554 389208 -53442 -11559 17201 -125303 -143890 -75534 -152644 -112969 371779 -350536 -55920
11542A42354b03891B08679O68K1249H1569G71b75817A8701J51760L24001j50982
11531C43480G3152M04546r9811h1528B19240a25465B34813g8279C4138e1908A28335
11519G551C151b3195j45128P1360A66318N9606n3167C9052e367D8531K0565L2527
11507A01623a18206C23441g3634C45993e8588p9868D5311J2923J51501a05744
11496C79614A17988b3965B37083I7066K43558i9786G6092L9536j0822Q0929f0250
11484A11719J95177A25854n6205A1920a6378A55132n0115b504k32002B39334f3131
11472f959C9617K42961J39006f6376J3355E4837L5319M2995L0410G9718K06333
11461B86051f3778B48919L4194A07770L89958A78456c15838A3692h620C69445
$$ plain form
11542 142354 -203891 208679 209347 230596 81569 771 -275817 18701 170461 494462 343480
11531 343480 73152 477698 377887 -81528 219240 -125465 234813 -78279 34138 -51908 128335
11519 7551 3151 -23195 -168323 -96963 166318 225924 172757 39052 -5367 48531 69096 101623
11507 101623 -118206 323441 -73634 345993 -58588 -138456 45311 58234 209735 -105744
11496 379614 117988 -23965 237083 97066 340624 -99786 76092 115628 104806 185735 -60250
11484 111719 306896 125854 69649 11920 -16378 155132 105017 -2504 -234506 239334 -63131
11472 -6959 39617 282578 421584 -66376 -53021 54837 90156 133151 163561 79718 286051
11461 286051 -63778 248919 283113 107770 497728 178456 -315838 13692 -8620 369445
11450a45392A85254A5198b82330g7379A75113L11022E0192K91990j66068a68942
11439C51850r6186g2118A03520a46326B2998J1714a07171B9569P3637P2732L3945
11428B09883A8851a55530A24317B9197J02895K61562B5007M5684M8125b86390
11417B55755a21721B47695h8375B16125b55860A47845f8715B86315F7577J62065
11407B29642A4690J68173f334D8854A1383P4409g6842E8779M4797K8106h4819
11395i2683D0215b18162M5200B01965M6347j15799L3440J98221d0764m0996j04920
11384a86680A14795a27482B31156b0848k99319j00931I8868M2805C6928J75087
11374B12015a24628F5112c1974H5728g38C2398A4488a70617J8909C20939A07494
$$ plain form
11450 -145392 185254 15198 -282330 -77379 175113 486135 50192 342182 176114 -168942
11439 351850 255664 -72118 103520 -146326 22998 34712 -107171 29569 103206 175938 209883
11428 209883 18851 -155530 124317 29197 132092 393654 25007 70691 118816 -286390
11417 255755 -121721 247695 -88375 216125 -255860 147845 -68715 286315 67577 229642
11407 229642 14690 182863 -6334 48854 11383 85792 -76842 58779 103576 131682 -84819
11395 -92683 40215 -218162 -172962 201965 248312 132513 165953 364174 -40764 -81760 -186680
11384 -186680 114795 -127482 231156 -20848 -320167 -421098 98868 141673 36928 212015
11374 212015 -124628 65112 -31974 85728 -738 32398 14488 -170617 -151708 320939 107494
11362B76269B0770K12668b44790A78799G5259d1097j70314d9757E432J76337h9887
11350i7318l7454B725L53609e5734B42694q5933H076a1575k41457j3620B28672
11338b62440A17057M2259A2047d0666n2584A31807k1789e8497b5581B10334a21828
11326b76067F3156q248c03853I2352A9484N8129i6576D63362E0835N2761c6587
11314c2614N645B32275B8638a36906e3895C12865d9927l4374d0044j01013A05765
11302C0028J0888a20053g869k78055b1341A63783B0341O0219a46662B04422J4369
11291B18791a6978j79899D01339G7693a86973G8697d55433D5697a4692e211m5726
11280e0937n4636A37471B3662r220N0057b75520B72634g2193k12107q8369B69508
$$ plain form
11362 276269 20770 233438 -244790 178799 75259 -41097 -211411 -49757 5432 181769 -89887
11350 -97318 -134772 2725 356334 -55734 242694 156761 8076 -11575 -253032 -266652 228672
11338 -262440 117057 159316 12047 -40666 -93250 131807 110018 -58497 -25581 210334 -121828
11326 -276067 63156 54908 -303853 92352 19484 77613 -96576 463362 50835 103596 -36587
11314 -32614 -26969 232275 28638 -136906 -53895 312865 -49927 -84301 -40044 -141057 105765
11302 30028 40916 -120053 -7869 -285924 -21341 163783 20341 80560 -146662 204422 218791
11291 218791 -16978 -196877 401339 77693 -186973 78697 -455433 45697 -14692 -5211 -50937
11280 -50937 -105573 137471 23662 14442 64499 -275520 272634 -72193 -284300 -372669 269508
11268b03220f0753a514A2093P8362a45492C6644c83815Q7670C8643a24979A985
11256a37475b1185m5261A8035Q4525e5042A40803J12892K38057b01728K6528m5515
11245b20715A13588g1495k48813E839d8758r882j20524N1002C27529a46550a2624
11233b20483C3989J7960a94571m371F7001b01050P1073C2955a09613q9975P4718
11222a24870e2336B592c34999a58362j17880D41302j73959a07894A1220e8106
11211a16197A85943a50095B70585c24551D2438c57936J12258i7155A1841e0662
11200a15997A73090d45332b9165k86528A39187A6733e85022f07H4136d5727C9377
11188A88318L8376D7576a59326b9728l1852j8892D1766d11296A57191a49150A2149
$$ plain form
11268 -203220 -60753 -1514 12093 90455 -145492 36644 -383815 -296145 38643 -124979 1985
11256 -137475 -21185 -66446 18035 102560 -55042 140803 253695 491752 -201728 -175200 -220715
11245 -220715 113588 -71495 -320308 5839 -48758 -58640 -179164 -128162 327529 -146550 -12624
11233 -220483 33989 51949 -194571 -198942 67001 -201050 -129977 32955 -109613 -199588 -124870
11222 -124870 -52336 2592 -334999 -158362 -276242 441302 267343 -107894 11220 -58106
11211 -116197 185943 -150095 270585 -324551 42438 -357936 -245678 -97155 11841 -50662
11200 -115997 173090 -445332 -29165 -315693 139187 16733 -585022 -607 84136 -45727 39377
11188 188318 226694 47576 -159326 -29728 -61580 -80472 41766 -411296 157191 -149150 12149
11176c49949J54769j29582B57071i9813A81656b45346A45863k910J61664k4104
11166B80513a20507l8787j07713p783J33914C30532B4298K90911C6488J24912
11156A61400B8729a35270A29646J53725A18288d60208b6848k44117J23495d5585
11145d6181j39642A40761a28626C1617h4424m1778F8341j3803a69603C2936K18816
11134B51752b54157e7226a1852n8398A85312b59832A06991O3471e8535k2938A12420
11122a92076C39547G4224b27880H2230h1241C1866M999J29430f17B32151m0146
11111A92005h8224G9084A7806i2840p6143C04743o1499C6019J13800A5990b9696
11099D17664A7818N29380i6352F2009L39635A90221O7851E3338J73056J37031
$$ plain form
11176 -349949 -195180 -324762 257071 -99813 181656 -245346 145863 142953 304617 280513
11166 280513 -120507 -159294 -267007 -274790 -140876 330532 24298 315209 36488 161400
11156 161400 28729 -135270 129646 283371 118288 -460208 -26848 -270965 -147470 -45585
11145 -46181 -185823 140761 -128626 31617 -84424 -126202 68341 54538 -169603 32936 251752
11134 251752 -254157 -57226 -11852 -70250 185312 -259832 106991 170462 -58535 -81473 112420
11122 -192076 339547 74224 -227880 82230 -81241 31866 36865 166295 -617 232151 192005
11111 192005 -88224 79084 17806 -92840 -168983 304743 243244 36019 149819 15990 -29696
11099 417664 17818 547198 -96352 62009 401644 190221 258072 53338 226394 363425
11089C63425a47122H0996J44696o109P6391R5842j32399K36348j19747l1775G4267
11077B57259r0408J50902A48987K5750L11505j803j7675M6309B53996R8346E9364
11065d894G30431o1401l16820M67059j81350p6498j80375n1818L04725k9516J80903
11054G85340j68912P0104l26042L78548k1812k11114m197r707K87769k43477K40484
11043G76984L3505j31524O9023j48247j60316N22497m39957L53819k07517O55721
11033A323988l26970k29173C08879O51064k74566j51563j44735M33761M1403k50540
11023F13703N2885j99308M23345k7387k06905p7234K34318j18085L9096K59208
11013I93636k42038J50262k05537j59169K34959N2053k88943r8658M11081l11774
$$ plain form
11089 363425 -147122 80996 225692 219583 295974 391816 259417 495765 376018 344243 74267
11077 257259 166851 317753 148987 174737 486242 484439 466764 513073 253996 352342 59364
11065 -4894 730431 669030 352210 819269 637919 561421 381046 329228 633953 604437 785340
11054 785340 616428 686532 360490 739038 717226 506112 501915 492208 779977 536500 776984
11043 776984 810489 678965 747988 599741 439425 961922 521965 875784 668267 1323988
11033 1323988 997018 767845 308879 959943 685377 533814 389079 822840 864243 613703
11023 613703 666588 467280 890625 863238 656333 579099 813417 695332 734428 993636
11013 993636 751598 901860 696323 537154 772113 824166 535223 436565 847646 535872
11003E35872N7559M72116k99432n9221K64558l07125j20988J56826r6818J22342
10993G25689J44751k74525K04161J41816k20695J23800l2537R1241L90166n19751
10983G74116L29754J79734L3236k11860K71541L66387K48099L23468j20653L34094
10973B527916P5063K55329q969K67036m12049N3954m02718j55377l86618M11079
10963B224646k99964k3455L5239K4681J90568l30974P1126R4099K5040j18377
10953A892629l27176Q9233p23180j64171k78832B04612J56086R4172j66401P8204
10943C66673q4758A34206E1761J29057C7337J9074J07369a60811C11392Q0364
10933C91756r8910j16390J06589A36361J13968j14847A6538J82170m1664B7641
$$ plain form
11003 535872 593431 1065547 766115 706894 971452 664327 543339 700165 603347 725689
10993 725689 870440 595915 800076 941892 721197 844997 812460 903701 1293867 774116
10983 774116 1103870 1283604 1316840 1104980 1376521 1742908 1991007 2314475 2193822 2527916
10973 2527916 2602979 2858308 2849339 3116375 2704326 2758280 2355562 2200185 1813567 2224646
10963 2224646 1924682 1901227 1936466 1961147 2151715 1820741 1891867 1985966 2011006 1892629
10953 1892629 1565453 1654686 931506 767335 488503 204612 360698 454870 288469 366673
10943 366673 281915 134206 51761 180818 37337 56411 163780 -160811 311392 391756
10933 391756 292846 176456 283045 136361 250329 135482 16538 198708 157044 27641
10922G0870J89539A12266e8752l12536d5449A09748b1314F1330K61622b51234
10911A22080a63067C17820M3239d916q0089B27637b92224D7183J03606d4153j09386
10900a53539j77439N3193B0159c25970h1976I3972c8433A04431c510l37559d8254
10888A44629B8534e2639p2842A69622a9937p1320k60018A29620a02592J2205B63278
10876A80942A7799a97775Q0747E7698J7863b40578R4798j27671f0391A8536L1910
10865E0446a11109M5030b6931F8315J26241a8088k00471l3498c8681r7010N8967
10854g6724k79387L1116G3722J54784q961a97676c4610A04453d8251B03205c5024
10842b26879B16590E3090g7549l1075b3827I5347J67711a39853n4685O0491A09352
$$ plain form
10922 70870 260409 112266 -58752 -371288 -45449 109748 -21314 61330 322952 -251234
10911 122080 -163067 317820 361059 -4916 -85005 227637 -292224 47183 150789 -44153 -153539
10900 -153539 -330978 -277785 20159 -325970 -81976 93972 -38433 104431 -3510 -341069 -48254
10888 144629 28534 -52639 -125481 169622 -19937 -91257 -351275 129620 -102592 -90387 263278
10876 180942 17799 -197775 -117028 57698 75561 -240578 -145780 -273451 -60391 18536 50446
10865 50446 -111109 -66079 -26931 68315 194556 -18088 -218559 -252057 -38681 -135691 -76724
10854 -76724 -356111 -324995 73722 228506 219545 -197676 -34610 104453 -48251 203205 -35024
10842 -226879 216590 53090 -77549 -108624 -23827 95347 263058 -139853 -194538 -134047 109352
10830b39593G2697k6668k1870H755h8930A42542a56432m8603A21089J9628E8373
10818B3289d77177a06233A90906O1740I0871c90060J17403A65691b25653j1576
10808b37229C374g7133C9602a69167E9742J0357a21745l7174B41640j8271a90323
10796a86662E2700h8688G0524k0116b60016A01933r819A5591K0481d5167H7548
10784a06916l0250k3443d5924m1742C90838a90220H7382L29767A35285g1261k69977
10773c41238J28696k15460a95397D7087a15568n2834A9377O8687N3515D4737Q5930
10762A30667e1845a944k57275K5409O4454H9827a99474R5074A25491K53436b31485
10750b2581j06262l42237a49419C40935A6932J85561b99196d1789n8705q4097
$$ plain form
10830 -239593 72697 46029 24159 8755 -88930 142542 -156432 -205035 121089 140717 58373
10818 23289 -477177 -106233 190906 252646 90871 -390060 -272657 165691 -225653 -237229
10808 -237229 3374 -77133 39602 -169167 59742 70099 -121745 -158919 241640 223369 -190323
10796 -186662 52700 -88688 70524 50408 -260016 101933 92114 15591 36072 -45167 87548
10784 -106916 -137166 -160609 -45924 -87666 390838 -190220 87382 417149 135285 -71261 -341238
10773 -341238 -212542 -428002 -195397 47087 -115568 -168402 19377 88064 141579 44737 130667
10762 130667 -51845 -1944 -259219 -233810 -169356 89827 -199474 -104400 125491 378927 -231485
10750 -22581 -128843 -471080 -149419 340935 16932 202493 -299196 -41789 -100494 -184591
10740a84591j7871C21373a64509N0624A52723b31253A70073i4001B53875i5196
10729a58986j6702A96170e7420F356a87142J1720E9062b37590A84085e5455k06767
10718b62222b6796G9849a92851L5946m697P5086j63869d9266k0953l64726K07329
10707b27616e1943r7190n5636C6871J61534a27347d6634E5328d76461a73616A64811
10695b4495C4124a15611F9340c36329J26056A33149a40871k6804A1108O7932c4146
10683i6609A3814J20016J26526i9769n3582k19354D2572a95619j8615h7122B66674
10671B9782a87925n9989N272A07617J5168R7544c85798J36292K333g9993F7505
10659H6293a72305I3026h5013r760j94458a32304M2284k14877k9049e2425q4832
$$ plain form
10740 -184591 -202462 321373 -164509 -113885 152723 -231253 170073 -94001 253875 -95196
10729 -158986 -175688 196170 -57420 6356 -187142 -175422 59062 -237590 184085 -55455 -262222
10718 -262222 -26796 79849 -192851 -156905 -161602 -86516 -250385 -49266 -70219 -434945 -227616
10707 -227616 -51943 -149133 -204769 36871 198405 -127347 -46634 55328 -476461 -173616 164811
10695 -24495 34124 -115611 69340 -336329 -210273 133149 -140871 -167675 11108 79040 -34146
10683 -96609 13814 133830 260356 -99769 -153351 -372705 42572 -195619 -214234 -87122 266674
10671 29782 -187925 -247914 -242642 107617 122785 220329 -385798 -249506 -247173 -79993 67505
10659 86293 -172305 93026 -85013 -94773 -289231 -132304 -90020 -304897 -333946 -52425 -137257
10648a37257k40063N6042f4112J5314k43276A5103n030M386J17162F1610O3257
10637A24867F2185L419f6244j4709a4556j9681A91030E2700i1235b1804B22460
10625A96780r4214m0503J68680D1762f256A94980G7414c17817c0742j11840H8679
10613a4367m4270j71169d2671C81223a74855o945j18351g5393P693p5267B28928
10601F6995a66587b6651k7872A61943p7596F567J69752f5867l3859K0468H7641
10589h9125j08307b3048o4357l33261f2337o0744A07990J43120a72312e8654A23435
10577a0709H2545J46616i4295q3664C1659J04780b5889r3054F0018J65674F6456
10565E1586i4046L2643m01089A70619c43278D2877N0699Q3692a34977c183B9656
$$ plain form
10648 -137257 -377320 -321278 -64112 -48798 -292074 15103 10073 14459 131621 61610 124867
10637 124867 62185 65604 -66244 -80953 -14556 -34237 191030 52700 -91235 -21804 222460
10625 196780 102566 62063 230743 41762 -6256 194980 77414 -317817 -30742 -142582 88679
10613 -14367 -58637 -229806 -42671 381223 -174855 -181800 -300151 -75393 -67700 -142967 228928
10601 66995 -166587 -26651 -54523 161943 84347 6567 176319 -65867 -99726 -79258 87641
10589 -89125 -197432 -23048 -87405 -420666 -62337 -123081 107990 251110 -172312 -58654 123435
10577 -10709 82545 229161 -94295 -177959 31659 136439 -25889 -118943 60018 225692 66456
10565 51586 -94046 -61403 -462492 170619 -343278 42877 93576 177268 -134977 -3183 29656
10553A61936a20316m0541A73373c5081E1613a31700o3224A09058Q5679a29284
10542C1485d558j84385h0814F169h4489B16981c4385A02097J92787j41707c61096
10530i9836M3035H6569g0343B822a37957j81389L7873J27976J5303I8862i6843
10518b54906H8826O3760c00992p9839J64587i3122a8606C1761N0218O1795i8610
10506I1165I205K03760e6553j18637n5137a08429B71979A18931a14677B89531
10495f7791j16591B25813b06911A0543a73229o2918Q306D4346j1977R1020j7463
10484A05926J94318m0534L385K55650B16648J23908h6588B65915g9616q315j4902
10473a02833d5308C23601A26828a52197O6680j26971n4492e0365j56544A64423
$$ plain form
10553 161936 -120316 -160857 173373 -35081 51613 -131700 -194924 109058 194737 -129284
10542 31485 -4558 -188943 -80814 6169 -84489 216981 -34385 102097 294884 153177 -361096
10530 -99836 -56801 86569 -70343 2822 -137957 -319346 -281473 -153497 -138194 98862 -96843
10518 -254906 88826 152586 -300992 -380831 -216244 -93122 -18606 31761 81979 143774 -98610
10506 91165 9205 212965 -56553 -175190 -230327 -108429 271979 118931 -114677 289531
10495 -67791 -184382 225813 -206911 10543 -173229 -236147 -227841 44346 32369 123389 105926
10484 105926 300244 259710 263095 518745 216648 340556 -86588 265915 -79616 -87931 -102833
10473 -102833 -45308 323601 126828 -152197 -85517 -212488 -266980 -50365 -206909 164423
10462g5870B61371b04075i4150A42218L864i3275A21971D0358J73803d01074a12242
10450a74272d0141A26975h8530B1924J25535B417a47381N1938F1545a30163r5675
10439b25838g2989A22342L0060i0394k18806c7199j06752J89L7476B15005a00545
10427b43965e9837A46538h8242B02696H8994a02681C45693j01113l2867a54269
10416A25132k8120D8139K9769d45289a8144D7518K42109d6621a9749j12904b5215
10404I7703b00071D9323a11072k67246a64330p3349b6757k02791O642g6118o3780
10393a39898C5094A7357e6193B99101J66830A98759A9084g1544B5381P6057P1444
10382A72882K5698i9555B00889b20382F42243A37221J85777r8413j6510K45522
$$ plain form
10462 -75870 261371 -204075 -94150 142218 146082 -93275 121971 40358 214161 -401074 -112242
10450 -174272 -40141 126975 -88530 21924 147459 2417 -147381 -95443 61545 -130163 -225838
10439 -225838 -72989 122342 152402 -90394 -309200 -37199 -143951 -143762 -106286 215005 -100545
10427 -243965 -59837 146538 -88242 202696 88994 -102681 345693 244580 211713 -154269
10416 125132 97012 48139 77908 -445289 -18144 47518 289627 -46621 -19749 -132653 -25215
10404 97703 -200071 49323 -111072 -378318 -164330 -237679 -26757 -229548 -222906 -76118 -139898
10393 -139898 35094 17357 -56193 299101 465931 198759 19084 -71544 25381 101438 172882
10382 172882 198580 -99555 200889 -220382 642243 137221 322998 224585 208075 453597
10372D53597A89779K6185I0492L12810j66708L48407k90830K13536D519J64767
10362A69286o0788N5602e3808A50837p3087C3485J03219Q8034k4205K49665L0395
10351D80593K32479k26207l5010K9585K58831A84737O43548l99035j81179J3227
10341B61298m6662J5087P190A16506a1323C90405o1098j46605J21141j22338k6123
10330A55382h0382B04922b15937I2541C8692c7789I96J51087a4956D58017A98347
10318E3431f9492A37348m5881K4157M8845D0014c21313i700j17633j34922f0530
10306h8081A97960K8873c53085i5707a2484F2913J97410o2432b0605A00889Q6090
10295A86979C0516g080k31633L0842f5553a1649k55531e6732j72479C60173c45085
$$ plain form
10372 453597 189779 215964 90492 403302 236594 585001 294171 507707 4519 169286
10362 169286 108498 164100 -53808 150837 77750 33485 136704 224738 200533 450198 480593
10351 480593 713072 486865 451855 481440 740271 184737 828285 429250 248071 261298
10341 261298 214636 229723 236913 116506 -11323 390405 329307 182702 303843 181505 155382
10330 155382 -80382 204922 -215937 92541 38692 -37789 996 152083 -14956 458017 198347
10318 53431 -69492 137348 91467 115624 164469 40014 -321313 -9700 -127333 -262255 -60530
10306 -88081 197960 226833 -353085 -95707 -12484 62913 260323 197891 -20605 100889 186979
10295 186979 30516 -7080 -238713 -207871 -65553 -11649 -267180 -56732 -229211 360173 -345085
10283B57578a7014B12711c8923q8624A7729K5346d3442A07917a25441r1833l8779
10272b56053D6415b76506a28526B32981a42499l033B78358L2314A25537R6162
10262B21699A2878L53362j46550M73427l37051A25740K44356A73108D8207b5331
10251H2200d23211C35806r4820F5201c05618J50861A03854K69390a5157m2529
10241e7686I9261e39634K66619g0826q4160D08633A5946c93000C4870a1599k31077
10230b42676i4167B70586j01601a5951p2598j13572m6654b9018D6532c5562p5514
10219a11076B01031b76323B87330H3724e9707k0600G2633b41483C0753a82421
10208G3752A1244O7602B6507b81603l6680f5815q7919J1050M077C56387g1335
$$ plain form
10283 257578 -17014 212711 -38923 -127547 17729 43075 -43442 107917 -125441 -217274 -256053
10272 -256053 46415 -276506 -128526 232981 -142499 -145532 278358 310672 125537 221699
10262 221699 12878 366240 219690 693117 356066 125740 370096 173108 48207 -25331
10251 82200 -423211 335806 240986 65201 -305618 -154757 103854 373244 -15157 -57686
10241 -57686 99261 -539634 -273015 -70826 -154986 408633 15946 -393000 34870 -11599 -242676
10230 -242676 -94167 270586 168985 -15951 -88549 -202121 -248775 -29018 46532 -35562 -111076
10219 -111076 201031 -276323 287330 83724 -59707 -80307 72633 -241483 30753 -182421
10208 73752 11244 78846 26507 -281603 -318283 -65815 -153734 -142684 -138607 356387 -71335
10196b88665P3173e7186f043k35651J04813D6520b70927J34932E550Q0642a29245
10184c5552j15025A47190a66312J6024b4178C12116b9880k190j88275b3626k4675
10173d8301q9339l2358j35066b2359j02445K6084A14488c7055l69156A41928o6319
10162G5609J05281d2684o3171o9990Q7050C5870a05250k3071N1272A20853b43687
10150B41868D3405d05794a02783l12046a26424J1293b7770C9281K52275h7666
10139b38358Q6711A03669a61525B01422d3544k05329a11080L2673i193A70747
10128B86650d73050d5142j25477A77122c7866o6884j30839j81540A43867P7284
10118B21151N9739F5942h8022A10194a8237k9200j17654e616j05261G2210b8599
$$ plain form
10196 -288665 -215492 -57186 -6043 -241694 -136881 46520 -270927 -135995 5550 86192 -129245
10184 -35552 -150577 147190 -166312 -150288 -24178 312116 -29880 -32070 -220345 -23626 -48301
10173 -48301 -137640 -169998 -305064 -22359 -124804 -98720 114488 -37055 -406211 141928 75609
10162 75609 180890 -42684 -105855 -175845 -88795 35870 -105250 -128321 -77049 120853 -243687
10150 241868 43405 -405794 -102783 -414829 -126424 -115131 -27770 39281 291556 -87666
10139 -238358 -151647 103669 -161525 201422 -43544 -248873 -111080 -78407 -9193 170747
10128 286650 -473050 -45142 -170619 177122 -37866 -104750 -235589 -417129 143867 221151
10118 221151 280890 65942 -88022 110194 -18237 -47437 -165091 -5616 -110877 72210 -28599
10106D2342F071a322o5881j28426F2129c09996J35653L0397G7206P8159G0665
10094A81274a48338n0148f5156j71675A71645c56302J44873M257e2200K1088l4109
10083f5221o6804a893j71796h381G1334C3816b11490B47495a66754A24941F2066
10071C7998b1806j18801j50386H0102J98237D6574b51511h5320A46203c32571
10060a22035j32747I6547D6552a24385F1281a91121l04769a18049Q492D7434b88882
10048d3651B316a42745A50423c21240A87911n4949n901f3533A95248E7976c14055
10036a33205C696b15692f4033J1207l21395D14242a65163j91955D5187P3421d28252
10024h153o5605m6657r7148A05365J5213d39790J61826j50030A30414A1240P7142
$$ plain form
10106 42342 6071 -1322 -67203 -195629 62129 -309996 -174343 -143946 77206 155365 70665
10094 181274 -148338 -198486 -65156 -236831 171645 -356302 -211429 -207172 -52200 -31112 -65221
10083 -65221 -132025 -1893 -173689 -8381 71334 33816 -211490 247495 -166754 124941 62066
10071 37998 -21806 -140607 -290993 80102 278339 46574 -251511 -85320 146203 -332571
10060 -122035 -254782 96547 46552 -124385 61281 -191121 -495890 -118049 -109557 47434 -288882
10048 -43651 2316 -142745 150423 -321240 187911 132962 127061 -63533 195248 57976 -314055
10036 -133205 3696 -215692 -64033 -52826 -374221 414242 -165163 -357118 45187 118608 -428252
10024 -8153 -73758 -120415 -217563 105365 120578 -439790 -277964 -427994 130414 11240 88382
10013H8382l3219h9280r6592h530k34378A4716g7855K2672a9193B52178l5506
10002B16672b16166A89252A4322c1196I2877J03425a03337j82589A07109l9826
9992F7283c9741B20161a72848P9196j52421H8662d55255c7177A85846a41245D4828
9980a51986f6842j88645B6309J45810F0909b19853k9623P4982I5810c0599j61993
9969a92592A12359a35174m089o9118M3340G5469e19837F6163i429j89891k39942
9958d39262a91349R4015A5053a12125d636l58175B06180b7412D62948F256M8505
9947E4761a91404B04825a09311D4496a00920n0140j01616e6880G7085a18582C7373
9935g6749C52326A14153K4914L0901b1921k15947b2771B40832c24912C76165A08599
$$ plain form
10013 88382 55163 -89280 -185872 -8530 -242908 14716 -77855 -55183 -19193 252178 216672
10002 216672 -216166 189252 14322 -31196 92877 196302 -103337 -285926 107109 67283
9992 67283 -39741 220161 -172848 -93652 -246073 88662 -455255 -37177 185846 -141245 44828
9980 -151986 -66842 -255487 26309 172119 60909 -219853 -249476 -174494 95810 -30599 -192592
9969 -192592 112359 -135174 -139263 -208381 -165041 75469 -519837 66163 -9429 -199320 -439262
9958 -439262 -191349 -97334 15053 -112125 -4636 -362811 206180 -27412 462948 6256 54761
9947 54761 -191404 204825 -109311 44496 -100920 -151060 -252676 -56880 77085 -118582 37373
9935 -76749 352326 114153 139067 169968 -21921 -237868 -22771 240832 -324912 376165 108599
9923b41887A59319p1377a46999h773k32096B9005a07377A70620a41410F7809a43522
9911G7939f2500k48713h9362l6652p3289j85677J59702L6240A4187a70067M4473
9900a25594c2883A46704e4242k36985a32157j70192C1956a35740r7930R9896q5747
9889b19521e861A18346F347b26563B7128a26984A89057a20842a1895q2952B6761
9877a29478L9242k04669f1724B9662a5977p4140j56561A56177B3291M2290a25537
9865a68708C3969J61209a30594e2957p1868N2626A6374e8003k36347R4003B18478
9853b42188c2863B820a78041m6095J07740k8486p350L6523B53990A05387a4847
9841d11j70168j16524F0078h5985m1811A1766b05410I1484l9432j3098c09456
$$ plain form
9923 -241887 159319 87942 -146999 -8773 -240869 29005 -107377 170620 -141410 67809 -143522
9911 77939 -62500 -311213 -89362 -126014 -199303 -384980 -225278 -189038 14187 -170067 -125594
9900 -125594 -32883 146704 -54242 -291227 -132157 -302349 31956 -135740 -233670 -133774 -219521
9889 -219521 -5861 118346 6347 -226563 27128 -126984 189057 -120842 -11895 -94847 26761
9877 -129478 -90236 -294905 -61724 29662 -15977 -90117 -246678 156177 23291 65581 -125537
9865 -168708 33969 195178 -130594 -52957 -124825 -72199 16374 -58003 -294350 -200347 218478
9853 -242188 -32863 2820 -178041 -224136 -116396 -144882 -152232 -115709 253990 105387 -14847
9841 -411 -170579 -287103 60078 -85985 -127796 11766 -205410 91484 52052 38954 -309456
9829f7455k49210J57255C159b4647k46880d1621k15861B6341J2679a60774N1267
9818a09507A34136g3017a8046k43052E0343a15862A3033R6626D2826b92172F2469
9806g4765A2904c54952i6274B82156b78323a18895D4332b413D918N1615J23321
9795A79854g2399j66386I0125a1298r7482A45261C2221K4171k7148b62461a08927
9783b82307Q249a18328j37120q0957h9127l8047O1243k24170J20714I664b50149
9771C58K92358b78413H7880R2566q8301b25666R8775H703i9065B45432a09230
9759f3170F253b12279d0930o9134j10667D802a8913E7757a93032n3062d2516B7964
9746A06563b44324o6927a55554c5036o21064c13759J47439g8224a0071j60715
$$ plain form
9829 -67455 -316665 -159410 3159 -24647 -271527 -41621 -257482 26341 39020 -160774 -109507
9818 -109507 134136 -73017 -18046 -261098 50343 -115862 13033 109659 42826 -292172 62469
9806 -74765 12904 -354952 -96274 282156 -278323 -118895 44332 -2413 4918 56533 179854
9795 179854 -72399 -238785 90125 -11298 -108780 145261 32221 56392 29244 -262461 -108927
9783 -282307 -274058 -118328 -255448 -336405 -89127 -127174 -65931 -290101 -169387 9664 -250149
9771 358 292716 -278413 87880 180446 92145 -225666 -126891 8703 -99065 245432 -109230
9759 -63170 6253 -212279 -40930 -110064 -220731 4802 -18913 57757 -193032 -246094 -42516 27964
9746 106563 -244324 -311251 -155554 -35036 -656100 -313759 -166320 -78224 -10071 -170786
9736a70786e4086j48066H6077e2385l69218H6769C1933a61049e8862F3899a9681
9724a22800b9861l12169f6637D0637a8476E1006a56818k30785a78714f5626K7915
9713c7711j7673A84252g5574A44960M1806a69814g0800k2209j37827e5408p0932
9702a26340A08134l7112h006k06003B1217f7958j54331o635b5791j84395c2152
9690c64434i1288B73696c11077B93864A2524Q6761b74101C4656J46986b00753
9679C033K9417L911H558J29928a06885D7488K7790a66979L3831M3410A9342n820
9667A3522a54325A66154K20520A27994a93424B7327K2801h5449H9434a21838C28490
9655a58749O1908l14783F1985a92827A89978a29864B20723q7241j2398a50521
$$ plain form
9736 -170786 -54086 -202152 86077 -52385 -421603 86769 31933 -161049 -58862 63899 -19681
9724 -122800 -29861 -342030 -66637 40637 -18476 51006 -156818 -387603 -178714 -65626 -37711
9713 -37711 -55384 184252 -75574 144960 186766 -169814 -70800 -93009 -230836 -55408 -126340
9702 -126340 108134 71022 -8006 -214009 21217 -67958 -222289 -228924 -25791 -210186 -32152
9690 -364434 -91288 273696 -311077 293864 12524 99285 -274101 34656 181642 -200753
9679 3033 32450 36361 8558 138486 -106885 47488 75278 -166979 -133148 -89738 19342 13522
9667 13522 -154325 166154 386674 127994 -193424 27327 50128 -85449 89434 -121838 328490
9655 -158749 -96841 -411624 61985 -192827 189978 -129864 220723 133482 121084 -150521
9644a30848j44961J31909E8968a61228A22352e42080I0745a67051j10634a4821
9633h8749J1647A30629c4228G5120b0580j31992b0495F6812a00533J3506a1093
9621b4972j76314A03239a85928A39580c4213j6093F2335M9736c00115o5154C8864
9609i5283k8753A60660f9864j38601O211A95752a98791j59747B13352a30876A45305
9597B5889b65457a17135N3670B9632J6233a36807A10424h4969j18972i8996d7666
9585b6806m48943A5476M7298b86976A10963b97819N4946P8188N4434D5234J3671
9574E8905Q5533b60881a12606A21934a93506L0008p2616g1980l17504a07445C890
9562f8800A63202a95598B30512b04109q5118A52498a65395K3209j50585C0552
$$ plain form
9644 -130848 -275809 -143900 58968 -161228 122352 -542080 90745 -167051 -277685 -14821
9633 -88749 -77102 130629 -34228 75120 -20580 -152572 -20495 66812 -100533 -87027 -11093
9621 -24972 -201286 103239 -185928 139580 -34213 -50306 62335 112071 -300115 -365269 38864
9609 -95283 -124036 160660 -69864 -208465 -202254 195752 -198791 -358538 213352 -130876 145305
9597 25889 -265457 -117135 -63465 29632 45865 -136807 110424 -84969 -203941 -98996 -47666
9585 -26806 -475749 15476 62774 -286976 110963 -297819 -242873 -164685 -110251 45234 58905
9574 58905 144438 -260881 -112606 121934 -193506 -163498 -236114 -71980 -389484 -107445 3890
9562 -68800 163202 -195598 230512 -204109 -289227 152498 -165395 -142186 -292771 30552
9551b5196L319j63857A27365g5264C27945c46034a15313C15396h4440J7469A74360
9539B23164c03527J09547g8109A48307o2734a20437k10144E5777c66291A0634
9528b11097D6657K05872c6560A72606a64771k05234a51404A73993b17792M2560
9518a75232f6557l35143J66671K833B70024a8886k18964m8527O4775N8589j20167
9507b83180h2346j46198D6903J0546a71735N4361l6949M8440C5395j1996a35798
9495b12543A57726b45966h0800A45620c1472l8339l72A10814F208L3691J76417
9484B16316H9877a19038M1531j02586a5545j19691i756A2698b5021A08485C0956
9472I2766b98953p4786J83010H228f5189A45441a63248A23874C5989a19285B61002
$$ plain form
9551 -25196 -21877 -185734 127365 -75264 327945 -346034 -115313 315396 -84440 -66971 174360
9539 223164 -303527 -193980 -78109 148307 85573 -120437 -330581 55777 -366291 10634
9528 -211097 46657 252529 -36560 172606 -164771 -370005 -151404 173993 -217792 -175232
9518 -175232 -66557 -401700 -235029 -232196 270024 -18886 -237850 -286377 -221602 -163013 -283180
9507 -283180 -82346 -228544 46903 57449 -171735 -117374 -154323 -105883 35395 23399 -135798
9495 -212543 157726 -245966 -80800 145620 -31472 -69811 -70183 110814 6208 39899 216316
9484 216316 89877 -119038 -77507 -180093 -15545 -135236 -9756 12698 -25021 108485 30956
9472 92766 -298953 -373739 -190729 8228 -65189 145441 -163248 123874 35989 -119285 261002
9460a8678J120l08766K4170B17408j03040n3271b14886e8332k58888F0491J71199
9449B31690c43622b9508A67672d7802a4855j70931B3984b57981a10256j98625
9439c08881i3482k29912I1337c58890J25841R6348J9741B68364e3441n6443a5917
9427a78922j12853c8314j17039H0774b59695A75463M6316a21008E4941a71570
9416I6012a20999A82289J97515a45768p9074L4028k806C53017r3934l5092e53040
9404e1934l0942F3902a32108J3052M0086j26452j57296b0102l66253A375f3413
9392a08482n8987b94G6441J9465b02346C5382h1007G4730a27653A38869J2876
9381A51745h5547d0721j01913J1305k9869A036b12172d5894k4378k56501i7124
$$ plain form
9460 -18678 -17558 -326324 -302154 217408 114368 61097 -214886 -58332 -317220 60491 231690
9449 231690 -343622 -29508 167672 -47802 -14855 -185786 23984 -257981 -110256 -308881
9439 -308881 -93482 -323394 91337 -358890 -233049 -136701 -116960 268364 -53441 -109884 -15917
9427 -178922 -291775 -38314 -155353 80774 -259695 175463 221779 -121008 54941 -171570
9416 96012 -120999 182289 379804 -145768 -224842 -190814 -193620 353017 259083 223991 -553040
9404 -51934 -82876 63902 -132108 -119056 -78970 -205422 -362718 -20102 -386355 1375 -63413
9392 -108482 -167469 -294 76441 95906 -202346 35382 -81007 74730 -127653 138869 151745
9381 151745 -85547 -40721 -142634 -131329 -161198 1036 -212172 -45894 -70272 -326773 -97124
9369b2024o7372A54528e6383l20968b0149B3595a53158A21900L8964E3285c06015
9357a07004k87616J87514R5474j54301M6181B25644A9578i4005a6401A1517d4838
9345C7074b12768M7265k59057a59612L1807e5354C09374a97840G748g5371L4437
9334d0934k91385e314k73745R065B59551P5980H1968b42426G1654a14216I9495
9322b3427A33974J174b12788P4130f2883j44296A40839b52464D5742e4885I8959
9310A0471b19980b7366A598J5581R3065K98364c60835a36448l0238j18759A76921
9298d7573B06517K38036d16750A61671J13459b18727q287d0458o0671A34230n085
9287A29145C150a41892f9948G0186a08718l544A46136a03961r7102B40508G0103
$$ plain form
9369 -22024 -89396 154528 -56383 -377351 -20149 23595 -153158 121900 160864 53285 -306015
9357 -107004 -394620 -207106 -111632 -265933 -219752 225644 19578 -94005 -16401 11517 -44838
9345 37074 -212768 -165503 -424560 -159612 -127805 -55354 309374 -197840 7748 -75371 -40934
9334 -40934 -332319 -5314 -279059 -269994 259551 335531 81968 -242426 71654 -114216 99495
9322 -23427 133974 135148 -212788 -138658 -62883 -207179 140839 -252464 45742 -54885 98959
9310 10471 -219980 -27366 1598 17179 110244 408608 -360835 -136448 -166686 -285445 176921
9298 -47573 206517 444553 -416750 161671 275130 -218727 -227014 -40458 -101129 134230 129145
9287 129145 3150 -141892 -69948 70186 -108718 -112262 146136 -103961 -201063 240508 70103
9275g1741k93830A26849a6499p7865B8809J40039n3995Q885N5383a04772n8780
9264a63552a9455n2923o5083C094E56a37732N6148k7081A55403a68270p0415f0132
9251a96415O7302C14335c81664a52583n7001C72471d1151g299F001e3876F3331
9239H564c86830B769M40652B19258b3309j49220Q420e9498A40254A096b75960
9227A45045b19212A01896B9002J4767a0482A33377a39206l6166M4075j75968F6167
9215b11105a03177H363J35688l436a51439m7967D4721b29451K436A38019C9171
9203a42192C90996e9332A04283m9286a37994A28487a83501d5485D3461c8146A14408
9191b54602f052j11288N6173K870l00147C36059a35462A01916D157J2119c23968
$$ plain form
9275 -71741 -365571 126849 -16499 -94364 28809 168848 114853 123738 179121 -104772 -163552
9264 -163552 -19455 -72378 -137461 3094 556 -137732 -81584 -108665 155403 -168270 -238685 -60132
9251 -196415 -129113 314335 -381664 -152583 -209584 372471 -41151 -7299 6001 -53876 63331
9239 8564 -386830 2769 443421 219258 -23309 -172529 -164109 -59498 140254 1096 -275960
9227 145045 -219212 101896 29002 43769 -10482 133377 -139206 -175372 -131297 -307265 66167
9215 -211105 -103177 8363 144051 140615 -151439 -199406 44721 -229451 -227015 138019 39171
9203 -142192 390996 -59332 104283 54997 -137994 128487 -183501 -45485 43461 -38146 114408
9191 -254602 -6052 -117340 -61167 -58297 -358444 336059 -135462 101916 4157 16276 -323968
9179a56981p1821j15696f4698l0757A25671b56573l37O0667j68382a14903B0449
9167d9262j28588O3516A9767g4809A03397E0261K19256b03974C6582b06337N1346
9156a54991O2914j52051j93840d5752b1489A2267P8608a48122H365a15000j97971
9145c12971g904B45476a27847F192a13947g322I9295Q8681f8374L0170B9370h7620
9132a28384a5569n9270F173d0515n1114A38748a32929K4263n054l0296M6518A00778
9119a9076Q427A4704J91287d2287A97780i0289F5496P530k126f9096q9496E7204
9106c41431a41697A08682g0543j17744a1579A62778h4076r336j36046e9104k76937
9095c36041A63984M8220D886b47334i7052m1792j2936k18432a18993B16235r2335
$$ plain form
9179 -156981 -228802 -344498 -64698 -95455 125671 -256573 -256910 -196243 -364625 -114903 20449
9167 -49262 -177850 -114334 19767 -74809 103397 50261 269517 -203974 36582 -206337 -154991
9156 -154991 -92077 -244128 -437968 -45752 -21489 12267 90875 -148122 8365 -115000 -312971
9145 -312971 -7904 245476 -127847 6192 -113947 -7322 99295 187976 -68374 -38204 29370 -87620
9132 -128384 -15569 -74839 6173 -40515 -91629 138748 -132929 -108666 -113720 -144016 -97498 100778
9119 -19076 -10649 14704 205991 -42287 197780 -90289 65496 73026 70900 -69096 -158592 57204
9106 -341431 -141697 108682 -70543 -188287 -11579 162778 -84076 -93412 -229458 -59104 -336041
9095 -336041 163984 212204 4886 -247334 -97052 -138844 -151780 -370212 -118993 216235 123900
9084A23900a05944A59008a25857k2854n1429k0791j67034o8934A90714c2305k01076
9073b33381c8235E7595a31156d7915j60362A13360L2889b11933N5672j1792J7022
9062a51031A6236b7263j89424j06839D1203g5438A40683b74791J15083r5593A37998
9050B1977a36658b4838n4463k2785A95976d8579C16481c0524A3227P1880b31167
9038f3935B06242e9836m9635o344j0573n36560c2857j37536K0673j05431j55746
9027d10897H5012J79396b42267q0959I4702p356a43543G4395A6467M1040M6015
9016A03522m5435d216j16396B18502c73j1708n9141G6075J36763J62045a7237
9004C50961j61505a3354A81507b61481Q8942D88478A21021k8881a80327I8989
$$ plain form
9084 123900 -105944 159008 -125857 -148711 -200140 -220931 -387965 -456899 190714 -32305 -233381
9073 -233381 -38235 57595 -131156 -47915 -208277 113360 146249 -211933 -156261 -168053 -151031
9062 -151031 16236 -27263 -216687 -323526 41203 -75438 140683 -274791 -159708 -255301 137998
9050 21977 -136658 -24838 -79301 -102086 195976 -48579 316481 -30524 13227 85107 -231167
9038 -63935 206242 -59836 -109471 -115815 -126388 -662948 -32857 -170393 -149720 -255151 -410897
9027 -410897 85012 264408 -242267 -323226 94702 87346 -143543 74395 16467 57507 103522
9016 103522 58087 -4216 -120612 218502 -373 -12081 -71222 76075 212838 374883 -17237
9004 350961 189456 -13354 181507 -261481 -172539 488478 121021 92140 -180327 98989
8993a02110M6790B84518c1929j14083O210I2030b26901G7966J96727a01921P89
8982a01132A47574b73739I6944J27297c0408D5026a46046a2791n2784o7994A00368
8970A15935g4039c1427A90042D4410J08718J65694j27496n3721d52418B1952a04649
8958b13857A65138J76743j44881d1158a7432j62509r8479a29742j80728L6789
8948b73681G2177m538b33600E8720c43411B28277F9924a160n2779k27351A2195
8936B21683e9867I7634L2565a59771d0085o5355m781D57145a15570m2423G322
8924C77892R8564J416810Q097973C137697C78974J58772j40177A44148a06846
8914a17915j07412a03859A74345a77344F1721a65950H0226a53309B37407d5238
$$ plain form
8993 -102110 -55320 284518 -31929 -146012 -139802 92030 -226901 77966 274693 -101921 -101132
8982 -101132 147574 -273739 96944 224241 -30408 45026 -146046 -12791 -65575 -133569 100368
8970 115935 -74039 -31427 190042 44410 153128 318822 191326 137605 -452418 21952 -104649
8958 -213857 165138 341881 197000 -41158 -17432 -179941 -278420 -129742 -310470 -273681
8948 -273681 72177 67639 -233600 58720 -343411 228277 69924 -1160 -53939 -281290 12195
8936 221683 -59867 97634 130199 -159771 -40085 -105440 -110221 457145 -115570 -157993 7322
8924 377892 476456 1893266 9991239 3137697 378974 537746 397569 144148 -106846
8914 -117915 -225327 -103859 174345 -177344 61721 -165950 80226 -153309 237407 -45238
8903d538C4537a40640B09194J01363a65164g3634j0212L6944A88279c36084j16401
8892d52485d1762j18120a7387j93066D7028c39063A48976i4204E06d0571m44607
8881d85178H099N3867O9985n6224a52313g504D108b22161A6643J96941f7787j39685
8869b07472A8910a49064e68j23373E3738j4438c11095a24589k9399N2973B7729
$$ plain form
8903 -4538 34537 -140640 209194 310557 -165164 -73634 -83846 -46902 188279 -336084 -452485
8892 -452485 -41762 -159882 -17387 -210453 47028 -339063 148976 -94204 506 -40571 -485178
8881 -485178 8099 61966 131951 75727 -152313 -7504 4108 -222161 16643 213584 -67787 -207472
8869 -207472 18910 -149064 -568 -123941 53738 39300 -311095 -124589 -153988 -101015 27729
$$ [...]
##END NTUPLES=NMR SPECTRUM
##END=
