
##TITLE=AC1290_VIERS11100_6528458_WgZoH42hia
##JCAMPDX= 6.0         $$ Bruker NMR JCAMP-DX V2.0
##DATA TYPE= NMR SPECTRUM
##DATA CLASS= NTUPLES
##ORIGIN= BRUKER
##OWNER= Administrator
$$ 1.72 TOPSPIN		Version 2.1
$$ 2012-07-15 15:02:56.718 -0500  Administrator@TOPSPIN
$$ Compression mode = diff/dup
##.OBSERVE FREQUENCY= 400.02188249412
##.OBSERVE NUCLEUS= ^1H
##.ACQUISITION MODE= SIMULTANEOUS (DQD)
##.ACQUISITION SCHEME= undefined
##.AVERAGES= 64
##.DIGITISER RES= 22
##SPECTROMETER/DATA SYSTEM= spect
##.PULSE SEQUENCE= noesygpps1d.comp
##.SOLVENT NAME= COFFEE_meoh
##.SHIFT REFERENCE= INTERNAL, COFFEE_meoh, 1, 14.96091
##AUDIT TRAIL= $$ (NUMBER, WHEN, WHO, WHERE, PROCESS, VERSION, WHAT)
$$ ##TITLE= Audit trail, TOPSPIN		Version 2.1
$$ ##JCAMPDX= 5.01
$$ ##ORIGIN= Bruker BioSpin GmbH
$$ ##OWNER= Administrator
$$ $$ C:\Bruker\TOPSPIN/data/COFFEE/nmr/AC1290_VIERS11100_6528458_WgZoH42hia/12/pdata/1/auditp.txt
$$ ##AUDIT TRAIL=  $$ (NUMBER, WHEN, WHO, WHERE, PROCESS, VERSION, WHAT)
(   1,<2012-07-15 15:02:51.828 -0500>,<Administrator>,<TOPSPIN>,<go>,<TOPSPIN 2.1>,
      <created by zg
	started at 2012-07-15 14:51:21.640 -0500,
	POWCHK enabled, PULCHK disabled,
       configuration hash MD5:
       6B 1B 68 BB D9 2E 58 E2 7F 35 AD 54 07 DF 0E 41
       data hash MD5: 64K
       F8 20 CE A2 C4 FE 4B 85 56 42 13 93 FC 56 C6 FD>)
(   2,<2012-07-15 15:02:54.765 -0500>,<Administrator>,<TOPSPIN>,<proc1d>,<TOPSPIN 2.1>,
      <Start of raw data processing
       efp LB = 0.3 FT_mod = 6 PKNL = 1 PHC0 = 0 PHC1 = 0 SI = 128K 
       data hash MD5: 128K
       44 46 D9 5F E4 3F 09 03 64 3B C8 AB 18 9D 6A E3>)
(   3,<2012-07-15 15:02:55.796 -0500>,<Administrator>,<TOPSPIN>,<proc1d>,<TOPSPIN 2.1>,
      <pk PHC0 = -0.3186035 PHC1 = 0 
       data hash MD5: 128K
       E2 81 8B D7 2F 8D 62 27 4C 9D C0 5A 32 21 6A 71>)
(   4,<2012-07-15 15:02:56.390 -0500>,<Administrator>,<TOPSPIN>,<proc1d>,<TOPSPIN 2.1>,
      <abs ABSG = 1 
       data hash MD5: 128K
       97 9C D6 2A 2F 17 18 05 2B 0F 06 C4 1E ED 30 CB>)
(   5,<2012-07-15 15:02:56.468 -0500>,<Administrator>,<TOPSPIN>,<proc1d>,<TOPSPIN 2.1>,
      <abs ABSG = 2 
       data hash MD5: 128K
       9D 36 6C 85 B4 95 09 C2 1A 2F 27 17 5C AF E5 A4>)
(   6,<2012-07-15 15:02:56.515 -0500>,<Administrator>,<TOPSPIN>,<proc1d>,<TOPSPIN 2.1>,
      <abs ABSG = 3 
       data hash MD5: 128K
       9E 1B 98 6A BC E0 30 DB 05 0C 2E 93 69 E3 60 3D>)
(   7,<2012-07-15 15:02:56.578 -0500>,<Administrator>,<TOPSPIN>,<proc1d>,<TOPSPIN 2.1>,
      <abs ABSG = 4 
       data hash MD5: 128K
       59 05 3D DD 21 65 79 BB 54 75 6A 73 CE 67 3F E0>)
(   8,<2012-07-15 15:02:56.640 -0500>,<Administrator>,<TOPSPIN>,<proc1d>,<TOPSPIN 2.1>,
      <abs ABSG = 5 
       data hash MD5: 128K
       D9 93 FB 91 DA CB 86 77 C9 F5 BD 05 85 0D 15 92>)
$$ ##END=
$$ 
$$ $$ hash MD5
$$ $$ F0 D5 05 06 88 67 88 80 A8 02 B2 99 75 9A 6B CA
##$RELAX= 
##$RELAX= 
##$RELAX= 
##$RELAX= 
##$RELAX= 
##$RELAX= 
##$RELAX= 
##$RELAX= 
$$ Bruker specific parameters
$$ [...]
##$TP07= 0
##$TPNAME0= <>
##$TPNAME1= <>
##$TPNAME2= <>
##$TPNAME3= <>
##$TPNAME4= <>
##$TPNAME5= <>
##$TPNAME6= <>
##$TPNAME7= <>
##$TPOAL= (0..7)
0.5 0.5 0.5 0.5 0.5 0.5 0.5 0.5
##$TPOFFS= (0..7)
0 0 0 0 0 0 0 0
##$TUNHIN= 0
##$TUNHOUT= 0
##$TUNXOUT= 0
##$USERA1= <user>
##$USERA2= <user>
##$USERA3= <user>
##$USERA4= <user>
##$USERA5= <user>
##$V9= 5
##$VALIST= <valist>
##$VCLIST= <CCCCCCCCCCCCCCC>
##$VD= 0
##$VDLIST= <DDDDDDDDDDDDDDD>
##$VPLIST= <PPPPPPPPPPPPPPP>
##$VTLIST= <TTTTTTTTTTTTTTT>
##$WBST= 2048
##$WBSW= 25
##$XGAIN= (0..3)
0 0 0 0
##$XL= 0
##$YL= 0
##$YMAX_a= 11139756
##$YMIN_a= -8311213
##$ZGOPTNS= <>
##$ZL1= 120
##$ZL2= 120
##$ZL3= 120
##$ZL4= 120
##$ABSF1= 14.96091
##$ABSF2= -5.597272
##$ABSG= 5
##$ABSL= 3
##$ALPHA= 0
##$AQORDER= 0
##$ASSFAC= 0
##$ASSFACI= 0
##$ASSFACX= 0
##$ASSWID= 0
##$AUNMP= <proc_prof1d_extract.lims>
##$AXLEFT= 0
##$AXNAME= <>
##$AXNUC= <1H>
##$AXRIGHT= 0
##$AXTYPE= 0
##$AXUNIT= <>
##$AZFE= 0.1
##$AZFW= 0.1
##$BCFW= 0
##$BC_mod= 0
##$BYTORDP= 0
##$COROFFS= 0
##$CY= 15
##$DATMOD= 1
##$DC= 0
##$DFILT= <>
##$DTYPP= 0
##$F1P= 0
##$F2P= 0
##$FCOR= 0.5
##$FTSIZE= 131072
##$FT_mod= 6
##$GAMMA= 0
##$GB= 0
##$INTBC= 1
##$INTSCL= 1
##$ISEN= 128
##$LB= 0.3
##$LEV0= 0
##$LPBIN= 0
##$MAXI= 10000
##$MC2= 0
##$MEAN= 0
##$ME_mod= 0
##$MI= 0
##$NCOEF= 0
##$NC_proc= -2
##$NLEV= 6
##$NOISF1= 0
##$NOISF2= 0
##$NSP= 0
##$NTH_PI= 0
##$NZP= 0
##$OFFSET= 14.96091
##$PC= 1
##$PHC0= -0.3186035
##$PHC1= 0
##$PH_mod= 1
##$PKNL= yes
##$PPARMOD= 0
##$PPDIAG= 0
##$PPIPTYP= 0
##$PPMPNUM= 2147483647
##$PPRESOL= 1
##$PSCAL= 4
##$PSIGN= 0
##$PYNMP= <proc.py>
##$REVERSE= no
##$SF= 400.020009674477
##$SI= 131072
##$SIGF1= 0
##$SIGF2= 0
##$SINO= 400
##$SIOLD= 131072
##$SPECTYP= <>
##$SREGLST= <1H.CDCl3>
##$SSB= 0
##$STSI= 131072
##$STSR= 0
##$SW_p= 8223.68421052631
##$SYMM= 0
##$S_DEV= 0
##$TDeff= 65536
##$TDoff= 0
##$TI= <>
##$TILT= no
##$TM1= 0
##$TM2= 0
##$TOPLEV= 0
##$USERP1= <user>
##$USERP2= <user>
##$USERP3= <user>
##$USERP4= <user>
##$USERP5= <user>
##$WDW= 1
##$XDIM= 131072
##$YMAX_p= 415046337
##$YMIN_p= -13176
##$CURPLOT= <Network HP LaserJet P1505>
##$CURPRIN= <$Network HP LaserJet P1505>
##$DFORMAT= <normdp>
##$LAYOUT= <+/1D_H.xwp>
##$LFORMAT= <normlp>
##$PFORMAT= <normpl>
##$SURQMSG= 1
$$ End of Bruker specific parameters
$$ ---------------------------------
##NTUPLES= NMR SPECTRUM
##VAR_NAME=  FREQUENCY,     SPECTRUM/REAL,   SPECTRUM/IMAG
##SYMBOL=    X,             R,               I
##VAR_TYPE=  INDEPENDENT,   DEPENDENT,       DEPENDENT
##VAR_FORM=  AFFN,          ASDF,            ASDF
##VAR_DIM=   131072,        131072,          131072
##UNITS=     HZ,            ARBITRARY UNITS, ARBITRARY UNITS
##FACTOR=    0.0627417313425164, 1,          1
##FIRST=     8223.62146879497, 4400,         -53411
##LAST=      0,             5257,            -52692
##MIN=       0,             -13176,          0
##MAX=       8223.62146879497, 415046337,    0
$$ Real data points
##PAGE= N=1
##DATA TABLE= (X++(R..R)), XYDATA
$$ [...]
$$ plain form
63859 713595 747978 784973 824278 866041 910388 957100 1005757 1055789 1106400 1156854 1206845
63848 1206845 1256130 1303712 1347907 1387364 1421641 1450680 1474179 1491664 1502706 1506803 1503431 1492455
63836 1492455 1474272 1449392 1418215 1381362 1339821 1294545 1246183 1195382 1143010 1089927 1036834
63825 1036834 984463 933538 884418 837161 792119 749965 710911 674409 640032 608248 579905
63814 579905 555235 533735 514751 497789 482570 469208 458091 449147 441461 434031 426753 420178
63802 420178 414436 408813 402379 394675 385837 376427 367102 358169 349451 340752 332297 324473 317341 310772
63788 310772 304876 299872 295613 291713 288125 285170 282896 280802 278320 275317 272018 268726 265739 263318
63774 263318 261579 260505 260036 259966 259777 258879 257131 254972 252948 251269 249910 248960 248688 249228 250274 251144
$$ packed form
63859G13595L4383L6995L9305M1763M4347M6712M8657N0032N0611N0454M9991
63848A206845M9285M7582M4195L9457L4277K9039K3499J7485J1042M097l372j0976
63836A492455j8183k4880l1177l6853m1541m5276m8362n0801n2372n3083n3093
63825A036834n2371n0925m9120m7257m5042m2154l9054l6502l4377l1784k8343
63814E79905k4670k1500j8984j6962j5219j3362j1117q944p686p430p278o575
63802D20178n742n623o434p704q838r410r325q933q718q699q455p824p132o569
63788C10772n896n004m259l900l588k955k274k094k482l003l299l292k987k421
63774B63318j739j074m69p0j89q98j748k159k024j679j359r50k72N40J046Q70
$$ plain form
63758 251144 251300 250851 250440 250491 250708 250447 249469 248147 247023 246369 246148 246186 246316 246457 246579 246614 246599 246886 247930
63739 247930 249678 251483 252919 254414 256678 259704 262798 265488 267943 270513 273323 276348 279480 282482
63725 282482 285304 288494 292849 298527 304902 311357 317736 323883 329364 334029 338331 342609 346457 349298
63711 349298 351201 352480 352697 350825 346531 340757 334823 329326 324103 318936 313964 309567 306133 303935
63697 303935 303094 303509 304764 306192 307279 308177 309562 311773 314290 316367 317994 319799 322107 324572 326756
63682 326756 328520 329720 330114 329915 329968 330970 332753 334707 336616 338655 340852 343078 345463 348296 351577
63667 351577 355134 359161 364080 369709 375045 379133 381847 383624 384724 384992 384069 381615 377538 372190 366219
63652 366219 360120 354119 348467 343406 338719 333803 328545 323768 320377 318358 317082 316348 316596 318122 320682
$$ packed form
63758B51144J56m49m11N1K17k61r78j322j124o54k21L8J30J41J22L5j5K87J044
63739B47930J748J805J436J495K264L026L094K690K455K570K810L025L132L002
63725B82482K822L190M355N678O375O455O379O147N481M665M302M278L848K841
63711C49298J903J279K17j872m294n774n934n497n223n167m972m397l434k198
63697C03935q41M15J255J428J087Q98J385K211K517K077J627J805K308K465K184
63682C26756J764J200L94j99N3J002J783J954J909K039K197K226K385K833L281
63667C51577L557M027M919N629N336M088K714J777J100K68r23k454m077n348n971
63652C66219o099o001n652n061m687m916n258m777l391k019j276p34K48J526K560
$$ plain form
63637 320682 323872 327489 331394 335401 339467 343682 347955 352019 355889 360059 364970 370444 375884 381067
63623 381067 386560 393188 401101 409555 417846 426359 436295 448329 462047 476930 493330 511957 532785
63610 532785 555177 578898 604307 631543 660196 689899 720677 752452 784619 816211 846028
63599 846028 872505 893957 909259 918064 920438 916917 909094 899428 889869 880868 871885 862423 852271
63586 852271 841148 828603 814074 796884 776543 753374 728608 703657 679598 657401 637979
63575 637979 621507 607221 594398 583204 574109 566992 561539 558182 557750 560209 564410 569183 574126
63562 574126 579303 584740 590452 596586 603294 610697 618974 628269 638504 649567 661672 675285 690791
63549 690791 708538 729152 753429 781876 814668 852026 894258 941179 991404 1041996 1088665
$$ packed form
63637C20682L190L617L905M007M066M215M273M064L870M170M911N474N440N183
63623C81067N493O628P913Q454Q291Q513R936J2034J3718J4883J6400J8627K0828
63610E32785K2392K3721K5409K7236K8653K9703L0778L1775L2167L1592K9817
63599H46028K6477K1452J5302Q805K374l521p823r666r559r001q983r462j0152
63586H52271j1123j2545j4529j7190k0341k3169k4766k4951k4059k2197j9422
63575F37979j6472j4286j2823j1194r095p117n453l357m32K459M201M773M943
63562E74126N177N437N712O134O708P403Q277R295J0235J1063J2105J3613J5506
63549F90791J7747K0614K4277K8447L2792L7358M2232M6921N0225N0592M6669
$$ plain form
63538 1088665 1126744 1152681 1165043 1164408 1152867 1133874 1111813 1090539 1071969 1056266 1043086 1032023
63526 1032023 1022037 1011383 998473 982393 962561 938540 910517 879451 846421 812226 777813
63515 777813 744563 713644 685337 659366 635695 614660 596448 580749 566938 554433 542938
63504 542938 532400 522742 513706 505177 497500 491089 485700 480486 474920 469329 464346 460147 456423 452799
63490 452799 449096 445390 441978 439107 436639 434254 432081 430742 430646 431599 433326 435968 439695 444131 448641
63475 448641 453006 457408 461825 465847 469146 471831 474127 475884 476581 475865 473933 471246 467886 463477 457958
63460 457958 452119 446975 442737 438905 435272 432262 430173 428645 427184 425756 424634 424117 424625 426481 429211
63445 429211 431657 433380 435561 439810 446382 454335 463261 473972 487366 503461 521941 543089 567723
$$ packed form
63538A088665L8079K5937J2362o35j1541j8993k2061k1274j8570j5703j3180j1063
63526A032023r986j0654j2910j6080j9832k4021k8023l1066l3030l4195l4413
63515G77813l3250l0919k8307k5971k3671k1035j8212j5699j3811j2505j1495
63504E42938j0538r658r036q529p677o411n389n214n566n591m983m199l724l624
63490D52799l703l706l412k871k468k385k173j339r6R53J727K642L727M436M510
63475D48641M365M402M417M022L299K685K296J757O97p16j932k687l360m409n519
63460D57958n839n144m238l832l633l010k089j528j461j428j122n17N08J856K730
63445D29211K446J723K181M249O572P953Q926J0711J3394J6095J8480K1148K4634
$$ plain form
63432 567723 596594 630251 668996 712082 756633 797846 830939 853352 865405 869205 867239 861987
63420 861987 856179 852580 853117 858522 869043 885205 907471 935340 967203 1001125 1035364 1068144
63408 1068144 1097408 1121147 1137925 1147046 1148561 1143427 1133518 1121037 1107692 1094309 1080999 1067377
63396 1067377 1052604 1035620 1015694 992719 966836 937963 906043 871741 836502 801764 768464
63385 768464 737450 709778 686041 665654 647462 631070 617068 605948 597426 590994 586573 584239
63373 584239 583741 584691 586984 590715 595870 602406 610490 620362 632069 645477 660391 676587 694047
63360 694047 713351 735434 760642 788376 818040 849936 884690 922050 960835 999938 1038645
63349 1038645 1075942 1110159 1139555 1162840 1178982 1187092 1187049 1180069 1168366 1154241 1139480 1125224
$$ packed form
63432E67723K8871L3657L8745M3086M4551M1213L3093K2413J2053L800j966n252
63420H61987n808l599N37N405J0521J6162K2266K7869L1863L3922L4239L2780
63408A068144K9264K3739J6778R121J515n134r909j2481j3345j3383j3310j3622
63396A067377j4773j6984j9926k2975k5883k8873l1920l4302l5239l4738l3300
63385G68464l1014k7672k3737k0387j8192j6392j4002j1120q522o432m421k334
63373E84239m98R50K293L731N155O536Q084R872J1707J3408J4914J6196J7460
63360F94047J9304K2083K5208K7734K9664L1896L4754L7360L8785L9103L8707
63349A038645L7297L4217K9396K3285J6142Q110m3o980j1703j4125j4761j4256
$$ plain form
63337 1125224 1111849 1098893 1085282 1069782 1051368 1029435 1003947 975445 944734 912448 878968
63326 878968 844830 811184 779758 752247 729684 712243 699483 690752 685610 684084 686279 691314
63314 691314 696567 698332 693490 680744 660669 635215 607190 579512 554294 532459 514127 498998
63302 498998 486338 475180 464984 455857 447908 440788 434163 428216 423206 418838 414554 410121 405486
63289 405486 400375 394717 389219 384752 381184 377515 373268 369044 365574 362878 360698 359137 358418 358257 357945
63274 357945 356922 355058 352571 349921 347714 346431 346088 346135 345788 344730 343581 343326 344063 344748 344561 344079
63258 344079 344409 345527 346350 346382 346230 346418 346691 346919 347691 349326 351097 352215 352999 354234 355850 357199 358390
63241 358390 360396 363786 368168 372993 378170 383621 388914 393744 398370 403253 408511 414063 420042 426741
$$ packed form
63337A125224j3375j2956j3611j5500j8414k1933k5488k8502l0711l2286l3480
63326H78968l4138l3646l1426k7511k2563j7441j2760q731n142j526K195N035
63314F91314N253J765m842j2746k0075k5454k8025k7678k5218k1835j8332j5129
63302D98998j2660j1158j0196r127p949p120o625n947n010m368m284m433m635
63289D05486n111n658n498m467l568l669m247m224l470k696k180j561p19j61l12
63274C57945j023j864k487k650k207j283l43M7l47j058j149k55P37O85j87m82
63258C44079L30J118Q23L2j52J88K73K28P72J635J771J118P84J235J616J349J191
63241C58390K006L390M382M825N177N451N293M830M626M883N258N552N979O699
$$ plain form
63227 426741 434207 442092 449899 457298 464304 471225 478382 485852 493508 501241 508992 516643 524126 531667
63213 531667 539679 548248 556815 564485 570597 574974 577739 578978 578573 576280 571979 565779 557884 548533
63199 548533 538258 528083 519063 511492 504781 498315 492236 487181 483482 481036 479956 480814 483929 488725
63185 488725 494288 500486 508131 517911 529554 542226 555360 568795 582368 595893 609463 623306
63173 623306 637279 650786 663336 674900 685647 695557 704359 711646 717063 720639 722916 724360 724564
63160 724564 722378 716931 708157 696278 681391 663906 644853 625231 605350 585302 565724 547473
63148 547473 530696 514894 499878 486084 473914 463359 454413 447236 441639 436853 432220 427839 424257
63135 424257 421786 420312 419510 418942 418228 417390 416853 416867 417193 417671 418763 421072 424459 428179 431893 435962
$$ packed form
63227D26741P466P885P807P399P006O921P157P470P656P733P751P651P483P541
63213E31667Q012Q569Q567P670O112M377K765J239m05k293m301o200p895r351
63199E48533j0275j0175r020p571o711o466o079n055l699k446j080Q58L115M796
63185D88725N563O198P645R780J1643J2672J3134J3435J3573J3525J3570J3843
63173F23306J3973J3507J2550J1564J0747R910Q802P287N417L576K277J444K04
63160G24564k186n447q774j1879j4887j7485j9053j9622j9881k0048j9578j8251
63148E47473j6777j5802j5016j3794j2170j0555q946p177n597m786m633m381l582
63135D24257k471j474q02n68p14q38n37J4L26M78J092K309L387L720L714M069
$$ plain form
63119 435962 440619 445399 449761 453930 458684 464463 471026 477852 484452 490349 495221 499326 503453 508206
63105 508206 513467 518760 523935 529254 534902 540756 546648 552535 558383 564190 570255 577150 585158 593910
63091 593910 602821 611759 620982 630468 639570 647382 653205 656683 657749 656634 653783 649556 644020 637107
63077 637107 628934 619945 610819 602296 594897 588639 583038 577588 572305 567714 564247 561741 559695 557993
63063 557993 557189 557949 560324 563739 567694 572252 577788 584516 592488 601869 612872 625419 639150 653863
63049 653863 669717 686918 705413 725061 745828 767565 789706 811578 833102 854950 877851
63038 877851 901807 926072 949790 972616 994874 1017258 1040284 1063731 1086507 1107186 1124915
63027 1124915 1139818 1152403 1162568 1169267 1171227 1167884 1159524 1146629 1129362 1107806 1082536 1054756
$$ packed form
63119D35962M657M780M362M169M754N779O563O826O600N897M872M105M127M753
63105E08206N261N293N175N319N648N854N892N887N848N807O065O895Q008Q752
63091E93910Q911Q938R223R486R102P812N823L478J066j115k851m227n536o913
63077F37107q173q989r126q523p399o258n601n450n283m591l467k506k046j702
63063E57993q04P60K375L415L955M558N536O728P972R381J1003J2547J3731J4713
63049F53863J5854J7201J8495J9648K0767K1737K2141K1872K1524K1848K2901
63038H77851K3956K4265K3718K2826K2258K2384K3026K3447K2776K0679J7729
63027A124915J4903J2585J0165O699J960l343q360j2895j7267k1556k5270k7780
$$ plain form
63015 1054756 1025875 997024 968948 942180 917245 894780 875506 860049 848724 841440 837809 837347
63003 837347 839702 844848 853011 864307 878390 894596 912369 931357 951026 970442 988723 1005632
62991 1005632 1021650 1037582 1054216 1072110 1091228 1110723 1129416 1146671 1162615 1177362 1190282
62980 1190282 1200154 1205838 1206642 1202263 1192739 1178403 1159581 1136338 1108764 1077555 1044118 1010001
62968 1010001 976302 943562 911946 881422 852004 823985 797870 773943 752036 731898 713646
62957 713646 697607 683678 671066 658776 646308 633860 621984 611147 601471 592601 583716 573815
62945 573815 562294 549414 536246 524076 513691 505063 497594 490688 484125 477944 472113 466485 461067
62932 461067 456066 451498 447043 442520 438330 435025 432481 430004 427360 425229 424335 424424 424534 424120 423561 423539
$$ packed form
63015A054756k8881k8851k8076k6768k4935k2465j9274j5457j1325p284l631m62
63003H37347K355N146Q163J1296J4083J6206J7773J8988J9669J9416J8281J6909
62991A005632J6018J5932J6634J7894J9118J9495J8693J7255J5944J4747J2920
62980A190282R872N684Q04m379r524j4336j8822k3243k7574l1209l3437l4117
62968A010001l3699l2740l1616l0524k9418k8019k6115k3927k1907k0138j8252
62957G13646j6039j3929j2612j2290j2468j2448j1876j0837r676q870q885r901
62945E73815j1521j2880j3168j2170j0385q628p469o906o563o181n831n628n418
62932D61067n001m568m455m523m190l305k544k477k644k131q94Q9J10m14n59k2
$$ plain form
62916 423539 424269 425376 426369 427140 428041 429416 431017 432107 432306 432205 432878 434849 437631 440197 441758 442329
62900 442329 442789 444227 446977 450463 454235 458786 464853 472164 479540 486230 492475 498673 504655 510035
62886 510035 514685 518540 521423 523468 525262 527071 528220 527690 525148 521059 516117 510982 506267 502155
62872 502155 498049 493053 486847 479865 472783 466197 460586 455979 451706 447017 441996 437357 433291 429123
62858 429123 424372 419600 415775 413193 411457 410204 409332 408683 408050 407530 407450 407825 408229 408247 407778 406826 405411
62841 405411 403915 403080 403315 404165 404898 405461 406431 408071 409915 411406 412506 413456 414374 415392 416798 418613
62825 418613 420265 421190 421636 422382 423739 425341 426869 428364 429682 430285 430008 429577 429920 431157 432619 433640
62809 433640 433991 433763 433281 433075 433580 434823 436596 438858 441690 444879 447851 450129 451783 453437 455860
$$ packed form
62916D23539P30J107R93P71R01J375J601J090J99j01O73J971K782K566J561N71
62900D42329M60J438K750L486L772M551O067P311P376O690O245O198N982N380
62886E10035M650L855K883K045J794J809J149n30k542m089m942n135m715m112
62872E02155m106m996o206o982p082o586n611m607m273m689n021m639m066m168
62858D29123m751m772l825k582j736j253q72o49o33n20q0L75M04J8m69r52j415
62841D05411j496q35K35Q50P33N63R70J640J844J491J100R50R18J018J406J815
62825D18613J652R25M46P46J357J602J528J495J318O03k77m31L43J237J462J021
62809D33640L51k28m82k06N05J243J773K262K832L189K972K278J654J654K423
$$ plain form
62794 455860 459395 463680 468054 472344 477000 482311 487849 493123 498556 505370 514538 526245 540315 556641
62780 556641 575073 595298 617152 640876 666913 695515 726537 759419 793291 827322 861019
62769 861019 894042 925698 954873 980464 1001663 1017789 1028203 1032590 1031134 1024234 1012213 995476
62757 995476 974739 950799 924157 895112 864193 832219 799921 767770 736329 706464 678839
62746 678839 653226 628765 605082 582887 563152 545925 530391 515935 502652 490739 479997
62735 479997 470197 461483 454062 447829 442657 438696 435899 433589 431061 428527 426864 426451 426764 427132 427432
62720 427432 427902 428694 429798 431130 432630 434468 437121 440951 445760 451161 457337 464995 474581 485930
62706 485930 498699 512605 527279 542538 558951 577587 598916 622524 648093 676018 706577
$$ packed form
62794D55860L535M285M374M290M656N311N538N274N433O814R168J1707J4070J6326
62780E56641J8432K0225K1854K3724K6037K8602L1022L2882L3872L4031L3697
62769H61019L3023L1656K9175K5591K1199J6126J0414M387j456o900j2021j6737
62757I95476k0737k3940k6642k9045l0919l1974l2298l2151l1441k9865k7625
62746F78839k5613k4461k3683k2195j9735j7227j5534j4456j3283j1913j0742
62735D79997r800q714p421o233n172l961k797k310k528k534j663m13L13L68L00
62720D27432M70P92J104J332J500J838K653L830M809N401O176P658R586J1349
62706D85930J2769J3906J4674J5259J6413J8636K1329K3608K5569K7925L0559
$$ plain form
62695 706577 739178 773070 808434 846046 885966 927098 967970 1007535 1045276 1080929 1114077
62684 1114077 1143727 1168319 1186346 1196879 1199467 1193913 1180454 1159825 1132829 1100158 1062909 1022791
62672 1022791 981209 938545 894976 851686 810491 772428 737417 705152 675479 647931 621887
62661 621887 597505 575687 556764 539946 524456 510471 498433 488075 478809 470519 463268 456625
62649 456625 450089 443914 438698 434203 429377 423671 417671 412251 407679 403861 400982 399461 399409 400395 401620
62634 401620 402328 402331 402224 402815 404159 405411 405723 404973 403447 401260 398481 395578 393237 391796 391142 391038 391183
62617 391183 391079 390395 389529 389352 390234 391655 392984 394266 395996 398383 401193 404040 406498 408187 409262
62602 409262 410742 413780 418431 423553 428096 432241 437122 443769 452564 463369 475751 489158 503257
$$ packed form
62695G06577L2601L3892L5364L7612L9920M1132M0872L9565L7741L5653L3148
62684A114077K9650K4592J8027J0533K588n554j3459k0629k6996l2671l7249m0118
62672A022791m1582m2664m3569m3290m1195l8063l5011l2265k9673k7548k6044
62661F21887k4382k1818j8923j6818j5490j3985j2038j0358r266q290p251o643
62649D56625o536o175n216m495m826n706o000n420m572l818k879j521n2R86J225
62634D01620P08Lj07N91J344J252L12p50j526k187k779k903k341j441o54j04J45
62617C91183j04o84q66j77Q82J421J329J282J730K387K810K847K458J689J075
62602D09262J480L038M651N122M543M145M881O647Q795J0805J2382J3407J4099
$$ plain form
62589 503257 518128 533882 550130 566116 581383 596024 610058 622792 633027 639848 643112 643300
62577 643300 641091 636960 630906 622435 611051 596981 581351 565435 549668 533646 517138 500887
62565 500887 486132 473416 462195 451649 441602 432476 424596 417848 411940 406747 402362 398991 396773
62552 396773 395523 394622 393384 391630 389717 387988 386400 384840 383499 382661 382303 382250 382679 384012 386245 388702
62536 388702 390690 392115 393262 394233 394928 395358 395620 395693 395693 396236 398001 400794 403588 405794 408137 411906 417646
62519 417646 425022 433700 443769 455329 468215 482374 498136 515850 535462 556664 579300 603395
62507 603395 628810 654970 680987 706061 729883 752608 774243 794020 810508 822383 829058 830750
62495 830750 828323 823079 816259 808459 799714 790340 781445 774308 769463 766736 766083 768030 773214 781799
$$ packed form
62589E03257J4871J5754J6248J5986J5267J4641J4034J2734J0235O821L264J88
62577F43300k209m131o054q471j1384j4070j5630j5916j5767j6022j6508j6251
62565E00887j4755j2716j1221j0546j0047r126p880o748n908n193m385l371k218
62552C96773j250r01j238j754j913j729j588j560j341q38l58n3M29J333K233K457
62536C88702J988J425J147R71O95M30K62P3%N43J765K793K794K206K343L769N740
62519D17646P376Q678J0069J1560J2886J4159J5762J7714J9612K1202K2636K4095
62507F03395K5415K6160K6017K5074K3822K2725K1635J9777J6488J1875O675J692
62495H30750k427n244o820p800q745r374q895p137m845k727o53J947N184Q585
$$ plain form
62481 781799 793442 807664 824114 842604 863015 885083 908079 930629 950864 966887 977339
62470 977339 981780 980608 974549 964109 949339 929943 905574 876308 843070 807546 771401 735487
62458 735487 699899 664784 630863 599121 570236 544525 522199 503265 487174 473047 460533
62447 460533 450216 442853 438310 435582 433758 432548 431836 431285 430711 430482 431119 432681 434881 437565 440575
62432 440575 443271 444829 445117 444803 444405 443701 442274 440190 437755 434938 431471 427367 422990 418642 414398
62417 414398 410297 406484 403179 400606 398865 397735 396774 395802 395094 394876 394848 394487 393675 392652 391470 389896
62401 389896 387933 386102 385090 385314 386813 389295 392192 394942 397374 399684 402058 404530 407284 410757
62387 410757 415220 420386 425640 430600 435353 440254 445653 451775 458666 466198 474222 482750 491995 502197
$$ packed form
62481G81799J1643J4222J6450J8490K0411K2068K2996K2550K0235J6023J0452
62470I77339M441j172o059j0440j4770j9396k4369k9266l3238l5524l6145l5914
62458G35487l5588l5115l3921l1742k8885k5711k2326j8934j6091j4127j2514
62447D60533j0317p363m543k728j824j210p12n51n74k29O37J562K200K684L010
62432D40575K696J558K88l14l98p04j427k084k435k817l467m104m377m348m244
62417D14398m101l813l305k573j741j130r61r72p08k18k8l61q12j023j182j574
62401C89896j963j831j012K24J499K482K897K750K432K310K374K472K754L473
62387D10757M463N166N254M960M753M901N399O122O891P532Q024Q528R245J0202
$$ plain form
62373 502197 513403 525365 537681 550077 562616 575622 589411 604115 619757 636436 654467
62362 654467 674433 697158 723500 753959 788443 826541 868197 914005 964669 1020136 1079381
62351 1079381 1140905 1203080 1263915 1320912 1371684 1414649 1448944 1473903 1489123 1494970 1492438 1482336
62339 1482336 1464937 1440499 1409700 1373423 1332574 1288361 1242352 1195961 1150186 1106037 1064722
62328 1064722 1026967 992473 960488 930656 902947 877124 852824 829928 808261 787129 765798
62317 765798 744304 723217 702659 682288 662253 643388 626174 610111 594504 579412 565435
62306 565435 552939 541854 531991 523182 515318 508540 503291 499891 498097 497189 496429 495446 494370 493691 493783
62291 493783 494503 495425 496417 497741 499599 501993 505053 509001 513587 518026 521800 525193 528702 532279 535568
$$ packed form
62373E02197J1206J1962J2316J2396J2539J3006J3789J4704J5642J6679J8031
62362F54467J9966K2725K6342L0459L4484L8098M1656M5808N0664N5467N9245
62351A079381O1524O2175O0835N6997N0772M2965L4295K4959J5220N847k532j0102
62339A482336j7399k4438l0799l6277m0849m4213m6009m6391m5775m4149m1315
62328A064722l7755l4494l1985k9832k7709k5823k4300k2896k1667k1132k1331
62317G65798k1494k1087k0558k0371k0035j8865j7214j6063j5607j5092j3977
62306E65435j2496j1085r863q809p864o778n249l400j794r08p60r83j076o79R2
62291D93783P20R22R92J324J858K394L060L948M586M439L774L393L509L577L289
$$ plain form
62276 535568 538634 542001 546064 550778 555791 560657 565100 569479 574927 582618 592857 605102 618867
62263 618867 634367 652289 673234 697474 725098 756270 791380 830954 875471 925284 980508
62252 980508 1040669 1104408 1169799 1234895 1297597 1355090 1404320 1443462 1472388 1491237 1499263 1495968
62240 1495968 1482785 1462338 1435907 1402658 1361656 1313641 1260375 1203266 1143611 1083645 1026133
62229 1026133 972751 923446 877520 834868 795991 761240 730378 702741 677713 655113 635128
62218 635128 617835 602860 589623 577778 567141 557295 547667 538138 529218 521388 514443 507821 501447
62205 501447 495926 491900 489411 487988 487136 486607 486386 486643 487644 489551 492311 495817 500094 505209 511057
62190 511057 517471 524494 532354 541178 550980 561892 574024 586959 599830 612210 624618 637654
$$ packed form
62276E35568L066L367M063M714N013M866M443M379N448P691J0239J2245J3765
62263F18867J5500J7922K0945K4240K7624L1172L5110L9574M4517M9813N5224
62252I80508O0161O3739O5391O5096O2702N7493M9230L9142K8926J8849Q026l295
62240A495968j3183k0447k6431l3249m1002m8015n3266n7109n9655n9966n7512
62229A026133n3382m9305m5926m2652l8877l4751l0862k7637k5028k2600j9985
62218F35128j7293j4975j3237j1845j0637r846r628r529q920p830o945o622o374
62205E01447n521m026k489j423q52n29k21K57J001J907K760L506M277N115N848
62190E11057O414P023P860Q824R802J0912J2132J2935J2871J2380J2408J3036
$$ plain form
62178 637654 650865 662988 673223 681727 688839 694571 699256 704149 710815 720140 732407 748096 767945
62165 767945 792239 820591 852667 888669 928813 972497 1018158 1063656 1106662 1145018 1177209
62154 1177209 1202521 1220615 1231141 1234079 1230308 1221263 1207738 1189182 1164406 1133009 1096150 1056109
62142 1056109 1015179 974790 935439 897335 861079 827692 798028 772223 749725 729839 712249
62131 712249 697053 684348 673883 665304 658631 654104 651326 648995 646047 642958 641341 642238 645344 650038
62117 650038 656511 665454 677082 691028 706923 724554 743659 764049 785750 808386 830361 849301
62105 849301 863724 874088 882127 889387 896525 903660 910941 918511 925835 931149 932033 927014 916727 903400
62091 903400 889295 875818 863677 853219 844487 837424 832222 829214 828422 829640 832997 838995 847843
$$ packed form
62178F37654J3211J2123J0235Q504P112N732M685M893O666R325J2267J5689J9849
62165G67945K4294K8352L2076L6002M0144M3684M5661M5498M3006L8356L2191
62154A177209K5312J8094J0526K938l771r045j3525j8556k4776l1397l6859m0041
62142A056109m0930m0389l9351l8104l6256l3387k9664k5805k2498j9886j7590
62131G12249j5196j2705j0465q579o673m527k778k331k948l089j617Q97L106M694
62117F50038O473Q943J1628J3946J5895J7631J9105K0390K1701K2636K1975J8940
62105H49301J4423J0364Q039P260P138P135P281P570P324N314Q84n019j0287j3327
62091I03400j4105j3477j2141j0458q732p063n202l008p92J218L357N998Q848
$$ plain form
62078 847843 859198 872733 888563 906877 927642 950894 976790 1004930 1033982 1062570 1090364
62067 1090364 1117918 1145567 1172958 1199648 1225826 1252377 1280320 1309984 1340501 1370238 1397828
62056 1397828 1422539 1443516 1459240 1468303 1470576 1467129 1459174 1447453 1432376 1414044 1391990 1365398
62044 1365398 1333795 1297400 1256964 1213658 1168984 1124233 1079936 1036231 993710 953392 915762
62033 915762 880423 846943 815608 787085 761721 739496 720351 704160 690491 678653 667967
62022 667967 657976 648547 639794 631687 623759 615472 606831 598195 589545 580581 571670 563939 557941 552922
62008 552922 548049 543844 541504 541080 541328 541423 542007 544279 548697 554883 562220 570099 577898 585104 591328
61993 591328 596106 599067 600496 601252 601736 601256 598806 594183 587952 580568 572087 562596 552379 541687
$$ packed form
62078H47843J1355J3535J5830J8314K0765K3252K5896K8140K9052K8588K7794
62067A090364K7554K7649K7391K6690K6178K6551K7943K9664L0517K9737K7590
62056A397828K4711K0977J5724R063K273l447p955j1721j5077j8332k2054k6592
62044A365398l1603l6395m0436m3306m4674m4751m4297m3705m2521m0318l7630
62033I15762l5339l3480l1335k8523k5364k2225j9145j6191j3669j1838j0686
62022F67967r991r429q753q107p928q287q641q636q650q964q911p731n998n019
62008E52922m873m205k340m24K48R5N84K272M418O186P337P879P799P206O224
61993E91328M778K961J429P56M84m80k450m623o231p384q481r491j0217j0692
$$ plain form
61979 541687 530826 520446 511233 503168 495526 487781 480145 473122 466930 461578 457079 453353 450199 447604
61965 447604 445739 444457 443202 441715 440409 439658 439158 438483 437922 438079 438894 439798 440800 442650 445715 449352
61949 449352 452757 456040 460138 465900 473503 482586 492826 504444 518017 533603 550319 567319 585002
61936 585002 604557 626368 649607 673484 697947 722735 746650 768473 788102 806167 823026
61925 823026 838662 853054 865898 876326 883630 887945 889602 888210 883253 875341 866010 856414 847095
61912 847095 838954 833402 831348 832783 837554 845753 857162 871099 887084 904917 923778 942044 958435
61899 958435 972603 984142 991733 994024 990856 982991 971084 955581 937268 917092 895618 873207
61887 873207 850560 828398 806753 785272 764196 744422 726463 709921 694039 678353 662709
$$ packed form
61979E41687j0861j0380r213q065p642p745p636p023o192n352m499l726l154k595
61965D47604j865j282j255j487j306p51n00o75n61J57Q15R04J002J850L065L637
61949D49352L405L283M098N762P603R083J0240J1618J3573J5586J6716J7000J7683
61936E85002J9555K1811K3239K3877K4463K4788K3915K1823J9629J8065J6859
61925H23026J5636J4392J2844J0428P304M315J657j392m957p912r331r596r319
61912H47095q141n552k054J435M771Q199J1409J3937J5985J7833J8861J8266J6391
61899I58435J4168J1539P591K291l168p865j1907j5503j8313k0176k1474k2411
61887H73207k2647k2162k1645k1481k1076j9774j7959j6542j5882j5686j5644
$$ plain form
61876 662709 647279 632677 619536 607652 596061 584304 573193 563827 556211 549449 543184 538143
61864 538143 535111 533986 534271 536111 540246 547039 556072 566790 579074 593052 608882 627070 648577
61851 648577 673989 702830 734228 768128 805093 844892 886027 926926 966937 1005761 1042498
61840 1042498 1075837 1104843 1128995 1147705 1160331 1166603 1166615 1160653 1149592 1135395 1120617 1107278
61828 1107278 1096520 1089195 1086176 1087912 1094183 1104561 1118789 1136439 1156400 1176969 1196315 1212761
61816 1212761 1224821 1231257 1231181 1224076 1209784 1188440 1160386 1126246 1087198 1045006 1001506 958060
61804 958060 915663 875428 838499 805406 775875 749440 726035 705771 688377 673150 659440
61793 659440 647082 636314 627265 619560 612497 605705 599472 594278 590207 587092 585047 584340 584720 585314
$$ packed form
61876F62709j5430j4602j3141j1884j1591j1757j1111r366p616o762o265n041
61864E38143l032j125K85J840M135O793R033J0718J2284J3978J5830J8188K1507
61851F48577K5412K8841L1398L3900L6965L9799M1135M0899M0011L8824L6737
61840A042498L3339K9006K4152J8710J2626O272J2n962j1061j4197j4778j3339
61828A107278j0758p325l019J736O271J0378J4228J7650J9961K0569J9346J6446
61816A212761J2060O436p6p105j4292k1344k8054l4140l9048m2192m3500m3446
61804I58060m2397m0235l6929l3093k9531k6435k3405k0264j7394j5227j3710
61793F59440j2358j0768r049p705p063o792o233n194m071l115k045p07L80N94
$$ plain form
61779 585314 585342 584623 583342 581769 580414 579944 580497 581341 581572 581008 580059 578897 577164 574513 571121 567565
61763 567565 564301 561355 558565 556162 554938 555508 557379 559179 559989 560101 560342 561192 562858 565544 568910
61748 568910 571733 572937 572884 572830 573203 573245 572436 571332 570623 570113 569216 567912 566656 565764 565380 565690 566559 567272
61730 567272 567231 566744 566621 567152 568064 569357 571477 574567 578137 581700 585288 589118 593122 597032 600631 603776
61714 603776 606452 609012 611993 615439 618606 620580 621068 620371 618855 616727 614211 611646 609377 607717 606914
61699 606914 606908 607148 606999 606499 606548 608013 610630 613040 614140 614300 614966 617061 620108 623019 625223 626746 627604
61682 627604 627787 627663 627749 627989 627814 626992 625871 624607 622795 620164 617089 614023 610856 607323 603665 600335
61666 600335 597360 594426 591397 588280 585002 581770 579300 578008 577151 575631 573651 572699 573630 575494 576686
$$ packed form
61779E85314K8p19j281j573j355m70N53Q44K31n64r49j162j733k651l392l556
61763E67565l264k946k790k403j224N70J871J800Q10J12K41Q50J666K686L366
61748E68910K823J204n3n4L73M2q09j104p09n10q97j304j256q92l84L10Q69P13
61730E67272m1m87j23N31R12J293K120L090L570L563L588L830M004L910L599L145
61714F03776K676K560K981L446L167J974M88o97j516k128k516k565k269j660q03
61699F06914oK40j49n00M9J465K617K410J100J60O66K095L047K911K204J523Q58
61682F27604J83j24Q6K40j75q22j121j264j812k631l075l066l167l533l658l330
61666F00335k975k934l029l117l278l232k470j292q57j520j980r52R31J864J192
$$ plain form
61651 576686 576672 576117 575774 575844 576224 576837 577715 579070 581324 584774 589166 593721 597615 600455 602398 603830
61635 603830 604828 604924 603566 600773 597141 593197 589007 584457 579604 574629 569681 564947 560644 556836 553519
61620 553519 550951 549539 549183 549073 548451 547382 546473 546060 546039 546263 546591 546512 545203 542151 537561 532049 526133
61603 526133 520078 514015 508028 502224 496803 491946 487607 483494 479427 475620 472511 470288 468659 467104
61589 467104 465243 462932 460144 456952 453612 450410 447375 444304 441184 438350 436054 434077 431996 429671
61575 429671 427210 424656 422059 419673 417661 415702 413383 410943 409079 407911 406654 404561 401751 398904
61561 398904 396564 394959 394033 393323 392172 390410 388474 386653 384743 382823 381770 382296 383803 384968 385224
61546 385224 384982 384551 383662 382163 380473 379112 378351 378484 379833 382151 384524 386209 387309 388375 389759
$$ packed form
61651E76686j4n55l43P0L80O13Q78J355K254L450M392M555L894K840J943J432
61635F03830R98R6j358k793l632l944m190m550m853m975m948m734m303l808l317
61620E53519k568j412l56j10o22j069r09m13k1K24L28p9j309l052m590n512n916
61603E26133o055o063n987n804n421m857m339m113m067l807l109k223j629j555
61589D67104j861k311k788l192l340l202l035l071l120k834k296j977k081k325
61575D29671k461k554k597k386k012j959k319k440j864j168j257k093k810k847
61561C98904k340j605r26p10j151j762j936j821j910j920j053N26J507J165K56
61546C85224k42m31q89j499j690j361p61J33J349K318K373J685J100J066J384
$$ plain form
61531 389759 391602 393995 396665 398829 399906 400206 400440 400625 400031 398269 395856 393379 390542 386620 381756
61516 381756 377245 374244 372550 371028 369058 367096 365831 365289 365031 364819 364626 364267 363490 362476 361771 361618
61500 361618 361684 361588 361382 361280 361166 360659 359623 358361 357241 356278 355229 354070 353239 353285 354274 355705 357014
61483 357014 357989 358608 358791 358561 358267 358317 358731 359253 359808 360573 361620 362869 364395 366355 368437 369774 369692
61466 369692 368346 366411 364420 362665 361524 361375 362160 363336 364365 365078 365538 365819 366071 366597 367553 368605
61450 368605 369086 368602 367438 366341 365957 366467 367554 368610 369123 369100 369110 369736 371002 372492 373985 375756 378205
61433 378205 381425 385200 389184 393012 396416 399345 401787 403492 404194 404202 404322 404950 405683 406170 406957 408880
61417 408880 411907 415183 418183 421193 424536 427820 430245 431429 431732 431872 432209 432301 431279 428846 425680
$$ packed form
61531C89759J843K393K670K164J077L00K34J85n94j762k413k477k837l922m864
61516C81756m511l001j694j522j970j962j265n42k58k12j93l59p77j014p05j53
61500C61618O6r6k06j02j14n07j036j262j120r63j049j159q31M6R89J431J309
61483C57014R75O19J83k30k94N0M14N22N55P65J047J249J526J960K082J337q2
61466C69692j346j935j991j755j141j49P85J176J029P13M60K81K52N26R56J052
61450C68605M81m84j164j097l84N10J087J056N13k3J0O26J266J490J493J771K449
61433C78205L220L775L984L828L404K929K442J705P02QJ20O28P33M87P87J923
61417D08880L027L276L000L010L343L284K425J184L03J40L37R2j022k433l166
$$ plain form
61402 425680 422576 419489 415916 411981 408425 405582 403063 400579 398344 396447 394498 392270 390139 388499
61388 388499 387241 386171 385409 384884 384012 382512 381127 380839 381573 382374 382715 382903 383226 383438 383283 383004 383108
61371 383108 383956 385671 388027 390344 391979 393133 394760 397384 400339 402499 403598 404517 406367 409477 413233
61356 413233 416702 419495 422081 425234 429147 433310 437346 441707 447270 454397 462681 471608 481167 491694
61342 491694 503296 515595 527934 539633 550034 558568 565037 569834 573622 576652 578591 579188 578869
61329 578869 578331 577631 576115 573312 569530 565365 561000 556341 551559 547062 543033 539413 536386 534414 533642
61314 533642 533580 533621 533681 534138 535309 537178 539504 541996 544500 547194 550588 555225 561446 569490 579487 591076
61298 591076 603218 614794 625378 635093 643730 650445 654417 655470 653893 650055 644426 637651 630216
$$ packed form
61402D25680l104l087l573l935l556k843k519k484k235j897j949k228k131j640
61388C88499j258j070p62n25q72j500j385k88P34Q01L41J88L23K12j55k79J04
61371C83108Q48J715K356K317J635J154J627K624K955K160J099R19J850L110L756
61356D13233L469K793K586L153L913M163M036M361N563P127Q284Q927R559J0527
61342D91694J1602J2299J2339J1699J0401Q534O469M797L788L030J939N97l19
61329E78869n38p00j516k803l782m165m365m659m782m497m029l620l027j972p72
61314E33642o2M1O0M57J171J869K326K492K504K694L394M637O221Q044R997J1589
61298E91076J2142J1576J0584R715Q637O715L972J053j577l838n629o775p435
$$ plain form
61285 630216 622177 613483 604453 595634 587327 579604 572806 567607 564433 562975 562453 562322 562640 563825 566177
61270 566177 569710 574410 580456 587936 596378 604854 612703 619971 626987 633771 640152 646372 653158 661088
61256 661088 670097 679820 690338 702339 716399 732145 748300 763598 777392 789243 798302 803635
61244 803635 805054 803078 798116 790334 780432 769744 759144 748455 737465 726849 717410 709007 701160
61231 701160 694378 689799 687548 686408 685270 684098 683294 683049 683686 685826 689633 694387 699306 704362 709880
61216 709880 715783 721733 727624 733370 738492 742495 745539 748250 750947 753473 755752 758019 760426 762757
61202 762757 764679 766034 766802 767022 767025 767682 770161 775221 782752 792172 803278 816492 832165 850045 869737
61187 869737 891385 915322 941069 967245 992493 1016048 1037335 1055620 1070423 1081904 1090617 1097271
$$ packed form
61285F30216q039q694r030q819q307p723o798n199l174j458n22j31L18J185K352
61270E66177L533M700O046P480Q442Q476P849P268P016O784O381O220O786P930
61256F61088R009R723J0518J2001J4060J5746J6155J5298J3794J1851R059N333
61244H03635J419j976m962p782r902j0688j0600j0689j0990j0616r439q403p847
61231G01160o782m579k251j140j138j172q04k45O37K140L807M754M919N056N518
61216G09880N903N950N891N746N122M003L044K711K697K526K279K267K407K331
61202G62757J922J355P68K20LO57K479N060P531R420J1106J3214J5673J7880J9692
61187H69737K1648K3937K5747K6176K5248K3555K1287J8285J4803J1481Q713O654
$$ plain form
61175 1097271 1102870 1108566 1114832 1120945 1125580 1127771 1127148 1123637 1117348 1108596 1097661 1084618 1069579
61162 1069579 1052924 1035085 1016244 996451 975875 954739 933178 911390 889813 869037 849666
61151 849666 832291 817316 804664 793862 784577 776868 770895 766687 764281 763757 765021 767742 771447
61138 771447 775235 777548 777006 773622 768592 762741 756036 748893 742849 739147 737466 736939 737857 741310 747632
61123 747632 756232 766708 779067 793027 808280 825559 846352 871179 898941 928303 958988 991339
61111 991339 1025270 1060159 1095357 1130335 1164622 1197970 1230415 1262036 1292748 1322302 1350133
61100 1350133 1375223 1396575 1413936 1427706 1438084 1444761 1447440 1445990 1439881 1428133 1410362 1387499
61088 1387499 1361004 1331666 1299591 1265094 1229129 1192856 1157199 1122766 1089861 1058455 1028449
$$ packed form
61175A097271N599N696O266O113M635K191o23l511o289q752j0935j3043j5039
61162A069579j6655j7839j8841j9793k0576k1136k1561k1788k1577k0776j9371
61151H49666j7375j4975j2652j0802r285p709n973m208k406n24J264K721L705
61138G71447L788K313n42l384n030n851o705p143o044l702j681n27R18L453O322
61123G47632Q600J0476J2359J3960J5253J7279K0793K4827K7762K9362L0685L2351
61111I91339L3931L4889L5198L4978L4287L3348L2445L1621L0712K9554K7831
61100A350133K5090K1352J7361J3770J0378O677K679j450o109j1748j7771k2863
61088A387499k6495k9338l2075l4497l5965l6273l5657l4433l2905l1406l0006
$$ plain form
61077 1028449 1000052 973757 949836 928031 907840 889078 871992 856846 843553 831902 821982
61066 821982 814076 808080 803393 799574 796863 795778 796427 798438 801376 804899 808742 813013 818379 825483
61052 825483 834136 843543 853441 864625 878135 894223 912339 931896 952750 975020 998732 1023838
61040 1023838 1050435 1078767 1108890 1140489 1173252 1207343 1243234 1281055 1320334 1360419 1400890
61029 1400890 1441603 1482727 1524819 1568565 1614384 1662604 1713838 1768554 1826241 1885709 1946274
61018 1946274 2007814 2069683 2130960 2192475 2257567 2330023 2412176 2505665 2612711 2735265 2873909
61007 2873909 3029269 3204199 3403785 3634628 3906137 4231729 4626753 5105865 5684602
60998 5684602 6383061 7226867 8247873 9488920 11004826 12847232 15040719 17574191
$$ packed form
61077A028449k8397k6295k3921k1805k0191j8762j7086j5146j3293j1651r920
61066H21982p906n996m687l819k711j085O49K011K938L523L843M271N366P104
61052H25483Q653R407R898J1184J3510J6088J8116J9557K0854K2270K3712K5106
61040A023838K6597K8332L0123L1599L2763L4091L5891L7821L9279M0085M0471
61029A400890M0713M1124M2092M3746M5819M8220N1234N4716N7687N9468O0565
61018A946274O1540O1869O1277O1515O5092P2456Q2153R3489J07046J22554J38644
61007B873909J55360J74930J99586K30843K71509L25592L95024M79112N78737
60998E684602O98459Q43806J021006J241047J515906J842406K193487K533472
$$ plain form
60990 17574191 20408739 23466832 26583429 29469213 31767097 33207387 33754069 33621631
60982 33621631 33156241 32688079 32448637 32544428 32928841 33372649 33502196 32940626 31481309
60973 31481309 29174420 26277006 23123836 20011783 17144191 14625867 12483385 10694321
60965 10694321 9214774 7996802 6995181 6169869 5487980 4923640 4455390 4064346 3734562
60956 3734562 3453252 3209787 2995414 2804260 2633224 2479980 2341828 2216866 2105001
60947 2105001 2006650 1920873 1845467 1778280 1717509 1661001 1606177 1550956 1494478 1437027 1379517
60936 1379517 1322956 1268078 1215378 1165373 1118528 1074819 1033657 994495 957386 922822 891190
60925 891190 862520 836553 812923 791315 771549 753471 736852 721529 707571 695050 683683
$$ packed form
60990A7574191K834548L058093L116597K885784K297884J440290N46682j32438
60982C3621631m65390m68162k39442R5791L84413M43808J29547n61570j459317
60973C1481309k306889k897414l153170l112053k867592k518324k142482j789064
60965A0694321j479547j217972j001621q25312o81889n64340m68250l91044l29784
60956C734562k81310k43465k14373j91154j71036j53244j38152j24962j11865
60947B105001r8351q5777p5406o7187o0771n6508n4824n5221n6478n7451n7510
60936A379517n6561n4878n2700n0005m6845m3709m1162l9162l7109l4564l1632
60925H91190k8670k5967k3630k1608j9766j8078j6619j5323j3958j2521j1367
$$ plain form
60914 683683 673000 662911 653868 646348 640328 635313 630757 626543 623204 621575 621912 623323 624359 624286
60900 624286 623612 623316 623771 624455 624538 623588 621823 619830 618112 616863 615962 614996 613357 610634 607056 603280
60884 603280 599702 596253 592908 589816 586693 582678 577407 571833 567328 564131 561250 557761 553505 548602
60870 548602 543086 537308 532058 527816 524162 520247 515685 510810 506275 502627 500135 498818 498582 499284 500680
60855 500680 502480 504612 507330 510799 514687 518352 521331 523447 524707 525502 526754 529365 533429 538267
60841 538267 543150 547576 550993 552870 553263 552875 552335 551672 550680 549412 548050 546588 545036 543810 543579 544589
60825 544589 546304 547900 549081 550249 551732 553094 553562 553067 552346 551863 551176 549688 547534 545194 542679
60810 542679 539671 536208 532555 528582 523870 518406 512594 506654 500573 494604 489213 484489 480179 476292
$$ packed form
60914F83683j0683j0089r043p520o020n015m556m214l339j629L37J411J036p3
60900F24286o74k96M55O84Q3r50j765j993j718j249r01r66j639k723l578l776
60884F03280l578l449l345l092l123m015n271n574m505l197k881l489m256m903
60870E48602n516n778n250m242l654l915m562m875m535l648k492j317k36P02J396
60855E00680J800K132K718L469L888L665K979K116J260P95J252K611M064M838
60841E38267M883M426L417J877L93l88n40o63r92j268j362j462j552j226k31J010
60825E44589J715J596J181J168J483J362M68m95p21m83o87j488k154k340k515
60810E42679l008l463l653l973m712n464n812n940o081n969n391m724m310l887
$$ plain form
60796 476292 473097 470477 467884 465038 462114 459279 456612 454468 453108 451880 449627 446266 443162 441514
60782 441514 441071 440901 440719 440796 441113 441376 441585 441962 442518 443183 444200 445906 448299 451180 454565 458582 463172
60765 463172 468276 474030 480428 487048 493500 499890 506351 512420 517501 521879 526620 532314 538371 543684
60751 543684 547713 550773 553519 556319 559066 561539 563843 566300 568891 571137 572686 573617 573910 573012 570433
60736 570433 566489 561975 557284 552339 547199 542026 536463 529779 521946 514057 507345 502066 497567 493112
60722 493112 488327 483178 478011 473532 470354 468461 467324 466566 466318 466825 467881 468859 469316 469499 470195 472029
60706 472029 474913 478173 481256 484289 487893 492447 497686 503135 508808 515187 522501 530353 538243 546152
60692 546152 554291 562457 570043 576673 582482 587769 592719 597506 602260 606788 610594 613439 615694 618048
$$ packed form
60796D76292l195k620k593k846k924k835k667k144j360j228k253l361l104j648
60782D41514m43j70j82P7L17K63K09L77N56O65J017J706K393K881L385M017M590
60765D63172N104N754O398O620O452O390O461O069N081M378M741N694O057N313
60751E43684M029L060K746K800K747K473K304K457K591K246J549R31K93q98k579
60736E70433l944m514m691m945n140n173n563o684p833p889o712n279m499m455
60722D93112m785n149n167m479l178j893j137p58k48N07J056R78M57J83O96J834
60706D72029K884L260L083L033L604M554N239N449N673O379P314P852P890P909
60692E46152Q139Q166P586O630N809N287M950M787M754M528L806K845K255K354
$$ plain form
60678 618048 621014 624804 629490 635144 641943 650117 659577 669633 679433 688795 698293 708391 718927
60665 718927 729645 740795 752741 765237 777518 789105 800169 811136 822142 832874 842776 851457
60653 851457 858941 865471 871049 875397 878451 880541 881880 882161 880931 878041 873485 867071 858677 848624
60639 848624 837426 825356 812707 800192 788475 777295 765721 753446 741308 730291 720505 711520
60627 711520 703308 696291 690566 685591 680774 676077 671877 668453 665803 663842 662504 661560 660518 658846
60613 658846 656306 653008 649214 645160 640940 636430 631403 625916 620476 615542 610888 605762 599729 593070
60599 593070 586273 579494 572726 566164 560113 554670 549683 544877 539855 534322 528622 523851 520993 519951
60585 519951 519637 518962 517545 515638 513788 512540 512138 512329 512662 513029 513803 515438 518140 521907 526685 532447
$$ packed form
60678F18048K966L790M686N654O799Q174R460J0056R800R362R498J0098J0536
60665G18927J0718J1150J1946J2496J2281J1587J1064J0967J1006J0732R902Q681
60653H51457P484O530N578M348L054K090J339K81j230k890m556o414q394j0053
60639H48624j1198j2070j2649j2515j1717j1180j1574j2275j2138j1017r786q985
60627G11520q212p017n725m975m817m697m200l424k650j961j338r44j042j672
60613F58846k540l298l794m054m220m510n027n487n440m934m654n126o033o659
60599E93070o797o779o768o562o051n443m987m806n022n533n700m771k858j042
60585E19951l14o75j417j907j850j248m02J91L33L67P74J635K702L767M778N762
$$ plain form
60569 532447 539259 547360 556981 568086 580396 593800 608670 625662 645084 666363 688089 708644
60557 708644 726817 741748 752449 757750 756988 750593 739858 726273 711270 696361 683063 672511
60545 672511 665233 661325 660751 663503 669594 678932 691198 705937 722863 741987 763341 786550 810567
60532 810567 833633 853577 868555 877776 881401 879791 873243 862645 849872 836976 825145 814730
60520 814730 806032 799490 795197 792724 791466 790825 790135 788973 787699 787312 788563 791462 795668 800959 807128
60505 807128 813880 821151 829330 838912 850135 863310 879379 899865 926284 959748 1000997 1050461
60493 1050461 1108204 1173954 1247173 1326878 1411221 1497269 1581206 1658707 1725192 1776039 1807064
60482 1807064 1815283 1799611 1761106 1702600 1628036 1541918 1449003 1353970 1260848 1172595 1091198
$$ packed form
60569E32447O812Q101R621J1105J2310J3404J4870J6992J9422K1279K1726K0555
60557G08644J8173J4931J0701N301p62o395j0735j3585j5003j4909j3298j0552
60545F72511p278l908n74K752O091R338J2266J4739J6926J9124K1354K3209K4017
60532H10567K3066J9944J4978R221L625j610o548j0598j2773j2896j1831j0415
60520H14730q698o542m293k473j258o41o90j162j274l87J251K899M206N291O169
60505H07128O752P271Q179R582J1223J3175J6069K0486K6419L3464M1249M9464
60493A050461N7743O5750P3219P9705Q4343Q6048Q3937P7501O6485N0847L1025
60482A807064Q219j5672l8505n8506p4564q6118r2915r5033r3122q8253q1397
$$ plain form
60471 1091198 1018036 953845 898291 850067 807892 771372 740537 714671 692128 671411 652089
60460 652089 634475 618811 605007 592752 581556 570985 561195 552900 546450 541255 536483 531888 527498
60447 527498 522979 518103 513462 509770 506629 503017 498958 495644 493712 492504 491401 490762 490923 491270 491171
60432 491171 490985 491251 491544 491117 490145 489251 488131 485820 482273 478644 475875 473846 472101 470581 469326 468106
60416 468106 466748 465434 464473 464058 464393 465682 467772 470048 471827 472748 472874 472637 472614 473068 473765 474433 475255
60399 475255 476565 478287 479997 481367 482196 482274 481689 481050 480841 480766 480354 480042 480882 483154 486004 488620 491035
60382 491035 493543 495975 497932 499351 500490 501653 503051 504638 505998 506795 507404 508625 510672 513032 515455
60367 515455 518447 522402 526828 530968 534789 538727 542678 545842 547623 548273 548524 548827 549058 548813 547878 546483
$$ packed form
60471A091198p3162o4191n5554m8224m2175l6520l0835k5866k2543k0717j9322
60460F52089j7614j5664j3804j2255j1196j0571r790q295o450n195m772m595m390
60447E27498m519m876m641l692l141l612m059l314j932j208j103o39J61L47r9
60432D91171j86K66K93m27r72q94j120k311l547l629k769k029j745j520j255j220
60416D68106j358j314r61m15L35J289K090K276J779R21J26k37k3M54O97O68Q22
60399D75255J310J722J710J370Q29P8n85o39k09p5m12l12Q40K272K850K616K415
60382D91035K508K432J957J419J139J163J398J587J360P97O09J221K047K360K423
60367E15455K992L955M426M140L821L938L951L164J781O50K51L03K31k45r35j395
$$ plain form
60351 546483 545168 544440 544418 544747 544880 544636 544447 544812 545544 545986 546108 546869 549113 552528 556161 559523 562654
60334 562654 565433 567550 568975 569851 570086 569684 569255 569451 570065 570444 570661 571369 572495 573074 572527 571244 569690
60317 569690 567904 566272 565877 567427 570433 573928 577552 581626 586723 593560 602738 614236 627637 643122
60303 643122 661706 684308 711270 742921 779472 819573 859655 895436 923799 942997 951973 950286
60291 950286 938128 915901 884494 846650 807092 770166 737671 709588 685990 667099 652233
60280 652233 640255 630877 624211 619213 614011 607947 602081 597347 593333 589206 584779 580201 575458 570822
60266 570822 567052 564531 562687 560706 558373 555839 553154 550507 548413 547133 546259 545355 544710 544957 546162
60251 546162 547753 549149 550035 550165 549426 548114 546798 545783 544903 543867 542634 541393 540309 539352 538321
$$ packed form
60351E46483j315p28k2L29J33k44j89L65P32M42J22P61K244L415L633L362L131
60334E62654K779K117J425Q76K35m02m29J96O14L79K17P08J126N79n47j283j554
60317E69690j786j632l95J550L006L495L624M074N097O837R178J1498J3401J5485
60303F43122J8584K2602K6962L1651L6551M0101M0082L5781K8363J9198Q976j687
60291I50286j2158k2227l1407l7844l9558l6926l2495k8083k3598j8891j4866
60280F52233j1978r378o666m998n202o064n866m734m014m127m427m578m743m636
60266E70822l770k521j844j981k333k534k685k647k094j280q74r04o45K47J205
60251E46162J591J396Q86J30p39j312j316j015q80j036j233j241j084r57j031
$$ plain form
60236 538321 537074 535840 535233 535774 537305 538999 540148 540960 542415 545230 549152 553450 557895 562791 568089
60221 568089 573020 576878 579771 582310 584878 587502 590125 592605 594666 596249 597764 599650 601954 604691
60207 604691 608287 613059 618448 623433 627643 631476 635104 638058 640002 641395 643097 645668 649112 652868
60193 652868 655901 657346 657318 656706 655970 654634 652338 649810 648204 647677 647217 645819 643356 640283 636935 633395
60177 633395 629763 626281 623168 620471 618118 616103 614543 613524 612920 612513 612294 612549 613523 615019 616424
60162 616424 617156 617104 616686 616498 616935 618088 619860 622045 624325 626413 628285 630086 631733 632783 632931 632460
60146 632460 632043 632188 633021 634516 636738 639944 644549 650876 658716 667265 675782 684305 693548 704080 715686
60131 715686 727373 737805 745911 751375 754567 755836 755017 751830 746578 740087 733020 725677 718503 712377
$$ packed form
60236E38321j247j234o07N41J531J694J149Q12J455K815L922M298M445M896N298
60221E68089M931L858K893K539K568K624K623K480K061J583J515J886K304K737
60207F04691L596M772N389M985M210L833L628K954J944J393J702K571L444L756
60193F52868L033J445k8o12p36j336k296k528j606n27m60j398k463l073l348l540
60177F33395l632l482l113k697k353k015j560j019o04m07k19K55R74J496J405
60162F16424P32n2m18j88M37J153J772K185K280K088J872J801J647J050J48m71
60146F32460m17J45Q33J495K222L206M605O327P840Q549Q517Q523R243J0532J1606
60131G15686J1687J0432Q106N464L192J269q19l187n252o491p067p343p174o126
$$ plain form
60117 712377 708079 705630 704337 703490 702912 702866 703545 704757 706186 707797 709722 711799 713544 714691 715393 715725
60101 715725 715438 714486 713369 712452 711234 708939 705691 702489 700007 698000 696092 694650 694564 696429 700148
60086 700148 705169 710869 716826 722907 729229 736088 743790 752188 760272 766634 770679 773063 774505 774485 771746
60071 771746 765886 757833 748764 739207 729322 719383 709618 699964 690345 681000 672349 664703 658163 652573
60057 652573 647543 642752 638280 634402 631070 627889 624501 620696 616286 611386 606773 603424 601583 600717
60043 600717 600395 600643 601377 602214 603187 605026 608264 612456 616758 620889 625076 629318 633213 636402 638708
60028 638708 639926 639828 638440 636117 633284 630121 626386 621567 615431 608493 601664 595363 589252 582935 576448
60013 576448 569893 563138 556312 550138 545194 541103 537089 533230 530443 529127 528466 527473 526210 525475 525540
$$ packed form
60117G12377m298k449j293q47n78m6O79J212J429J611J925K077J745J147P02L32
60101G15725k87r52j117r17j218k295l248l202k482k007j908j442q6J865L719
60086G00148N021N700N957O081O322O859P702Q398Q084O362M045K384J442k0k739
60071G71746n860q053r069r557r885r939r765r654r619r345q651p646o540n590
60057F52573n030m791m472l878l332l181l388l805m410m900m613l349j841q66
60043F00717l22K48P34Q37R73J839L238M192M302M131M187M242L895L189K306
60028F38708J218r8j388k323k833l163l735m819o136o938o829o301o111o317o487
60013E76448o555o755o826o174m944m091m014l859k787j316o61r93j263p35O5
$$ plain form
59998 525540 525839 525945 526207 527047 528075 528492 528259 528277 529316 531269 533587 535940 538206 540437 543249 547603
59982 547603 553487 559341 563566 566314 568877 571608 573570 574237 574304 574390 574008 572482 570111 567684 565453 563279
59966 563279 561391 560321 560327 561361 563276 565569 567317 567985 568122 568782 570426 572772 575310 577452 578545 578388
59950 578388 577601 576866 575988 574322 571953 569703 567936 566122 563804 561370 559496 558238 557023 555239 552566
59935 552566 549025 545095 541719 539811 539547 540114 540226 539058 536893 534853 533963 534463 536020 538332 541295
59920 541295 544735 548286 551613 554542 556999 558942 560391 561411 562155 562984 564428 566699 569275 571247 572212
59905 572212 572712 573660 575449 577757 580102 582379 584692 586863 588418 589152 589410 589646 589948 590294 591055 592819
59889 592819 595787 599734 604509 610176 616590 623286 629954 636644 643425 650174 656857 663639 670631 677819
$$ packed form
59998E25540K99J06K62Q40J028M17k33J8J039J953K318K353K266K231K812M354
59982E47603N884N854M225K748K563K731J962O67O7Q6l82j526k371k427k231k174
59966E63279j888j070OJ034J915K293J748O68J37O60J644K346K538K142J093j57
59950E78388p87p35q78j666k369k250j767j814k318k434j874j258j215j784k673
59935E52566l541l930l376j908k64N67J12j168k165k040q90N00J557K312K963
59920E41295L440L551L327K929K457J943J449J020P44Q29J444K271K576J972R65
59905E72212N00R48J789K308K345K277K313K171J555P34K58K36L02L46P61J764
59889E92819K968L947M775N667O414O696O668O690O781O749O683O782O992P188
$$ plain form
59875 677819 685352 693410 701595 708877 714398 717960 719588 719107 716447 711956 706046 698961 691150 683408
59861 683408 676226 669423 662798 656721 651612 647241 643123 639237 635842 632911 630345 628527 628019 628828 630569
59846 630569 633275 637541 643917 652561 663379 675939 689294 702330 714273 724509 732121 736222 736896
59833 736896 735438 733665 733139 734785 738632 743747 748612 751625 751310 746626 737678 725818 712552 698470
59819 698470 683638 668590 654254 641094 629026 618041 608217 599233 590698 582984 577012 573034 570238
59806 570238 567669 564960 562122 559247 556591 554377 552455 550674 549482 549304 549307 547835 544468 540732 538205
59791 538205 536732 535220 533441 532064 531221 530030 527667 524332 521041 518755 517732 517466 517266 517006 517168
59776 517168 518042 519178 519848 519800 519268 518466 517427 516230 515114 514390 514310 514827 515414 515412 514781 514266 514606 515790
$$ packed form
59875F77819P533Q058Q185P282N521L562J628m81k660m491n910p085p811p742
59861F83408p182o803o625o077n109m371m118l886l395k931k566j818n08Q09J741
59846F30569K706M266O376Q644J0818J2560J3355J3036J1943J0236P612M101O74
59833G36896j458j773n26J646L847N115M865L013l15m684q948j1860j3266j4082
59819F98470j4832j5048j4336j3160j2068j0985r824q984q535p714n972l978k796
59806E70238k569k709k838k875k656k214j922j781j192j78Lj472l367l736k527
59791E38205j473j512j779j377q43j191k363l335l291k286j023k66k00k60J62
59776E17168Q74J136O70m8n32q02j039j197j116p24q0N17N87ko31n15L40J184
$$ plain form
59758 515790 517305 518900 520823 523498 527182 531772 536749 541459 545658 549593 553408 556809 559654 562582
59744 562582 566473 571274 575832 579077 581098 582833 584918 587145 589042 590560 591853 592570 591996 590140 588124
59729 588124 586984 586377 585190 583218 581445 580549 579995 578988 577574 576220 574909 573421 572194 572034 572973
59714 572973 574084 574565 574529 574591 575104 575988 576950 577636 577864 577983 578786 580709 583148 584921 585554 585886 587196 589852
59696 589852 593049 595775 597725 599239 600783 602738 605284 608101 610346 611375 611343 610728 609550 607615 605418
59681 605418 604032 603921 604438 604755 604736 604633 604457 604088 603612 603098 602252 600677 598333 595477 592362 589179 586008
59664 586008 582634 578704 574338 570232 566878 564062 561473 559431 558544 558923 560208 562111 564472 567056 569883
59649 569883 573519 578357 583664 587991 590618 591961 592488 591925 589831 586387 582154 577439 572378 567493 563675
$$ packed form
59758E15790J515J595J923K675L684M590M977M710M199L935L815L401K845K928
59744E62582L891M801M558L245K021J735K085K227J897J518J293P17n74j856k016
59729E88124j140o07j187j972j773q96n54j007j414j354j311j488j227j60R39
59714E72973J111M81l6O2N13Q84R62O86K28J19Q03J923K439J773O33L32J310K656
59696E89852L197K726J950J514J544J955K546K817K245J029l2o15j178j935k197
59681F05418j386j11N17L17j9j03j76l69m76n14q46j575k344k856l115l183l171
59664E86008l374l930m366m106l354k816k589k042q87L79J285J903K361K584K827
59649E69883L636M838N307M327K627J343N27n63k094l444m233m715n061m885l818
$$ plain form
59634 563675 561508 560741 560406 559444 557500 555381 554609 556185 559648 563454 566254 567721 568304 568594 569068 570162
59618 570162 572076 574441 576437 577401 577183 575873 573501 570266 566871 564207 562703 562252 562741 564251 566663
59603 566663 569506 572403 575387 578459 581120 582668 582898 582238 581175 579766 577779 575222 572669 570903 570199
59588 570199 570041 569732 569143 568558 567957 566960 565521 564087 562822 561211 558773 555765 552713 549617 546152 542395
59572 542395 538809 535596 532599 529824 527596 526138 525351 525047 525102 525400 525929 526878 528320 529867 531072 532100
59556 532100 533519 535340 536824 537485 537821 538693 540315 542253 544186 546164 548218 550213 552243 554834 558439
59541 558439 562949 568011 573851 581440 591699 604770 620304 638155 658153 678945 697494 710325
59529 710325 715425 713013 704915 693744 682544 674294 670858 672192 676815 683209 690725 699253 708407 717450
$$ packed form
59634E63675k167p67l35r62j944k119p72J576L463L806K800J467N83K90M74J094
59618E70162J914K365J996R64k18j310k372l235l395k664j504m51M89J510K412
59603E66663K843K897K984L072K661J548K30o60j063j409j987k557k553j766p04
59588E70199j58l09n89n85o01r97j439j434j265j611k438l008l052l096l465l757
59572E42395l586l213k997k775k228j458p87l04N5K98N29R49J442J547J205J028
59556E32100J419J821J484O61L36Q72J622J938J933J978K054J995K030K591L605
59541E58439M510N062N840P589J0259J3071J5534J7851J9998K0792J8549J2831
59529G10325N100k412q098j1171j1200q250l436J334M623O394P516Q528R154R043
$$ plain form
59515 717450 725854 733415 739617 743364 743820 741278 736647 730247 721733 711251 699881 688624 677566
59502 677566 666497 655741 645759 636399 627293 618759 611500 605475 599892 594452 589874 586892 585297 584314
59488 584314 583419 582397 581059 579466 578245 578158 579401 581623 584514 588040 592229 597262 603774 612530 623426
59473 623426 635094 645854 654955 662680 669414 675026 679137 681582 682425 681850 680303 678577 677449 677296
59459 677296 678259 680632 684780 690750 698370 707814 719767 734755 752467 771911 792211 813154 834993
59446 834993 857722 880563 902243 921691 938095 950065 955270 951699 939379 920428 897450 872394
59434 872394 846836 822343 799940 779704 761347 744880 730368 717547 706235 696826 689901 685651
59422 685651 684133 685741 690876 699380 710821 725115 742321 762096 784003 808123 834631 862952
$$ packed form
59515G17450Q404P561O202L747M56k542m631o400q514j0482j1370j1257j1058
59502F77566j1069j0756r982r360r106q534p259o025n583n440m578k982j595r83
59488E84314q95j022j338j593j221q7J243K222K891L526M189N033O512Q756J0896
59473F23426J1668J0760R101P725O734N612M111K445Q43n75j547j726j128j53
59459F77296R63K373M148N970P620R444J1953J4988J7712J9444K0300K0943K1839
59446H34993K2729K2841K1680J9448J6404J1970N205l571j2320j8951k2978k5056
59434H72394k5558k4493k2403k0236j8357j6467j4512j2821j1312r409o925m250
59422F85651j518J608N135Q504J1441J4294J7206J9775K1907K4120K6508K8321
$$ plain form
59410 862952 892171 922161 953020 982795 1006571 1018785 1016608 1001265 976934 948912 922061 899673
59398 899673 883207 873017 869026 870189 873430 873892 866972 850510 825369 794324 760575 726975 695878
59385 695878 668968 646922 629427 615740 605220 597289 591207 586233 581956 578226 574860 571722 569055
59372 569055 567383 566979 567665 569112 570989 572768 573833 574111 574397 575694 578201 581148 583665 585728 588202
59357 588202 592019 597396 603923 611310 619803 629758 641068 653305 666304 680365 695907 713169 732203
59344 732203 752884 774939 798157 822530 847924 873656 898684 922143 943352 961369 975147
59333 975147 984352 989539 991144 988692 981501 969950 955389 938822 920262 899641 877791 856007
59321 856007 834921 814478 794971 777414 762546 749937 738582 728063 718603 710225 702614 695816
$$ packed form
59410H62952K9219K9990L0859K9775K3776J2214k177j5343k4331k8022k6851k2388
59398H99673j6466j0190l991J163L241M62o920j6462k5141l1045l3749l3600l1097
59385F95878k6910k2046j7495j3687j0520p931o082m974m277l730l366l138k667
59372E69055j672m04O86J447J877J779J065K78K86J297K507K947K517K063K474
59357E88202L817N377O527P387Q493R955J1310J2237J2999J4061J5542J7262J9034
59344G32203K0681K2055K3218K4373K5394K5732K5028K3459K1209J8017J3778
59333I75147R205N187J605k452p191j1551j4561j6567j8560k0621k1850k1784
59321H56007k1086k0443j9507j7557j4868j2609j1355j0519r460q378p611o798
$$ plain form
59309 695816 690368 686446 683474 680939 679108 678486 678916 679715 680516 681593 683516 686811 691835 698700 707420
59294 707420 718286 731825 748242 767252 788629 812196 836543 858109 872375 876283 869571 854433
59282 854433 834505 813663 794666 778522 765415 755948 750891 750048 752259 756614 762994 771454 781919
59269 781919 794608 809968 827820 847075 866559 885590 903605 919816 933497 944088 950847 953006
59257 953006 950551 944295 934853 922081 905883 887121 867320 847822 829521 812930 798082 784617
59245 784617 772294 761228 751542 743193 736266 731025 727485 725413 724883 726244 729309 733243 737636 743010
59231 743010 749779 757308 764621 771464 777933 783469 787036 788049 786440 782035 774662 764781 753309 740756
59217 740756 727188 713048 699347 686779 675179 664086 653442 643458 634186 625602 617951 611667
$$ packed form
59309F95816n448l922k972k535j831o22M30P99Q01J077J923L295N024O865Q720
59294G07420J0866J3539J6417J9010K1377K3567K4347K1566J4266L908o712j5138
59282H54433j9928k0842j8997j6144j3107r467n057q43K211M355O380Q460J0465
59269G81919J2689J5360J7852J9255J9484J9031J8015J6211J3681J0591O759K159
59257I53006k455o256r442j2772j6198j8762j9801j9498j8301j6591j4848j3465
59245G84617j2323j1066r686q349o927n241l540k072n30J361L065L934M393N374
59231G43010O769P529P313O843O469N536L567J013j609m405p373r881j1472j2553
59217G40756j3568j4140j3701j2568j1600j1093j0644r984r272q584p651o284
$$ plain form
59205 611667 606880 603191 600038 597230 594950 593220 591620 589784 587989 586811 586309 586030 585879 586365 587742
59190 587742 589487 591032 592568 594711 597743 601619 606340 611784 617436 622804 627952 633170 638433 643660
59176 643660 649246 655740 663169 671276 680205 690232 700925 711363 721328 731558 742662 754402 766322
59163 766322 778393 790657 802754 814346 825617 836789 847351 856275 862958 867550 870368 871314 869916
59150 869916 865662 858300 848104 835981 823047 809869 796253 782007 767772 754829 743992 734952
59138 734952 726800 718962 711423 704355 697942 692507 688337 685258 682704 680410 678847 678788 680593 684002 688444
59123 688444 693436 698861 705074 712654 721974 733012 745454 758832 772629 786595 801024 816393
59111 816393 832704 849380 865818 881644 896445 909669 920974 930277 937419 942320 945633 948590
$$ packed form
59205F11667m787l689l153k808k280j730j600j836j795j178n02k79j51M86J377
59190E87742J745J545J536K143L032L876M721N444N652N368N148N218N263N227
59176F43660N586O494P429Q107Q929J0027J0693J0438R965J0230J1104J1740J1920
59163G66322J2071J2264J2097J1592J1271J1172J0562Q924O683M592K818R46j398
59150H69916m254p362j0196j2123j2934j3178j3616j4246j4235j2943j0837r040
59138G34952q152p838p539p068o413n435m170l079k554k294j563n9J805L409M442
59123F88444M992N425O213P580R320J1038J2442J3378J3797J3966J4429J5369
59111H16393J6311J6676J6438J5826J4801J3224J1305R303P142M901L313K957
$$ plain form
59099 948590 951738 954234 954827 953168 949779 945129 939332 932501 924943 917154 909939 904220 900201 896947
59085 896947 893327 889198 885127 881061 875811 867951 856926 843348 828549 813772 799449 785293 771227
59072 771227 757927 746118 735673 725865 716335 707304 699042 691718 685678 681250 678119 675303 671925
59059 671925 667874 663819 660776 659405 659347 659437 658853 657791 656722 655465 653623 651517 649851 648633 647304
59044 647304 645840 644814 644287 643553 642245 640911 640181 640070 640494 641760 644041 646827 649440 651814 654460
59029 654460 657961 662759 669012 676355 684157 692286 701289 711549 722707 734253 746288 759246 773113
59016 773113 787368 801489 815137 827861 838885 847134 851512 851549 848028 842687 837051 831771 827191
59003 827191 823996 822817 823560 825740 829338 834838 842408 851469 861104 870624 879721 888398 896717 904445
$$ packed form
59099I48590L148K496N93j659l389m650n797o831p558p789p215n719m019l254
59085H96947l620m129m071m066n250p860j1025j3578j4799j4777j4323j4156j4066
59072G71227j3300j1809j0445r808r530r031q262p324o040m428l131k816l378
59059F71925m051m055l043j371n8R0n84j062j069j257j842k106j666j218j329
59044F47304j464j026n27p34j308j334p30j11M24J266K281K786K613K374K646
59029F54460L501M798O253P343P802Q129R003J0260J1158J1546J2035J2958J3867
59016G73113J4255J4121J3648J2724J1024Q249M378L7l521n341n636n280m580
59003H27191l195j179P43K180L598N500P570R061R635R520R097Q677Q319P728
$$ plain form
58989 904445 910998 915963 919537 922064 923233 922180 918465 912491 904790 895330 883957 871328 858919
58976 858919 848025 839019 831680 825966 822251 820939 822136 825725 831617 839859 850480 863186 877132
58963 877132 891257 905142 919466 935193 952209 969117 984400 997362 1007655 1014484 1016878 1014553
58951 1014553 1007954 997526 983508 966436 947297 926980 905976 884775 864167 844905 827323
58940 827323 811615 798272 787921 780698 775960 772661 769861 766877 763126 758230 752444 746698 741757
58927 741757 737306 732344 726594 721042 716793 713873 711527 709219 706789 703991 700676 697291 694556 692680
58913 692680 691438 690963 691758 693872 696754 700145 704516 710351 717467 725366 733951 743680 755260 769302
58899 769302 785903 804427 823899 843644 863280 882274 900123 917031 933879 951487 970514
$$ packed form
58989I04445O553M965L574K527J169j053l715n974p701r460j1373j2629j2409
58976H58919j0894r006p339n714l715j312J197L589N892Q242J0621J2706J3946
58963H77132J4125J3885J4324J5727J7016J6908J5283J2962J0293O829K394k325
58951A014553o599j0428j4018j7072j9139k0317k1004k1201k0608j9262j7582
58940H27323j5708j3343j0351p223m738l299k800k984l751m896n786n746m941
58927G41757m451m962n750n552m249k920k346k308k430k798l315l385k735j876
58913F92680j242m75P95K114K882L391M371N835P116P899Q585R729J1580J4042
58899G69302J6601J8524J9472J9745J9636J8994J7849J6908J6848J7608J9027
$$ plain form
58888 970514 992088 1017593 1047319 1079931 1113795 1148341 1183597 1218850 1252382 1282322 1307246
58877 1307246 1326211 1338754 1344875 1344687 1338132 1325181 1306040 1280994 1250494 1215839 1179424 1143706
58865 1143706 1110034 1078821 1050476 1025444 1003409 983287 964309 946636 930606 915758 900983
58854 900983 885444 869028 852028 834817 817943 802156 787988 775394 764070 754060 745655 738709
58842 738709 732517 726682 721537 717259 712938 707340 700414 693290 686750 680504 674153 668031 662584 657558
58828 657558 652427 647209 642341 638020 634175 630830 628050 625727 623895 623101 623987 626529 630058 633986 638198
58813 638198 642824 647930 653408 658878 663770 667736 670941 673718 676072 677769 678731 678976 678289 676405 673623
58798 673623 670875 668931 667647 666123 663564 659941 655917 652156 648780 645513 642327 639766 638590 639208
$$ packed form
58888I70514K1574K5505K9726L2612L3864L4546L5256L5253L3532K9940K4924
58877A307246J8965J2543O121j88o555j2951j9141k5046l0500l4655l6415l5718
58865A143706l3672l1213k8345k5032k2035k0122j8978j7673j6030j4848j4775
58854I00983j5539j6416j7000j7211j6874j5787j4168j2594j1324j0010q405o946
58842G38709o192n835n145m278m321n598o926p124o540o246o351o122n447n026
58828F57558n131n218m868m321l845l345k780k323j832p94Q86K542L529L928M212
58813F38198M626N106N478N470M892L966L205K777K354J697R62K45o87j884k782
58798F73623k748j944j284j524k559l623m024l761l376l267l186k561j176O18
$$ plain form
58784 639208 641548 645293 650153 655960 662595 669776 677011 683878 690291 696257 701470 705461 708143 709746
58770 709746 710158 708828 705603 701233 696660 692121 687393 682648 678501 675227 672475 669944 667991 667262 667885
58755 667885 669313 671013 673077 675968 679747 683868 687841 691808 696258 701413 707192 713585 720626 728069
58741 728069 735555 743109 751098 759684 768644 777711 786693 795303 803365 811231 819478 828088 836460 844385
58727 844385 852453 861265 870744 880437 889928 898626 905763 911187 915806 920783 926508 932717 939287 946417
58713 946417 954239 962693 971680 980987 990161 998677 1006121 1012017 1015661 1016370 1013754 1007617 997877 984738
58699 984738 968685 950068 928988 905768 881188 856032 830670 805380 780788 757743 736961
58688 736961 718922 703738 690862 679350 668756 659513 652146 646385 641293 635963 629907 623150 616274
$$ packed form
58784F39208K340L745M860N807O635P181P235O867O413N966N213L991K682J603
58770G09746M12j330l225m370m573m539m728m745m147l274k752k531j953p29O23
58755F67885J428J700K064K891L779M121L973L967M450N155N779O393P041P443
58741G28069P486P554P989Q586Q960R067Q982Q610Q062P866Q247Q610Q372P925
58727H44385Q068Q812R479R693R491Q698P137N424M619M977N725O209O570P130
58713I46417P822Q454Q987R307R174Q516P444N896L644P09k616o137r740j3139
58699I84738j6053j8617k1080k3220k4580k5156k5362k5290k4592k3045k0782
58688G36961j8039j5184j2876j1512j0594r243p367n761n092n330o056o757o876
$$ plain form
58675 616274 610081 604987 600955 598058 596566 596368 596974 598413 601498 606806 614030 622806 633414 645960
58661 645960 659479 672675 685074 696589 706359 713092 716543 717777 717891 717137 715324 712397 708481 703937
58647 703937 699485 695746 692505 688863 684282 679203 674543 670843 668008 665633 663506 661874 661171 661471 662441
58632 662441 663890 665994 668808 671949 675065 678167 681066 682903 682853 681094 678640 676315 674336 672752 671842
58617 671842 672120 674225 678730 685834 695332 706974 720620 735907 752064 768138 783054 795466 804266
58604 804266 809473 811984 812235 809885 805149 799399 793741 787781 780654 772560 764373 756350 748256 740430
58590 740430 733768 728866 725959 725325 726980 730345 735099 741955 751697 763784 776801 789921 803007
58577 803007 815641 827232 837871 847989 857350 865413 872487 879395 886128 892133 897935 905230 915143
$$ packed form
58675F16274o193n094m032k897j492j98O06J439L085N308P224Q776J0608J2546
58661F45960J3519J3196J2399J1515R770O733L451J234J14p54j813k927l916m544
58647G03937m452l739l241l642m581n079m660l700k835k375k127j632p03L00R70
58632F62441J449K104K814L141L116L102K899J837n0j759k454k325j979j584r10
58617F71842K78K105M505P104R498J1642J3646J5287J6157J6074J4916J2412Q800
58604H04266N207K511K51k350m736n750n658n960p127q094q187q023q094p826
58590G40430o662m902k907o34J655L365M754O856R742J2087J3017J3120J3086
58577H03007J2634J1591J0639J0118R361Q063P074O908O733O005N802P295R913
$$ plain form
58564 915143 927536 942173 959300 978740 999610 1021406 1044318 1067948 1090715 1111154 1128934
58553 1128934 1143891 1154909 1160667 1161037 1157060 1149853 1140160 1128678 1116103 1102817 1088905 1074604
58541 1074604 1060542 1047345 1034914 1022162 1007845 991826 975122 958502 941617 924013 906311
58530 906311 889660 874546 861096 850059 842288 837381 834020 831713 831135 832677 835717 839564 844090
58517 844090 849114 854051 858559 862818 866877 870409 873340 876016 878533 880624 882407 884529 887319 890461
58503 890461 893651 896885 899957 902419 904278 906018 907650 908422 907656 905270 901288 895551 888175 879792 871203
58488 871203 863229 856719 851973 848239 844642 841575 840333 841450 844378 848788 854956 862675 870965 879322
58474 879322 888242 898107 908381 918240 927091 934109 938212 938957 936734 931843 924331 915077 905979 898424
$$ packed form
58564I15143J2393J4637J7127J9440K0870K1796K2912K3630K2767K0439J7780
58553A128934J4957J1018N758L70l977p207r693j1482j2575j3286j3912j4301
58541A074604j4062j3197j2431j2752j4317j6019j6704j6620j6885j7604j7702
58530I06311j6651j5114j3450j1037p771m907l361k307n78J542L040L847M526
58517H44090N024M937M508M259M059L532K931K676K517K091J783K122K790L142
58503H90461L190L234L072K462J859J740J632P72p66k386l982n737p376q383q589
58488H71203p974o510m746l734l597l067j242J117K928M410O168P719Q290Q357
58474H79322Q920R865J0274R859Q851P018M103P45k223m891p512r254r098p555
$$ plain form
58460 898424 892279 886821 881904 877808 874815 873453 874445 877819 882615 887820 893132 898647 904444 910529
58446 910529 916442 920831 922312 920987 918265 915157 911674 907923 904544 901792 899329 897304 896507 897209 899012
58431 899012 902080 907128 913700 919929 924776 929346 935249 942836 951761 962070 973772 986318 999354
58418 999354 1013028 1026803 1038958 1048161 1054681 1059331 1062152 1062913 1061965 1059746 1056253 1051718 1046879 1041858
58404 1041858 1035764 1028198 1020202 1012952 1006488 1000561 995643 992080 989219 986405 984092 982986 982946 983603 985186
58389 985186 987648 989814 990514 989990 989240 988611 987945 987469 987561 988052 988549 988991 989400 989796 990932 994185 999951
58372 999951 1006898 1013520 1019699 1026160 1033278 1041168 1050115 1060195 1071175 1083259 1096995 1111986 1126803
58359 1126803 1140742 1154571 1169007 1183692 1198159 1212421 1225958 1237608 1247134 1255369 1262169 1266100
$$ packed form
58460H98424o145n458m917m096k993j362R92L374M796N205N312N515N797O085
58446I10529N913M389J481j325k722l108l483l751l379k752k463k025p97P02J803
58431H99012L068N048O572O229M847M570N903P587Q925J0309J1702J2546J3036
58418I99354J3674J3775J2155R203O520M650K821P61r48k219l493m535m839n021
58404A041858o094p566p996p250o464n927m918l563k861k814k313j106m0O57J583
58389I85186K462K166P00n24p50o29o66m76R2M91M97M42M09L96J136L253N766
58372I99951O947O622O179O461P118P890Q947J0080J0980J2084J3736J4991J4817
58359A126803J3939J3829J4436J4685J4467J4262J3537J1650R526Q235O800L931
$$ plain form
58347 1266100 1267132 1267710 1269935 1273522 1277818 1283794 1292306 1302216 1312205 1322887 1335294 1348763 1362371
58334 1362371 1376976 1393683 1411487 1428671 1445483 1463348 1482329 1501441 1520530 1539781 1558197
58323 1558197 1574585 1589294 1603072 1615140 1624416 1631857 1639436 1647480 1655060 1662342 1670494 1679755 1689554
58310 1689554 1700111 1712187 1725799 1740778 1757781 1777023 1796958 1816068 1835079 1855524 1877148
58299 1877148 1898769 1920650 1943712 1967251 1989805 2011649 2034183 2057483 2080642 2103900 2128282
58288 2128282 2153745 2179746 2206954 2236244 2266806 2297439 2328922 2362879 2399133 2436432 2474868
58277 2474868 2515182 2556612 2598034 2640365 2685277 2732310 2779910 2828478 2879723 2933832 2989989
58266 2989989 3048846 3111524 3177012 3243576 3312094 3384930 3462110 3541686 3623306 3708237 3796208
$$ packed form
58347A266100J032N78K225L587M296N976Q512R910R989J0682J2407J3469J3608
58334A362371J4605J6707J7804J7184J6812J7865J8981J9112J9089J9251J8416
58323A558197J6388J4709J3778J2068R276P441P579Q044P580P282Q152R261R799
58310A689554J0557J2076J3612J4979J7003J9242J9935J9110J9011K0445K1624
58299A877148K1621K1881K3062K3539K2554K1844K2534K3300K3159K3258K4382
58288B128282K5463K6001K7208K9290L0562L0633L1483L3957L6254L7299L8436
58277B474868M0314M1430M1422M2331M4912M7033M7600M8568N1245N4109N6157
58266B989989N8857O2678O5488O6564O8518P2836P7180P9576Q1620Q4931Q7971
$$ plain form
58255 3796208 3885331 3974921 4065612 4157099 4248630 4341180 4436401 4534138 4633822 4737353 4847579
58244 4847579 4964870 5088272 5218794 5358218 5505894 5660377 5823043 5996451 6180417
58235 6180417 6373582 6577488 6795086 7026572 7270951 7530202 7807470 8102690 8414705
58226 8414705 8746135 9101331 9481368 9886343 10320716 10790707 11298296 11843840 12432740
58217 12432740 13073124 13769033 14523020 15343889 16244855 17236088 18326874 19533499 20877409
58208 20877409 22378179 24057509 25948922 28096083 30546074 33356275 36607453 40402427
58200 40402427 44857863 50109953 56324291 63689176 72409038 82725802 94950067 109469393
58192 109469393 126745190 147302323 171640228 200023179 232269123 267672816 304950125
$$ packed form
58255C796208Q9123Q9590R0691R1487R1531R2550R5221R7737R9684J03531J10226
58244D847579J17291J23402J30522J39424J47676J54483J62666J73408J83966
58235F180417J93165K03906K17598K31486K44379K59251K77268K95220L12015
58226H414705L31430L55196L80037M04975M34373M69991N07589N45544N88900
58217A2432740O40384O95909P53987Q20869R00966R91233J090786J206625J343910
58208B0877409J500770J679330J891413K147161K449991K810201L251178L794974
58200D0402427M455436N252090O214338P364885Q719862J0316764J2224265J4519326
58192A09469393J7275797K0557133K4337905K8382951L2245944L5403693L7277309
$$ plain form
58185 304950125 341975348 375459436 401168162 415046337 414755724 400619396 375405589
58178 375405589 343246104 308388604 274289465 243220182 216332726 193946559 175760545
58171 175760545 160914948 148126673 136082037 123918094 111442782 98978547 87035908
58164 87035908 76060532 66321492 57896782 50718777 44647790 39527273 35202333 31527729
58156 31527729 28382970 25678037 23341373 21310491 19536024 17982890 16620295 15416077
58148 15416077 14342766 13380915 12512940 11720377 10989770 10314670 9689381 9106790 8563992
58139 8563992 8063375 7605545 7186502 6803139 6455459 6141514 5855880 5595033 5358709
58130 5358709 5143940 4942951 4749151 4560629 4376368 4194297 4015245 3843969 3683624
$$ packed form
58185C04950125L7025223L3484088K5708726J3878175k90613j4136328k5213807
58178C75405589l2159485l4857500l4099139l1069283k6887456k2386167j8186014
58171A75760545j4845597j2788275j2044636j2163943j2475312j2464235j1942639
58164H7035908j0975376r739040q424710p178005o070987n120517m324940l674604
58156C1527729l144759k704933k336664k030882j774467j553134j362595j204218
58148A5416077j073311r61851q67975p92563p30607o75100o25289n82591n42798
58139H563992n00617m57830m19043l83363l47680l13945k85634k60847k36324
58130E358709k14769k00989j93800j88522j84261j82071j79052j71276j60345
$$ plain form
58121 3683624 3532915 3390396 3257404 3134690 3020114 2911876 2810693 2716852 2628308 2543521
58111 2543521 2463279 2388213 2317348 2250324 2188080 2130100 2073905 2018461 1965252 1914929 1865882
58100 1865882 1817164 1769904 1724723 1680659 1637783 1597943 1561714 1527334 1493789 1462144 1432761
58089 1432761 1404135 1375790 1349494 1326195 1304399 1282945 1262695 1243941 1224763 1203705 1181835
58078 1181835 1160444 1138800 1115861 1092385 1069698 1047951 1026851 1006615 987121 967776 949121
58067 949121 932835 919184 906280 892716 879081 866055 853144 840442 829491 820985 813340 804937
58055 804937 796117 787651 778807 768375 756401 743761 731116 719138 708468 698722 688870 679246 671621
58042 671621 666608 662644 658287 653789 649549 644900 639492 634184 629406 624195 618034 612039 607085 602155
$$ packed form
58121C683624j50709j42519j32992j22714j14576j08238j01183r3841q8544q4787
58111B543521q0242p5066p0865o7024o2244n7980n6195n5444n3209n0323m9047
58100A865882m8718m7260m5181m4064m2876l9840l6229l4380l3545l1645k9383
58089A432761k8626k8345k6296k3299k1796k1454k0250j8754j9178k1058k1870
58078A181835k1391k1644k2939k3476k2687k1747k1100k0236j9494j9345j8655
58067I49121j6286j3651j2904j3564j3635j3026j2911j2702j0951q506p645q403
58055H04937q820q466q844j0432j1974j2640j2645j1978j0670r746r852r624p625
58042F71621n013l964m357m498m240m649n408n308m778n211o161n995m954m930
$$ plain form
58028 602155 595790 587920 579260 570155 561054 552734 545042 536794 527889 520064 514430 509804 504691 499460
58014 499460 495168 491584 487889 484236 481195 478585 476132 474369 473618 472942 471274 468801 466346 464326 463238
57999 463238 463948 466289 468496 469352 469927 471942 475395 479154 482939 487156 491443 495025 498230 502288 507696
57984 507696 513703 519205 523387 525874 527076 528035 529269 530075 529485 527387 524306 520703 516970 513350 509471
57969 509471 504791 499834 495855 492818 489104 483924 478602 474445 470759 466360 461827 458654 456940 455442
57955 455442 453373 450826 447895 444587 441218 437930 434382 430790 428446 428079 428568 428538 428363 429099 430225 430341
57939 430341 429767 430586 434051 439566 446375 454676 464501 474819 484492 493407 502176 511214 520352 528832
57925 528832 535556 539843 541996 542765 542396 540746 538026 534660 530457 524697 517085 508038 497979 486934
$$ packed form
58028F02155o365p870q660r105r101q320p692q248q905p825n634m626n113n231
58014D99460m292l584l695l653l041k610k453j763p51o76j668k473k455k020j088
57999D63238P10K341K207Q56N75K015L453L759L785M217M287L582L205M058N408
57984E07696O007N502M182K487J202R59J234Q06n90k098l081l603l733l620l879
57969E09471m680m957l979l037l714n180n322m157l686m399m533l173j714j498
57955D55442k069k547k931l308l369l288l548l592k344l67M89l0j75P36J126J16
57939D30341n74Q19L465N515O809Q301R825J0318R673Q915Q769R038R138Q480
57925E28832O724M287K153P69l69j650k720l366m203n760p612r047j0059j1045
$$ plain form
57911 486934 474988 462677 450784 439988 430668 422674 415395 408339 401550 395176 388866 382014 374549
57898 374549 367161 360721 355544 351058 346240 340687 335247 331143 328527 326597 325099 324718 325653 326877 327520
57883 327520 328210 330213 333853 338542 343777 349220 354194 358035 360823 363050 364726 365419 365037 364016 362826
57868 362826 361706 360734 359823 358854 358022 357713 357855 357872 357552 357464 358262 360099 362917 366579 370444 373727 376789
57851 376789 381133 387481 394663 401153 406848 412484 418100 423136 427412 430971 433432 434532 434889 435242 435288
57836 435288 434158 431704 428437 424626 420431 416461 413062 409323 404017 397485 391535 387364 384552 382194
57822 382194 380110 378690 378278 378969 380528 382431 384395 386820 390268 394623 399238 403691 407899 411720 415103
57807 415103 418437 422022 425198 426527 424932 420356 413562 405649 397532 389464 381278 373241 366136 360134
$$ packed form
57911D86934j1946j2311j1893j0796r320p994p279p056o789o374o310o852p465
57898C74549p388o440n177m486m818n553n440m104k616j930j498l81R35J224O43
57883C27520O90K003L640M689N235N443M974L841K788K227J676O93l82j021j190
57868C62826j120r72r11r69q32l09J42J7l20q8P98J837K818L662L865L283L062
57851C76789M344O348P182O490N695N636N616N036M276L559K461J100L57L53M6
57836D35288j130k454l267l811m195l970l399l739n306o532n950m171k812k358
57822C82194k084j420m12O91J559J903J964K425L448M355M615M453M208L821L383
57807D15103L334L585L176J329j595m576o794p913q117q068q186q037p105o002
$$ plain form
57793 360134 354348 348145 342177 337299 333112 328589 323657 319098 315229 311782 308850 306836 305561 304460
57779 304460 303662 303884 305182 306710 307872 309035 310973 314208 318891 324696 330914 337200 344000 351546 358789
57764 358789 364210 367600 370084 372452 374344 375021 374072 371327 366937 361698 356554 351701 346856 342260 338570
57749 338570 335802 333292 330798 328767 327384 326212 324959 323853 323054 322397 321885 321755 321902 321912 321712 321481
57733 321481 320954 319658 317934 316804 316586 316538 316199 316141 316895 317928 318328 318047 317857 318428 319817 321654 323489
57716 323489 325063 326409 327616 328606 329362 330103 330835 331020 330267 329097 328327 327918 327192 326041 325069 324635 324765
57699 324765 325943 328873 333141 337213 340254 343054 346644 350753 354258 356482 357403 357079 355606 353471 351419
57684 351419 350025 349572 350137 351675 354260 358353 364614 373498 385417 401164 421607 446987 477207
$$ packed form
57793C60134n786o203n968m878m187m523m932m559l869l447k932k014j275j101
57779C04460p98K22J298J528J162J163J938L235M683N805O218O286O800P546P243
57764C58789N421L390K484K368J892O77r49k745m390n239n144m853m845m596l690
57749C38570k768k510k494k031j383j172j253j106p99o57n12j30J47J0k00k31
57733C21481n27j296j724j130k18m8l39n8P54J033M00k81j90N71J389J837J835
57716C23489J574J346J207R90P56P41P32J85p53j170p70m09p26j151r72m34J30
57699C24765J178K930M268M072L041K800L590M109L505K224R21l24j473k135k052
57684C51419j394m53N65J538K585M093O261Q884J1919J5747K0443K5380L0220
$$ plain form
57671 477207 512935 555841 607563 668966 740311 821081 908726 997511 1078631 1141411 1175482
57660 1175482 1174114 1137435 1072810 991573 904605 819751 741649 672674 613858 565348 526392
57649 526392 495450 470788 451004 434906 421360 409780 400382 393283 387651 382440 377691 374171 371978
57636 371978 370458 369400 369194 369725 370227 370489 371134 372377 373453 373742 373605 373666 374047 374711 375730 376793 377192
57619 377192 376814 376419 376480 376428 375588 374245 373273 373229 374138 375627 376943 377440 377394 377773 378988 380557 382163 384071
57601 384071 386174 387644 388081 388133 388359 388342 387603 386588 386019 385952 386135 386521 386707 385652 382902 379484 376752
57584 376752 374899 373434 372461 372463 373223 373981 374407 374594 374434 373832 373330 373648 374785 376233 377797 379462 380741
57567 380741 381031 380496 379908 379718 379920 380623 382048 384103 386557 389456 392780 395975 398495 400601 402922 405479
$$ packed form
57671D77207L5728M2906N1722O1403P1345Q0770Q7645Q8785Q1120O2780L4071
57660A175482j368l6679o4625q1237q6968q4854p8102o8975n8816m8510l8956
57649E26392l0942k4662j9784j6098j3546j1580r398p099n632n211m749l520k193
57636C71978j520j058k06N31N02K62O45J243J076K89j37O1L81O64J019J063L99
57619C77192l78l95O1n2q40j343r72m4R09J489J316M97m6L79J215J569J606J908
57601C84071K103J470M37N2K26j7p39j015n69o7J83L86J86j055k750l418k732
57584C76752j853j465r73KP60P58M26J87j60o02n02L18J137J448J564J665J279
57567C80741K90n35n88j90K02P03J425K055K454K899L324L195K520K106K321K557
$$ plain form
57551 405479 407875 410258 413247 416951 420828 424450 427745 430530 432543 433901 434907 435506 435677 436231 438311
57536 438311 441911 445681 448468 450398 452265 454494 457021 459602 461895 463696 465347 467512 470323 473250
57522 473250 476039 479277 483582 488626 493466 497625 501353 504885 508023 510662 513385 517037 521649 526193
57508 526193 529728 532540 535734 539794 544112 548038 551777 555842 560143 564050 567084 569161 570460 571491
57494 571491 572930 574887 576572 577242 577309 577974 579877 582689 585933 589565 593587 597596 601049 603798 606232
57479 606232 608991 612561 617016 622124 627663 633334 638389 641925 643923 645614 648276 651918 655622 658888
57465 658888 662044 665493 669224 673088 677035 680980 684950 689398 694931 701545 708457 714823 720334 725154
57451 725154 729610 734089 738884 743947 748952 753712 758409 763406 768938 774963 781195 787306 793213 799099
$$ packed form
57551D05479K396K383K989L704L877L622L295K785K013J358J006N99J71N54K080
57536D38311L600L770K787J930J867K229K527K581K293J801J651K165K811K927
57522D73250K789L238M305N044M840M159L728L532L138K639K723L652M612M544
57508E26193L535K812L194M060M318L926L739M065M301L907L034K077J299J031
57494E71491J439J957J685O70O7O65J903K812L244L632M022M009L453K749K434
57479F06232K759L570M455N108N539N671N055L536J998J691K662L642L704L266
57465F58888L156L449L731L864L947L945L970M448N533O614O912O366N511M820
57451G25154M456M479M795N063N005M760M697M997N532O025O232O111N907N886
$$ plain form
57437 799099 805104 811179 817363 823930 831022 838283 845132 851357 857304 863558 870552 878253 886106 893531
57423 893531 900577 907813 915435 922869 929534 935629 941825 948502 955594 962893 970175 977313 984578 992529
57409 992529 1001307 1010438 1019618 1029194 1039336 1049233 1057858 1065219 1072194 1079337 1086511 1093595 1100827 1108444
57395 1108444 1116577 1125511 1135463 1146033 1156413 1166247 1175834 1185477 1195097 1204636 1214430 1224976 1236567
57382 1236567 1249245 1262886 1277184 1291577 1305240 1317273 1327291 1335931 1344382 1353228 1362146 1370975
57370 1370975 1380395 1391020 1402350 1413336 1423694 1433992 1444670 1455687 1466989 1478633 1490523
57359 1490523 1502580 1515051 1528110 1541331 1554207 1567043 1580625 1595006 1609306 1622837 1635865
57348 1635865 1649179 1663369 1678537 1694234 1709662 1724361 1738660 1753087 1767520 1781437 1794823
$$ packed form
57437G99099O005O075O184O567P092P261O849O225N947O254O994P701P853P425
57423H93531P046P236P622P434O665O095O196O677P092P299P282P138P265P951
57409I92529Q778R131R180R576J0142R897Q625P361O975P143P174P084P232P617
57395A108444Q133Q934R952J0570J0380R834R587R643R620R539R794J0546J1591
57382A236567J2678J3641J4298J4393J3663J2033J0018Q640Q451Q846Q918Q829
57370A370975R420J0625J1330J0986J0358J0298J0678J1017J1302J1644J1890
57359A490523J2057J2471J3059J3221J2876J2836J3582J4381J4300J3531J3028
57348A635865J3314J4190J5168J5697J5428J4699J4299J4427J4433J3917J3386
$$ plain form
57337 1794823 1808249 1822159 1836663 1851864 1867729 1883731 1899285 1914567 1930320 1946856 1963861
57326 1963861 1981020 1998141 2014747 2030406 2045570 2061261 2077708 2094035 2109576 2124896 2141176
57315 2141176 2159030 2178095 2197392 2216002 2233796 2251567 2270093 2289196 2308217 2327085 2346210
57304 2346210 2365527 2384584 2403491 2422804 2442432 2461672 2480509 2499838 2520078 2540522 2560472
57293 2560472 2580067 2599537 2618607 2637313 2656559 2677015 2698089 2718716 2738722 2758719 2779046
57282 2779046 2799518 2819903 2840027 2859664 2878843 2898094 2917933 2938323 2958969 2979811 3000798
57271 3000798 3021456 3041260 3060343 3079482 3099364 3120084 3141224 3162314 3183356 3204915 3227462
57260 3227462 3250705 3273936 3296978 3320160 3343326 3365633 3386678 3407177 3428080 3449498 3470903
$$ packed form
57337A794823J3426J3910J4504J5201J5865J6002J5554J5282J5753J6536J7005
57326A963861J7159J7121J6606J5659J5164J5691J6447J6327J5541J5320J6280
57315B141176J7854J9065J9297J8610J7794J7771J8526J9103J9021J8868J9125
57304B346210J9317J9057J8907J9313J9628J9240J8837J9329K0240K0444J9950
57293B560472J9595J9470J9070J8706J9246K0456K1074K0627K0006J9997K0327
57282B779046K0472K0385K0124J9637J9179J9251J9839K0390K0646K0842K0987
57271C000798K0658J9804J9083J9139J9882K0720K1140K1090K1042K1559K2547
57260C227462K3243K3231K3042K3182K3166K2307K1045K0499K0903K1418K1405
$$ plain form
57249 3470903 3491804 3511807 3530561 3548331 3566225 3585199 3605024 3624735 3643881 3662848 3682041
57238 3682041 3701259 3719895 3737454 3753915 3769704 3785297 3800836 3816344 3832195 3848901 3866358
57227 3866358 3883826 3900824 3917533 3934138 3950430 3966398 3982507 3998852 4014574 4028819 4041828
57216 4041828 4054381 4066414 4077025 4085871 4093831 4101977 4110259 4117612 4123308 4127999 4133119 4139211 4145193
57203 4145193 4149718 4152993 4156612 4161694 4167997 4175014 4183017 4192494 4203360 4215383 4228841 4243967 4260127
57190 4260127 4276274 4292061 4307812 4323473 4338259 4351469 4363191 4373998 4384206 4393566 4401618 4408189
57178 4408189 4413417 4417288 4419461 4419897 4419385 4418850 4418213 4416472 4412900 4407532 4400486 4391632 4381079 4369290
57164 4369290 4356417 4342265 4327071 4311510 4295590 4278467 4259822 4240567 4221676 4203213 4185155
$$ packed form
57249C470903K0901K0003J8754J7770J7894J8974J9825J9711J9146J8967J9193
57238C682041J9218J8636J7559J6461J5789J5593J5539J5508J5851J6706J7457
57227C866358J7468J6998J6709J6605J6292J5968J6109J6345J5722J4245J3009
57216D041828J2553J2033J0611Q846P960Q146Q282P353N696M691N120O092N982
57203D145193M525L275L619N082O303P017Q003R477J0866J2023J3458J5126J6160
57190D260127J6147J5787J5751J5661J4786J3210J1722J0807J0208R360Q052O571
57178D408189N228L871K173M36n12n35o37j741l572n368p046q854j0553j1789
57164D369290j2873j4152j5194j5561j5920j7123j8645j9255j8891j8463j8058
$$ plain form
57153 4185155 4168253 4153164 4139405 4126039 4112863 4100106 4087635 4075389 4063963 4053705 4043573
57142 4043573 4031916 4018125 4002679 3985938 3967824 3948299 3927024 3902771 3874399 3842488 3809011
57131 3809011 3775270 3741041 3705861 3670257 3635405 3602288 3571421 3542847 3516190 3491005 3467008
57120 3467008 3443683 3419977 3395015 3368874 3342060 3314726 3287259 3261255 3238788 3220732 3206860
57109 3206860 3197623 3194731 3199806 3213533 3236618 3270918 3319396 3385744 3474430 3590629 3740022
57098 3740022 3929240 4166361 4459963 4817235 5243298 5741711 6314151 6959017 7670964
57089 7670964 8441582 9259228 10108122 10968720 11818103 12627055 13357209 13968440 14438706
57080 14438706 14780747 15036403 15249097 15436349 15582700 15652920 15610436 15428962 15096208 14613698
$$ packed form
57153D185155j6902j5089j3759j3366j3176j2757j2471j2246j1426j0258j0132
57142D043573j1657j3791j5446j6741j8114j9525k1275k4253k8372l1911l3477
57131C809011l3741l4229l5180l5604l4852l3117l0867k8574k6657k5185k3997
57120C467008k3325k3706k4962k6141k6814k7334k7467k6004k2467j8056j3872
57109C206860r237k892N075J3727K3085L4300M8478O6348Q8686J16199J49393
57098C740022J89218K37121K93602L57272M26063M98413N72440O44866P11947
57089G670964P70618Q17646Q48894Q60598Q49383Q08952P30154O11231M70266
57080A4438706L42041K55656K12694J87252J46351P0220m2484j81474l32754m82510
$$ plain form
57070 14613698 13995120 13263596 12448345 11581417 10694459 9815631 8967418 8166094 7422374
57061 7422374 6742186 6127350 5576546 5086473 4652531 4269025 3929555 3627690 3357361
57052 3357361 3112885 2889383 2683520 2493478 2317906 2155286 2004441 1864983 1736667
57043 1736667 1618645 1509885 1409878 1318280 1234182 1156512 1085037 1020345 962849 912315 868200
57032 868200 829874 796647 768210 744933 727231 714930 707943 707314 714794 731625 758609 796966
57020 796966 847935 911788 988599 1079467 1183762 1292945 1388327 1447940 1457637 1417035 1336973
57009 1336973 1232878 1119341 1007481 904353 813558 736207 671664 618270 574203 537937
56999 537937 507962 482674 461013 442897 428483 417144 407645 399144 391547 385023 379646 375473 372527
$$ packed form
57070A4613698o18578p31524q15251q66928q86958q78828q48213q01324p43720
57061G422374o80188o14836n50804m90073m33942l83506l39470l01865k70329
57052C357361k44476k23502k05863j90042j75572j62620j50845j39458j28316
57043A736667j18022j08760j00007r1598q4098p7670p1475o4692n7496n0534m4115
57032H68200l8326l3227k8437k3277j7702j2301o987o29P480J6831K6984L8357
57020G96966N0969O3853P6811R0868J04295J09183R5382N9613R697m0602q0062
57009A336973j04095j13537j11860j03128r0795p7351o4543n3394m4067l6266
56999E37937k9975k5288k1661j8116j4414j1339r499q501p597o524n377m173k946
$$ plain form
56986 372527 370702 370010 370826 373502 377649 382048 385150 385478 381836 373782 362064 348255 333739 319176
56972 319176 304914 291625 280330 271848 266200 262544 259833 257769 257079 258754 263112 269747 278218 288539
56958 288539 301032 315876 332623 349816 365016 375550 379593 376778 368041 355053 339668 323506
56946 323506 307717 292989 279735 268312 259143 252593 248666 246939 247102 249598 255422 265143 278440
56933 278440 294709 313748 335417 358763 381843 402264 417528 425131 423210 411713 392806 369802
56921 369802 345628 322184 300563 281240 264061 248577 234706 222873 213356 205723 199182 193293
56909 193293 188135 183911 180714 178550 177203 176083 174605 172830 171382 170669 170601 171177 172844 175912 179992
56894 179992 184446 189235 194964 202283 211548 222873 236171 251264 268122 286646 305838 323549
$$ packed form
56986C72527j825o92Q16K676M147M399L102L28l642q054j1718j3809j4516j4563
56972C19176j4262j3289j1295q482n648l656k711k064o90J675M358O635Q471J0321
56958B88539J2493J4844J6747J7193J5200J0534M043k815q737j2988j5385j6162
56946C23506j5789j4728j3254j1423r169o550l927j727J63K496N824R721J3297
56933B78440J6269J9039K1669K3346K3080K0421J5264P603j921j1497j8907k3004
56921C69802k4174k3444k1621j9323j7179j5484j3871j1833r517p633o541n889
56909A93293n158m224l197k164j347j120j478j775j448p13o8N76J667L068M080
56894A79992M454M789N729P319R265J1325J3298J5093J6858J8524J9192J7711
$$ plain form
56882 323549 337506 346446 349949 347753 340144 328828 316457 304948 294724 285675 278200 273099 270994
56869 270994 272242 277103 285748 298308 315100 336597 363116 394734 431412 472786 517655 563779
56857 563779 607949 645926 672782 684410 679525 660307 631280 597627 563900 533053 506212 483666
56845 483666 466060 454268 448423 448142 453818 466815 488074 517476 555006 601582 657903 722974
56833 722974 794230 868201 939911 1002035 1046057 1065259 1057093 1023558 970158 904309 833597 764451
56821 764451 701555 647539 602826 566385 537403 516195 503274 498093 499560 507682 523880 549467
56809 549467 584265 626836 675417 727943 781016 829047 864895 882166 877756 852741 811228 758588
56797 758588 700433 642066 587659 539583 498648 464879 437877 416826 400851 389544 382983 381314
$$ packed form
56882C23549J3957Q940L503k196p609j1316j2371j1509j0224r049p475n101k105
56869B70994J248M861Q645J2560J6792K1497K6519L1618L6678M1374M4869M6124
56857E63779M4170L7977K6856J1628m885j9218k9027l3653l3727l0847k6841k2546
56845D83666j7606j1792n845k81N676J2997K1259K9402L7530M6576N6321O5071
56833G22974P1256P3971P1710O2124M4022J9202q166l3535n3400o5849p0712o9146
56821G64451o2896n4016m4713l6441k8982k1208j2921n181J467Q122J6198K5587
56809E49467L4798M2571M8581N2526N3073M8031L5848J7271m410k5015m1513n2640
56797G58588n8155n8367n4407m8076m0935l3769k7002k1051j5975j1307o561j669
$$ plain form
56785 381314 384653 393238 407205 426054 448596 473393 498801 522397 540714 550078 548009 534095
56773 534095 509911 478373 442934 406811 372385 341025 313311 289329 268688 250587 234320
56762 234320 219910 207927 198476 190645 183240 175879 169008 163025 157768 152809 147922 143297 139537 137197
56748 137197 135972 134609 132165 129131 126741 125376 124405 123490 123082 123399 123770 123429 122342 120914 119453 118297
56732 118297 117915 118412 119338 120265 121174 122075 122835 123586 124681 125899 126405 125893 125114 124804 124778 124718 125090 126456
56714 126456 128405 130002 130924 131336 131064 129850 128234 127225 127092 127225 127206 127261 127592 128050 128698 129990 132008
56697 132008 133981 134955 134775 134107 133658 133562 133501 133253 132934 132678 132264 131403 130338 129693 129704 130082 130743 132077 134161
56678 134161 136268 137613 138191 138417 138372 137885 137046 136128 135261 134580 134395 134868 135835 137253 139316 141769 143698
$$ packed form
56785C81314L339Q585J3967J8849K2542K4797K5408K3596J8317R364k069j3914
56773E34095k4184l1538l5439l6123l4426l1360k7714k3982k0641j8101j6267
56762B34320j4410j1983r451p831p405p361o871n983n257m959m887m625l760k340
56748A37197j225j363k444l034k390j365r71r15m08L17L71l41j087j428j461j156
56732A18297l82M97R26R27R09R01P60P51J095J218N06n12p79l10k6o0L72J366
56714A26456J949J597R22M12k72j214j616j009j33J33j9N5L31M58O48J292K018
56697A32008J973R74j80o68m49r6o1k48l19k56m14q61j065o45J1L78O61J334K084
56678A34161K107J345N78K26m5m87q39r18q67o81j85M73R67J418K063K453J929
$$ plain form
56661 143698 144545 144801 145142 145501 145705 146386 148257 150867 153096 154642 156074 157598 158752 159329 159618 159709 159380
56644 159380 158751 158247 157850 157168 156343 156130 156882 158200 159671 161282 162940 164277 165155 165733 165902 165332 164257
56627 164257 163517 163600 164256 165222 166634 168421 170004 171040 171963 173356 175193 177016 178463 179316 179451 179045
56611 179045 178533 178114 177633 177106 176928 177270 177668 177551 176913 176231 175955 176217 176785 177134 176872 176248 176001 176585 177780
56592 177780 179072 180011 180185 179392 178035 176940 176454 176042 175037 173486 171991 170981 170486 170452 170911 171798 172785
56575 172785 173450 173663 173802 174477 175915 177750 179505 181157 183101 185732 189241 193523 198049 202192 205987
56560 205987 210348 216132 223295 231318 240020 249292 258309 265784 271077 274550 276918 278770 280542 282314
56546 282314 283631 284020 283687 283246 282931 282594 282188 281612 280371 278175 275671 273690 271900 269212 265443 261498
$$ packed form
56661A43698Q47K56L41L59K04O81J871K610K229J546J432J524J154N77K89R1l29
56644A59380o29n04l97o82q25k13P52J318J471J611J658J337Q78N78J69n70j075
56627A64257p40Q3O56R66J412J787J583J036R23J393J837J823J447Q53J35m06
56611A79045n12m19m81n27j78L42L98j17o38o82k76K62N68L49k62o24k47N84J195
56592A77780J292R39J74p93j357j095m86m12j005j551j495j010m95l4M59Q87R87
56575A72785O65K13J39O75J438J835J755J652J944K631L509M282M526M143L795
56560B05987M361N784P163Q023Q702R272R017P475N293L473K368J852J772J772
56546B82314J317L89l33m41l15l37m06n76j241k196k504j981j790k688l769l945
$$ plain form
56530 261498 257803 253725 248921 244160 240228 236858 233370 229672 226090 222783 219837 217395 215288 213122
56516 213122 211133 210322 211187 212847 213892 213670 212341 210258 207860 205735 204196 203095 202373 202373 203183 204175
56500 204175 204715 204911 205135 205191 204583 203335 201982 200849 199822 198730 197568 196422 195495 195111 195399 196111 196935
56483 196935 197843 198916 199962 200529 200280 199301 198145 197468 197431 197593 197666 198115 199500 201447 202978 203814 204581
56466 204581 205675 206741 207495 208260 209297 210297 210915 211240 211409 211401 211565 212690 215072 218004 220571 222448
56450 222448 223636 224102 224145 224447 225206 225708 225272 224151 223061 222385 222323 223216 225047 227038 228370 228954 229022 228475
56432 228475 227270 226027 225560 225948 226565 226832 226562 225887 225267 225284 226029 226979 227763 228603 229722 230836 231660 232345
56414 232345 232951 233081 232607 232235 232703 233844 235013 235962 236712 237040 236814 236465 236498 236881 237449 238428 239905 241237
$$ packed form
56530B61498l695m078m804m761l932l370l488l698l582l307k946k442k107k166
56516B13122j989q11Q65J660J045k22j329k083k398k125j539j101p22%Q10R92
56500B04175N40J96K24N6o08j248j353j133j027j092j162j146r27l84K88P12Q24
56483A96935R08J073J046N67k49r79j156o77l7J62P3M49J385J947J531Q36P67
56466B04581J094J066P54P65J037J000O18L25J69qJ64J125K382K932K567J877
56450B22448J188M66M3L02P59N02m36j121j090o76o2Q93J831J991J332N84O8n47
56432B28475j205j243m67L88O17K67k70o75o20J7P45R50P84Q40J119J114Q24O85
56414B32345O06J30m74l72M68J141J169R49P50L28k26l49L3L83N68R79J477J332
$$ plain form
56396 241237 241772 241810 242170 243096 244266 245459 246555 247307 247868 249147 251735 254799 256928 257845 258361 258871 258945
56379 258945 258448 258086 258571 259944 261888 264164 266538 268725 270540 271866 272625 273030 273526 274117 274234 273759
56363 273759 273583 274354 275282 275228 274577 274763 276078 277231 277313 276994 277368 278631 280402 282482 284604 285999 285957
56346 285957 284652 283019 281920 281646 281985 282601 283392 284488 285741 286526 286455 286180 286929 289214 292460 295936
56330 295936 299554 303641 308352 313458 318428 322681 326012 328810 331639 334622 337427 339674 341093 341512
56316 341512 341108 340496 340193 340154 340175 340440 341183 342082 342588 342678 342721 342737 342474 342161 342538 344045 346464 349393 352578
56297 352578 355795 358846 361695 364240 366052 366857 367159 367883 369393 371349 373438 375651 377879 379866 381774
56282 381774 384304 388001 392625 397263 400963 403508 405864 409609 415422 422382 429148 435503 442108 449095
$$ packed form
56396B41237N35L8L60R26J170J193J096P52N61J279K588L064K129R17N16N10P4
56379B58945m97l62M85J373J944K276K374K187J815J326P59M05M96N91J17m75
56363B73759j76P71R28n4o51J86J315J153Q2l19L74J263J771K080K122J395m2
56346B85957j305j633j099k74L39O16P91J096J253P85p1k75P49K285L246L476
56330B95936L618M087M711N106M970M253L331K798K829K983K805K247J419M19
56316C41512m04o12l03l9K1K65P43Q99N06R0M3J6k63l13L77J507K419K929L185
56297C52578L217L051K849K545J812Q05L02P24J510J956K089K213K228J987J908
56282C81774K530L697M624M638L700K545K356L745N813O960O766O355O605O987
$$ plain form
56268 449095 455929 462646 470195 479109 488568 497416 505744 514914 526142 539478 554178 569777 586539
56255 586539 604968 625250 647484 672219 700256 731907 766956 805400 847676 894043 944354
56244 944354 998645 1057218 1119780 1185203 1252544 1321600 1391954 1462145 1530343 1595103 1654817
56233 1654817 1707162 1749942 1782005 1802752 1811438 1807800 1792714 1767403 1732558 1689058 1638845 1584002
56221 1584002 1525597 1464439 1402348 1341416 1282448 1225329 1170493 1118820 1070404 1024744 981943
56210 981943 942506 906221 872477 841478 813851 789213 766473 745462 726959 711094 696993
56199 696993 684088 672522 662182 652522 643513 635674 629064 623296 618500 615165 613009 611095 609062
56186 609062 607179 605369 603431 602044 602139 603352 604491 605496 607326 609908 611912 612885 613929 615794 617884
$$ packed form
56268D49095O834O717P549Q914R459Q848Q328R170J1228J3336J4700J5599J6762
56255E86539J8429K0282K2234K4735K8037L1651L5049L8444M2276M6367N0311
56244I44354N4291N8573O2562O5423O7341O9056P0354P0191O8198O4760N9714
56233A654817N2345M2780L2063K0747Q686l638j5086k5311l4845m3500n0213n4843
56221A584002n8405o1158o2091o0932n8968n7119n4836n1673m8416m5660m2801
56210I81943l9437l6285l3744l0999k7627k4638k2740k1011j8503j5865j4101
56199F96993j2905j1566j0340r660r009p839o610n768m796l335k156j914k033
56186F09062j883j810j938j387R5J213J139J005J830K582K004R73J044J865K090
$$ plain form
56171 617884 619656 621476 623472 624994 625945 627333 629796 632754 635679 639026 643305 648399 654346 661581
56157 661581 669798 677815 685208 692942 701774 711280 721053 731524 742865 754448 766262 779597 795278
56144 795278 812430 830107 849183 871477 897751 927582 960574 996873 1037182 1083100 1136854
56133 1136854 1200013 1272997 1356146 1450218 1554987 1667942 1784837 1900742 2010361 2108819
56123 2108819 2193436 2264518 2324097 2374614 2418776 2458941 2495386 2525784 2547088 2557411 2556135
56112 2556135 2543728 2522367 2495589 2466098 2434114 2397762 2353896 2298460 2228127 2143129 2047773
56101 2047773 1947512 1846454 1748142 1656778 1575943 1506724 1448232 1399412 1359520 1327649 1302810
56090 1302810 1284088 1270294 1260119 1252972 1248832 1247038 1246332 1246394 1247994 1251245 1255201 1259712 1266063 1274896
$$ packed form
56171F17884J772J820J996J522R51J388K463K958K925L347M279N094N947P235
56157F61581Q217Q017P393P734Q832R506R773J0471J1341J1583J1814J3335J5681
56144G95278J7152J7677J9076K2294K6274K9831L2992L6299M0309M5918N3754
56133A136854O3159P2984Q3149R4072J04769J12955J16895J15905J09619R8458
56123B108819Q4617P1082N9579N0517M4162M0165L6445L0398K1304J0323j276
56112B556135j2407k1361k6778k9491l1984l6352m3866n5436p0333q4998r5356
56101B047773j00261j01058r8312r1364q0835o9219n8492m8820l9892l1871k4839
56090A302810j8722j3794j0175p147m140j794p06O2J600L251L956M511O351Q833
$$ plain form
56076 1274896 1284959 1294939 1305194 1316641 1329065 1341534 1353542 1365051 1376456 1388934 1403583
56065 1403583 1419754 1435726 1451360 1468357 1487466 1507547 1528098 1550404 1575096 1600732 1626040
56054 1626040 1651386 1676674 1700070 1720570 1739799 1759475 1779001 1797394 1815709 1835546 1856855
56043 1856855 1879164 1903315 1929947 1957856 1985923 2015250 2047382 2081860 2117470 2154437 2193352
56032 2193352 2233384 2273630 2315012 2358889 2405069 2452937 2503103 2556103 2610988 2667021 2725232
56021 2725232 2786531 2850024 2914953 2982403 3053195 3126201 3200790 3278692 3361147 3446477 3533013
56010 3533013 3622238 3716362 3814981 3916862 4022872 4134270 4250250 4370087 4495549 4628323
56000 4628323 4767360 4911807 5063988 5226244 5397414 5576033 5764358 5965442 6178830
$$ packed form
56076A274896J0063R980J0255J1447J2424J2469J2008J1509J1405J2478J4649
56065A403583J6171J5972J5634J6997J9109K0081K0551K2306K4692K5636K5308
56054A626040K5346K5288K3396K0500J9229J9676J9526J8393J8315J9837K1309
56043A856855K2309K4151K6632K7909K8067K9327L2132L4478L5610L6967L8915
56032B193352M0032M0246M1382M3877M6180M7868N0166N3000N4885N6033N8211
56021B725232O1299O3493O4929O7450P0792P3006P4589P7902Q2455Q5330Q6536
56010C533013Q9225R4124R8619J01881J06010J11398J15980J19837J25462J32774
56000D628323J39037J44447J52181J62256J71170J78619J88325K01084K13388
$$ plain form
55991 6178830 6403127 6640278 6893123 7161302 7443928 7743802 8064602 8406660 8770219
55982 8770219 9160041 9581908 10037435 10527457 11057442 11634114 12260034 12937565 13675140
55973 13675140 14483653 15370444 16343726 17419535 18617461 19953867 21447767 23130246
55965 23130246 25040950 27221156 29721201 32612422 35984874 39941364 44606090 50133594
55957 50133594 56698526 64487659 73722032 84687067 97737245 113292577 131838409
55950 131838409 153858461 179647083 209103629 241647118 276164464 310772272 342491595
55943 342491595 367375709 381482602 382313053 369786786 346152249 315038664 280315334
55936 280315334 245260100 212169248 182335309 156257714 133925004 115042481 99180302
$$ packed form
55991F178830K24297K37151K52845K68179K82626K99874L20800L42058L63559
55982H770219L89822M21867M55527M90022N29985N76672O25920O77531P37575
55973A3675140Q08513Q86791R73282J075809J197926J336406J493900J682479
55965B3130246J910704K180206K500045K891221L372452L956490M664726N527504
55957E0133594O564932P789133R234373J0965035J3050178J5555332J8545832
55950A31838409K2020052K5788622K9456546L2543489L4517346L4607808L1719323
55943C42491595K4884114J4106893Q30451j2526267k3634537l1113585l4723330
55936B80315334l5055234l3090852k9833939k6077595k2332710j8882523j5862179
$$ plain form
55929 99180302 85877578 74712439 65324281 57404675 50692831 44979333 40098001 35908686
55921 35908686 32291769 29152723 26418149 24024521 21916222 20051224 18398808 16930640
55913 16930640 15619705 14445918 13395015 12451791 11600239 10829399 10132743 9501846 8925979
55904 8925979 8397505 7912431 7465886 7051929 6667559 6312326 5984085 5679143 5396103
55895 5396103 5135415 4895501 4673169 4467359 4278594 4105233 3944138 3794752 3658814
55886 3658814 3536378 3425719 3327001 3242473 3173072 3118080 3078019 3054657 3048083 3056582 3078985
55875 3078985 3113750 3155384 3194384 3220891 3226346 3202901 3145277 3054301 2936414 2799515 2651008
55864 2651008 2498752 2350161 2209603 2078798 1959592 1853868 1760858 1677473 1601789 1534025
$$ packed form
55929I9180302j3302724j1165139r388158p919606o711844n713498m881332m189315
55921C5908686l616917l139046k734574k393628k108299j864998j652416j468168
55913A6930640j310935j173787j050903r43224q51552p70840o96656o30897n75867
55904H925979n28474m85074m46545m13957l84370l55233l28241l04942k83040
55895E396103k60688k39914k22332k05810j88765j73361j61095j49386j35938
55886C658814j22436j10659r8718q4528o9401n4992m0061k3362o574Q499K2403
55875C078985L4765M1634L9000K6507N455k3445n7624r0976j17887j36899j48507
55864B651008j52256j48591j40558j30805j19206j05724r3010q3385p5684o7764
$$ plain form
55854 1534025 1473969 1419978 1370910 1326728 1286658 1248798 1212035 1176639 1142697 1109734 1077972
55843 1077972 1048139 1019884 992123 964982 939633 916230 893922 872820 853950 837137 820935
55832 820935 804875 789884 776252 763058 749878 737282 725368 713515 701846 691201 681427 671343
55820 671343 660564 649615 638197 625371 611730 599352 588996 579210 568923 559127 551216 545231
55808 545231 540606 537242 534990 533253 531845 531274 531800 533339 536567 542668 551476 561085 569830 577520 584364
55793 584364 590066 594514 598047 600406 600613 598508 595292 591920 587998 582874 576770 570221 563228 555439
55779 555439 546230 534311 518367 498769 477824 457891 440020 424610 412209 403085 396951 393608
55767 393608 393022 394459 396469 398083 399149 399304 397779 394538 390495 386156 381191 375682 370504 365876 360812
$$ packed form
55854A534025o0056n3991m9068m4182m0070l7860l6763l5396l3942l2963l1762
55843A077972k9833k8255k7761k7141k5349k3403k2308k1102j8870j6813j6202
55832H20935j6060j4991j3632j3194j3180j2596j1914j1853j1669j0645r774j0084
55820F71343j0779j0949j1418j2826j3641j2378j0356r786j0287r796p911n985
55808E45231m625l364k252j737j408n71N26J539L228O101Q808R609Q745P690O844
55793E84364N702M448L533K359K07k105l216l372l922n124o104o549o993p789
55779E55439r209j1919j5944j9598k0945j9933j7871j5410j2401r124o134l343
55767C93608n86J437K010J614J066J55j525l241m043m339m965n509n178m628n064
$$ plain form
55752 360812 354692 348159 341681 334474 325849 316619 308091 300433 292989 285526 278273 271371 265118 260174
55738 260174 256723 254021 251509 249700 249155 249224 248761 247598 246383 245320 243994 242206 240144 237770 234651
55723 234651 230396 224966 218816 212955 208422 205293 202683 200115 198275 197856 198292 198383 197818 197327 197662 199111
55707 199111 201783 205590 209918 213911 217170 219833 221894 222768 221590 217926 212297 206009 200173 194871
55693 194871 189610 184509 180401 177612 175387 172905 170247 167896 165882 164033 162668 162381 163244 164716 166223
55678 166223 167583 169027 170954 173407 175622 176547 176006 174888 173967 173086 171828 170334 168900 167334 165429
55663 165429 163630 162512 161864 161060 160170 159993 161035 163096 165872 169291 173069 176579 179539 182477 186154
55648 186154 190648 195288 199400 202862 205854 208244 209469 209092 207286 204577 201197 196948 191691 185770
$$ packed form
55752C60812o120o533o478p207q625r230q528p658p444p463p253o902o253m944
55738B60174l451k702k512j809n45O9m63j163j215j063j326j788k062k374l119
55723B34651m255n430o150n861m533l129k610k568j840m19M36R1n65m91L35J449
55707A99111K672L807M328L993L259K663K061Q74j178l664n629o288n836n302
55693A94871n261n101m108k789k225k482k658k351k014j849j365k87Q63J472J507
55678A66223J360J444J927K453K215R25n41j118r21q81j258j494j434j566j905
55663A65429j799j118o48q04q90j77J042K061K776L419L778L510K960K938L677
55648A86154M494M640M112L462K992K390J225l77j806k709l380m249n257n921
$$ plain form
55634 185770 179842 174328 169035 163264 156540 149397 143249 139156 136842 135204 133538 131863 130371 129199
55620 129199 128684 129134 130195 130976 130956 130355 129573 128772 128090 127738 127710 127816 128033 128297 127954 126097 122703 118870
55602 118870 115710 113539 112251 111747 111678 111380 110556 109535 108496 107083 105238 103852 103878 105083 106265 106582
55586 106582 106212 105873 106102 106957 108040 108822 109127 109328 109946 111192 112903 114815 116873 119392 122818 127185
55570 127185 132062 137315 143483 150858 158578 165422 171181 176274 180212 181765 180783 178548 175899 172311
55556 172311 167486 162525 158446 154557 149579 143742 138441 134163 130026 125402 120872 117378 115124 113576
55542 113576 111994 109844 107121 104417 102406 101217 100429 99529 98230 96651 95397 95104 95622 96065 95941 95747
55526 95747 96061 96657 97048 97371 97993 98634 98668 98086 97403 96760 95820 94539 93367 92629 92184 91767 91276 90723 90185
$$ packed form
55634A85770n928n514n293n771o724p143o148m093k314j638j666j675j492j172
55620A29199n15M50J061P81k0o01p82q01o82l52k8J06K17K64l43j857l394l833
55602A18870l160k171j288n04o9k98q24j021j039j413j845j386K6J205J182L17
55586A06582l70l39K29Q55J083P82L05K01O18J246J711J912K058K519L426M367
55570A27185M877N253O168P375P720O844N759N093L938J553r82k235k649l588
55556A72311m825m961m079l889m978n837n301m278m137m624m530l494k254j548
55542A13576j582k150k723k704k011j189p88r00j299j579j254k93N18M43j24j94
55526I5747L14N96L91L23O22O41L4n82o83o43r40j281j172p38m45m17m91n53n38
$$ plain form
55507 90185 89739 89198 88158 86571 84990 83902 83203 82763 83023 84351 86090 86966 86379 84726 82641 80605
55491 80605 79190 78891 79496 80115 80051 79367 78633 78415 78953 79943 80662 80596 79942 79308 79150 79690 80953 82489 83463
55472 83463 83576 83546 84154 85162 85856 86233 86765 87232 86818 85453 84201 84016 84798 85823 86518 86612 86109 85387
55454 85387 84879 84504 83831 82897 82340 82592 83381 84201 84779 84988 84757 84271 83832 83386 82580 81415 80405 79928
55436 79928 79851 80006 80613 81895 83562 84955 85606 85557 85261 85234 85609 86072 86361 86699 87448 88481 89306 89749 90111
55417 90111 90703 91585 92737 94049 95261 96348 97845 100226 102936 104678 104771 103717 102350 101028 99838
55402 99838 98891 98016 96630 94421 91923 90054 89158 88718 87883 86224 84100 82346 81476 81218 81018 80764 80670
55385 80670 80687 80589 80574 81173 82440 83782 84675 85079 85055 84556 83756 83079 82666 82310 82067 82430 83603 85119 86444
$$ packed form
55507I0185m46n41j040j587j581j088o99m40K60J328J739Q76n87j653k085k036
55491H0605j415k99O05O19o4o84p34k18N38R90P19o6o54o34j58N40J263J536R74
55472H3463J13l0O08J008O94L77N32M67m14j365j252j85P82J025O95R4n03p22
55454H5387n08l75o73r34n57K52P89Q20N78K09k31m86m39m46q06j165j010m77
55436G9928p7J55O07J282J667J393O51m9k96k7L75M63K89L38P49J033Q25M43L62
55417I0111N92Q82J152J312J212J087J497K381K710J742R3j054j367j322j190
55402I9838r47q75j386k209k498j869q96m40q35j659k124j754q70k58k00k54r4
55385H0670J7r8j5N99J267J342Q93M04k4m99q00o77m13l56k43L63J173J516J325
$$ plain form
55366 86444 87507 88347 88747 88654 88550 88951 89724 90286 90277 89764 88981 88169 87542 87214 87232 87675 88479 89196 89338 89049
55346 89049 88978 89419 90023 90502 90997 91533 91741 91541 91504 92017 92556 92374 91550 90736 90125 89329 88193 87150 86724
55327 86724 87054 87885 88732 89114 88945 88638 88579 88630 88419 87986 87793 88160 88966 89811 90203 89754 88536 87170 86295
55308 86295 85941 85650 85131 84555 84267 84423 84868 85225 85225 85050 85121 85343 84898 83160 80604 78355 76992 76284 76035
55289 76035 76519 77890 79636 81028 81897 82684 83857 85541 87662 90105 92632 94836 96396 97384 98110 98666
55273 98666 98771 98186 97115 96081 95501 95523 96021 96523 96414 95616 94898 95027 95689 95835 95120 94330 94255 94787 95497
55254 95497 96349 97335 97938 97696 96964 96476 96322 96084 95798 96022 96830 97472 97298 96484 95509 94415 93068 91872
55236 91872 91619 92518 93789 94444 94300 93943 93813 93724 93451 93415 94300 96042 97668 98291 97957 97357 97038 97120 97518
$$ packed form
55366H6444J063Q40M00r3j04M01P73N62rn13p83q12o27l28J8M43Q04P17J42k89
55346H9049p1M41O04M79M95N36K08k00l7N13N39j82q24q14o11p96j136j043m26
55327H6724L30Q31Q47L82j69l07n9N1k11m33j93L67Q06Q45L92m49j218j366q75
55308H6295l54k91n19n76k88J56M45L57%j75P1K22m45j738k556k249j363p08k49
55289G6035M84J371J746J392Q69P87J173J684K121K443K527K204J560R88P26N56
55273I8666J05n85j071j034n80K2M98N02j09p98p18J29O62J46p15p90p5N32P10
55254I5497Q52R86O03k42p32m88j54k38k86K24Q08O42j74q14r75j094j347j196
55236I1872k53Q99J271O55j44l57j30q9k73l6Q85J742J626O23l34o00l19Q2L98
$$ plain form
55217 97518 98115 98797 99508 100155 100453 100187 99724 99888 101065 102706 103992 104646 104790 104405 103487 102476 101918 101730
55199 101730 101348 100609 100008 99968 100304 100583 100672 100735 100937 101308 101757 102085 102161 102123 102224 102420 102346 101777 100969 100416 100341
55178 100341 100487 100315 99451 98066 96899 96772 97978 100116 102433 104275 105326 105595 105215 104271 102926 101723
55162 101723 101466 102512 104258 105586 105850 105324 104763 104730 105308 106235 107176 107913 108296 108139 107361 106215 105146
55145 105146 104308 103472 102515 101697 101212 100801 100162 99562 99614 100505 101744 102633 102726 101962 100667 99418 98592 98091
55127 98091 97718 97644 98150 99026 99731 100167 100825 101999 103264 103977 104080 104105 104488 105056 105189 104446 103069 101831
55109 101831 101341 101555 102015 102359 102479 102417 102405 102789 103653 104636 105467 106469 108138 110319 112245 113337 113517 112887
55091 112887 111673 110567 110405 111266 112367 113101 113712 114687 115948 117060 117843 118340 118440 117979 117112 116217 115503
$$ packed form
55217I7518N97O82P11O47K98k66m63J64J177J641J286O54J44l85r18j011n58j88
55199A01730l82p39o01m0L36K79Q9O3K02L71M49L28P6l8J01J96p4n69q08n53p5
55178A00341J46j72q64j385j167j27J206K138K317J842J051K69l80r44j345j203
55162A01723k57J046J746J328K64n26n61l3N78R27R41P37L83j57p78j146j069
55145A05146q38q36r57q18m85m11o39o00N2Q91J239Q89R3p64j295j249q26n01
55127I8091l73p4N06Q76P05M36O58J174J265P13J03K5L83N68J33p43j377j238
55109A01831m90K14M60L44J20o2j2L84Q64R83Q31J002J669K181J926J092J80o30
55091A12887j214j106j62Q61J101P34O11R75J261J112P83M97J00m61q67q95p14
$$ plain form
55074 115503 114980 114718 114864 115388 116001 116269 115843 114767 113596 112949 112783 112418 111419 110113 109030 108294 107877
55057 107877 108068 109143 110760 112199 113055 113280 112789 111648 110561 110484 111596 113125 114299 115005 115366 115342 115011
55040 115011 114768 114754 114518 113647 112466 111638 111269 110911 110368 110042 110437 111582 112951 113745 113394 112090 110763
55023 110763 110236 110481 110960 111421 111891 112107 111688 110915 110654 111232 112013 112397 112636 113228 114044 114628 114897 114981 114712
55004 114712 113964 113212 113032 113219 113083 112570 112356 112835 113725 114745 115919 117059 117703 117890 118325 119383 120516
54987 120516 121061 121071 120893 120536 119995 119725 120123 120908 121588 122230 123057 123639 123270 122144 121404 121876 123291 124819
54969 124819 125896 126410 126559 126730 127200 127761 127874 127242 126029 124596 123325 122672 122935 123821 124546 124558 124022 123601
54951 123601 123913 125113 126697 127716 127508 126378 125385 125397 126427 127763 128574 128573 128316 128726 130019 131308 131620
$$ packed form
55074A15503n23k62J46N24O13K68m26j076j171o47j66l65r99j306j083p36m17
55057A07877J91J075J617J439Q56K25m91j141j087p7J112J529J174P06L61k4l31
55040A15011k43j4k36q71j181q28l69l58n43l26L95J145J369P94l51j304j327
55023A10763n27K45M79M61M70K16m19p73k61N78P81L84K39N92Q16N84K69Q4k69
55004A14712p48p52j80J87j36n13k14M79Q90J020J174J140O44J87M35J058J133
54987A20516N45J0j78l57n41k70L98P85O80O42Q27N82l69j126p40M72J415J528
54969A24819J077N14J49J71M70N61J13o32j213j433j271o53K63Q86P25J2n36m21
54951A23601L12J200J584J019k08j130r93J2J030J336Q11jk57M10J293J289L12
$$ plain form
54934 131620 131095 130795 131544 133438 136234 139476 142301 143999 145026 146788 150080 154300 158547 162849 167793
54919 167793 173452 179419 185655 192602 200402 208508 216151 222811 228092 231415 232135 229914 224911 217648
54905 217648 208805 199213 189876 181729 175198 170100 166048 162736 159712 156320 152345 148546 145986 144839
54891 144839 144330 143827 143434 143458 143932 144935 146793 149459 152100 153853 154839 156051 158294 161607 165672 170432
54875 170432 176115 182804 190169 197742 205406 213301 221046 227352 230844 231242 229356 225998 221361 215475
54861 215475 208701 201553 194378 187417 180853 174684 168852 163522 158843 154469 149886 145321 141716 139552
54847 139552 138286 137234 136325 135593 134603 133031 131377 130346 129779 128811 127038 125058 123825 123724 124183 124077
54831 124077 122807 121095 120295 120798 121698 122272 123001 124476 126055 126550 125839 124861 124194 123598 122907 122463 122474 122658
$$ packed form
54934A31620n25l00P49J894K796L242K825J698J027J762L292M220M247M302M944
54919A67793N659N967O236O947P800Q106P643O660N281L323P20k221n003p263
54905B17648q843r592r337q147o531n098m052l312l024l392l975l799k560j147
54891A44839n09n03l93K4M74J003J858K666K641J753R86J212K243L313M065M760
54875A70432N683O689P365P573P664P895P745O306L492L98j886l358m637n886
54861B15475o774p148p175o961o564o169n832n330m679m374m583m565l605k164
54847A39552j266j052r09p32r90j572j654j031n67r68j773j980j233j01M59j06
54831A24077j270j712q00N03R00N74P29J475J579M95p11r78o67n96o91m44J1J84
$$ plain form
54813 122658 122778 123032 123724 124958 126712 128849 130966 132579 133475 133617 132951 131740 130826 130903 131604 131963 131721
54796 131721 131543 131891 132393 132495 132133 131560 131033 130869 131289 131975 132243 131885 131424 131430 131984 132927 134172 135550 136816
54777 136816 137991 139393 141195 143322 145776 148595 151501 154193 157042 160776 165356 169992 174604 180442
54763 180442 188626 198701 209206 219126 228141 236015 242575 247993 252202 254121 252236 246127 237017 226868
54749 226868 217263 208929 201669 194691 187493 180569 174867 170582 166928 163164 159456 156541 154913 154506
54735 154506 154870 155415 155661 155499 155210 155197 155732 156824 158175 159295 159962 160753 162908 167398 174015 181486 188623
54718 188623 195299 202155 209420 216421 222445 227577 232045 234943 234519 229954 222272 213182 203667 194110
54704 194110 185078 177172 170404 164481 159578 156119 153864 151879 149558 147183 145381 144498 144583 145437 146444
$$ packed form
54813A22658J20K54O92J234J754K137K117J613Q96J42o66j211r14P7P01L59k42
54796A31721j78L48N02J02l62n73n27j64M20O86K68l58m61ON54R43J245J378J266
54777A36816J175J402J802K127K454K819K906K692K849L734M580M636M612N838
54763A80442Q184J0075J0505R920R015P874O560N418M209J919j885o109r110j0149
54749B26868r605q334p260o978p198o924n702m285l654l764l708k915j628m07
54735A54506L64N45K46j62k89j3N35J092J351J120O67P91K155M490O617P471P137
54718A88623O676O856P265P001O024N132M468K898m24m565p682r090r515r557
54704A94110r032p906o768n923m903l459k255j985k321k375j802q83Q5Q54J007
$$ plain form
54689 146444 146789 146167 145055 144080 143343 142511 141335 139929 138722 138274 138853 140015 140782 140483 139358 138220
54673 138220 137621 137444 137231 136740 136176 135965 136378 137403 138806 140105 140542 139588 137695 136186 136007 136873 137952
54656 137952 139001 140238 141439 142051 142140 142348 142753 142638 141726 140761 140323 139804 138343 136277 134777 134332 134399
54639 134399 134466 134629 135032 135463 135788 136270 137108 138022 138546 138512 138054 137351 136556 135870 135531 135736 136490 137399 137752
54620 137752 137096 135713 134342 133493 133259 133590 134284 134886 135098 135305 136099 137249 137805 137456 137030 137242 137660 137562
54602 137562 137202 137332 137774 137484 136083 134511 133929 134569 135920 137410 138535 138842 138313 137563 137288 137601 138172
54585 138172 138788 139508 140395 141340 142054 142130 141336 140070 139298 139708 141041 142476 143498 144107 144337 144051 143284 142430
54567 142430 141940 141967 142359 142813 143018 142842 142467 142224 142260 142491 142885 143564 144552 145563 146137 146006 145354 144736 144631
$$ packed form
54689A46444L45o22j112r75p37q32j176j406j207m48N79J162P67k99j125j138
54673A38220n99j77k13m91n64k11M13J025J403J299M37r54j893j509j79Q66J079
54656A37952J049J237J201O12Q9K08M05j15r12r65m38n19j461k066j500m45O7
54639A34399O7J63M03M31L25M82Q38R14N24l4m58p03p95o86l39K05P54R09L53
54620A37752o56j383j371q49k34L31O94O02K12K07P94J150N56l49m26K12M18r8
54602A37562l60J30M42k90j401j572n82O40J351J490J125L07n29p50k75L13N71
54585A38172O16P20Q87R45P14P6p94j266p72M10J333J435J022O09K30k86p67q54
54567A42430m90K7L92M54K05j76l75k43L6K31L94O79R88J011N74j31o52o18j05
$$ plain form
54548 144631 144890 144764 143733 142261 141458 141963 143447 145225 146996 148778 150435 151682 152495 153187 154000 154784
54532 154784 155188 155143 155082 155642 157085 159049 160891 162272 163296 164211 165119 165996 166756 167217 167162 166547 165529 164340
54514 164340 163271 162682 162697 162795 162116 160443 158592 157554 157481 157780 157913 157692 157056 156142 155513 155718 156493 156893
54496 156893 156395 155443 154661 154065 153451 153112 153552 154634 155642 156258 156879 157841 158766 159059 158748 158451 158643 159316
54478 159316 160348 161815 163749 165753 167177 167754 167959 168618 170142 172221 174253 175849 176827 176972 176253 175287
54462 175287 175066 175907 176970 177229 176749 176533 177171 178163 178795 179184 179988 181263 182135 181767 180346 178890 178185
54445 178185 178176 178372 178549 178783 178927 178482 177175 175436 173987 173090 172506 172056 171847 171881 171809 171238 170098 168617
54427 168617 167151 166086 165574 165335 165019 164843 165425 166763 167940 168264 168280 169050 170687 172229 172911 172972 173118
$$ packed form
54548A44631K59j26j031j472q03N05J484J778J771J782J657J247Q13O92Q13P84
54532A54784M04m5o1N60J443J964J842J381J024R15R08Q77P60M61n5o15j018j189
54514A64340j069n89J5R8o79j673j851j038p3K99J33k21o36r14o29K05P75M00
54496A56893m98r52p82n96o14l39M40J082J008O16O21R62R25K93l11k97J92O73
54478A59316J032J467J934K004J424N77K05O59J524K079K032J596R78J45p19r66
54462A75287k21Q41J063K59m80k16O38R92O32L89Q04J275Q72l68j421j456p05
54445A78185rJ96J77K34J44m45j307j739j449q97n84m50k09L4p2n71j140j481
54427A68617j466j065n12k39l16j76N82J338J177L24J6P70J637J542O82O1J46
$$ plain form
54410 173118 173728 174747 175867 176559 176209 174584 172128 169749 168324 168254 169180 170194 170628 170674 170998 171832 172821
54393 172821 173673 174451 175151 175524 175582 175870 176891 178523 180240 181677 182731 183379 183683 183814 183850 183652 183094 182244
54375 182244 181160 179721 177873 175916 174350 173569 173751 174821 176358 177734 178542 178767 178490 177778 176963 176639
54359 176639 177016 177510 177365 176513 175576 175133 175272 175709 176052 176038 175782 175706 176067 176641 177014 176939 176233 174699 172531
54340 172531 170541 169508 169373 169478 169454 169432 169435 169086 168069 166547 164951 163621 162704 162187 161877 161512 161001 160523
54322 160523 160391 160843 161861 163082 163991 164343 164303 164079 163670 163123 162749 162837 163377 164305 165709 167433 168850 169516
54304 169516 169813 170388 171154 171460 171186 170981 171359 172166 173062 173981 174924 175830 176853 178310 180127 181786 183028
54287 183028 184150 185371 186382 186876 187141 187663 188420 188950 188959 188552 187944 187150 185881 183735 180731 177664 175513
$$ packed form
54410A73118O10J019J120O92l50j625k456k379j425p0R26J014M34M6L24Q34R89
54393A72821Q52P78P00L73N8K88J021J632J717J437J054O48L04J31L6j98n58q50
54375A82244j084j439j848j957j566p81J82J070J537J376Q08K25k77p12q15l24
54359A76639L77M94j45q52r37m43J39M37L43j4k56p6L61N74L73p5p06j534k168
54340A72531j990j033j35J05k4k2Ll49j017j522j596j330r17n17l10l65n11m78
54322A60523j32M52J018J221R09L52m0k24m09n47l74Q8N40R28J404J724J417O66
54304A69516K97N75P66L06k74k05L78Q07Q96R19R43R06J023J457J817J659J242
54287A83028J122J221J011M94K65N22P57N30Rm07o08p94j269k146l004l067k151
$$ plain form
54270 175513 174337 173179 171294 169030 167233 166288 166154 166852 168209 169374 169393 168361 167468 167656 168549 168888
54254 168888 167792 165551 163392 162580 163543 165628 167664 168826 169086 168996 169063 169190 168744 167387 165767 165043 165642
54237 165642 166824 167611 167701 167271 166466 165550 165129 165542 166233 166314 165677 165012 164838 165096 165671 166605 167595 167980 167556
54218 167556 166948 166810 167059 167303 167591 168142 168537 167899 166082 164144 163288 163545 163877 163488 162654 162150 162177 162180 161648
54199 161648 160727 160014 159963 160615 161686 162722 163362 163603 163701 163704 163308 162363 161308 160797 161044 161780 162659 163380 163599
54180 163599 163209 162689 162696 163227 163617 163504 163304 163483 163772 163537 162665 161598 160602 159491 158184 157165 157045 157805
54162 157805 158739 159146 158938 158507 158222 158205 158465 158947 159403 159497 159225 159016 159208 159608 159789 159683 159558 159533 159573 159940
54142 159940 161133 163104 164913 165599 165287 165043 165644 166799 167677 167872 167586 167042 166122 164658 162775 160750
$$ packed form
54270A75513j176j158j885k264j797r45j34O98J357J165J9j032q93J88Q93L39
54254A68888j096k241k159q12R63K085K036J162K60r0O7J27m46j357j620p24N99
54237A65642J182P87R0m30q05r16m21M13O91Q1o37o65j74K58N75R34R90L85m24
54218A67556o08j38K49K44K88N51L95o38j817j938q56K57L32l89q34n04K7Ln32
54199A61648r21p13n1O52J071J036O40K41R8Ll96r45j055n11K47P36Q79P21K19
54180A63599l90n20PN31L90j13k00J79K89k35q72j067r96j111j307j019j20P60
54162A57805R34M07k08m31k85j7K60M82M56R4k72k09J92M00J81j06j25k5M0L67
54142A59940J193J971J809O86l12k44O01J155Q78J95k86n44r20j464j883k025
$$ plain form
54126 160750 158746 156974 155930 155978 156731 157296 157341 157470 158311 159646 160781 161404 161620 161478 161047 160778 161139 161997
54108 161997 162908 163986 165775 168210 170390 171633 172146 172359 172208 171520 170610 169934 169474 168963 168514 168556 169244
54091 169244 170298 171351 172153 172593 172785 172997 173312 173554 173738 174193 174927 175306 174916 174407 174813 176166 177494
54074 177494 178202 178742 179774 181222 182448 182920 182468 181353 180336 180311 181481 183103 184257 184673 184615 184275 183661
54057 183661 182933 182481 182571 183040 183336 182907 181763 180687 180694 182103 184292 186449 188297 190026 191812 193687 195710
54040 195710 198024 200818 204258 208305 212537 216471 220230 224526 229724 235275 240466 245376 250533 255871
54026 255871 260715 264826 268803 273181 277641 281464 284458 287002 289387 291437 292808 293385 293348 292975 292432
54011 292432 291729 290815 289655 288085 285723 282271 277921 273257 268714 264333 260067 256005 252109 248082 243787
$$ packed form
54126A60750k004j772j044M8P53N65M5J29Q41J335J135O23K16j42m31k69L61Q58
54108A61997R11J078J789K435K180J243N13K13j51o88r10o76m60n11m49M2O88
54091A69244J054J053Q02M40J92K12L15K42J84M55P34L79l90n09M06J353J328
54074A77494P08N40J032J448J226M72m52j115j017k5J170J622J154M16n8l40o14
54057A83661p28m52R0M69K96m29j144j076PJ409K189K157J848J729J786J875K023
54040A95710K314K794L440M047M232L934L759M296N198N551N191M910N157N338
54026B55871M844M111L977M378M460L823K994K544K385K050J371N77l7l73n43
54011B92432p03r14j160j570k362l452m350m664m543m381m266m062l896m027m295
$$ plain form
53996 243787 239615 236118 233358 230946 228661 226731 225461 224855 224678 224627 224361 223613 222452 221251 220214 219075
53980 219075 217434 215297 213077 211193 209935 209575 210159 211073 211284 210451 209513 209691 210961 212026 211923 211120
53964 211120 210738 211116 211671 211923 212102 212713 214013 216005 218510 221075 223242 225135 227426 230370 233267 235364
53948 235364 237063 239646 243783 248869 253978 259022 264701 271713 280398 290970 303547 317935 333772
53935 333772 351104 370505 392205 415021 436245 452629 461613 462029 454366 440702 424081 407313
53923 407313 392023 378797 368028 360240 355491 352921 351322 350132 349597 350023 351280 353176 355991 360203
53909 360203 365704 371622 377104 382067 386910 391601 395508 398205 400071 401705 403010 403297 402222 400150
53895 400150 397620 394837 391848 388695 385218 381068 376202 370991 365573 359523 352563 345230 338286 331668
$$ packed form
53996B43787m172l497k760k412k285j930j270o06j77n1k66p48j161j201j037j139
53980B19075j641k137k220j884j258l60N84R14K11q33r38J78J270J065j03q03
53964B11120l82L78N55K52J79O11J300J992K505K565K167J893K291K944K897K097
53948B35364J699K583M137N086N109N044N679P012Q685J0572J2577J4388J5837
53935C33772J7332J9401K1700K2816K1224J6384Q984M16p663j3664j6621j6768
53923D07313j5290j3226j0769p788m749k570j599j190n35M26J257J896K815M212
53909C60203N501N918N482M963M843M691L907K697J866J634J305K87j075k072
53895D00150k530k783k989l153l477m150m866n211n418o050o960p333o944o618
$$ plain form
53881 331668 324660 317049 309555 303021 297652 293147 289165 285459 281871 278386 275038 271788 268727 266261
53867 266261 264681 263556 262068 260009 257945 256271 254715 253028 251536 250536 249631 248301 246780 245691
53853 245691 244992 244012 242534 241194 240546 240293 239761 238766 237607 236479 235340 234293 233614 233283 232854 232063 231338
53836 231338 231289 231796 232025 231450 230405 229473 228777 228234 228039 228267 228250 227102 224922 222829 221712 221503 221765 222267
53818 222267 222703 222521 221546 220305 219349 218705 218372 218751 220023 221609 222968 224572 227298 231084 234915 238042
53802 238042 240531 242751 245105 248208 252498 257515 262274 266571 271195 276634 282273 287244 291427 295140
53788 295140 298380 300971 303090 305140 307275 309438 311609 313577 314734 314611 313531 312251 310990 309277
53774 309277 306807 304003 301506 299392 297190 294540 291582 288651 285896 283378 281457 280711 281387 283199 285879
$$ packed form
53881C31668p008p611p494o534n369m505l982l706l588l485l348l250l061k466
53867B66261j580j125j488k059k064j674j556j687j492j000r05j330j521j089
53853B45691o99r80j478j340o48k53n32r95j159j128j139j047o79l31m29p91p25
53836B31338m9N07K29n75j045r32o96n43j95K28j7j148k180k093j117k09K62N02
53818B22267M36j82r75j241r56o44l33L79J272J586J359J604K726L786L831L127
53802B38042K489K220K354L103M290N017M759M297M624N439N639M971M183L713
53788B95140L240K591K119K050K135K163K171J968J157j23j080j280j261j713
53774C09277k470k804k497k114k202k650k958k931k755k518j921p46O76J812K680
$$ plain form
53759 285879 289673 294987 301765 309675 318794 329498 341447 353049 362117 366860 366254 360079 349058
53746 349058 334726 318821 302758 287650 274394 263434 254666 247837 242843 239478 237236 235698 234871
53733 234871 234784 234936 234579 233570 232591 232419 233103 233911 234086 233679 233607 234639 236364 237581 237769 237633 237934 238348
53715 238348 238084 237216 236652 236942 237796 238754 239685 240576 241497 242934 245488 248922 252069 254124 255614 257609
53699 257609 260308 262944 264912 266412 267990 269980 272577 275996 280222 284745 288853 292129 294528 296029
53685 296029 296528 296054 294904 293370 291487 289225 286876 285032 284127 284150 284776 285622 286348 286695 286566 285968 284936
53668 284936 283703 283007 283792 286312 289705 292737 294875 296424 297838 299356 301281 304055 307760 311696 314710
53653 314710 315911 315072 312532 308869 304633 300235 295987 292147 288834 285956 283386 281181 279529 278418
$$ packed form
53759B85879L794N314O778P910R119J0704J1949J1602R068M743o06o175j1021
53746C49058j4332j5905j6063j5108j3256j0960q768o829m994l365k242j538q27
53733B34871q7J52l57j009r79j72O84Q08J75m07p2J032J725J217J88j36L01M14
53715B38348k64q68n64K90Q54R58R31Q91R21J437K554L434L147K055J490J995
53699B57609K699K636J968J500J578J990K597L419M226M523M108L276K399J501
53685B96029M99m74j150j534j883k262k349j844r05K3O26Q46P26L47j29n98j032
53668B84936j233o96P85K520L393L032K138J549J414J518J925K774L705L936L014
53653C14710J201q39k540l663m236m398m248l840l313k878k570k205j652j111
$$ plain form
53639 278418 277472 276214 274514 272783 271649 271408 271767 272242 272717 273412 274346 275237 276041 277205 279076 281381
53623 281381 283632 285708 287608 288971 289556 290090 291841 295188 299261 303171 306973 311007 314963 318239 320852
53608 320852 323350 326011 328711 331477 334552 337831 340757 342972 344671 346129 347256 347914 348421 349353 350874
53593 350874 352472 353408 353265 352103 350317 348450 347001 346127 345457 344370 342667 340911 339870 339593 339247 337984
53577 337984 335802 333445 331685 330888 331028 331659 331844 330574 327615 323857 320636 318662 317637 316779 315623
53562 315623 314377 313660 313924 315048 316425 317421 317758 317569 317299 317558 318827 321027 323475 325520 327247 329270
53546 329270 331785 334189 335946 337573 340192 344047 348002 350902 353150 356360 361526 368029 374616 380896
53532 380896 387493 395002 403322 411933 420417 428640 436826 445666 456042 468279 481807 495750 509717
$$ packed form
53639B78418r46j258j700j731j134k41L59M75M75O95R34Q91Q04J164J871K305
53623B81381K251K076J900J363N85N34J751L347M073L910L802M034L956L276K613
53608C20852K498K661K700K766L075L279K926K215J699J458J127O58N07R32J521
53593C50874J598R36j43j162j786j867j449q74o70j087j703j756j041k77l46j263
53577C37984k182k357j760p97J40O31J85j270k959l758l221j974j025q58j156
53562C15623j246p17K64J124J377R96L37j89k70K59J269K200K448K045J727K023
53546C29270K515K404J757J627K619L855L955K900K248L210N166O503O587O280
53532C80896O597P509Q320Q611Q484Q223Q186Q840J0376J2237J3528J3943J3967
$$ plain form
53519 509717 523786 538012 552372 567165 582948 599947 617913 636742 656758 678119 700355
53508 700355 722990 746306 770896 796574 822381 847741 872955 898289 923226 947139 970302
53497 970302 993575 1017253 1040812 1063824 1086565 1109457 1132268 1154171 1174456 1192985 1210114
53486 1210114 1226360 1242171 1257766 1273051 1287631 1300968 1312747 1323200 1332996 1342626 1351921 1360346
53474 1360346 1367638 1373845 1378667 1381222 1380786 1377632 1372733 1366690 1359205 1349655 1337803 1323803 1307901
53461 1307901 1290496 1272343 1254212 1236204 1217680 1198051 1177397 1156183 1134568 1112286 1089135
53450 1089135 1065352 1041553 1018440 996483 975640 955465 935693 916714 899229 883558 869510
53439 869510 856898 845786 836216 828078 821362 816255 812823 810844 810100 810602 812432 815643 820376 826783
$$ packed form
53519E09717J4069J4226J4360J4793J5783J6999J7966J8829K0016K1361K2236
53508G00355K2635K3316K4590K5678K5807K5360K5214K5334K4937K3913K3163
53497I70302K3273K3678K3559K3012K2741K2892K2811K1903K0285J8529J7129
53486A210114J6246J5811J5595J5285J4580J3337J1779J0453R796R630R295Q425
53474A360346P292O207M822K555m36l154m899o043p485r550j1852j4000j5902
53461A307901j7405j8153j8131j8008j8524j9629k0654k1214k1615k2282k3151
53450A089135k3783k3799k3113k1957k0843k0175j9772j8979j7485j5671j4048
53439H69510j2612j1112r570q138o716n107l432j979p44N02J830L211M733O407
$$ plain form
53425 826783 834739 844005 854785 867652 882671 899048 916055 933910 953379 974807 997974 1022528
53413 1022528 1048067 1074114 1100589 1128179 1157678 1189168 1222373 1257542 1295238 1335307 1376764
53402 1376764 1418912 1461989 1506635 1553238 1601934 1652671 1705047 1758481 1812668 1867470 1922358
53391 1922358 1976565 2029956 2083203 2136841 2190565 2243620 2295332 2345016 2391912 2435608 2476187
53380 2476187 2513749 2548206 2579625 2608119 2633088 2653275 2668062 2678135 2684336 2686442 2683767 2676443
53368 2676443 2665150 2649701 2628705 2600741 2565385 2523174 2475166 2422563 2366349 2307200 2245880
53357 2245880 2183520 2121124 2059098 1997712 1937726 1879914 1824158 1769711 1716316 1664406 1614187
53346 1614187 1565274 1517417 1470915 1425994 1382303 1339435 1297555 1257256 1219008 1183022 1149326
$$ packed form
53425H26783P956R266J0780J2867J5019J6377J7007J7855J9469K1428K3167K4554
53413A022528K5539K6047K6475K7590K9499L1490L3205L5169L7696M0069M1457
53402A376764M2148M3077M4646M6603M8696N0737N2376N3434N4187N4802N4888
53391A922358N4207N3391N3247N3638N3724N3055N1712M9684M6896M3696M0579
53380B476187L7562L4457L1419K8494K4969K0187J4787J0073O201K106k675p324
53368B676443j1293j5449k0996k7964l5356m2211m8008n2603n6214n9149o1320
53357B245880o2360o2396o2026o1386n9986n7812n5756n4447n3395n1910n0219
53346A614187m8913m7857m6502m4921m3691m2868m1880m0299l8248l5986l3696
$$ plain form
53335 1149326 1117802 1088362 1061221 1036709 1014746 994841 976739 960711 947000 935297 924969
53324 924969 915446 906288 897282 888761 881475 875811 871443 868037 865875 865384 866397 868462 871646 876401
53310 876401 882689 889931 897967 907494 919206 932817 947290 961827 976367 991317 1007216 1024639
53298 1024639 1043994 1065205 1087839 1111724 1137229 1164632 1193380 1222385 1251094 1279845 1308975
53287 1308975 1337926 1365631 1391538 1415795 1438466 1459033 1476842 1491685 1503785 1513441 1520835 1525959
53275 1525959 1528521 1528081 1524462 1517966 1509115 1498301 1485701 1471312 1454921 1436256 1415393 1392899
53263 1392899 1369367 1344884 1319115 1291816 1263091 1233178 1202259 1170557 1138450 1106343 1074364
53252 1074364 1042266 1009738 976889 944402 913095 883329 854889 827405 800711 774812 749641
$$ packed form
53335A149326l1524k9440k7141k4512k1963j9905j8102j6028j3711j1703j0328
53324I24969r523r158r006q521p286n664m368l406k162m91J013K065L184M755
53310H76401O288P242Q036R527J1712J3611J4473J4537J4540J4950J5899J7423
53298A024639J9355K1211K2634K3885K5505K7403K8748K9005K8709K8751K9130
53287A308975K8951K7705K5907K4257K2671K0567J7809J4843J2100R656P394N124
53275A525959K562m40l619o496q851j0814j2600j4389j6391j8665k0863k2494
53263A392899k3532k4483k5769k7299k8725k9913l0919l1702l2107l2107l1979
53252A074364l2098l2528l2849l2487l1307k9766k8440k7484k6694k5899k5171
$$ plain form
53241 749641 724966 700484 676103 652247 629797 609385 590696 572756 555064 538197 523109
53230 523109 510113 498806 488767 479887 472056 464894 457966 451081 444264 437554 430896 424192 417366
53217 417366 410445 403562 396838 390220 383464 376355 369037 362097 356193 351382 346927 341974 336419 330892
53203 330892 325919 321498 317553 314351 312058 310127 307642 304260 300535 297295 294979 293530 292563 291518
53189 291518 289915 287670 285113 282651 280484 278595 276786 274757 272365 269890 267828 266349 265159 263995
53175 263995 263004 262467 262326 262209 261882 261465 261243 261333 261517 261368 260655 259689 259119 259270 259875 260572 261449 262743 264219
53156 264219 265309 265860 266325 267038 267706 267861 267540 267183 267017 266859 266438 265643 264503 263232 262252 261927 262237 262931
53138 262931 263911 265178 266452 267298 267694 268025 268404 268488 268279 268518 269723 271218 271782 271087 269800 268409 266806
$$ packed form
53241G49641k4675k4482k4381k3856k2450k0412j8689j7940j7692j6867j5088
53230E23109j2996j1307j0039q880p831p162o928o885o817o710o658o704o826
53217D17366o921o883o724o618o756p109p318o940n904m811m455m953n555n527
53203C30892m973m421l945l202k293j931k485l382l725l240k316j449r67j045
53189B91518j603k245k557k462k167j889j809k029k392k475k062j479j190j164
53175B63995r91n37j41j17l27m17k22R0J84j49p13r66n70J51O05O97Q77J294J476
53156B64219J090N51M65P13O68J55l21l57j66j58m21p95j140j271r80l25L10O94
53138B62931R80J267J274Q46L96L31L79Q4k09K39J205J495N64o95j287j391j603
$$ plain form
53121 266806 265171 264330 264672 265315 265047 263782 262478 261844 261765 261895 262161 262539 262847 262961 262897 262566 261783 260649
53103 260649 259588 258831 258120 257073 255539 253460 250806 247985 245912 245135 245085 244673 243600 242579 242254 242396
53087 242396 242368 241924 241207 240267 238994 237479 236147 235438 235440 235786 235857 235280 234348 233792 233982 234545 234945 235168 235501
53068 235501 235834 235706 235032 234320 234033 234128 234404 234900 235615 236194 236238 235815 235325 234974 234672 234396 234277 234314 234247 233796
53048 233796 232932 231934 231234 231069 231122 230680 229449 228105 227661 228357 229463 230215 230551 230869 231447 232344 233494 234584
53030 234584 234993 234233 232445 230302 228480 227365 227104 227617 228508 229166 229118 228273 226850 225203 223778 223083 223459
53013 223459 224759 226318 227392 227709 227579 227514 227838 228629 229791 230982 231669 231500 230643 229587 228694 228071 227763
52996 227763 227779 228014 228402 229093 230085 230708 230017 227969 225834 225053 225828 227070 227559 226926 225701 224756 224655 225236
$$ packed form
53121B66806j635q41L42O43k68j265j304o34p9J30K66L78L08J14o4l31p83j134
53103B60649j061p57p11j047j534k079k654k821k073p77n0m12j073j021l25J42
53087B42396k8m44p17r40j273j515j332p09KL46P1n77r32n56J90N63M00K23L33
53068B35501L33j28o74p12k87R5K76M96P15N79M4m23m90l51l02k76j19L7o7m51
53048B33796q64r98p00j65N3m42j231j344m44O96J106P52L36L18N78Q97J150J090
53030B34584M09p60j788k143j822j115k61N13Q91O58m8q45j423j647j425o95L76
53013B23459J300J559J074L17j30o5L24P91J162J191O87j69q57j056q93o23l08
52996B27763J6K35L88O91R92O23o91k048k135p81P75J242M89o33j225r45j01N81
$$ plain form
52978 225236 225796 225839 225622 225862 226975 228807 230958 233105 235012 236512 237622 238498 239262 239982 240834 242050
52962 242050 243584 244936 245504 245153 244408 244005 244257 244874 245387 245604 245523 244955 243573 241424 239075 237050 235326
52945 235326 233639 232089 231054 230543 230015 229007 227730 226801 226481 226323 225632 224220 222613 221529 221244 221541
52929 221541 222137 222874 223518 223720 223392 222910 222696 222763 222908 223152 223633 224135 224163 223558 222729 222158 221917 221824 221815 221875 221775
52908 221775 221184 220158 219335 219442 220551 221859 222337 221685 220580 219972 220205 220936 221683 222186 222344 222208 222189 222899
52890 222899 224436 225991 226559 226072 225481 225646 226457 227204 227494 227368 226721 225198 222892 220701 219582 219599 220001
52873 220001 220128 219948 219766 219795 220037 220335 220473 220421 220516 221210 222685 224831 227422 229975 231655 231942 231438 231452
52855 231452 232606 234370 236129 238010 240236 242285 243364 243389 242872 242075 240878 239301 237576 235700 233429
$$ packed form
52978B25236N60M3k17K40J113J832K151K147J907J500J110Q76P64P20Q52J216
52962B42050J534J352N68l51p45m03K52O17N13K17q1n68j382k149k349k025j724
52945B35326j687j550j035n11n28j008j277r29l20j58o91j412j607j084k85K97
52929B21541N96P37O44K02l28m82k14O7J45K44M81N02K8o05q29n71k41r3rO0j00
52908B21775n91j026q23J07J109J308M78o52j105o08K33P31P47N03J58j36j9P10
52890B22899J537J555N68m87n91J65Q11P47K90j26o47j523k306k191j119J7M02
52873B20001J27j80j82K9K42K98J38n2R5O94J475K146K591K553J680K87n04J4
52855B31452J154J764J759J881K226K049J079K5n17p97j197j577j725j876k271
$$ plain form
52840 233429 230682 227570 224132 220482 217100 214503 212717 211516 211014 211439 212410 213170 213607 214399 216022 218182
52824 218182 220409 222569 224483 225616 225532 224359 222595 220808 219634 219524 220216 220894 221132 221263 221709 222576
52808 222576 224146 227020 231212 235684 239453 242649 245783 248401 249291 247862 244585 240252 235542 231255
52794 231255 228093 225955 223970 221455 218474 215472 212875 211063 210213 210054 210169 210548 211363 212247 212485 212043
52778 212043 211678 211759 211752 211294 211019 211638 212733 213376 213606 214345 215750 216557 215531 213051 210759 209863 210168 210691
52760 210691 210839 210847 211266 212304 213699 215008 215826 215871 215221 214490 214353 214661 214448 213162 211587 211009 211678 212695
52742 212695 213382 214080 215365 217131 218920 220697 222715 224785 226278 226869 226865 226726 226665 226890 227829 229720 232086
52725 232086 233948 234733 234817 235007 235479 235474 234178 231726 228994 226495 223989 221357 219236 218307 218267 218207 217847 217724
$$ packed form
52840B33429k747l112l438l650l382k597j786j201n02M25R71P60M37P92J623K160
52824B18182K227K160J914J133q4j173j764j787j174j10O92O78K38J31M46Q67
52808B22576J570K874M192M472L769L196L134K618Q90j429l277m333m710m287
52794B31255l162k138j985k515k981l002k597j812q50j59J15L79Q15Q84K38m42
52778B12043l65Q1pm58k75O19J095O43K30P39J405Q07j026k480k292q96L05N23
52760B10691J48QM19J038J395J309Q18M5o50p31j37L08k13j286j575n78O69J017
52742B12695O87O98J285J766J789J777K018K070J493N91mj39o1K25R39J891K366
52725B32086J862P85Q4J90M72nj296k452k732k499k506k632k121r29m0o0l60j23
$$ plain form
52707 217724 218123 218544 218458 217993 217578 217352 217327 217655 218310 218844 218898 218680 218516 218293 217826 217452 217602 217938 217621 216506
52687 216506 215466 215401 216335 217585 218398 218359 217657 217063 217270 218172 219176 220182 221672 223721 225563 226490 226646
52670 226646 226551 226282 225659 224909 224563 224819 225433 226188 227163 228493 230067 231410 231869 231192 230115 230061 231894 235105
52652 235105 238396 240890 242599 244067 245883 248231 250491 251472 250444 247804 244407 240547 236091 231422
52638 231422 227567 225234 224228 223966 224206 225070 226632 228715 231033 233396 235828 238452 241258 244091 246893
52623 246893 249684 252193 253854 254467 254477 254189 253080 250511 246893 243447 240833 238709 236634 234702 233087
52608 233087 231713 230685 230464 231175 232150 232587 232360 231886 231558 231619 232183 232917 233036 232131 230820 230157 230525 231487
52590 231487 232553 233597 234568 235289 235654 235725 235577 235256 234947 234939 235392 236337 237848 239972 242428 244602 245970
$$ packed form
52707B17724L99M21q6m65m15k26k5L28O55N34N4k18j64k23m67l74J50L36l17j115
52687B16506j040o5R34J250Q13l9p02n94K07R02J004J006J490K049J842R27J56
52670B26646r5k69o23p50l46K56O14P55R75J330J574J343M59o77j077n4J833L211
52652B35105L291K494J709J468J816K348K260R81j028k640l397l860m456m669
52638B31422l855k333j006k62K40Q64J562K083K318K363K432K624K806K833K802
52623B46893K791K509J661O13J0k88j109k569l618l446k614k124k075j932j615
52608B33087j374j028k21P11R75M37k27m74l28O1N64P34J19r05j311o63L68R62
52590B31487J066J044R71P21L65P1j48l21l09qM53R45J511K124K456K174J368
$$ plain form
52573 245970 246467 246448 246376 246520 246792 246830 246334 245307 243996 242687 241617 240900 240379 239709 238769 237876 237379 237212
52555 237212 237093 237036 237284 237816 238288 238508 238599 238620 238406 237987 237811 238270 239211 240190 241030 241810 242384 242300 241296 239723
52535 239723 238344 237788 238130 238862 239288 239119 238759 238893 239799 241151 242480 243539 244170 244155 243527 242838 242706 243044
52517 243044 243165 242806 242737 244031 246883 250457 253798 256588 259032 261382 263753 266132 268396 270353 271821
52502 271821 272646 272650 271766 270176 268099 265404 261767 257301 252744 248842 245827 243721 242732 242878 243507 243773
52486 243773 243534 243301 243311 243282 243164 243485 244603 246131 247574 249121 251227 253688 255754 257131 258226 259311
52470 259311 260083 260371 260812 262341 265137 268450 271392 273623 275296 276642 277735 278526 279011 279313 279566 279648
52454 279648 279168 277842 275838 273664 271829 270657 270215 270099 269406 267354 264092 260722 258337 257162 256669
$$ packed form
52573B45970M97j9p2J44K72L8m96j027j311j309j070p17n21o70r40q93m97j67
52555B37212j19n7K48N32M72K20R1K1k14m19j76M59R41R79Q40P80N74q4j004j573
52535B39723j379n56L42P32M26j69l60J34R06J352J329J059O31j5o28o89j32L38
52517B43044J21l59o9J294K852L574L341K790K444K350K371K379K264J957J468
52502B71821Q25Mq84j590k077k695l637m466m557l902l015k106r89J46O29K66
52486B43773k39k33J0k9j18L21J118J528J443J547K106K461K066J377J095J085
52470B59311P72K88M41J529K796L313K942K231J673J346J093P91M85L02K53Q2
52454B79648m80j326k004k174j835j172m42j16o93k052l262l370k385j175m93
$$ plain form
52439 256669 256285 255792 255171 254392 253418 252292 251149 250123 249285 248628 248174 248041 248307 248756 248899 248373 247319
52422 247319 246288 245828 246158 247153 248446 249580 250190 250185 249797 249474 249636 250429 251725 253505 256221 260504 266401
52405 266401 273097 279717 286274 293617 302366 312147 321876 330546 337504 342111 343525 341198 335612 328289
52391 328289 320772 313590 306417 299192 292718 287908 284720 282250 279851 277807 276804 276956 277596 277946 277892
52376 277892 278044 279082 281069 283394 285343 286642 287519 288475 290054 292616 296097 299983 303611 306403 307861
52361 307861 307661 305994 303629 301376 299547 298080 296980 296317 295958 295645 295284 294906 294471 294046 294099 295143 297081
52344 297081 299251 301190 302988 304820 306521 307820 308665 309166 309495 310016 311245 313490 316703 320754 325595
52329 325595 331042 336749 342576 348790 355717 363477 372170 381923 392461 402942 412607 421415 429700 437367
$$ packed form
52439B56669l84m93o21p79r74j126j143j026q38o57m54j33K66M49J43n26j054
52422B47319j031m60L30R95J293J134O10nl88l23J62P93J296J780K716M283N897
52405B66401O696O620O557P343Q749R781R729Q670O958M607J414k327n586p323
52391C28289p517p182p173p225o474m810l188k470k399k044j003J52O40L50n4
52376B77892J52J038J987K325J949J299Q77R56J579K562L481L886L628K792J458
52361C07861k00j667k365k253j829j467j100o63l59l13l61l78m35m25N3J044J938
52344B97081K170J939J798J832J701J299Q45N01L29N21J229K245L213M051M841
52329C25595N447N707N827O214O927P760Q693R753J0538J0481R665Q808Q285P667
$$ plain form
52315 437367 443788 448553 452083 455455 459684 465076 471171 477342 483468 489879 496741 503840 511031 518448
52301 518448 526087 533615 540898 548313 556100 563787 570769 577167 583463 589411 594001 596659 597982 599037
52287 599037 600249 601158 601061 599705 597479 595026 592707 590576 588871 588096 588292 588585 588051 586931 586449 587389
52271 587389 589344 591377 592911 593845 594386 595062 596527 599024 602282 606110 610756 616498 623185 630433 637997
52256 637997 645653 653048 660022 666942 674354 682373 690611 698614 706115 712956 719033 724326 728855 732559
52242 732559 735302 736945 737427 736951 736114 735617 735654 735793 735653 735502 735914 736904 737720 737567 736396 734968 734222 734544
52224 734544 735493 736140 735728 734129 731841 729654 728183 727478 727080 726624 726375 726957 728605 730993 733829 737189
52208 737189 741155 745475 749864 754317 758841 763186 767199 771175 775449 779762 783508 786523 789224 792060
$$ packed form
52315D37367O421M765L530L372M229N392O095O171O126O411O862P099P191P417
52301E18448P639P528P283P415P787P687O982O398O296N948M590K658J323J055
52287E99037J212R09r7j356k226k453k319k131j705p75J96K93n34j120m82R40
52271E87389J955K033J534R34N41O76J465K497L258L828M646N742O687P248P564
52256F37997P656P395O974O920P412Q019Q238Q003P501O841O077N293M529L704
52242G32559K743J643M82m76q37m97L7J39j40j51M12R90Q16j53j171j428p46L22
52224G34544R49O47m12j599k288k187j471p05l98m56k49N82J648K388K836L360
52208G37189L966M320M389M453M524M345M013L976M274M313L746L015K701K836
$$ plain form
52194 792060 795253 799054 803698 808936 813988 818249 821799 825065 828281 831485 834736 837943 840563 841840
52180 841840 841435 839671 837050 833706 829458 824384 819087 814181 809531 804356 798264 792006 786849 783322
52166 783322 780884 778822 777022 775726 774950 774503 774468 775331 777554 781057 785025 788230 789792 789805 789090 788213
52150 788213 787020 785299 783572 782719 782951 783746 784843 786681 789534 792729 795294 797128 798874 800640 801506
52135 801506 800582 798109 795139 792395 789922 787713 786145 785710 786672 789182 793431 799473 807040 815764 825524
52120 825524 836377 848264 861012 874528 888722 903183 917161 930065 941870 952903 963308
52109 963308 972865 981313 988641 994952 1000233 1004475 1008026 1011542 1015472 1019839 1024715 1030636 1038127 1046854
52095 1046854 1055757 1064177 1072435 1081077 1089916 1098122 1104841 1109274 1110443 1107627 1101149 1092237 1082052 1071281
$$ packed form
52194G92060L193L801M644N238N052M261L550L266L216L204L251L207K620J277
52180H41840m05j764k621l344m248n074n297m906m650n175o092o258n157l527
52166G83322k438k062j800j296p76m47l5Q63K223L503L968L205J562J3p15q77
52150G88213j193j721j727q53K32P95J097J838K853L195K565J834J746J766Q66
52135H01506r24k473k970k744k473k209j568m35R62K510M249O042P567Q724R760
52120H25524J0853J1887J2748J3516J4194J4461J3978J2904J1805J1033J0405
52109I63308R557Q448P328O311N281M242L551L516L930M367M876N921P491Q727
52095A046854Q903Q420Q258Q642Q839Q206O719M433J169k816o478q912j0185j0771
$$ plain form
52081 1071281 1060648 1051174 1043537 1037567 1032729 1028826 1025939 1023951 1022488 1021140 1019525 1017510 1015707 1015394
52067 1015394 1017265 1020397 1023049 1024532 1025682 1027425 1029508 1031023 1031706 1032143 1032924 1034086 1035449 1037161 1039654
52052 1039654 1043147 1047261 1051177 1054231 1056340 1057814 1058836 1059251 1058801 1057313 1054653 1050788 1045994 1040809
52038 1040809 1035625 1030514 1025546 1021100 1017698 1015708 1015212 1015895 1016950 1017451 1017124 1016563 1016467 1016869 1017328 1017483
$$ packed form
52081A071281j0633r474p637n970m838l903k887j988j463j348j615k015j803l13
52067A015394J871L132K652J483J150J743K083J515O83M37P81J162J363J712K493
52052A039654L493M114L916L054K109J474J022M15m50j488k660l865m794n185
52038A040809n184n111m968m446l402j990m96O83J055N01l27n61r6M02M59J55
$$ [...]
##END NTUPLES=NMR SPECTRUM
##END=
