
##TITLE=AC1290_VIERS11100_6615631_yTGpp5kn2d
##JCAMPDX= 6.0         $$ Bruker NMR JCAMP-DX V2.0
##DATA TYPE= NMR SPECTRUM
##DATA CLASS= NTUPLES
##ORIGIN= BRUKER
##OWNER= Administrator
$$ 1.72 TOPSPIN		Version 2.1
$$ 2012-08-02 22:13:02.296 -0500  Administrator@TOPSPIN
$$ Compression mode = diff/dup
##.OBSERVE FREQUENCY= 400.02188249412
##.OBSERVE NUCLEUS= ^1H
##.ACQUISITION MODE= SIMULTANEOUS (DQD)
##.ACQUISITION SCHEME= undefined
##.AVERAGES= 8
##.DIGITISER RES= 22
##SPECTROMETER/DATA SYSTEM= spect
##.PULSE SEQUENCE= zg30
##.SOLVENT NAME= COFFEE_meoh
##.SHIFT REFERENCE= INTERNAL, COFFEE_meoh, 1, 14.98509
##AUDIT TRAIL= $$ (NUMBER, WHEN, WHO, WHERE, PROCESS, VERSION, WHAT)
$$ ##TITLE= Audit trail, TOPSPIN		Version 2.1
$$ ##JCAMPDX= 5.01
$$ ##ORIGIN= Bruker BioSpin GmbH
$$ ##OWNER= Administrator
$$ $$ C:\Bruker\TOPSPIN/data/COFFEE/nmr/AC1290_VIERS11100_6615631_yTGpp5kn2d/10/pdata/1/auditp.txt
$$ ##AUDIT TRAIL=  $$ (NUMBER, WHEN, WHO, WHERE, PROCESS, VERSION, WHAT)
(   1,<2012-08-02 22:12:55.640 -0500>,<Administrator>,<TOPSPIN>,<go>,<TOPSPIN 2.1>,
      <created by zg
	started at 2012-08-02 22:11:48.734 -0500,
	POWCHK enabled, PULCHK disabled,
       configuration hash MD5:
       6B 1B 68 BB D9 2E 58 E2 7F 35 AD 54 07 DF 0E 41
       data hash MD5: 64K
       FB E3 A5 3F 8C 64 BF 36 0B D4 30 A5 73 CD 12 2A>)
(   2,<2012-08-02 22:12:58.265 -0500>,<Administrator>,<TOPSPIN>,<proc1d>,<TOPSPIN 2.1>,
      <Start of raw data processing
       efp LB = 0 FT_mod = 6 PKNL = 1 PHC0 = 0 PHC1 = 0 SI = 32K 
       data hash MD5: 32K
       DF A0 2B 05 97 A0 82 2B 2B F1 10 77 69 4F 35 5D>)
(   3,<2012-08-02 22:12:58.625 -0500>,<Administrator>,<TOPSPIN>,<proc1d>,<TOPSPIN 2.1>,
      <pk PHC0 = 177.7039 PHC1 = 0 
       data hash MD5: 32K
       AE B8 99 A9 D9 23 D2 5E BE A7 93 3A 05 AC 9C 44>)
(   4,<2012-08-02 22:12:58.718 -0500>,<Administrator>,<TOPSPIN>,<proc1d>,<TOPSPIN 2.1>,
      <abs ABSG = 1 
       data hash MD5: 32K
       82 48 ED 60 7E F9 63 AE 4A 57 5B F5 11 15 48 4E>)
(   5,<2012-08-02 22:12:58.750 -0500>,<Administrator>,<TOPSPIN>,<proc1d>,<TOPSPIN 2.1>,
      <abs ABSG = 2 
       data hash MD5: 32K
       78 F1 BA A9 C6 72 A4 98 64 2C 88 26 FE EE F7 05>)
(   6,<2012-08-02 22:12:58.765 -0500>,<Administrator>,<TOPSPIN>,<proc1d>,<TOPSPIN 2.1>,
      <abs ABSG = 3 
       data hash MD5: 32K
       12 9D 75 1C 7B C0 4F 51 96 D2 A7 C3 8A FE 3B 4E>)
(   7,<2012-08-02 22:12:58.796 -0500>,<Administrator>,<TOPSPIN>,<proc1d>,<TOPSPIN 2.1>,
      <abs ABSG = 4 
       data hash MD5: 32K
       4A 24 E4 BE CD 42 F3 E6 95 6A 5F B8 79 5D C2 F7>)
(   8,<2012-08-02 22:12:58.828 -0500>,<Administrator>,<TOPSPIN>,<proc1d>,<TOPSPIN 2.1>,
      <abs ABSG = 5 
       data hash MD5: 32K
       E1 CA 13 3C D8 69 92 ED 70 B6 25 F1 01 45 14 31>)
$$ ##END=
$$ 
$$ $$ hash MD5
$$ $$ 93 74 0D E8 37 A5 90 B0 A0 4B 28 1B 01 1E 09 7B
##$RELAX= 
##$RELAX= 
##$RELAX= 
##$RELAX= 
##$RELAX= 
##$RELAX= 
##$RELAX= 
$$ Bruker specific parameters
$$ --------------------------
$$ [...]
150 150 150 150 150 150 150 150
##$TP07= 0
##$TPNAME0= <>
##$TPNAME1= <>
##$TPNAME2= <>
##$TPNAME3= <>
##$TPNAME4= <>
##$TPNAME5= <>
##$TPNAME6= <>
##$TPNAME7= <>
##$TPOAL= (0..7)
0.5 0.5 0.5 0.5 0.5 0.5 0.5 0.5
##$TPOFFS= (0..7)
0 0 0 0 0 0 0 0
##$TUNHIN= 0
##$TUNHOUT= 0
##$TUNXOUT= 0
##$USERA1= <user>
##$USERA2= <user>
##$USERA3= <user>
##$USERA4= <user>
##$USERA5= <user>
##$V9= 5
##$VALIST= <valist>
##$VCLIST= <CCCCCCCCCCCCCCC>
##$VD= 0
##$VDLIST= <DDDDDDDDDDDDDDD>
##$VPLIST= <PPPPPPPPPPPPPPP>
##$VTLIST= <TTTTTTTTTTTTTTT>
##$WBST= 1024
##$WBSW= 4
##$XGAIN= (0..3)
0 0 0 0
##$XL= 0
##$YL= 0
##$YMAX_a= 487214
##$YMIN_a= -634736
##$ZGOPTNS= <>
##$ZL1= 120
##$ZL2= 120
##$ZL3= 120
##$ZL4= 120
##$ABSF1= 14.98509
##$ABSF2= -5.573092
##$ABSG= 5
##$ABSL= 3
##$ALPHA= 0
##$AQORDER= 0
##$ASSFAC= 0
##$ASSFACI= 0
##$ASSFACX= 0
##$ASSWID= 0
##$AUNMP= <proc_prof1d_extract_pilot.lims>
##$AXLEFT= 0
##$AXNAME= <>
##$AXNUC= <1H>
##$AXRIGHT= 0
##$AXTYPE= 0
##$AXUNIT= <>
##$AZFE= 0.1
##$AZFW= 0.1
##$BCFW= 0
##$BC_mod= 0
##$BYTORDP= 0
##$COROFFS= 0
##$CY= 15
##$DATMOD= 1
##$DC= 0
##$DFILT= <>
##$DTYPP= 0
##$F1P= 0
##$F2P= 0
##$FCOR= 0.5
##$FTSIZE= 32768
##$FT_mod= 6
##$GAMMA= 0
##$GB= 0
##$INTBC= 1
##$INTSCL= 1
##$ISEN= 128
##$LB= 0
##$LEV0= 0
##$LPBIN= 0
##$MAXI= 10000
##$MC2= 0
##$MEAN= 0
##$ME_mod= 0
##$MI= 0
##$NCOEF= 0
##$NC_proc= -8
##$NLEV= 6
##$NOISF1= 0
##$NOISF2= 0
##$NSP= 0
##$NTH_PI= 0
##$NZP= 0
##$OFFSET= 14.98509
##$PC= 1
##$PHC0= 177.7039
##$PHC1= 0
##$PH_mod= 1
##$PKNL= yes
##$PPARMOD= 0
##$PPDIAG= 0
##$PPIPTYP= 0
##$PPMPNUM= 2147483647
##$PPRESOL= 1
##$PSCAL= 4
##$PSIGN= 0
##$PYNMP= <proc.py>
##$REVERSE= no
##$SF= 400.02
##$SI= 32768
##$SIGF1= 0
##$SIGF2= 0
##$SINO= 400
##$SIOLD= 32768
##$SPECTYP= <>
##$SREGLST= <1H.CDCl3>
##$SSB= 0
##$STSI= 32768
##$STSR= 0
##$SW_p= 8223.68421052631
##$SYMM= 0
##$S_DEV= 0
##$TDeff= 65536
##$TDoff= 0
##$TI= <>
##$TILT= no
##$TM1= 0
##$TM2= 0
##$TOPLEV= 0
##$USERP1= <user>
##$USERP2= <user>
##$USERP3= <user>
##$USERP4= <user>
##$USERP5= <user>
##$WDW= 1
##$XDIM= 32768
##$YMAX_p= 460322119
##$YMIN_p= -728452
##$CURPLOT= <Network HP LaserJet P1505>
##$CURPRIN= <$Network HP LaserJet P1505>
##$DFORMAT= <normdp>
##$LAYOUT= <+/1D_H.xwp>
##$LFORMAT= <normlp>
##$PFORMAT= <normpl>
##$SURQMSG= 1
$$ End of Bruker specific parameters
$$ ---------------------------------
##NTUPLES= NMR SPECTRUM
##VAR_NAME=  FREQUENCY,     SPECTRUM/REAL,   SPECTRUM/IMAG
##SYMBOL=    X,             R,               I
##VAR_TYPE=  INDEPENDENT,   DEPENDENT,       DEPENDENT
##VAR_FORM=  AFFN,          ASDF,            ASDF
##VAR_DIM=   32768,         32768,           32768
##UNITS=     HZ,            ARBITRARY UNITS, ARBITRARY UNITS
##FACTOR=    0.250966925370066, 1,           1
##FIRST=     8223.43324360094, -239632,      -327691
##LAST=      0,             -98637,          -83233
##MIN=       0,             -728452,         0
##MAX=       8223.43324360094, 460322119,    0
$$ Real data points
##PAGE= N=1
##DATA TABLE= (X++(R..R)), XYDATA
$$ [...]
$$ plain form
19490 171724 -318952 99278 23221 -315390 173166 -110033 -290328 -118989 -40586 -6289
19479 44820 -156138 -240609 -113387 65256 -111929 -207715 74575 -360529 68175 88298 -117352
19467 -161232 48439 -267325 -243006 -329045 310590 -42930 -147768 -52985 32214 -18682 -170394
19456 -170394 201773 57017 -6513 253792 -232392 114000 -9682 -27424 -63657 -129196 130903
19444 -214291 -222365 -40061 -194029 33311 -231403 -152899 298138 -15799 -22198 -55165 109948
19432 241494 -137872 -25718 280242 -79668 -218829 -286648 -88977 -89692 48383 -406819 -237572
19421 -237572 -227000 155400 255846 -261256 -89563 -100159 3434 -178160 281471 -153561
19410 -1870 -57805 -306810 245218 -105776 7927 131037 -194450 25288 -6288 -139241 -21619
$$ packed form
19490A71724c18952I9278B3221c15390A73166a10033j80295a18989d0586f289
19479D4820a56138q4471a13387F5256a11929r5786G4575c60529F8175K0123a17352
19467a61232D8439b67325K4319q6039C10590d2930j04838e2985C2214a8682j51712
19456a70394B01773E7017f513B53792b32392A14000i682j7742l6233o5539A30903
19444b14291q074d0061j53968C3311b31403P8504B98138a5799o399l2967A09948
19432B41494a37872b5718B80242g9668j39161o7819h8977p15D8383d06819J69247
19421b37572J0572A55400J00446b61256h9563j0596C434a78160B81471a53561
19410a870n5935k49005B45218a05776G927J23110a94450B5288f288j32953b1619
$$ plain form
19398 442210 62502 -110839 -348373 -309599 -152044 -320307 39895 -132763 -189554 153051
19387 -130584 -636 -122937 -356529 -233637 58460 134327 65571 -40073 -417341 -205356 68032
19375 123337 -106571 -255369 65297 -176270 -293886 -121029 29004 190985 -110931 -276956
19365 -276956 11106 21159 134111 -188356 80880 -132630 -237306 169771 -87092 92067
19354 185321 -238020 -223699 95172 -17345 128339 -155807 242300 -126713 -208202 -241722
19344 -241722 106808 -447530 41961 -71579 -59681 285287 149305 -14256 1201 -241162 -63283
19332 229513 -85164 -314681 -82960 124086 28492 -138731 100911 -328196 97657 69201
19322 69201 -339012 -155179 -391653 85013 -249444 -144088 -251226 -61479 -120693 -180972
$$ packed form
19398D42210F2502a10839k37534L8774a52044j68263C9895a32763n6791A53051
19387a30584f36j22301k33592J22892E8460P5867F5571d0073l77268b05356F8032
19375A23337a06571j48798F5297a76270j17616a21029B9004J61981a10931j66025
19365b76956A1106J0053J12952a88356H0880a32630j04676A69771h7092I2067
19354A85321b38020J4321I5172a7345A28339a55807B42300a26713q1489l3520
19344b41722A06808d47530D1961g1579J1898B85287j35982a4256A201b41162f3283
19332B29513h5164k29517h2960A24086B8492a38731A00911c28196I7657k8456
19322F9201c39012a55179k36474H5013b49444J05356j07138f1479n9214o0279
$$ plain form
19312 -180972 -286818 -541246 -111264 -237229 -287567 212757 -40173 -51240 -64819 -337227
19302 -337227 -265408 -48337 -130512 -125374 -336669 53086 336317 112836 -173094 41116 -234926
19290 -268100 -2082 -40895 -221660 35240 68354 -20473 -272415 39087 -251181 -164334 195810
19278 -179402 -152581 3038 71076 -172412 28069 -177918 -33852 -400015 118907 -232896 52183
19266 -216684 -99886 -516891 -244516 123318 -46327 -188535 57524 -105348 -264867 -4410
19255 -17909 89219 -379500 -98524 361848 -47017 -220271 -121469 -145681 -231705 -147384 44954
19243 -247317 -175811 -47007 -83672 -141422 -49519 -308302 -473611 -386032 41920 76741 96163
19232 96163 162705 -200903 192394 98939 139337 -238709 277664 -378524 -326658 -155043
$$ packed form
19312a80972j05846k54428a11264j25965n0338B12757d0173j1067j3579k72408
19302c37227P1819d8337q2175N138k11295E3086K83231A12836a73094D1116b34926
19290b68100b082l8813j80765C5240L3114b0473k51942C9087b51181Q6847A95810
19278a79402K6821C038O8038a72412B8069a77918c3852l66163A18907b32896E2183
19266b16684i9886m17005b44516A23318d6327j42208E7524a05348j59519d410
19255a7909H9219c79500i8524C61848d7017j73254R8802k4212q6024Q4321D4954
19243b47317P1506d7007l6665n7750d9519k58783j65309Q7579D1920L4821J9422
19232I6163O6542b00903A92394r3455M0398b38709B77664c78524N1866a55043
$$ plain form
19221 129544 -220850 106159 76027 -21099 -97556 -62609 50944 -25112 -60833 283802 -61708
19209 355541 -88429 -123729 80758 239302 30246 -236624 -147323 -47237 -365710 -85966 72906
19197 -105986 364154 24441 -46567 64508 298195 -226336 -261894 -280337 -333825 -143391 113419
19185 72590 28387 14915 -71559 -64292 -37354 -67692 -141979 138561 -21224 -185460 -183417 172380
19172 248853 -167456 30175 106895 244724 -202663 -220264 -121059 -109924 -292222 -120683
19161 -47856 -226092 -137778 -161606 -141135 -27569 -27949 321495 91713 -240214 -130335 145576
19149 -99300 -80839 -69239 -165516 31906 23026 141830 -228329 -63147 -288155 -73546 -207607
19138 -207607 134031 65238 95402 -329354 21437 137407 -12576 -185078 7968 -205867 148491
$$ packed form
19221A29544b20850A06159l0132b1099p6457L4947E0944b5112l5721B83802f1708
19209C55541h8429l5300H0758J58544C0246b36624Q9301d7237l18473h5966G2906
19197a05986C64154B4441d6567F4508K33687b26336l5558j8443n3488a43391A13419
19185G2590B8387j3472g1559P267K6938l0338p4287A38561b1224j64236K043A72380
19172B48853a67456C0175P6720J37829b02663j7601R9205J1135j82298a20683
19161d7856j78236Q8314k3828K0471b7569l80C21495I1713b40214J09879A45576
19149i9300J8461J1600r6277C1906q880J18804b28329f3147k25008g3546j34061
19138b07607A34031F5238L0164c29354B1437J15970a2576j72502G968b05867A48491
$$ plain form
19126 212453 -96200 215021 -173869 -206120 63175 -4422 207138 -89763 -98244 289481 -204069
19114 16343 -241262 -291499 144937 -11120 -141983 195796 -93566 -134791 281710 -313357
19103 294116 100444 14007 -43797 54368 96923 -73335 68340 124742 -19792 194810 -342631
19091 -37440 102008 163824 -114091 48104 262836 -351226 -72022 -370472 -58293 187595
19080 10044 53417 94893 -76178 17061 -534 70792 -197686 -29296 -122931 101086 130140 153551
19068 153551 95302 -207214 120650 -199643 -244573 -120347 213 30487 -232473 -307883 -180342
19057 -180342 -5645 -114210 -377280 13747 75567 -28892 -198336 -30836 84312 -152373 -279596
19046 -279596 256467 89220 217766 -12343 37861 297789 23956 244371 -33947 153569
$$ packed form
19126B12453i6200B15021a73869l2251F3175d422B07138h9763q481B89481b04069
19114A6343b41262n0237A44937a1120j30863A95796i3566m1225B81710c13357
19103B94116A00444A4007d3797E4368M2555g3335F8340N6402a9792A94810c42631
19091c7440A02008O1816a14091D8104K14732c51226g2022k98450e8293A87595
19080A0044M3373M1476g6178A7061e34G0792a97686b9296r3635A01086K9054K3411
19068A53551n8249b07214A20650a99643m4930a20347B13L0274b32473p5410J27541
19057a80342e645j08565k63070A3747O1820b8892j69444c0836H4312a52373j27223
19046b79596B56467H9220J28546a2343C7861K59928B3956K20415c3947A53569
$$ plain form
19035 -225578 -193279 83011 18084 -156912 218075 -66829 -6872 -43888 -25678 -247749 -99280
19023 -197701 -140786 -118962 -211715 -243561 -286579 82505 -297434 -310755 367151 58757 -85126
19011 -61919 -353516 -10243 239 -128332 71817 27129 131191 -206506 -143012 38321 56849
19000 56849 -182071 198313 202641 190519 330351 77875 33948 -383866 55899 -236798 62065
18988 160755 9391 17088 -62970 -30924 264916 214622 -196410 -110265 -166050 126950 -226315
18976 51376 -362190 -195503 40141 -59343 -187880 -173421 -68337 77889 -74390 139618 -213931
18964 3077 -250034 58569 422101 805300 761618 380810 161813 141037 198750 58902 92436
18953 92436 147230 428213 172952 -169264 140000 -340264 -5797 182837 -184462 14353
$$ packed form
19035b25578L2299H3011A8084a56912B18075f6829f872l7016J8210k22071i9280
19023a97701N6915K1824r2753l1846m3018H2505b97434j3321C67151E8757h5126
19011f1919k91597a0243B39a28332G1817B7129J04062b06506O3494C8321J8528
19000E6849a82071A98313M328j2122J39832G7875C3948c83866E5899b36798F2065
18988A60755I391P697f2970c0924B64916n0294a96410Q6145n5785A26950b26315
18976E1376c62190J66687D0141e9343j28537J4459f8337G7889g4390A39618b13931
18964C077b50034E8569L63532L83199m3682l80808A61813k0776N7713E8902L3534
18953I2436N4794K80983A72952a69264A40000c40264e797A82837a84462A4353
$$ plain form
18942 -115211 -78757 1446 117003 119194 -234231 -33012 21874 -326940 -35016 -47011 -185529
18931 -185529 -64021 -20110 -87924 -236551 -77553 127681 139529 137037 -30752 22724 -13765
18919 30894 62459 -301089 -77676 -63092 121184 3012 -40065 4181 -141181 -80061 -12891
18907 190643 20349 -248816 -207178 -233010 -32444 188339 -520562 117863 -36558 393457
18896 761511 734155 163523 -124394 53283 -267203 301814 165584 -240311 -91884 57385
18885 44045 -96042 -374915 -116765 168257 5033 -262897 116290 31402 -82157 -151564 -363394
18874 -363394 -185645 6873 201599 -171621 284983 -270167 -13607 -149535 109003 -339226
18863 -362785 -332743 135068 183659 -13028 -18510 -57509 103850 43138 -105191 -55454 -320387
$$ packed form
18942a15211L6454A446J15557K191b34231c3012B1874c26940c5016j1995j38518
18931a85529f4021b0110o7814j48627g7553A27681J1848k492c0752B2724a3765
18919C0894L1565c01089g7676J4584A21184C012d0065D181a41181O1120a2891
18907A90643B0349b48816M1638k5832c2444A88339e20562A17863c6558C93457
18896G61511k7356A63523a24394E3283b67203C01814j36230b40311i1884E7385
18885D4045i6042k78873a16765A68257E033b62897A16290C1402h2157o9407k11830
18874c63394J77749F873J94726a71621B84983b70167a3607j35928A09003c39226
18863c62785L0042A35068M8591a3028n482l8999A03850D3138a05191M9737k64933
$$ plain form
18852 -320387 -35755 -155724 -330211 -520239 137199 -66109 240715 -123223 208970 -8567
18841 39015 -217312 -109263 169627 -140565 -403834 -195718 361207 -20477 -25710 -152476
18831 -152476 -197489 -117301 -50888 64239 9454 -606878 -39860 217373 -121904 4848 -55864
18819 -178304 -225198 18136 133286 70795 -341974 -50869 -43765 55427 -281304 -118411 142163
18807 -18959 83215 -36982 -83285 28043 -18376 -156748 -94381 -148447 19102 121368 65806
18796 65806 -52228 -87562 -59385 110437 -82712 177861 -149762 -138891 -237930 385160 -25749
18784 -124610 -355896 -101893 369345 -372790 -252665 162484 49126 88051 -210432 -97571
18773 -174916 123571 234126 149241 19531 -30594 -76806 -38414 55027 -275272 -228602 79931
$$ packed form
18852c20387c5755j19969j74487j90028A37199f6109B40715a23223B08970h567
18841C9015b17312J08049A69627a40565k63269a95718C61207b0477n233j26766
18831a52476m5013Q0188e0888F4239I454f06878c9860B17373a21904D848e5864
18819a78304m6894A8136J15150o2491c41974e0869P104E5427b81304a18411A42163
18807a8959H3215c6982m6303B8043a8376j38372O2367n4066A9102J02266n5562
18796F5806e2228l5334K8177A10437h2712A77861a49762J0871r9039C85160b5749
18784a24610k31286a01893C69345c72790J20125A62484D9126L8925b10432i7571
18773a74916A23571J10555q4885A9531c0594m6212L8392E5027b75272M6670G9931
$$ plain form
18761 41905 31660 -152519 -21540 -100982 -116978 41289 -103452 -71614 112593 13890 -76539
18749 -206857 101324 19892 4334 -48640 77612 118433 51658 -107755 -60044 259459 144071
18738 144071 -132556 29381 -191995 -68111 207407 -38820 47486 23931 -195324 20696 -220669
18726 -62853 -141013 -77515 -99360 -100182 112201 -140125 -334218 -119995 4788 -175352 -145408
18715 -145408 151109 211552 20643 -300928 -62066 -3322 -179443 97726 -44901 -220732 -2005
18703 18298 -294421 -30133 29647 230985 -65897 -219260 86881 333528 -342595 153064
18692 -110405 -161904 199668 -121764 -103358 116537 -96613 -93725 -227370 10622 109526 219411
18681 219411 -86984 -61844 111082 -172737 -46448 142687 -340884 36600 113113 2621 317200
$$ packed form
18761D1905j0245a52519b1540p9442j5996D1289a03452L1838A12593A3890g6539
18749b06857A01324A9892D334d8640G7612M0821E1658a07755M7711B59459j15388
18738A44071a32556B9381a91995f8111B07407c8820D7486k3555a95324B0696b20669
18726f2853p8160O3498k1845q22A12201a40125j94093a19995D788a75352K9944
18715a45408A51109O0443B0643c00928f2066c322j76121I7726d4901j75831b005
18703A8298b94421c0133B9647K01338f5897j53363H6881K46647c42595A53064
18692a10405n1499A99668a21764J8406A16537i6613K888j33645A0622R8904J09885
18681B19411h6984K5140A11082a72737d6448A42687c40884C6600P6513B621L14579
$$ plain form
18670 317200 -555451 -152218 -182424 -103328 -193251 152659 -145635 90101 -186083 -343828
18660 -343828 -176036 -105203 6866 414864 -230885 -178117 -217546 169761 -129896 203681
18649 -25732 -83030 169125 -128397 -36618 -134417 156103 96772 -122588 -83571 530928 -31666
18637 -191870 -15893 -344492 75486 -71420 -61159 298282 58101 161207 42197 -186754 158486
18625 14463 109726 -13186 251677 55811 -220147 -130407 -160742 185293 -171099 -175882 211733
18613 180131 -81513 -123460 -157817 282659 -364228 -9561 285394 -125948 -141296 -204831 -125746
18602 -125746 -449378 81407 64566 -285957 125994 108316 36256 -313412 -59035 -45241 -9303
18590 61784 13863 -42891 -150395 208903 -237336 -106083 26949 11848 -109131 -57574 124284
$$ packed form
18670C17200e55451a52218l0206P9096q9923A52659a45635I0101a86083j57745
18660c43828J67792P0833F866M07998b30885N2768l9429A69761a29896B03681
18649b5732n7298A69125a28397c6618r7799A56103n9331a22588L9017E30928c1666
18637a91870a5893l28599G5486g1420J0261B98282E8101J03106D2197a86754A58486
18625A4463R5263a3186B51677E5811b20147Q9740l0335A85293a71099m783B11733
18613A80131h1513m1947l4357B82659c64228i561B85394a25948j5348o3535P9085
18602a25746l23632H1407j6841b85957A25994j7678C6256c13412e9035J3794i303
18590F1784A3863d2891j07504B08903b37336a06083B6949A1848a09131N1557A24284
$$ plain form
18578 27544 -323432 99261 -131121 22338 -174076 -37759 -38323 -241495 -37562 -185310 -310989
18567 -310989 -76089 -383841 57541 238156 303820 -192543 -159506 -36566 4032 113069 -51580
18555 17511 158985 81692 191557 216622 60695 233269 -269772 -15865 -109558 -44135 154449
18543 -39167 85848 216669 94841 274935 -165750 -244254 -175632 -32136 17624 -279758 -71814
18531 -58862 -62549 -49071 360599 -76899 -319916 -198163 -303956 -76646 -406829 153464 9159
18519 32706 8663 -166681 -3794 -237305 -207403 102870 -89095 -49269 -261960 -294916 -140043
18507 101266 115414 -7115 37411 -163698 368304 -270882 441006 -285203 -362493 -34701 -17168
18495 -417844 -77543 -92376 254617 -65603 -148307 93393 16988 -108092 84189 -137386 108942
$$ packed form
18578B7544c23432I9261a31121B2338a74076c7759n64k03172c7562j47748j25679
18567c10989g6089l07752E7541J80615O5664a92543L3037c6566D032J09037e1580
18555A7511J41474p7293J09865K5065F0695J72574b69772a5865r3693d4135A54449
18543c9167H5848J30821I4841J80094a65750p8504O8622c2136A7624b79758g1814
18531e8862l687J3478C60599g6899k43017J21753j05793g6646l30183A53464I159
18519C2706H663a66681c794k33511K9902A02870h9095L9826k12691l2956a40043
18507A01266J4148g115C7411a63698C68304b70882D41006b85203p7290c4701a7168
18495d17844g7543j4833B54617f5603q2704I3393A6988a08092H4189a37386A08942
$$ plain form
18483 -42296 -232252 -12568 -41240 246672 -49911 72073 -21127 -176200 -42078 -68717 -103249
18472 -103249 -111887 -392643 145634 -118231 -69226 -232178 -97359 -95127 -248424 107699 -120045
18460 -363774 -139756 -223687 -96597 -150584 173065 -356573 -35109 -196357 44661 96967 -89182
18448 118483 -147664 -92776 -141563 163973 -245873 -162945 -21549 43283 -99502 -140207 -112718
18437 -112718 25947 -118598 51521 -103727 -223218 -6785 145970 -253242 -140946 -269125
18427 -269125 432192 -255764 202170 -248478 9288 52197 -261060 79879 10001 -106811
18416 -96499 -136539 -364800 -151347 -42848 -58771 79981 -322716 -260312 69992 74381 14621
18404 -146258 166200 -82387 75314 139418 -150706 301 10243 -138423 79681 96811 95529 -40275
$$ packed form
18483d2296j89956a2568k8672B46672d9911G2073b1127j55073d2078k6639l4532
18472a03249q638k80756A45634a18231M9005j62952i7359K232j53297A07699a20045
18460c63774a39756q3931i6597n3987A73065c56573c5109j61248D4661N2306h9182
18448A18483a47664N4888m8787A63973b45873Q2928b1549D3283i9502m0705K7489
18437a12718B5947a18598E1521a03727j19491f785A45970b53242J12296j28179
18427b69125D32192b55764B02170b48478I288M2909b61060G9879A0001a06811
18416i6499m0040k28261a51347d2848j5923G9981c22716O2404F9992M389A4621
18404a46258A66200h2387G5314O4104a50706C01R942a38423G9681J7130j282d0275
$$ plain form
18391 -25926 -153561 -156956 29334 -136436 -31003 -281549 -129177 -74812 28620 118596 -136631
18379 -97433 59233 95700 -368141 60882 -200051 -79724 -65006 -22766 -62090 -134865 -45262
18367 42438 -6594 208093 -147871 61150 -142815 28334 172120 53395 -178109 38586 -29305
18355 42955 -173731 -162725 1918 -251325 -109651 155726 -332978 235376 17074 104631 -84995
18343 -26676 119992 -82786 -177172 -76716 65477 -31933 -42495 81606 -1025 236848 -42030
18331 -237543 -337586 -200130 -259106 209763 42968 -164864 -48548 -188352 -203937 -390587
18321 -390587 121222 -95311 -209263 -59212 111600 -31271 -95710 -42519 -378703 222752
18310 -40373 -15706 -110160 -34486 207023 -107014 -54923 -129636 255069 -13555 -1677 56231
$$ packed form
18391b5926j27635l395B9334a36436c1003k50546a29177N4365B8620Q9976a36631
18379i7433E9233L6467c68141F0882b00051g9724J4718b2766l9324p2775d5262
18367D2438f594B08093a47871F1150a42815B8334J43786E3395a78109C8586b9305
18355D2955a73731J1006A918b51325a09651A55726c32978B35376A7074Q7557h4995
18343b6676A19992h2786r4386g6716F5477c1933j0562H1606a025B36848d2030
18331b37543j00043J37456n8976B09763D2968a64864d8548j39804j5585j86650
18321c90587A21222i5311j13952e9212A11600c1271o4439d2519l36184B22752
18310d0373a5706r4454c4486B07023a07014N2091p4713B55069a3555a677E6231
$$ plain form
18298 177093 8481 171299 -341577 -300786 -197797 -29574 -57977 -49801 261996 -181671 -98081
18287 -98081 12940 -144495 -178294 -136252 -137348 37900 -72784 132616 -12774 -104948 -46656
18275 -122987 -292033 76014 26479 124832 114340 -66100 -38837 62276 -312127 6036 90720
18264 90720 55539 -177308 -367989 -118840 114847 -163086 -189344 343286 -99492 -438258
18254 -438258 -299714 -97069 91604 103241 -227663 -167080 230840 113841 65424 172746
18244 172746 161370 99679 -60553 -110754 -14830 130521 -25119 246088 -139330 -77880 242674
18232 -71652 -237048 -106318 -67092 -269351 40185 185956 -248241 -75936 2406 340818 -24301
18220 -43005 89949 70747 -28460 10186 169054 272980 -21924 -944 -170116 -12271 -19651 -369458
$$ packed form
18298A77093H481J62818c41577M0791J02989b9574k8403Q176B61996a81671Q3590
18287i8081A2940a44495l3799M2042j096C7900g2784A32616a2774r2174d6656
18275a22987j69046G6014B6479R8353j0492f6100K7263F2276c12127F036Q4684
18264I0720l5181a77308j90681a18840A14847a63086k6258C43286i9492l38766
18254d38258J38544i7069I1604J1637b27663O0583B30840A13841m8417J07322
18244A72746j1376o1691f0553n0201a4830A30521b5119B46088a39330O1450B42674
18232g1652j65396a06318L9226k02259D0185J45771b48241g5936B406L38412b4301
18220d3005H9949j9202b8460A0186J58868J03926b1924i44j69172a2271p380l49807
$$ plain form
18208 -369458 -156631 281107 -107222 52905 132145 63632 8427 -214833 -472995 45144 -23280
18196 -77085 253554 310750 -52035 140491 1311 -86764 -23964 29976 121466 86760 14522
18184 -160275 57022 -167481 113276 -44088 -59482 22186 -42198 -120048 60817 -207599 3075
18172 -80167 244411 128516 -449384 -152811 -468673 293556 191535 148117 -46889 -15176
18161 -126997 48359 237054 -100117 27630 -140545 -78700 -152157 -139289 -401284 120394
18150 -187815 -37059 -120112 93829 -141674 -250090 -395935 -160989 -31348 187573 -235371
18139 -85879 -223541 168945 -24277 29765 2331 -163981 6360 -65892 -39219 -45844 286227
18127 -326639 -343473 -181150 289280 -41964 46487 -258902 94349 25806 199095 112761 -27324
$$ packed form
18208c69458a56631B81107a07222E2905P9240F3632H427b14833k58162D5144b3280
18196g7085B53554N7196e2035A40491A311h6764b3964B9976R1490l4706A4522
18184a60275E7022a67481A13276d4088j5394B2186d2198p7850F0817b07599C075
18172h0167B44411j15895d49384a52811l15862B93556j02021m3418d6889a5176
18161a26997D8359J88695a00117B7630a40545O1845p3457J2868k61995A20394
18150a87815c7059q3053I3829a41674j08416j45845a60989c1348A87573b35371
18139h5879j37662A68945b4277B9765B331a63981F360f5892K6673o625B86227
18127c26639j6834J62323B89280d1964D6487b58902I4349B5806J73289q6334b7324
$$ plain form
18115 -60479 -97342 149146 -19099 63810 -322926 -55708 10855 -44986 232463 -243661 -156173
18104 -156173 85659 -78536 -79216 -78648 -95576 309204 -11814 12036 -128084 -135321 269742 106266
18091 -281188 318757 241859 62573 -51470 44406 -176003 -70766 248939 -33434 318 -365359
18079 -128760 -41450 4393 137527 -75451 134697 29351 19849 190893 -172965 33484 106051
18068 106051 -56164 95434 81434 306863 61615 10493 -51418 -248867 -191155 -86025 24408
18056 128676 286938 261311 -60087 3616 -105671 -414105 -296632 -256448 -243444 65714 -165662
18044 -47142 -174052 -172260 -282505 96956 70799 -202585 -35842 -475135 3912 147148 16547
18032 157324 -90556 259963 11029 -45947 -221190 -8858 -120295 94695 -243915 38553 11926
$$ packed form
18115f0479l6863A49146a9099F3810c22926e5708A0855d4986B32463b43661Q7488
18104a56173H5659g8536o80N68j6928C09204a1814A2036a28084p237B69742A06266
18091b81188C18757p6898F2573e1470D4406a76003g0766B48939c3434C18c65359
18079a28760d1450D393J33134g5451A34697B9351r502J71044a72965C3484P2567
18068A06051e6164I5434j4000K25429F1615A0493e1418j97449N7712h6025B4408
18056A28676J58262k5627f0087C616a05671l08434J17473M0184J3004F5714a65662
18044d7142j26910J792j10245I6956k6157b02585c5842m39293C912J43236A6547
18032A57324i0556B59963A1029d5947j75243h858j11437I4695b43915C8553A1926
$$ plain form
18020 -55586 365120 -8471 94154 97730 126805 322591 -234602 -196813 -16922 -82782 -27757
18008 58533 -9837 -240400 -150688 -144947 -42883 62447 -179787 -17270 4096 -85020 326858 -234281
17995 -47264 69566 207783 -185107 203513 233703 93460 -20077 -131937 354245 -239620
17984 -94177 -10915 108292 -29145 254325 -62223 196598 26307 -206841 -173425 83539 -12046
17972 109370 -146848 -72694 279056 -89668 199888 -215522 61226 -119949 -109178 620 -47582
17960 -145081 145153 52874 -165841 -167599 151032 -309128 -113316 225039 -131748 -125351
17950 -125351 68602 -115677 267560 32797 12235 117135 -16523 -270716 64957 -103515
17939 98005 -120491 -139882 -7317 -29930 -151846 -75654 44996 -83338 -107771 190441 379512
$$ packed form
18020e5586C65120h471I4154L576K9075J95786b34602L7789a6922o5860b7757
18008E8533i837k30563Q9712N741d2883F2447a79787a7270D096h5020C26858b34281
17995d7264F9566J38217a85107B03513L0190I3460b0077j11860C54245b39620
17984i4177a0915A08292b9145B54325f2223A96598B6307b06841L3416H3539a2046
17972A09370a46848g2694B79056h9668A99888b15522F1226a19949J0771F20d7582
17960a45081A45153E2874a65841j758A51032c09128a13316B25039a31748O397
17950a25351F8602a15677B67560C2797A2235J04900a6523k54193F4957a03515
17939I8005a20491j9391g317k2613j21916g5654D4996h3338k4433A90441J89071
$$ plain form
17928 379512 8508 107143 248669 -157867 264679 -66307 154036 53073 79870 313369 92316
17916 -172934 -46990 106808 69078 212730 196686 101732 -118943 233496 446951 -133431
17905 -103696 -25428 -112197 139263 -130957 -395608 -62638 139150 -121331 -33111 19155
17894 -42681 -218110 -61687 272911 155257 34906 -36260 -342224 143020 -272915 223324
17883 -18008 -203555 -118128 139299 -70382 -280693 -83134 135673 153272 -138857 -98448 -223109
17872 -223109 36445 170894 68464 -152276 319728 253105 38107 58192 67111 182736 165572
17861 165572 -70966 -143688 -12392 130513 107282 135798 -34130 -118928 -114804 455489 269758
17850 269758 85451 -50217 38258 49630 -50172 313069 -34903 -153287 -54496 213915 211675
$$ packed form
17928C79512H508R8635J41526a57867B64679f6307A54036E3073K6797K33499I2316
17916a72934d6990A06808l7730J43652j6044r4954a18943B33496K13455a33431
17905a03696b5428q6769A39263a30957k64651f2638A39150a21331c3111A9155
17894d2681j75429f1687B72911j17654C4906c6260l05964A43020b72915B23324
17883a8008j85547Q5427A39299g0382k10311h3134A35673J7599a38857M0409j24661
17872b23109C6445J34449F8464a52276C19728o6623C8107K0085Q919J15625j7164
17861A65572g0966p2722a2392A30513k3231K8516c4130q4798M124D55489j85731
17850B69758H5451e0217C8258J1372e0172C13069c4903j18384e4496B13915k240
$$ plain form
17839 211675 53767 59453 -130548 77785 -173793 194465 -46324 188644 181903 -66853 -112306
17828 -112306 25723 124815 27749 159798 176209 104711 -158044 -282849 -100295 -25955 68518
17816 160556 208495 3438 -293166 151864 160548 25902 71210 -96558 -110737 -202692 -224052
17805 -224052 213594 -101747 -123172 141158 142865 55788 -212832 208274 112877 181137 60416
17793 128030 89958 523733 509149 -282379 -55340 284786 -100033 -223200 30723 -235561
17782 -136987 250591 -335854 2126 369802 332528 -12166 159533 -277532 -8722 -33821 69477
17770 64952 -397232 -27451 -161107 152610 -96767 352075 -145611 105915 -194040 -118593
17760 -118593 249839 -273991 68645 58422 -352728 -41021 -117661 242459 -178247 -145297
$$ packed form
17839B11675E3767N686a30548G7785a73793A94465d6324A88644o741f6853m5453
17828a12306B5723R9092B7749J32049J6411p1498a58044j24805a00295b5955F8518
17816A60556M7939C438b93166A51864Q684B5902M5308i6558j4179r1955k1360
17805b24052B13594a01747k1425A41158J707E5788b12832B08274r5397O8260F0416
17793A28030l8072M33775j4584b82379e5340B84786a00033j23167C0723b35561
17782a36987B50591c35854B126L67676l7274a2166A59533b77532h722k5099F9477
17770F4952c97232b7451j33656A52610i6767C52075a45611A05915a94040P5447
17760a18593B49839b73991F8645j0223c52728d1021p6640B42459a78247L2950
$$ plain form
17750 -145297 19075 -271916 207990 65585 -31561 -197666 329109 138520 175203 217225
17740 217225 -45734 27312 400687 -108289 76449 -26697 11446 31596 323466 302121 28560
17728 147475 163892 180761 139640 -17285 104273 -110787 -48703 48155 250521 105284 -53875
17716 -97975 254611 -24941 21436 80815 63714 -125262 117703 -163097 198589 82250 79065
17705 79065 159579 85699 325416 -48938 -150525 264643 -77232 -73313 71951 -118328 20139
17693 143867 -96838 -17649 -151278 34110 -90524 212862 -236706 -78432 187790 230595 99616
17681 241288 72241 164024 145315 -5464 -53177 177932 219434 -194266 -42036 100712 218617
17670 218617 56199 234441 -51542 -12970 -104537 348231 167533 -45224 30509 216302 212063
$$ packed form
17750a45297A9075b71916B07990F5585c1561j66105C29109A38520L6683M2022
17740B17225d5734B7312L73375a08289G6449b6697A1446K0150K91870k1345B8560
17728A47475J6417J6869m1121a7285A04273a10787d8703D8155K02366A05284e3875
17716i7975B54611b4941B1436N9379j7101a25262A17703a63097A98589H2250l185
17705G9065Q0514p3880K39717d8938j01587B64643g7232L919G1951a18328B0139
17693A43867i6838a7649j33629C4110i0524B12862b36706g8432A87790M2805I9616
17681B41288G2241R1783j8709e464m7713A77932M1502a94266d2036A00712J17905
17670B18617E6199J78242e1542a2970r1567C48231A67533d5224C0509J85793m239
$$ plain form
17659 212063 150903 81054 422212 122226 10213 123687 141987 202853 -12479 276231 46621
17647 -183245 363601 -249290 129180 -94248 361758 115216 153598 -461964 -145115 120795
17636 -6795 170495 -105582 343244 7951 90184 -42305 135721 98431 5100 63838 -120428
17624 239430 498023 -29031 -115487 131451 117742 69585 542016 -170063 76050 -182627
17613 122968 123114 -203740 -28212 480268 205672 193454 175400 -93774 352650 300603 -370485
17601 175389 -311567 -16453 16754 125590 82706 -83307 234395 338488 51871 349073
17591 349073 -89523 114572 165605 50017 -25007 123494 35319 -22386 215644 308949 95085
17579 70265 90645 313831 377800 5975 48646 108574 297451 -77164 100936 54971 70422
$$ packed form
17659B12063o1160o9849L41158A22226A0213J13474J8300O0866a2479B76231D6621
17647a83245C63601b49290A29180i4248C61758A15216L8382d61964a45115A20795
17636f795A70495a05582C43244G951Q2233d2305A35721l7290E100N8738a20428
17624B39430K58593b9031q6456A31451j3709m8157M72431a70063G6050a82627
17613A22968J46b03740b8212D80268B05672j2218j8054i3774C52650n2047c70485
17601A75389c11567a6453A6754J08836m2884h3307B34395J04093E1871K97202
17591C49073h9523A14572N1033E0017b5007A23494C5319b2386B15644R3305I5085
17579G0265K0380K23186O3969E975M2671N9928J88877g7164A00936m5965J5451
$$ plain form
17568 70422 104105 -85410 264652 -79156 254157 16441 252517 491564 143430 279400
17558 279400 -43201 198774 583839 268318 -40722 393884 80284 377657 162571 -296531
17547 394131 17560 -148532 -138982 274278 496882 228439 310647 403718 637772 286876
17536 85574 -92492 304320 389129 245599 -21413 261821 419458 166149 197514 414231
17526 414231 149612 388926 742409 507846 507372 610776 625570 746 267528 95060 96280
17515 96280 229993 348891 482623 93359 453977 779949 518515 675028 669229 267320
17504 426635 228291 127088 516692 41348 416546 700180 133652 189055 140400 159413
17494 159413 304484 219275 340130 311371 371588 255136 385983 66311 -77899 464226
$$ packed form
17568G0422L3683h5410B64652g9156B54157A6441K36076K39047A43430J35970
17558B79400d3201A98774L85065B68318d0722C93884H0284K97373A62571b96531
17547C94131A7560a48532R550B74278K22604B28439Q2208R3071K34054B86876
17536H5574i2492C04320Q4809j43530b1413B61821J57637A66149L1365K16717
17526D14231A49612K39314L53483k34563m74J03404J4794G46K66782I5060J220
17515I6280J33713J18898J33732I3359L60618L25972k61434J56513n799B67320
17504D26635j98344j01203L89604D1348L75198K83634A33652N5403m8655J9013
17494A59413J45071q5209J20855k8759O0217j16452J30847F6311g7899D64226
$$ plain form
17483 836751 363964 303549 352352 382900 113405 -147667 223524 308744 363922 322894 136085
17471 289771 489299 378485 292688 68419 160962 277926 234561 352967 311513 247902 283904
17460 283904 282140 39202 206634 374443 292428 304928 58371 69891 174529 238694 340150
17449 340150 189261 428925 38002 488130 375637 632487 367767 481799 731860 322790
17438 -23275 356223 385405 557458 283468 585800 431441 319996 641302 221292 211699
17428 211699 116728 290074 198594 631367 247006 320038 272502 368672 734753 452847
17418 452847 667281 364456 509032 611284 340482 286056 440051 431702 326463 590081
17408 590081 347813 187152 343461 264502 670540 331092 294798 517121 99140 38741
$$ packed form
17483H36751C63964o0415M8803L0548A13405a47667B23524Q5220N5178m1028A36085
17471B89771J99528j10814q5797F8419R2543J16964m3365J18406m1454o3611L6002
17460B83904j764C9202J67432J67809q2015J2500E8371J1520J04638O4165J01456
17449C40150j50889K39664C8002M50128j12493K56850k64720J14032K50061C22790
17438b3275C56223K9182J72053k73990L02332j54359j11445L21306B21292r593
17428B11699r4971J73346r1480M32773B47006P3032m7536R6170L66081k81906
17418D52847K14434l02825J44576J02252k70802n4426J53995q349j05239K63618
17408E90081k42268j60661J56309p8959M06038C31092l6294K22323I9140C8741
$$ plain form
17397 147770 384281 -50224 224432 83208 62854 410195 553858 298728 250232 338190
17387 338190 501503 -282934 266228 90119 131500 229409 196349 -25183 175577 187650 294006
17376 294006 181304 130559 274788 309480 100780 316443 308201 172656 230071 289114 303723
17365 303723 453252 139386 433521 587776 -79884 524749 232277 136960 -112571 113187
17354 437401 199412 290030 -155358 435514 268038 203963 -95471 308081 209808 177185
17344 177185 356740 365822 376115 170919 272364 13943 172892 508155 152473 -25089
17333 452038 155643 303564 164981 411243 311158 342737 338193 293515 153304 53136
17322 159485 303862 115995 14988 -26244 159973 590208 73050 2275 247562 164843 188683
$$ packed form
17397A47770K36511e0224B24432H3208k0354L47341J43663k55130m8496Q7958
17387C38190J63313b82934B66228I0119M1381R7909l3060b5183A75577J2073J06356
17376B94006j12702n0745J44229L4692A00780K15663q242j35545N7415N9043J4609
17365C03723J49529A39386K94135J54255g9884E24749B32277r5317a12571A13187
17354D37401A99412R0618a55358D35514j67476o4075i5471C08081r8273l2623
17344A77185J79555R082J0293A70919J01445A3943J58949L35263A52473b5089
17333D52038A55643J47921j38583K46262j00085L1579m544m4678j40211E3136
17322A59485J44377A15995A4988b6244A59973M30235G3050B275K45287q2719K3840
$$ plain form
17311 188683 497688 218711 -119645 -26306 77892 148848 154184 394637 477037 378677 292503
17300 292503 80252 228659 493479 318832 102302 289136 122646 307560 397222 150169
17289 434430 187946 442499 106610 442800 12478 203525 347681 96299 276978 217895
17279 217895 177454 508792 204096 251305 276853 442014 495619 447657 343771 97826 303938
17268 303938 619673 369944 123982 243287 488720 486546 21577 513711 20656 348818
17258 348818 113809 407986 269487 625554 449612 181291 406201 21793 355798 109229
17247 -29048 162757 -98218 174126 553875 578236 140925 391902 636519 326609 347360
17237 347360 385373 358022 321680 312783 327489 379096 392469 568724 320125 504557 507128
$$ packed form
17311A88683L09005B18711a19645b6306G7892P0956N336K40453Q2400r8360q6174
17300B92503H0252J48407K64820j74647A02302J86834A22646J84914Q9662A50169
17289D34430A87946K54553A06610L36190A2478J91047J44156I6299J80679n9083
17279B17895m0441L31338B04096M7209K5548J65161N3605m7962j03886I7826K06112
17268C03938L15735k49729A23982J19305K45433k174B1577M92134B0656L28162
17258C48818A13809K94177j38499L56067j75942A81291K24910B1793L34005A09229
17247b9048A62757i8218A74126L79749K4361A40925K50977K44617l09910K0751
17237C47360L8013k7351l6342q897J4706N1607J3373J76255k48599J84432K571
$$ plain form
17226 507128 393666 472398 580759 150733 283825 556938 332708 354303 -25166 218156
17215 173726 430975 493919 283195 623219 289228 384763 537930 618859 373707 345138
17205 345138 743886 251627 562048 359101 449014 240007 552196 567779 186370 313109
17195 313109 320698 199209 365178 356062 551212 493248 883667 543233 362727 792999
17185 792999 390304 292070 542790 240068 439362 833127 378936 545377 624236 850031
17175 850031 534013 410194 426205 443443 635605 375482 352128 836181 328235 960040
17165 960040 663222 356110 108474 598863 279694 556296 595064 342106 596706 556736
17155 556736 300359 500323 442658 337103 711881 487801 632412 669709 535934 650470
$$ packed form
17226E07128j13462P8732J08361A50733J33092K73113k24230K1595b5166B18156
17215A73726K57249O2944k10724L40024B89228R5535J53167Q0929k45152k8569
17205C45138L98748B51627L10421k02947Q9913k09007L12189J5583A86370J26739
17195C13109P589j21489J65969r116J95150n7964L90419l40434j80506M30272
17185G92999C90304r8234K50720B40068J99294L93765C78936J66441P8859K25795
17175H50031l16018j23819J6011J7238J92162k60123k3354M84053C28235O31805
17165I60040k96818l07112A08474M90389B79694K76602L8768k52958K54600l9970
17155E56736k56377J99964n7665j05555L74778k24080J44611L7297j33775J14536
$$ plain form
17145 650470 587959 649729 497382 574678 662499 554124 287266 775461 646612 705267
17135 705267 534571 755399 634110 474759 807417 577148 675672 789930 626799 667626
17125 667626 441013 247818 686153 642549 700659 478923 741778 489084 658591 773355
17115 773355 447888 705274 560207 417547 612794 402176 544129 642907 756136 893834
17105 893834 579340 852570 832186 432348 388992 608015 684072 458798 697858 701141
17095 701141 457121 718906 1048921 393573 494652 736724 343283 549247 848742 668931
17085 668931 719348 758699 987071 450146 862809 612798 942777 955330 871807 1030619
17075 1030619 1107932 901957 767694 1050155 619590 974480 917710 721706 896039 726789
$$ packed form
17145F50470o2511O1770j52347P7296Q7821j08375k66858M88195j28849N8655
17135G05267j70696K20828j21289j59351L32658k30269R8524J14258j63131M0827
17125F67626k26613j93195M38335m3604N8110k21736K62855k52694J69507J14764
17115G73355l25467K57386j45067j42660J95247k10618J41953R8778J13229J37698
17105H93834l14494K73230k0384l99838m3356K19023P6057k25274K39060L283
17095G01141k44020K61785L30015C93573J01079K42072C43283K05964K99495j79811
17085F68931N0417L9351K28372D50146M12663k50011L29979J2553q3523J58812
17075A030619P7313k05975j34263K82461m30565L54890n6770j96004J74333j69250
$$ plain form
17065 726789 563158 722260 772656 595375 830824 844093 536111 1055465 965974 907009
17055 907009 1098183 928621 787362 1161605 757142 918901 904056 916192 1151867 916482
17045 916482 836526 941516 1024239 1238087 828018 949289 1002263 1094882 933971 1220686
17035 1220686 995307 765906 1057281 776300 1065002 971212 1278840 1102654 979371 1230998
17025 1230998 972019 1334980 1118486 1053271 1347101 1642175 1323004 1040333 1134274 1418359
17015 1418359 1261624 1303936 1185839 1116648 1251352 978171 1369219 1253915 1475362 1162212
17005 1162212 1083169 1160415 1104865 1243593 993906 1427343 1358168 1583049 1373076 1331591
16995 1331591 1543684 1542316 1408040 1451964 1220147 1398365 1511942 1166955 1270035 1536470
$$ packed form
17065G26789j63631J59102N0396j77281K35449J3269l07982N19354q9491n8965
17055I07009J91174j69562j41259L74243m04463J61759j4845J2136K35675k35385
17045I16482p9956J04990Q2723K13848m10069J21271N2974R2619j60911K86715
17035A220686k25379k29401K91375k80981K88702r3790L07628j76186j23283K51627
17025A230998k58979L62961k16494o5215K93830K95074l19171k82671R3941K84085
17015A418359j56735M2312j18097o9191J34704k73181L91048j15304K21447l13150
17005A162212p9043P7246n5550J38728k49687M33437o9175K24881k09973m1485
16995A331591K12093j368j34276M3924k31817J78218J13577l44987J03080K66435
$$ plain form
16985 1536470 1542271 1531910 1240317 1432571 1350158 1537216 1276501 1637119 1161614 1537581
16975 1537581 1485361 1684152 1726117 1684912 1275262 1494292 1382095 1732991 1865660 1429897
16965 1429897 1748028 1885567 1784620 1973799 1822190 1366943 1710547 1806658 1914571 1927001
16955 1927001 1744949 1551213 2032823 1835038 1582320 1993221 1681407 1924281 1894986 2099123
16945 2099123 1945236 2090535 2034181 2198817 2050998 2078635 2100690 1780131 2080222 2009315
16935 2009315 2109753 2220769 2176331 2164895 2506286 2657635 2342712 2404583 2320271 2253894
16925 2253894 2440231 2536777 2521354 2630955 2660576 2688838 2299689 3019934 2605644 2766604
16915 2766604 2490989 2515163 2769802 2614648 2713620 2570379 2998536 3211476 2744526 2659512
$$ packed form
16985A536470N801j0361k91593J92254q2413J87058k60715L60618m75505L75967
16975A537581n2220J98791M1965m1205m09650K19030j12197L50896J32669m35763
16965A429897L18131J37539j00947J89179j51609m55247L43604R6111J07913J2430
16955A927001j82052j93736M81610j97785k52718M10901l11814K42874k9295K04137
16945B099123j53887J45299n6354J64636j47819K7637K2055l20559L00091p0907
16935B009315J00438J11016m4438j1436L41391J51349l14923O1871q4312o6377
16925B253894J86337R6546j5423J09601K9621K8262l89149P20245m14290J60960
16915B766604k75615K4174K54639j55154R8972j43241M28157K12940m66950q5014
$$ plain form
16905 2659512 3041005 3036445 3042754 2692601 2927560 3058231 3428464 3260283 3304955 3246121
16895 3246121 3278153 3107951 3439021 3845904 3824534 3240763 3543395 3496423 3566897 3707704
16885 3707704 4120912 3954525 3826580 3862292 3885454 3893778 3907960 3592064 4257436 3882498
16875 3882498 4229543 4248483 4230106 4174693 4246958 4319762 4564546 4552185 4723606 4615575
16865 4615575 4820439 4522297 5162053 5042781 4983050 5157280 5199372 5501426 5621035 5662362
16855 5662362 5452875 5470506 5704161 5853416 5683772 5782172 5860331 6303292 6198250 6344002
16845 6344002 6335636 6529986 6685576 6884841 6703177 7034436 7015720 7241690 7027343 7624349
16835 7624349 7361462 7709040 7743624 8119131 7764777 8301792 8031518 8552838 8414112 8571920
$$ packed form
16905B659512L81493m560O309l50153K34959J30671L70233j68181M4672n8834
16895C246121L2032j70202L31070M06883k1370n83771L02632m6972P0474J40807
16885C707704M13208j66387j27945L5712K3162Q324J4182l15896O65372l74938
16875C882498L47045J8940j8377n5413P2265P2804K44784j2361J71421j08031
16865D615575K04864k98142O39756j19272n9731J74230M2092L02054J19609M1327
16855E662362k09487J7631K33655J49255j69644R8400P8159M42961j05042J45752
16845F344002q366J94350J55590J99265j81664L31259j8716K25970k14347N97006
16835G624349k62887L47578L4584L75507l54354N37015k70274N21320j38726J57808
$$ plain form
16825 8571920 9171099 8808741 9447702 9139139 9498250 9661462 10156294 10259518 10253407 10496654
16815 10496654 10784882 11182565 11419057 11370159 11646820 12209977 12605602 12503216 12583751 12902367
16805 12902367 13345934 13663142 13774681 13912453 14435819 14897799 15045385 15565898 15914876
16796 15914876 16524356 16683596 16697245 17373449 17699412 18331611 18693807 19373689 19581209
16787 19581209 19918486 20672553 21247398 21792773 22493809 23088848 23674141 24440835 25024775
16778 25024775 25868572 26184016 27468092 28129898 28654913 29571316 30554105 31639108 32803187
16769 32803187 33486403 34833071 35704341 36927391 37871333 39412567 40847233 41923215
16761 41923215 43461952 44857775 46539813 48016961 49272080 51413938 53149989 55138480
$$ packed form
16825H571920N99179l62358O38961l08563L59111J63212M94832J03224o111K43247
16815A0496654K88228L97683K36492m8898K76661N63157L95625j02386Q0535L18616
16805A2902367M43567L17208J11539J37772N23366M61980J47586N20513L48978
16796A5914876O09480J59240J3649O76204L25963O32199L62196O79882K07520
16787A9581209L37277P54067N74845N45375P01036N95039N85293P66694N83940
16778B5024775Q43797L15444J284076O61806N25015R16403R82789J085003J164079
16769C2803187O83216J346668Q71270J223050R43942J541234J434666J075982
16761D1923215J538737J395823J682038J477148J255119K141858J736051J988491
$$ plain form
16753 55138480 57201645 58843923 60671815 63088010 64886557 67669332 69594853 72136304
16745 72136304 74218394 76400681 79718992 81579492 84246769 86941675 88891525 91862711
16737 91862711 94234070 96764097 99058936 101670890 103585109 105665188 107418779 109569095
16729 109569095 110754219 112064173 113486940 114080561 114638007 114971185 115232806 115457285 114924463
16720 114924463 113676462 113107215 112214916 110490640 108944122 107201690 105380567 103019989
16712 103019989 100883007 98544878 96118313 93701805 91001594 88552644 85893950 83112500
16704 83112500 80697719 78397589 76054785 73373670 70717685 68880171 66150539 63925484
16696 63925484 61816863 59828716 57481977 55601151 53759702 51909972 49976271 48338456
$$ packed form
16753E5138480K063165J642278J827892K416195J798547K782775J925521K541451
16745G2136304K082090K182287L318311J860500K667277K694906J949850K971186
16737I1862711K371359K530027K294839K611954J914219K080079J753591K150316
16729A09569095J185124J309954J422767N93621N57446L33178K61621K24479n32822
16720A14924463j248001n69247q92299j724276j546518j742432j821123k360578
16712A03019989k136982k338129k426565k416508k700211k448950k658694k781450
16704H3112500k414781k300130k342804k681115k655985j837514k729632k225055
16696F3925484k108621j988147k346739j880826j841449j849730j933701j637815
$$ plain form
16688 48338456 46601549 45310677 43374809 42257549 41043116 39622847 38237253 36787437
16680 36787437 35789057 34391685 33542396 32693529 31526827 30846352 29852668 28904122 27968992
16671 27968992 27072206 26565478 25583072 24910238 24273065 23600949 22887168 22081474 21734641
16662 21734641 20951431 20398634 20013937 19839446 18672445 18543273 18022766 17718258 16863638
16653 16863638 16747394 16100188 15630169 15370756 15081742 14810644 14269619 14425253 13986862
16644 13986862 13297617 13021925 13031951 12431053 12248064 11898171 11842344 11430166 11432649 11149524
16634 11149524 10507496 10661679 10439755 10204522 9876283 9486372 9720835 9448007 9069148
16625 9069148 9139661 8677657 8721874 8489112 8717427 8408448 7860842 8087722 7633699 7447995
$$ packed form
16688D8338456j736907j290872j935868j117260j214433j420269j385594j449816
16680C6787437r98380j397372q49289q48867j166702o80475r93684r48546r35130
16671B7968992q96786n06728r82406o72834o37173o72116p13781q05694l46833
16662B1734641p83210n52797l84697j74491j167001j29172n20507l04508q54620
16653A6863638j16244o47206m70019k59413k89014k71098n41025J55634m38391
16644A3986862o89245k75692J0026o00898j82989l49893n5827m12178K483k83125
16634A1149524o42028J54183k21924k35233l28239l89911K34463k72828l78859
16625I069148P0513m62004M4217k32762K28315l08979n47606K26880m54023j85704
$$ plain form
16615 7447995 7332863 7207129 7192083 7065128 7109014 6785445 6431621 6528838 6304563 6403657
16605 6403657 6193382 6502499 6194776 6255946 5811159 5560113 5602647 5844190 5673517 5539708
16595 5539708 5249922 5408424 5334547 5237659 5205617 4872417 4868878 4762929 4752624 4905781
16585 4905781 4627909 4853641 4403757 4456369 4359764 4456044 4655679 4224795 4205972 4032868
16575 4032868 4052882 3975603 3903452 4121288 3860588 3855015 3603457 3774704 3470837 3614368
16565 3614368 3476703 3702578 3208763 3232583 3421665 3258946 3346509 3419065 3298386 3206126
16555 3206126 3191558 3291700 3256858 3136593 2951851 3056574 3091147 2987358 2942116 2974845
16545 2974845 3024531 2800984 2897225 2748369 2590458 2857928 2740839 2343634 2489302 2745882
$$ packed form
16615G447995j15132j25734j5046j26955M3886l23569l53824R7217k24275R9094
16605F403657k10275L09117l07723O1170m44787k51046M2534K41543j70673j33809
16595E539708k89786J58502p3877r6888l2042l33200l539j05949j0305J53157
16585D905781k77872K25732m49884N2612r6605R6280J99635m30884j8823j73104
16575D032868K0014p7279p2151K17836k60700n573k51558J71247l03867J43531
16565C614368j37665K25875m93815K3820J89082j62719Q7563P2556j20679r2260
16555C206126j4568J00142l4842j20265j84742J04723L4573j03789m5242L2729
16545B974845M9686k23547R6241j48856j57911K67470j17089l97205J45668K56580
$$ plain form
16535 2745882 2250696 2363264 2296858 2128200 2295646 2493308 2405108 2300060 2529271 2310714
16525 2310714 2285885 2079643 2135817 2330453 2053523 2495994 2263208 2029108 2026513 1949403
16515 1949403 1805608 1928953 2195039 2164674 2079051 2056151 1997747 2143393 1575857 1930297
16505 1930297 1905562 2013492 1853924 1746485 1655192 1888714 1603413 1917086 1547247 1799825
16495 1799825 1623666 1464427 1613032 1849693 1902932 1649649 1519009 1620672 1821095 1581089
16485 1581089 1711407 1473897 1259585 1493345 1303744 1441447 1121825 1509235 1338974
16476 1338974 1580193 1246538 1434022 1686152 1451552 1485451 1052783 1493036 1330370 1423755
16466 1423755 1300833 1185070 1303592 1301058 1227161 1240608 1632888 1324236 1418647 1253001
$$ packed form
16535B745882m95186J12568o6406j68658J67446J97662q8200j05048K29211k18557
16525B310714k4829k06242N6174J94636k76930M42471k32786k34100k595p7110
16515A949403j43795J23345K66086l0365q5623k2900n8404J45646n67536L54440
16505A930297k4735J07930j59568j07439r1293K33522k85301L13673l69839K52578
16495A799825j76159j59239J48605K36661N3239k53283j30640J01663K00423k40006
16485A581089J30318k37510k14312K33760j89601J37703l19622L87410j70261
16476A338974K41219l33655J87484K52130k34600L3899m32668M40253j62666R3385
16466A423755j22922j15763J18522k534p3897J3447L92280l08652R4411j65646
$$ plain form
16456 1253001 966096 1100693 1041714 1250781 951625 1348511 1029263 1026948 1192683 1111118
16446 1111118 1125759 1205884 1296349 1056138 1127349 1060157 880092 1183159 824496 1042280
16436 1042280 610107 1189913 1095523 923723 865255 979617 1171694 962528 1229191 930701
16426 930701 1021362 1099544 1121586 1290161 1013952 1367960 995907 1018686 1362623 663420
16415 870989 575848 974445 661938 638486 554032 794437 494909 1004454 974287 748211
16405 748211 925986 786154 904444 1032588 313417 497771 876682 817087 837439 1103141
16395 1103141 532156 595030 797114 1117543 748765 480021 789640 473633 764415 839285
16385 839285 746115 672748 856622 615756 339966 658099 713884 979420 546114 671938
$$ packed form
16456A253001k86905J34597n8979K09067k99156L96886l19248k315J65735q1565
16446A111118J4641Q0125R0465k40211P1211o7192j80065L03067l58663K17784
16436A042280m32173N79806r4390j71800n8468J14362J92077k09166K66663k98490
16426I30701R0661P8182K2042J68575k76209L54008l72053K2779L43937F63420
16415H70989k95141L98597l12507k3452q4454K40405k99528N09545l0167k26076
16405G48211J77775j39832J18290J28144C13417J84354L78911n9595K0352K65702
16395A103141E32156O2874K02084L20429l68778k68744L09619l16007K90782P4870
16385H39285r3170p3367J83874k40866k75790L18133N5785K65536m33306J25824
$$ plain form
16375 671938 460795 680209 468134 365684 482260 526871 883929 718843 651380 510662
16365 510662 629691 611241 756072 514858 376824 311875 671458 239358 517354 530280
16355 530280 596780 557349 575550 843206 587436 756796 478112 460934 574210 918315
16345 918315 622122 850341 481597 966783 464894 394832 811358 734794 476575 648211
16335 648211 701418 309130 401142 286523 435594 590324 667410 511114 444210 289805
16325 289805 766884 436522 337144 560206 387122 633114 465479 519449 474756 623536
16315 623536 379902 444681 446165 509317 320947 243425 466834 484666 616003 454860 607420
16304 607420 441523 417854 295866 698470 425654 247148 370528 306558 342624 544389
$$ packed form
16375F71938k11143K19414k12075j02450J16576M4611L57058j65086o7463j40718
16365E10662J19029j8450J44831k41214j38034o4949L59583B39358K77996J2926
16355E30280O6500l9431J8201K67656k55770J69360k78684j7178J13276L44105
16345I18315k96193K28219l68744M85186D64894p0062M16526p6564k58219J71636
16335F48211N3207C09130R2012j14619J49071J54730P7086j56296o6904j54405
16325B89805M77079l30362r9378K23062j73084K45992j67635N3970m4693J48780
16315F23536k43634O4779J484O3152j88370p7522K23409J7832J31337j61143J52560
16304F07420j65897k3669j21988M02604k72816j78506J23380o3970L6066K01765
$$ plain form
16294 544389 564068 447724 98149 707757 243780 413525 408645 240151 571728 266241
16283 489320 554586 586334 268017 488270 366268 381208 483050 463466 327131 551174
16273 551174 -58723 225973 261245 595660 221817 441904 93831 364165 367407 567284
16263 567284 532804 230598 405784 42238 291612 459153 510093 -135766 553577 323601
16253 323601 218633 220154 22001 552651 264922 132017 171203 123936 168882 170399 -77993
16241 241890 412120 -13690 503031 142648 320412 351667 233923 57449 131638 161297
16231 161297 424349 428821 217987 106013 258346 245559 228090 121762 244497 434069
16221 434069 246511 525616 348344 234061 211712 110956 201274 81890 502847 358643
$$ packed form
16294E44389J9679j16344I8149O09608B43780J69745m880j68494L31577B66241
16283D89320O5266L1748B68017K20253j22002J4940J01842j9584j36335K24043
16273E51174e8723B25973L5272L34415B21817K20087I3831K70334L242J99877
16263E67284l4480B30598J75186D2238K49374J67541N0940a35766E53577k29976
16253C23601j04968J521B2001N30650B64922A32017L9186m7267M4946J517g7993
16241B41890J70230a3690E03031A42648J77764L1255j17744E7449P4189K9659
16231A61297K63052M472k10834A06013J52333j2787j7469j06328J22735J89572
16221D34069j87558K79105j77272j14283k2349j00756R0318H1890M20957j44204
$$ plain form
16211 358643 -101512 410713 50649 188220 406054 31585 339487 186735 40423 -10464
16200 459847 -325618 363019 -60391 510308 138703 212954 355302 371145 130181 267895
16190 267895 -104808 206803 214843 293189 291141 -98837 395352 322497 462865 247938 84719
16178 231297 470364 313217 134578 12306 130334 -138866 -49292 41635 153708 137546
16168 137546 381361 297598 152284 53415 414280 218439 346488 156148 261953 228949
16158 228949 16629 3232 403195 112056 23379 201778 125033 55685 221631 93472 198805
16147 198805 195345 -74925 63742 112131 311347 426932 228699 284895 320984 -203682 417473
16135 145622 40647 56011 90513 223772 173151 343777 -295068 80540 -81423 -56466 165791
$$ packed form
16211C58643a01512D10713E0649J37571K17834C1585L07902j52752D0423a0464
16200D59847c25618C63019f0391E10308A38703P4251J42348J5843A30181J37714
16190B67895a04808B06803Q040P8346k048i8837C95352p2855J40368k14927H4719
16178B31297K39067j57147A34578A2306J18028a38866d9292D1635J12073j6162
16168A37546K43815q3763j45314E3415L60865j95841J28049A56148J05805l3004
16158B28949A6629C232L99963A12056B3379J78399p6745E5685J65946I3472J05333
16147A98805l460g4925F3742M8389J99216J15585j98233N6196L6089b03682D17473
16135A45622D0647J5364L4502J33259n0621J70626b95068H0540h1423K4957A65791
$$ plain form
16123 7872 194507 273596 423560 231951 -278131 115829 116241 593659 209522 34492 139235
16112 139235 -209130 -101592 234042 -108799 58090 -242083 -94733 -176492 -75501 532195
16101 202967 333794 273682 5190 -59704 56031 89799 122095 31915 148229 40253 -37843
16089 190362 9617 -294415 138370 -108168 162040 30986 269258 115194 -134582 106340
16078 73844 20011 236655 271312 -161920 162341 -17420 164616 -98034 239943 385162
16068 385162 153043 358657 94167 -114261 518307 -166602 175473 24716 289895 240191
16058 240191 -105220 127341 40079 -68233 112027 35481 66624 213863 -233821 -69979
16047 84899 -48446 -140950 -776 169776 362117 22661 51327 99992 -146402 199926 172422
$$ packed form
16123G872J86635P9089J49964j91609b78131A15829M12M77418B09522C4492J04743
16112A39235b09130a01592B34042a08799E8090b42083i4733q1759g5501E32195
16101B02967J30827o0112E190e9704E6031L3768L2296C1915J16314D0253c7843
16089A90362I617b94415A38370a08168A62040C0986K38272A15194a34582A06340
16078G3844B0011K16644L4657a61920A62341a7420A64616i8034B39943J45219
16068C85162A53043K05614I4167a14261E18307a66602A75473B4716K65179m9704
16058B40191a05220A27341D0079f8233A12027C5481L1143J47239b33821f9979
16047H4899d8446r2504g76A69776J92341B2661K8666M8665a46402A99926k7504
$$ plain form
16036 172422 -48992 97232 31169 50276 72641 82805 -262701 75165 -194235 -109700 64561
16024 169613 249108 -152859 87678 163403 -47771 237014 -289589 -20913 138826 -104026
16013 126078 -138689 -17355 -21034 -13984 38411 27308 278908 102645 -51336 20221 42379
16002 42379 39710 -20772 239137 207045 27631 29208 124063 -43050 -58859 172640 167762 -33525
15989 -247142 232193 180947 -158128 -124909 168106 212229 261375 196031 258301 527138 679392
15978 679392 815128 788924 751311 629982 448769 158215 -43195 124815 78555 52807
15968 52807 227911 56247 49805 -130293 148942 173193 -134291 260526 10712 2608 -9298
15956 -93268 -252909 -244816 204167 360927 43660 337050 -64920 53241 557591 98502 -325854
$$ packed form
16036A72422d8992I7232C1169J9107K2365J0164b62701G5165a94235Q4535F4561
16024A69613P9495a52859H7678P5725d7771B37014b89589b0913A38826a04026
16013A26078a38689a7355l679P050C8411j1103K51600A02645e1336B0221K2158
16002D2379k669b0772B39137l2092B7631J577R4855d3050j5809A72640m878c3525
15989b47142B32193n1246a58128L3219A68106M4123M9146o5344O2270K68837J52254
15978F79392J35736k6204l7613j21329j81213A58215d3195A24815m6260k5748
15968E2807J75104E6247o442a30293A48942K4251a34291B60526A0712B608i298
15956i3268j59641Q093B04167J56760D3660K93390f4920E3241N04350I8502c25854
$$ plain form
15944 27222 273683 240066 -60821 -169841 96726 -161869 -127373 -147993 -220006 -245939 164359
15932 -63515 -203189 -281942 -14324 168524 -285912 59876 245387 20184 -107556 -246140
15922 -246140 -214576 63801 5276 -215942 -57487 154705 531480 230230 -408735 329751
15911 -298059 222957 58863 408284 -118963 -236303 231216 -61347 -39508 -160303 128427
15900 169375 22397 -206733 120767 349532 58251 211856 -37091 -254791 -91728 -325397
15890 -325397 -321436 139948 -129903 17132 248075 -277971 -76954 -84475 51474 231583 -3638
15878 133830 442646 -232362 130096 -183790 -28 20773 48110 -72293 126012 156767 -178830
15866 108985 -2342 -200787 -5279 100433 12758 -128882 57547 238776 -102610 -242290 -2971
$$ packed form
15944B7222K46461l3617f0821j09020I6726a61869L4496k0620p2013k5933A64359
15932f3515j39674p8753a4324A68524b85912E9876J85511B0184a07556j38584
15922b46140L1564F3801E276b15942e7487A54705L76775B30230d08735C29751
15911b98059B22957E8863L49421a18963j17340B31216f1347K1839j20795A28427
15900A69375B2397b06733A20767K28765E8251J53605c7091k17700i1728k33669
15890c25397L961A39948a29903A7132K30943b77971g6954p521E1474J80109c638
15878A33830L08816b32362A30096a83790b8B0773K7337g2293A26012L0755a78830
15866A08985b342j98445e279A00433A2758a28882E7547J81229a02610j39680b971
$$ plain form
15854 -72970 44051 195453 2629 1230 245109 -292955 -199766 40076 -142011 9710 -68514
15842 145835 7587 332050 -218365 -224646 198763 165932 -298616 -124279 -253522 -223420 53383
15830 -110511 -52721 -98825 -123036 42114 245259 119221 164781 -380535 -261232 -61502 -142305
15819 -142305 158179 -88229 -135468 101236 63483 -150423 -109950 -343286 196756 109108
15809 109108 61862 -173949 20090 -106503 7075 43623 8542 11880 33866 212628 158307
15798 158307 -186049 -88963 2908 -152386 -81705 64355 -57636 -76034 165831 27608 -167761
15786 117750 -104003 28773 116470 59139 -226824 73651 48991 199245 -45841 -111829 -120846
15775 -120846 3830 73192 -116133 -168840 -180046 286208 -205588 215007 226804 -223058 -139473
$$ packed form
15854g2970D4051J51402B629A230K43879b92955R3189D0076a42011I710f8514
15842A45835G587L24463b18365o281A98763l2831b98616a24279j29243L0102E3383
15830a10511e2721m6104k4211D2114K03145A19221M5560c80535J19303f1502q0803
15819a42305A58179h8229m7239A01236l7753a50423M0473k33336A96756q7648
15809A09108m7246a73949B0090a06503G075L6548H542L338K1986J78762n4321
15798A58307a86049h8963B908a52386P0681F4355e7636j8398A65831B7608a67761
15786A17750a04003B8773Q7697n7331b26824G3651k4660J50254d5841o5988r017
15775a20846C830O9362a16133n2707j1206B86208b05588B15007J1797b23058Q3585
$$ plain form
15764 -139473 -166289 21951 151067 52209 386823 -134562 48446 124860 -69181 -156801 -53817
15752 204321 126621 48318 -17959 -224739 32996 168973 -22122 -31454 -92893 -265740 -56127
15740 405711 183849 254900 112657 285478 1691 -452919 -108397 -153725 -32708 -235113
15730 -235113 69225 148782 -201803 -89933 28033 160880 -46975 170977 235478 -118893 -245445
15719 -245445 -85390 -35360 6773 105091 -72321 -66621 79617 -200664 -33091 257319 -181706
15707 -282871 562388 238213 -103444 222741 171917 -285149 -175720 -166505 -207208 -229069
15697 -229069 -186262 351685 -363359 -158627 -37002 -156757 72308 -67312 -166214 -780 16797
15685 79033 -17183 -43668 -35397 -149755 -16360 17762 71327 219616 279896 115478 -424219
$$ packed form
15764a39473k6816B1951J29116E2209L34614a34562D8446P6414f9181q7620e3817
15752B04321p7700D8318a7959k06780C2996J35977b2122r332o1439j72847e6127
15740D05711A83849P1051A12657J72821A691d52919a08397m5328c2708k02405
15730b35113F9225P9557b01803h9933B8033J32847d6975A70977O4501a18893j26552
15719b45445h5390c5360F773R8318g2321N700G9617b00664c3091B57319a81706
15707b82871E62388B38213a03444B22741n0824b85149J09429R215m0703k1861
15697b29069M2807C51685c63359a58627c7002j19755G2308f7312r8902g80A6797
15685G9033a7183k6485Q271j14358a6360A7762N3565J48289O0280A15478d24219
$$ plain form
15673 -106203 -453642 88037 170840 300465 -29014 -298614 -152022 -260467 -264357 -241117 280786
15661 105693 -357088 203279 399741 -302029 -342462 202769 41768 -347456 48010 45719
15651 45719 123599 -109833 138401 9594 -317227 -167607 -96473 -364116 -1836 59920 -343674
15639 110096 -89272 -66992 -157680 -137592 58404 -49458 -211743 26338 -188472 -6768 -8417
15628 -8417 -61882 65783 204988 749 74190 -284129 -335492 -117565 224478 177219 -115098
15616 197195 307163 -216764 -285246 -66837 -80409 104422 -60923 -65202 -273597 -135898 -203423
15605 -203423 -142409 -139299 74593 -222996 74513 228674 -160059 187304 250007 -103334 -18169
15593 -17495 -114414 -75765 150318 115029 -32714 -226095 -22251 -71644 135021 323623 -166374
$$ packed form
15673a06203l47439H8037Q2803J29625b9014k69600J46592j08445l890K3240B80786
15661A05693c57088B03279J96462c02029m0433B02769D1768c47456D8010k291
15651D5719P7880a09833A38401I594c17227J49620P1134k67643a836E9920c43674
15639A10096h9272K2280r0688K0088E8404d9458j62285B6338a88472f768j649
15628h417n3465F5783J39205G49P3441b84129n1363a17565B24478m7259a15098
15616A97195J09968b16764o8482f6837j3572A04422f0923m279k08395a35898o7525
15605b03423O1014L110G4593b22996G4513J54161a60059A87304O2703a03334a8169
15593a7495r6919L8649A50318l5289c2714j93381b2251m9393A35021J88602a66374
$$ plain form
15581 -31448 -189477 252278 1683 -5408 -137143 64563 169902 -61226 103746 -77676 -114205
15570 -114205 159443 213616 -206643 -193871 -328228 274892 -31547 51598 -24777 -212475
15560 -212475 -32359 -106998 237702 -137787 97576 62785 138602 109426 89479 360262 219180
15549 219180 -111709 132769 290798 102409 -48862 65519 -242846 288850 34611 175465
15539 175465 -333060 22358 292220 229646 39682 180520 188940 66026 131081 274164 249626
15528 249626 61295 88940 62713 157256 276746 177008 264827 41485 207955 432535 182469
15516 198229 137868 232365 533617 106124 -110006 142960 283158 388602 46427 353828
15506 353828 -108024 -86749 -154196 9961 259079 293116 2634 -25566 150105 179981 26076
$$ packed form
15581c1448j58029B52278A683e408j31735F4563J05339f1226A03746g7676l6529
15570a14205A59443N4173b06643J2772j34357B74892c1547E1598b4777j87698
15560b12475c2359p4639B37702a37787I7576l4791P5817k9176j9947K70783j41082
15549B19180a11709A32769J58029A02409d8862F5519b42846B88850C4611J40854
15539A75465c33060B2358K69862o2574C9682J40838Q420F6026O5055J43083k4538
15528B49626F1295K7645k6227R4543J19490r9738Q7819D1485J66470K24580A82469
15516A98229o0361R4497L01252A06124a10006A42960J40198J05444D6427L07401
15506C53828a08024K1275o7447I961K49118L4037B634b5566A50105K9876B6076
$$ plain form
15494 31012 -212795 -476742 60257 -201114 -62514 23832 137427 184402 72612 248657 117674
15482 273877 175604 43887 18703 -126581 36526 -206273 203462 119213 126370 496650 284616
15471 284616 149759 312719 -16419 -237398 -172701 -89119 -136720 133016 221468 147092 121521
15460 121521 89298 75017 359377 -251067 -138486 -65427 151632 5429 -221790 53225 291023
15449 291023 -31318 -32844 64161 175720 107985 -98231 372505 275681 406284 315127 528712
15438 528712 374045 118239 -47934 -89920 232480 15303 11990 371924 216840 -252397
15427 130640 -305459 -28242 -68144 1765 104186 -94124 34190 183753 132367 -43995 -72469
15416 -72469 175626 25409 41667 74831 114627 -395733 136785 167962 -375081 -92013 -101599
$$ packed form
15494C1012b12795k63947F0257b01114f2514B3832J13595M6975G2612J76045A17674
15482B73877r8273D3887A8703a26581C6526b06273B03462q4249P157L70280k12034
15471B84616j34857J62960a6419k20979O4697Q3582m7601A33016Q8452p4376k5571
15460A21521l2223j4281K84360b51067J12581f5427A51632E429b21790E3225K37798
15449B91023c1318j526F4161J11559o7735i8231C72505r6824J30603r1157K13585
15438E28712j54667A18239d7934m1986B32480A5303l313L59934j55084b52397
15427A30640c05459b8242l9902A765J02421i4124C4190J49563n1386d3995k8474
15416g2469A75626B5409J6258L3164L9796c95733A36785L1177c75081i2013r586
$$ plain form
15405 -101599 276376 145220 225878 -99982 -75973 256628 -74700 108732 96687 -60910 -450435
15394 -450435 43587 127426 74814 -100169 127107 164346 -66187 -14850 149327 -103148 -194541
15383 -194541 96840 148910 390115 534 101447 273128 95750 72732 -380460 -146348 -43219
15371 -209295 323738 223091 128146 296797 -164102 154169 68872 130097 102621 54799
15361 54799 329545 -51581 269381 141746 280912 -11940 -95004 228762 -175298 215819
15350 67843 25961 -271069 96988 102216 95536 326884 110895 -54616 277609 31900 95426
15339 95426 41779 239509 -9828 150506 175417 61019 135250 -107939 66224 -31092 -188693
15328 -188693 -225232 -211702 336545 -75727 302468 -967 199186 206617 90764 130990 18839
$$ packed form
15405a01599B76376j31156Q0658i9982K4009B56628g4700A08732j2045f0910l89525
15394d50435D3587Q3839n2612a00169A27107L7239f6187a4850A49327a03148r1393
15383a94541I6840N2070K41205E34J00913J71681I5750k3018c80460a46348d3219
15371b09295C23738j00647r4945J68651a64102A54169F8872O1225k7476m7822
15361E4799K74746e1581B69381j27635J39166a1940q3064B28762a75298B15819
15350F7843B5961b71069I6988N228o680K31348A10895e4616B77609C1900O3526
15339I5426D1779J97730i828A50506K4911F1019P4231a07939F6224c1092j57601
15328a88693l6539J3530C36545g5727C02468i67A99186P431I0764M0226A8839
$$ plain form
15316 -33956 117661 48246 -37365 -80687 13219 154527 -81447 45346 -71678 171400 -141779
15304 329795 -27331 358375 283363 -134885 129499 186962 140101 152479 108735 23118 11411
15292 161926 134006 217125 -103014 -25282 366562 67271 -252174 -284131 401818 44692 121155
15281 121155 -6505 249889 -109542 130990 275376 132283 -296433 7277 -92810 -58645 278626
15269 -133659 60532 -840 103297 -64242 95394 -174155 -94318 298095 -116288 302501 197988
15258 197988 -36052 141676 15063 -7312 128065 86833 123259 -32344 335997 -12556 360858
15246 86211 49156 251630 89357 145827 -205184 -218338 8383 369617 233016 180270 214800
15235 214800 230838 334583 620787 1543110 3197673 3442831 2878422 3476412 1874682
$$ packed form
15316c3956A17661D8246c7365m3322A3219J41308h1447D5346g1678A71400a41779
15304C29795b7331C58375p5012a34885A29499N7463m6861J2378m3744B3118A1411
15292A61926k7920Q3119a03014b5282C66562F7271b52174l1957D01818D4692P6463
15281A21155f505B49889a09542A30990J44386A32283b96433G277i2810L4165B78626
15269a33659F0532h40A03297f4242I5394a74155P9837B98095a16288C02501j04513
15258A97988c6052A41676A5063g312A28065m1232L6426c2344C35997a2556C60858
15246H6211l7055K02474H9357N6470b05184j3154H383L61234j36601n2746L4530
15235B14800J6038J03745K86204R22323J654563K45158n64409N97990j601730
$$ plain form
15226 1874682 876146 686379 417813 153752 123822 -61148 -119771 26430 -131548 -3844
15215 180009 49327 -311060 -238098 -40303 -286512 -217783 29615 -60750 23428 -118144 -60249
15204 -60249 2865 255956 265663 -124264 -205826 249719 -59624 305136 258428 -235439 -45246
15192 -218517 -26993 148080 172429 215151 8514 265961 369878 15664 7473 -23274 288392
15180 -184141 -264505 323210 -23711 180036 -359801 -75345 140991 -142019 78454 -81868
15169 -6297 45072 222360 204529 423385 -108177 150754 -2730 12996 103496 64861 -215390
15157 111529 2583 229862 -16765 149577 360278 136 151168 87560 209180 504480 322861
15146 322861 -103337 45651 5813 -121780 -7918 169175 -79931 -145881 -10480 -37728 84038
$$ packed form
15226A874682H76146j89767k68566A53752k9930f1148n8623B6430a31548c844
15215A80009D9327c11060P2962d0303k46209O8729B9615f0750B3428a18144N7895
15204f0249B865K53091R707a24264q1562B49719e9624C05136m6708b35439d5246
15192b18517b6993A48080K4349M2722H514K57447J03917A5664G473b3274B88392
15180a84141q0364C23210b3711A80036c59801g5345A40991a42019G8454h1868
15169f297D5072J77288j7831K18856a08177A50754b730A2996R0500l8635b15390
15157A11529B583K27279a6765A49577K10701A36J51032o3608J21620K95300j81619
15146C22861a03337D5651E813a21780g918A69175g9931o5950a0480k7248H4038
$$ plain form
15134 93231 -68360 204546 -152004 235793 100227 175927 303699 221263 192102 249548 290020
15123 290020 423253 286171 220709 -103232 284130 169689 364542 106505 219271 -165755
15112 300366 284857 495654 409135 901539 557456 388937 167466 -10388 265327 254858
15102 254858 253768 203114 -60208 -45539 105990 119161 48434 45060 156825 -20672 -36270
15091 -36270 -85158 230158 248513 204386 810 241423 154785 241332 146806 178407 285216
15080 285216 -19398 91866 263955 37130 408515 151408 -15970 -74304 82875 262657 -121689
15068 315891 387849 249499 207363 324375 347863 28866 383078 115430 43777 185997
15058 185997 -72652 -155551 279425 217384 268678 162243 23790 240862 194175 454823 180881
$$ packed form
15134I3231f8360B04546a52004B35793A00227P5700J27772q2436k9161N7446M0472
15123B90020J33233j37082o5462a03232B84130j14441J94853A06505J12766a65755
15112C00366j5509K10797q6519M92404l44083j68519A67466a0388B65327j0469
15102B54858j090n0654f0208J4669A05990J3171D8434l374J11765b0672j5598
15091c6270m8888B30158J8355m4127H10K40613q6638Q6547r4526L1601J06809
15080B85216a9398I1866J72089C7130L71385A51408a5970n8334H2875J79782a21689
15068C15891P1958j38350m2136J17012K3488B8866L54212A15430D3777J42220
15058A85997g2652q2899B79425o2041N1294j06435B3790K17072m6687K60648A80881
$$ plain form
15046 363781 198339 324396 3168 248586 146425 23137 639347 405807 32511 144261
15036 144261 463918 249687 156236 399592 207704 417134 587348 604254 485858 785011
15026 785011 543655 128349 129179 243468 620750 554064 78566 267544 112409 206045 -46540
15014 256785 285060 323747 284675 289267 255387 209693 400622 198423 425898 351777 316201
15003 316201 131219 162974 40774 326976 355315 538253 619529 222235 258671 304912 413674
14992 413674 297579 278898 476969 553310 89532 379183 102813 277592 408651 468342
14982 468342 916631 527385 267451 386807 621643 418080 371740 64105 322498 266029
14972 266029 285709 472262 487861 594537 90605 185080 216679 -55337 222024 2005 439248
$$ packed form
15046C63781j65442J26057C168K45418j02161B3137O16210k33540C2511J11750
15036A44261L19657k14231r3451K43356j91888K09430J70214J6906j18396K99153
15026G85011k41356A28349Q30J14289L77282o6686G8566J88978A12409R3636d6540
15014B56785K8275L8687l9072M592l3880m5694J90929A98423K27475p4121l5576
15003C16201A31219L1755D0774K86202K8339J82938Q1276B22235L6436M6241J08762
14992D13674j16095j8681J98071P6341H9532K89651A02813J74779J31059N9691
14982D68342M48289l89246k59934J19356K34836k03563m6340F4105K58393n6469
14972B66029J9680J86553J5599J06676I0605R4475L1599e5337B22024B005M37243
$$ plain form
14961 439248 397090 144372 50841 186205 457074 221704 74733 2108 342264 454362
14951 454362 473422 240163 -108969 417708 18899 447373 387815 583642 438329 468281
14941 468281 499690 52335 424395 323241 468311 400752 541013 153026 473745 389493
14931 389493 516869 629382 579265 657749 660768 825686 586982 713161 822573 906516
14921 906516 1056793 910764 1040408 1014053 908782 1088432 1116390 1265345 755906 831906
14911 831906 790335 604945 689014 437470 292114 243599 447227 184613 410236 -53589
14900 214138 484568 367872 393388 276393 444738 274448 315830 332281 249222 268312
14890 268312 483304 488251 694412 190449 466773 239706 265226 544277 935612 700032
$$ packed form
14961D39248m2158A44372E0841J35364K70869B21704G4733B108L40156J12098
14951D54362J9060k33259a08969D17708A8899M28474n9558J95827j45313K9952
14941D68281L1409E2335L72060j01154J45070o7559J40261A53026L20719q4252
14931C89493J27376J12513n0117P8484L019J64918k38704J26179J09412Q3943
14921I06516J50277j46029J29644k6355j05271J79650K7958J48955n09439P6000
14911H31906m1571j85390Q4069k51544j45356m8515K03628A84613K25623e3589
14900B14138K70430j16696K5516j16995J68345j70290M1382J6451q3059J9090
14890B68312K14992M947K06161A90449K76324k27067K5520K79051L91335k35580
$$ plain form
14880 700032 746827 403137 891139 570504 495832 264040 202917 486861 508246 354311
14870 354311 356262 505012 351868 286676 332774 399511 683777 291227 133248 486276
14860 486276 420368 566354 733731 -2485 194137 248918 15718 557930 671919 345439
14850 345439 440675 538596 491962 777909 626305 570916 843074 555580 569277 523780 718040
14839 718040 743708 953560 1034921 757613 765055 663704 917524 590280 678431 195361
14828 995867 617990 555452 620366 334566 702171 589324 360777 443159 529720 718589
14818 718589 666357 645234 510902 604647 572397 501641 437835 532675 601596 452124 834079
14807 834079 542167 486711 900585 651177 681365 786739 737527 727488 374414 611371
$$ packed form
14880G00032M6795l43690M88002l20635p4672k31792o1123K83944K1385j53935
14870C54311J951J48750j53144o5192M6098O6737K84266B91227A33248L53028
14860D86276o5908J45986J67377b485A94137N4781A5718N42212J13989l26480
14850C45439R5236R7921m6634K85947j51604n5389K72158k87494J3697m5497J94260
14839G18040K5668K09852Q1361k77308P442j01351K53820l27244Q8151A95361
14828I95867l77877o2538O4914k85800L67605j12847k28547Q2382Q6561J88869
14818G18589n2232k1123j34332R3745l2250p0756o3806R4840O8921j49472L81955
14807H34079k91912n5456M13874k49408L0188J05374m9212j0039l53074K36957
$$ plain form
14797 611371 585433 506539 630814 456082 1006765 848342 812270 674003 655631 467792
14787 467792 348225 611563 659545 487467 621819 729797 762300 737008 499123 979650
14777 979650 682334 747003 696486 427288 402743 482371 782809 915734 736001 679615
14767 679615 373907 663661 426992 489395 208334 711862 379105 829125 954708 839375
14757 839375 132812 687666 1114796 389229 564815 477617 704233 778875 719639 845376
14747 845376 792164 736503 785139 340696 483717 419902 607911 928530 751720 824511
14737 824511 969072 780756 755483 743761 822607 697114 984279 1091554 1024886 1071326
14727 1071326 1078651 1200964 1386041 1246048 1115970 774083 1014799 903981 986923 826440
$$ packed form
14797F11371k5938p8894J24275j74732N50683j58423l6072j38267j8372j87839
14787D67792j19567K63338M7982j72078J34352J07978L2503k5292k37885M80527
14777I79650k97316O4669n0517k69198k4545P9628L00438J32925j79733n6386
14767F79615l05708K89754k36669O2403B08334N03528l32757M50020J25583j15333
14757H39375A32812N54854M27130C89229J75586q7198K26616P4642n9236J25737
14747H45376n3212n5661M8636C40696J43021o3815J88009L20619j76810P2791
14737H24511J44561j88316k5273j1722P8846j25493K87165J07275o6668M6440
14727A071326P325J22313J85077j39993j30078l41887K40716j10818Q2942j60483
$$ plain form
14717 826440 752251 702732 634928 769293 715428 632009 559637 826193 684503 1221886 904921
14706 904921 1046141 1189103 1239426 1151678 1150254 847130 1184341 1471312 1207677 1178388
14696 1178388 908786 821615 662278 933226 1121587 725976 715853 842207 931375 1051405
14686 1051405 947299 816865 1061077 758368 780486 1101675 870218 1135862 1105107 784027
14676 784027 1052309 968822 883839 1251474 1107406 1149431 1110400 814998 908142 785302
14666 785302 1057738 1231664 991001 961071 708932 1048333 979333 1118833 1350536 935385
14656 935385 1067345 1010572 1073269 1164531 1172509 997330 928471 1257531 1151802 1206172 1529576
14645 1529576 1174123 1346568 1300223 1345090 946945 1224903 1301602 1103789 1319958 1014047
$$ packed form
14717H26440p4189m9519o7804J34365n3865q3419p2372K66556j41690N37383l16965
14706I04921J41220J42962N0323q7748j424l03124L37211K86971k63635k9289
14696A178388k69602q7171j59337K70948J88361l95611j0123J26354Q9168J20030
14686A051405j04106j30434K44212l02709K2118L21189k31457K65644l0755l21080
14676G84027K68282q3487q4983L67635j44068M2025l9031k95402R3144j22840
14666G85302K72436J73926k40663k9930k52139L39401o9000J39500K31703m15151
14656I35385J31960n6773O2697R1262P978j75179o8859L29060j05729N4370L23404
14645A529576l55453J72445m6345M4867l98145K77958P6699j97813K16169l05911
$$ plain form
14635 1014047 1071792 1441838 1202734 1241748 1722263 1219396 1298272 1254964 1273826 1233090
14625 1233090 1563808 1724466 1386687 1274368 1401886 1510443 1638182 1532937 906223
14616 906223 1155005 1453436 1566389 1534943 1402556 1421250 1502777 1404115 1682015 1516739
14606 1516739 1461804 1310110 1551980 1792836 1195127 1712239 1675428 1490836 1486294 1838796
14596 1838796 1907455 1705098 1513940 1623198 1858567 1754431 1705189 1750540 1628446 2109455
14586 2109455 1884099 1798269 1945246 1709456 1793603 1490417 2101211 1846598 1850665 2081495
14576 2081495 1785464 2256056 2093165 2084507 1852499 2100328 1976074 2073762 2211124 2591423
14566 2591423 2300266 2356093 2359050 2400491 2320181 2787857 2477110 2612733 3198372 2910892
$$ packed form
14635A014047N7745L70046k39104L9014M80515n02867P8876m3308J8862m0736
14625A233090L30718J60658l37779j12319J27518J08557J27739j05245o26714
14616I06223K48782K98431J12953l1446j32387J8694Q1527r8662K77900j65276
14606A516739n4935j51694K41870K40856n97709N17112l6811j84592m542L52502
14596A838796O8659k02357j91158J09258K35369j04136m9242M5351j22094M81009
14586B109455k25356q5830J46977k35790Q4147l03186O10794k54613M067K30830
14576B081495k96031M70592j62891q658k32008K47829j24254R7688J37362L80299
14566B591423k91157N5827K957M1441q0310M67676l10747J35623N85639k87480
$$ plain form
14556 2910892 3220003 3357186 3546955 3880948 4376347 5092282 5774605 7770393 11579946
14547 11579946 20323723 38769399 44364652 20597835 8233673 4030578 2546471 2409437
14539 2409437 2008430 2268197 2093860 2335278 2307664 1913848 2393489 2194006 2441395 2187613
14529 2187613 2860142 2900846 4302674 7642748 7965779 4143595 2597364 2819122 2585145
14520 2585145 2214308 2312441 2320581 2403818 2419071 2721564 2775951 2650895 2963405 2680385
14510 2680385 2672302 2854458 3067086 2783766 2972273 2734894 3168625 2763520 2947103 3112134
14500 3112134 3205424 3126546 3325118 3405072 3192116 3244891 3346247 3411552 3524419 3580040
14490 3580040 3361243 3507640 3575444 3311665 3536791 3296458 3711629 3415417 3592835 3644342
$$ packed form
14556B910892L09111J37183J89769L33993M95399P15935O82323J995788L809553
14547A1579946Q743777J8445676N595253B0597835H233673D030578j484107j37034
14539B409437m01007K59767j74337K41418k7614l93816M79641j99483K47389k53782
14529B187613O72529M0704J401828L340074L23031l822184j546231K21758k33977
14520B585145l70837R8133Q140Q3237J5253L02493N4387j25056L12510k83020
14510B680385q083J82156K12628k83320J88507k37379M33731m05105J83583J65031
14500C112134R3290p8878J98572P9954k12956N2775J01356O5305J12867N5621
14490C580040k18797J46397O7804k63779K25126k40333M15171k96212J77418N1507
$$ plain form
14480 3644342 3834857 3859476 3919484 3965520 4051329 4272144 4153898 4254526 4159887 4241248
14470 4241248 4207877 4694699 4206943 4709133 4547965 4279227 4516265 4278909 4607995 4787998
14460 4787998 4851189 5076174 5038135 4596119 5223866 5295945 5262025 5204999 4864036 5179808
14450 5179808 5705500 5860775 5730652 5778100 5572229 5910731 5723851 6048900 6145195 6171902
14440 6171902 6143820 6187848 6004974 6170634 6453747 6765935 6456769 6303575 6643695 6935899
14430 6935899 6830809 7034311 6956616 7072712 7404517 7182057 7853736 7722558 7877456 8103816
14420 8103816 7998093 8414572 8586072 8523358 8820701 8977817 8944619 9145588 8902224 9036810
14410 9036810 9186029 9232562 9657007 9663223 9716266 10104475 10178817 10482555 10429031 10913061
$$ packed form
14480C644342J90515K4619O0008M6036Q5809K20815j18246J00628r4639Q1361
14470D241248l3371M86822m87756N02190j61168k68738K37038k37356L29086J80003
14460D787998O3191K24985l8039m42016O27747P2079l3920n7026l40963L15772
14450E179808N25692J55275j30123M7448k05871L38502j86880L25049R6295K6707
14440F171902k8082M4028j82874J65660K83113L12188l09166j53194L40120K92204
14430F935899j05090K03502p7695J16096L31805k22460O71679j31178J54898K26360
14420H103816j05723M16479J71500o2714K97343J57116l3198K00969k43364J34586
14410I036810J49219M6533M24445O216N3043L88209P4342L03738n3524M84030
$$ plain form
14400 10913061 10736555 10723594 10834743 11216405 11215543 11564448 11876806 11721094 12183355 12580862
14390 12580862 12452996 12652841 12936406 13379199 13467680 13745107 13919282 14464056 14576980
14381 14576980 14684509 14893662 15309490 15772186 15752591 16159959 16112359 16308738 17095675 17419033
14371 17419033 18009334 18140207 18637583 18629326 19471738 19786189 20419798 20633811 21131632 21131070
14361 21131070 21992949 21983612 22719651 23110815 23756195 24497361 25052975 25431258 26102893 26750577
14351 26750577 26915467 28130520 28477655 29226573 30495921 30762712 31664921 32384097 33364938
14342 33364938 34450228 35146320 36199848 37072859 38137233 39276418 40582821 41642312
14334 41642312 42596037 44010752 45371420 46846986 48274264 49666303 51091372 52876671
$$ packed form
14400A0913061j76506j2961J11149L81662q62L48905L12358j55712M62261L97507
14390A2580862j27866J99845K83565M42793Q8481K77427J74175N44774J12924
14381A4576980J07529K09153M15828M62696j9595M07368m7600J96379P86937L23358
14371A7419033N90301J30873M97376q257Q42412L14451O33609K14013M97821n62
14361B1131070Q61879r337P36039L91164O45380P41166N55614L78283O71635O47684
14351B6750577J64890J215053L47135P48918J269348K66791R02209P19176R80841
14342C3364938J085290O96092J053528Q73011J064374J139185J306403J059491
14334D1642312R53725J414715J360668J475566J427278J392039J425069J785299
$$ plain form
14326 52876671 54684142 56511786 58637123 60495999 62422426 64884896 67221359 69754245
14318 69754245 72014785 74580491 77427836 80529928 83342222 86533819 90365504 94090922
14310 94090922 98395729 102434286 106481173 110709054 115944189 121152972 126369165 132811107
14302 132811107 138643793 144972255 152002869 159034701 166699074 174699407 183784047 192972951
14294 192972951 202423933 212582445 223310616 234834339 246658465 258615731 271637815
14287 271637815 285072801 298857340 313374912 327899787 342595297 357528175 372611100
14280 372611100 387192474 401413057 414597194 427167896 438323436 447621006 453745505
14273 453745505 457286888 459679862 459930410 460322119 457911367 453968383 449850472 443588211
$$ packed form
14326E2876671J807471J827644K125337J858876J926427K462470K336463K532886
14318F9754245K260540K565706K847345L102092K812294L191597L831685L725418
14310I4090922M304807M038557M046887M227881N235135N208783N216193O441942
14302A32811107N832686O328462P030614P031832P664373Q000333R084640R188904
14294A92972951R450982J0158512J0728171J1523723J1824126J1957266J3022084
14287B71637815J3434986J3784539J4517572J4524875J4695510J4932878J5082925
14280C72611100J4581374J4220583J3184137J2570702J1155540R297570O124499
14273D53745505L541383K392974K50548L91709k410752l942984m117911o262261
$$ plain form
14265 443588211 433970210 422865932 410316458 396957945 382657941 368091332 352615512
14258 352615512 337270085 321947892 306590923 292301133 277624866 264157606 251217642
14251 251217642 238505677 226685943 215438970 204794199 194694301 185356994 176070335
14244 176070335 168026763 160091962 152469898 145088136 138171318 132059956 127316948 125367612
14236 125367612 119731937 113344942 108368906 103623532 99160916 95364532 91940406 87777796
14228 87777796 84481609 81650042 78253140 75641212 72807954 69977135 67310844 65194528
14220 65194528 63153297 61112976 58972550 56985374 55368189 53582821 51967487 50638097
14212 50638097 49045551 47237677 46055787 44421179 43261601 42512371 41606803 39941438
$$ packed form
14265D43588211r618001j1104278j2549474j3358513j4300004j4566609j5475820
14258C52615512j5345427j5322193j5356969j4289790j4676267j3467260j2939964
14251B51217642j2711965j1819734j1246973j0644771j0099898r337307r286659
14244A76070335q043572p934801p622064p381762o916818o111362m743008j949336
14236A25367612n635675o386995m976036m745374m462616l796384l424126m162610
14228H7777796l296187k831567l396902k611928k833258k830819k666291k116316
14220F5194528k041231k040321k140426j987176j617185j785368j615334j329390
14212E0638097j592546j807874j181890j634608j159578p49230r05568j665365
$$ plain form
14204 39941438 38890629 37468703 36651888 35943877 35249161 34129138 32902916 32175310 31254375
14195 31254375 30516733 30099523 29418989 28542966 27688372 27466982 26608690 26062658 25382789
14186 25382789 24572433 23967938 23615574 23319798 22629057 22286969 21772960 21531039 21009735
14177 21009735 20132814 19997612 19568310 19198253 18896968 18463053 18279925 17604535 17255557
14168 17255557 17224658 16733257 16506422 15857551 15861836 15637645 15592020 15155007 14554952 14580039
14158 14580039 14471593 13848803 14157898 13285812 13228150 12782511 12980113 12431280 12350689 12363062
14148 12363062 12103211 11623353 11547907 11471873 11394193 10890183 10853802 10861869 10725923 10628995
14138 10628995 10238656 10073289 9917596 10054737 9772921 9679221 9631548 9390839 9310505 8895994
$$ packed form
14204C9941438j050809j421926q16815p08011o94716j120023j226222p27606r20935
14195C1254375p37642m17210o80534q76023q54594k21390q58292n46032o79869
14186B5382789q10356o04495l52364k95776o90741l42088n14009k41921n21304
14177B1009735q76921j35202m29302l70057l01285m33915j83128o75390l48978
14168A7255557l0899m91401k26835o48871M285k24191m5625m37013o00055K5087
14158A4580039j08446o22790L09095q72086n7662m45639J97602n48833q0591J2373
14148A2363062k59851m79858p5446p6034p7680n04010l6381Q067j35946r6928
14138A0628995l90339j65367j55693J37141k81816r3700m7673k40709q0334m14511
$$ plain form
14128 8895994 8750757 8694823 8642739 8470783 8557533 8521865 8175713 7869098 7738617 8071806
14118 8071806 7590800 7808577 7510619 7405523 7668342 7331349 7235862 6885359 6956347 7067015
14108 7067015 6719661 6908496 6618550 6415620 6429462 6537484 6271813 6416049 6147938 6335913
14098 6335913 6153254 6085001 6037645 5963489 5715915 5712190 5610472 5366450 5413697 5444324 5452553
14087 5452553 5392965 5499356 5176805 5386960 5341245 5021491 5101638 5098960 5063424 4836554
14077 4836554 4848759 4692109 4764820 4603890 4691926 4717652 4561279 4562030 4585779 4280356 4489645
14066 4489645 4525180 4067029 4089819 4150771 3961137 4277198 4216355 4085668 4470418 3996065
14056 3996065 4106818 4111064 3932765 3996165 3896749 3779100 3701415 3588654 3496288 3582751 3515194
$$ packed form
14128H895994j45237n5934n2084j71956Q6750l5668l46152l06615j30481L33189
14118H071806m81006K17777k97958j05096K62819l36993r5487l50503P0988J10668
14108G067015l47354J88835k89946k02930J3842J08022k65671J44236k68111J87975
14098F335913j82659o8253m7356p4156k47574l725j01718k44022M7247L0627Q229
14087E452553n9588J06391l22551K10155m5715l19754Q0147k678l5536k26870
14077D836554J2205j56650P2711j60930Q8036K5726j56373P51K3749l05423K09289
14066D489645L5535m58151K2790O0952j89634L16061o0843j30687L84750m74353
14056C996065J10753M246j78299O3400r9416j17649p7685j12761r2366Q6463o7557
$$ plain form
14045 3515194 3411002 3543833 3568524 3572914 3113718 3434300 3551959 3684508 3274489 3207507
14035 3207507 3085595 3241367 3225194 3129629 3251489 3126036 3170195 2862437 2874100 3092549
14025 3092549 2991645 3289035 2925178 3233932 2869994 2712165 2738460 2964577 2657573 2635252
14015 2635252 2485352 2692048 2306542 2568566 2359320 2537472 2637801 2405937 2507954
14006 2507954 2744131 2313846 2284370 2404134 2044195 2132008 1913771 1990447 2116358 2287660
13996 2287660 2310620 2187033 2128742 2207628 2230009 2104942 3020357 4104116 6391977 12706746
13986 12706746 30358277 46888966 28498806 14341483 8560537 6124640 4685444
13979 4685444 4061922 3681823 3374467 3143697 3272030 2945345 2794971 2427802 2659029
$$ packed form
14045C515194j04192J32831K4691M390m59196L20582J17659J32549m10019o6982
14035C207507j21912J55772j6173r5565J21860j25453M4159l07758J1663K18449
14025C092549j00904K97390l63857L08754l63938j57829K6295K26117l07004k2321
14015B635252j49900K06696l85506K62024k09246J78152J00329k31864J02017
14006B507954K36177m30285k9476J19764l59939Q7813k18237P6676J25911J71302
13996B287660K2960j23587n8291P8886K2381j25067R15415J083759K287861O314769
13986A2706746J7651531J6530689j8390160j4157323n780946k435897j439196
13979D685444o23522l80099l07356k30770J28333l26685j50374l67169K31227
$$ plain form
13970 2659029 2494298 2631409 2352601 2713978 2470009 2292286 2584247 2434490 2423760 2292880
13960 2292880 2311223 2174026 2006979 2418827 2352653 2079032 2301002 2200576 2064786 1884268
13950 1884268 2252649 1948305 1913592 1893785 1963742 2017840 1824546 1692104 1596122 1901409
13940 1901409 2001656 1441877 1548047 1700743 1887123 1693512 1502527 1869299 1671713
13931 1671713 1626691 1983136 1786993 1528336 1800562 1613813 1562715 1799676 1840252 1585922
13921 1585922 1680166 1512182 1631342 1793151 1505416 1640988 1799386 1677546 1278294 1261680
13911 1261680 1669290 1325578 1410793 1884549 1401387 1358335 1285023 1138030 1694153 1538159
13901 1538159 1333764 1238759 1584428 1656067 1219280 1350948 1239957 1313821 1582373 1350459
$$ packed form
13970B659029j64731J37111k78808L61377k43969j77723K91961j49757j0730j30880
13960B292880J8343j37197j67047M11848o6174k73621K21970j00426j35790j80518
13950A884268L68381l04344l4713j9807O9957N4098j93294j32442r5982L05287
13940A901409J00247n59779J06170J52696J86380j93611j90985L66772j97586
13931A671713m5022L56445j96143k58657K72226j86749n1098K36961M0576k54330
13921A585922R4244j67984J19160J61809k87735J35572J58398j21840l99252j6614
13911A261680M07610l43712Q5215M73756m83162m3052p3312j46993N56123j55994
13901A538159k04395r5005L45669P1639m36787J31668j10991P3864K68552k31914
$$ plain form
13891 1350459 1544715 1337061 1187859 1562210 1135523 1044707 1228554 1308537 1220403 1539861
13881 1539861 1407888 1339868 1149078 1599378 1168580 1169742 1408178 1080038 1213490 1223448
13871 1223448 1168698 1328467 1026328 1109587 1128624 1400898 1083712 1115085 1100020 1433737
13861 1433737 1203739 1321844 1237313 1267681 1354133 1154396 1214969 1242872 1291326 1295915 1097755
13850 1097755 1010479 927050 1170800 1169449 1186311 908590 1268290 915949 1240114 1018636
13840 1018636 714986 1068165 1113663 762349 889054 1099778 1084803 667403 838619 926670
13830 926670 1213401 1217036 947009 736760 884867 779965 1137283 942136 979933 973196
13820 973196 929456 953270 920053 1264167 995058 963487 789014 981624 859663 898039
$$ packed form
13891A350459J94256k07654j49202L74351m26687r0816J83847P9983q8134L19458
13881A539861j31973o8020j90790M50300m30798J162K38436l28140J33452R958
13871A223448n4750J59769l02139Q3259J9037K72274l17186L1373j5065L33717
13861A433737k29998J18105q4531L0368Q6452j99737O0573K7903M8454M589j98160
13850A097755q7276q3429K43750j351J6862k77721L59700l52341L24165k21478
13840A018636l03650L53179M5498l51314J26705K10724j4975m17400J71216Q8051
13830I26670K86731L635k70027k10249J48107j04902L57318j95147L7797o737
13820I73196m3740K3814l3217L44114k69109l1571j74473J92610j21961L8376
$$ plain form
13810 898039 921116 1026649 1018784 1001304 1099317 953037 1046946 621666 798537 919391 731978
13799 731978 944956 673097 1166621 1016654 960845 807216 775123 1115399 716065 1002805
13789 1002805 1115564 797013 546635 721336 752462 567584 646154 764767 584348 440971
13779 440971 769564 852639 651286 904309 952413 813671 654539 573440 735326 598928
13769 598928 391576 897930 811010 862898 412760 782528 1029372 766302 448788 739342
13759 739342 927773 454823 522057 355638 700890 559387 534698 632175 811702 753589
13749 753589 895093 340867 380298 196299 686768 273894 756642 676138 663915 429311
13739 429311 855032 513657 670722 637540 551152 475504 400127 799096 509303 612394
$$ packed form
13810H98039K3077J05533p865j7480R8013j46280R3909m25280J76871J20854j87413
13799G31978K12978k71859M93524j49967n5809j53629l2093L40276l99334K86740
13789A002805J12759l18551k50378J74701L1126j84878P8570J18613j80419j43377
13779D40971L28593Q3075k01353K53023M8104j38742j59132q1099J61886j36398
13769E98928k07352N06354q6920N1888D12760L69768K46844k63070l17514K90554
13759G39342J88431D54823O7234j66419L45252j41503k4689R7477J79527n8113
13749G53589J41504C40867L9431j83999M90469B73894M82748q0504j2223k34604
13739D29311M25721l41375J57065l3182q6388p5648p5377L98969k89793J03091
$$ plain form
13729 612394 450603 538179 468952 663376 825405 622873 795271 418375 748571 608561
13719 608561 688459 631018 391792 916867 643825 621599 437763 760435 420574 446331
13709 446331 556361 433264 962047 718035 364788 580788 975114 605150 700280 721266
13699 721266 714774 355066 380329 625000 686715 505844 309911 474604 685577 579802
13689 579802 742238 344530 646879 584302 544738 506011 553862 368701 403112 697035
13679 697035 627461 228823 403931 662279 412300 702462 652674 638411 211654 259959
13669 259959 440928 546876 533644 684373 373698 507090 537776 431929 585206 745190
13659 745190 423953 705473 440055 441508 684374 536585 400886 511774 580626 238699
$$ packed form
13729F12394j61791Q7576o9227J94424J62029k02532J72398l76896L30196j40010
13719F08561P9898n7441k39226N25075k73042k2226j83836L22672l39861K5757
13709D46331J10030j23097N28783k44012l53247K16000L94326l69964R5130K0986
13699G21266o492C55066K5263K44671O1715j80871j95933J64693K10973j05775
13689E79802J62436C44530L02349o2577l9564l8727M7851j85161L4411K93923
13679F97035o9574B28823J75108K58348k49979K90162m9788j4263B11654M8305
13669B59959J80969J05948j3232J50729l10675J33392L0686j05847J53277J59984
13659G45190l21237K81520k65418J453K42866j47789j35699J10888O8852B38699
$$ plain form
13648 574824 588029 304110 212849 78079 436368 357793 648114 322115 414829 339053 371641
13637 371641 487912 391164 142735 71998 710863 459530 359126 474350 353677 64517
13626 433664 120560 462677 740125 506820 240901 53716 309737 467617 -8783 297511
13615 554280 596417 82261 229061 476489 152981 153787 377042 580923 408679 388596 280348
13604 280348 114799 540390 522969 278911 -33287 348861 150317 311777 587699 308153
13594 308153 452728 615351 369878 430967 370836 564533 242156 386293 403442 293502
13584 293502 228606 462904 442423 321962 225195 450021 487290 128257 388265 344906
13574 344906 584754 413563 380975 158970 440055 193139 513503 566439 369454 107404
$$ packed form
13648E74824J3205k83919r1261G8079L58289p8575K90321C22115R2714p5776L2588
13637C71641J16271r6748A42735p0737O38865k51333j00404J15224j20673F4517
13626D33664A20560L42117K77448k33305B40901E3716K56021J57880h783B97511
13615E54280M2137H2261J46800K47428A52981Q06K23255K03881j72244k0083j08248
13604B80348A14799M25591j7421k44058c3287C48861A50317J61460K75922k79546
13594C08153J44575J62623k45473O1089o0131J93697B42156J44137J7149j09940
13584B93502o4896K34298k0481j20461r6767K24826L7269A28257K60008m3359
13574C44906K39848j71191l2588A58970K81085A93139L20364N2936j96985A07404
$$ plain form
13563 239130 355292 225746 415137 182610 357937 247333 432173 184558 445248 410496
13553 410496 245675 286639 112796 196266 378749 250865 147596 181751 337994 183100
13543 183100 311788 228998 257891 261296 186456 157971 255204 352213 390021 76744 303674
13532 303674 352870 462056 29886 327727 230096 447728 553517 496517 290132 206904
13522 206904 471763 304227 49345 428630 342140 405499 109020 566395 318841 -78464
13511 173909 236275 379511 60834 258547 133274 583549 336116 419191 479961 191888
13500 86834 258697 163630 649161 635564 66237 190107 251297 207494 196795 247021 102860
13488 338691 381842 388464 551626 266041 90741 204903 177285 390307 -211819 108023
$$ packed form
13563B39130J16162j29546J89391A82610J75327j10604J84840A84558K60690l4752
13553D10496j64821M0964A12796Q3470J82483j27884j03269L4155J56243j54894
13543A83100J28688q2790K8893L405p4840k8485R7233R7009L7808G6744K26930
13532C03674M9196J09186B9886K97841r7631K17632J05789n7000k06385q3228
13522B06904K64859j67536D9345L79285q6490O3359A09020M57375k47554g8464
13511A73909O2366J43236F0834J97713j25273M50275k47433Q3075O0770A91888
13500H6834J71863r5067M85531j3597F6237J23870O1190m3803j0699N0226A02860
13488C38691M3151O622J63162B66041I0741J14162k7618K13022b11819A08023
$$ plain form
13477 169260 345565 279566 41605 194730 104238 246293 212384 409502 373035 327791 451616
13466 451616 107467 -83088 408298 164228 260979 190090 454457 34869 277249 239845
13456 239845 22617 399091 246630 300303 370452 168969 94457 539172 306948 -4618 287293
13444 253870 63001 328013 268164 176231 75918 278445 113569 367250 270606 115606
13433 254203 289605 376027 250437 450421 -21952 13423 240044 210818 353526 185538
13423 185538 153539 427864 314572 268242 56137 169752 -10018 72820 131419 218382 57262
13411 366594 -10239 535002 -16483 126891 157601 262649 224729 416562 339419 124343
13400 236316 489364 10434 218777 181693 315618 45619 249712 94506 333055 317931
$$ packed form
13477A69260J76305o5999D1605J53125r0492J42055l3909J97118l6467m5244J23825
13466D51616A07467h3088D08298A64228R6751p0889K64367C4869K42380l7404
13456B39845B2617L76474j52461N3673P0149A68969p4512M44715k32224d618B87293
13444B53870F3001K65012n9849r1933G5918K02527A13569K53681r6644A15606
13433B54203L5402Q6422j25590J99984b1952A3423K26621k9226J42708j67988
13423A85538l1999K74325j13292m6330E6137J13615a0018G2820N8599Q6963E7262
13411C66594a0239E35002a6483A26891L0710J05048l7920J91833p7143A24343
13400B36316K53048A0434K08343l7084J33925D5619K04093I4506K38549j5124
$$ plain form
13390 317931 198573 -14896 254414 -15162 506782 293299 309427 140054 364136 -77415
13379 245222 417014 179320 208141 258632 13503 283331 -116770 -87969 51124 371477
13369 371477 -13709 397865 603261 288949 419533 391050 46745 129602 420185 181882
13358 488359 -131755 11747 347175 226161 477111 -84503 128670 304444 237388 26884
13347 9491 389671 200009 389223 182611 -86229 495446 335720 287315 442267 545523
13337 545523 352534 315741 575846 123215 205074 381209 33484 274974 279217 116474
13326 169348 218457 307008 395749 173506 -43916 136382 301187 229636 442395 139438
13315 -8872 362215 223264 247255 122415 204177 224553 63491 257653 108870 136069 241634
$$ packed form
13390C17931j19358a4896B54414a5162E06782k13483J6128A40054K24082g7415
13379B45222J71792A79320K8821N0491A3503K69828a16770K8801E1124L20353
13369C71477a3709C97865K05396B88949J30584k8483D6745Q2857K90583A81882
13358D88359a31755A1747L35428j21014K50950h4503A28670J75774o7056B6884
13347I491L80180j89662J89214A82611h6229D95446j59726m8405J54952J03256
13337E45523j92989l6793K60105A23215Q1859J76135C3484K41490M243A16474
13326A69348M9109Q8551Q8741A73506d3916A36382J64805p1551K12759A39438
13315h872C62215j38951K3991A22415Q1762K0376F3491J94162A08870K7199J05565
$$ plain form
13304 241634 -52865 165110 254182 66824 207746 253802 -90452 204100 316563 423949
13294 423949 37399 106207 108484 198043 34726 327957 151393 269971 61626 291871 286870
13283 286870 120839 451193 267129 -221052 -87592 111278 -28002 200365 286680 158243
13273 158243 59119 101982 -29939 29978 49056 50456 74874 253581 11869 140624 118941
13262 118941 97746 214253 202195 79757 377456 58460 250809 -397255 110020 363569
13252 363569 208846 107202 140282 82420 253434 172871 35215 93106 356187 84117 -108286
13240 345281 24406 -15514 -171790 299500 70313 172994 -299296 145837 20138 -15450
13229 243795 77047 334963 209406 -29858 78815 249782 291420 -126374 166755 172780 151770
$$ packed form
13304B41634e2865A65110Q9072F6824J40922M6056i0452B04100J12463J07386
13294D23949C7399O8808K277Q9559C4726K93231A51393J18578F1626K30245n001
13283B86870A20839L30354j84064b21052h7592A11278b8002B00365Q6315j28437
13273A58243E9119M2863b9939B9978J9078J400K4418J78707A1869J28755k1683
13262A18941k1195J16507j2058G9757K97699E8460J92349c97255A10020K53549
13252C63569j54723j01644L3080n7862J71014q0563C5215N7891K63081H4117a08286
13240C45281B4406a5514j56276B99500G0313J02681b99296A45837B0138a5450
13229B43795G7047K57916j25557b9858G8815J70967M1638a26374A66755O025k1010
$$ plain form
13218 151770 -43955 479186 415294 -169624 138878 194808 -73632 -239975 177487 58735
13207 17112 102380 298356 180088 260329 -222527 92561 -106764 -203141 225364 144310 8297
13195 -11152 390487 -42138 103236 199908 278345 -40731 -138984 -167738 143175 14016 385709
13184 385709 83286 -84657 140669 -11890 227193 295911 333605 252687 7637 25448 426868
13173 426868 64670 -154256 88890 19561 -30331 74062 335492 289642 95464 229024 166934
13162 166934 -61179 230942 -67065 35796 88135 78015 27615 6009 119364 20752 212969
13151 212969 -34613 108089 170374 -78809 313108 -12032 188255 343644 266502 -12721 -81415
13140 -81415 -170401 179278 6003 466866 38022 -109117 46718 340436 -5028 192788 -70636
$$ packed form
13218A51770d3955D79186o3892a69624A38878N5930g3632j66343A77487E8735
13207A7112Q5268J95976j18268Q0241b22527I2561a06764r6377B25364q1054H297
13195a1152C90487d2138A03236R6672P8437d0731r8253k8754A43175A4016L71693
13184C85709H3286h4657A40669a1890B27193O8718L7694q0918G637J7811M01420
13173D26868F4670a54256H8890A9561c0331G4062K61430m5850I5464J33560o2090
13162A66934f1179B30942f7065C5796N2339j0120B7615F009J13355B0752J92217
13151B12969c4613A08089O2285g8809C13108a2032A88255J55389p7142a2721o8694
13140h1415q8986A79278F003M60863C8022a09117D6718K93718e028A92788g0636
$$ plain form
13128 144014 202244 119873 -5429 125040 192055 -32919 74013 -35641 45286 -9727 342063
13116 50724 246894 61843 -72129 -50695 129691 -191430 302845 -162632 362279 -57369
13105 111058 102 358300 2167 -125872 -6619 -860 53049 202423 145085 43779 92371 -36150
13092 22887 318103 211881 311885 135285 217724 -297458 -199530 9570 -107107 -2289 -340156
13081 -340156 -222666 77428 108200 79066 -142682 -94931 216845 30876 140073 -236928
13070 -185216 401627 -51424 -215270 233680 -200888 -22059 -237922 172620 40752 411308
13060 411308 50124 130398 -115994 280694 -250558 96516 489378 22565 72511 125815 207352
13049 207352 -8966 -30509 -17635 23023 -58639 276470 515822 235510 624 129853 -92373
$$ packed form
13128A44014N8230q2371e429A25040O7015c2919G4013c5641D5286i727C42063
13116E0724J96170F1843g2129K1434A29691a91430C02845a62632C62279e7369
13105A11058A02L58198B167a25872f619h60E3049J49374n7338D3779M8592c6150
13092B2887K95216j06222J00004A35285Q2439b97458R7928I570a07107b289l37867
13081c40156J17490G7428L0772k9134a42682M7751B16845C0876J09197b36928
13070a85216D01627e1424j63846B33680b00888b2059k15863A72620D0752L70556
13060D11308E0124Q0274a15994B80694b50558I6516L92862B2565M9946N3304Q1537
13049B07352h966k1543J2874B3023e8639B76470K39352B35510F24J29229i2373
$$ plain form
13037 -102564 -285075 -39879 -19917 -391993 401553 112414 252117 19863 133035 -141136
13026 223664 118122 -9354 91962 -97973 -130442 331781 8940 266782 286899 215438 -71879
13014 -35405 337642 40207 184563 59874 -395067 -49777 176749 -106742 111438 316664
13004 316664 223827 125394 200847 38888 102038 221372 71475 -101599 84059 172991 44763
12992 -41409 187917 155574 277795 -356734 153998 -158414 258877 293719 15472 194562
12982 194562 -329698 68926 -187982 -25553 -6111 -326080 130946 137016 1748 272544 -161123
12970 109511 -161025 305646 -86420 -8737 -124433 92327 144239 318233 350617 -96684 31357
12958 144642 -36421 155525 179986 104663 269471 33860 172629 -1641 221830 136027 -35499
$$ packed form
13037a02564j82511c9879a9917l72076D01553A12414J39703A9863J13172a41136
13026B23664j05542i354I1962i7973l2469C31781H940K57842K0117p1461g1879
13014c5405C37642D0207J44356E9874c95067d9777A76749a06742A11438K05226
13004C16664r2837r8433P5453C8888O3150J19334G1475a01599H4059Q8932D4763
12992d1409A87917l2343J22221c56734A53998a58414B58877L4842A5472J79090
12982A94562c29698F8926a87982b5553f111l19969A30946O070A748K70796a61123
12970A09511a61025C05646h6420h737j15696I2327N1912J73994L2384i6684C1357
12958A44642c6421A55525K4461p5323J64808C3860J38769a641B21830q5803c5499
$$ plain form
12946 -136801 -23547 47201 1412 176318 177672 74129 176464 264393 -15665 -71074 57273
12934 -71816 -137673 -52316 -166208 -63299 -141889 -413461 80639 -258331 -98969 -10109 95126
12922 273484 -119238 -99404 -68116 -302044 -31825 92806 82970 8778 36630 280994 126452
12910 43382 -3794 21501 -13401 -143726 70402 50027 -140333 97370 121604 230304 -246065
12898 -95257 72438 30720 354594 -336936 -90221 -181395 -119471 193819 -275114 -107550 103936
12886 98323 167406 -83349 48954 59653 12661 -129894 123460 165430 -42264 13537 246172
12875 246172 413918 45748 -92577 373677 332150 33167 -119883 96425 148157 -229091 -56140
12863 -191128 355034 -183411 56630 27868 -145213 57472 -136807 -50538 131832 326448
$$ packed form
12946a36801b3547D7201A412J74906J354G4129J02335Q7929a5665n5409E7273
12934g1816o5857e2316j13892f3299p8590k71572H0639b58331i8969a0109I5126
12922B73484a19238J9834L1288k33928c1825I2806r836H778K7852K44364A26452
12910D3382c794B1501a3401j30325G0402k0375a40333I7370K4234J08700b46065
12898i5257G2438C0720L23874c36936i0221r1174O1924A93819b75114a07550A03936
12886I8323O9083h3349D8954J0699A2661a29894A23460M1970d2264A3537K32635
12875B46172J67746D5748i2577C73677m1527C3167a19883I6425N1732b29091e6140
12863a91128C55034a83411E6630B7868a45213E7472a36807e0538A31832J94616
$$ plain form
12853 326448 79850 -101594 14558 28063 -15085 243142 -146160 -307460 -71085 217293
12842 -11620 128550 97073 68855 -461888 237536 -185822 -106126 -8966 -89627 -453 190179
12830 -136724 79696 -25851 -100967 328818 301237 -27447 200232 316902 125446 -22841 30037
12818 386359 39488 -146957 -145975 199171 170826 146458 -304741 49192 191262 -252664 233652
12806 29294 -188434 -86156 -138943 -77821 10136 -208638 -9375 89727 -32789 -207203 -246285
12795 -246285 147078 229082 -71006 -78437 57845 -131823 -197871 39584 -130998 -171738 77026
12783 48424 -45941 77437 -8408 -76268 -159923 -295385 -51446 -43637 254823 17890 -230178
12771 -51267 -82727 59338 -140495 -114036 238340 22520 -116950 227266 -19311 88461 45612
$$ packed form
12853C26448G9850a01594A4558J3505a5085B43142a46160j61300g1085B17293
12842a1620A28550l1477k8218d61888B37536a85822P9696h966q0661d53A90179
12830a36724G9696b5851p5116C28818k7581b7447B00232J16670A25446b2841C0037
12818C86359C9488a46957R82A99171k8345k4368c04741D9192J42070b52664B33652
12806B9294a88434h6156n2787O1122A0136b08638i375H9727c2789j74414l9082
12795b46285A47078Q2004g1006p431E7845a31823o6048C9584a30998m0740G7026
12783D8424d5941G7437h408o7860q3655j35462e1446P809B54823A7890b30178
12771e1267l1460E9338a40495K6459B38340B2520a16950B27266a9311H8461m2849
$$ plain form
12760 45612 54647 155570 329048 101555 6440 321713 32458 -99555 -148492 -187884 -290959
12749 -290959 -129811 -295220 -145185 -37123 29916 -3334 44893 53886 -32426 172681 -208519
12737 99411 -244183 270202 -121061 179808 -95696 148421 -235399 81684 -237358 -90636
12726 -29209 -26453 82577 155987 48149 132211 250164 -123243 129889 -27828 -175898 98511
12714 125695 395407 -18736 -276783 -207939 213755 -427402 286415 -331207 143350 -111424
12703 -96128 -7509 -271568 176720 158054 -103080 -234326 250704 -66474 62846 354418 83016
12691 -75052 121775 383457 -146417 -177408 -360711 166337 159356 -75935 20183 181289 -54976
12679 89883 53165 58733 285938 259089 -63372 162048 -284484 86761 -115838 20441 42783
$$ packed form
12760D5612R035J00923J73478A01555F440L15273C2458i9555m8937l9392j03075
12749b90959a29811j65409a45185c7123B9916c334D4893Q993c2426A72681b08519
12737I9411b44183B70202a21061A79808i5696A48421b35399H1684b37358i0636
12726b9209K756H2577P3410D8149Q4062J17953a23243A29889b7828j48070I8511
12714A25695K69712a8736k58047O8844B13755d27402B86415c31207A43350a11424
12703i6128g509k64059A76720j8666a03080j31246B50704f6474F2846K91572H3016
12691g5052A21775K61682a46417l0991j83303A66337o981g5935B0183J61106e4976
12679H9883l6718N568K27205k6849f3372A62048b84484H6761a15838B0441K2342
$$ plain form
12668 42783 239047 176359 187857 188940 121876 -133907 117491 287340 453273 53445 49721
12657 49721 169647 236354 228977 229337 96409 379882 352532 284121 125207 100994 114665 18639
12644 -66575 166073 -49812 -372985 160345 87853 61111 -157918 147167 48757 211893
12634 211893 360430 332546 -111773 -82638 58102 -12996 148508 59062 186616 212619 -17197
12622 126821 307194 64826 44534 58418 104914 -196074 44534 178229 -5987 -90889 -151745
12611 -151745 -316196 -80128 -154409 52312 -129919 -38308 212846 311431 193149 135664 -199804
12599 512 422379 98881 -38480 93858 -29721 131499 7208 207412 57611 140819 332847
12588 332847 94161 124194 -89110 -73164 92493 -39170 -333300 -106102 158892 -54881 201576
$$ packed form
12668D2783J96264o2688J1498J083o7064a33907A17491J69849J65933E3445l724
12657D9721J19926O6707p377L60I6409K83473k7350o8411A25207k4213J3671A8639
12644f6575A66073d9812l23173A60345p2492k6742a57918A47167D8757J63136
12634B11893J48537k7884a11773K9135E8102a2996A48508E9062J27554K6003a7197
12622A26821J80373F4826k0292J3884M6496a96074D4534J33695e987q4902o0856
12611a51745j64451h0128p4281E2312a29919c8308B12846R8585j18282n7485a99804
12599E12M21867I8881c8480I3858b9721A31499G208K00204E7611Q3208J92028
12588C32847I4161L0033h9110J5946I2493c9170k94130a06102A58892e4881B01576
$$ plain form
12576 -326176 -158792 119286 -173641 -49548 -166432 -238240 85085 140676 158606 21468 104690
12565 104690 177968 -278101 7808 -4946 -388551 47748 180206 42909 123198 -64570 18897
12553 93243 131403 -301244 50993 -135179 24972 77608 -52086 10762 -394531 118939 75799
12542 75799 -151251 -189820 -82111 62481 223393 -226591 157955 216290 82835 4094 45887
12531 45887 -122696 443599 -132401 138500 -196951 119522 -3212 -4717 290574 114980
12520 66645 171079 123006 322096 223815 1602 96030 205342 -215973 -83194 -6847 -142831
12509 -142831 28726 206583 -44281 63291 -13668 -89220 -216791 -59592 -108129 -194346 28594
12497 -12698 -138674 -26159 383053 52891 25959 282957 -91727 261858 94664 194760 167781
$$ packed form
12576c26176a58792A19286a73641d9548j16884p1808H5085N5591J7930B1468Q3222
12565A04690P3278b78101G808d946l83605D7748J32458D2909Q0289f4570A8897
12553I3243L8160c01244E0993a35179B4972N2636e2086A0762c94531A18939m3140
12542G5799a51251l8569h2111F2481J60912b26591A57955N8335H2835D094M1793
12531D5887a22696D43599a32401A38500a96951A19522c212j505B90574A14980
12520F6645J04434m8073J99090r8281A602R4428J09312b15973h3194f847j35984
12509a42831B8726J77857d4281F3291a3668p5552j27571e9592m8537q6217B8594
12497a2698j25976b6159C83053E2891B5959K56998i1727B61858I4664J00096k6979
$$ plain form
12486 167781 137324 35645 51980 -138003 100441 -238552 61 -62785 -244391 185069 -132617
12474 84566 -28898 294366 218409 -16542 -28057 -63219 -177885 42803 134117 235011 251110
12463 251110 18338 126306 101556 174514 -10956 195731 62498 83319 -58418 -96676 -14423
12451 405065 11849 -109562 -242466 -162465 -25248 -152325 -30446 -243058 269366 -125016
12440 -314310 -71860 85040 130093 29529 44872 100355 -59114 -293721 252381 86528 142754
12429 142754 -121099 70998 51151 -1212 -40677 54199 -61122 -136682 -456710 -407224 -474736
12418 -474736 -74240 204948 23493 60338 34447 77361 -60466 -112880 -161170 172501 -118785
12406 443952 -24657 -8885 183978 74864 19486 89164 -58160 225132 -285994 145656 16934
$$ packed form
12486A67781l0457C5645J6335a38003A00441b38552F1f2785j81606A85069a32617
12474H4566b8898B94366p5957a6542j1515l5162j14666D2803R1314J00894J6099
12463B51110A8338J07968k4750P2958a0956A95731F2498K0821e8418l8258a4423
12451D05065A1849a09562j32904Q0001b5248j27077c0446k12612B69366a25016
12440c14310g1860H5040M5053B9529J5343N5483e9114k34607B52381H6528N6226
12429A42754a21099G0998j9847a212l9465E4199f1122p5560l20028M9486o7512
12418d74736g4240B04948B3493L6845k5891M2914f0466n2414m8290A72501a18785
12406D43952b4657h885A83978G4864A9486O9678e8160B25132b85994A45656A6934
$$ plain form
12394 357842 84009 123964 159141 54756 270515 100120 239953 198731 100541 102854 306798
12383 306798 30248 216553 239199 -9535 -214961 55532 226331 22453 229763 198576 -62668
12371 96145 94996 180419 -88221 -27945 65668 -48235 -149361 -137043 -113597 -65295 68254 11579
12358 -50874 -21897 42810 250880 -285294 -149021 -125583 -172955 181332 76849 151668 -163977
12346 -393787 379225 111115 329552 250219 -123002 -102631 414871 183388 162699 -174001
12335 64370 -189672 157952 438995 206974 65461 79247 457732 255773 62302 499756
12325 499756 345801 -37440 339208 18060 372863 400426 -155607 180483 314810 199479
12315 199479 331816 175636 -2031 15607 342951 103241 494129 64774 137060 99947 370538
$$ packed form
12394C57842H4009L9955L5177E4756K15759A00120J39833m1222r8190K313K03944
12383C06798C0248J86305K2646i535k05426E5532J70799B2453K07310l1187f2668
12371I6145j149Q5423h8221b7945F5668d8235j01126J2318K3446M8302F8254A1579
12358e0874b1897D2810K08070b85294J36273K3438m7372A81332G6849P4819a63977
12346c93787C79225A11115K18437p9333a23002K0371D14871A83388k0689a74001
12335F4370a89672A57952K81043B06974F5461J3786L78485k01959F2302M37454
12325D99756j53955c7440C39208A8060L54803K7563a55607A80483J34327j15331
12315A99479J32337j56180b031A5607L27344A03241L90888F4774P2286l7113K70591
$$ plain form
12304 370538 230140 -295 -14615 231066 -180157 319716 -59452 -106617 -261552 22278 84611
12293 84611 -50650 -21730 392954 232802 -184485 -40100 -19768 59438 90507 -72608 64270
12281 115040 -21479 277970 -104487 1923 80249 -169834 100232 64906 386304 -39940 212516
12269 176335 45151 34231 22254 301887 -21794 -49262 -54203 418893 183814 -364472 261604
12257 132583 38125 -17616 103607 285910 159073 -91378 140222 253286 -132807 -118905
12247 -118905 432690 14306 69089 -40834 -13453 44730 119949 8470 -247103 130664 124780
12236 124780 224327 -103895 -157908 52749 50555 30474 -80846 433372 305688 477433 143248
12224 329123 245113 -49020 76525 79595 -10654 326464 193788 183412 -37497 219342 331817
$$ packed form
12304C70538j40398b95j4320B31066a80157C19716e9452m7165j54935B2278O2333
12293H4611e0650b1730C92954j60152a84485d0100a9768E9438L1069g2608F4270
12281A15040b1479B77970a04487A923P8326a69834A00232l5326L21398c9940B12516
12269A76335D5151j0920j1977K79633b1794k7468m941D18893A83814c64472B61604
12257A32583C8125a7616A03607J82303j26837i1378A40222J13064a32807J3902
12247a18905D32690A4306N4783d0834a3453D4730P5219H470b47103A30664n884
12236A24780R9547a03895n4013E2749k194k0081h0846D33372j27684J71745A43248
12224C29123q4010d9020G6525L070a0654C26464j32676j0376c7497B19342J12475
$$ plain form
12213 331817 266832 17643 87928 215092 254279 -68762 278455 184671 -236388 292252 199077
12202 199077 163690 207461 167115 477277 654182 537875 289323 290832 191806 154591 111630
12191 111630 273448 348731 476029 180642 252639 265132 72232 208693 390412 539241
12181 539241 -180528 108018 68660 82223 110501 281223 126100 508980 231177 420677
12171 420677 323718 456463 478038 203723 -22097 230721 487670 143455 357450 163665
12160 252536 225213 29971 168751 291467 233692 166304 -214354 442111 -99549 245571
12149 3727 95697 -28517 40855 5896 317727 162085 356747 135989 61563 349710 126494
12137 183626 -6930 574870 96212 172893 27566 513951 490134 169604 70837 230680 278166
$$ packed form
12213C31817o4985A7643P0285J27164L9187f8762B78455r3784b36388B92252r3175
12202A99077l5387M3771m0346L10162J76905j16307k48552J509r9026l7215m2961
12191A11630J61818P5283J27298A80642P1997J2493G2232J36461J81719J48829
12181E39241a80528A08018l9358J3563K8278J70722A26100L82880B31177J89500
12171D20677r6959J32745K1575B03723b2097B30721K56949A43455K13995A63665
12160B52536k7323B9971J38780J22716n7775o7388b14354D42111i9549B45571
12149C727R1970b8517D0855E896L11831j55642J94662A35989F1563K88147A26494
12137A83626f930E74870I6212P6681B7566M86385k3817A69604G0837J59843M7486
$$ plain form
12126 278166 77975 200874 450616 342733 136300 399907 560629 208106 271194 -236231
12115 387532 18684 58742 -165953 -117965 165086 -62543 141720 152398 89587 122779 40628
12103 24852 351600 325914 48404 117870 224687 36769 14705 151052 228853 70045 106693
12092 106693 245375 169072 -40371 156058 -135774 271272 193432 148796 149789 307289 -458
12080 250565 83124 151528 333976 26863 206202 318837 -77435 112502 -10124 35848 202119
12069 202119 72557 185833 167672 -320255 -65095 -114952 -361553 80828 11513 -53262 187237
12057 46106 91819 149162 -388214 142942 58491 -133093 -269876 -135449 -1636 77154 -336628
12045 -95705 -43886 360198 120987 43192 -39719 19456 25870 -238859 -80848 19709 87787
$$ packed form
12126B78166G7975J22899K49742j07883A36300K63607J60722B08106O3088b36231
12115C87532A8684M0058a65953M7988A65086f2543A41720J0678o2811L3192D0628
12103B4852L26748k5686D8404O9466J06817C6769A4705J36347P7801G0045L6648
12092A06693J38682p6303d0371A56058a35774B71272p7840m4636R93J57500d58
12080B50565H3124O8404J82448B6863J79339J12635g7435A12502a0124C5848J66271
12069B02119G2557J13276j8161c20255f5095m9857k46601H0828A1513e3262A87237
12057D6106M5713N7343c88214A42942E8491a33093j36783J34427a636G7154c36628
12045i5705d3886C60198A20987D3192c9719A9456O414b38859h0848A9709O8078
$$ plain form
12034 87787 -161211 67366 128868 46842 35197 231811 253425 -188723 -69180 -215181 -127779
12023 -127779 24338 -139840 -46025 -258692 1662 -166929 -246251 -174960 66017 -77627 42987
12011 196079 -134179 -142507 -407184 -116809 203203 -125254 -49071 -228383 201385 14690
12000 99318 53611 249208 -160289 61387 -71500 202337 127979 158599 -50346 -37854 -261404
11989 -261404 162193 -142932 132521 -198096 -90157 74535 -158782 59229 -75781 -64641
11979 -64641 371698 -218113 162465 -245276 -388326 43169 -420537 71323 -205666 -104309
11969 -104309 207668 -35188 61216 -231395 -261755 110764 125742 363671 -328058 -63036
11958 -261587 -245103 -21297 -224047 -116326 -129438 -174591 8066 21213 -406880 62827 140584
$$ packed form
12034H7787a61211F7366O1502D6842j1645J96614K1614a88723f9180j46001Q7402
12023a27779B4338a39840d6025k12667A662a66929p9322P1291F6017g7627D2987
12011A96079a34179q328k64677a16809B03203a25254d9071j79312B01385A4690
12000I9318m5707J95597a60289F1387g1500B02337p4358L0620e0346J2492k23550
11989b61404A62193a42932A32521a98096i0157G4535a58782E9229g5781J1140
11979f4641C71698b18113A62465b45276j43050D3169d20537G1323b05666J01357
11969a04309B07668c5188F1216b31395l0360A10764J4978K37929c28058f3036
11958b61587J6484b1297k02750J07721j3112m5153H066J3147d06880F2827P7757
$$ plain form
11947 140584 -298553 475454 -144093 -117605 4071 -178722 -229493 29164 195551 114110 -144085
11935 -67379 -132946 8802 91911 -14053 -89561 -373900 12049 -143536 196248 -121080 -392433
11924 -392433 -182238 -23590 -63517 46206 -285212 -129765 171432 -41862 -38923 -39886 -18575
11912 -345563 -169402 91583 267884 -114136 52237 -36159 -183911 85234 202521 -19085
11901 -236777 10831 -124633 160096 225868 -66237 283561 104970 -39350 137485 82892
11891 82892 -225774 -249414 -9662 -3463 -177361 76779 141086 -251499 -110618 -140943 -62770
11879 -9519 168897 162486 -149010 94522 -108064 457635 43294 355475 -101880 -41002 -242825
11868 -242825 -312219 -9202 -468062 -27641 -52863 -33418 -91242 72570 224134 -91731 -491930
$$ packed form
11947A40584b98553D75454a44093K6488D071a78722n0771B9164J66387q1441a44085
11935f7379o5567H802Q3109a4053p5508k84339A2049a43536A96248a21080k71353
11924c92433a82238b3590l9927D6206b85212a29765A71432d1862K939r63a8575
11912c45563a69402I1583J76301a14136E2237c6159j47752H5234J17287a9085
11901b36777A0831a24633A60096O5772f6237B83561A04970c9350A37485n4593
11891H2892b25774k3640i662c463j73898G6779O4307b51499a10618l0325f2770
11879i519A68897o411a49010I4522a08064D57635D3294L12181a01880d1002k01823
11868b42825o9394i202m58860b7641k5222J9445n7824G2570J51564i1731m00199
$$ plain form
11857 -491930 259943 10770 -117316 -218693 -46396 172955 289971 145352 -186942 78021
11846 -31263 -159869 66493 82191 -116072 -180786 -221208 -64038 -52260 -317777 -206467 -147237
11835 -147237 -8491 -447725 -261015 -157300 285290 80578 143205 -209922 -164818 273830
11824 326443 -48877 85494 49872 39778 87011 -28032 -147381 108438 13276 74520 84437
11813 84437 -201121 -182167 -220307 -166627 153843 168596 -164477 34886 -225350 92560 -134475
11801 -66217 -134772 -108092 -54666 85171 -121457 49704 -96046 372957 16051 -5269 -217413
11790 -217413 -139337 86116 -239017 -368388 -247648 -21694 -240106 -81062 -171387 116813
11779 81594 -69714 85232 -67586 -243516 -29525 113094 -116523 -216706 129367 232874
$$ packed form
11857d91930B59943A0770a17316j01377d6396A72955J17016j44619a86942G8021
11846c1263j28606F6493J5698a16072o4714m0422f4038J1778k65517J11310N9230
11835a47237h491m39234J86710J03715B85290H0578O2627b09922M5104B73830
11824C26443d8877H5494l5622j0094M7233b8032j19349A08438A3276O1244R917
11813H4437b01121J8954l8140N3680A53843J4753a64477C4886b25350I2560a34475
11801f6217o8555K6680N3426H5171a21457D9704i6046C72957A6051e269k12144
11790b17413P8076H6116b39017j29371J20740b1694k18412h1062r0325A16813
11779H1594f9714H5232f7586j75930b9525A13094a16523j00183A29367J03507
$$ plain form
11769 232874 -159862 -100151 -118225 54347 294790 114 155050 -161447 -65488 -248905 85893
11757 -49292 28406 61097 -119157 47523 -334258 9051 -213989 -81767 126707 50450 -171253
11745 -154782 -265007 -57287 -186232 -53262 57349 49329 241954 -175602 191767 -216171
11734 154729 -340884 59409 87049 270393 -247500 -172723 -223252 -293167 -245212 -204189 -89466
11722 -216377 -59320 -229923 274739 -193791 -112189 -300919 -171583 -466208 -14123 -86221
11712 -86221 -258983 293903 -75664 -37008 -207102 -80157 -127924 -159932 -115690 169961 -64319
11700 13985 -24683 -304643 -97648 250392 -19023 -99715 -5179 -93524 57532 -77873 267097
11688 -78365 -18538 124440 185032 -72069 96470 -137903 -127154 -1545 -53987 -202615 -202702 111962
$$ packed form
11769B32874a59862N9711j8074E4347K40443A14J54936a61447f5488j83417H5893
11757d9292B8406L2691a19157D7523c34258I051b13989h1767A26707E0450a71253
11745a54782j10225e7287j28945e3262E7349q020J92625a75602A91767b16171
11734A54729c40884E9409K7640J83344b47500P4777n0529o9915M7955M1023h9466
11722b16377e9320j70603B74739a93791Q1602j88730J29336k94625a4123p2098
11712h6221j72762B93903g5664c7008j70094h0157m7767l2008M4242A69961f4319
11700A3985b4683k79960i7648B50392a9023q0692e179q8345E7532g7873B67097
11688g8365a8538A24440O0592g2069I6470a37903J0749a545n2442j48628q7A11962
$$ plain form
11675 -84566 -263790 339671 -141858 -53045 -23170 -143746 117139 -165547 -149174 -166172
11665 -166172 -6421 -107261 -102944 -65365 -126959 -56803 135966 -85679 -441202 -176082 60221
11653 -12434 179164 -110691 -1128 -159124 108891 52276 -202601 -131121 -196179 -51056 233780
11641 110278 -503829 145183 -35785 -66183 -75249 -83555 39935 -11168 -210187 30131 -162367
11629 -94806 -1034 -48744 71291 -243466 71349 272617 -59439 1251 191416 -96251 -171649
11618 -171649 -96214 -126173 129280 67162 150936 -328990 -152024 -306189 43017 -215886
11607 -214491 -77369 -210509 42197 -77604 48217 -214764 -49097 166223 86213 -2474 -55354
11596 -55354 -67253 296929 -202700 115268 75321 223330 -172710 -41628 -96141 26758 -68999
$$ packed form
11675h4566j79224C39671a41858e3045b3170j20576A17139a65547J6373j6998
11665a66172f421j00840M317L7579o1594e6803A35966h5679l55523a76082F0221
11653a2434A79164a10691a128j57996A08891E2276b02601P1480o5058e1056B33780
11641A10278e03829A45183c5785l0398r066q306C9935a1168j99019C0131a62367
11629i4806a034m7710G1291b43466G1349K01268e9439A251J90165i6251p5398
11618a71649P5435k9959A29280o2118Q3774c28990a52024j54165D3017b15886
11607b14491g7369j33140D2197g7604D8217b14764d9097A66223q0010b474n2880
11596e5354j1899B96929b02700A15268l9947J48009a72710d1628n4513B6758f8999
$$ plain form
11584 -13708 -109856 78103 -130362 36164 -27551 -28283 -4926 -241599 -152655 -7294 -208430 -66826
11571 23344 189242 -189962 8367 -70723 284773 -57728 -17685 -168499 57634 -16873 69021
11559 -162819 189682 3339 -92804 -6062 183303 -190261 12657 -68624 -297316 -42200 96148
11547 172906 55636 278878 98519 55037 -93245 213447 109794 -297171 -83318 14004 -422372
11535 125684 -160824 -141843 -12091 40054 108566 37785 96788 101010 75476 -45873 -141816
11524 -141816 310554 -139264 153075 125957 190353 -160750 -141051 109903 -189794 267966
11513 221119 57671 -243180 248750 71248 81325 -87339 -170787 22770 -254345 -79391 177121
11501 -172707 405516 -61418 -131743 -97912 91095 -32325 77667 -83119 133690 269649 182138
$$ packed form
11584a3708r6148G8103a30362C6164b7551p32d926k36673Q8944g294k01136f6826
11571B3344J65898a89962H367g0723B84773e7728a7685j50814E7634a6873F9021
11559a62819A89682C339i2804f062A83303a90261A2657f8624k28692d2200I6148
11547A72906E5636K23242I8519m3482i3245B13447j03653b97171h3318A4004d22372
11535A25684a60824J8981a2091D0054O8512C7785N9003M222k5534d5873r5943
11524a41816C10554a39264A53075k7118O4396a60750J9699A09903a89794B67966
11513B21119E7671b43180B48750G1248J0077h7339q3448B2770b54345g9391A77121
11501a72707D05516f1418p0325L3831I1095c2325G7667h3119A33690J35959q7511
$$ plain form
11490 182138 -28318 328170 475051 -179320 110465 139516 207208 -158902 132027 388032
11480 388032 393218 198337 99513 278367 -1464 186343 102561 -26676 -74430 208040 163634
11469 163634 -47730 409582 75732 -59658 -198693 33263 -81714 106525 113582 174987 84580
11457 87130 47930 204649 15818 132375 375051 180991 274271 -55873 -90062 13824 246454
11446 246454 123222 17173 127343 182765 -128532 282911 -4189 350414 -86563 -119359 322557
11434 293326 -99412 -108436 -43951 272461 89654 -72210 347801 44841 160375 269889 200226
11423 200226 -50098 229530 -220265 -46448 -278656 -9322 -76611 155053 240 47103 265885
11412 265885 -8890 73146 -212540 -177406 -109619 -129496 200186 -57204 -94666 -69729 75028
$$ packed form
11490A82138b8318C28170J46881a79320A10465K9051O7692a58902A32027K56005
11480C88032N186j94881r8824J78854a464A86343q3782b6676m7754B08040m4406
11469A63634d7730D09582G5732e9658j39035C3263h1714A06525P057O1405H4580
11457H7130l9200J56719A5818J16557K42676A80991R3280e5873l4189A3824K32630
11446B46454A23222A7173J10170N5422a28532B82911d189C50414h6563l2796C22557
11434B93326i9412r024d3951B72461H9654g2210C47801D4841J15534J09514o9663
11423B00226e0098B29530b20265d6448k32208i322o7289A55053B40M6863K18782
11412B65885h890G3146b12540L5134O7787j9877B00186e7204l7462K4937G5028
$$ plain form
11400 -335170 -91507 111577 -24351 34807 -23036 -127300 -381314 135511 -153531 -112333
11390 -112333 -165356 138488 188546 161196 -43715 -61827 -328117 52222 -125843 20471 -278616
11378 177681 249835 -167385 67505 -275543 -91087 18756 -251601 114808 22335 -171171
11367 35632 41320 94771 -78260 269271 -152635 159429 -111889 -11272 -140015 -306678 -179221
11356 -179221 -74730 -364529 77599 -160644 -229059 -229142 22995 -65239 -278765 -119844 5508
11344 -194825 -162095 -52193 -320675 -281721 156903 -346276 5547 -190210 -37064 -84173 -5536
11332 -21178 54920 37809 119435 258841 -306049 -43406 -64397 -68557 166833 -366530 -165242
11320 -221933 43998 -58913 138752 -238391 -24228 46047 -135218 -72026 242063 197119 -104241
$$ packed form
11400c35170i1507A11577b4351C4807b3036j04264k54014A35511a53531M1198
11390a12333n3023A38488N0058k7350d3715j8112k66290E2222a25843B0471b78616
11378A77681P2154a67385F7505b75543i1087A8756b51601A14808B2335a71171
11367C5632N688N3451g8260B69271a52635A59429a11889a1272j28743j66663J27457
11356a79221g4730k89799G7599a60644o8415q3B2995f5239k13526a19844E508
11344a94825L2730e2193k68482L8954A56903c46276E547a90210c7064m7109e536
11332b1178E4920j7111Q1626J39406c06049d3406k0991m160A66833c66530a65242
11320b21933D3998e8913A38752b38391b4228D6047a35218O3192B42063m4944a04241
$$ plain form
11308 -115679 111459 -68784 262804 230665 -233313 -72371 -185894 -230388 -985 24070 -168007
11296 87122 31762 -186315 -406377 25345 -35708 -350024 -75288 -8586 -197606 47373 407085
11285 407085 146130 -89064 241469 8659 -252624 -201004 -308426 -1251 -133579 112365 -84368
11273 64980 -250475 -177193 -316854 -191229 294626 -93085 334181 -318432 -67915 -330033
11263 -330033 -80044 142693 -10974 -120011 -4559 5870 73535 -142910 282195 -73190 17009
11251 -43649 148574 266212 -229673 80951 -201017 15252 -50152 -6032 224760 -32494 -332148
11240 -332148 122822 283831 -194305 -389223 88650 -207565 87853 -113715 16357 -180242
11229 138460 -257031 410472 284792 274103 175928 -39209 -71036 47849 198 55053 16254
$$ packed form
11308a15679A11459f8784B62804l2139b33313g2371j13523m4494i85B4070a68007
11296H7122C1762a86315k20062B5345c5708l14316g5288h586j89020D7373L59712
11285D07085A46130h9064B41469H659b52624N1620j07422a251j32328A12365h4368
11273F4980b50475P3282j39661J25625B94626i3085C34181c18432f7915k62118
11263c30033h0044A42693a0974j09037d559E870O7665a42910B82195g3190A7009
11251d3649A48574J17638b29673H0951b01017A5252e0152f032B24760c2494k99654
11240c32148A22822J61009a94305j94918H8650b07565H7853a13715A6357a80242
11229A38460b57031D10472j25680j0689r8175c9209l1827D7849A98N4855A6254
$$ plain form
11217 170475 132312 -49521 83642 -23583 60327 -30731 250715 67558 290281 -100957 -180766
11206 -180766 -277262 44730 -7429 -165044 -61666 -67327 -354979 -5281 164790 11991 -104767
11194 103932 195444 -33841 -139536 -125282 30459 -305009 -55741 -125309 113212 103590 342928
11183 342928 -169876 49325 -102984 -286459 -316468 -241569 -209125 21957 -25932 -77395 43902
11171 217773 -32169 -317387 -206180 -80261 151046 115254 -135395 -81350 -146881 -25296 27191
11159 -13875 -270372 51024 206819 -152614 164493 129383 -78343 41407 2309 48824 30020
11148 30020 -299360 -109388 -62640 40794 -485164 -45018 -67948 -161403 -175017 -141340 -183552
11137 -183552 125920 69975 -71349 -65715 394919 -82445 147155 -82233 172273 22729 124414
$$ packed form
11217A70475l8163d9521H3642b3583F0327c0731B50715F7558K22723a00957p9809
11206a80766r6496D4730g429j57615f1666n661k87652e281A64790A1991a04767
11194A03932R1512c3841j05695J4254C0459c05009e5741o9568A13212r622K39338
11183C42928a69876D9325a02984j83475l0009P4899L2444B1957b5932n1463D3902
11171B17773c2169k85218J11207h0261A51046l5792a35395N4045o5531b5296B7191
11159a3875k56497E1024J55795a52614A64493l5110g8343D1407B309M6515j8804
11148C0020b99360a09388M6748D0794d85164d5018k2930r3455j3614L3677m2212
11137a83552A25920n5945g1349N634C94919h2445A47155h2233A72273B2729J01685
$$ plain form
11126 124414 -279283 -263964 174511 -195960 274772 204424 144010 -268008 145975 109970
11116 109970 256119 54567 -72751 -199973 324331 -42377 -146498 -39927 -25973 363693
11105 254791 158249 406300 76984 -65295 246159 90494 164972 60242 126384 137292 112530
11094 112530 324377 276026 110780 245084 231537 191849 161361 246580 -15201 248716 26344
11082 -262882 268623 -27264 79443 226980 154826 362938 250093 323329 110369 132397
11072 132397 457473 577828 78296 234636 61716 180929 604334 232419 225166 115153
11062 115153 448598 158486 256679 545984 353940 293853 620106 572775 206733 211728
11052 211728 279267 587562 812949 865385 480545 744705 415200 957225 736571 958606
$$ packed form
11126A24414b79283J5319A74511a95960B74772p0348o0414b68008A45975l6005
11116A09970J46149E4567g2751j27222C24331d2377j04121c9927J3954C63693
11105B54791r6542K48051G6984f5295B46159I0494P4478F0242O6142J0908k4762
11094A12530K11847m8351A10780J34304j3547l9688l0488Q5219a5201B48716B6344
11082b62882B68623b7264G9443J47537p2154K08112j12845P3236A10369K2028
11072A32397L25076J20355G8296J56340F1716J19213M23405B32419p253j10013
11062A15153L33445A58486R8193K89305j92044o0087L26253m7331B06733M995
11052B11728O7539L08295K25387N2436l84840K64160l29505N42025k20654K22035
$$ plain form
11042 958606 1068631 843523 662600 1133385 648331 690407 712946 879660 758632 954535
11032 954535 980673 786639 645694 868989 828402 891399 866908 847616 1049050 824096
11022 824096 742662 797035 916547 654984 942167 715734 805930 728174 370850 548947
11012 548947 654796 308471 688262 476549 408843 690003 538388 640830 668029 369255
11002 369255 469814 679418 485845 857364 570221 542334 769918 373694 725482 751477
10992 751477 459318 782799 630053 444167 656799 724350 577453 871297 689117 904715
10982 904715 1133599 509436 1016762 839693 1096326 1063365 904891 940110 1322064 1395974
10972 1395974 1517353 1767048 2046293 2159553 2542420 2802426 2758681 3090140 2802519 3286874
$$ packed form
11042I58606J10025k25108j80923M70785m85054M2076K2539J66714j21028J95903
11032I54535K6138j94034j40945K23295m0587O2997k4491j9292K01434k24954
11022H24096q1434N4373J19512k61563K87183k26433R0196p7756l57324J78097
11012E48947J05849C08471L79791k11713o7706K81160j51615J02442K7199k98774
11002C69255J00559K09604j93573L71519k87143k7887K27584C73694L51788K5995
10992G51477k92159L23481j52746j85886K12632O7551j46897K93844j82180K15598
10982I04715K28884E09436N07326j77069K56633l2961j58474L5219L81954P3910
10972A395974J21379K49695K79245J13260L82867K60006m3745L31459k87621M84355
$$ plain form
10962 3286874 2855270 3148411 2381418 1825031 1189177 1172334 1048183 996000 825483 577774
10952 577774 708284 842395 1274794 581357 595557 654434 796888 355253 352982 385738
10942 385738 43735 241580 176075 466680 259963 -70320 78446 252346 -38152 292420
10931 -166351 -276471 -158516 208919 94696 95466 -61244 216068 -69809 146307 -26272 205770
10919 98392 78500 -77926 96571 179391 154533 91045 -133576 8586 -430733 -317410 -67030
10907 -208832 78626 -183816 98914 303138 32876 122473 -373103 -88622 -121684 148482 24375
10895 121126 76191 -254509 -42721 165587 -15474 156139 204465 -28852 -133504 278037
10884 -393940 -135667 25774 -234171 -339320 126651 197995 228616 -73723 105349 -30553
$$ packed form
10962C286874m31604K93141p66993n56387o35854j6843j24151n2183j70517k47709
10952E77774J30510J34111M32399E81357J4200N8877J42454C55253k271L2756
10942C85738D3735J97845o5505K90605k06717g0320G8446J73900c8152B92420
10931a66351j10120J17955B08919I4696P70f1244B16068f9809A46307b6272B05770
10919I8392j9892g7926I6571Q2820k4858o3488a33576H586d30733J13323f7030
10907b08832G8626a83816I8914K04224C2876Q9597c73103h8622l3062A48482B4375
10895A21126m4935b54509d2721A65587a5474A56139M8326b8852j04652B78037
10884c93940a35667B5774b34171j05149A26651P1344L0621g3723A05349c0553
$$ plain form
10873 199148 92200 160990 118056 -373964 92222 -44308 377012 -211618 -390587 -151724
10862 -206144 -46718 -307417 -48949 169919 -252019 151642 -13562 32019 -307676 -209490
10852 -209490 127110 -166828 78058 325383 -322969 2138 -38773 -30933 -152656 -77034 -37688
10840 -41050 -80011 -29991 84147 -193208 125467 -304551 -276274 242812 137885 162950 -4256
10828 71316 144579 -387094 248134 -408593 -48478 94490 81187 75897 -59069 13393 -229939
10816 17673 -156489 -24033 -2348 -270032 -104275 -34032 -8285 -15164 -54045 -342217 -14934
10804 -316635 -248841 -113998 -26294 178889 118098 -56363 71029 -323933 151161 131577 -30683
10792 73850 11718 160281 -56477 181184 -311419 255710 140090 -97425 -52623 -219342
$$ packed form
10873A99148I2200O8790m2934c73964I2222d4308C77012b11618j78969a51724
10862b06144d6718k60699d8949A69919b52019A51642a3562C2019c07676R8186
10852b09490A27110a66828G8058K47325c22969B138c8773P840j21723P5622c7688
10840d1050l8961b9991H4147a93208A25467c04551K8277B42812j04927K5065d256
10828G1316P3263c87094B48134d08593d8478I4490j3303n290e9069A3393b29939
10816A7673a56489b4033b348k67684a04275c4032h285o879l8881k88172a4934
10804c16635O7794a13998b6294A78889o0791e6363G1029c23933A51161j9584c0683
10792G3850A1718J48563e6477A81184c11419B55710j15620i7425M4802j66719
$$ plain form
10782 -219342 -28691 -165930 -214729 -34329 -135595 99549 -143617 -24764 -135478 51629 62645
10771 62645 107423 255201 89272 -145428 -195934 -28526 55980 -271924 300820 85805 -88144
10759 96852 82964 192374 158864 69254 27623 -234065 -205432 -167812 -242586 -188839 -240092
10748 -240092 -77478 171990 -121205 578241 -26342 -147016 -9144 245295 -235885 55461
10737 2086 118014 -237383 142332 -38827 -95134 -253237 -82009 243421 46362 -97801 -13588
10725 -15607 -294435 -146047 -273853 287600 -389886 -84717 -161647 -33893 -355483 18622
10714 -236124 -141705 -87345 228804 -92001 -81508 -16037 -20567 51269 -179022 -312898 -224154
10703 -224154 23676 -108146 -105335 142605 -191655 -281572 195281 -331466 -408594 -80122 -52386
$$ packed form
10782b19342b8691j37239m8799c4329j01266I9549a43617b4764j10714E1629J1016
10771F2645M4778J47778H9272a45428n0506b8526E5980b71924C00820H5805h8144
10759I6852j3888J09410l3510F9254B7623b34065K8633L7620p4774N3747n1253
10748b40092g7478A71990a21205E78241b6342j20674i144B45295b35885E5461
10737B086J15928b37383A42332c8827n6307j58103h2009B43421D6362i7801a3588
10725a5607k78828a46047j27806B87600c89886h4717p6930c3893l21590A8622
10714b36124R4419N4360B28804i2001J0493a6037m530E1269a79022j33876Q8744
10703b24154B3676a08146K811A42605a91655q9917A95281c31466p7128h0122K7736
$$ plain form
10692 -52386 253367 -45684 -357140 -198380 99577 131023 -292713 -51254 -204030 -24892 -126835
10681 -126835 172954 11573 144091 -26385 -167559 -392165 -316225 103750 275048 48699
10670 126204 -112897 -124434 349802 152803 -219603 146005 271177 88759 86756 -69002
10659 369114 -178053 140102 -86490 -256713 104756 -277944 -139498 150237 -70064 -42325
10649 -42325 -10662 -73736 -230411 111358 206918 -287023 125088 213844 34309 92544 78503
10638 78503 -100815 99492 67241 -91512 -198257 -105611 -72474 -322870 273602 -338657 -189801
10627 -189801 -350282 158532 192843 317986 -29480 -160895 -162962 16775 -196157 158062
10616 -304658 -272746 -9626 -278728 -198081 -425974 37667 -200507 -34139 -229198 -219979 -198496
$$ packed form
10692e2386B53367d5684l11456J58760I9577L1446b92713e1254j52776b4892j01943
10681a26835A72954A1573J32518b6385j41174k24606P5940A03750J71298D8699
10670A26204a12897j1537C49802A52803b19603A46005J25172H8759k003f9002
10659C69114a78053A40102h6490j70223A04756b77944J38446A50237g0064K7739
10649d2325a0662o3074j56675A11358R5560b87023A25088Q8756C4309N8235j4041
10638G8503a00815I9492l2251i1512j06745R2646L3137k50396B73602c38657J48856
10627a89801j60481A58532L4311J25143b9480j31415k067A6775a96157A58062
10616c04658L1912i626k69102Q0647k27893C7667b00507c4139j95059R219K1483
$$ plain form
10605 -198496 -204180 -76127 -46251 146553 -290312 -254816 147950 133520 -36994 -80657 111984
10593 -37823 -527859 -34177 -80929 -186728 282658 8921 6261 -202500 -225664 544 127478
10582 127478 -106177 -130770 79848 131909 -199165 -419287 105613 -287237 -305506 333272
10571 -142554 -155312 -259969 151921 45872 -221497 -92466 46944 -135135 209792 83039
10560 -534398 177030 -15559 -80329 -30523 -160497 -115117 132337 225015 99887 113780 -169524
10548 -176152 -137119 77232 433616 -42932 -85154 27727 -138399 9348 -20280 146203 -188981
10536 12964 -203575 194851 -102790 102336 309244 -151267 81320 154387 -146204 -57471
10525 -312179 144346 78546 131412 153504 -102062 -81524 95461 -9412 -73416 70049 244186
$$ packed form
10605a98496n684g6127K9876A46553b90312L5496A47950j4430c6994m3663A11984
10593c7823m90036c4177m6752j05799B82658H921k660b02500k3164E44J26934
10582A27478a06177k4593G9848N2061a99165k20122A05613b87237j8269C33272
10571a42554j2758j04657A51921D5872b21497i2466D6944a35135B09792H3039
10560e34398A77030a5559o4770c0523j29974M5380A32337R2678I9887J3893a69524
10548a76152L9033G7232L56384d2932m2222B7727a38399I348b0280A46203a88981
10536A2964b03575A94851a02790A02336K06908a51267H1320P3067a46204e7471
10525c12179A44346o5800N2866K2092a02062K0538I5461i412o4004G0049J74137
$$ plain form
10514 244186 -49170 -233205 -202691 126889 131537 -51869 212130 -22355 -220956 -57556 -34178
10503 -34178 -273335 -272630 113643 -99924 20489 -246185 -217806 10688 -303809 -44047 380623
10491 8180 -199620 137435 -23917 93600 160206 -312099 204791 171983 157976 -249407 -116110
10479 -105035 28136 -220698 94750 -316355 -303393 -94662 81311 -94015 22783 -392117 30702
10467 272092 -107651 -82455 135649 67457 48796 -207361 -146944 -138797 84861 -181582 -49713
10455 -357743 201759 -161739 -139952 -256510 -51704 -10517 -465007 60389 115933 -116589
10444 -222891 -170856 -171530 67239 308541 -210904 209535 -31493 126830 -301507 62583 -313970
10432 131326 126596 39094 -22159 -354319 34806 -145401 -111767 98174 -188987 -129752 48283
$$ packed form
10514B44186d9170j84035L0514A26889M648e1869B12130b2355j98601e7556K3378
10503c4178k39157P05A13643i9924B0489b46185K8379A0688c03809d4047C80623
10491H180a99620A37435b3917I3600O6606c12099B04791l2808j4007b49407a16110
10479a05035B8136b20698I4750c16355J2962i4662H1311i4015B2783c92117C0702
10467B72092a07651K5196A35649F7457j8661b07361O0417Q147H4861a81582d9713
10455c57743B01759a61739K1787j16558e1704a0517m54490F0389N5544a16589
10444b22891N2035o74F7239K41302b10904B09535c1493A26830c01507F2583c13970
10432A31326m730C9094b2159l32160C4806a45401L3634I8174a88987N9235D8283
$$ plain form
10420 70344 -419723 155794 -3283 -55759 -49193 -18184 -266926 107212 -261773 -255213 119061
10408 48893 8115 -81873 169495 -314403 39041 -158249 -123678 -46386 175747 -424232 -151585
10396 -192468 -36889 -124104 262186 201081 82080 -53922 206576 -127618 320645 256595 2947
10384 164915 167911 344466 -26997 59649 408618 215364 76022 156517 -3345 149253 279516
10373 279516 90754 346420 137587 26361 130411 -99100 147374 150590 278680 385360
10363 385360 695748 389667 528024 109643 237813 156602 -171376 268163 68884 98395
10353 98395 198658 147788 217236 193561 327384 319511 399777 239732 302680 189436 328269
10342 328269 639216 307566 -69963 -3064 137332 355056 293171 294407 370807 73063 167690
$$ packed form
10420G0344d19723A55794c283n2476O566a8184k48742A07212b61773O560A19061
10408D8893H115h1873A69495c14403C9041a58249L4571d6386A75747d24232a51585
10396a92468c6889q7215B62186o1105H2080e3922B06576a27618C20645o4050B947
10384A64915K996J76555b6997E9649L48969j93254G6022Q0495c345A49253J30263
10373B79516I0754K55666A37587B6361J04050i9100A47374L216J28090J06680
10363C85360L10388l06081J38357A09643J28170q1211a71376B68163F8884K9511
10353I8395J00263n0870O9448k3675J33823p873Q0266j60045O2948j13244J38833
10342C28269L10947C07566f9963c064A37332K17724o1885J236P6400G3063R4627
$$ plain form
10331 167690 87382 170881 -120128 98918 60325 191490 271164 -90621 218948 -169353 -5070
10319 126547 178634 224459 407861 96852 -76272 318434 -28796 20843 -6184 -2559 37501
10307 -378534 -214537 -245659 100436 -120232 -214901 163089 -37977 151879 153465 -305681
10296 -288991 -118632 50383 61556 -66740 6699 -48688 59756 -17669 -228798 -139587 -338239
10285 -338239 -90851 -123580 22489 140017 147570 -90868 -6428 63604 34777 192445 300387
10274 300387 52510 -112393 -355746 -36421 -135161 75995 -51462 190176 -88608 119195 176534
10263 176534 7598 -314928 356755 -221050 -143920 -50479 -30785 -161769 36379 52247 42254
10252 42254 8356 136985 -70616 -169635 330263 184854 216758 -135251 157176 101768 -134905
$$ packed form
10331A67690q0308Q3499a20128I8918l8593J31165P9674i0621B18948a69353e070
10319A26547N2087M5825J83402I6852g6272C18434b8796B0843f184b559C7501
10307c78534J63997l1122A00436a20232r4669A63089c7977A51879J586c05681
10296b88991a18632E0383J1173f6740F699d8688E9756a7669k11129Q9211j98652
10285c38239i0851l2729B2489J17528P553i0868f428F3604k8827J57668J07942
10274C00387E2510a12393k43353c6421r8740G5995e1462A90176h8608A19195N7339
10263A76534G598c14928C56755b21050P7130e0479J9694j30984C6379J5868r993
10252D2254H356J28629g0616r9019C30263j45409L1904a35251A57176n5408a34905
$$ plain form
10240 -378707 -229347 65922 -134501 -128774 -93322 -160023 -103128 278013 -55623 -186186 7062
10228 -184807 -369448 -367388 -294689 147952 160916 106751 61388 -370328 -231436 81510 -16106
10216 -33871 -371780 103249 62483 -280101 120882 -94812 33194 -26967 -55646 -39057 243005
10204 -101606 -5387 -325563 -36926 95477 -25260 2545 -6303 15402 256932 5740 -83958 -286204
10192 -286204 31644 77782 53051 -148572 -134014 315587 236789 -174304 -267166 31461 -36858
10180 -225061 -27988 143735 -305856 -191976 -43825 -10597 -105463 -221505 -143038 189659
10169 -191095 -198911 -120373 -194851 -93331 -64202 -143637 109544 164829 305437 -13189 -87768
10158 -87768 -145982 -26216 65935 -111563 21671 233039 93627 -198824 -74769 -277794 6315
$$ packed form
10240c78707J49360F5922a34501N727L5452o6701N6895B78013e5623j30563G062
10228a84807j84641K060P2699A47952J2964n4165m5363c70328J38892H1510a6106
10216c3871l37909A03249m0766b80101A20882i4812C3194b6967k8679J6589B43005
10204a01606e387l20176c6926I5477b5260B545f303A5402K41530E740h3958k02246
10192b86204C1644M6138k4731a48572J4558C15587p8798a74304r2862C1461c6858
10180b25061b7988A43735c05856J13880d3825a0597r4866j16042P8467A89659
10169a91095p816P8538p4478i3331K9129p9435A09544N5285J40608a3189p4579
10158h7768n8214b6216F5935a11563B1671K11368I3627a98824g4769k03025F315
$$ plain form
10146 -395473 -408294 -20590 172721 207177 -393660 325701 -148923 59610 -265716 -159582
10136 -159582 -228085 -179491 -103808 -94835 58170 39650 253019 68670 58482 -15114 -300757
10125 -300757 -8088 -66250 115329 42425 165144 63397 158587 107116 -86428 -535670 364273
10113 53336 -174573 83947 -111721 49386 -231949 78294 -230539 34009 -42031 128418 -138607
10101 -94058 -14280 97212 -324960 -78360 -875 -15313 -356723 -178798 -80783 -38143 59190
10089 -298258 -100786 -167449 -119570 151991 -267065 57991 12196 -118124 77232 122362 -70456
10077 94356 -196980 49741 -193764 -197139 -182195 52138 222066 -135116 -122477 -120422 291397
10065 97906 121383 112995 45666 -40280 50716 -140407 -274987 -74011 -287814 132561 -6009
$$ packed form
10146c95473j2821b0590A72721L4456c93660C25701a48923E9610b65716J06134
10136a59582o8503M8594P5683Q973E8170j8520K13369F8670j0188a5114k85643
10125c00757h088n8162A15329D2425J22719F3397R5190n1471h6428m49242C64273
10113E3336a74573H3947a11721D9386b31949G8294b30539C4009d2031A28418a38607
10101i4058a4280I7212c24960g8360h75j4438l41410J77925h0783c8143E9190
10089b98258a00786o6663M7879A51991b67065E7991A2196a18124G7232M5130g0456
10077I4356a96980D9741a93764l375J4944E2138J69928a35116J2639K055B91397
10065I7906K3477q388D5666d0280E0716a40407j34580g4011k13803A32561f009
$$ plain form
10053 12557 80071 442 195610 -131525 120448 -360425 -241335 -159452 -207452 -25746 -233938
10042 -233938 -123651 -57227 207744 130576 -30833 -165650 -157181 64235 -199629 -97781 -82915
10031 -82915 -180704 -66769 -13042 -175620 -33496 65006 -295619 -75942 -41504 -239252 -141307
10020 -141307 -112088 201842 228235 110422 245947 30915 -164127 297599 25833 -19343
10009 -163661 -226928 76007 8716 -44220 -220076 -62921 -285377 108862 -79180 319082 50064
9997 -133032 -32659 -103465 187275 -111140 -155394 -75511 298846 -169489 -319814 -112423
9986 26091 116723 118672 -336603 -51386 -234358 -148121 146322 -66089 -143094 -24064 -161148
9975 -161148 -209542 -76165 109008 120787 -68711 189971 -186618 -152390 -5210 -140004 -28335
$$ packed form
10053A2557O7514D42J95168a31525A20448c60425J19090Q1883m8000b5746k08192
10042b33938J10287e7227B07744p7168c0833j34817Q469F4235a99629i7781J4866
10031h2915r7789f6769a3042j62578c3496F5006b95619g5942L4438j97748R7945
10020a41307K9219B01842K6393A10422J35525C0915a64127B97599B5833a9343
10009a63661o3267G6007H716d4220j75856f2921k22456A08862g9180C19082E0064
9997a33032c2659p0806A87275a11140m4254g5511B98846a69489j50325a12423
9986B6091R0632J949c36603e1386j82972Q6237A46322f6089p7005b4064j37084
9975a61148m8394g6165A09008J1779f8711A89971a86618L4228e210j34794b8335
$$ plain form
9963 -145136 6860 213297 -42242 -65955 -185311 -173206 -227628 -89600 -143778 -76845 32848
9951 -185411 36676 -184648 -445055 -219409 -162009 -26550 -43409 -118656 -108425 -138264 -36426
9939 25224 215965 3933 -323811 -65345 74782 -118438 -112385 138758 -191710 200926 109111
9928 109111 -149556 -49269 85214 -10331 327925 125489 -188175 -26705 -387422 -26441 -180652
9917 -180652 -32242 -95126 199986 -197914 -264304 -58089 21783 -16970 -272240 -79739 -35971
9905 21889 34916 21881 119453 -324278 -132789 -277047 -31770 263485 9444 55924 36505
9894 36505 18066 -76113 -430588 -196437 40158 64091 21113 -125771 -186740 -50749 -91310
9883 -91310 -64515 111178 -118562 -260950 -116956 80397 -22536 -41677 -68260 466644 -250175
$$ packed form
9963a45136F860K06437d2242k3713j19356J2105n4422h9600n4178O6933C2848
9951a85411C6676a84648k60407b19409N7400b6550j6859p5247J0231k9839c6426
9939B5224J90741C933c23811f5345G4782a18438O053A38758a91710B00926r1815
9928A09111a49556d9269H5214a0331C27925A25489a88175b6705l60717b6441j54211
9917a80652c2242o2884A99986a97914o6390e8089B1783a6970k55270g9739c5971
9905B1889J3027j3035R7572c24278a32789j44258c1770B63485I444M6480j9419
9894C6505A8066g6113l54475a96437D0158K3933B1113a25771o0969e0749m0561
9883i1310K6795A11178a18562j42388a16956H0397b2536j9141k6583D66644b50175
$$ plain form
9871 -364733 129367 -106003 -238766 38238 43363 -419156 -26232 -58159 85738 -179038 -46097
9859 -475022 -100876 82212 86030 134980 12622 -25678 156475 4363 54157 197503 -35145
9847 -9441 -177350 -219798 104216 122044 -43739 -120892 -171945 2864 -318421 -322886 -67926 98878
9834 -329235 -187966 -71967 -229847 -312972 -421179 151184 -73458 -505486 -109858 -126547
9824 -126547 -270463 65911 -230227 -81274 -50685 -66450 83438 -47714 20987 2478 -105764
9812 -129418 -104274 -103044 113879 271342 -174634 -80261 -153438 -128395 -184553 -43138 -127788
9801 -127788 -145453 -327408 171166 -160421 -145146 -27121 -169366 384508 -324172 45865
9790 -236887 -189379 -167466 55543 96229 -374880 -51680 -96198 -200269 -259219 59244 -286569
$$ packed form
9871c64733A29367a06003j32763C8238N125d19156b6232l1927H5738a79038d6097
9859d75022a00876H2212L818M8950A2622b5678A56475D363M9794J43346c5145
9847i441j67909m2448A04216J7828d3739p7153n1053B864c18421m465f7926I8878
9834c29235J41269g1967j57880q3125j08207A51184g3458m32028a09858j6689
9824a26547j43916F5911b30227h1274L0589j5765H3438d7714B0987B478a05764
9812a29418K5144J230A13879J57463a74634h0261p3177K5043n6158d3138q4650
9801a27788j7665j81955A71166a60421J5275b7121j42245C84508c24172D5865
9790b36887M7508K1913E5543M0686c74880e1680m4518j04071n8950E9244b86569
$$ plain form
9778 -127775 -198890 136362 198128 11952 -289631 126249 85414 -443395 -117391 -239173
9768 -239173 -245830 -56741 130853 -426443 291860 -155129 82442 -185876 -122632 45908 -110315
9756 -283808 -192419 -104286 284712 -14476 -48145 -136890 3763 57757 186693 -106211 -69020
9745 -69020 16497 334201 -317684 -172160 205870 -231657 -185864 -254680 -139139 -70293 -379090
9734 -379090 272887 -31629 78326 -145198 -27332 -150796 -188127 167039 -48932 -73845 98199
9722 -333513 -282911 -225952 247926 -107234 172772 -70197 -232480 24765 -7136 192049 188104
9711 188104 -165534 122150 -37448 -150361 -205933 -166371 -209314 -68232 106212 118017 -304861
9699 36823 -148064 166267 -200865 177578 -95406 -86356 135374 -270704 1174 -214165 -296698
$$ packed form
9778a27775p1115A36362O1766A1952b89631A26249m0835d43395a17391j21782
9768b39173o657e6741A30853d26443B91860a55129H2442a85876O3244D5908a10315
9756b83808R1389Q8133B84712a4476l3669q8745C763N3994J28936a06211L7191
9745f9020A6497L17704c17684J45524B05870b31657M5793o8816J15541O8846l08797
9734c79090B72887c1629G8326a45198b7332j23464l7331A67039d8932k4913I8199
9722c33513N0602N6959B47926a07234A72772g0197j62283B4765g136A92049l945
9711A88104a65534A22150c7448j12913n5572L9562m2943f8232A06212J1805c04861
9699C6823a48064A66267b00865A77578i5406R050A35374b70704A174b14165q2533
$$ plain form
9688 -296698 -118329 -143619 -130382 -274173 -103137 -233588 -186368 -73006 100070 -250603
9677 -256455 257621 -104616 -143085 115139 98273 519540 105548 -235304 143833 49879
9666 -79011 28818 -63191 85469 233137 -57348 -16429 -52347 -50535 -190771 -40407 -159585
9655 -159585 -117697 159049 -200971 -78600 -486090 -167204 -125000 -208207 -142871 -278393 15393
9643 44341 -83279 -313368 -218897 246479 109492 -50792 299262 -87421 -53131 -218796 -319639
9632 -319639 -268759 32641 -110035 -96943 -32687 -330538 42720 -257788 69279 195265 68149
9620 68817 55966 -126542 124866 -3446 -246918 -41721 -244659 -97438 -295623 -58728 32434
9608 76294 -168403 206064 -131853 46644 198943 49218 -87330 -258462 192689 147025 -92820
$$ packed form
9688b96698a18329k5290J3237j43791a03137j30451M7220g3006A00070b50603
9677b56455B57621a04616l8469A15139j6866M21267A05548b35304A43833D9879
9666g9011B8818f3191H5469J47668e7348a6429l5918J812j40236d0407j19178
9655a59585M1888A59049b00971g8600m07490a67204M2204q3207O5336j35522A5393
9643D4341h3279k30089R4471B46479A09492e0792B99262h7421L4290j65665j00843
9632c19639N0880C2641a10035J3092c2687k97851D2720b57788F9279J25986F8149
9620F8817j2851a26542A24866c446k43472d1721k02938i7438j98185e8728C2434
9608G6294a68403B06064a31853D6644J52299D9218h7330j71132A92689m5664i2820
$$ plain form
9596 -61665 11538 42229 249386 -269456 171294 -120944 -110159 -327220 53931 -208943 -249551
9585 -249551 45874 -60770 -121583 -70082 -260538 77228 -34595 96979 68556 213948 -196734
9573 -248294 278301 1064 -202663 -127826 -260323 -146450 -108580 224447 -91872 218880 -191594
9561 -296122 -205364 -347513 -93704 -180105 -371922 -124920 -203749 -33327 -112098 -198927 -152494
9550 -152494 -283973 22853 153496 -464369 -143916 36839 -6700 -18150 -166701 -293293 -252013
9539 -252013 -89525 73357 -90850 57858 -163885 -254979 162628 -110345 71446 55290 -104024
9527 123412 -116181 -206577 -81289 -286966 -231262 -178792 -107000 -37076 -334636 84756 64029
9516 64029 24553 122059 -341566 -179691 -385149 -167860 -250473 -44037 136626 -148486 -47384
$$ packed form
9596f1665A1538L0691K07157b69456A71294a20944J0785k17061E3931b08943m0608
9585b49551D5874f0770o0813N1501j90456G7228c4595I6979k8423J45392a96734
9573b48294B78301A064b02663P4837j32497J13873L7870B24447i1872B18880a91594
9561b96122R0758j42149i3704q6401j91817a24920p8829c3327p8771q6829M6433
9550a52494j31479B2853J30643d64369a43916C6839f700j1450j48551j26592M1280
9539b52013h9525G3357i0850E7858a63885r1094A62628a10345G1446j6156a04024
9527A23412a16181r0396h1289k05677N5704N2470P1792c7076k97560H4756k0727
9516F4029B4553R7506c41566J61875k05458a67860q2613d4037A36626a48486d7384
$$ plain form
9504 -14931 24230 11681 -233285 -124969 -289943 -8560 -356342 -204867 -119820 95586 -325266
9492 -122524 -335281 -26334 221239 220273 52530 -222851 -49101 -134144 228641 117231 -96595
9480 13293 135496 92368 -205360 -10548 -148989 92032 -313789 -7823 -130989 41159 52589
9469 52589 1005 -27587 289039 213930 50463 134199 -85418 8208 -11912 397664 4632 -18405
9456 269987 -21582 -345215 -123687 58103 -5786 -28189 -256717 -82287 64655 117031 293525
9445 293525 -316856 6884 -315438 103156 -220252 -344925 -208835 -60581 235865 -334959
9434 -175778 -118788 -149642 -3492 -130040 -393267 -186722 -77257 36259 -179154 -361354 -30982
9422 -117180 -85285 150854 -36691 -192193 18044 -383219 265799 152884 -114792 -61687
$$ packed form
9504a4931B4230A1681b33285J08316j64974h560l47782J51475Q5047I5586c25266
9492a22524k12757b6334B21239r66E2530b22851d9101q5043B28641j11410i6595
9480A3293J22203m3128b05360a0548j38441I2032c13789g823j23166D1159J1430
9469E2589A005b7587B89039p5109E0463Q3736h5418H208a1912C97664D632a8405
9456B69987b1582l23633a23687E8103e786k2403k28528h2287F4655N2376J76494
9445B93525c16856F884c15438A03156b20252j24673J36090f0581B35865c34959
9434a75778N6990l0854c492j26548k63227a86722g7257C6259a79154j82200c0982
9422a17180L1895A50854c6691j55502A8044c83219B65799j12915a14792N3105
$$ plain form
9412 -61687 -26790 28092 -330815 -120852 -64744 -137489 -142957 -246100 -32991 -168782 -225539
9401 -225539 -363130 -105101 -84254 -100508 107743 -74003 -89442 -260067 23329 -207160 -138809
9390 -138809 -2994 -155026 250332 -63147 76611 -127835 -92413 139192 -64060 -179674 -229667
9379 -229667 -81222 -49771 -88092 189653 95659 -100712 -213925 -91192 37225 -72358 34186
9367 -46726 -58614 107341 -133672 -165714 -31126 -56323 -127988 -175291 -138466 -144215 379128
9355 152297 72514 -6178 -40908 -52777 158484 11231 14290 -162850 84848 106302 -114435
9343 349542 275702 -30562 36960 -383413 -142303 108427 53393 211799 -106179 -12058 -138469
9332 -138469 241118 203355 126008 -47892 -67100 -400804 -116848 26926 -190840 -283348 280212
$$ packed form
9412f1687b6790B8092c30815a20852N6108p2745n468j03143c2991j35791n6757
9401b25539j37591a05101K0847j6254A07743g4003j5439j70625B3329b07160O8351
9390a38809b994j52032B50332f3147G6611a27835L5422A39192f4060j15614m9993
9379b29667h1222L1451l8321A89653r3994a00712j13213i1192C7225g2358C4186
9367d6726j1888A07341a33672l2042c1126k5197p1665m7303L6825n749C79128
9355A52297G2514f178l4730j1869A58484A1231L059a62850H4848K1454a14435
9343C49542p3840c0562C6960c83413a42303A08427E3393J58406a06179a2058j26411
9332a38469B41118l7763p7347d7892j9208l33704a16848B6926a90840r2508B80212
$$ plain form
9320 -150580 -148175 -285402 28736 195726 -119558 -257998 65540 -238914 -129919 -153784 90131
9308 -89291 -112305 -147446 125361 -260481 8196 79327 -72767 -148758 -48687 145820 215817
9297 215817 82915 229196 -271537 -14225 -157171 -76946 72787 -474666 -366375 117438
9286 9287 261944 89880 -181416 -78219 -181146 96529 -331915 26525 159876 17797 104874
9275 104874 70676 -40195 -64563 -68650 -416275 85629 -274236 59969 -105265 -182344 -70875
9263 -203522 243264 -115244 -234098 -23252 100672 -50142 -147355 -121360 -156650 99691 -321769
9251 -160602 166236 -83808 -176685 -51065 -184650 -228887 -68030 17524 83319 -285450 47847
9239 -161870 -86612 -68592 -295962 11767 83411 -490778 274877 -304992 -86713 59963 17659
$$ packed form
9320a50580K405j37227B8736J66990a19558j38440F5540b38914J08995k3865I0131
9308h9291k3014l5141A25361b60481H196P1131g2767p5991d8687A45820O9997
9297B15817H2915J46281b71537a4225j42946g6946G2787d74666J08291A17438
9286I287K52657H9880a81416g8219j02927I6529c31915B6525J33351A7797Q7077
9275A04874l4198d0195k4368m087l47625H5629b74236E9969a05265p7079g0875
9263b03522B43264a15244j18854b3252A00672e0142r7213K5995l5290I9691c21769
9251a60602A66236h3808r2877e1065j33585m4237f8030A7524O5795b85450D7847
9239a61870P5258J8020k27370A1767P1644d90778B74877c04992h6713E9963A7659
$$ plain form
9227 -268045 64011 -420412 -163800 55269 67020 -86824 -16992 185908 -236074 63187 -252458
9215 -92536 -51189 -331639 -116444 -238977 -175924 -295267 113920 -67521 -130247 62553 -165470
9203 36204 11459 -108845 -100048 129728 214783 292081 -138711 -100421 -59663 77176 95747
9192 95747 -143005 -60870 -239283 -361483 -46171 94645 -29851 -166761 13234 179653 213149
9181 213149 118476 158972 7514 -96087 -143643 -12897 -109695 -53919 -276960 -39916 -144528
9170 -144528 -53073 -293603 -28610 19364 -361415 -168446 -125753 112231 -258174 -453430
9160 -453430 -56437 -1192 -512 -194939 162032 -83552 209009 -196596 60536 -116071 -21992
9148 -193745 -305845 -193885 -272324 104151 -390535 24616 9683 -433806 285213 123585
$$ packed form
9227b68045F4011d20412a63800E5269J1751h6824a6992A85908b36074F3187b52458
9215i2536M1347k80450a16444j22533O3053j19343A13920f7521o2726F2553a65470
9203C6204A1459a08845Q797A29728Q5055P7298a38711L8290M0758G7176J8571
9192I5747a43005f0870j78413j22200d6171I4645b9851j36910A3234J66419L3496
9181B13149r4673M0496G514i6087m7556a2897r6798e3919k23041c9916j04612
9170a44528e3073k40530b8610A9364c61415a68446M2693A12231b58174j95256
9160d53430e6437a192e12j94427A62032h3552B09009a96596F0536a16071b1992
9148a93745j12100J11960p8439A04151c90535B4616I683d33806B85213A23585
$$ plain form
9137 -217763 -150390 101450 -31387 -88165 -132383 -8096 -52365 -183080 281868 -75526 196367
9125 -215754 -76547 -273229 -13071 -101366 63221 60722 270498 -52321 78318 62438 -91690
9113 -351557 -273902 -55737 -424544 25887 -16221 -321113 80041 -63193 -176756 -333958 186580
9101 -122524 146688 166173 12277 -256711 36170 -93182 -223494 160575 182744 162193 176690
9090 176690 128368 10174 135164 -463641 69915 -339584 -92484 -297450 282912 407378
9080 407378 204116 7622 75056 15138 -4074 207328 107089 215895 310942 -152412 -303515
9069 -303515 311423 -110084 -285523 221846 -156851 -104187 -64764 52941 321076 -57048
9058 78610 -279993 120268 -109767 38735 57186 -309596 -192000 -359647 -63290 308192
$$ packed form
9137b17763O7373A01450c1387n6778m4218h096m4269j30715B81868g5526A96367
9125b15754g6547j96682a3071q8295F3221k499K09776e2321G8318j5880i1690
9113c51557P7655e5737l68807B5887a6221l04892H0041f3193j13563j57202A86580
9101a22524A46688J9485A2277b56711C6170i3182j30312A60575K2169k0551J4497
9090A76690m8322A0174J24990d63641F9915c39584i2484k04966B82912J24466
9080D07378k03262G622O7434A5138d074B07328j00239J08806R5047a52412j51103
9069c03515C11423a10084j75439B21846a56851N2664L9423E2941K68135e7048
9058G8610b79993A20268a09767C8735J8451c09596J17596j67647f3290C08192
$$ plain form
9047 -86186 -187264 210780 -15558 23516 -30329 170695 -84697 -39644 -266943 -295534 -168460
9036 -168460 -170059 -236966 -115300 -97674 114847 15669 -13130 82042 119731 119669 19523 119719
9024 119719 258071 204747 -122146 -179673 -133949 19999 -190313 -334158 -134885 -39760 -127264
9013 -127264 -158442 80109 212454 -94292 -148533 -276682 -93547 57407 -172026 99426 107665
9002 107665 -257359 -70097 -122253 -51738 11029 57307 20352 49863 -173141 112779 -83635
8990 -38477 -227507 -217778 -100947 26600 -21994 -364473 -93013 -199150 -215288 94003 -179535
8978 -242021 -31253 -120155 -359018 -318227 200595 -77341 -106470 11681 -4277 -103502 -119163
8967 -119163 -49409 -251111 193123 59192 -333963 -60639 -286791 -21766 -84034 -39486 -9612
$$ packed form
9047h6186j01078B10780a5558B3516c0329A70695h4697c9644k27299k8591J27074
9036a68460j599o6907a15300J7626A14847A5669a3130H2042L7689o2A9523J00196
9024A19719J38352n3324a22146n7527M5724A9999a90313j43845a34885c9760q7504
9013a27264l1178H0109J32345i4292n4241j28149i3547E7407a72026I9426Q239
9002A07665b57359g0097n2156e1738A1029M6278B0352K9511a73141A12779h3635
8990c8477j89030R729a00947B6600b1994l42479i3013j06137j6138I4003a79535
8978b42021c1253q8902k38863M0791B00595g7341k9129A1681d277r9225j5661
8967a19163d9409k01702A93123E9192c33963f0639k26152b1766o2268c9486i612
$$ plain form
8955 -236536 -51394 283081 109126 53083 -229949 418461 256303 76852 109005 -123042
8944 176975 116433 -18070 -118533 -276593 379599 -441376 -454254 87210 47197 -87920 -126798
8933 -126798 -298077 -18532 69989 -63239 56619 -341092 160283 48866 -148983 -34403 378324
8921 413246 151775 1049077 4010854 7837494 3292255 813734 294916 458182 367226
8912 367226 185219 -158295 65772 -175512 -183931 -19988 84950 155690 -158913 159294 -285762
8900 -20577 -142929 364469 -154807 -179281 -16350 110492 33944 -154714 -132695 -40339 114680
8888 -325260 -240915 32401 92397 293474 -185412 132603 -3035 -46993 53609 196219 118988
$$ packed form
8955b36536e1394B83081A09126E3083b29949D18461j62158G6852L2153a23042
8944A76975o0542a8070j00463j58060C79599d41376j2878H7210m0013h7920l8878
8933a26798j71279a8532F9989f3239E6619c41092A60283D8866a48983c4403C78324
8921D13246A51775Q97302K961777L826640C292255H13734B94916J63266r0956
8912C67226j82007a58295F5772a75512q419a9988H4950P0740a58913A59294b85762
8900b0577j22352C64469a54807k4474a6350A10492C3944a54714K2019d0339A14680
8888c25260Q4345C2401N9996K01077a85412A32603c035m3958E3609J42610p7231
$$ [...]
##END NTUPLES=NMR SPECTRUM
##END=
