
##TITLE=AC1290_VIERS11100_6615631_yTGpp5kn2d
##JCAMPDX= 6.0         $$ Bruker NMR JCAMP-DX V2.0
##DATA TYPE= NMR SPECTRUM
##DATA CLASS= NTUPLES
##ORIGIN= BRUKER
##OWNER= Administrator
$$ 1.72 TOPSPIN		Version 2.1
$$ 2012-08-02 22:26:06.000 -0500  Administrator@TOPSPIN
$$ Compression mode = diff/dup
##.OBSERVE FREQUENCY= 400.02188249412
##.OBSERVE NUCLEUS= ^1H
##.ACQUISITION MODE= SIMULTANEOUS (DQD)
##.ACQUISITION SCHEME= undefined
##.AVERAGES= 64
##.DIGITISER RES= 22
##SPECTROMETER/DATA SYSTEM= spect
##.PULSE SEQUENCE= noesygpps1d.comp
##.SOLVENT NAME= COFFEE_meoh
##.SHIFT REFERENCE= INTERNAL, COFFEE_meoh, 1, 14.96303
##AUDIT TRAIL= $$ (NUMBER, WHEN, WHO, WHERE, PROCESS, VERSION, WHAT)
$$ ##TITLE= Audit trail, TOPSPIN		Version 2.1
$$ ##JCAMPDX= 5.01
$$ ##ORIGIN= Bruker BioSpin GmbH
$$ ##OWNER= Administrator
$$ $$ C:\Bruker\TOPSPIN/data/COFFEE/nmr/AC1290_VIERS11100_6615631_yTGpp5kn2d/12/pdata/1/auditp.txt
$$ ##AUDIT TRAIL=  $$ (NUMBER, WHEN, WHO, WHERE, PROCESS, VERSION, WHAT)
(   1,<2012-08-02 22:26:01.296 -0500>,<Administrator>,<TOPSPIN>,<go>,<TOPSPIN 2.1>,
      <created by zg
	started at 2012-08-02 22:14:31.171 -0500,
	POWCHK enabled, PULCHK disabled,
       configuration hash MD5:
       6B 1B 68 BB D9 2E 58 E2 7F 35 AD 54 07 DF 0E 41
       data hash MD5: 64K
       52 F8 79 BF 68 A2 21 2B 62 CE A8 BE F4 95 F3 8E>)
(   2,<2012-08-02 22:26:04.218 -0500>,<Administrator>,<TOPSPIN>,<proc1d>,<TOPSPIN 2.1>,
      <Start of raw data processing
       efp LB = 0.3 FT_mod = 6 PKNL = 1 PHC0 = 0 PHC1 = 0 SI = 128K 
       data hash MD5: 128K
       09 DF D7 29 BE A8 1B F6 FF E1 25 46 D8 4F 94 6E>)
(   3,<2012-08-02 22:26:05.265 -0500>,<Administrator>,<TOPSPIN>,<proc1d>,<TOPSPIN 2.1>,
      <pk PHC0 = 0.7580566 PHC1 = 0 
       data hash MD5: 128K
       32 B8 E7 DF B5 1C 58 EA 0E 42 4A A6 D8 E7 E7 04>)
(   4,<2012-08-02 22:26:05.500 -0500>,<Administrator>,<TOPSPIN>,<proc1d>,<TOPSPIN 2.1>,
      <abs ABSG = 1 
       data hash MD5: 128K
       81 FE 9D 9D ED C6 2D AA 08 12 E7 18 31 9C C8 CD>)
(   5,<2012-08-02 22:26:05.562 -0500>,<Administrator>,<TOPSPIN>,<proc1d>,<TOPSPIN 2.1>,
      <abs ABSG = 2 
       data hash MD5: 128K
       CD BC 23 B7 CF 40 6E 59 94 70 E0 2D 0E 92 27 45>)
(   6,<2012-08-02 22:26:05.625 -0500>,<Administrator>,<TOPSPIN>,<proc1d>,<TOPSPIN 2.1>,
      <abs ABSG = 3 
       data hash MD5: 128K
       CA 26 C3 BB 9C 39 B5 CD 9F 29 AB 78 E7 A5 1D 7A>)
(   7,<2012-08-02 22:26:05.859 -0500>,<Administrator>,<TOPSPIN>,<proc1d>,<TOPSPIN 2.1>,
      <abs ABSG = 4 
       data hash MD5: 128K
       B3 8B 18 2E 19 9C 88 73 C9 DD 10 0F D6 CE E1 F4>)
(   8,<2012-08-02 22:26:05.906 -0500>,<Administrator>,<TOPSPIN>,<proc1d>,<TOPSPIN 2.1>,
      <abs ABSG = 5 
       data hash MD5: 128K
       E8 67 C9 45 4F 04 E8 F7 28 8B 07 46 6F FF 9C 7A>)
$$ ##END=
$$ 
$$ $$ hash MD5
$$ $$ F1 A5 24 12 96 7E AA E7 ED 84 BA 92 A7 B3 C5 6E
##$RELAX= 
##$RELAX= 
##$RELAX= 
##$RELAX= 
##$RELAX= 
##$RELAX= 
##$RELAX= 
##$RELAX= 
$$ Bruker specific parameters
$$ [...]
##$TP07= 0
##$TPNAME0= <>
##$TPNAME1= <>
##$TPNAME2= <>
##$TPNAME3= <>
##$TPNAME4= <>
##$TPNAME5= <>
##$TPNAME6= <>
##$TPNAME7= <>
##$TPOAL= (0..7)
0.5 0.5 0.5 0.5 0.5 0.5 0.5 0.5
##$TPOFFS= (0..7)
0 0 0 0 0 0 0 0
##$TUNHIN= 0
##$TUNHOUT= 0
##$TUNXOUT= 0
##$USERA1= <user>
##$USERA2= <user>
##$USERA3= <user>
##$USERA4= <user>
##$USERA5= <user>
##$V9= 5
##$VALIST= <valist>
##$VCLIST= <CCCCCCCCCCCCCCC>
##$VD= 0
##$VDLIST= <DDDDDDDDDDDDDDD>
##$VPLIST= <PPPPPPPPPPPPPPP>
##$VTLIST= <TTTTTTTTTTTTTTT>
##$WBST= 1024
##$WBSW= 4
##$XGAIN= (0..3)
0 0 0 0
##$XL= 0
##$YL= 0
##$YMAX_a= 15159708
##$YMIN_a= -8219098
##$ZGOPTNS= <>
##$ZL1= 120
##$ZL2= 120
##$ZL3= 120
##$ZL4= 120
##$ABSF1= 14.96303
##$ABSF2= -5.595152
##$ABSG= 5
##$ABSL= 3
##$ALPHA= 0
##$AQORDER= 0
##$ASSFAC= 0
##$ASSFACI= 0
##$ASSFACX= 0
##$ASSWID= 0
##$AUNMP= <proc_prof1d_extract.lims>
##$AXLEFT= 0
##$AXNAME= <>
##$AXNUC= <1H>
##$AXRIGHT= 0
##$AXTYPE= 0
##$AXUNIT= <>
##$AZFE= 0.1
##$AZFW= 0.1
##$BCFW= 0
##$BC_mod= 0
##$BYTORDP= 0
##$COROFFS= 0
##$CY= 15
##$DATMOD= 1
##$DC= 0
##$DFILT= <>
##$DTYPP= 0
##$F1P= 0
##$F2P= 0
##$FCOR= 0.5
##$FTSIZE= 131072
##$FT_mod= 6
##$GAMMA= 0
##$GB= 0
##$INTBC= 1
##$INTSCL= 1
##$ISEN= 128
##$LB= 0.3
##$LEV0= 0
##$LPBIN= 0
##$MAXI= 10000
##$MC2= 0
##$MEAN= 0
##$ME_mod= 0
##$MI= 0
##$NCOEF= 0
##$NC_proc= -2
##$NLEV= 6
##$NOISF1= 0
##$NOISF2= 0
##$NSP= 0
##$NTH_PI= 0
##$NZP= 0
##$OFFSET= 14.96303
##$PC= 1
##$PHC0= 0.7580566
##$PHC1= 0
##$PH_mod= 1
##$PKNL= yes
##$PPARMOD= 0
##$PPDIAG= 0
##$PPIPTYP= 0
##$PPMPNUM= 2147483647
##$PPRESOL= 1
##$PSCAL= 4
##$PSIGN= 0
##$PYNMP= <proc.py>
##$REVERSE= no
##$SF= 400.020008826483
##$SI= 131072
##$SIGF1= 0
##$SIGF2= 0
##$SINO= 400
##$SIOLD= 131072
##$SPECTYP= <>
##$SREGLST= <1H.CDCl3>
##$SSB= 0
##$STSI= 131072
##$STSR= 0
##$SW_p= 8223.68421052631
##$SYMM= 0
##$S_DEV= 0
##$TDeff= 65536
##$TDoff= 0
##$TI= <>
##$TILT= no
##$TM1= 0
##$TM2= 0
##$TOPLEV= 0
##$USERP1= <user>
##$USERP2= <user>
##$USERP3= <user>
##$USERP4= <user>
##$USERP5= <user>
##$WDW= 1
##$XDIM= 131072
##$YMAX_p= 425030468
##$YMIN_p= -11856
##$CURPLOT= <Network HP LaserJet P1505>
##$CURPRIN= <$Network HP LaserJet P1505>
##$DFORMAT= <normdp>
##$LAYOUT= <+/1D_H.xwp>
##$LFORMAT= <normlp>
##$PFORMAT= <normpl>
##$SURQMSG= 1
$$ End of Bruker specific parameters
$$ ---------------------------------
##NTUPLES= NMR SPECTRUM
##VAR_NAME=  FREQUENCY,     SPECTRUM/REAL,   SPECTRUM/IMAG
##SYMBOL=    X,             R,               I
##VAR_TYPE=  INDEPENDENT,   DEPENDENT,       DEPENDENT
##VAR_FORM=  AFFN,          ASDF,            ASDF
##VAR_DIM=   131072,        131072,          131072
##UNITS=     HZ,            ARBITRARY UNITS, ARBITRARY UNITS
##FACTOR=    0.0627417313425164, 1,          1
##FIRST=     8223.62146879497, 1757,         -50577
##LAST=      0,             2771,            -51539
##MIN=       0,             -11856,          0
##MAX=       8223.62146879497, 425030468,    0
$$ Real data points
##PAGE= N=1
##DATA TABLE= (X++(R..R)), XYDATA
$$ [...]
60996H28105J6031J8108K0746K2870K4213K5480K7029K8504K9646L0416L0584
60985A101732L0138K9792L0020L0015K8804K6935K5695K5076K4038K2439K1101
60974A395785K0184J9214J8661J9725K2514K6010K9919L4799M0446M5999N1808
60963A725064N9158O7943P6630Q4909R4091J04226J13157J19477J24472J30069
60953B699196J37056J46510J60698J80800K05370K32631K62625K95709L30862
60944D651457L67508M07534M53976N09537N78217O66122P78279R16996J086306
60935A0415932J295630J555460J872349K253423K711725L253329L848407M413418
60927C1619673M822395M937401M644585L900277K784777J523049M22628k59837
$$ y = [828105, 844136, 862244, 882990, 905860, 930073, 955553, 982582, 1011086, 1040732, 1071148, 1101732, 1131870, 1161662, 1191682, 1221697, 1250501, 1277436, 1303131, 1328207, 1352245, 1374684, 1395785, 1415969, 1435183, 1453844, 1473569, 1496083, 1522093, 1552012, 1586811, 1627257, 1673256, 1725064, 1784222, 1852165, 1928795, 2013704, 2107795, 2212021, 2325178, 2444655, 2569127, 2699196, 2836252, 2982762, 3143460, 3324260, 3529630, 3762261, 4024886, 4320595, 4651457, 5018965, 5426499, 5880475, 6390012, 6968229, 7634351, 8412630, 9329626, 10415932, 11711562, 13267022, 15139371, 17392794, 20104519, 23357848, 27206255, 31619673, 36442068, 41379469, 46024054, 49924331, 52709108, 54232157, 54654785, 54394948]
60919E4394948m36852k11176J95346N31228N73226J70456o98078j884106l110914
60910D9524078m096061m673335m829573m654743m269802l782963l274601k793082
60902A7149918k358200j973931j641071j359737j126175r33704p77017o52673
60894F327410n56061m80854m21456l73861l34433k99984k69148k41939k17804
60885C131870j95446j74359j55083j38121j23839j13135j06630j03281j01047
60876A920929r8761r6140r2389q6548p9193p2069o5838n9671n3291m7712m3502
60865A125815l9838l5996l2429k9659k7242k4662k2183k0085j7991j5770j4146
60854H45814j3620j3540j3062j2235j1439j0484r173q018p465o995n977m884m630
$$ y = [54394948, 53958096, 53746920, 53942266, 54473494, 55046720, 55217176, 54519098, 52634992, 49524078, 45428017, 40754682, 35925109, 31270366, 27000564, 23217601, 19943000, 17149918, 14791718, 12817787, 11176716, 9816979, 8690804, 7757100, 6980083, 6327410, 5771349, 5290495, 4869039, 4495178, 4160745, 3860761, 3591613, 3349674, 3131870, 2936424, 2762065, 2606982, 2468861, 2345022, 2231887, 2125257, 2021976, 1920929, 1822168, 1726028, 1633639, 1547091, 1467898, 1395829, 1329991, 1270320, 1217029, 1169317, 1125815, 1085977, 1049981, 1017552, 987893, 960651, 935989, 913806, 893721, 875730, 859960, 845814, 832194, 818654, 805592, 793357, 781918, 771434, 762261, 754243, 746778, 739783, 733806, 728922, 724292]
60841G24292n048n115m518m002m181m867n619o290o851p234p474p571p274o373
60827F41875n117l994l199k645k293k088j790j280q04n09n8Q31J810K480L128
60812F26347M230N585O653P500Q573R715J0369J0633J1157J1937J2151J1398J0179
60799G46427Q845P069M785K834J946J660R08p20k848n084p364r616j1542j2691
60785G24609j2627j1302r432q159p988q341q355p740o564m742k391l57L36l60
60771F36587j438k014k157k381k679k546j821j091r93j315j227l87N82R98J077
60756F19195J537K542L572M251M703N042N170N215N625O524P413P823P894P932
60742F94438P737O756M728J947j014l645n759p567r342j1014j2241j2933j3349
$$ y = [724292, 719244, 714129, 709611, 705609, 701428, 696561, 690942, 684652, 677801, 670567, 663093, 655522, 648248, 641875, 636758, 632764, 629565, 626920, 624627, 622539, 620749, 619469, 618665, 618156, 618098, 618929, 620739, 623219, 626347, 630577, 636162, 642815, 650315, 658888, 668603, 678972, 689605, 700762, 712699, 724850, 736248, 746427, 755272, 762341, 767126, 769960, 771906, 773566, 774474, 773754, 770906, 765822, 758458, 748842, 737300, 724609, 711982, 700680, 691248, 683089, 675101, 666760, 658405, 650665, 644101, 639359, 636968, 636611, 636947, 636587, 635149, 633135, 630978, 628597, 625918, 623372, 621551, 620460, 619467, 618152, 616925, 616538, 617120, 618118, 619195, 620732, 623274, 626846, 631097, 635800, 640842, 646012, 651227, 656852, 663376, 670789, 678612, 686506, 694438, 702175, 708931, 713659, 715606, 714592, 710947, 705188, 697621, 688279, 677265, 665024, 652091, 638742]
60729F38742j3624j3586j3199j2743j2390j1923j1146j0232r418q697q005p432
60717E06347p014o613o208o002n993n826n329m858m725m695m383l880l547l435
60703D33839l337l190l040k723k101j478j372j801k141j799q00K97R69J172J327
60688D13822J846K638L179L132K705K409K592L274M131M629M485M077M127M813
60674D61859N623O092O321O556O794P057P554Q225Q509Q070P394P254P808Q623
60660E63739R328R872J0277J0568J0894J1374J1916J2314J2445J2287J1942J1679
60648F98635J1628J1405J0527R169P931O677M482J127k213m404n800p410r236
60635G32518j0374j0459j0058r742r616r638r678r306q284p175o799p103p289
$$ y = [638742, 625118, 611532, 598333, 585590, 573200, 561277, 550131, 539899, 530481, 521784, 513779, 506347, 499333, 492720, 486512, 480510, 474517, 468691, 463362, 458504, 453779, 449084, 444701, 440821, 437274, 433839, 430502, 427312, 424272, 421549, 419448, 417970, 416598, 414797, 412656, 410857, 410057, 410354, 411323, 412495, 413822, 415668, 418306, 421485, 424617, 427322, 429731, 432323, 435597, 439728, 444357, 448842, 452919, 457046, 461859, 467482, 473574, 479895, 486451, 493245, 500302, 507856, 516081, 524590, 532660, 540054, 547308, 555116, 563739, 573067, 582939, 593216, 603784, 614678, 626052, 637968, 650282, 662727, 675014, 686956, 698635, 710263, 721668, 732195, 741364, 749295, 755972, 760454, 761581, 759368, 754964, 749164, 741754, 732518, 722144, 711685, 701627, 691885, 682269, 672631, 662953, 653647, 645363, 638188, 631389, 624286, 616997]
60622F16997o962o398n716m679l436k620k405k227j700j134p26J3J452L031L857
60607E87347L882L884M491N653P040Q380R428J0041J0493J1405J3051J4901J6162
60594G06158J6843J7785J9548K1551K2751K2869K2435K1819K0825J9256J7168
60583I29008J4411J0590N831R13l676q220j2918j7240k0608k3054k4594k4662
60571H25781k3013k0631j8790j7589j6235j4511j2960j1857j0919r994r239q594
60559F51449p812o923o057m957l471k236k036k551k644j763k37J644L738N312
60545F21456N451M411L505L355L329K962K724K901K867K277J944K650L868M639
60531F68339N109O201Q182J0499J2801J5233J7870K0588K3609K7391L1930L6644
$$ y = [616997, 610035, 603637, 597921, 593242, 589806, 587186, 584781, 582554, 580854, 579720, 578994, 579007, 580459, 583490, 587347, 591229, 595113, 599604, 605257, 612297, 620677, 630105, 640146, 650639, 662044, 675095, 689996, 706158, 723001, 740786, 760334, 781885, 804636, 827505, 849940, 871759, 892584, 911840, 929008, 943419, 954009, 959840, 960753, 957077, 948857, 935939, 918699, 898091, 875037, 850443, 825781, 802768, 782137, 763347, 745758, 729523, 715012, 702052, 690195, 679276, 669282, 660043, 651449, 643637, 636714, 630657, 625700, 622229, 619993, 617957, 615406, 612762, 610999, 610762, 612406, 616144, 621456, 626907, 631318, 634823, 638178, 641507, 644469, 647193, 650094, 652961, 655238, 657182, 659832, 663700, 668339, 673448, 679649, 687831, 698330, 711131, 726364, 744234, 764822, 788431, 815822, 847752, 884396]
60519H84396M1184M5977N1794N9084O7900P8197Q9802J02037J13673J23573J31305
60508A788922J36739J38913J35884J26159J10025Q9121O5250M0301J6921k107
60498B646128j5573k4339k9976l3665l6538m0103m5440n2279n9302o5205o9136
60487B174572p0536o9053o4641n7621m8625l8377k7180j4676n26J4755L0082M4826
60475A873000N9001P2395Q4105R2978R7900R7606R1047P8379O1262M1985K2720
60464B672378N530p622j5280j6517j0695K126K0577M2650O7283R4621J24665J56844
60452C136560J91298K29518K72883L21442L74909M34061M99993N71981O46487
60443F679132P17573P77470Q17014Q26482P96799P20945N96156M26405K22876
$$ y = [884396, 925580, 971557, 1023351, 1082435, 1150335, 1228532, 1318334, 1420371, 1534044, 1657617, 1788922, 1925661, 2064574, 2200458, 2326617, 2436642, 2525763, 2591013, 2631314, 2648235, 2646128, 2630555, 2606216, 2576240, 2542575, 2506037, 2465934, 2420494, 2368215, 2308913, 2243708, 2174572, 2104036, 2034983, 1970342, 1912721, 1864096, 1825719, 1798539, 1783863, 1783337, 1798092, 1828174, 1873000, 1932001, 2004396, 2088501, 2181479, 2279379, 2376985, 2468032, 2546411, 2607673, 2649658, 2672378, 2677908, 2670286, 2655006, 2638489, 2627794, 2629920, 2650497, 2693147, 2760430, 2855051, 2979716, 3136560, 3327858, 3557376, 3830259, 4151701, 4526610, 4960671, 5460664, 6032645, 6679132, 7396705, 8174175, 8991189, 9817671, 10614470, 11335415, 11931571, 12357976, 12580852]
60434A2580852J523k20102m24658n96493p24443q04430q39269q35953q03076p49634
60424F584317o84244o14224n45000m79926m20365l66250l17323k73974k36778
60415B646233k05486j79005j56160j36237j18913j04078r1661q1380p2707o5172
60405A435434n8483n2357m6670m1804l8252l5737l3274l0384k7570k5400k3809
60394A021694k2645k2046k1803k1240k0334k0100k0990k1752k0963j8995j7424
60383G93402j6920j6902j6904j6979j6848j5868j4045j2249j1190j0811j0648
60372F34038j0133q672o255l950k995l317l693l315k501j779j169o22m06p28j396
60357E83107k059k422k282j813j734k563l749m174l523k571k092k119k321k386
$$ y = [12580852, 12582375, 12362273, 11937615, 11341122, 10616679, 9812249, 8972980, 8137027, 7333951, 6584317, 5900073, 5285849, 4740849, 4260923, 3840558, 3474308, 3156985, 2883011, 2646233, 2440747, 2261742, 2105582, 1969345, 1850432, 1746354, 1654693, 1573313, 1500606, 1435434, 1376951, 1324594, 1277924, 1236120, 1197868, 1162131, 1128857, 1098473, 1070903, 1045503, 1021694, 999049, 977003, 955200, 933960, 913626, 893526, 872536, 850784, 829821, 810826, 793402, 776482, 759580, 742676, 725697, 708849, 692981, 678936, 666687, 655497, 644686, 634038, 623905, 615233, 608978, 605028, 602033, 598716, 595023, 591708, 589207, 587428, 586259, 585637, 585231, 584503, 583107, 581048, 578626, 576344, 574531, 572797, 570234, 566485, 562311, 558788, 556217, 554125, 552006, 549685, 547299]
60343E47299j968r11L33J089J369J817K631L251L312L182L291L505L500L256K872
60328E77828K337J722J226P96J97m22n25j2M96M33m6m37m47QR10J983K846L595
60310E92488M726O221P284P310O652N954N210L993K224J46k132m368n792n755
60296F24161m721l902l735l375j954K46K364M203O243Q503J0128J0357R495Q545
60282F66558Q022P589O735N433L992K635J371J81r26j867k502k797k938l040k769
60267F85677j677QJ395K064K688M102O078P588Q173Q501R535J1505J3801J5670
60253G75108J6982J8407K0776K4193K7944L1387L4629L8080M1703M5148M8383
60242A122740N1709N5187N8424O0830O1951O1654O0264N8266N5659N1872M6662
$$ y = [547299, 545331, 544420, 544753, 545842, 547211, 549028, 551659, 554910, 558222, 561404, 564695, 568200, 571700, 574956, 577828, 580165, 581887, 583113, 583909, 584106, 583684, 583159, 583147, 583643, 584076, 584030, 583593, 583146, 583154, 584064, 586047, 588893, 592488, 597214, 603435, 610719, 618029, 624681, 630635, 635845, 639838, 642062, 642208, 640076, 635708, 629916, 624161, 619440, 615538, 611803, 608428, 606474, 606720, 609084, 613287, 619530, 628033, 638161, 648518, 658013, 666558, 674580, 682169, 688904, 694337, 698329, 700964, 702335, 702516, 701590, 699723, 697221, 694424, 691486, 688446, 685677, 684000, 684008, 685403, 687467, 690155, 694257, 700335, 707923, 716096, 724597, 734132, 745637, 759438, 775108, 792090, 810497, 831273, 855466, 883410, 914797, 949426, 987506, 1029209, 1074357, 1122740, 1174449, 1229636, 1288060, 1348890, 1410841, 1472495, 1532759, 1591025, 1646684, 1698556, 1745218]
60231A745218M0703L4839K9068K2793J5808Q408P85o948j4187k0010k4081k6827
60219A805569k8537k8898k7588k4831k1083j6506j1096n053J270P663J4155K0831
60207A685896K7594L4143M0261M6028N1478N6047N8831N9674N9488N8984N7535
60196B235959N3841M7478L9250L0212K0999J1924L043n871j4871k3313l0342l5852
60184B332457m0325m3784m5513m4994m2497l8542l3319k6843j9368j1349l198
60173A982725M844J2782K0702K8355L5184M1061M6561N1896N6006N7620N7074
60162B394810N6054N5414N4295N1761M8370M5467M3519M1906M0032L7963L5999
60151B905590L3990L1197K6799K0637J3428O059j108p904j3461j6324j5536j1166
$$ y = [1745218, 1785921, 1820760, 1849828, 1872621, 1888429, 1896837, 1897622, 1890674, 1876487, 1856477, 1832396, 1805569, 1777032, 1748134, 1720546, 1695715, 1674632, 1658126, 1647030, 1641977, 1643247, 1650910, 1665065, 1685896, 1713490, 1747633, 1787894, 1833922, 1885400, 1941447, 2000278, 2059952, 2119440, 2178424, 2235959, 2289800, 2337278, 2376528, 2406740, 2427739, 2439663, 2442706, 2436835, 2421964, 2398651, 2368309, 2332457, 2292132, 2248348, 2202835, 2157841, 2115344, 2076802, 2043483, 2016640, 1997272, 1985923, 1982725, 1987569, 2000351, 2021053, 2049408, 2084592, 2125653, 2172214, 2224110, 2280116, 2337736, 2394810, 2450864, 2506278, 2560573, 2612334, 2660704, 2706171, 2749690, 2791596, 2831628, 2869591, 2905590, 2939580, 2970777, 2997576, 3018213, 3031641, 3037700, 3036592, 3028688, 3015227, 2998903, 2983367, 2972201]
60139B972201l691O567J9202L3471M8686O4545Q0801R6918J12366J26918J40413
60128C698397J52384J62151J69203J73317J74316J71856J65495J55106J41259
60119E163484J24872J06332Q5355O1905L6786J0829j5871m3156o9634r3350j13527
60108E254025j30562j44328j53521j57103j55453j49628j40272j27867j13364
60099C981927r7922q2318o7038n2529l8925k5794j2647N19J3412K5809L7371M7307
60087C729172N4591N8481N8776N5835N0420M3221L4365K3673J1471j236j3507
60076D105262k5007l5711m5424n3894o1059o6959p1670p5369p8243q0108q0349
60065C431469p8392p4073o7653n9659n0690m1037l0515j8963o653O147J9764L4579
$$ y = [2972201, 2968510, 2975077, 2994279, 3027750, 3076436, 3140981, 3221782, 3318700, 3431066, 3557984, 3698397, 3850781, 4012932, 4182135, 4355452, 4529768, 4701624, 4867119, 5022225, 5163484, 5288356, 5394688, 5480043, 5541948, 5578734, 5589563, 5573692, 5530536, 5460902, 5367552, 5254025, 5123463, 4979135, 4825614, 4668511, 4513058, 4363430, 4223158, 4095291, 3981927, 3884005, 3801687, 3734649, 3682120, 3643195, 3617401, 3604754, 3605273, 3618685, 3644494, 3681865, 3729172, 3783763, 3842244, 3901020, 3956855, 4007275, 4050496, 4084861, 4108534, 4120005, 4118769, 4105262, 4080255, 4044544, 3999120, 3945226, 3884167, 3817208, 3745538, 3670169, 3591926, 3511818, 3431469, 3353077, 3279004, 3211351, 3151692, 3101002, 3059965, 3029450, 3010487, 3003834, 3009981, 3029745, 3064324]
60053C064324N0024O4818P8205R0271J00918J09270J14342J15669J13042J06171
60043D007054R5026Q0149O2482M3174K3471M276j4273l2261m9083o3693p5786
60032D080536q5933r4433j00807j04678j06408j06463j04841j01509r6888r1457
60022C087119q5341p8626p1631o4606n7531n0435m3451l6388k8776k0462j1633
60011B538239k244P946J8586K8864L8596M8443N8633O8233P6118Q1855Q5205Q5502
59999C133976Q2243P5760O6767N5706M2980K9355J5480J357j3258k8163m2591
59988C419612n5476o5709p2707p6937p9315p9904p7874p2896o5847n7777m9032
59977B666138l9671k9969k0058r861K22R338J7398K5279L3344M0622M6071M9732
$$ y = [3064324, 3114348, 3179166, 3257371, 3347642, 3448560, 3557830, 3672172, 3787841, 3900883, 4007054, 4102080, 4182229, 4244711, 4287885, 4311356, 4315632, 4301359, 4269098, 4220015, 4156322, 4080536, 3994603, 3900170, 3799363, 3694685, 3588277, 3481814, 3376973, 3275464, 3178576, 3087119, 3001778, 2923152, 2851521, 2786915, 2729384, 2678949, 2635498, 2599110, 2570334, 2549872, 2538239, 2535995, 2543941, 2562527, 2591391, 2629987, 2678430, 2737063, 2805296, 2881414, 2963269, 3048474, 3133976, 3216219, 3291979, 3358746, 3414452, 3457432, 3486787, 3502267, 3503624, 3490366, 3462203, 3419612, 3364136, 3298427, 3225720, 3148783, 3069468, 2989564, 2911690, 2838794, 2772947, 2715170, 2666138, 2626467, 2596498, 2576440, 2566579, 2566801, 2576139, 2593537, 2618816, 2652160, 2692782, 2738853, 2788585]
59965B788585N1974N2676N2036N1145N0543M9015M4990L8683L1762K5364J9535
59954C256308J4185R398N031R95k034l081j899J158N950J2532K0659L0151M1511
59941C390864N5357P1465Q9086J07840J27466J47117J65863J83541K00034K13875
59931D752508K22700K25030K20518K08480J87444J56740J17690P2817K4474k5252
59921F163149p3867j18384j56101j85418k06059k18479k23202k20902k13036k01628
59911D346073j88035j72442j54870j36071j16914r7547p7889n8383l9583k1475
59901C282864l917J2877K8944M4885O0575P4350Q4717R2198R8004J01285R9515
59890C976297R1553P8661O2175M1849J7349r935l7643o4197q8996j11355j30109
$$ y = [2788585, 2840559, 2893235, 2945271, 2996416, 3046959, 3095974, 3140964, 3179647, 3211409, 3236773, 3256308, 3270493, 3279891, 3284922, 3285917, 3283883, 3280802, 3278903, 3280061, 3286011, 3298543, 3319202, 3349353, 3390864, 3446221, 3517686, 3606772, 3714612, 3842078, 3989195, 4155058, 4338599, 4538633, 4752508, 4975208, 5200238, 5420756, 5629236, 5816680, 5973420, 6091110, 6163927, 6188401, 6163149, 6089282, 5970898, 5814797, 5629379, 5423320, 5204841, 4981639, 4760737, 4547701, 4346073, 4158038, 3985596, 3830726, 3694655, 3577741, 3480194, 3402305, 3343922, 3304339, 3282864, 3278947, 3291824, 3320768, 3365653, 3426228, 3500578, 3585295, 3677493, 3775497, 3876782, 3976297, 4067850, 4146511, 4208686, 4250535, 4267884, 4257949, 4220306, 4156109, 4067113, 3955758, 3825649]
59879C825649j44170j53063j57116j57335j54821j50079j43135j34266j24248
59870B507416j13822j03320r2828q2364p1945o1760n2231m3497l5173k7110k0056
59859A803310j4978j1905j0169r443r719j0436j0645j0102r320q504p259n449
59847A685381l374r92K086N473P735P787N885K896q67n626j1484j8059k4437k9347
59833A623057l2004l2944l3407l3757l3151l1009k7976k5007k2224j9232j5943
59822A316403j2491q775m716o28L179O936J0990J5108J8712K1657K4281K6779
59810A417435K8929L0535L1657L2315L2185L0839K8149K4368J9908J5186J0669
59799A702175O798L774J567L38O06K627N770R077J2497J6938K2881K9648L6408
$$ y = [3825649, 3681479, 3528416, 3371300, 3213965, 3059144, 2909065, 2765930, 2631664, 2507416, 2393594, 2290274, 2197446, 2115082, 2043137, 1981377, 1929146, 1885649, 1850476, 1823366, 1803310, 1788332, 1776427, 1766258, 1756815, 1747096, 1736660, 1726015, 1715913, 1706593, 1698089, 1690830, 1685381, 1682007, 1681015, 1683101, 1688574, 1696309, 1704096, 1709981, 1712877, 1712010, 1706384, 1694900, 1676841, 1652404, 1623057, 1591053, 1558109, 1524702, 1490945, 1457794, 1426785, 1398809, 1373802, 1351578, 1332346, 1316403, 1303912, 1295137, 1290421, 1289793, 1292972, 1299908, 1310898, 1326006, 1344718, 1366375, 1390656, 1417435, 1446364, 1476899, 1508556, 1540871, 1573056, 1603895, 1632044, 1656412, 1676320, 1691506, 1702175, 1708973, 1712747, 1714314, 1714652, 1715258, 1717885, 1723655, 1732732, 1745229, 1762167, 1785048, 1814696, 1851104]
59786A851104M3415N1645O1614P3202Q6298J01102J17736J35982J55216J74315
59776B851629J91711K05643K14015K14038K02877J79231J43969R9178M7484p208
59766D342567n9591j04938j40901j66850j82288j87176j83133j72852j58347j40701
59756B845790j21225j01629q3066o6004n0875l7810k5943j4157k551P897J6997
59745B367424K5568L3979M1802M9076N6765O5504P4886Q4349R3952J03987J14552
59734C111844J25759J37680J50059J62842J76844J93015K11044K29684K48320
59725D747091K67044K85158L00867L12803L20647L23955L21646L13174K99337
59716G491722K81489K61101K40445K22547K09702K02756K02124K08343K20960
$$ y = [1851104, 1894519, 1946164, 2007778, 2080980, 2167278, 2268380, 2386116, 2522098, 2677314, 2851629, 3043340, 3248983, 3462998, 3677036, 3879913, 4059144, 4203113, 4302291, 4349775, 4342567, 4282976, 4178038, 4037137, 3870287, 3687999, 3500823, 3317690, 3144838, 2986491, 2845790, 2724565, 2622936, 2539870, 2473866, 2422991, 2385181, 2359238, 2345081, 2342530, 2350427, 2367424, 2392992, 2426971, 2468773, 2517849, 2574614, 2640118, 2715004, 2799353, 2893305, 2997292, 3111844, 3237603, 3375283, 3525342, 3688184, 3865028, 4058043, 4269087, 4498771, 4747091, 5014135, 5299293, 5600160, 5912963, 6233610, 6557565, 6879211, 7192385, 7491722, 7773211, 8034312, 8274757, 8497304, 8707006, 8909762, 9111886, 9320229, 9541189]
59707I541189K37902K56730K75733K93177L06327L12100L08290K93759K68105
59698A2093312K31795J86313J33933P7691K1444l1051p7284j15556j43706j59698
59688A2217193j63643j57674j43333j20489q9477n2545j2059L1455P8305J27855
59678A1715588J79028K31580K85419L39301L91293M39739M82315N14752N31801
59669A5110816N29299N04365M54379L77588K75052J51403J3850j28732k66532
59660A7021488l90368m93413n71438o22160o45460o43965o22308n85519n38654
59651A1908203m87477m38150l95789l63820l44677l40091l49947l70915l96614
59642H420723m19649m34473m39107m34412m21749m01863l75848l46167l15824
$$ y = [9541189, 9779091, 10035821, 10311554, 10604731, 10911058, 11223158, 11531448, 11825207, 12093312, 12325107, 12511420, 12645353, 12723044, 12744488, 12713437, 12636153, 12520597, 12376891, 12217193, 12053550, 11895876, 11752543, 11632054, 11542577, 11490032, 11477973, 11509428, 11587733, 11715588, 11894616, 12126196, 12411615, 12750916, 13142209, 13581948, 14064263, 14579015, 15110816, 15640115, 16144480, 16598859, 16976447, 17251499, 17402902, 17416752, 17288020, 17021488, 16631120, 16137707, 15566269, 14944109, 14298649, 13654684, 13032376, 12446857, 11908203, 11420726, 10982576, 10586787, 10222967, 9878290, 9538199, 9188252, 8817337, 8420723, 8001074, 7566601, 7127494, 6693082, 6271333, 5869470, 5493622, 5147455, 4831631]
59633D831631k86796k59690k34358k10410j87657j66678j48439j32900j18655
59624C086048j04618r1338p9858o9969o0649n1783m4199l8242l3272k8635k4292
59613B459193k0576j8042j7451j9108k2252k5762k9328l3292l7470m1037m3511
59602B151364m5129m6196m6717m6665m6024m4518m1966l8840l5853l2962k9439
59591A697055k5030k0401j6251j2567r037n721k964q39J035L154N574P735R010
59578A630753R475R829J0467J0984J0871J0295R853R875J0359J1258J2511J4070
59566A760600J6189J9246K3048K6812L0278L4211L9288M5050N0689N6345O2752
59555B164508O9947P7216Q4192R1230R8729J06715J15105J23744J32165J39681
$$ y = [4831631, 4544835, 4285145, 4050787, 3840377, 3652720, 3486042, 3337603, 3204703, 3086048, 2981430, 2890092, 2810234, 2740265, 2679616, 2627833, 2583634, 2545392, 2512120, 2483485, 2459193, 2438617, 2420575, 2403124, 2384016, 2361764, 2336002, 2306674, 2273382, 2235912, 2194875, 2151364, 2106235, 2060039, 2013322, 1966657, 1920633, 1876115, 1834149, 1795309, 1759456, 1726494, 1697055, 1672025, 1651624, 1635373, 1622806, 1613769, 1608048, 1605084, 1604245, 1605280, 1608434, 1614008, 1621743, 1630753, 1640228, 1650057, 1660524, 1671508, 1682379, 1692674, 1702527, 1712402, 1722761, 1734019, 1746530, 1760600, 1776789, 1796035, 1819083, 1845895, 1876173, 1910384, 1949672, 1994722, 2045411, 2101756, 2164508, 2234455, 2311671, 2395863, 2487093, 2585822, 2692537, 2807642, 2931386, 3063551, 3203232]
59545C203232J45657J49505J50745J49553J46784J42957J37551J29942J20643
59536D476569J10836J01111R1475Q2317P4350O7538O1005N4152M7179M0436L4027
59525E240995K8410K4799K4613K8583L6220M5749N4557O0286O1662N8154M9158
59514E713186L3985J2564j4214m4717p6809j08260j37486j63829j86755k05122
59504D822543k17793k24663k26417k23518k16186k05208j91916j77231j61363
59495B978248j44666j28133j12778r8859q5916p3445o1493n0651m1386l3306k5416
59484B122199j7167q875r72O525J3558J9856K5732L2270L9970M7988N5591O3515
59472B400190P2779Q2831R2320J01218J10505J19849J27354J31905J34074J34059
$$ y = [3203232, 3348889, 3498394, 3649139, 3798692, 3945476, 4088433, 4225984, 4355926, 4476569, 4587405, 4688516, 4779991, 4862308, 4936658, 5004196, 5065201, 5119353, 5166532, 5206968, 5240995, 5269405, 5294204, 5318817, 5347400, 5383620, 5429369, 5483926, 5544212, 5605874, 5664028, 5713186, 5747171, 5759735, 5745521, 5700804, 5623995, 5515735, 5378249, 5214420, 5027665, 4822543, 4604750, 4380087, 4153670, 3930152, 3713966, 3508758, 3316842, 3139611, 2978248, 2833582, 2705449, 2592671, 2493812, 2407896, 2334451, 2272958, 2222307, 2180921, 2147615, 2122199, 2105032, 2096157, 2095185, 2101710, 2115268, 2135124, 2160856, 2193126, 2233096, 2281084, 2336675, 2400190, 2472969, 2555800, 2648120, 2749338, 2859843, 2979692, 3107046, 3238951, 3373025, 3507084]
59462C507084J30217J20807J06040Q7353O5343L9771J1274j8072m6092p1704r4583
59451C837438j14259j29881j40758j46914j49052j48009j44323j38444j31084
59442B594714j23011j14506j05484r6206q7434p9612p2262o4552n6387m8624m2166
59431A704470l7076l2725k8599k4617k0716j6619j2368q635n968l933j675R02
59419A512441L247N346P805J0605J2920J4551J6426J9016K1390K2835K4442K7816
59407A698840L2735L7404M0608M2344M2536M0611L6863L3130L1588L3313L8216
59396B108188M5688N4993O5460P6534Q7460R7020J04188J09207J13724J19758
59386B982220J28682J41038J56760J75477J96656K19593K43331K66909K89594
$$ y = [3507084, 3637301, 3758108, 3864148, 3951501, 4016844, 4056615, 4067889, 4049817, 4003725, 3932021, 3837438, 3723179, 3593298, 3452540, 3305626, 3156574, 3008565, 2864242, 2725798, 2594714, 2471703, 2357197, 2251713, 2155507, 2068073, 1988461, 1916199, 1851647, 1795260, 1746636, 1704470, 1667394, 1634669, 1606070, 1581453, 1560737, 1544118, 1531750, 1523115, 1517147, 1513214, 1511539, 1512441, 1515688, 1521034, 1528839, 1539444, 1552364, 1566915, 1583341, 1602357, 1623747, 1646582, 1671024, 1698840, 1731575, 1768979, 1809587, 1851931, 1894467, 1935078, 1971941, 2005071, 2036659, 2069972, 2108188, 2153876, 2208869, 2274329, 2350863, 2438323, 2535343, 2639531, 2748738, 2862462, 2982220, 3110902, 3251940, 3408700, 3584177, 3780833, 4000426, 4243757, 4510666, 4800260]
59377D800260L10408L27408L38321L42253L40003L32390L19122L00090K76806
59368G687061K51588K25893K00418J76306J54884J36372J19785J04033Q8433P2341
59358I217114N5136L6556J6417n581k9063n2292p3060r0119j03241j12442j18136
59347H741289j21626j24470j27574j31638j37943j47619j60364j74856j90064
59338G425135k05180k18670k28705k34526k36515k35111k30619k23752k15194
59329E396863k04833j92459j78892j65334j51925j38215j24754j12744j02250
59320D025457r2207q2180p2678o3705n4545m5274l7038l0442k4823j9378j3884
59309C489303q086j673M888J0667J5632K0588K5569K9619L2241L3779L4194L2975
$$ y = [4800260, 5110668, 5438076, 5776397, 6118650, 6458653, 6791043, 7110165, 7410255, 7687061, 7938649, 8164542, 8364960, 8541266, 8696150, 8832522, 8952307, 9056340, 9144773, 9217114, 9272250, 9308806, 9325223, 9319642, 9290579, 9238287, 9165227, 9075108, 8971867, 8859425, 8741289, 8619663, 8495193, 8367619, 8235981, 8098038, 7950419, 7790055, 7615199, 7425135, 7219955, 7001285, 6772580, 6538054, 6301539, 6066428, 5835809, 5612057, 5396863, 5192030, 4999571, 4820679, 4655345, 4503420, 4365205, 4240451, 4127707, 4025457, 3933250, 3851070, 3778392, 3714687, 3660142, 3614868, 3577830, 3547388, 3522565, 3503187, 3489303, 3481217, 3479544, 3484432, 3495099, 3510731, 3531319, 3556888, 3586507, 3618748, 3652527, 3686721, 3719696]
59297C719696L0571K8240K5996K2243J6196R198K862k786q390j3853j8773k3223
59285C787977k7065k9419k9672k8214k5548k1564j6336j0583m609K106R464J6015
59273C622552K0546K3309K4647K3481J8490R990n73j2449k5767m0354n5438p0152
59261C538282q3398r3701j00165j03320j04219j03038r9356r3407q6188p8507
59251B592983p0705o3032n5593m8053m0058l1765k3569j5498p445L85P770J4998
59239B260418K2615L0865L9770M9461O0007P1166Q2732R4967J08430J23646J41052
59228C085129J60804J82334K04495K26396K47679K67612K84184K94302K94739
59219E247674K83323K60094K27672J89811J49185J06717O2738J7917k6868p0410
$$ y = [3719696, 3750267, 3778507, 3804503, 3826746, 3842942, 3852140, 3855002, 3852216, 3843826, 3829973, 3811200, 3787977, 3760912, 3731493, 3701821, 3673607, 3648059, 3626495, 3610159, 3599576, 3594967, 3597073, 3606537, 3622552, 3643098, 3666407, 3691054, 3714535, 3733025, 3743015, 3742442, 3729993, 3704226, 3663872, 3608434, 3538282, 3454884, 3361183, 3261018, 3157698, 3053479, 2950441, 2851085, 2757678, 2671490, 2592983, 2522278, 2459246, 2403653, 2355600, 2315542, 2283777, 2260208, 2244710, 2237265, 2237650, 2245420, 2260418, 2283033, 2313898, 2353668, 2403129, 2463136, 2534302, 2617034, 2712001, 2820431, 2944077, 3085129, 3245933, 3428267, 3632762, 3859158, 4106837, 4374449, 4658633, 4952935, 5247674, 5530997, 5791091, 6018763, 6208574, 6357759, 6464476, 6527214, 6545131, 6518263, 6447853]
59209F447853j10514j44388j70203j87724j97296j99137j93985j83430j69033
59200D892143j51767j32659j13139r4310p6578o0446m6837l6190k8037k1915j8033
59189D112232j6563j7138j9410k3374k8678l4460m0263m6305n2465n7915o2201
59178C713460o5696o8535p0107p0116o9129o7426o4448o0049n5310n1163m7200
59167C024281m2666l7767l3115k8685k4247k0083j6440j2913r224n866l237p48
59155B789290K441O419J0874J5674K0484K4609K7944L1305L5105L8612M1092M2823
59143C086672M4096M4299M2828M0023L6276L1151K4419J7010R816K393n980j4667
59131C358336k2343k8570l3647l7441l9568m0188l9615l7621l4012k9290k3852
$$ y = [6447853, 6337339, 6192951, 6022748, 5835024, 5637728, 5438591, 5244606, 5061176, 4892143, 4740376, 4607717, 4494578, 4400268, 4323690, 4263244, 4216407, 4180217, 4152180, 4130265, 4112232, 4095669, 4078531, 4059121, 4035747, 4007069, 3972609, 3932346, 3886041, 3833576, 3775661, 3713460, 3647764, 3579229, 3509122, 3439006, 3369877, 3302451, 3238003, 3177954, 3122644, 3071481, 3024281, 2981615, 2943848, 2910733, 2882048, 2857801, 2837718, 2821278, 2808365, 2799141, 2793275, 2790038, 2789290, 2791731, 2798150, 2809024, 2824698, 2845182, 2869791, 2897735, 2929040, 2964145, 3002757, 3043849, 3086672, 3130768, 3175067, 3217895, 3257918, 3294194, 3325345, 3349764, 3366774, 3376590, 3378983, 3373003, 3358336, 3335993, 3307423, 3273776, 3236335, 3196767, 3156579, 3116964, 3079343, 3045331, 3016041, 2992189]
59120B992189j7284r390j159O376J3480K0783K7891L4185M0183M6643N2906N7580
59108C264383O0517O2657O4214O4329O2338N8182N1717M2615L0833J6341j219
59097C776907k1631m3283o4204q3471j00823j15659j27514j36863j44134j48498
59087B790827j48925j45943j41040j34816j27067j18239j09289j00395r1203q2158
59077A591752p4156o7073o0026n2995m6899m2060l7858l3885l0300k7063k3911
59066A095526k1033j8727j6600j4084j1539r737q560p345o208n779n889n843n763
59053I58419o292p136p301o710o177n766m540k102Q79L844O869R893J2499J4596
59039I60975J6304J7218J6848J5687J4739J4123J3341J2722J3235J4905J6809
$$ y = [2992189, 2974905, 2965515, 2964356, 2970732, 2984212, 3004995, 3032886, 3067071, 3107254, 3153897, 3206803, 3264383, 3324900, 3387557, 3451771, 3516100, 3578438, 3636620, 3688337, 3730952, 3761785, 3778126, 3776907, 3755276, 3711993, 3647789, 3564318, 3463495, 3347836, 3220322, 3083459, 2939325, 2790827, 2641902, 2495959, 2354919, 2220103, 2093036, 1974797, 1865508, 1765113, 1673910, 1591752, 1517596, 1450523, 1390497, 1337502, 1290603, 1248543, 1210685, 1176800, 1146500, 1119437, 1095526, 1074493, 1055766, 1039166, 1025082, 1013543, 1003806, 995246, 987901, 981693, 975914, 970025, 964182, 958419, 952127, 944991, 937690, 930980, 924803, 919037, 914497, 912395, 913274, 917118, 923987, 933880, 946379, 960975, 977279, 994497, 1011345, 1027032, 1041771, 1055894, 1069235, 1081957, 1095192, 1110097, 1126906]
59028A126906J8658K0935K3273K4221K2889J9658J5029R130K650l131p701j1534
59016A260983j4608j5968j5203j3132j0500p042k509K380O641R916J2164J3118
59004A226240J2615J0846P907L694j592p367j3238j9015k4064k7366k8426k7667
58992A112567k5897k3825k1950k0215j7974j4864j1471q454n576k439L64K014
58980I62280K927M256O180Q003R579J1323J3082J4440J5923J8327K0953K2193
58968A109466K1884K1451K1529K1243K0132J9032J8391J7385J5544J3849J3323
58957A313229J3550J3472J2722J1588J0529J0238J1277J3184J4792J5755J6954
58946A457290J9083K1865K4867K8079L1427L4836L8931M4487N0827N6128N9815
$$ y = [1126906, 1145564, 1166499, 1189772, 1213993, 1236882, 1256540, 1271569, 1280699, 1283349, 1280218, 1272517, 1260983, 1246375, 1230407, 1215204, 1202072, 1191572, 1184530, 1182021, 1184401, 1191042, 1200958, 1213122, 1226240, 1238855, 1249701, 1257608, 1261302, 1259710, 1252343, 1239105, 1220090, 1196026, 1168660, 1140234, 1112567, 1086670, 1062845, 1040895, 1020680, 1002706, 987842, 976371, 967917, 962341, 959902, 960266, 962280, 965207, 969463, 975643, 983646, 993225, 1004548, 1017630, 1032070, 1047993, 1066320, 1087273, 1109466, 1131350, 1152801, 1174330, 1195573, 1215705, 1234737, 1253128, 1270513, 1286057, 1299906, 1313229, 1326779, 1340251, 1352973, 1364561, 1375090, 1385328, 1396605, 1409789, 1424581, 1440336, 1457290, 1476373, 1498238, 1523105, 1551184, 1582611, 1617447, 1656378, 1700865, 1751692, 1807820, 1867635]
58935A867635O3376O8253P4124P9968Q5665R1699R8236J05299J13135J21883J31504
58924B900777J42409J55337J70284J86459K03630K22517K43441K65618K88162
58915D778634L10756L32867L53300L70994L85214L94458L96217L88438L70266
58906H081144L40957K99359K45343J80884J08985L2403m5914j22077j92026k52735
58896H676323l02292l39582l64573l78407l82571l78288l66934l50383l30504
58887E482789l08755k86367k64396k43427k23744k05736j89563j74761j61038
58878C425002j49111j39616j31509j22950j13717j05224r8105r1318q3930p6251
58868B313271o8920o2321n7215n4307n2710n0379m6658m2868l9911l7010l3506
$$ y = [1867635, 1931011, 1999264, 2073388, 2153356, 2239021, 2330720, 2428956, 2534255, 2647390, 2769273, 2900777, 3043186, 3198523, 3368807, 3555266, 3758896, 3981413, 4224854, 4490472, 4778634, 5089390, 5422257, 5775557, 6146551, 6531765, 6926223, 7322440, 7710878, 8081144, 8422101, 8721460, 8966803, 9147687, 9256672, 9289075, 9243161, 9121084, 8929058, 8676323, 8374031, 8034449, 7669876, 7291469, 6908898, 6530610, 6163676, 5813293, 5482789, 5174034, 4887667, 4623271, 4379844, 4156100, 3950364, 3760801, 3586040, 3425002, 3275891, 3136275, 3004766, 2881816, 2768099, 2662875, 2564770, 2473452, 2389522, 2313271, 2244351, 2182030, 2124815, 2070508, 2017798, 1967419, 1920761, 1877893, 1837982, 1800972, 1767466]
58857A767466l0081k7183k3962j9907j6093j3446j1104p817l807K6L668P442J0788
58844A635990J3047J4788J7173K0486K4294K8450L2976L7485M1636M5732N0155
58833A962212N4750N9423O4708P1072P8216Q5688R3543J01972J10939J20656J31663
58822B934842J43941J56814J70123J84621K00771K18099K36218K55440K75851
58813D776720K96702L17189L36757L54146L67245L74458L75129L68153L51341
58804G917840L22845K82155K29443J65542R3264J7209n8711j32324k01256k61748
58794H374259l10674l47398l72471l86041l88890l83689l73451l59397l41646
58785E110602l21128k99543k78058k57160k37169k17929j98834j80063j63019
$$ y = [1767466, 1737385, 1710202, 1686240, 1666333, 1650240, 1636794, 1625690, 1617873, 1614066, 1614092, 1617760, 1625202, 1635990, 1649037, 1663825, 1680998, 1701484, 1725778, 1754228, 1787204, 1824689, 1866325, 1912057, 1962212, 2016962, 2076385, 2141093, 2212165, 2290381, 2376069, 2469612, 2571584, 2682523, 2803179, 2934842, 3078783, 3235597, 3405720, 3590341, 3791112, 4009211, 4245429, 4500869, 4776720, 5073422, 5390611, 5727368, 6081514, 6448759, 6823217, 7198346, 7566499, 7917840, 8240685, 8522840, 8752283, 8917825, 9011089, 9028298, 8969587, 8837263, 8636007, 8374259, 8063585, 7716187, 7343716, 6957675, 6568785, 6185096, 5811645, 5452248, 5110602, 4789474, 4489931, 4211873, 3954713, 3717544, 3499615, 3300781, 3120718, 2957699]
58776B957699j48639j36161j24403j13358j03624r5226q7977q2106p7571p3601
58766A915033o9577o5523o1164n5799m9729m4318l9866l5034k9232k3729j9287
58755A421775j4680r082m008r18J429N035R483J2986J5401J7885K0370K1816K2412
58742A519904K3140K3380K1111J5541P880m12q509j5531k0669k4084k6558k8283
58730A486910k9156k9778l0932l2450l3763l5061l6675l7888l7851l7120l6912
58719A109324l7192l6949l5909l4538l2758l0181k7299k5028k3203k0917j8110
58708G87240j5583j3590j1737j0025q852q084p230o315n684n264m952n127n835
58695F78962o078n081l654l041l004k409j155j85L6k55j001k222l376l954m246
$$ y = [2957699, 2809060, 2672899, 2548496, 2435138, 2331514, 2236288, 2148311, 2066205, 1988634, 1915033, 1845456, 1779933, 1718769, 1662970, 1613241, 1568923, 1529057, 1494023, 1464791, 1441062, 1421775, 1407095, 1398013, 1394005, 1393087, 1394516, 1399551, 1409034, 1422020, 1437421, 1455306, 1475676, 1497492, 1519904, 1543044, 1566424, 1587535, 1603076, 1610956, 1610544, 1602035, 1586504, 1565835, 1541751, 1515193, 1486910, 1457754, 1427976, 1397044, 1364594, 1330831, 1295770, 1259095, 1221207, 1183356, 1146236, 1109324, 1072132, 1035183, 999274, 964736, 931978, 901797, 874498, 849470, 826267, 805350, 787240, 771657, 758067, 746330, 736305, 727453, 719369, 712139, 705824, 700140, 694876, 689924, 684797, 678962, 672884, 667803, 664149, 661108, 658104, 655695, 654540, 654355, 654391, 654136, 653135, 650913, 647537, 643583, 639337]
58680F39337m487l903j874O56K364L579N562Q290J0452J1404J1593J1128R433
58667G03534O433L024K64j216j291o01k95q85j879l042n024p925j0462j1626j2047
58652F56962j2464j2102j0075p280n208l723j731P59K884M606O493Q449J0096
58639F37666J1708J3430J4441J4327J4332J5669J7555J8648J9334K0713K2484
58628H20307K3879K5761K9445L4246L8428M2042M6592N2442N8769O5561P3393
58617A310865Q1604Q8958R5721J02881J09717J14379J16520J16860J14409J06750
58607B358664R3176P5293N4337L0324M128k1772m5226o5302q1092r1582r7065
58596B213883r9073r8528r5457r0404q4544p8307p1430o4196n7120m9780m1635
$$ y = [639337, 634850, 630947, 629073, 629729, 632093, 635672, 641234, 649524, 659976, 671380, 682973, 694101, 703534, 709967, 712991, 713255, 712039, 710748, 710147, 709852, 708967, 707088, 704046, 699022, 691097, 680635, 669009, 656962, 644498, 632396, 622321, 615041, 609833, 606110, 604379, 605138, 608022, 612628, 619121, 627570, 637666, 649374, 662804, 677245, 691572, 705904, 721573, 739128, 757776, 777110, 797823, 820307, 844186, 869947, 899392, 933638, 972066, 1014108, 1060700, 1113142, 1171911, 1237472, 1310865, 1392469, 1481427, 1577148, 1680029, 1789746, 1904125, 2020645, 2137505, 2251914, 2358664, 2451840, 2527133, 2581470, 2611794, 2615922, 2594150, 2548924, 2483622, 2402530, 2310948, 2213883, 2114810, 2016282, 1920825, 1830421, 1745877, 1667570, 1596140, 1531944, 1474824, 1425044, 1383409]
58585A383409l3620k7101k1719j6173j0670o494l636j086R35J436J077J614L041
58572A271013L772L694M499O768R197J1064J3002J4844J4892J1910O028k612j3959
58559A354112k6575l7998m7016n3823n8114n9048n7114n3803m9405m3333l6563
58548H31320l1251k7812k4771k1664j9500j8194j6269j3614j1881j1482j0760
58537F24122q820o784n459m190k752k074k208j789m57L50k53j403k294l142l726
58522E79121l229k086j919k833l030j749l91M1L67J228J797J519J199J487J988
58507E73510K517L435M308M164L509M048O008P821Q857J0186J2248J4158J5886
58494F70655J8653K2392K5132K5669K4749K3010K0062J6129J2331Q712M203j039
$$ y = [1383409, 1349789, 1322688, 1300969, 1284796, 1274126, 1267632, 1263996, 1262910, 1263845, 1265281, 1266358, 1267972, 1271013, 1274785, 1278479, 1282978, 1289746, 1298943, 1310007, 1323009, 1337853, 1352745, 1364655, 1370683, 1368071, 1354112, 1327537, 1289539, 1242523, 1188700, 1130586, 1071538, 1014424, 960621, 911216, 867883, 831320, 800069, 772257, 747486, 725822, 706322, 688128, 671859, 658245, 646364, 634882, 624122, 615302, 608518, 603059, 598869, 596117, 594043, 591835, 590046, 589589, 589939, 589686, 588283, 585989, 582847, 579121, 575892, 573806, 571887, 569054, 566024, 564275, 563884, 563925, 564292, 565520, 567317, 568836, 570035, 571522, 573510, 576027, 579462, 583770, 587934, 591443, 595491, 601499, 609320, 618177, 628363, 640611, 654769, 670655, 689308, 711700, 736832, 762501, 787250, 810260, 830322, 846451, 858782, 867494, 871697, 870658]
58482H70658n587r344j3598j8153k1175k2389k3445k4545k3786k0777j7840j6422
58470F53597j5238j3135j0985r518p938n910m355l249j300J247K334J555R36J324
58456E89365J142r0m04J008K112J648J262K229L171K975L024M488O135O860P768
58441F32693R770J1691J2610J3531J4949J5324J3723J1367Q932N158j72m816p499
58428G37261r767j2530j3880j2568j0558r704q797o425l928k873k194l98J759
58415F45398L253M970P570R676J0584J2113J5330J7975J7809J6024J4662J3166
58403G88530J0177O491L369Q2m179p975r749j0335j1034j1252j0304r307q995
58390G25519p919n122k303j002m4J922L794M285M394N192N654M933M292M453L757
$$ y = [870658, 865071, 855727, 842129, 823976, 802801, 780412, 756967, 732422, 708636, 687859, 670019, 653597, 638359, 625224, 614239, 604721, 596783, 590873, 586518, 583269, 581969, 583216, 585550, 587105, 588041, 589365, 590507, 590417, 590013, 591021, 593133, 594781, 596043, 598272, 601443, 604418, 607442, 611930, 618065, 624925, 632693, 642463, 654154, 666764, 680295, 695244, 710568, 724291, 735658, 744590, 749748, 749576, 744760, 737261, 727494, 714964, 701084, 688516, 677958, 668254, 659457, 653032, 649104, 646231, 644037, 643639, 645398, 648651, 653621, 661191, 670867, 681451, 693564, 708894, 726869, 744678, 760702, 775364, 788530, 798707, 805198, 808567, 808649, 804470, 796495, 786746, 776411, 765377, 754125, 743821, 734514, 725519, 717600, 712478, 710175, 709173, 709129, 711051, 714845, 719130, 723524, 728716, 734370, 739303, 743595, 748048, 751805]
58375G51805J341o82o92k78r57j093J016L839N291O058P468Q748R187J0203J2524
58360H13778J4090J3564J2938J3955J5055J4747J4677J6149J6988J5211J2594
58349I73746J1190R498N703J538p29k154m406o257o269n866o276n684k907m06
58335I60721j4N95L422O124O541P109J0224J3254J3102J1881J2937J4933J5192
58322A076021J5302J7832K0829K1271K0817K2512K4837K4746K3545K3961K4279
58311A315952K1326J6526J3145J0345N832J600Q96K141J903J318L413O765Q091
58298A409253Q496J0949J4099J4932J4930J7208K0200K0638K0151K2245K5549
58287A598650K6826K7755L1696L6568L8290L8692M2441M8630N2950N5812O0579
$$ y = [751805, 753146, 752464, 751772, 751494, 750537, 749444, 750460, 754299, 759590, 765648, 773116, 781864, 791051, 801254, 813778, 827868, 841432, 854370, 868325, 883380, 898127, 912804, 928953, 945941, 961152, 973746, 984936, 994434, 1000137, 1001675, 1000946, 998792, 994386, 988129, 981860, 975994, 969718, 964034, 961127, 960721, 960707, 961302, 964724, 970848, 977389, 984498, 994722, 1007976, 1021078, 1032959, 1045896, 1060829, 1076021, 1091323, 1109155, 1129984, 1151255, 1172072, 1194584, 1219421, 1244167, 1267712, 1291673, 1315952, 1337278, 1353804, 1366949, 1377294, 1383126, 1384726, 1385622, 1387763, 1389666, 1390984, 1394397, 1401162, 1409253, 1417749, 1428698, 1442797, 1457729, 1472659, 1489867, 1510067, 1530705, 1550856, 1573101, 1598650, 1625476, 1653231, 1684927, 1721495, 1759785, 1798477, 1840918, 1889548, 1942498, 1998310, 2058889]
58276B058889O6043O8262O7722O7123O4634N6968M6668L8426L1060K1107J1304
58265B598206O926O636N812N836J0902J8653K3656K7368L4677M3471M7957M9742
58253B879842N4821O2113O5918O7387P2241P9242Q2542Q3536Q8550R6691J01871
58242C734754J05011J11994J21428J27068J30474J38332J49168J56186J61227
58233D935642J71842J86569J97682K06630K21460K40810K56478K70087K90540
58224F977740L16549L39140L59921L88551M23698M55859M87736N31302N85747
58215A0866243O40010O96360P68425Q56475R49307J050647J177705J333369J507994
58206A9846535J709430J960892K267156K614884L008092L468750M002183M604066
$$ y = [2058889, 2124932, 2193194, 2260916, 2328039, 2392673, 2449641, 2496309, 2534735, 2565795, 2586902, 2598206, 2605132, 2611768, 2617580, 2623416, 2634318, 2652971, 2676627, 2703995, 2738672, 2782143, 2830100, 2879842, 2934663, 2996776, 3062694, 3130081, 3202322, 3281564, 3364106, 3447642, 3536192, 3632883, 3734754, 3839765, 3951759, 4073187, 4200255, 4330729, 4469061, 4618229, 4774415, 4935642, 5107484, 5294053, 5491735, 5698365, 5919825, 6160635, 6417113, 6687200, 6977740, 7294289, 7633429, 7993350, 8381901, 8805599, 9261458, 9749194, 10280496, 10866243, 11506253, 12202613, 12971038, 13827513, 14776820, 15827467, 17005172, 18338541, 19846535, 21555965, 23516857, 25784013, 28398897, 31406989, 34875739, 38877922, 43481988]
58198D3481988N306693O175117P255272Q579808J0231287J2334681J4973573J8186323
58190A26524742K2047931K6604898L1585968L6186280L9188387L9273898L5294396
58183C56706500K6618821J3699252j557274j6260296k7777339l4809101l7525032
58176B79095531l6943921l4268218l0539279k6511185k2617937j9048956j5887469
58169I3278566j3180706j0923152r057064p521830o277081n277327m463668l792482
58161C2785256l244904k801031k430218k112776j847120j628385j440285j273303
58153A6007234j131219j013520r08883q11485p27307o58488n96166n34577m78632
58144I146957m31708l88188l43917l03039k68509k35506j99996j65421j35216
$$ y = [43481988, 48788681, 54963798, 62219070, 70798878, 81030165, 93364846, 108338419, 126524742, 148572673, 175177571, 206763539, 242949819, 282138206, 321412104, 356706500, 383325321, 397024573, 395467299, 379207003, 351429664, 316620563, 279095531, 242151610, 207883392, 177344113, 150832928, 128214991, 109166035, 93278566, 80097860, 69174708, 60117644, 52595814, 46318733, 41041406, 36577738, 32785256, 29540352, 26739321, 24309103, 22196327, 20349207, 18720822, 17280537, 16007234, 14876015, 13862495, 12953612, 12142127, 11414820, 10756332, 10160166, 9625589, 9146957, 8715249, 8327061, 7983144, 7680105, 7411596, 7176090, 6976094, 6810673, 6675457]
58135F675457j05960p3331l8680m525L1150P0711J10909J46212J75781K03118
58125G190842K30931K60834K97420L48059M17306N04991O12097P45415R12950
58116A1520845J118742J369062J680614K072566K552965L129078L830878M692536
58108C1967286N679372O632426P293528P376847O629628M909369K315440p23491
58100G2080405l568356n671904o818963p117448o820029o176959n388879m595154
58092B5922713l863735l210624k641489k165492j778225j459671j195504r83241
58084H624732q15972o78777n64765m78119m17558l71701l33929l07332k91323
58075D365256k76953k59329k42078k25920k04934j78047j52726j33364j16682
$$ y = [6675457, 6569497, 6496166, 6457486, 6452961, 6484111, 6554822, 6665731, 6811943, 6987724, 7190842, 7421773, 7682607, 7980027, 8328086, 8745392, 9250383, 9862480, 10607895, 11520845, 12639587, 14008649, 15689263, 17761829, 20314794, 23443872, 27274750, 31967286, 37646658, 44279084, 51572612, 58949459, 65579087, 70488456, 72803896, 72080405, 68512049, 62840145, 56021182, 48903734, 42083705, 35906746, 30517867, 25922713, 22058978, 18848354, 16206865, 14041373, 12263148, 10803477, 9607973, 8624732, 7808760, 7129983, 6565218, 6087099, 5669541, 5297840, 4963911, 4656579, 4365256, 4088303, 3828974, 3586896, 3360976, 3156042, 2977995, 2825269, 2691905, 2575223]
58066B575223j01928r4691r6439j00243j00985j00717j00543r6662q8252q0361
58056A614402p5227o9132o1053n5784n4855n2898m6875m0870l7917l4988l0014
58045A054789k6274k5755k5239k2856k1689k3120k3420k0627j8189j8110j7176
58034H12334j3640j1081j1687j2077r777p808q779j0284j0125j0459j2721j3883
58022F80013j1822r319q884q628o842n635o285n972k936o1L51O34K904M898M524
58007F26940M045N774P825Q005P873R164J0018Q450N874L822Q31m053q500j0875
57993F75193j3209j6955j9686j9336j7939j7676j6983j4147j1111j0049r550p720
57981E00832n894n766o012n106m386n060n361l929k790l655m509l232j495j518
$$ y = [2575223, 2473295, 2378604, 2282165, 2181922, 2080937, 1980220, 1879677, 1783015, 1694763, 1614402, 1539175, 1470043, 1408990, 1353206, 1298351, 1245453, 1198578, 1157708, 1119791, 1084803, 1054789, 1028515, 1002760, 977521, 954665, 932976, 909856, 886436, 865809, 847620, 829510, 812334, 798694, 787613, 775926, 763849, 754072, 746264, 737485, 727201, 717076, 706617, 693896, 680013, 668191, 658872, 649988, 641360, 634518, 628883, 622598, 616626, 613690, 613629, 613980, 614614, 617518, 622416, 626940, 630985, 636759, 644584, 652589, 660462, 669626, 679644, 688094, 693968, 697790, 698621, 694568, 686068, 675193, 661984, 645029, 625343, 606007, 588068, 570392, 553409, 539262, 528151, 518102, 508552, 500832, 494938, 489172, 483160, 478054, 473668, 468608, 463247, 459318, 456528, 452873, 448364, 445132, 443637, 442119]
57967D42119k024j020L02L9o80P2J532K159K588L568L644J931L89L12m97l790
57951D50644p160p808p067p449q039o817m933m529m525k784m57j4o41K69K438
57936C91128L380K669J938J639J212J368K993M725M671L527L208L605L521L460
57922D33044M556N930O007N257M951M452K543J53j114j917l882o536q293r260
57908D35891j0411j1216j0799j0264j1073j2296j2151j1004j0238r420p489n458
57896C14072m940n125m122k330j488j407n88P08J030O46J061K230L009L685N330
57881C11771P219P639O815O454O752O434N285M220L217J580j70r20j040j710k745
57866C60801l208l499m568n769n792n115n202n841n597m331l052j819k8J806K803
$$ y = [442119, 440095, 439075, 439377, 439416, 438736, 438808, 440340, 442499, 445087, 448655, 452299, 454230, 454619, 454931, 454434, 450644, 443484, 435676, 428609, 421160, 413121, 406304, 401371, 396842, 392317, 389533, 389076, 389062, 388421, 388690, 391128, 394508, 397177, 399115, 400754, 401966, 403334, 406327, 411052, 415723, 419250, 422458, 426063, 429584, 433044, 437600, 443530, 449537, 454794, 459745, 464197, 466740, 466893, 465779, 463862, 459980, 453444, 445151, 435891, 425480, 414264, 403465, 393201, 382128, 369832, 357681, 346677, 336439, 327019, 319530, 314072, 309132, 304007, 299885, 297555, 296067, 294660, 294072, 294780, 295810, 296456, 297517, 299747, 302756, 306441, 311771, 318990, 326629, 333444, 339898, 346650, 353084, 358369, 362589, 365806, 367386, 367216, 366296, 365256, 363546, 360801, 357593, 354094, 349526, 343757, 337965, 332850, 327648, 321807, 316210, 311879, 308827, 307008, 306980, 308786, 311589]
57851C11589L598N284P141P715P512Q184R654J0474J0504J0745J0932R863P857
57838D21052O478N887M718K511J87j768l654n306o324p229q589r574r171q137
57824C81081p764p571o394m941m798n517n220l659k168j039N65K349L053K779
57810C40756K772L057K576J424O60J35j144k753l380l420m458o301p098o455n857
57795C10514n858n422m398m051m649m789l715k161n83J362L180L624K830K415
57781B88299K982L521L616M110N135N584N158N024N822O828P532Q290Q991Q874
57767C69766Q215Q439J0010J1763J2695J2821J2007R795O835M673L587K127p66
57754D71967m628q631j2259j4645j4986j3926j3007j2519j1494r786q320p189
$$ y = [311589, 315187, 320471, 327612, 335327, 342839, 351023, 360677, 371151, 381655, 392400, 403332, 413195, 421052, 427530, 433417, 438135, 440646, 440833, 439065, 435411, 430105, 423781, 416552, 407963, 398389, 389218, 381081, 373317, 365746, 359352, 354411, 349613, 344096, 338876, 335217, 333049, 332010, 332575, 334924, 337977, 340756, 343528, 346585, 349161, 350585, 351245, 351380, 350236, 347483, 344103, 340683, 336225, 329924, 322826, 316371, 310514, 304656, 299234, 294836, 290785, 286136, 281347, 277632, 275471, 274888, 276250, 279430, 283054, 285884, 288299, 291281, 294802, 298418, 302528, 307663, 313247, 318405, 323429, 329251, 336079, 343611, 351901, 360892, 369766, 377981, 386420, 396430, 408193, 420888, 433709, 445716, 455511, 462346, 467019, 470606, 472733, 471967, 467339, 458708, 446449, 431804, 416818, 402892, 389885, 377366, 365872, 356086, 347766, 340577]
57742C40577n499l402k195k067j690n40L42M76Q02J773K491K480K528L071L414
57727C42561L338L729M858N675N585N433N966O761P342P925Q462Q442Q203Q834
57713D33114J0223J0858J0211R627J0046J0590J0373J0114J0805J2148J3437J4890
57701E66436J7086K0004K3391K7233L1307L5231L9352M4411M9934N4239N6461
57690I65085N7286N7356N6495N5161N5046N7372O1783O7669P5214Q4264R3379
57679A686110J00922J06083J08091J05556R7479Q4237O6973M6926K5789N837j0965
57668B423038k3282k9849k9635k2784j0355O739K7179M7421O1867O5275N4149
57657B569763K6740j5508o5632j12638j47213j65956j70409j64021j50616j33698
$$ y = [340577, 335078, 331676, 329481, 327414, 325724, 325184, 325526, 326002, 326804, 328577, 331068, 333548, 336076, 339147, 342561, 345899, 349628, 354486, 360161, 365746, 371179, 377145, 383906, 391248, 399173, 407635, 416077, 424280, 433114, 443337, 454195, 464406, 474033, 484079, 494669, 505042, 515156, 525961, 538109, 551546, 566436, 583522, 603526, 626917, 654150, 685457, 720688, 760040, 804451, 854385, 908624, 965085, 1022371, 1079727, 1136222, 1191383, 1246429, 1303801, 1365584, 1433253, 1508467, 1592731, 1686110, 1787032, 1893115, 2001206, 2106762, 2204241, 2288478, 2355451, 2402377, 2428166, 2434003, 2423038, 2399756, 2369907, 2340272, 2317488, 2307133, 2313872, 2341051, 2388472, 2450339, 2515614, 2569763, 2596503, 2580995, 2515363, 2402725, 2255512, 2089556, 1919147, 1755126, 1604510, 1470812]
57647A470812j15510r7290q0556o6793n5642m5211l4849k5948j9370j3974q506
57636I07163l175J698O831J2565J7860K1959K5735L0302L5567M1228M7802N5469
57624A201004O3186P0177P7066Q4356R0949R5389R7416R7091R3409Q5157P2395
57613B127595N5961L6311J3914r894l3348n4959p3286q7006r5899j00917j02792
57602A675680j01537r7641r2398q6523p9838p2846o6934o2298n7382n1344m5385
57591H61554m0646l6600l2720k9890k8570k7289k4671k1588j9512j8063j6060
57580E65945j3827j2485j1852j0935r849r488r737r627q870p814o440m684l265
57567D47072k833k816k279j398q51m09N42J671K146J987J841J910K137K844M099
$$ y = [1470812, 1355302, 1258012, 1177456, 1110663, 1055021, 1009810, 974961, 949013, 929643, 915669, 907163, 903988, 905686, 912517, 925082, 942942, 964901, 990636, 1020938, 1056505, 1097733, 1145535, 1201004, 1264190, 1334367, 1411433, 1495789, 1586738, 1682127, 1779543, 1876634, 1970043, 2055200, 2127595, 2183556, 2219867, 2233781, 2223887, 2190539, 2135580, 2062294, 1975288, 1879389, 1778472, 1675680, 1574143, 1476502, 1384104, 1297581, 1217743, 1144897, 1077963, 1015665, 958283, 906939, 861554, 820908, 784308, 751588, 721698, 693128, 665839, 641168, 619580, 600068, 582005, 565945, 552118, 539633, 527781, 516846, 506997, 497509, 487772, 478145, 469275, 461461, 455021, 450337, 447072, 444239, 441423, 439144, 437746, 436895, 436486, 437028, 438699, 440845, 442832, 444673, 446583, 448720, 451564, 455663]
57552D55663N060N097N008N950P696R094R735J0189J1015J2486J4755J7420J9571
57539E88739K1024K2846K5801K9168L2001L4618L7845M1729M6056N1158N7072
57528I88057O2786O7501P1685P5729P8562P8915P6959P3242O6862N6286M1357
57517A737941K3295L500j6422l4348m8930o0582o9962p6368p8931p8421p6212
57506A224560p2437o6750o0176n4323m9351m4407l9557l5562l2237k8691k4833
57495G16236k1172j7551j3630j0145q113p136n998m470l133j904k95J377K583
57482F26649L866O004Q532J0678J3079J6686K0706K3583K5617K8534L2771L7212
57470H53917M1396M5982N1124N6278O1547O7345P2769P6157P7075P5935P1871
$$ y = [455663, 460723, 465820, 470828, 476778, 484474, 493568, 503303, 513492, 524507, 536993, 551748, 569168, 588739, 609763, 632609, 658410, 687578, 719579, 754197, 792042, 833771, 879827, 930985, 988057, 1050843, 1118344, 1190029, 1265758, 1344320, 1423235, 1500194, 1573436, 1640298, 1696584, 1737941, 1761236, 1764736, 1748314, 1713966, 1665036, 1604454, 1534492, 1458124, 1379193, 1300772, 1224560, 1152123, 1085373, 1025197, 970874, 921523, 877116, 837559, 801997, 769760, 741069, 716236, 695064, 677513, 663883, 653738, 645625, 638489, 632491, 628021, 624888, 622984, 622689, 624066, 626649, 630515, 636519, 645051, 655729, 668808, 685494, 706200, 729783, 755400, 783934, 816705, 853917, 895313, 941295, 992419, 1048697, 1110244, 1177589, 1250358, 1326515, 1403590, 1479525, 1551396]
57459A551396O3214N0097L4424J7170k021k2264m0763n5497o6720p5149q0502
57448A373385q2539q1908p9191p4502o8537o2631n7301n2036m6778m2116l7885
57437F87961l3276k8616k5259k3289k1212j8477j6287j5232j4032j1729r336q097
57425D63119p607o929o235o106o173n761m991m303l605k728j990j564j034k14
57411D03879M08N78P83J322J733J707J722K174K691K841K856L128L668M340M985
57396D38815N143M460L472L137L546M021M417N073N622N233M207L779M090L977
57382D98992L078K528K966L461L226K860L057L437L479L323K924J796M16L04J756
57367E37603K904K278Q87M33P35N31j41q4J062K440L243L259K487J346R18J953
$$ y = [1551396, 1614610, 1664707, 1699131, 1716301, 1714280, 1692016, 1651253, 1595756, 1529036, 1453887, 1373385, 1290846, 1208938, 1129747, 1055245, 986708, 924077, 866776, 814740, 767962, 725846, 687961, 654685, 626069, 600810, 577521, 556309, 537832, 521545, 506313, 492281, 480552, 471216, 463119, 455512, 448583, 442348, 436242, 430069, 424308, 419317, 415014, 411409, 408681, 406691, 405127, 404093, 403879, 404287, 404865, 405648, 406970, 408703, 410410, 412132, 414306, 416997, 419838, 422694, 425822, 429490, 433830, 438815, 443958, 448418, 451890, 455027, 458573, 462594, 467011, 472084, 477706, 482939, 487146, 490925, 495015, 498992, 502070, 504598, 507564, 511025, 514251, 517111, 520168, 523605, 527084, 530407, 533331, 535127, 535543, 535847, 537603, 540507, 542785, 543672, 544105, 544840, 545371, 545230, 545146, 546208, 548648, 551891, 555150, 557637, 558983, 559901, 561854]
57351E61854L756M870M727L989L553L823M688N616N979N679N266N273N826O890
57337F31789Q259R199Q996Q123P904Q729R451R096Q162P691P886Q270Q517Q522
57323G50594Q257P986Q076Q366Q375Q213Q515R365J0234J1059J2127J2852J2159
57310H76178J0501R860J1092J2691J3078J2682J2735J3277J3593J3702J4156J4992
57298A028537J5790J6279J6257J5615J4948J5269J6619J7798J8006J7720J7574
57287A210412J7497J7557J8305J9645K0604K0941K1587K2733K3009K1635J9911
57276A433836J9277J9147J7955J5274J1666P602L717J109rr55k707m342m603l830
57262A513137l048k225q97M91J394K378M066N785O729P570R307J1423J2767J3500
$$ y = [561854, 565610, 570480, 575207, 579196, 582749, 586572, 591260, 596876, 602855, 608534, 613800, 619073, 624899, 631789, 640048, 649247, 658243, 666366, 674270, 682999, 692450, 701546, 709708, 717399, 725285, 733555, 742072, 750594, 758851, 766837, 774913, 783279, 791654, 799867, 808382, 817747, 827981, 839040, 851167, 864019, 876178, 886679, 896539, 907631, 920322, 933400, 946082, 958817, 972094, 985687, 999389, 1013545, 1028537, 1044327, 1060606, 1076863, 1092478, 1107426, 1122695, 1139314, 1157112, 1175118, 1192838, 1210412, 1227909, 1245466, 1263771, 1283416, 1304020, 1324961, 1346548, 1369281, 1392290, 1413925, 1433836, 1453113, 1472260, 1490215, 1505489, 1517155, 1524757, 1528474, 1529583, 1529574, 1528619, 1525912, 1521570, 1516967, 1513137, 1510089, 1507864, 1506967, 1507458, 1508852, 1511230, 1515296, 1521081, 1527810, 1535380, 1544687, 1556110, 1568877, 1582377]
57248A582377J4408J5095J4674J3731J3790J5137J6806J8272J9640K0544K0531
57237A765005K0251K0771K1914K2734K3228K4050K4907K4947K4467K4629K5528
57226B022431K6105K6019K6112K6849K7625K7882K7853K8017K8679K9988L1658
57215B329218L2926L3548L4253L5484L6449L6480L6353L6982L7752L7694L7415
57204B724554L7951L8490L7314L4715L2830L2614L2906L2588L1822L0987L0117
57193C096888K9765L0778L2814L4442L5012L5204L5610L6044L6396L6884L7308
57182C477145L7277L7255L8129L9698M0860M1301M1670M2051M1734M0749M0269
57171C918138M1020M2395M3442M3816M3566M2864M2051M1309M0285L8678L6784
$$ y = [1582377, 1596785, 1611880, 1626554, 1640285, 1654075, 1669212, 1686018, 1704290, 1723930, 1744474, 1765005, 1785256, 1806027, 1827941, 1850675, 1873903, 1897953, 1922860, 1947807, 1972274, 1996903, 2022431, 2048536, 2074555, 2100667, 2127516, 2155141, 2183023, 2210876, 2238893, 2267572, 2297560, 2329218, 2362144, 2395692, 2429945, 2465429, 2501878, 2538358, 2574711, 2611693, 2649445, 2687139, 2724554, 2762505, 2800995, 2838309, 2873024, 2905854, 2938468, 2971374, 3003962, 3035784, 3066771, 3096888, 3126653, 3157431, 3190245, 3224687, 3259699, 3294903, 3330513, 3366557, 3402953, 3439837, 3477145, 3514422, 3551677, 3589806, 3629504, 3670364, 3711665, 3753335, 3795386, 3837120, 3877869, 3918138, 3959158, 4001553, 4044995, 4088811, 4132377, 4175241, 4217292, 4258601, 4298886, 4337564, 4374348]
57160D374348L4814L2330K9262K6660K5332K4510K3142K1565K0378J8763J5730
57149D646834J2255J0043Q898P372N509M634M768M495L387K423K121K212K986
57136D717937M870O907P816Q268R937J2511J4079J4244J4315J4388J2962R711
57124D847945O200L466J237l11l30J004K927O187J2381K1347L1639M3120N6206
57111E033018O9137P9437Q7942R7997J11049J26899J47985J78949K21562K74418
57101F428393L38009M15796N10220O22881P59180R27307J131639J372365J651311
57092A4157101J970552K323719K695945L073897L447800L802451M116837M374599
57084C9962901M562237M656314M637124M530434M409802M318721M188954L866902
$$ y = [4374348, 4409162, 4441492, 4470754, 4497414, 4522746, 4547256, 4570398, 4591963, 4612341, 4631104, 4646834, 4659089, 4669132, 4678030, 4685402, 4690911, 4695545, 4700313, 4704808, 4708195, 4710618, 4712739, 4714951, 4717937, 4722807, 4729714, 4737530, 4745798, 4755735, 4768246, 4782325, 4796569, 4810884, 4825272, 4838234, 4847945, 4854145, 4857611, 4858848, 4858537, 4858207, 4859211, 4862138, 4868325, 4880706, 4902053, 4933692, 4976812, 5033018, 5102155, 5181592, 5269534, 5367531, 5478580, 5605479, 5753464, 5932413, 6153975, 6428393, 6766402, 7182198, 7692418, 8315299, 9074479, 10001786, 11133425, 12505790, 14157101, 16127653, 18451372, 21147317, 24221214, 27669014, 31471465, 35588302, 39962901, 44525138, 49181452, 53818576, 58349010, 62758812, 67077533, 71266487, 75133389]
57076G5133389L236356K305947J180224k4240j219577k335741l312323m110442
57068G0853593m716266n126786n341437n369585n235946m973577m616331m198873
57060C1274792l755803l315181k894889k506373k158051j853578j590856j365589
57052A1834472j174234j012967q76927p62228o66759n87991n22150m66503m20439
57043E344274l83197l52323l25351l01357k79895k59887k40514k21810k03668
57034B776272j85514j67614j51337j37272j24447j12141j01173r2381q5015p7782
57024A541596p0616o4304n9048n4417n0257m6645m3239l9571l5797l2521k9988
57013A015193k7925k6054k4278k2548k0902j9479j8280j7119j6052j5409j5144
$$ y = [75133389, 78369745, 80675692, 81855916, 81831676, 80612099, 78276358, 74964035, 70853593, 66137327, 61010541, 55669104, 50299519, 45063573, 40089996, 35473665, 31274792, 27518989, 24203808, 21308919, 18802546, 16644495, 14790917, 13200061, 11834472, 10660238, 9647271, 8770344, 8008116, 7341357, 6753366, 6231216, 5764713, 5344274, 4961077, 4608754, 4283403, 3982046, 3702151, 3442264, 3201750, 2979940, 2776272, 2590758, 2423144, 2271807, 2134535, 2010088, 1897947, 1796774, 1704393, 1619378, 1541596, 1470980, 1406676, 1347628, 1293211, 1242954, 1196309, 1153070, 1113499, 1077702, 1045181, 1015193, 987268, 961214, 936936, 914388, 893486, 874007, 855727, 838608, 822556, 807147, 792003]
57002G92003j4578j3259j1699j0690j0209r586q597p684p065o317n029l358j692
56989F82240m2J908M432P566J1132J4786J8171K1019K2841K2662J9598J3999P709
56976H48021K891Q44J911N917J2227J9889K8276L7483M7923O0067P4848R3568
56964A233865J16936J44903J78139K18717K68490L28101L98881M83653N81443
56955C953128O79991P55104P78179P24606N79804L47199N6747k38074m81227o39138
56945F516319p09429p10367o65695n96537n18968m42688l71564l06881k49916
56936A944274k01239j59632j23289r1506o4436m2237k5463j5486j3419j8864l0082
56925A158621m4647n9388p0724p6358p6450p2688o6635n9392n2089m5639m0159
$$ y = [792003, 777425, 764166, 752467, 741777, 731568, 721982, 713385, 705701, 698636, 692319, 687290, 683932, 682240, 682198, 684106, 688538, 696104, 707236, 722022, 740193, 761212, 784053, 806715, 826313, 840312, 848021, 850912, 851756, 853667, 859584, 871811, 891700, 919976, 957459, 1005382, 1065449, 1140297, 1233865, 1350801, 1495704, 1673843, 1892560, 2161050, 2489151, 2888032, 3371685, 3953128, 4633119, 5388223, 6166402, 6891008, 7470812, 7818011, 7874758, 7636684, 7155457, 6516319, 5806890, 5096523, 4430828, 3834291, 3315323, 2872635, 2501071, 2194190, 1944274, 1743035, 1583403, 1460114, 1368608, 1304172, 1261935, 1236472, 1220986, 1207567, 1188703, 1158621, 1113974, 1054586, 983862, 907504, 831054, 758366, 691731, 632339, 580250, 534611, 494452]
56914D94452l5243l0692k6546k2821j9681j7528j6385j5461j3817j1328q607o197
56902B70146m238k698j488l91Q62K404M222O198Q182J0259J2856J6319K0390K4505
56888C67528K8485L2441L5940L7910L7406L3906K6933J6426L850p898j6466k1583
56876E74878k4296k5278k4425k1684j7508j2623p662k892J940P284J3117J9023
56864D79874K5127L2382M1447N1659O1374O8834P2098O8741N6796L6501J0956
56853A005789j5047l6940n1843n9059n9605n5188m7454l7903k7893j8324r322
56842E87211m91Q608J8281K8769M0361N3480O8494Q5062J01343J14071J19469
56831A224658J14076R5435O3422K1765k2293o0946q9096j05214j10125j05866
$$ y = [494452, 459209, 428517, 401971, 379150, 359469, 341941, 325556, 310095, 296278, 284950, 276343, 270146, 265908, 263210, 261722, 261331, 262193, 264597, 268819, 275017, 283199, 293458, 306314, 322633, 343023, 367528, 396013, 428454, 464394, 502304, 539710, 573616, 600549, 616975, 620825, 612927, 596461, 574878, 550582, 525304, 500879, 479195, 461687, 449064, 441402, 438510, 440450, 447734, 460851, 479874, 505001, 537383, 578830, 630489, 691863, 760697, 832795, 901536, 958332, 994833, 1005789, 990742, 953802, 901959, 842900, 783295, 728107, 680653, 642750, 614857, 596533, 587211, 586720, 595328, 613609, 642378, 682739, 736219, 804713, 889775, 991118, 1105189, 1224658, 1338734, 1434169, 1497591, 1519356, 1497063, 1436117, 1347021, 1241807, 1131682, 1025816]
56821A025816r5452q2312o8922n5944m3056l0379j8699q312J656J2384K4186L6682
56809F97648M9732O3214P5615Q3547Q3264P2460N0822K0196j4803m7310p1136
56798A063249q3960q7426q4578p7865o9150n9900n0653m0993l0730k0756j2266
56787D44972n464O41P303J5071K3425L1168L7166M0651M0741L6176K6090J1114
56775G09054o527k3830l7902m6791n0346n0151m8025m4690m0205l5076l0091k5462
56763B69958k1077j7249j4300j1719q855o245n025n117n220m671m054l801l516
56750A59109l025k846l115l146k651k321k630k994k734k059j453r24m36l09o08
56735A27858q49q09r89j694k330k182j327l97R1r5p51j114o26O9j64j196j705
$$ y = [1025816, 930364, 848052, 779130, 723186, 680130, 649751, 631052, 622740, 624396, 636780, 660966, 697648, 747380, 810594, 886209, 969756, 1053020, 1125480, 1176302, 1196498, 1181695, 1134385, 1063249, 979289, 891863, 807285, 729420, 660270, 600370, 549717, 508724, 477994, 457238, 444972, 439508, 440149, 447452, 462523, 485948, 517116, 554282, 594933, 635674, 671850, 697940, 709054, 702527, 678697, 640795, 594004, 543658, 493507, 445482, 400792, 360587, 325511, 295420, 269958, 248881, 231632, 217332, 205613, 196758, 190513, 185488, 180371, 175151, 170480, 166426, 162625, 159109, 156084, 153238, 150123, 146977, 144326, 142005, 139375, 136381, 133647, 131588, 130135, 129211, 128775, 128466, 127858, 127009, 126200, 125211, 123517, 121187, 119005, 117678, 117281, 117372, 117277, 116526, 115412, 114786, 114855, 114691, 113495, 111790]
56718A11790j235p59p56l11J097K262J880M30o92r55o15J72J109J414Q94N61J097
56701A17383J592J008M6P5Q83J100M88J79P16J319J318J030R01P69M42K26M97
56684A29972J139J689J728J161L24k61m15l20%P09J487J606J015O07Q70J121O47
56667A43079j80p10j080j642k059j922j618j632j607j080m76l48k73M06J258J376
56651A31492Q29L85J79k32q38j319j862k694l243k876k069j656j399o77k8m46
56635A13546j420j397j49R51J207J398J980K206J652J116J168J090J36j134j676
56620A20674j302m52O22J658K053J539Q36Q46J513K015J870J319Q75R15J533K441
56604A38955L029K787J713K76r13j490j511j306j065p26k89O5K75M66M83q4j087
$$ y = [111790, 110555, 109796, 109040, 108729, 109826, 112088, 113968, 114398, 113706, 112751, 112136, 112308, 113417, 114831, 115725, 116286, 117383, 118975, 119983, 120029, 120104, 120987, 122087, 122575, 122754, 123470, 124789, 126107, 127137, 128038, 128807, 129249, 129475, 129972, 131111, 132800, 134528, 135689, 136013, 135752, 135337, 135017, 135017, 135726, 137213, 138819, 139834, 140441, 141311, 142432, 143079, 142899, 142189, 141109, 139467, 137408, 135486, 133868, 132236, 130629, 129549, 129073, 128725, 128452, 128858, 130116, 131492, 132321, 132706, 132885, 132653, 131815, 130496, 128634, 125940, 122697, 119821, 117752, 116096, 114697, 114020, 113992, 113546, 112126, 110729, 110580, 111531, 112738, 114136, 116116, 118322, 119974, 121090, 122258, 123348, 123484, 122350, 120674, 119372, 118920, 119542, 121200, 123253, 124792, 125628, 126474, 127987, 130002, 131872, 133191, 134066, 134981, 136514, 138955, 141984, 144771, 146484, 146760, 145847, 144357, 142846, 141540, 140475, 139749, 139460, 139525, 139800, 140266, 140749, 140665, 139578]
56587A39578j663j335o88l57J0R72K132K667K630K660K773K510K043K000K230
56572A58162J933J138R29J920L352M098L902L355L206L819M922N743N809N478
56558B07766N338N387N402N665O588P845Q738R193R639J0131J0464J0851J1562
56545C14569J2052J1527J0253R301R043Q870Q350P563O325M270J868K41l32p31
56531D03169j625k701l559m339n149n742o129o723p526q006q062q299r013r722
56517C16574j0065j0391j0959j1272j0730r494q270p598p557p797p668o774n479
56504B02520m538m264m441m867n350n375m508l130k064j558j248r83q94p77k84
56489A58239K93L33n8j27L02O42N98N78Q46J158J347J530J602J244N78J79L10
$$ y = [139578, 137915, 136580, 135892, 135535, 135545, 136517, 138649, 141316, 143946, 146606, 149379, 151889, 153932, 155932, 158162, 160095, 161233, 162162, 164082, 167434, 171532, 175434, 178789, 181995, 185814, 190736, 196479, 202288, 207766, 213104, 218491, 223893, 229558, 236146, 243991, 252729, 261922, 271561, 281692, 292156, 303007, 314569, 326621, 338148, 348401, 357702, 366745, 375615, 383965, 391528, 397853, 402123, 403991, 404232, 403900, 403169, 401544, 398843, 395284, 390945, 385796, 380054, 373925, 367202, 359676, 351670, 343608, 335309, 326296, 316574, 306509, 296118, 285159, 273887, 263157, 253663, 245393, 237795, 230238, 222441, 214773, 207999, 202520, 197982, 193718, 189277, 184410, 179060, 173685, 169177, 166047, 163983, 162425, 161177, 160194, 159300, 158523, 158239, 158532, 158865, 158807, 158680, 158982, 159624, 160222, 160800, 161646, 162804, 164151, 165681, 167283, 168527, 169105, 169284, 169594]
56472A69594P70J433K260K906K986K672K280J679P68K21O86J687K343K795L648
56457A98728M374L819K236J239J649K712L559M063M074L299K219J845K287K719
56443B38822K910L393M068M174L831M062M939N352N028N025N692N873M942M006
56429C02117M090M628M729M585M532M018K587Q69m35j513k510k792k178j811k666
56414C18250m171n310o123p011p520p096o351o263o673o670o075n429m962m486
56400B34110m063l886l668k868j486j46M78J17q77j654j614j105q26o85r9O90
56384B12418P85K33J24Q09J362J276J300J836J944Q31q09j926k517k908k682j502
56368B10574j71K92J05K50R74J633J664J047J22n61n99j99J70O56J708K926L250
$$ y = [169594, 170364, 171797, 174057, 176963, 179949, 182621, 184901, 186580, 187348, 187569, 188255, 189942, 192285, 195080, 198728, 203102, 206921, 209157, 210396, 212045, 214757, 218316, 222379, 226453, 229752, 231971, 233816, 236103, 238822, 241732, 245125, 249193, 253367, 257198, 261260, 266199, 271551, 276579, 281604, 287296, 293169, 298111, 302117, 306207, 310835, 315564, 320149, 324681, 328699, 331286, 332155, 331720, 330207, 327697, 324905, 322727, 320916, 318250, 314079, 308769, 302646, 295635, 288115, 281019, 274668, 268405, 261732, 255062, 248987, 243558, 238596, 234110, 230047, 226161, 222493, 219625, 218139, 217993, 218471, 218588, 217711, 216057, 214443, 213338, 212512, 211827, 211728, 212418, 213203, 213436, 213560, 214369, 215731, 217007, 218307, 220143, 222087, 222918, 222109, 220183, 217666, 214758, 212076, 210574, 210403, 210695, 210800, 211050, 212024, 213657, 215321, 216368, 216490, 215929, 215330, 215131, 215301, 215957, 217665, 220591, 223841]
56351B23841K549J867J766J706J454J700K604L128K612J833J616J651J535J762
56337B51624K660L401L211K598K430K637K775K982L425L631L428L676N073O872
56323C00423P740P396O574N960N826O166O631O770O662O687O628N961N059M876
56309C89359N228M858L523K431K159J855J174J189K398L511L344K482J926J533
56295D26970R14N22O20M48m91j501k058k708l595l547j900J00R75R43J009J359
56279D18060J749K321K964L095K933L616N248O428O598P011Q343R377R385R766
56265D96894J1678J4021J5553J7128J9849K2751K4466K5749K8184L1678L5194
56254G43145L8791M2968M7145N0582N3705N6926N9506O1091O2783O4852O5138
$$ y = [223841, 226390, 228257, 230023, 231729, 233183, 234883, 237487, 240615, 243227, 245060, 246676, 248327, 249862, 251624, 254284, 257685, 260896, 263494, 265924, 268561, 271336, 274318, 277743, 281374, 284802, 288478, 293551, 300423, 308163, 315559, 322133, 328093, 333919, 340085, 346716, 353486, 360148, 366835, 373463, 379424, 384483, 389359, 394587, 399445, 402968, 405399, 407558, 409413, 410587, 411776, 414174, 417685, 421029, 423511, 425437, 426970, 427884, 428406, 429026, 429474, 428983, 427482, 425424, 422716, 419121, 415574, 413674, 413774, 414749, 415692, 416701, 418060, 419809, 422130, 425094, 428189, 431122, 434738, 439986, 446414, 453012, 460023, 468366, 477743, 487128, 496894, 508572, 522593, 538146, 555274, 575123, 597874, 622340, 648089, 676273, 707951, 743145, 781936, 824904, 872049, 922631, 976336, 1033262, 1092768, 1153859, 1216642, 1281494, 1346632]
56243A346632O1799N6032N0002M3661L5983K7665K0066J2780M774l146r467j4434
56231A632347j8957k2272k3133k2308k1403k0246j7891j5149j3529j2639j1237
56220A433583r980j0467j2343j4015j5536j8168k1692k4701k7120k9961l3068
56209A216532l5338l6702l7712l7965l6973l5746l5261l4411l1855k8791k7260
56198H38518k6642k4699k1268j8141j5955j3930j2094j1038j0048q079n999n316
56186F65309n434m708l414k861k582j283K41K67n39l5J710K811L021L711M767
56171F60981M755L846L578L915L479K372J835J618N58p29p92l70j341l171l673
56156F76861k743k154k084j271q2lm58L90K110K722K491L418N335O269O362P692
$$ y = [1346632, 1408431, 1464463, 1514465, 1558126, 1594109, 1621774, 1641840, 1654620, 1659394, 1656248, 1646781, 1632347, 1613390, 1591118, 1567985, 1545677, 1524274, 1504028, 1486137, 1470988, 1457459, 1444820, 1433583, 1423603, 1413136, 1400793, 1386778, 1371242, 1353074, 1331382, 1306681, 1279561, 1249600, 1216532, 1181194, 1144492, 1106780, 1068815, 1031842, 996096, 960835, 926424, 894569, 865778, 838518, 811876, 787177, 765909, 747768, 731813, 717883, 705789, 694751, 684703, 676624, 670625, 665309, 659875, 655167, 651753, 648892, 646310, 645027, 645268, 645535, 644996, 644961, 646671, 649482, 652503, 656214, 660981, 665736, 669582, 673160, 677075, 680554, 682926, 684761, 686379, 686937, 686208, 685416, 685046, 683705, 680534, 676861, 674118, 671964, 669880, 668609, 668527, 668524, 668066, 668456, 670566, 673288, 675779, 679197, 684532, 690801, 697163, 704855]
56140G04855J0409J2741J4590J7268J9953K0457J9365J9469K1174K2516K3655
56129I06452K6932L2416L7709M2479M8882N7168O5350P3687Q5125J00513J17587
56118A594300J35324J55011J76203J95676K11055K21465K24351K16426J98757
56109C328568J76778J54506J32870J13782J00460R2313Q4264P2612N7548L9307
56099D353008J7092o792k6881m0863n2118o4599p9392r7372j20314j47243j73629
56088C560897j95755k12286k21017k19072k07617j91705j74096j53738j31300
56079A854311j10786r4080p9049o4761n3486m5687l8308l0101k3653k0030j6439
56068A277931j1368p144n159l373o39J220J632K774N081O165N804O828R550J0767
$$ y = [704855, 715264, 728005, 742595, 759863, 779816, 800273, 819638, 839107, 860281, 882797, 906452, 933384, 965800, 1003509, 1045988, 1094870, 1152038, 1217388, 1291075, 1376200, 1476713, 1594300, 1729624, 1884635, 2060838, 2256514, 2467569, 2689034, 2913385, 3129811, 3328568, 3505346, 3659852, 3792722, 3906504, 4006964, 4099277, 4183541, 4256153, 4313701, 4353008, 4370100, 4363308, 4336427, 4295564, 4243446, 4178847, 4099455, 4002083, 3881769, 3734526, 3560897, 3365142, 3152856, 2931839, 2712767, 2505150, 2313445, 2139349, 1985611, 1854311, 1743525, 1649445, 1570396, 1505635, 1452149, 1406462, 1368154, 1338053, 1314400, 1294370, 1277931, 1266563, 1259419, 1254260, 1250887, 1250248, 1251468, 1253100, 1255874, 1260955, 1267120, 1272924, 1279752, 1289302, 1300069]
56054A300069R899J0277J2642J3529J2003J1706J3983J5507J5036J5888J9162
56043A449701K1256K0900K1813K5352K7473K6290K5706K8104L0314L0378L1287
56032A738574L4330L5850L4503L4540L7918M0410L9680L9863M3725M7678M8996
56021B176067N0612N4296N6606N6134N7175O1643O5239O6018O8468P4424P8767
56010B865449P9134Q0766Q6460R1099R1853R4001J00595J06296J08025J11504
56000C815182J20328J28958J33697J39934J50996J60964J66530J74579J89436
55991E180604K04332K14502K26605K45607K64847K79337K96059L20332L45108
55982G577333L65259L88792M21996M57553M90082N28603N80232O37067O93422
$$ y = [1300069, 1309968, 1320245, 1332887, 1346416, 1358419, 1370125, 1384108, 1399615, 1414651, 1430539, 1449701, 1470957, 1491857, 1513670, 1539022, 1566495, 1592785, 1618491, 1646595, 1676909, 1707287, 1738574, 1772904, 1808754, 1843257, 1877797, 1915715, 1956125, 1995805, 2035668, 2079393, 2127071, 2176067, 2226679, 2280975, 2337581, 2393715, 2450890, 2512533, 2577772, 2643790, 2712258, 2786682, 2865449, 2944583, 3025349, 3111809, 3202908, 3294761, 3388762, 3489357, 3595653, 3703678, 3815182, 3935510, 4064468, 4198165, 4338099, 4489095, 4650059, 4816589, 4991168, 5180604, 5384936, 5599438, 5826043, 6071650, 6336497, 6615834, 6911893, 7232225, 7577333, 7942592, 8331384, 8753380, 9210933, 9701015, 10229618, 10809850, 11446917, 12140339]
55973A2140339P59731Q44270R38739J038356J157663J308761J484240J681131
55965B1353230J919879K217640K565722K957109L411126L945646M555693N252817
55957D8178862O096025P149835Q449282J0049229J2063836J4600186J7700950
55950A24288205K1420707K5872871L1013167L6299491M0613622M2522076M0611602
55943C62641741L3829106K2024431O535190r876322k4082732l3962774l9023062
55936C18085578m0010030l8152928l4654260l0475131k6241893k2262400j8665051
55929A07623885j5524913j2872750j0670452q850253p364281o171056n208287
55922D0961893m416015l766108l242285k812372k445090k133805j879360j666308
$$ y = [12140339, 12900070, 13744340, 14683079, 15721435, 16879098, 18187859, 19672099, 21353230, 23273109, 25490749, 28056471, 31013580, 34424706, 38370352, 42926045, 48178862, 54274887, 61424722, 69874004, 79923233, 91987069, 106587255, 124288205, 145708912, 171581783, 202594950, 238894441, 279508063, 322030139, 362641741, 396470847, 418495278, 425030468, 415154146, 391071414, 357108640, 318085578, 278075548, 239922620, 205268360, 174793229, 148551336, 126288936, 107623885, 92098972, 79226222, 68555770, 59705517, 52341236, 46170180, 40961893, 36545878, 32779770, 29537485, 26725113, 24280023, 22146218, 20266858, 18600550]
55914A8600550j477157j313033j179336j065723r59306q63635p86329p20686o56473
55905I578872n96847n48335n05392m60334m17913l85377l58019l28489l00662
55896E677504k80788k64179k43879k23789k10411j99870j85450j70223j60144
55887C738771j52128j40565j28647j21858j16902j08087r8296r3062q9773q3124
55877B606329p5423p1363o8237o1230n3081m8810m5975l9534l1358k5749k0349
55866B065220j0755N09Q606J5548K5843L7132M3768M5830M6160M2336L0275J2438
55854B362910n623k3593m3409o1581p2770p8187q2619q5840q4500p9799p5507
55843A669482p0810o2612n2824m6164m2603l8779l4907l3581l3736l2381l0538
$$ y = [18600550, 17123393, 15810360, 14631024, 13565301, 12605995, 11742360, 10956031, 10235345, 9578872, 8982025, 8433690, 7928298, 7467964, 7050051, 6664674, 6306655, 5978166, 5677504, 5396716, 5132537, 4888658, 4664869, 4454458, 4254588, 4069138, 3898915, 3738771, 3586643, 3446078, 3317431, 3195573, 3078671, 2970584, 2872288, 2779226, 2689453, 2606329, 2530906, 2459543, 2391306, 2330076, 2276995, 2228185, 2182210, 2142676, 2111318, 2085569, 2065220, 2054465, 2054974, 2063580, 2079128, 2104971, 2142103, 2185871, 2231701, 2277861, 2320197, 2350472, 2362910, 2357287, 2333694, 2290285, 2228704, 2155934, 2077747, 1995128, 1909288, 1824788, 1744989, 1669482, 1598672, 1536060, 1483236, 1437072, 1394469, 1355690, 1320783, 1287202, 1253466, 1221085, 1190547]
55832A190547l1105l2708l1833k9211k7932k7158k3879j9188j6625j5892j4041
55821I20975j1309r933q832n247j67L504O668J2321J9639K5323K9169L2705L3795
55808A048611K8500J7319M346q537k1327l1425l5483l4868l3804l2814k9403k4274
55796H46841k1246k1195k1349k0404j9489j8290j5109j0768p990p012n824m276
55784F73889l851m020l033j705k231l877m028k693j860j145J432N063O891O686
55770F65518O491O093L202k162p494j1729j5510j8145j8293j7179j7147j7573
55758E56072j6140j3517j2679j4117j5717j6838j8410j9600j8661j6590j5810
55747C77993j5665j3480r647p108o166m365j492n7n57p27L3k27j916l028k976
$$ y = [1190547, 1159442, 1126734, 1094901, 1065690, 1037758, 1010600, 986721, 967533, 950908, 935016, 920975, 909666, 899733, 890901, 885654, 885487, 888991, 895659, 907980, 927619, 952942, 982111, 1014816, 1048611, 1077111, 1094430, 1098776, 1090239, 1068912, 1037487, 1002004, 967136, 933332, 900518, 871115, 846841, 825595, 804400, 783051, 762647, 743158, 724868, 709759, 698991, 691001, 683989, 678165, 673889, 670038, 666018, 662985, 661280, 659049, 655172, 651144, 648451, 646591, 645446, 646878, 651941, 658832, 665518, 672009, 678102, 681304, 679142, 671648, 659919, 644409, 626264, 607971, 590792, 573645, 556072, 539932, 526415, 513736, 499619, 483902, 467064, 448654, 429054, 410393, 393803, 377993, 362328, 348848, 339201, 332093, 325927, 321562, 320070, 320013, 319456, 318729, 318762, 318535, 316619, 313591, 310615]
55732C10615l341m242l814k003j110j920k787l181m503o782q080p822p403p083
55718B46544n696l811l550m714m703k880j492j545j413l62J30l82q8J873L981
55703B21892N117N936O654O306M988M140L997L419K606K993M131L834J899M34
55689B78346Nj152l425m870m829n138o595p529p091o754p233o973n219l707l761
55674B04075m325m302m352n019n460n323n557o222n820l929k173j511r05L59J316
55659A50852J341J247J428J174O12R49K005K040Q85N00J489J854L86j426k276
55644A63060l067m504n247m250k738k077j761j116r93k036l129l144k653k466
55630A23879k170j449j178j760k046j254l90m68q05l86M63R65J178J333J170P48
$$ y = [310615, 307274, 303032, 299218, 297215, 296105, 294185, 291398, 288217, 283714, 276932, 268852, 261030, 253627, 246544, 240848, 237037, 233487, 228773, 224070, 221190, 219698, 218153, 216740, 216378, 216508, 216126, 216038, 217911, 221892, 227009, 232945, 239599, 245905, 250893, 255033, 259030, 262449, 265055, 268048, 272179, 276013, 277912, 278346, 278351, 277199, 273774, 268904, 264075, 258937, 252342, 244813, 237722, 230968, 223735, 216762, 211543, 207836, 204075, 199750, 195448, 191096, 186077, 180617, 175294, 169737, 163515, 157695, 153766, 151593, 150082, 149177, 149536, 150852, 152193, 153440, 154868, 156042, 156654, 157603, 159608, 161648, 162533, 163033, 164522, 166376, 166762, 165336, 163060, 159993, 155489, 150242, 145992, 143254, 141177, 139416, 138300, 137307, 135271, 132142, 128998, 126345, 123879, 121709, 120260, 119082, 117322, 115276, 114022, 113632, 113164, 112359, 111973, 112436, 113401, 114579, 115912, 117082, 117830]
55614A17830P17J051Q89J79p0L80N55J41JK68j23j376k243k208k228k679k520
55597A08564j430o34q02r82n38j64j87J64R79J153M93K71Q58J062O15J010K760
55580A13192M156M018L475L754M337M703N733P887R973J1141J2293J4193J6148
55567B15003J7854K0550K4858K9424L3035L6169L8992L9951L7901L3732K8295
55556E55764K0761J0705p9r674j8163k5967l1976l5203l6573l7114l6072l2845
55544C23564k9098k6774k5268k2711j8974j5419j2720j0751r732r672r531q418
55532A24496o831n511m194k699j930k365k900k574k068k120j986j012j89m83j055
55517H6579q84p51j702k908k988k323k156k452k475k396k586k379j284l92p62
$$ y = [117830, 118547, 119598, 120487, 120666, 120596, 120976, 121531, 121672, 121673, 121941, 121818, 120442, 118199, 115991, 113763, 111084, 108564, 107134, 106500, 105698, 104716, 104178, 104014, 103827, 103991, 104970, 106123, 106616, 106887, 107745, 108807, 109422, 110432, 113192, 117348, 121366, 124841, 128595, 132932, 137635, 143368, 151255, 161228, 172369, 184662, 198855, 215003, 232857, 253407, 278265, 307689, 340724, 376893, 415885, 455836, 493737, 527469, 555764, 576525, 587230, 587151, 577477, 559314, 533347, 501371, 466168, 429595, 392481, 356409, 323564, 294466, 267692, 242424, 219713, 200739, 185320, 172600, 161849, 152117, 142445, 132914, 124496, 117665, 112154, 107960, 105261, 103331, 100966, 98066, 95492, 93424, 91304, 89318, 88306, 88117, 87634, 86579, 85695, 84944, 83242, 80334, 77346, 75023, 72867, 70415, 67940, 65544, 62958, 60579, 59295, 58903, 58141]
55502E8141j569j504r60r87j271r87n71p36q10l3N90j56j357j300k30M18O32J350
55484D8660K124J694M67L9N34O17M3j7P78J379J202Q10N96L38Q7J06mp63j594
55465E7096j538q35m11k36K29M05p56k608l178j799P8R32O02l61j435j991j654
55448D2540r47p15r09q59m86k72k17N4L80K68j59l53k58j81r5J11J58M4M44J512
55428D0060K011R55o09q40K96J211J038M47K36M53Q65J257J325J129J316K103
55412E3253K552J820N52l2J98O00J091J900K582K593K373K676L298L609L755M136
55396H6956M224L274J656K70q29j999k910l204l544m490n066m069k214j249j456
55381F5350j686j487j456j711j748j673j974k279j859j186j351k146k359j823
$$ y = [58141, 56572, 55068, 54108, 53121, 51850, 50863, 50292, 49556, 48746, 48713, 49303, 49147, 47790, 46490, 46260, 46678, 47310, 48660, 50784, 52478, 52945, 52984, 53518, 54135, 54178, 54161, 54939, 56318, 57520, 58330, 58926, 59264, 59351, 59457, 59453, 58690, 57096, 55558, 54723, 54312, 54076, 54305, 54710, 53954, 51346, 48168, 46369, 46447, 47379, 47981, 47620, 46185, 44194, 42540, 41593, 40878, 39969, 39110, 38624, 38352, 38135, 38189, 38569, 38837, 38678, 38325, 38067, 37886, 37791, 37902, 38060, 38104, 38548, 40060, 42071, 43026, 42417, 41577, 41873, 43084, 44122, 44569, 44805, 45258, 46123, 47380, 48705, 49834, 51150, 53253, 55805, 57625, 58177, 58145, 58343, 58943, 60034, 61934, 64516, 67109, 69482, 72158, 75456, 79065, 82820, 86956, 91180, 94454, 96110, 96380, 95551, 93552, 90642, 87438, 83894, 79404, 74338, 70269, 68055, 66806, 65350, 63664, 62177, 60721, 59010, 57262, 55589, 53615, 51336, 49477, 48291, 46940, 44794, 42435, 40612]
55367D0612j526j740j700j147o32k19N59J417J516J015R03J213R52o7p84n97r6
55350C9679J87M94J000J370J407J223P19j77r29j018q94j199j544j254q30j107
55334C7127j491p85N50R01J30l27OP7m60n55J61N10j68q26m87K79N39M57N91P80
55314C7009O41L37K13K11J92J89J58K7N6L91N03o9o57l31M65N08k07n69l56m84
55294C8227j068j109m13j46p67j084j92J043J361P89N5o19j282j638j505j241
55278C0411j153j014n96o0M29Q13Q33L37j00K04Q70R69N98P22J343J307K36p32
55260C5417o27J45P67J076J121O88j88j054j668j993j620k29J273J459M21k79
55244C4709Q3N92M81K34K72J24l98n20J16O36L30k65m63n35q20q26j38O30P32
$$ y = [40612, 39086, 37346, 35646, 34499, 33867, 33648, 34207, 35624, 37140, 38155, 39058, 40271, 41223, 41156, 40372, 39775, 39679, 39866, 40360, 41360, 42730, 44137, 45360, 46079, 45902, 44973, 43955, 43061, 41862, 40318, 39064, 38234, 37127, 35636, 34851, 35401, 36302, 36432, 36105, 36111, 36188, 35728, 35173, 35334, 35844, 35676, 34850, 34363, 34642, 35181, 35638, 36229, 37009, 37650, 37987, 38200, 38411, 38603, 38792, 38950, 38977, 39033, 39424, 39927, 39858, 39201, 38870, 39335, 39843, 39636, 39067, 38711, 38227, 37159, 36050, 35637, 35491, 34724, 33640, 33448, 34491, 35852, 36641, 36696, 36077, 34795, 33157, 31652, 30411, 29258, 28244, 27648, 27588, 28017, 28830, 29663, 30000, 29900, 30104, 30974, 31943, 32541, 33263, 34606, 35913, 36149, 35417, 34790, 34935, 35702, 36778, 37899, 38587, 38399, 37345, 35677, 33684, 32064, 31835, 33108, 34567, 34988, 34709, 34792, 35384, 35865, 36099, 36371, 36495, 36097, 35577, 35693, 36329, 36659, 36394, 35931, 35396, 34576, 33750, 33612, 34242, 34974]
55225C4974L99K79M42N88N89K93m70j223j012K23J318J418R77P79Q61J030J466
55208D2931K120K327J728Q77M15L26M65R45J501J334J95j074j613j501j214r07
55192D8855o07m20j81L42P53M25k44j48P46J158M31n81j026j209j619k021k172
55175D2482k321k329j557k21M18m9m65r3Q7p71j692j375k79K24o3k97k04j53j68
55156C1174N6M26P06J044J481J466O73k02l53rJ36J04M05J039J485J401P84o5
55138D1751m81N6J005J193N10O7L29L93j77l19O95J702J335J89j83M49J115J406
55120E1035J666J925J917J866K020J845P93n43j153j114j255j711j869j497r17
55105E3008l60%k69j157j712j115J05Q51R47Q61N69j16n21K21J670K446K078J445
$$ y = [34974, 35373, 35652, 36094, 36682, 37271, 37564, 37094, 35871, 34859, 35082, 36400, 37818, 38795, 39574, 40435, 41465, 42931, 45051, 47378, 49106, 49983, 50398, 50724, 51189, 52134, 53635, 54969, 55164, 54090, 52477, 50976, 49762, 48855, 48248, 47828, 47647, 47989, 48742, 49167, 48923, 48775, 49521, 50679, 51110, 50529, 49503, 48294, 46675, 44654, 42482, 40161, 37832, 36275, 36054, 36472, 36423, 35958, 35865, 35952, 35181, 33489, 32114, 31835, 32059, 31996, 31699, 31495, 31342, 31174, 31230, 31656, 32362, 33406, 34887, 36353, 37026, 36824, 36471, 36462, 36598, 36702, 37107, 38146, 39631, 41032, 41816, 41751, 41270, 41326, 42331, 43524, 44034, 44101, 44430, 44823, 44646, 44327, 45022, 46724, 48059, 48248, 48065, 48514, 49629, 51035, 52701, 54626, 56543, 58409, 60429, 62274, 63067, 62524, 61371, 60257, 59002, 57291, 55422, 53925, 53008, 52648, 52648, 52379, 51222, 49510, 48395, 48500, 49351, 50298, 51159, 51728, 51612, 51091, 51312, 52982, 55428, 57506, 58951]
55087E8951J374J737J961J653P73j77l85L12J008R36N28N54Q55Q15N37M35K53
55070G2120m52j209j271q98q34q85l20N21M50p14j786j887j347p61j80M54R17
55053F1918J050R06N17j6l40l16l78p61q31l7R85J282J137J504K192K028Q58q1
55035G1617N5P36J181J285J108M67m92j147j228j021o02K71J298J632J126P01
55019G6987J023J661K007K224K659K953K536J586Q37N24J14q65k047k474j694
55004H8031m95j62r41j703j534j019j324k470l410l559l314l108k850k433j974
54989E7735j469p76q6K46L12N30Q82R72Q03P98R99R98P56P29J076J449J687K010
54971F9651K361K325J921J727J938K074J902J950K625L480L912M084M546N319
$$ y = [58951, 60325, 62062, 64023, 65676, 66449, 66272, 65887, 66199, 67207, 68143, 68671, 69225, 70080, 70895, 71432, 71867, 72120, 71668, 70459, 69188, 68290, 67456, 66571, 66251, 66772, 67222, 66508, 64722, 62835, 61488, 60727, 60547, 61001, 61918, 62968, 63874, 64391, 64375, 64035, 63719, 63341, 62580, 61749, 61712, 62697, 63979, 65116, 66620, 68812, 70840, 71698, 71617, 71672, 72408, 73589, 74874, 75982, 76449, 75957, 74810, 73582, 72561, 71959, 72230, 73528, 75160, 76286, 76987, 78010, 79671, 81678, 83902, 86561, 89514, 92050, 93636, 94473, 94997, 95111, 94246, 92199, 89725, 88031, 87536, 87374, 86433, 84730, 83196, 82177, 80853, 78383, 74973, 71414, 68100, 64992, 62142, 59709, 57735, 56266, 55490, 55404, 55650, 55962, 56492, 57374, 58346, 59149, 59947, 60946, 61944, 62700, 63429, 64505, 65954, 67641, 69651, 72012, 74337, 76258, 77985, 79923, 81997, 83899, 85849, 88474, 91954, 95866, 99950, 104496, 109815]
54957A09815N876N893N598N430N637O130O586O734O608O443O455O859P862R334
54943B01260J0675J1414J1729J1843J1133Q671M639L95l117o235r460j2275j3760
54930B26912j3924j3655j3496j3177j2386j1346j0340r145p463n663m534m218
54918A07565l916k943j593n49J70R40J550J424Q30R39K259L863M720N085N926
54903A26270P561R512J1308J2764J3711J4073J3962J3252J1451Q375M571O32l342
54890B44100p208j0334j2365j3746j4727j4532j2533r707p744o959o300n228m350
54877A18367m084l922l356k616k055j616j222j072j119q52n0P07O19m30j808k718
54861I2773k778k222j624j335j205r25m75n0J61K3l45l67M77J754K334J891J323
$$ y = [109815, 115691, 121584, 127182, 132612, 138249, 144379, 150965, 157699, 164307, 170750, 177205, 184064, 191926, 201260, 211935, 223349, 235078, 246921, 258054, 266725, 271364, 271759, 268642, 262407, 252947, 240672, 226912, 212988, 199333, 185837, 172660, 160274, 148928, 138588, 129443, 121980, 116317, 111783, 107565, 103649, 100706, 99113, 98564, 98734, 99674, 101224, 102648, 103478, 104417, 106676, 110539, 115259, 120344, 126270, 133831, 143343, 154651, 167415, 181126, 195199, 209161, 222413, 233864, 242239, 246810, 247442, 244100, 236892, 226558, 214193, 200447, 185720, 171188, 158655, 148948, 141204, 134245, 127945, 122717, 118367, 114283, 110361, 107005, 104389, 102334, 100718, 99496, 98424, 97305, 96453, 96403, 97110, 97729, 97299, 95491, 92773, 89995, 87773, 86149, 84814, 83609, 82684, 82209, 82159, 82320, 82343, 81998, 81631, 82108, 83862, 86196, 88087, 89410]
54844H9410J298J253N25m44r61j299j986k612k557k332k747l305k904j883j710
54829F7746k658l275k550j133q8M32P86J149J617K172K271J374No35k52L45P10
54812F8016J195J772J718R94O31J119J535J136P23J383K753L604L674L806M515
54797I8574N393N991O553P634R303J1009J2174J2891J3836J5330J6713J6926J5562
54784B47889J2991R716O113K606n26l432o276q719j0396j1527j2374j2482j1336
54771B02247r490p951o650m745k329n74L5L52J134K186L296M870P060R194J0653
54756B09288J1588J2332J2900J3335J3764J3823J2839J0911Q890P154N432M017
54744C36273L686M044L303O28k705n333p737j0967j4506j6913j7897j8346j8656
$$ y = [89410, 90708, 91961, 92486, 92042, 91081, 89782, 87796, 85184, 82627, 80295, 77548, 74243, 71339, 69456, 67746, 65088, 61813, 59263, 58130, 58042, 58474, 59260, 60409, 62026, 64198, 66469, 67843, 67848, 67213, 66961, 67306, 68016, 69211, 70983, 72701, 73695, 74326, 75445, 76980, 78116, 78839, 80222, 82975, 86579, 90253, 94059, 98574, 103967, 109958, 116511, 124145, 133448, 144457, 156631, 169522, 183358, 198688, 215401, 232327, 247889, 260880, 270596, 276709, 279315, 278789, 275357, 269081, 260362, 249966, 238439, 226065, 213583, 202247, 192757, 184806, 178156, 173411, 171082, 170508, 170543, 170895, 172029, 174215, 177511, 182381, 189441, 198635, 209288, 220876, 233208, 246108, 259443, 273207, 287030, 299869, 310780, 319670, 326824, 332256, 336273, 339959, 344003, 347306, 347934, 345229, 339896, 332159, 321192, 306686, 289773, 271876, 253530, 234874]
54731B34874j8269j6783j4559j2230j0321r144q512p770o629n577n015m529l620
54718A11916k661k288k356k246j912j772j763j397o98l47p94j673k236k107j586
54703H6080j291j400j316m80O24R83O20O91J686K525K141J042M35N08N39K59R6
54686I3742L07O84J034J346J625J995K744L730M237L907L429L621M291M678M647
54671A36017M653M837M949N014N284N634N661N294M805M310L818L558L712L992
54657B01538M087M295N123O470P853R257J1103J3394J5611J7506J9364K1403K3333
54644C60337K4613K4781K3536K0904J7135J2150N387l189j2067j8977k2841k4471
54632D07298k5213k5536k5118k3758k1752j9528j7296j5095j3040j1354j0091
$$ y = [234874, 216605, 199822, 185263, 173033, 162712, 153568, 145056, 137286, 130657, 125080, 120065, 115536, 111916, 109255, 106967, 104611, 102365, 100453, 98681, 96918, 95521, 94823, 94476, 93682, 92009, 89773, 87666, 86080, 84789, 83389, 82073, 81593, 82217, 83200, 83820, 84511, 86197, 88722, 90863, 91905, 92340, 92848, 93387, 93646, 93742, 94049, 94733, 95767, 97113, 98738, 100733, 103477, 107207, 111444, 115351, 118780, 122401, 126692, 131370, 136017, 140670, 145507, 150456, 155470, 160754, 166388, 172049, 177343, 182148, 186458, 190276, 193834, 197546, 201538, 205625, 209920, 215043, 221513, 229366, 238623, 249726, 263120, 278731, 296237, 315601, 337004, 360337, 384950, 409731, 433267, 454171, 471306, 483456, 488843, 485654, 473587, 454610, 431769, 407298, 382085, 356549, 331431, 307673, 285921, 266393, 249097, 234002, 220962, 209608, 199517]
54621A99517q885p301n482m079l388k882j910n22O95J393J675J700J463Q76j27
54606A72743j509k959l978m333m239l955l462k767k202k109k382k650k712k636
54592A30850k525k468k541k689k724k554k309k216k418k844l042k373q29N36O62
54577A00516j67p32o09n34r33j173p85l87o19r32m05P84J616J684J474J316R42
54560A01056J90m47k91P25J868K218J579P72P79J685K759L499L969M247M227M078
54544A32913M174M427M480M620N637P469R069R918J0601J1437J1746J1149J0356
54531B37996R763Q431N560J950j225m113p311j0170j1583j1864j2173j2487j1769
54518A81005j0003q363p327o223m910m339m856n328m690l374k455k119j791j211
$$ y = [199517, 190632, 183331, 177849, 173770, 170382, 167500, 165590, 165068, 165763, 167156, 168831, 170531, 171994, 172870, 172743, 171234, 168275, 164297, 159964, 155725, 151770, 148308, 145541, 143339, 141230, 138848, 136198, 133486, 130850, 128325, 125857, 123316, 120627, 117903, 115349, 113040, 110824, 108406, 105562, 102520, 100147, 99318, 99854, 100516, 100349, 99617, 99008, 98474, 97541, 96368, 95583, 95196, 94577, 93645, 93240, 94024, 95640, 97324, 98798, 100114, 101056, 101246, 100799, 100508, 101233, 103101, 105319, 106898, 107670, 108449, 110134, 112893, 116392, 120361, 124608, 128835, 132913, 137087, 141514, 145994, 150614, 156251, 163720, 172789, 182707, 193308, 204745, 216491, 227640, 237996, 247759, 256190, 261750, 263700, 262475, 258362, 251051, 240881, 229298, 217434, 205261, 192774, 181005, 171002, 162639, 155312, 149089, 144179, 139840, 134984, 129656, 124966, 121592, 119137, 117018, 115227, 114016]
54504A14016p02n91q53j128j000l96K72N94O93Q57R21N64J26L04J081J626J458
54487A17842R81O57L74K2J01J188K915M078L820K591J680J797K221J771M76l46
54471A42168J59J187J406O73m4r6K66N02L83k7m07l44J41M90L40R2J84K79k36
54452A47116j189j803j729j316j021j088j596k296k648k481k316k519k638k176
54438A20300j510j293j395j302j095j117j089n30K06L72O3J6L52N23L40R3k44
54421A12690q34j194o57M06R53Q14P80J152J378J240J252J640K035K354K964L771
54405A30744M202M296M719N469N708N223M867N096N213M532L349K191J095J56
54391A86860k25j91n67j616k594l073l639m531m796l784k457k078k406k409k102
$$ y = [114016, 113314, 112723, 111870, 110742, 109742, 109346, 109618, 110212, 110905, 111762, 112683, 113247, 113373, 113677, 114758, 116384, 117842, 118823, 119480, 119854, 119876, 119977, 121165, 124080, 128158, 131978, 134569, 136249, 138046, 140267, 142038, 142514, 142168, 142327, 143514, 144920, 145593, 145549, 145453, 145719, 146221, 146604, 146577, 146170, 145826, 145967, 146457, 146797, 146889, 147073, 147352, 147116, 145927, 144124, 142395, 141079, 140058, 138970, 137374, 135078, 132430, 129949, 127633, 125114, 122476, 120300, 118790, 117497, 116102, 114800, 113705, 112588, 111499, 110969, 111175, 111547, 111610, 111626, 111978, 112501, 112841, 112934, 112690, 111856, 110662, 110005, 110411, 111364, 112178, 112958, 114110, 115488, 116728, 117980, 119620, 121655, 124009, 126973, 130744, 134946, 139242, 143961, 149430, 155138, 160361, 165228, 170324, 175537, 180069, 183418, 185609, 186704, 186860, 186635, 186444, 185877, 184261, 181667, 178594, 174955, 170424, 165628, 161844, 159387, 157309, 154903, 152494, 150392]
54376A50392k295k873k798j810q94q36j186j115n52p4n7l22m39j63L65Q25J084
54359A37252J294J566J762J720J500J278J190J323J710K267K891L557M114M182
54345A67606L674L202L390L859L604K403J101L35k06r59j717k154k489k999l378
54330A75272l264l041l446m480n303n214m418l743l784m391m890m841m442m086
54316A15929l749l204k634k479k691k745k433k139k137k156j919j588j413j305
54302H3337j090q62q61j130j413j326o60K46O88L75k28p26j446k596l304k487
54286F6517n99O93O11L1j04L5m2j70n9m2n59j351j716j309l74N10P44K41k64K4
54266F2817Q92J365J104P03N69L87K0k7N12J124J284J092P35J63l60j94O42J246
$$ y = [150392, 148097, 145224, 142426, 140616, 139722, 138886, 137700, 136585, 136033, 135959, 135902, 135580, 135141, 134978, 135343, 136168, 137252, 138546, 140112, 141874, 143594, 145094, 146372, 147562, 148885, 150595, 152862, 155753, 159310, 163424, 167606, 171280, 174482, 177872, 181731, 185335, 187738, 188839, 189174, 188968, 188009, 186292, 184138, 181649, 178650, 175272, 172008, 168967, 165521, 161041, 155738, 150524, 146106, 142363, 138579, 134188, 129298, 124457, 120015, 115929, 112180, 108976, 106342, 103863, 101172, 98427, 95994, 93855, 91718, 89562, 87643, 86055, 84642, 83337, 82247, 81385, 80524, 79394, 77981, 76655, 75995, 76241, 76929, 77304, 77076, 76350, 74904, 72308, 69004, 66517, 65918, 66611, 67222, 67253, 67149, 67184, 67142, 66972, 66913, 66871, 66312, 64961, 63245, 61936, 61562, 62072, 62816, 63057, 62793, 62817, 63709, 65074, 66178, 66881, 67450, 67837, 67857, 67830, 68342, 69466, 70750, 71842, 72577, 72740, 72380, 72186, 72828, 74074]
54248G4074J159J043J431J698J112J32k48R2N20O95O76M58R8k3K28L00k22q35
54230H2388q46n15o73j439k123k207j796j208o47k59o3K9p6o05j353j659j295
54213F5653q31p75r06r11j008j364j582j432j444j964k223j277M71J699J808J299
54197E5213O97N0n13o31l27j34m47j077j582j615j090k79K61J11o55j563j997
54180D4422j447n0J106R70o2m97K37J085J128Q98J094J132J53j302j945j564r57
54163D4401m41K40P64L78o79j152m68N25Q29M94K27M63J101J678J659R78K53O5
54145E1315J35j95q40j034m79K91P51R37J049J073R76Q41O82M51K34J20Pj91l67
54126E5756m99p87j110q77R6J005J033M99K47L88M63M66O90Q35L80l03k64N18
$$ y = [74074, 75233, 76276, 77707, 79405, 80517, 80649, 80401, 80493, 81013, 81708, 82384, 82842, 82940, 82917, 83145, 83445, 83223, 82388, 81542, 81027, 80354, 78915, 76792, 74585, 72789, 71581, 70934, 70675, 70612, 70641, 70565, 69960, 68607, 66948, 65653, 64822, 64047, 63141, 62230, 61222, 59858, 58276, 56844, 55400, 53436, 51213, 49936, 50407, 52106, 53914, 55213, 55910, 55960, 55447, 54816, 54489, 54355, 53908, 52831, 51249, 49634, 48544, 48265, 48526, 48637, 47982, 46419, 44422, 42975, 42925, 44031, 45001, 44939, 44442, 44679, 45764, 46892, 47790, 48884, 50016, 50169, 48867, 46922, 45358, 44401, 43960, 44200, 44964, 45342, 44663, 43511, 43043, 43568, 44397, 44891, 45118, 45581, 46682, 48360, 50019, 50997, 51250, 51315, 51450, 51255, 50415, 49381, 48902, 49193, 49944, 50881, 51930, 53003, 53979, 54820, 55502, 55953, 56187, 56307, 56314, 56123, 55756, 55257, 54470, 53360, 52483, 52579, 53584, 54617, 55116, 55363, 55751, 56214, 56680, 57370, 58205, 58585, 58282, 58018, 58536]
54108E8536J094J035R09J081J073N43n7k73l15m68n18k54Q7K46L60N71O39L00
54090F4589l83j190j840j885j100p9K09k45m15K35R03O88p0m09j74j2k01k92J5
54071E8344L96M48K73K47M80P40Q25P51N86L21M1N3N64J246J484J202R98J280
54053G0279J660J602J231J060J125J039O96M02L03K75L44O10Q18N71Q7P3O86J164
54035H4025Q58J78N6P81J726K153J935J519J439J900K659L241L380L312L638M709
54019A17509O122P013O973O414N866N283M521M077M513N289N199M084L097K949
54005A88909K877K023Q47K98L64L13o2m46q66j635k610l323l683l946m151m219
53989A70690m301m510m614m457m292m161l599k585k057k552l077k472j284r51
$$ y = [58536, 59630, 60665, 61574, 62655, 63728, 64271, 64214, 63941, 63626, 63158, 62640, 62386, 62473, 62719, 63079, 63650, 64289, 64589, 64206, 63016, 61176, 59291, 58191, 58112, 58321, 58076, 57661, 57896, 58799, 59487, 59417, 59008, 58834, 58822, 58621, 58329, 58344, 58740, 59188, 59461, 59708, 60188, 60928, 61753, 62504, 63090, 63411, 63452, 63505, 64069, 65315, 66799, 68001, 68999, 70279, 71939, 73541, 74772, 75832, 76957, 77996, 78692, 79094, 79397, 79672, 80016, 80626, 81444, 82015, 82102, 82175, 82861, 84025, 84883, 85061, 85117, 85898, 87624, 89777, 91712, 93231, 94670, 96570, 99229, 102470, 105850, 109162, 112800, 117509, 123631, 130644, 137617, 144031, 149897, 155180, 159701, 163778, 168291, 173580, 178779, 182863, 185960, 188909, 191786, 193809, 194656, 194954, 195318, 195631, 195569, 195123, 194257, 192622, 190012, 186689, 183006, 179060, 174909, 170690, 166389, 161879, 157265, 152808, 148516, 144355, 140756, 138171, 136114, 133562, 130485, 128013, 126729, 125778]
53975A25778j577j911j330m27K67P83Q49n1j484k214j909j538j778k132k012j608
53959A07706j264r40o62o73p34k33O99J154Q96Q15J474K151J962J151N57N52J033
53942A15644J806K436K391J824J606K131K740K802K644K873L387L720L829L935
53928A53768M041M133M404M803M762L834K297Q13j45l58J24P19P07J34j94O5K88
53911A84195J9j34O50K225L761M756N163N053M671M572N095N927O550O894P189
53896B46586P500P750P848P487O217M170K295J455J519J665J283K92j112k534
53882B92421l439l556l235l149l672m582n291n437n284n440o056o626o819o930
53868B22905p099o717n435m143l880m184l822k864k534l066l309k703k138k308
$$ y = [125778, 124201, 122290, 120960, 120533, 120800, 121583, 122432, 122381, 120897, 118683, 116774, 115236, 113458, 111326, 109314, 107706, 106442, 105502, 104840, 104167, 103433, 103200, 103899, 105053, 105949, 106764, 108238, 110389, 112351, 113502, 114059, 114611, 115644, 117450, 119886, 122277, 124101, 125707, 127838, 130578, 133380, 136024, 138897, 142284, 146004, 149833, 153768, 157809, 161942, 166346, 171149, 175911, 179745, 182042, 182855, 182710, 182352, 182476, 183195, 183902, 184036, 183842, 183907, 184195, 184214, 184080, 184730, 186955, 190716, 195472, 200635, 205688, 210359, 214931, 220026, 225953, 232503, 239397, 246586, 254086, 261836, 269684, 277171, 283388, 287558, 289853, 291308, 292827, 294492, 295775, 296067, 294955, 292421, 288982, 285426, 282191, 279042, 275370, 270788, 265497, 260060, 254776, 249336, 243280, 236654, 229835, 222905, 215806, 209089, 203654, 199511, 195631, 191447, 187625, 184761, 182227, 179161, 175852, 173149, 171011, 168703]
53854A68703k703k865l240l994m288l712l211l607m263m292m031m096l943k770
53840A17688j138l63o40j025r72p54n96m18l49n49p24m63N1L53L86K90j07q55
53822A09815j358j051k92J54J68J48K12L07P11J578K232J770K84j149j603j000
53806A10926M5O54L45l29k72O38J288J070R09J752K990L489L396L614M101M145
53790A38761L913M248N061N346M852M469M779N346N648N656N330M509L568L300
53776B04786L796M174L694K509J208K17k17r8J45N6l03o29j049j930l197m421
53760B08741n375n891n593m524l618l642l978l559k624k316k711k635j598m91
53746A60186j16j88k21k82m01k59K8j95r51j352r94p33j301k071k038j392j156
$$ y = [168703, 166000, 163135, 159895, 155901, 151613, 147901, 144690, 141083, 136820, 132528, 128497, 124401, 120458, 117688, 116550, 116187, 115547, 114522, 113550, 112796, 112200, 111782, 111433, 110884, 110160, 109697, 109748, 110101, 110487, 110777, 110670, 109815, 108457, 107406, 107114, 107268, 107436, 107584, 107796, 108103, 108814, 110392, 112624, 114394, 114678, 113529, 111926, 110926, 110971, 111625, 111970, 111641, 111369, 112007, 113295, 114365, 115274, 117026, 120016, 123505, 126901, 130515, 134616, 138761, 142674, 146922, 151983, 157329, 162181, 166650, 171429, 176775, 182423, 188079, 193409, 197918, 201486, 204786, 208582, 212756, 216450, 218959, 220167, 220384, 220167, 220069, 220214, 220270, 219967, 219338, 218289, 216359, 213162, 208741, 203366, 197475, 191882, 187358, 183740, 180098, 176120, 172561, 169937, 167621, 164910, 162275, 160677, 160186, 160070, 159882, 159661, 159379, 158978, 158719, 158747, 158552, 157601, 156249, 155255, 154522, 153221, 151150, 149112, 147720, 146564]
53729A46564j599j853j130K42J115P40l91r94m52M71P72N65N61N78k12j637k406
53712A40934j937j101o71k85L98P36K39l33j53K03k93j249j332m21J43l68r96
53695A33514n57O83J521J512J380J828K545K650J855Q16K67K09K03J83M44R26
53679A49979J178J133J305J899K330K137J824K217L186L703L132J900Q57M23N01
53664A77704Q33J166J296J203J085J031Q06J04r11j573j386n91J26L33O0n05j104
53647A79677j294p95m4J75j38o9P80J433Q18o26j495j320r19j006j311j360j256
53630A71250j304j385j182o81j55K07M40P24J162J536J400O80rk4N41J043J157
53613A75400J079J060J208J588K052K175J841J664K240L179L600L400L191L188
$$ y = [146564, 144965, 143112, 141982, 142224, 143339, 144079, 143688, 142694, 142242, 142713, 143485, 144050, 144611, 145189, 144977, 143340, 140934, 138997, 137896, 137225, 136940, 137338, 138074, 138313, 137980, 137827, 138030, 137737, 136488, 135156, 134735, 134878, 134510, 133514, 132957, 133640, 135161, 136673, 138053, 139881, 142426, 145076, 146931, 147747, 148014, 148223, 148426, 148609, 149053, 149979, 151157, 152290, 153595, 155494, 157824, 159961, 161785, 164002, 167188, 170891, 174023, 175923, 176780, 177203, 177704, 178537, 179703, 180999, 182202, 183287, 184318, 185124, 185228, 184317, 182744, 181358, 180767, 180893, 181226, 181286, 180781, 179677, 178383, 177588, 177544, 177719, 177581, 177512, 178292, 179725, 180543, 179917, 178422, 177102, 176183, 175177, 173866, 172506, 171250, 169946, 168561, 167379, 166698, 166543, 166750, 167190, 167914, 169076, 170612, 172012, 172692, 172683, 172659, 173200, 174243, 175400, 176479, 177539, 178747, 180335, 182387, 184562, 186403, 188067, 190307, 193486, 197086, 200486, 203677, 206865]
53599B06865L079K989L522M572N147M729M012L843M139M298M050L473K739K162
53585B59619K038K162K038J778K058K940L504L142K459K376K907L386L389K917
53571B96713K073J100M14K41M78J041J818K151J260m98j653j458q59r98j613j825
53555B98385j686j820k033j589o11n2k75o95r44j343j994k282j725p42m4L20P93
53538B81663J497J962J699Q91L38O30J439J888J635J279J527K358L349M267M928
53523C11350M880L942K848K691L749N336O723P630P984P825P632Q047R109J0145
53509C99891J0632J0765J1015J1559J2389J3583J5084J6453J7218J7446J7737
53498E53772J8609K0051K1629K2911K3789K4461K5175K6026K6935K7822K8669
$$ y = [206865, 209944, 212933, 216455, 221027, 226174, 230903, 234915, 238758, 242897, 247195, 251245, 254718, 257457, 259619, 261657, 263819, 265857, 267635, 269693, 272633, 276137, 279279, 281738, 284114, 287021, 290407, 293796, 296713, 298786, 299886, 300300, 300541, 301019, 302060, 303878, 306029, 307289, 306791, 305138, 303680, 302821, 301823, 300210, 298385, 296699, 294879, 292846, 291257, 290646, 290594, 290319, 289624, 288680, 287337, 285343, 283061, 281336, 280594, 280550, 280870, 281663, 283160, 285122, 286821, 287712, 288050, 288680, 290119, 292007, 293642, 294921, 296448, 298806, 302155, 306422, 311350, 316230, 320172, 323020, 325711, 329460, 334796, 341519, 349149, 357133, 364958, 372590, 380637, 389746, 399891, 410523, 421288, 432303, 443862, 456251, 469834, 484918, 501371, 518589, 536035, 553772, 572381, 592432, 614061, 636972, 660761, 685222, 710397, 736423, 763358, 791180, 819849]
53487H19849K9414K9831K9642K8831K7889K7499K7880K8517K8786K8665K8625
53476A135428K8991K9756L0874L2222L3284L3474L2917L2369L2141L1616L0173
53465A483245K8070K5978K4061K2062J9995J8025J5986J3601J1200R560Q942Q789
53453A689514Q531Q164P870P444O467M815K679J89k683n827q868j1483j3786j6187
53439A676839j8886k1616k3991k5983k7774k9295l0213l0489l0620l1088l1767
53428A375117l2135l1985l1660l1528l1430l0794k9269k7207k5382k4262k3631
53417A055834k2958k1985k0786j9390j7631j5392j2769j0004p323m768k120R10
53405I01618M244P440J0289J3083J5994J8595K0534K2345K4787K7576K9678L0868
$$ y = [819849, 849263, 879094, 908736, 937567, 965456, 992955, 1020835, 1049352, 1078138, 1106803, 1135428, 1164419, 1194175, 1225049, 1257271, 1290555, 1324029, 1356946, 1389315, 1421456, 1453072, 1483245, 1511315, 1537293, 1561354, 1583416, 1603411, 1621436, 1637422, 1651023, 1662223, 1671783, 1680725, 1689514, 1698045, 1706209, 1714079, 1721523, 1727990, 1732805, 1735484, 1735673, 1732990, 1727163, 1718295, 1706812, 1693026, 1676839, 1657953, 1636337, 1612346, 1586363, 1558589, 1529294, 1499081, 1468592, 1437972, 1406884, 1375117, 1342982, 1310997, 1279337, 1247809, 1216379, 1185585, 1156316, 1129109, 1103727, 1079465, 1055834, 1032876, 1010891, 990105, 970715, 953084, 937692, 924923, 914919, 907596, 902828, 900708, 901618, 905862, 913302, 923591, 936674, 952668, 971263, 991797, 1014142, 1038929, 1066505, 1096183, 1127051]
53393A127051L2149L4250L6664L8589M0082M1660M3335M4793M6206M8115N0628
53382A583522N3320N5854N8323O0922O3587O6013O7843O8962O9756P0879P2579
53371B291560P4363P5478P5583P4884P3817P2751P1793P0693O9047O6581O3117
53360C079667N8453N2718M6735M1512L7221L3225K9159K5400K2184J9023J5344
53349C460641J1266P229L284q66n445j0658j6884k4406l3062m2388n1883o1003
53337C235825o9241p6354q2173q6173q7876q7844q7542q7803q7993q7129q5204
53326B310493q2919q0685p8536p6631p5150p3952p2712p1221o9324o6915o4284
53315A498164o1809n9185n5645n1316m7404m4457m1431l7295l2643k8618k5073
$$ y = [1127051, 1159200, 1193450, 1230114, 1268703, 1308785, 1350445, 1393780, 1438573, 1484779, 1532894, 1583522, 1636842, 1692696, 1751019, 1811941, 1875528, 1941541, 2009384, 2078346, 2148102, 2218981, 2291560, 2365923, 2441401, 2516984, 2591868, 2665685, 2738436, 2810229, 2880922, 2949969, 3016550, 3079667, 3138120, 3190838, 3237573, 3279085, 3316306, 3349531, 3378690, 3404090, 3426274, 3445297, 3460641, 3471907, 3479136, 3482420, 3481554, 3476109, 3465451, 3448567, 3424161, 3391099, 3348711, 3296828, 3235825, 3166584, 3090230, 3008057, 2921884, 2834008, 2746164, 2658622, 2570819, 2482826, 2395697, 2310493, 2227574, 2146889, 2068353, 1991722, 1916572, 1842620, 1769908, 1698687, 1629363, 1562448, 1498164, 1436355, 1377170, 1321525, 1270209, 1222805, 1178348, 1136917, 1099622, 1066979, 1038361, 1013288]
53304A013288k1124j6943j3509j0801p774m168j034Q93K156L592N278O923Q466
53291I65243R845J0752J1047J1033J1151J1767J3243J5631J8272K0342K1829K3431
53279A143586K5442K7425K9112L0802L2719L4580L6090L7251L7931L7745L6710
53268A509393L5503L4652L3882L2655L1035K9653K8895K8371K7169K4681K1354
53257A837243J8426J6686J5645J4334J2640J1226J0271R012O633L052j337o082
53245A947749j0636j4543j7950k1631k6083l0916l5310l8883m1901m4800m7644
53234A617452n0047n1595n2333n2593n2318n1073m8858m6405m4221m1998l9547
53223A086464l7649l7064l7209l6935l6275l6181l6721l6850l6149l5489l5462
$$ y = [1013288, 992164, 975221, 961712, 950911, 943137, 938969, 937935, 938828, 940984, 944576, 949854, 956777, 965243, 975088, 985840, 996887, 1007920, 1019071, 1030838, 1044081, 1059712, 1077984, 1098326, 1120155, 1143586, 1169028, 1196453, 1225565, 1256367, 1289086, 1323666, 1359756, 1397007, 1434938, 1472683, 1509393, 1544896, 1579548, 1613430, 1646085, 1677120, 1706773, 1735668, 1764039, 1791208, 1815889, 1837243, 1855669, 1872355, 1888000, 1902334, 1914974, 1926200, 1936471, 1945483, 1952116, 1955168, 1953831, 1947749, 1937113, 1922570, 1904620, 1882989, 1856906, 1825990, 1790680, 1751797, 1709896, 1665096, 1617452, 1567405, 1515810, 1463477, 1410884, 1358566, 1307493, 1258635, 1212230, 1168009, 1126011, 1086464, 1048815, 1011751, 974542, 937607, 901332, 865151, 828430, 791580, 755431, 719942, 684480]
53212F84480l5289l3950l1537k8880k6405k3947k1234j8289j5639j4149j4043
53201D21118j4112j2869j0540q869q700q936q367p313o609o152n467m929n194
53188C13061n904o093n608n204n308n558n449m890m154l739m056m850n281n004
53174B41963m623m664m660m016l156k952l400l777l789l630l178k166j063p09
53160A96180j038j142p22n32j101j956k433k514k372j893j131o44p80j096j038
53145A75788p66p98j175j463j394j016m15K49O15M95K55M10Q84J154J106J192
53129A75121J646K059K014J720J688K008K442K985L834M823N345N106M589M431
53115B19811M615M543L890K987K378K177K005J383J04j672l525m927n416m872
$$ y = [684480, 649191, 615241, 583704, 554824, 528419, 504472, 483238, 464949, 449310, 435161, 421118, 407006, 394137, 383597, 374728, 366028, 357092, 348725, 341412, 334803, 328651, 323184, 318255, 313061, 307157, 301064, 295456, 290252, 284944, 279386, 273937, 269047, 264893, 261154, 257098, 252248, 246967, 241963, 237340, 232676, 228016, 224000, 220844, 217892, 214492, 210715, 206926, 203296, 200118, 197952, 196889, 196180, 195142, 194000, 193278, 192746, 191645, 189689, 187256, 184742, 182370, 180477, 179346, 178702, 177922, 176826, 175788, 175022, 174224, 173049, 171586, 170192, 169176, 168761, 169010, 169625, 170120, 170375, 170785, 171669, 172823, 173929, 175121, 176767, 178826, 180840, 182560, 184248, 186256, 188698, 191683, 195517, 200340, 205685, 210791, 215380, 219811, 224426, 228969, 232859, 235846, 238224, 240401, 242406, 243789, 243893, 242221, 238696, 233769, 228353, 223481]
53101B23481l810l182l512m271m510m090l817m184m695m766m699n001n311m869
53087A62764l849l247l418l628l223k500k048j984k148k449k602k077q80J61K90
53072A29162k79q16j045j143j157r77p43p19q51q44o41m62m62n87p50q45p18l82
53054A15741j33k19n24p96r51j018r56q15q47j090j098n16K92O11L07j22l67o55
53036A06844j145j473j207m85J13K24m7m62r78j559j959j926j626j549j835j970
53020H8960j472o06n1L9O8J27k76j319k303k384j585o66k37k77l78j28N35J135
53002G9182J030K22n33o39l42j17J39P72J528J777J468J172J125R11L44l4L67
52985H8372J350K204K522K375J953J421J054J174J862K920M077N037N445N143
$$ y = [223481, 219671, 216489, 212977, 208706, 204196, 200106, 196289, 192105, 187410, 182644, 177945, 172944, 167633, 162764, 158915, 155668, 152250, 148622, 145399, 142899, 140851, 138867, 136719, 134270, 131668, 129591, 128711, 128872, 129162, 128883, 128067, 127022, 125879, 124722, 123745, 123002, 122283, 121432, 120588, 119947, 119485, 119023, 118436, 117686, 116841, 116123, 115741, 115608, 115389, 114865, 114069, 113118, 112100, 111144, 110329, 109482, 108392, 107294, 106778, 107070, 107681, 107988, 107866, 107499, 106844, 105699, 104226, 103019, 102534, 102647, 102871, 102824, 102362, 101384, 99825, 97866, 95940, 94314, 92765, 90930, 88960, 87488, 86882, 86831, 86870, 86938, 87065, 86789, 85470, 83167, 80783, 79198, 78532, 78295, 78018, 77640, 77512, 78047, 79182, 80212, 80434, 79901, 79262, 78920, 78803, 78942, 79714, 81242, 83019, 84487, 85659, 86784, 87695, 88039, 88005, 88372, 89722, 91926, 94448, 96823, 98776, 100197, 101251, 102425, 104287, 107207, 111284, 116321, 121766, 126909]
52971A26909M516M211M371M435L964L350L249L472L044J469n86k111k816l034
52957A54443l052l017l191l688m112m001l553l342l402l214k655k286k504k998
52943A09428l311l442l517l351k748j962j427j197j002p15n02n99j025j520j721
52928H1389j559j373j438j551j378r99o38q5Q38J419N99j354k747k447j163j98
52912F7315K21N50O71O9r90j532j100k47K57J60l52r11j121q17k80P3Q9j37m20
52893F1498m05K28J145J363M43p61j089n04J00K06K7k31n55o42p1Q37J129M68
52875F3186k83j77O72J386J468J175R24P19L07k76n28nJ058J873J923J445J010
52858G5877R61J448K519L821M572M298L375K500J896J490J472K070K977L623L890
$$ y = [126909, 131425, 135636, 140007, 144442, 148406, 151756, 155005, 158477, 161521, 162990, 162404, 160293, 157477, 154443, 151391, 148374, 145183, 141495, 137383, 133382, 129829, 126487, 123085, 119871, 117216, 114930, 112426, 109428, 106117, 102675, 99158, 95807, 93059, 91097, 89670, 88473, 87471, 86756, 86254, 85655, 84630, 83110, 81389, 79830, 78457, 77019, 75468, 74090, 73091, 72453, 72368, 73206, 74625, 75224, 73870, 71123, 68676, 67513, 67315, 67536, 68086, 68757, 68826, 67836, 66304, 65204, 64957, 65214, 65374, 65022, 64111, 62990, 62173, 61893, 61966, 62055, 61918, 61498, 61093, 61321, 62466, 63829, 64272, 63511, 62422, 61918, 62018, 62224, 62251, 62020, 61465, 60823, 60752, 61589, 62718, 63186, 62903, 62726, 63398, 64784, 66252, 67427, 68351, 69070, 69377, 69101, 68573, 68568, 69626, 71499, 73422, 74867, 75877, 76838, 78286, 80805, 84626, 89198, 93496, 96871, 99371, 101267, 102757, 104229, 106299, 109276, 112899, 116789]
52843A16789L982L781K999J972J501J787K082J693P49j83q80j538k289k900k952
52828A26593k341j621j600k370l143l302l227l567m135m154l437k534j832j260
52814H8070q25p26q27o99l29k05n91j214j754k087k049j531r10p08q07o63k76
52797G1869k13n28n96l05m68j520k572k479j307j35K42p8m93m15K59R20Q08J04
52779F3093j12O49J490J383O35K86N40O30J72k86j63L65P83R03R19J071J371J523
52761G5252J067j66j666k576k457j632p67k85j58j14j1J3k16n00l68K54P49M95
52743F6914l03p96n57p7j26p67j316j192o03k20k88l89q5N18J042J370J520J315
52725F5960O56K2P3P48J252J050M58N6R2N59J390K254K598K297J891J867K036
$$ y = [116789, 120771, 124552, 127551, 129523, 131024, 132811, 134893, 136586, 137335, 137152, 136272, 134734, 132445, 129545, 126593, 124252, 122631, 121031, 118661, 115518, 112216, 108989, 105422, 101287, 97133, 93696, 91162, 89330, 88070, 87245, 86519, 85692, 84993, 84664, 84459, 83868, 82654, 80900, 78813, 76764, 75233, 74323, 73615, 72808, 72145, 71869, 71656, 71128, 70532, 70227, 69759, 68239, 65667, 63188, 61881, 61746, 61988, 61910, 61417, 61002, 61261, 62181, 62989, 63093, 62981, 63630, 65120, 66503, 67138, 67424, 67964, 68594, 68766, 68480, 68317, 68682, 69465, 70368, 71287, 72358, 73729, 75252, 76319, 76153, 74487, 71911, 69454, 67822, 67055, 66770, 66612, 66498, 66487, 66500, 66284, 65784, 65416, 65670, 66419, 66914, 66611, 65815, 65258, 65181, 65055, 64288, 62972, 61780, 61177, 60957, 60669, 60280, 60195, 60713, 61755, 63125, 64645, 65960, 66616, 66638, 66711, 67459, 68711, 69761, 70219, 70275, 70367, 70926, 72316, 74570, 77168, 79465, 81356, 83223, 85259]
52708H5259J971J726J715K117K788L535M082M036L311K444K050K069J958J552
52694A20613J284J435J609J160k5j362k178k355k362k658l183l536l524l301l013
52679I8604k688k496k725l289l610l257k437j662j203j054j115j188j094j009
52665F9777j362k099k494k048j166m92J9P05J246R38j10r15r36p41r84j367j094
52648E6877q1R03J224J066R82J074Q64qj159j769j515r15o19n77k68M19R86J075
52630E8559R33J007J332J630J753J828J980K222K487K602K279J385K30o61j152
52615G8414j666k577l600m040l589k606j626q38j70L90P38Q03O53N12O67J108
52599F2573J256N15p48j355q35j96n30j367j337k76N73M96K60O43J140R47L63
$$ y = [85259, 87230, 88956, 90671, 92788, 95576, 99111, 103193, 107229, 110540, 112984, 115034, 117103, 119061, 120613, 121897, 123332, 124941, 126101, 126076, 124714, 122536, 120181, 117819, 115161, 111978, 108442, 104918, 101617, 98604, 95916, 93420, 90695, 87406, 83796, 80539, 78102, 76440, 75237, 74183, 73068, 71880, 70786, 69777, 68415, 66316, 63822, 61774, 60608, 60116, 60135, 60840, 62086, 63024, 62914, 61999, 61063, 60322, 59338, 57971, 56877, 56796, 57699, 58923, 59989, 60971, 62045, 62909, 62901, 61742, 59973, 58458, 57543, 56924, 56347, 56079, 56498, 57484, 58559, 59492, 60499, 61831, 63461, 65214, 67042, 69022, 71244, 73731, 76333, 78612, 79997, 80227, 79566, 78414, 76748, 74171, 70571, 66531, 62942, 60336, 58710, 57872, 57702, 58092, 58830, 59633, 60286, 60798, 61465, 62573, 63829, 64344, 63596, 62241, 61406, 61210, 60680, 59313, 57976, 57700, 58273, 58769, 59029, 59672, 60812, 61759, 62122]
52582F2122K19M63L60j96n91n86n42n12q0P06J081O01j93n83n11k96qL59N71N11
52562F2895N29Q94J183Q31J57R8Q86J633J516Q23L70K72m3p02r96m14M16M52l48
52543G0452q64k37J076J919J801J251R47R58R12N90Q1m66r74j344j427j136n20
52526G3019L29J288K103K392K001J269P46N62L83M6j03K10O11N07m1m28m47m94
52508H3953o92m65N13J510J491N28k67j59L81N63L44K74N21O01Q3p46j169q43
52490H6421j45K96K70P4K3O7kj45j01J89L59K1o73j088q28k41m1m56j002j127
52470H1871q29m91l03j40J24L99N27M54K69J59K75N92R38J243J522J616J178K48
52452H9652n67p41m43j53K7K26K38j45m47O7J189J788J301M14k8j08k88m45j71
$$ y = [62122, 62341, 62804, 63164, 62968, 62377, 61791, 61249, 60737, 60657, 61363, 62444, 63045, 62852, 62269, 61758, 61462, 61454, 61813, 62384, 62895, 63424, 64318, 65501, 66332, 66489, 66587, 67473, 69106, 70622, 71445, 71815, 72087, 72044, 71342, 70346, 69932, 70348, 70800, 70452, 69588, 69351, 70427, 72346, 74147, 75398, 76345, 77303, 78215, 78805, 78886, 78420, 77446, 76102, 74675, 73539, 73019, 73348, 74636, 76739, 79131, 81132, 82401, 83147, 83709, 84092, 84138, 84035, 84245, 84856, 85363, 85322, 84894, 84447, 83953, 83261, 82796, 83309, 84819, 86310, 86838, 86571, 86412, 86793, 87356, 87700, 87974, 88495, 89096, 89179, 88433, 87264, 86421, 86276, 86572, 86842, 86916, 86939, 87006, 87004, 86859, 86758, 86947, 87306, 87327, 86654, 85566, 84738, 84497, 84456, 84000, 82998, 81871, 81042, 80551, 80248, 80108, 80232, 80631, 81158, 81612, 81881, 82040, 82315, 82907, 83845, 85088, 86610, 88226, 89404, 89652, 89085, 88344, 87901, 87748, 87775, 88001, 88239, 88094, 87647, 87714, 88903, 90691, 91992, 92406, 92378, 92270, 91982, 91537, 91366]
52433I1366L55N02N4o08j066j196j057q40q28j014r35k88N24R25J025J339J757
52416I0015J510L52q48j067k62P15J080O85j02p25p56k35K99L75R6q4m5j68o58
52397I0177j112r87l56J72K60J46Q5j04o22j216j470j410j334j222p39J42R75
52380H1385J306J063M59j40k80K53J094J657J836J964K140K037J463O75J2l37
52364I6587j75N34J230J168M65J68Q80J928K288J854J272R65Q71Q42P48M18o8
52347A11975k43K16J022J609J747J543J173Q74Q14P70L24l52n17l9J96l88j080
52330A19644r97m80m18o69l87L83O75J09o11r57j197j520j503r17k85j16k23k10
52312A10321q9j0J58N12P78P17N66O14O96M90J24K5L02O33P17N66L68K81L44M90
$$ y = [91366, 91721, 92223, 92277, 91669, 90603, 89407, 88350, 87510, 86682, 85668, 84733, 84445, 84969, 85894, 86919, 88258, 90015, 91525, 91877, 91029, 89962, 89700, 90415, 91495, 92180, 92078, 91353, 90597, 90362, 90661, 91036, 91132, 91048, 91003, 90835, 90177, 89065, 88078, 87722, 87894, 88154, 88300, 88385, 88281, 87659, 86443, 84973, 83563, 82229, 81007, 80268, 80410, 81385, 82691, 83754, 84213, 84073, 83793, 84046, 85140, 86797, 88633, 90597, 92737, 94774, 96237, 96912, 96924, 96587, 96412, 96946, 98176, 99344, 99809, 99977, 100857, 102785, 105073, 106927, 108199, 109164, 110035, 110877, 111625, 112043, 111975, 111732, 111948, 112970, 114579, 116326, 117869, 119042, 119916, 120730, 121500, 121824, 121472, 120955, 120916, 121112, 120724, 119644, 118647, 118167, 117749, 117080, 116693, 117076, 117751, 117860, 117249, 116292, 115095, 113575, 112072, 111155, 110870, 110754, 110531, 110321, 110232, 110222, 110380, 110892, 111670, 112387, 112953, 113567, 114263, 114753, 114877, 114902, 115204, 115837, 116554, 117120, 117488, 117769, 118113, 118603]
52292A18603N92N95O03Q23J421K291K962K898K063J049M51L31M46P35J271J861
52276A38995K138K025J828J848K116K411K414J992J471J363J612J550R07M18Q33
52261A63921J729K008J333L67k81n82n78j54M98Q27N87J58K4L42J007J737K132
52244A75075K038J811J817J824J475J099J267J750J806J516J779K837L748L746
52230B03588L188K753K459K037J578J254R67P68J036J761K213J885J214Q23O35
52215B28159L33J43M20R12J172J323J699K026J769J132Q84J220J536J388J053
52200B45169R53J128J433J841K341K831L258L590L626L095K129J389J516K504
52186B76803L614L918L041J531M37L69R75J414J245Q35R65K016L454M169L563
$$ y = [118603, 119195, 119790, 120393, 121216, 122637, 124928, 127890, 130788, 132851, 133900, 134351, 134682, 135128, 135863, 137134, 138995, 141133, 143158, 144986, 146834, 148950, 151361, 153775, 155767, 157238, 158601, 160213, 161763, 162670, 163088, 163921, 165650, 167658, 168991, 169358, 169077, 168495, 167917, 167763, 168261, 169088, 169675, 169833, 169857, 170199, 171206, 172943, 175075, 177113, 178924, 180741, 182565, 184040, 185139, 186406, 188156, 189962, 191478, 193257, 196094, 199842, 203588, 206776, 209529, 211988, 214025, 215603, 216857, 217824, 218592, 219628, 221389, 223602, 225487, 226701, 227524, 228159, 228492, 228635, 229055, 229967, 231139, 232462, 234161, 236187, 237956, 239088, 239972, 241192, 242728, 244116, 245169, 246122, 247250, 248683, 250524, 252865, 255696, 258954, 262544, 266170, 269265, 271394, 272783, 274299, 276803, 280417, 284335, 287376, 288907, 289344, 289713, 290688, 292102, 293347, 294182, 295147, 297163, 300617, 304786, 308349]
52171C08349K246J368J351J625J635J490J443J322Q10Qo75r48p29j43L67K88l12
52154C19495p79p08m01k49j51J8o3o58j348j533j260j022j003j066j212j421j295
52137C05344n82J38Pq82j536j422j068j151j649k122k320k166j630r78p38j064
52121B86181j401j224q36j033k008l043l297k697j899j581j888k442k691k246
52107B57895j116K13J008Q52Kr10j454j587j395r96o87p44j004j003n99j40K26
52090B48561Q19J742K345J973Q93L5j28J10L47N61Q75J329J910K481K696K355
52074B68904J866J997K916L862L863K735J196J78J18P22J285J315R45O99Q75J217
52058B94693J227P19Qm80o12n50l66K7N31P41N23M83J318K776L786L655K717J646
$$ y = [308349, 310595, 311963, 313314, 314939, 316574, 318064, 319507, 320829, 321639, 321647, 320972, 320024, 319295, 319152, 319519, 319807, 319495, 318716, 318008, 317607, 317358, 317207, 317225, 317162, 316504, 315156, 313623, 312363, 311341, 310338, 309272, 308060, 306639, 305344, 304762, 304900, 304907, 304025, 302489, 301067, 299999, 298848, 297199, 295077, 292757, 290591, 288961, 287983, 287245, 286181, 284780, 283556, 282720, 281687, 279679, 276636, 273339, 270642, 268743, 267162, 265274, 262832, 260141, 257895, 256779, 256992, 258000, 258852, 258854, 257944, 256490, 254903, 253508, 252512, 251825, 251081, 250077, 249074, 248475, 248335, 248561, 249380, 251122, 253467, 255440, 256333, 256368, 256240, 256350, 256697, 257258, 258133, 259462, 261372, 263853, 266549, 268904, 270770, 272767, 275683, 279545, 283408, 286143, 287339, 287517, 287635, 288357, 289642, 290957, 291902, 292601, 293476, 294693, 295920, 296639, 296647, 296167, 295555, 295005, 294639, 294666, 295197, 295938, 296461, 296944, 298262, 301038, 304824, 308479, 311196, 312842]
52040C12842P16l5m79n94o25o89n33m5M22O00P72J277J849J906J277K37q29j481
52022C16588j333n81j37o28j594k141k107j999k021j938j674j459j357j245j160
52007B95214j137q42j2R20J310J295J532K005J972J210M57L00M26L02J7j1K80
51990C05238N92O44K70m96j308j789k043k458l002l287l447m143n405o229n887
51975B67250n056m923n579o032n680n062n065n861o775o963o250n326n047n468
51961A88163n807n458m680m052l676l340l126l291l693l873l728l601l654l586
51947A32598l137k570k360k555k751k619k288k139k239k217j716r03l22l11o83
51932A03788j053j194j012m50L42Q97P84J00n47n75N7Q06J009M58l92q54o58j43
$$ y = [312842, 313558, 313523, 313044, 312450, 311825, 311136, 310603, 310558, 310980, 311580, 312352, 313629, 315478, 317384, 318661, 318898, 318069, 316588, 315255, 314674, 314537, 313909, 312315, 310174, 308067, 306068, 304047, 302109, 300435, 298976, 297619, 296374, 295214, 294077, 293235, 293223, 294143, 295453, 296748, 298280, 300285, 302257, 303467, 303924, 304224, 304650, 304952, 304969, 304958, 305238, 305830, 306474, 306744, 306248, 304940, 303151, 301108, 298650, 295648, 292361, 288914, 284771, 279366, 273137, 267250, 262194, 257271, 251692, 245660, 239980, 234918, 229853, 223992, 217217, 210254, 204004, 198678, 193631, 188163, 182356, 176898, 172218, 168166, 164490, 161150, 158024, 154733, 151040, 147167, 143439, 139838, 136184, 132598, 129461, 126891, 124531, 121976, 119225, 116606, 114318, 112179, 109940, 107723, 106007, 105104, 104782, 104471, 103788, 102735, 101541, 100529, 100079, 100421, 101318, 102102, 102202, 101655, 101080, 101137, 101943, 102952, 103410, 103018, 102164, 101506, 101363]
51914A01363K00J66j47n59q50p56j55P20J377J457J052O09M86O05N91L01Om3m0
51895A06383l51r00j160q29k46mk44n05k09O75J451J295J64j095j669j582j301
51878I9873q51J08J389K074J519J65q91r96m28J3k10q28j009k88P74J145M83n59
51860A01483j174j132o79j81O1M6K59J164K389K969K537J702J034L98k97n00O6
51843A10145N61N6r15r79j7N28k53j353j242O9J208J338R96J005J304J246O73
51826A14370J88L45R37J255R27K71j75k64k48l10k96Q9Q60J685K158K128J734
51809A25654J164N64J83L82J197K073K329J977J775K328L363M082M028L403K713
51794A57215K277K053J788J408J281J927L352M862N714N848N773N879O063N940
$$ y = [101363, 101563, 101729, 101582, 101023, 100173, 99417, 99262, 99982, 101359, 102816, 103868, 104477, 104963, 105568, 106159, 106460, 106466, 106423, 106383, 106032, 105132, 103972, 103143, 102897, 102893, 102649, 102144, 101935, 102610, 104061, 105356, 105520, 104425, 102756, 101174, 99873, 99022, 99130, 100519, 102593, 104112, 104277, 103386, 102390, 101962, 101975, 101765, 100937, 99928, 99640, 100414, 101559, 102042, 101483, 100309, 99177, 98498, 98317, 98378, 98424, 98683, 99847, 102236, 105205, 107742, 109444, 110478, 110876, 110579, 110079, 110145, 110706, 110762, 109847, 108868, 108851, 109379, 109126, 107773, 106531, 106600, 107808, 109146, 110142, 111147, 112451, 113697, 114370, 114558, 114903, 115840, 117095, 118022, 118293, 118118, 117854, 117606, 117296, 117000, 117089, 117949, 119634, 121792, 123920, 125654, 126818, 127382, 127565, 127947, 129144, 131217, 133546, 135523, 137298, 139626, 142989, 147071, 151099, 154502, 157215, 159492, 161545, 163333, 164741, 166022, 167949, 171301, 176163, 181877, 187725, 193498, 199377, 205440, 211380]
51780B11380N312M427L796L597L215J728r81l829n568n962n664n261m813m210
51766A97167l457k586j758j374j705k342k466j804r34n29o65j060j511j863j907
51751A71206j643j370j225r45m17r5l68q24p52k21M5j63k75m0o1p98j633j624
51733A58797q02k2L00N34R39J122O89j27p81j060j056q27l90Q5L74M71N46O93
51715A59485R00J168J545K011K445K679K589K197J732J447J379J426J571J828
51701A84402K020J914J559J149N07p26k286l219l010k275j863j740j384r10j030
51686A73108j958l078l767l902l505k538j347o90r38j550j724j299p28l85k00
51671A45499M9M62R30J230J122N22l89j251j811k138k505k906k805j719j06Q12
$$ y = [211380, 216692, 221119, 224915, 228512, 231727, 233455, 232474, 228645, 223077, 217115, 211451, 206190, 201377, 197167, 193710, 191124, 189366, 187992, 186287, 183945, 181479, 179675, 178741, 178212, 177547, 176487, 174976, 173113, 171206, 169563, 168193, 166968, 166023, 165606, 165511, 165143, 164319, 163567, 163346, 163391, 163228, 162953, 162913, 162852, 162054, 160421, 158797, 157995, 157973, 158273, 158807, 159746, 160868, 161557, 161430, 160649, 159589, 158533, 157706, 157316, 157401, 157775, 158246, 158792, 159485, 160385, 161553, 163098, 165109, 167554, 170233, 172822, 175019, 176751, 178198, 179577, 181003, 182574, 184402, 186422, 188336, 189895, 191044, 191551, 190825, 188539, 185320, 182310, 180035, 178172, 176432, 175048, 174138, 173108, 171150, 168072, 164305, 160403, 156898, 154360, 153013, 152323, 151385, 149835, 148111, 146812, 146084, 145699, 145499, 145548, 146010, 146940, 148170, 149292, 149814, 149425, 148174, 146363, 144225, 141720, 138814, 136009, 134290, 134184, 134996]
51655A34996M57l06k41P28J639J923K000K515L623N077O350O643N462L382J608
51640A75856N93k59j358k267k647l031l886m611m367l470l007l218l189k267r79
51625A37893k40k32m13l07M8K77J15k62l80o9K10q9q05j157o57M07J485K333K868
51606A41025K822J931M66q01j202o43M75J577K160J965J105J5q57j290j261q38
51590A46649k38K02L28L77N82P24M48l4q8M72J174J726K399L217L466K646J385
51573A65435O30L64m1m77k49N44Q69K60m94o04l24k90n48q22j152j637j950j751
51555A57763j222p93o12p03j185j915k219j569k77Q04J136P32o7p05o50M0O58
51538A49216P59P26J008J267Q98J09k34K51J092J697J917J851J583J269J104J170
$$ y = [134996, 135453, 135147, 134906, 135634, 137273, 139196, 141196, 143711, 147334, 152411, 158761, 165404, 170866, 174248, 175856, 176449, 176190, 174832, 172565, 169918, 166887, 163001, 158390, 154023, 150553, 147546, 144328, 141139, 138872, 137893, 137653, 137421, 137008, 136701, 136749, 137026, 137141, 136879, 136499, 136430, 136640, 136551, 135746, 134589, 133932, 134339, 135824, 138157, 141025, 143847, 145778, 146244, 145443, 144241, 143598, 144073, 145650, 147810, 149775, 150880, 150895, 150038, 148748, 147487, 146649, 146411, 146613, 146941, 147318, 147900, 148624, 149072, 149038, 148950, 149422, 150596, 152322, 154721, 157938, 161404, 164050, 165435, 166065, 166429, 166388, 165911, 165662, 166206, 167075, 167335, 166841, 166237, 165913, 165623, 165075, 164253, 163101, 161464, 159514, 157763, 156541, 155748, 155136, 154433, 153248, 151333, 149114, 147545, 147268, 148072, 149208, 149940, 149873, 149168, 148518, 148558, 149216, 149975, 150701, 151709, 152976, 153874, 153983, 153749, 154000, 155092, 156789, 158706, 160557, 162140, 163409, 164513, 165683]
51522A65683J440J815K041J774J030K96n9k13m05m20oN50P18M63J43q7l41o19
51504A73803q65j157j429j249m77K58L67K87Q61J890K307J811J332J605K184K330
51488A83858K134K080K114J815J217P91O69M49j22o55n64J75R02R16J65q28j583
51471A93533k021k212k138j892j783j987k243k208j942j770j876k187k477k384
51457A64413j619m58L07K44k61o44r03j201j326j101r57j315j772j637j011n34
51441A50225k82J36N57L17o18j510j950k209k354j977j080l48j93k58k45m36r22
51424A36853j159p65j79m1m41j163k040k660k457j572r33r34p97J02J027R25J09
51407A23875j67M97J253J324Q20K30j77l13k06j84n42j048j140o40O9N25M66k52
$$ y = [165683, 167123, 168938, 170979, 172753, 173783, 174079, 174020, 173807, 173402, 172982, 172976, 173526, 174244, 174707, 174850, 174763, 174422, 173803, 172938, 171781, 170352, 169103, 168626, 168884, 169251, 169538, 170399, 172289, 174596, 176407, 177739, 179344, 181528, 183858, 185992, 188072, 190186, 192001, 193218, 194009, 194678, 195127, 195005, 194350, 193786, 193961, 194863, 195779, 195944, 195116, 193533, 191512, 189300, 187162, 185270, 183487, 181500, 179257, 177049, 175107, 173337, 171461, 169274, 166797, 164413, 162794, 162336, 162643, 162887, 162626, 161982, 161079, 159878, 158552, 157451, 156494, 155179, 153407, 151770, 150759, 150225, 149943, 150079, 150636, 150953, 150335, 148825, 146875, 144666, 142312, 140335, 139255, 138907, 138714, 138456, 138211, 137775, 136853, 135694, 134929, 134750, 134709, 134268, 133105, 131065, 128405, 125948, 124376, 123443, 122509, 121712, 121814, 122841, 123766, 123875, 123708, 124205, 125458, 126782, 127602, 127832, 127655, 127342, 127136, 126952, 126410, 125362, 124222, 123582, 123651, 124176, 124642, 124390]
51389A24390j488k616k994k625k030j508j001o23o67r78r46l35L48N74M59M27
51373A08387N79P94J170J837K459K415J610P40N03P93R77Q18P01R04J116R03L73
51356A27079j19o12j376k183k407j945j432j305j248r47p78j157j645j467o59
51341A07799j6P1k9Kp4n02j079j527j895k211k145j482o47k93m89p22o92o18p03
51322I2748o81k27M30P19M45k2l05m65o93q85p83m29j52j47k63k44J3M21P60Q25
51302I1065O96P81J307J825J619O67k04k55L73R96J184R84O01K12n3j93l92p78
51284A00435j240j612j898k124k128j740j096n60l34k75j52N6J18j32m64l46M01
51267H6909J191J229M94k40m74n71j003j470j291m57L13M85K52M6m4j78l49l25
$$ y = [124390, 122902, 120286, 117292, 114667, 112637, 111129, 110128, 109505, 108838, 107860, 106914, 106579, 106927, 107501, 107960, 108387, 108966, 109760, 110930, 112767, 115226, 117641, 119251, 119991, 120494, 121287, 122264, 123082, 123783, 124687, 125803, 126706, 127079, 126960, 126348, 124972, 122789, 120382, 118437, 117005, 115700, 114452, 113505, 112727, 111570, 109925, 108458, 107799, 107783, 107854, 107825, 107827, 107753, 107251, 106172, 104645, 102750, 100539, 98394, 96912, 96265, 95972, 95483, 94761, 94069, 93451, 92748, 92067, 91840, 92270, 92989, 93434, 93412, 93107, 92642, 91949, 91064, 90281, 89852, 89700, 89553, 89290, 89046, 89059, 89480, 90240, 91065, 91761, 92542, 93849, 95674, 97293, 97960, 97756, 97501, 97874, 98870, 100054, 101038, 101639, 101851, 101798, 101605, 101213, 100435, 99195, 97583, 95685, 93561, 91433, 89693, 88597, 88037, 87703, 87428, 87276, 87332, 87450, 87318, 86854, 86508, 86909, 88100, 89329, 89823, 89583, 89109, 88538, 87535, 86065, 84774, 84317, 84630, 85115, 85367, 85413, 85369, 85191, 84842, 84517]
51249H4517L6N47P97N59J52K04R08J634J574O87k44n56l38l6J87L84M40J36l64
51230I1224n39j79K96L61M5k63l94m66m44j21M44Q69R74R44Q82O07J29j38K2K28
51210I4481J37M6L16O30M21j33l48j25k7k58l37J8L67K00l84r19j080p84k28Q2
51190I2075j97o49m47N07J425J704J563J393J157P66M13J26m12j166j490j067
51174I5701n26m71n17J0Q24J017M33j07K5N49Q23O00P9m49p69q49p54n06p4M30
51154I5469P99J048J298J302N35r57k243k458j729q97n78p96j133j000j37Q77
51138H9400J090M22j71o9K29J50P8N11R86P22m5m53l29j65j16K4O1l49q32o99
51118I0445j71j58p14p95J48J310J664J243P77O81Q00Q09N32L9m05o56q27q68
$$ y = [84517, 84553, 85100, 85897, 86456, 86608, 86812, 87720, 89354, 90928, 91615, 91371, 90815, 90477, 90441, 90628, 91012, 91452, 91588, 91224, 90685, 90506, 90802, 91163, 91208, 90945, 90551, 90085, 89641, 89520, 89964, 90833, 91807, 92751, 93633, 94240, 94369, 94231, 94253, 94481, 94618, 94664, 94980, 95610, 96031, 95898, 95550, 95425, 95398, 95140, 94803, 94821, 95188, 95388, 95004, 94085, 93005, 92221, 91993, 92075, 91878, 91229, 90782, 91289, 92714, 94418, 95981, 97374, 98531, 99297, 99710, 99836, 99424, 98258, 96768, 95701, 95175, 94704, 94187, 94197, 95021, 96038, 96471, 96364, 96389, 96938, 97761, 98361, 98440, 97991, 97222, 96373, 95619, 95113, 95039, 95469, 96268, 97316, 98614, 99916, 100451, 99494, 97251, 94793, 93064, 92167, 91589, 90793, 89660, 88660, 88523, 89400, 90490, 90912, 90741, 90672, 90901, 91051, 91129, 91640, 92626, 93348, 93303, 92850, 92521, 92356, 92240, 92264, 92325, 91976, 91144, 90445, 90274, 90116, 89402, 88607, 88755, 90065, 91729, 92972, 93749, 94430, 95230, 96039, 96571, 96610, 96205, 95549, 94722, 93854]
51100I3854l32R43K216K560J982J199N81O3j59J50N19K95j73L1P96J058O03M54
51082A06640J019J251L39q52j053l67J64J62P8K01L34L20K09R2J31M47O34kj374
51063A08373k263j715k15J004J353R86Q1j134j960j738o89K77N24Q2o55j138q88
51046A00285q1M11O0n17l91L84J008J208J463K012K413K237J645J045O61N82Q34
51029A15259J259J522J430J051N63J04k41m97p21q56p91n88l62P6R42J804J803
51012A21757Q60l6k05l07j212k456k727j648j50Q08J060P95J83m36o21l86j77
50995A15102j77j42K6P3o7k6N33J442K261K607K315J572R42R19J393J891K271
50978A32935K774L388L633L104J982Q53K88M44R42J166R63Q45J191J608J535J205
$$ y = [93854, 93522, 94465, 96681, 99241, 101223, 102422, 103003, 103066, 102907, 103057, 103576, 103871, 103698, 103729, 104525, 105583, 106186, 106640, 107659, 108910, 109249, 108397, 107344, 106977, 107141, 107303, 107381, 107582, 107916, 108236, 108445, 108537, 108668, 109115, 109749, 109747, 108373, 106110, 104395, 104180, 105184, 106537, 107523, 107604, 106470, 104510, 102772, 102083, 102360, 102884, 102966, 102311, 101173, 100285, 100204, 100615, 100675, 100158, 99767, 100151, 101159, 102367, 103830, 105842, 108255, 110492, 112137, 113182, 113843, 114425, 115259, 116518, 118040, 119470, 120521, 121084, 121188, 120947, 120450, 119729, 118873, 118082, 117494, 117132, 117208, 118150, 119954, 121757, 122617, 122581, 122376, 122069, 120857, 118401, 115674, 114026, 113876, 114684, 115744, 116539, 116722, 116286, 115665, 115279, 115102, 114925, 114783, 114809, 114882, 114815, 114789, 115322, 116764, 119025, 121632, 123947, 125519, 126461, 127380, 128773, 130664, 132935, 135709, 139097, 142730, 145834, 147816, 148669, 148957, 149401, 150343, 151509, 152472, 153317, 154508, 156116, 157651, 158856]
50962A58856J337K053K800L214L334L019K057R47P04J563K633L164L468M143N100
50947A98392N863O273O445O496O747P651R025R927R874R692J0447J1884J2783
50934C11499J2637J2163J2092J2194J1723J0296Q112N644L311J249p01k658m383
50921C93178n561o315p128q213r216r662r510r219r353j0012j0576j0155q515
50908B79743o470n086m602m368l740k729j718r20k48M54J240K023K671L153L533
50893B62936L776L691L261K840K820L166L531L741L859L730K972J496j25j105
50879C00589j148o21j29k7k70n61p31r07j342k031k691l036k985k629k184j970
50863B77327k169k475k242j187J79R97R32M29J51L07N69N70M15O51J583K724L155
$$ y = [158856, 160193, 162246, 165046, 168260, 171594, 174613, 176670, 177617, 178321, 179884, 182517, 185681, 189149, 193292, 198392, 204255, 210528, 216973, 223469, 230216, 237867, 246892, 256819, 266693, 276385, 286832, 298716, 311499, 324136, 336299, 348391, 360585, 372308, 382604, 390716, 396360, 399671, 400920, 400219, 397561, 393178, 387617, 381302, 374174, 365961, 356745, 347083, 337573, 328354, 319001, 308989, 298413, 288258, 279743, 273273, 268187, 263585, 259217, 255477, 252748, 251030, 250110, 249862, 250316, 251556, 253579, 256250, 259403, 262936, 266712, 270403, 273664, 276504, 279324, 282490, 286021, 289762, 293621, 297351, 300323, 301819, 301694, 300589, 299441, 298820, 298691, 298664, 298394, 297833, 297102, 296195, 294853, 292822, 290131, 287095, 284110, 281481, 279297, 277327, 275158, 272683, 270441, 269254, 269433, 270430, 271362, 271791, 271942, 272249, 272818, 273388, 273803, 274454, 276037, 278761, 281916]
50846B81916K600J861J934K891L982M650N017N356N600N652N766O280P131Q000
50832C48636Q807R780J1124J2834J4786J6718J8264J9265K0093K1324K3108K5131
50820E49870K7152K9219L1211L2613L2977L2378L1164K9532K7530K5216K2473
50809H71335J8877J4205R064M645J627m53k558m966o888p406o611n537m825l923
50795H76586j999O07K580L278L395L807M529N348O652Q773J1079J2795J4514J7696
50781I69640K2673K8079L2481L5611L7672L8457L7738L5843L3101K9308K4373
50770A324976J8976J3900R114M207n56m521p786j1276j5596k0449k5293k9888
50758A255808l4061l7424l9646m0699m0713l9928l8792l7714l6543l4693l1968
$$ y = [281916, 284516, 286377, 288311, 291202, 295184, 299834, 304851, 310207, 315807, 321459, 327225, 333505, 340636, 348636, 357443, 367223, 378347, 391181, 405967, 422685, 440949, 460214, 480307, 501631, 524739, 549870, 577022, 606241, 637452, 670065, 703042, 735420, 766584, 796116, 823646, 848862, 871335, 890212, 904417, 913481, 918126, 919753, 919300, 916742, 911776, 904888, 897482, 890871, 885334, 880509, 876586, 874587, 875194, 877774, 881052, 884447, 888254, 892783, 898131, 904783, 913556, 924635, 937430, 951944, 969640, 992313, 1020392, 1052873, 1088484, 1126156, 1164613, 1202351, 1238194, 1271295, 1300603, 1324976, 1343952, 1357852, 1366966, 1371173, 1370617, 1366096, 1358310, 1347034, 1331438, 1310989, 1285696, 1255808, 1221747, 1184323, 1144677, 1103978, 1063265, 1023337, 984545, 946831, 910288, 875595, 843627]
50747H43627k8900k6104k3606k1033j8142j4948j1560q195n148k520j12K296M720
50734F90375P143R649J2163J4348J6066J7767K0029K2782K5251K6653K6726K5564
50722I14516K3234J9723J5224J0317N762J933j449m851q111j0435j1324j1156
50710I43383j0552r488p604n161k995j394M13L238O841J0264J3022J5449J7945
50697I73361K0346K2177K3237K3669K3630K3109K2003K0225J7788J4912J2056
50686A196513R711Q103P141O642O511O702P125P685Q323Q921R264R238R048R085
50672A310012R554J0406J1739J4128J8338K4653L2586M1255N0026N8652O6919
50661A648268P4239P9792Q3006Q3789Q2243P8409P2470O5104N7300M9787M2750
$$ y = [843627, 814727, 788623, 765017, 743984, 725842, 710894, 699334, 691139, 685991, 683471, 683359, 685655, 690375, 697518, 707167, 719330, 733678, 749744, 767511, 787540, 810322, 835573, 862226, 888952, 914516, 937750, 957473, 972697, 983014, 988776, 990709, 989260, 984409, 976298, 965863, 954539, 943383, 932831, 923343, 915739, 910578, 907583, 906189, 906602, 909840, 916681, 926945, 939967, 955416, 973361, 993707, 1015884, 1039121, 1062790, 1086420, 1109529, 1131532, 1151757, 1169545, 1184457, 1196513, 1206224, 1214327, 1221468, 1228110, 1234621, 1241323, 1248448, 1256133, 1264456, 1273377, 1282641, 1291879, 1300927, 1310012, 1319566, 1329972, 1341711, 1355839, 1374177, 1398830, 1431416, 1472671, 1522697, 1581349, 1648268, 1722507, 1802299, 1885305, 1969094, 2051337, 2129746, 2202216, 2267320, 2324620, 2374407, 2417157]
50650B417157L6103K9727K3438J7002J0379L746k764r082j4804j9225k2082k3988
50638B445607k5604k6649k6233k4061k0682j6525j1434n457M83N212Q327J0146
50626B313130J0850J0269Q467O007L445Q16k111n252q082j0129j1381j2099j2169
50613B291761j0855p462k278L413Q411J2481J6023J9057K0945K1006J9059J5266
50601B406827R768K792n141j3409k1756l0333l9220m7980n5853o2284o7125p0389
50589B005897p2001p1859p0072o6986o3081n8856n4688n0587m6213m1402l6609
50578A373543l2674l0105k8728k7936k7075k5702k3813k1839k0129j8425j6193
50567A100924j3474j0904q784o695m288k002m71M48J486K966M553N946P382R293
$$ y = [2417157, 2453260, 2482987, 2506425, 2523427, 2533806, 2537552, 2534788, 2525706, 2510902, 2491677, 2469595, 2445607, 2420003, 2393354, 2367121, 2343060, 2322378, 2305853, 2294419, 2288962, 2289445, 2294657, 2302984, 2313130, 2323980, 2334249, 2342716, 2348723, 2352168, 2352984, 2350873, 2345621, 2337539, 2327410, 2316029, 2303930, 2291761, 2280906, 2273444, 2271166, 2274579, 2282990, 2295471, 2311494, 2330551, 2351496, 2372502, 2391561, 2406827, 2416595, 2419387, 2414246, 2400837, 2379081, 2348748, 2309528, 2261548, 2205695, 2143411, 2076286, 2005897, 1933896, 1862037, 1791965, 1724979, 1661898, 1603042, 1548354, 1497767, 1451554, 1410152, 1373543, 1340869, 1310764, 1282036, 1254100, 1227025, 1201323, 1177510, 1155671, 1135542, 1117117, 1100924, 1087450, 1076546, 1067762, 1061067, 1056779, 1054777, 1054306, 1054754, 1056240, 1059206, 1063759, 1069705, 1077087, 1086380]
50553A086380J1835J4861J8235K2084K6746L2385L8664M4981N1136N7434O3899
50542A468640O9881P4662P8145Q0418Q1054P9552P6258P2256O8397O5099O2888
50531B277250O2219O2618O2860O2390O1925O2274O3213O3977O4271O4293O4228
50520B971518O4375O5397O7792P1163P4441P6754P7677P6929P4349P0032O3985
50509C754412N5669M4433L0481J4975r74j7051l3310m9373o4324p7279q7768r5552
50497C474339j00203j01107r8016r1544q2824p2501o0351m6216l1141j7077n399
50486B767960L887J1246J6320J7938J5325Q842o43j2812k7822m5139o2816p8419
50474B613867r0620r9639j06109j09979j10807j08812j05127j00859r6259r0970
$$ y = [1086380, 1098215, 1113076, 1131311, 1153395, 1180141, 1212526, 1251190, 1296171, 1347307, 1404741, 1468640, 1538521, 1613183, 1691328, 1771746, 1852800, 1932352, 2008610, 2080866, 2149263, 2214362, 2277250, 2339469, 2402087, 2464947, 2527337, 2589262, 2651536, 2714749, 2778726, 2842997, 2907290, 2971518, 3035893, 3101290, 3169082, 3240245, 3314686, 3391440, 3469117, 3546046, 3620395, 3690427, 3754412, 3810081, 3854514, 3884995, 3899970, 3898996, 3881945, 3848635, 3799262, 3734938, 3657659, 3569891, 3474339, 3374136, 3273029, 3175013, 3083469, 3000645, 2928144, 2867793, 2821577, 2790436, 2773359, 2767960, 2771847, 2783093, 2799413, 2817351, 2832676, 2841518, 2840875, 2828063, 2800241, 2755102, 2692286, 2613867, 2523247, 2423608, 2317499, 2207520, 2096713, 1987901, 1882774, 1781915, 1685656, 1594686]
50464A594686q4946p8734p2813o7011o0904n4712m9275m4988m1201l6997l2314
50453I70791k7892k4291k1445j9010j6639j4051j1251q797p207o150m820l129
50441H06109j768r07K72K261M338N720O912Q834J1127J2592J3225J4544J7520
50428I00779K1171K3928K5691K7745L0989L5050L9164M3186M7394N1697N5538
50417A302332N8539O0917O3078O5039O6451O7106O7118O6697O6041O5490O5430
50406B014238O5821O6156O5991O5256O3837O1293N7389N2679M8005M3452L8213
50395B642330L1583K3791J5723P990L54p912j7215k7255l7486m7704n7806o7186
50383B459207p4928q0739q5000q7708q7984q5110p9486p2114o3639n4562m5723
$$ y = [1594686, 1509740, 1431006, 1358193, 1291182, 1230278, 1175566, 1126291, 1081303, 1040102, 1003105, 970791, 942899, 918608, 897163, 878153, 861514, 847463, 836212, 827415, 820208, 814058, 809238, 806109, 804341, 803434, 803706, 805967, 810305, 816025, 822937, 831771, 842898, 855490, 868715, 883259, 900779, 921950, 945878, 971569, 999314, 1030303, 1065353, 1104517, 1147703, 1195097, 1246794, 1302332, 1360871, 1421788, 1484866, 1549905, 1616356, 1683462, 1750580, 1817277, 1883318, 1948808, 2014238, 2080059, 2146215, 2212206, 2277462, 2341299, 2402592, 2459981, 2512660, 2560665, 2604117, 2642330, 2673913, 2697704, 2713427, 2721417, 2721771, 2713859, 2696644, 2669389, 2631903, 2584199, 2526393, 2459207, 2384279, 2303540, 2218540, 2130832, 2042848, 1957738, 1878252, 1806138, 1742499, 1687937, 1642214]
50372A642214l7729l0181k2446j4923q683l999l83J928J693j661p063j3033j9143
50359A486591k5593l2063l7782m2384m5883m7973m8095m6306m3577m1008l8962
50348A036965l7037l4685l1823k8828k6071k3546k1102j8843j6975j5309j3328
50337G69418j0876q488o811n900n188m012k219m21M23Mq76j158p84n33p02o80
50321G21197l2P54J026R22J008J387J783K206K941M016N139O152P142Q152R151
50306G72944J0225J1478J2851J4273J5912J7913K0051K1918K3397K4589K5385
50295I70936K5470K4736K3326K1225J8246J4559J0898P938N634L340N05k898o601
50282A117314j0370j4097j7690k1079k4248k7096k9181k9868k8941k6890k4501
$$ y = [1642214, 1604485, 1574304, 1551858, 1536935, 1528252, 1524253, 1523870, 1525798, 1527491, 1525830, 1518767, 1505734, 1486591, 1460998, 1428935, 1391153, 1348769, 1302886, 1254913, 1206818, 1160512, 1116935, 1075927, 1036965, 999928, 965243, 933420, 904592, 878521, 854975, 833873, 815030, 798055, 782746, 769418, 758542, 750054, 743243, 737343, 732155, 728143, 725924, 725503, 725926, 725930, 725054, 723896, 723112, 722579, 721877, 721197, 721165, 721919, 722945, 723867, 724875, 726262, 728045, 730251, 733192, 737208, 742347, 748499, 755641, 763793, 772944, 783169, 794647, 807498, 821771, 837683, 855596, 875647, 897565, 920962, 945551, 970936, 996406, 1021142, 1044468, 1065693, 1083939, 1098498, 1109396, 1117334, 1122968, 1126308, 1126813, 1123915, 1117314, 1106944, 1092847, 1075157, 1054078, 1029830, 1002734, 973553, 943685, 914744, 887854, 863353]
50271H63353k2269k0383j9022j8188j7461j6371j5022j3877j2947j1809j0516
50260F85488r797j0015j0486j0354r644q943q425p836p181o763o569o242n725
50247E77508n384n402n465n245m830m477m173l644k727j586o75m03p60j271j460
50232E30006j288j057r36p98m22K63J069J557J288K91q02j358j387j380j625j942
50216E21479k050j869j508j146r20p33l12L81Q86Q05L79J63J96K2m43o68l10K69
50198E14621N65N83N86N78N00N88J037J504J506J270J582K708M011M819N198N497
50182E47153N622N271M612M191M192M318M384M456M345L568K230J394J969L485
50168F01190M590M666M339M400M853N289N602N953O362O785P316P952Q301P941
$$ y = [863353, 841084, 820701, 801679, 783491, 766030, 749659, 734637, 720760, 707813, 696004, 685488, 675691, 665676, 655190, 644836, 635192, 626249, 617824, 609988, 602807, 596044, 589475, 583233, 577508, 572124, 566722, 561257, 556012, 551182, 546705, 542532, 538888, 536161, 534575, 533900, 533497, 532737, 531466, 530006, 528718, 527661, 526725, 525927, 525505, 525768, 526837, 528394, 529682, 529973, 529171, 527813, 526426, 525046, 523421, 521479, 519429, 517560, 516052, 514906, 513986, 513253, 512941, 513322, 514208, 515013, 515392, 515555, 515751, 515773, 515330, 514662, 514352, 514621, 515186, 515769, 516355, 516933, 517433, 518021, 519058, 520562, 522068, 523338, 524920, 527628, 531639, 536458, 541656, 547153, 552775, 558046, 562658, 566849, 571041, 575359, 579743, 584199, 588544, 592112, 594342, 595736, 597705, 601190, 605780, 610446, 614785, 619185, 624038, 629327, 634929, 640882, 647244, 654029, 661345, 669297, 677598, 685539]
50154F85539P054O334O227O553O927P256P626P860P528O479N262M705N047N626
50140G76023N676N201M828M869N036N084N239N638N796N127L850K861K738L186
50126H41152L610L867M207M739N235N551O021P228R356J1929J4315J6367J8423
50113I52000K0795K3499K6466K9793L3624L8027M3033M8718N5184O2526P0709
50102A404374P9322Q7631R5074J01470J06389J08555J06630J00603R1795Q1417
50092B363260O9890N7816M6745L8197L2387K8410K5238K1937J7320J0318N63j1797
50080B700284k6628m3408o0595p6221q9194r9379j06509j09839j09102j05102
50070A874307r9051r1798q3940p6051o8387o0801n3319m6513m0928l6418l2347
$$ y = [685539, 692593, 698927, 705154, 711707, 718634, 725890, 733516, 741376, 748904, 755383, 760645, 765350, 770397, 776023, 781699, 786900, 791728, 796597, 801633, 806717, 811956, 817594, 823390, 828517, 832367, 835228, 837966, 841152, 844762, 848629, 852836, 857575, 862810, 868361, 874382, 881610, 890966, 902895, 917210, 933577, 952000, 972795, 996294, 1022760, 1052553, 1086177, 1124204, 1167237, 1215955, 1271139, 1333665, 1404374, 1483696, 1571327, 1666401, 1767871, 1874260, 1982815, 2089445, 2190048, 2281843, 2363260, 2433150, 2490966, 2537711, 2575908, 2608295, 2636705, 2661943, 2683880, 2701200, 2711518, 2712081, 2700284, 2673656, 2630248, 2569653, 2493432, 2404238, 2304859, 2198350, 2088511, 1979409, 1874307, 1775256, 1683458, 1599518, 1523467, 1455080, 1394279, 1340960, 1294447, 1253519, 1217101, 1184754]
50059A184754k8290k4284k0610j7591j5487j4319j3831j3658j3406j2618j1030
50048I99630r052p609p202p287o857n567m055l266l538m312m594l842k501j465
50034I28483j024o23K42J339K185K807L495M131M389M573N487P243Q811R233Q900
50019I89671R009J0037J1393J2497J3470J4439J4892J4283J3000J2113J2200J2917
50007A139921J3691J4411J5250J6290J7544J9094K0937K2900K4835K6778K8815
49996A360466L1104L4041L8146M3571M9969N7050O4960P3981Q4172R5509J07953
49985B040922J21073J33891J45441J55126J62167J65214J63270J56776J47188
49976C391068J35711J23127J10768J00453R2907Q6905Q0469P2567O3157N1948
$$ y = [1184754, 1156464, 1132180, 1111570, 1093979, 1078492, 1064173, 1050342, 1036684, 1023278, 1010660, 999630, 990578, 982969, 975767, 968480, 961623, 956056, 952001, 948735, 945197, 940885, 936291, 932449, 929948, 928483, 927459, 926836, 927078, 928417, 930602, 933409, 936904, 941035, 945424, 949997, 955484, 962727, 971538, 980771, 989671, 998680, 1008717, 1020110, 1032607, 1046077, 1060516, 1075408, 1089691, 1102691, 1114804, 1127004, 1139921, 1153612, 1168023, 1183273, 1199563, 1217107, 1236201, 1257138, 1280038, 1304873, 1331651, 1360466, 1391570, 1425611, 1463757, 1507328, 1557297, 1614347, 1679307, 1753288, 1837460, 1932969, 2040922, 2161995, 2295886, 2441327, 2596453, 2758620, 2923834, 3087104, 3243880, 3391068, 3526779, 3649906, 3760674, 3861127, 3954034, 4040939, 4121408, 4193975, 4257132, 4309080]
49966D309080L7857J9691k943k9306n7587q5263j09943j30330j46446j58802j67509
49955C478499j72396j73771j72576j69507j64418j56962j47696j37908j28373
49946B054892j18815j08805r8637q8992q0140p1944o4369n7495n1269m5622m0756
49935A228048l6816l3522l0452k7628k5349k3576k1939k0317j8934j7898j7054
49924I54563j6388j6061j6004j5805j5225j4412j3582j2717j1672j0354q750p001
49912G96592n459m371l573k749j946j484j347j095l84O63J630K081J746Q01l1
49897G81074o9O32J451J961K243K499K826L318L995M591M863N066N672O673P649
49882H34444Q538R754J1517J3569J5650J7780J9952K2102K4462K7395L0863L4563
$$ y = [4309080, 4346937, 4366628, 4363685, 4334379, 4276792, 4191529, 4081586, 3951256, 3804810, 3646008, 3478499, 3306103, 3132332, 2959756, 2790249, 2625831, 2468869, 2321173, 2183265, 2054892, 1936077, 1827272, 1728635, 1639643, 1559503, 1487559, 1423190, 1365695, 1314426, 1268804, 1228048, 1191232, 1157710, 1127258, 1099630, 1074281, 1050705, 1028766, 1008449, 989515, 971617, 954563, 938175, 922114, 906110, 890305, 875080, 860668, 847086, 834369, 822697, 812343, 803593, 796592, 791133, 786762, 783189, 780440, 778494, 777010, 775663, 774568, 774184, 774847, 776477, 778558, 780304, 781105, 781074, 781005, 781637, 783088, 785049, 787292, 789791, 792617, 795935, 799930, 804521, 809384, 814450, 820122, 826795, 834444, 842982, 852736, 864253, 877822, 893472, 911252, 931204, 953306, 977768, 1005163, 1036026, 1070589]
49870A070589L8686M3845N0165N7144O4629P3106Q2659R2407J01348J09099J15240
49859A898917J18643J18224J13994J06766R7142Q5416P2257N8964M7122L8134
49849B755579L2584K9605K7133K3301J7279Q618l487j9543l8773n9497q0134r9193
49837B593472j14706j24842j29285j29353j26528j21333j13665j03761r2623q1764
49827A455612p2525o5218n8931n2461m5553l8951l3409k9058k5676k3107k1178
49816I89545j9536j7789j5759j3575j1595j0138r130q172p018n914n178m713m217
49803H56811l675l350l282l159k638j647n01K00o4j134k146k332j740j002n40
49788H29801k84L1N02R52R64K35r62j929k348k596l095l683l950l766l068j702
$$ y = [1070589, 1109275, 1153120, 1203285, 1260429, 1325058, 1398164, 1480823, 1573230, 1674578, 1783677, 1898917, 2017560, 2135784, 2249778, 2356544, 2453686, 2539102, 2611359, 2670323, 2717445, 2755579, 2788163, 2817768, 2844901, 2868202, 2885481, 2894099, 2890612, 2871069, 2832296, 2772799, 2692665, 2593472, 2478766, 2353924, 2224639, 2095286, 1968758, 1847425, 1733760, 1629999, 1537376, 1455612, 1383087, 1317869, 1258938, 1206477, 1160924, 1121973, 1088564, 1059506, 1033830, 1010723, 989545, 970009, 952220, 936461, 922886, 911291, 901153, 892023, 883851, 876833, 870919, 865741, 861028, 856811, 853136, 849786, 846504, 843345, 840707, 839060, 838559, 838759, 838695, 837561, 835415, 833083, 831343, 830341, 829801, 829517, 829548, 830050, 831002, 831966, 832201, 831239, 829310, 826962, 824366, 821271, 817588, 813638, 809872, 806804, 805102]
49772H05102J6J052P22k72o07l6M65K01m36p28m99M0P42J435J799J644J105M09
49754H12154l60j167j919k499k783k686k317j961j720j416j122j368k366l368
49740G85102l437k689k091k141k461k677k874l071l016k705k529k583k449j958
49726G48421j571j700k105k280k069j588j039q56j505k829l977m392m372m365
49712G13773m187l568k924k971l712m444m613m175l297k209j318q86n73J19R92
49697F76007J179L78n17l96O84J574J427N91k5p7R2K49O54J487K354K711K549
49680F90921K280K100J941J923K346L054L370K849J889J299J503K337L351M167
49666G25330M651M952N282N580N582N224M822M751N137N884O777P505P850P897
$$ y = [805102, 805118, 806170, 806892, 806620, 806013, 805977, 806442, 806643, 806207, 805479, 804980, 805020, 805762, 807197, 808996, 810640, 811745, 812154, 811794, 810627, 808708, 806209, 803426, 800740, 798423, 796462, 794742, 793326, 792204, 790836, 788470, 785102, 781665, 778976, 776885, 774744, 772283, 769606, 766732, 763661, 760645, 757940, 755411, 752828, 750379, 748421, 746850, 745150, 743045, 740765, 738696, 737108, 736069, 735213, 733708, 730879, 726902, 722510, 718138, 713773, 709586, 706018, 703094, 700123, 696411, 691967, 687354, 683179, 679882, 677673, 676355, 675469, 674896, 675015, 676007, 677186, 677564, 677047, 676651, 677335, 678909, 680336, 680927, 680902, 680825, 680917, 681166, 681820, 683307, 685661, 688372, 690921, 693201, 695301, 697242, 699165, 701511, 704565, 707935, 710784, 712673, 713972, 715475, 717812, 721163, 725330, 729981, 734933, 740215, 745795, 751377, 756601, 761423, 766174, 771311, 777195, 783972, 791477, 799327, 807224]
49652H07224P817P532O936O399O436O805O599N537M521M496N291O218P205Q568
49638H97584J0007J0711J0481R958R703R692R815J0187J0710J0971J0869J0841
49626A021529J1077J0994R943Q158O554N803N941O690P709Q648R351R920J0427
49613A132744J0655J0482J0235J0245J0261R879R412R545J0084R896Q557P344
49601A249339P799R826J1904J2964J3204J3196J3149J3262J4006J5578J7491J9079
49589A410797K0138K0816K1239K1527K1872K2315K2762K3361K4529K6341K8324
49578A664021L0057L1547L2662L2865L2093L1354L1721L2964L3960L4262L4462
49567B021968L5103L5974L6585L6632L5904L4362L2529L1246L0844L0988L1315
$$ y = [807224, 815041, 822573, 829509, 835908, 842344, 849149, 855748, 861285, 865806, 870302, 875593, 881811, 889016, 897584, 907591, 918302, 928783, 938741, 948444, 958136, 967951, 978138, 988848, 999819, 1010688, 1021529, 1032606, 1043600, 1053543, 1061701, 1068255, 1074058, 1079999, 1086689, 1094398, 1103046, 1112397, 1122317, 1132744, 1143399, 1153881, 1164116, 1174361, 1184622, 1194501, 1203913, 1213458, 1223542, 1233438, 1241995, 1249339, 1257138, 1266964, 1278868, 1291832, 1305036, 1318232, 1331381, 1344643, 1358649, 1374227, 1391718, 1410797, 1430935, 1451751, 1472990, 1494517, 1516389, 1538704, 1561466, 1584827, 1609356, 1635697, 1664021, 1694078, 1725625, 1758287, 1791152, 1823245, 1854599, 1886320, 1919284, 1953244, 1987506, 2021968, 2057071, 2093045, 2129630, 2166262, 2202166, 2236528, 2269057, 2300303, 2331147, 2362135, 2393450]
49556B393450L1634L1424K9970K7403K4924K3479K2671K1472J9614J7686J6131
49545B659858J4721J2980J0780Q484O648N493M617L479K188J409J304J136K49
$$ y = [2393450, 2425084, 2456508, 2486478, 2513881, 2538805, 2562284, 2584955, 2606427, 2626041, 2643727, 2659858, 2674579, 2687559, 2698339, 2706823, 2713471, 2718964, 2723581, 2727060, 2729248, 2730657, 2731961, 2733097, 2733346]
$$ [...]
##END NTUPLES=NMR SPECTRUM
##END=
