
##TITLE=AC1291_CRIAH12101_6528502_UZRDczU5y3
##JCAMPDX= 6.0         $$ Bruker NMR JCAMP-DX V2.0
##DATA TYPE= NMR SPECTRUM
##DATA CLASS= NTUPLES
##ORIGIN= BRUKER
##OWNER= Administrator
$$ 1.72 TOPSPIN		Version 2.1
$$ 2012-07-15 14:26:24.312 -0500  Administrator@TOPSPIN
$$ Compression mode = diff/dup
##.OBSERVE FREQUENCY= 400.02188249412
##.OBSERVE NUCLEUS= ^1H
##.ACQUISITION MODE= SIMULTANEOUS (DQD)
##.ACQUISITION SCHEME= undefined
##.AVERAGES= 64
##.DIGITISER RES= 22
##SPECTROMETER/DATA SYSTEM= spect
##.PULSE SEQUENCE= noesygpps1d.comp
##.SOLVENT NAME= COFFEE_meoh
##.SHIFT REFERENCE= INTERNAL, COFFEE_meoh, 1, 14.96093
##AUDIT TRAIL= $$ (NUMBER, WHEN, WHO, WHERE, PROCESS, VERSION, WHAT)
$$ ##TITLE= Audit trail, TOPSPIN		Version 2.1
$$ ##JCAMPDX= 5.01
$$ ##ORIGIN= Bruker BioSpin GmbH
$$ ##OWNER= Administrator
$$ $$ C:\Bruker\TOPSPIN/data/COFFEE/nmr/AC1291_CRIAH12101_6528502_UZRDczU5y3/12/pdata/1/auditp.txt
$$ ##AUDIT TRAIL=  $$ (NUMBER, WHEN, WHO, WHERE, PROCESS, VERSION, WHAT)
(   1,<2012-07-15 14:26:19.296 -0500>,<Administrator>,<TOPSPIN>,<go>,<TOPSPIN 2.1>,
      <created by zg
	started at 2012-07-15 14:14:48.734 -0500,
	POWCHK enabled, PULCHK disabled,
       configuration hash MD5:
       6B 1B 68 BB D9 2E 58 E2 7F 35 AD 54 07 DF 0E 41
       data hash MD5: 64K
       15 25 59 62 0D 59 A2 3A 70 19 81 E8 72 89 A8 80>)
(   2,<2012-07-15 14:26:22.234 -0500>,<Administrator>,<TOPSPIN>,<proc1d>,<TOPSPIN 2.1>,
      <Start of raw data processing
       efp LB = 0.3 FT_mod = 6 PKNL = 1 PHC0 = 0 PHC1 = 0 SI = 128K 
       data hash MD5: 128K
       42 E1 0D FB A1 02 BB DF 9C 77 61 5D 86 BC 5C 5B>)
(   3,<2012-07-15 14:26:23.281 -0500>,<Administrator>,<TOPSPIN>,<proc1d>,<TOPSPIN 2.1>,
      <pk PHC0 = -1.19751 PHC1 = 0 
       data hash MD5: 128K
       34 AD 09 A4 20 A9 A3 97 73 90 2D 6E C0 61 57 E8>)
(   4,<2012-07-15 14:26:23.953 -0500>,<Administrator>,<TOPSPIN>,<proc1d>,<TOPSPIN 2.1>,
      <abs ABSG = 1 
       data hash MD5: 128K
       E8 F8 FD CA B2 95 7D 3C D6 A1 E4 8F EA 31 0B DB>)
(   5,<2012-07-15 14:26:24.031 -0500>,<Administrator>,<TOPSPIN>,<proc1d>,<TOPSPIN 2.1>,
      <abs ABSG = 2 
       data hash MD5: 128K
       C9 90 AE 00 F3 52 55 BB 04 9B 7A 30 65 D5 5A D5>)
(   6,<2012-07-15 14:26:24.093 -0500>,<Administrator>,<TOPSPIN>,<proc1d>,<TOPSPIN 2.1>,
      <abs ABSG = 3 
       data hash MD5: 128K
       33 35 0F 2C 8D 7F 3E E4 9B 8D 8F 01 22 2A 1E 27>)
(   7,<2012-07-15 14:26:24.156 -0500>,<Administrator>,<TOPSPIN>,<proc1d>,<TOPSPIN 2.1>,
      <abs ABSG = 4 
       data hash MD5: 128K
       06 63 6E B8 9E FC CB 1E 28 75 90 75 D7 EF 5C 8E>)
(   8,<2012-07-15 14:26:24.218 -0500>,<Administrator>,<TOPSPIN>,<proc1d>,<TOPSPIN 2.1>,
      <abs ABSG = 5 
       data hash MD5: 128K
       BD E3 22 A4 6A F3 37 3F 35 E8 E7 6B 91 7D 78 AB>)
$$ ##END=
$$ 
$$ $$ hash MD5
$$ $$ 83 F0 32 0D 66 CC EA 24 D8 A3 30 8B D2 E9 B1 68
##$RELAX= 
##$RELAX= 
##$RELAX= 
##$RELAX= 
##$RELAX= 
##$RELAX= 
##$RELAX= 
##$RELAX= 
$$ Bruker specific parameters
$$ [...]
##$TP07= 0
##$TPNAME0= <>
##$TPNAME1= <>
##$TPNAME2= <>
##$TPNAME3= <>
##$TPNAME4= <>
##$TPNAME5= <>
##$TPNAME6= <>
##$TPNAME7= <>
##$TPOAL= (0..7)
0.5 0.5 0.5 0.5 0.5 0.5 0.5 0.5
##$TPOFFS= (0..7)
0 0 0 0 0 0 0 0
##$TUNHIN= 0
##$TUNHOUT= 0
##$TUNXOUT= 0
##$USERA1= <user>
##$USERA2= <user>
##$USERA3= <user>
##$USERA4= <user>
##$USERA5= <user>
##$V9= 5
##$VALIST= <valist>
##$VCLIST= <CCCCCCCCCCCCCCC>
##$VD= 0
##$VDLIST= <DDDDDDDDDDDDDDD>
##$VPLIST= <PPPPPPPPPPPPPPP>
##$VTLIST= <TTTTTTTTTTTTTTT>
##$WBST= 2048
##$WBSW= 25
##$XGAIN= (0..3)
0 0 0 0
##$XL= 0
##$YL= 0
##$YMAX_a= 11368672
##$YMIN_a= -9021679
##$ZGOPTNS= <>
##$ZL1= 120
##$ZL2= 120
##$ZL3= 120
##$ZL4= 120
##$ABSF1= 14.96093
##$ABSF2= -5.597252
##$ABSG= 5
##$ABSL= 3
##$ALPHA= 0
##$AQORDER= 0
##$ASSFAC= 0
##$ASSFACI= 0
##$ASSFACX= 0
##$ASSWID= 0
##$AUNMP= <proc_prof1d_extract.lims>
##$AXLEFT= 0
##$AXNAME= <>
##$AXNUC= <1H>
##$AXRIGHT= 0
##$AXTYPE= 0
##$AXUNIT= <>
##$AZFE= 0.1
##$AZFW= 0.1
##$BCFW= 0
##$BC_mod= 0
##$BYTORDP= 0
##$COROFFS= 0
##$CY= 15
##$DATMOD= 1
##$DC= 0
##$DFILT= <>
##$DTYPP= 0
##$F1P= 0
##$F2P= 0
##$FCOR= 0.5
##$FTSIZE= 131072
##$FT_mod= 6
##$GAMMA= 0
##$GB= 0
##$INTBC= 1
##$INTSCL= 1
##$ISEN= 128
##$LB= 0.3
##$LEV0= 0
##$LPBIN= 0
##$MAXI= 10000
##$MC2= 0
##$MEAN= 0
##$ME_mod= 0
##$MI= 0
##$NCOEF= 0
##$NC_proc= -2
##$NLEV= 6
##$NOISF1= 0
##$NOISF2= 0
##$NSP= 0
##$NTH_PI= 0
##$NZP= 0
##$OFFSET= 14.96093
##$PC= 1
##$PHC0= -1.19751
##$PHC1= 0
##$PH_mod= 1
##$PKNL= yes
##$PPARMOD= 0
##$PPDIAG= 0
##$PPIPTYP= 0
##$PPMPNUM= 2147483647
##$PPRESOL= 1
##$PSCAL= 4
##$PSIGN= 0
##$PYNMP= <proc.py>
##$REVERSE= no
##$SF= 400.020009666144
##$SI= 131072
##$SIGF1= 0
##$SIGF2= 0
##$SINO= 400
##$SIOLD= 131072
##$SPECTYP= <>
##$SREGLST= <1H.CDCl3>
##$SSB= 0
##$STSI= 131072
##$STSR= 0
##$SW_p= 8223.68421052631
##$SYMM= 0
##$S_DEV= 0
##$TDeff= 65536
##$TDoff= 0
##$TI= <>
##$TILT= no
##$TM1= 0
##$TM2= 0
##$TOPLEV= 0
##$USERP1= <user>
##$USERP2= <user>
##$USERP3= <user>
##$USERP4= <user>
##$USERP5= <user>
##$WDW= 1
##$XDIM= 131072
##$YMAX_p= 432418581
##$YMIN_p= -12589
##$CURPLOT= <Network HP LaserJet P1505>
##$CURPRIN= <$Network HP LaserJet P1505>
##$DFORMAT= <normdp>
##$LAYOUT= <+/1D_H.xwp>
##$LFORMAT= <normlp>
##$PFORMAT= <normpl>
##$SURQMSG= 1
$$ End of Bruker specific parameters
$$ ---------------------------------
##NTUPLES= NMR SPECTRUM
##VAR_NAME=  FREQUENCY,     SPECTRUM/REAL,   SPECTRUM/IMAG
##SYMBOL=    X,             R,               I
##VAR_TYPE=  INDEPENDENT,   DEPENDENT,       DEPENDENT
##VAR_FORM=  AFFN,          ASDF,            ASDF
##VAR_DIM=   131072,        131072,          131072
##UNITS=     HZ,            ARBITRARY UNITS, ARBITRARY UNITS
##FACTOR=    0.0627417313425164, 1,          1
##FIRST=     8223.62146879497, -70,          -55069
##LAST=      0,             819,             -55832
##MIN=       0,             -12589,          0
##MAX=       8223.62146879497, 432418581,    0
$$ Real data points
##PAGE= N=1
##DATA TABLE= (X++(R..R)), XYDATA
$$ [...]
63921D800114j12281j45874j75777k00545k19049k30900k36599k37194k33779
63912C008116k27246k18217k07041j93869j78857j62530j46014j30676j17179
63903A426487j04871r2561p9993o8251n8462n0534m3568l7152l1669k7411k4081
63892H07934k1307j9153j7727j6600j5097j3031j0899r243q123p203o157m928
63880F58466l700k740k064j291N4J949L923N833Q213J1456J4955J7750J9864K2203
63866G54871K5009K7333K8449K8934K9581L0001K9286K7643K6140K4942K2979
63855A055168J9602J5531J1738Q272M659P82l222p415j1763j5841j9338k2503
63843A035670k5627k8409l0380l1710l2986l4351l5379l5712l5422l4759l3883
$$ y = [4800114, 4687833, 4541959, 4366182, 4165637, 3946588, 3715688, 3479089, 3241895, 3008116, 2780870, 2562653, 2355612, 2161743, 1982886, 1820356, 1674342, 1543666, 1426487, 1321616, 1229055, 1149062, 1080811, 1022349, 971815, 928247, 891095, 859426, 832015, 807934, 786627, 767474, 749747, 733147, 718050, 705019, 694120, 684877, 676754, 669551, 663394, 658466, 654766, 652026, 649962, 648671, 648725, 650674, 654597, 660430, 668643, 680099, 695054, 712804, 732668, 754871, 779880, 807213, 835662, 864596, 894177, 924178, 953464, 981107, 1007247, 1032189, 1055168, 1074770, 1090301, 1102039, 1110311, 1114970, 1115752, 1112530, 1105115, 1093352, 1077511, 1058173, 1035670, 1010043, 981634, 951254, 919544, 886558, 852207, 816828, 781116, 745694, 710935, 677052]
63832F77052l2857l1625l0073k8224k6322k4514k2710k0874j9229j7894j6576
63821D06154j4930j3076j1468j0468j0163j0400j0635j0119q632o828n560m956
63809B88919m528l958l386l038k933k957k959k762k318j760j301j173j638k612
63795B51596l274k725j317o09j502l001l562l092k709k945l249l116k610j763
63781B16122m56P77Q93k59j434j479p08j94k64l32j6L50K97j74p01r78r33o51
63763B09860k26J99L58J3o66j093q88l61l1J34M97R56R12K36l62j88O17J345J515
63744B12827J169O51L49M13O90J045J677K698L532L406K538K065K527L117K976
63729B41680K469K465K914L099K922L015L592M206M668N347O280O800O510N890
$$ y = [677052, 644195, 612570, 582497, 554273, 527951, 503437, 480727, 459853, 440624, 422730, 406154, 391224, 378148, 366680, 356212, 346049, 335649, 325014, 314895, 306263, 299435, 293875, 288919, 284391, 280433, 277047, 274009, 271076, 268119, 265160, 262398, 260080, 258320, 257019, 255846, 254208, 251596, 248322, 245597, 244280, 243671, 242169, 239168, 235606, 232514, 229805, 226860, 223611, 220495, 217885, 216122, 215666, 216443, 217336, 217077, 215643, 214164, 213456, 213262, 212998, 212666, 212650, 213000, 213297, 213123, 212422, 211444, 210511, 209860, 209634, 209833, 210191, 210204, 209538, 208445, 207557, 207196, 207165, 207299, 207796, 208752, 209664, 209900, 209538, 209350, 209967, 211312, 212827, 213996, 214647, 214996, 215409, 216099, 217144, 218821, 221519, 225051, 228457, 230995, 233060, 235587, 238704, 241680, 244149, 246614, 249528, 252627, 255549, 258564, 262156, 266362, 271030, 276377, 282657, 289457, 295967, 301857]
63715C01857N415M690L166J263Rl41n20j125j976k725l426m156m630m597m286
63700B88618m016l690l052k205j426o30M34J579K350K710L033L359L316K946K976
63685B96302L821M800M884L893K574J657J278J091O36l34j514k181j869q33L40
63670C14545J326K011K254K091J912J955J898J389P32M12J95o01k000l272m029
63655C20818m647n385n840n641n205n188n496n352m240k470q51k0j0k97k52L63
63639B70287J315K205K767K984L110L401L737L679L217L055L769M918N603N698
63625C19745N828O243O489O340O288O817P817R032J0440J1887J3002J3883J5252
63612D39063J7386J9456K0613K1238K2403K4410K6677K8917L1438L4008L5219
$$ y = [301857, 307272, 311962, 315128, 316391, 316400, 316059, 315539, 314414, 312438, 309713, 306287, 302131, 297501, 292904, 288618, 284602, 280912, 277860, 275655, 274229, 273599, 274033, 275612, 277962, 280672, 283705, 287064, 290380, 293326, 296302, 300123, 304923, 309807, 313700, 316274, 317931, 319209, 320300, 320936, 320602, 319088, 316907, 315038, 314205, 314545, 315871, 317882, 320136, 322227, 324139, 326094, 327992, 329381, 330113, 330525, 330720, 330119, 328119, 324847, 320818, 316171, 310786, 304946, 299305, 294100, 288912, 283416, 278064, 273824, 271354, 270503, 270483, 270473, 270176, 269924, 270287, 271602, 273807, 276574, 279558, 282668, 286069, 289806, 293485, 296702, 299757, 303526, 308444, 314047, 319745, 325573, 331816, 338305, 344645, 350933, 357750, 365567, 374599, 385039, 396926, 409928, 423811, 439063, 456449, 475905, 496518, 517756, 540159, 564569, 591246, 620163, 651601, 685609, 720828]
63601G20828L3555K8967K2911J6879J1216N522l6m369o565o994o857o887o995
63588H01175p098p565q783j0826j3712j7395k1240k4162k5644k6123k6040k5103
63576E87484k2983k0198j7662j5679j3875j1827r299o258l137p67M97J238K121
63563D69655L007L513L962M982O453P654Q313Q756R173R534J0120J1385J3308
63550E69815J5568J8236K1547K5168K8613L2250L6801M1721M5190M5855M3478
63539I24242L7762K8107J5465L048o070j1410j4190j4925j3367j0218p196n297
63527I25951m320m302o050r832j4587j9282k4058k9287l4145l7221l8189l7904
63515F66774l6879l4687l1110k7036k3679k1364j9618j8099j6785j5426j3548
$$ y = [720828, 754383, 783350, 806261, 823140, 834356, 839878, 839842, 835473, 828908, 821914, 815057, 808170, 801175, 794077, 786512, 777729, 766903, 753191, 735796, 714556, 690394, 664750, 638627, 612587, 587484, 564501, 544303, 526641, 510962, 497087, 485260, 475961, 469703, 466566, 465799, 466296, 467534, 469655, 472662, 476175, 480137, 485119, 491572, 499226, 507539, 516295, 525468, 535002, 545122, 556507, 569815, 585383, 603619, 625166, 650334, 678947, 711197, 747998, 789719, 834909, 880764, 924242, 962004, 990111, 1005576, 1008624, 1002554, 991144, 976954, 962029, 948662, 938444, 931248, 925951, 921631, 917329, 911279, 901447, 886860, 867578, 843520, 814233, 780088, 742867, 704678, 666774, 629895, 595208, 564098, 537062, 513383, 492019, 472401, 454302, 437517, 422091, 408543]
63504D08543j1241r340q431q031p247n988m970m612m483m008l189k397j817j406
63490C31383j189j212j319j281j047o71r2P82J816K766L529M100M405M465M619
63475C51054N125N590N310M325L529L409L199J826n16k526l442l825m497n334
63461C63227n649n289m704m085l178k026j252j253j574j526j085o69k59O50K190
63446C33518L713M551M813N184O144P610R114J0168J0672J1249J2897J6013J9936
63433D55582K3780K7432L1208L4544L5747L3369K7522J9693J1726N200J164k14
63421G06753L26J983M699Q828J4198K0038K5718L1025L5604L8715L9744L8546
63409I66177L5125K9479K2015J3756N815j020o133r041r919r722r297q730q021
$$ y = [408543, 397302, 387962, 379531, 371500, 364253, 358265, 353295, 348683, 344200, 340192, 337003, 334606, 332789, 331383, 330194, 328982, 327663, 326382, 325335, 324664, 324572, 325354, 327170, 329936, 333465, 337565, 341970, 346435, 351054, 356179, 361769, 367079, 371404, 374933, 378342, 381541, 383367, 382851, 380325, 376883, 373058, 368561, 363227, 357578, 352289, 347585, 343500, 340322, 338296, 337044, 335791, 334217, 332691, 331606, 330937, 330678, 331328, 333518, 337231, 341782, 346595, 351779, 357923, 365533, 374647, 384815, 395487, 406736, 419633, 435646, 455582, 479362, 506794, 538002, 572546, 608293, 641662, 669184, 688877, 700603, 705803, 706967, 706753, 707079, 709062, 713761, 722589, 736787, 756825, 782543, 813568, 849172, 887887, 927631, 966177, 1001302, 1030781, 1052796, 1066552, 1072367, 1071347, 1065214, 1056173, 1046254, 1036532, 1027235, 1018505, 1010484]
63396A010484q012r911j4029j9513k5210l0327l4359l6999l8221l8040l6313l3246
63384F86304k9876k7380k5808k4190k1932j9385j6942j4371j1401q353n645l201
63372D77820p86J414L004L965M710N783P593J0101J2600J4345J5558J7266J9843
63359E93216K2458K4399K6162K8568L1412L3891L5920L7924L9591L9787L7844
63348I51172L4027K8664K1688J3480N388j090n433q101r750j0714j1051j0826
63336I97454j0425j0665j2392j5855k0489k5303k9398l2317l4130l5101l5141
63325G36238l3867l1348k8305k5162k1277j5870r532m037o85M99j45k698p181
63312E56630j2808j8193k1998k3356k2176j9366j6352j3999j2136j0246q210o305
$$ y = [1010484, 1002472, 992561, 978532, 959019, 933809, 903482, 869123, 832124, 793903, 755863, 719550, 686304, 656428, 629048, 603240, 579050, 557118, 537733, 520791, 506420, 495019, 486666, 481021, 477820, 477034, 478448, 481452, 485417, 490127, 495910, 503503, 513604, 526204, 540549, 556107, 573373, 593216, 615674, 640073, 666235, 694803, 726215, 760106, 796026, 833950, 873541, 913328, 951172, 985199, 1013863, 1035551, 1049031, 1054419, 1053329, 1047896, 1039795, 1030045, 1019331, 1008280, 997454, 987029, 976364, 963972, 948117, 927628, 902325, 872927, 840610, 806480, 771379, 736238, 702371, 671023, 642718, 617556, 596279, 580409, 570877, 566840, 566155, 566654, 566509, 563811, 556630, 543822, 525629, 503631, 480275, 458099, 438733, 422381, 408382, 396246, 386000, 377790, 371485]
63300C71485m883m239m355m657m442l769l388l601l741l209k398k120k466k796
63286C21421k590j868r92m92p52j511j947j635j097r26q51l07M35N98J58j20P9
63269C07603K66J85L17R42J475J368J021J126J486J359P50N38J166J985K240K203
63253C26030K699L789M609M592M293M641N638O397O361O001O049O516O907P211
63239D01733Q024R597J1266J2254J2748J3758J5875J8532K0638K1665K1919K1920
63227E89929K1850K1626K1275K0919K0601K0298K0130K0331K0909K1557K2009
63216H21434K2394K2980K3606K3634K2542K0347J7331J3483Q587K803l191q766
63204I87184j3804j8354k2177k5018k7100k8815k9885k9481k7387k4458k1514
$$ y = [371485, 366602, 362363, 358008, 353351, 348909, 345140, 341752, 338151, 334410, 331201, 328803, 326683, 324217, 321421, 318831, 316963, 315971, 315479, 314727, 313216, 311269, 309634, 308537, 307611, 306760, 306453, 306888, 307486, 307644, 307524, 307603, 307869, 308054, 308371, 309313, 310788, 312156, 313177, 314303, 315789, 317148, 317898, 318436, 319602, 321587, 323827, 326030, 328729, 332518, 337127, 341719, 346012, 350653, 356291, 362688, 369049, 375050, 381099, 387615, 394522, 401733, 409757, 419354, 430620, 442874, 455622, 469380, 485255, 503787, 524425, 546090, 568009, 589929, 611779, 633405, 654680, 675599, 696200, 716498, 736628, 756959, 777868, 799425, 821434, 843828, 866808, 890414, 914048, 936590, 956937, 974268, 987751, 996338, 999141, 995950, 987184, 973380, 955026, 932849, 907831, 880731, 851916, 822031, 792550, 765163, 740705, 719191]
63193G19191j8365j4478j0218o576l761r43K426N801Q445J0499J2617J4947J7108
63180G36693J8936K0613K2122K3188K3853K4616K5693K6512K6349K5267K4046
63169I97888K3192K2371K0943J8784J6210J3286R531M518j536p984j4295k0211
63157A082697k5537l0157l4133l7479l9813m0652m0087l8817l7346l5514l3065
63146F90097l0286k7697k5334k2748j9751j6766j4352j2615j1161r507p503n482
63134D86895m060l596l808m014l793l257k636j860q28J58O17O14Q16J628K620
63119D65496L204L536M212N113N321M402L134K597K912L427L743L935L908L285
63105E18225K044P74J18K13P53J280J373R42L93K58N42P47N52J42j26r3K18O54
$$ y = [719191, 700826, 686348, 676130, 669554, 665793, 664850, 667276, 673077, 681522, 692021, 704638, 719585, 736693, 755629, 776242, 798364, 821552, 845405, 870021, 895714, 922226, 948575, 973842, 997888, 1021080, 1043451, 1064394, 1083178, 1099388, 1112674, 1122205, 1126723, 1125187, 1117203, 1102908, 1082697, 1057160, 1027003, 992870, 955391, 915578, 874926, 834839, 796022, 758676, 723162, 690097, 659811, 632114, 606780, 584032, 564281, 547515, 533163, 520548, 509387, 499880, 492377, 486895, 482835, 479239, 475431, 471417, 467624, 464367, 461731, 459871, 459043, 459201, 459818, 460432, 461248, 462876, 465496, 468700, 472236, 476448, 481561, 486882, 491284, 494418, 497015, 499927, 503354, 507097, 511032, 514940, 518225, 520269, 521043, 521161, 521374, 522127, 523407, 524780, 525722, 526115, 526373, 526915, 527662, 528214, 528356, 528230, 528137, 528355, 529009]
63087E29009R43R22Q00Q54R42P99O73J074J855K280K164K191K776L398L633M066
63071E58379N405P200Q337Q606Q801R430J0140J0629J1247J2407J3937J5482J7128
63058F97128J9150K1436K3577K5532K7789L0752L4189L7462M0198M2560M4857
63047A044630M7183M9483N1687N3439N4016N3097N1546N0786N1258N2056N2282
63036A611463N2235N2715N3725N4435N4208N3075N1267M8701M4850L8895L0189
63025B145758J8952O461n871j7505k8740l9821n0369n9443o5981o9418p0261o9673
63013A694089o8100o4646n8408n0109m1635l4159k7395k0622j3588o258J434R171
63001A319774J6136K1842K6688L1284L5507L8699M0674M2041M3439M4771M5466
$$ y = [529009, 529952, 530874, 531674, 532528, 533470, 534269, 534942, 536016, 537871, 540151, 542315, 544506, 547282, 550680, 554313, 558379, 563784, 570984, 579321, 587927, 596728, 606158, 616298, 626927, 638174, 650581, 664518, 680000, 697128, 716278, 737714, 761291, 786823, 814612, 845364, 879553, 917015, 957213, 999773, 1044630, 1091813, 1141296, 1192983, 1246422, 1300438, 1353535, 1405081, 1455867, 1507125, 1559181, 1611463, 1663698, 1716413, 1770138, 1824573, 1878781, 1931856, 1983123, 2031824, 2076674, 2115569, 2145758, 2164710, 2171171, 2165300, 2147795, 2119055, 2079234, 2028865, 1969422, 1903441, 1834023, 1763762, 1694089, 1625989, 1561343, 1502935, 1452826, 1411191, 1377032, 1349637, 1329015, 1315427, 1309169, 1310603, 1319774, 1335910, 1357752, 1384440, 1415724, 1451231, 1489930, 1530604, 1572645, 1616084, 1660855, 1706321]
62990A706321M5368M5057M5058M5041M4220M2390L9993L7011L2566K5997J7674
62979B126696Q224k402j4352k6892l8860m9786n9700o8169p4492p8689q1233q1871
62967A558474p9912p5718p0773o5974o0954n5440n0084m5435m1168l7048l3647
62956I42321l1297k9262k6812k4393k2777k1788k0839k0062j9806j9531j8439
62945F87315j6853j5828j5564j5347j4894j4503j3939j2501j0439r065q965r168
62933E30249q673p803p293o923n964m498l316k779k532k283k135k073j758j019
62919D71200k17R5k91j101j836k133k019j835j903k207k443k407k275k462l127
62904D45039l783l689k763j879j934k709l112k502j270r4Q17J502J802J599J186
$$ y = [1706321, 1751689, 1796746, 1841804, 1886845, 1931065, 1973455, 2013448, 2050459, 2083025, 2109022, 2126696, 2134920, 2132518, 2118166, 2091274, 2052414, 2002628, 1942928, 1874759, 1800267, 1721578, 1640345, 1558474, 1478562, 1402844, 1332071, 1266097, 1205143, 1149703, 1099619, 1054184, 1013016, 975968, 942321, 911024, 881762, 854950, 830557, 807780, 785992, 765153, 745091, 725285, 705754, 687315, 670462, 654634, 639070, 623723, 608829, 594326, 580387, 567886, 557447, 548382, 539417, 530249, 521576, 513773, 506480, 499557, 493593, 489095, 485779, 483000, 480468, 478185, 476050, 473977, 472219, 471200, 470983, 471078, 470787, 469686, 467850, 465717, 463698, 461863, 459960, 457753, 455310, 452903, 450628, 448166, 445039, 441256, 437567, 434804, 432925, 430991, 428282, 425170, 422668, 421398, 421304, 422121, 423623, 425425, 427024, 428210]
62889D28210R20P35L74n5k03q6r4l66n52k89L83J166J750J841J304M90J16N04
62871D36148J092J066L34m50q42j064j397j565j178n46l98p96r28k65O18Q95P25
62854D31449R31J563J651O35o98j202p84k09J73P16J517J939J433L97k27j7O25
62837D39892J063R90M75j96o52o44k81O5J37mj51j65L6M84R89J165Q62N03P04
62818D45272J487K223K450K470K871L652M243M295M088M027M126M244M522N164
62804D95134N905O151N706N113N075N744O753P728Q585R422J0370J1564J2966
62791E96216J4244J5067J5654J6743J8886K1947K5480K9331L3570L7996M2283
62780H67417M6631N1759N7997O4742P1140P6952Q2280Q6704Q9271Q9400Q7360
$$ y = [428210, 429130, 429865, 430239, 430184, 429981, 429895, 429801, 429435, 428883, 428594, 428977, 430143, 431893, 433734, 435038, 435528, 435644, 436148, 437240, 438306, 438640, 438190, 437348, 436284, 434887, 433322, 432144, 431598, 431200, 430404, 429476, 429211, 429829, 430724, 431449, 432380, 433943, 435594, 436229, 435531, 434329, 433545, 433336, 433509, 434225, 435742, 437681, 439114, 439511, 439284, 439267, 439892, 440955, 441945, 442420, 442224, 441572, 440928, 440647, 440712, 440849, 440845, 440694, 440529, 440565, 441049, 442038, 443203, 444065, 444568, 445272, 446759, 448982, 451432, 453902, 456773, 460425, 464668, 468963, 473051, 477078, 481204, 485448, 489970, 495134, 501039, 507190, 512896, 518009, 523084, 528828, 535581, 543309, 551894, 561316, 571686, 583250, 596216, 610460, 625527, 641181, 657924, 676810, 698757, 724237, 753568, 787138, 825134, 867417, 914048, 965807, 1023804, 1088546, 1159686, 1236638, 1318918, 1405622, 1494893, 1584293, 1671653]
62769A671653Q3670P8377P1015O1071M8367L3408J7379J545j3628k8377m2575
62758A981905n5172o5061p2163p7195q0638q2472q2779q1930q0082p7017p2730
62747A154666o7712o2502n7251n2022m7136m2890l9178l5662l2167k8669k5122
62736F64355k1617j8556j6283j4650j3183j1633j0052q447o741n099l864l064
62724E31166k266j160l7N70N91N85J212K672M651O742Q798J0809J2557J3710J4400
62709F05000J5379J7292J9971K2905K6159L0240L5111M0051M4693M9489N4762
62698I61052N9981O4635O9179P4295P9538Q3725Q6599Q9024R1255R1950Q9491
62687A840724Q3572P4874O3755N0079L4091J6613j572j9904l7536n3306o6403
$$ y = [1671653, 1755323, 1833700, 1904715, 1965786, 2014153, 2047561, 2064940, 2066485, 2052857, 2024480, 1981905, 1926733, 1861672, 1789509, 1712314, 1631676, 1549204, 1466425, 1384495, 1304413, 1227396, 1154666, 1086954, 1024452, 967201, 915179, 868043, 825153, 785975, 750313, 718146, 689477, 664355, 642738, 624182, 607899, 593249, 580066, 568433, 558381, 549934, 543193, 538094, 534230, 531166, 528900, 527740, 527703, 528273, 528864, 529449, 530661, 533333, 537984, 544726, 553524, 564333, 576890, 590600, 605000, 620379, 637671, 657642, 680547, 706706, 736946, 772057, 812108, 856801, 906290, 961052, 1021033, 1085668, 1154847, 1229142, 1308680, 1392405, 1479004, 1568028, 1659283, 1751233, 1840724, 1924296, 1999170, 2062925, 2113004, 2147095, 2163708, 2162136, 2142232, 2104696, 2051390, 1984987]
62676A984987p6657q4096q8726r0917r1503r1062q9476q6422q2038p6713p0649
62665A056728o4069n7641n2092m7432m3070l8703l4571l0861k7388k4088k1345
62654F15468j9447j8015j6327j4093j1711r920r303r843j0715j0791r696q152
62642D67455p085o623o275n722m922l728k083m98L21M01M11N45J75j024k284k635
62626D26429k129j612j520j501j120l96L61Q32Q15M58L67J104K482L700M244M376
62610D36890M609N039N412N637N940O559P451Q340R034R668J0605J2086J4054
62597E41324J6334J8894K1768K4893K8217L1807L5614L9212M2070M4024M5102
62586H89259M4945M2865L8675L3049K6743J9763J1722K817n963j3664k0010k5212
$$ y = [1984987, 1908330, 1824234, 1735508, 1644591, 1553088, 1462026, 1372550, 1286128, 1204090, 1127377, 1056728, 992659, 935018, 882926, 835494, 792424, 753721, 719150, 688289, 660901, 636813, 615468, 596021, 578006, 561679, 547586, 535875, 525955, 516652, 506809, 496094, 485303, 475607, 467455, 460370, 453747, 447472, 441750, 436828, 433100, 431017, 430519, 430840, 431241, 431652, 432197, 432372, 431348, 429064, 426429, 424300, 422688, 421168, 419667, 418547, 418151, 418512, 419344, 420159, 420617, 420984, 422088, 424570, 428270, 432514, 436890, 441499, 446538, 451950, 457587, 463527, 470086, 477537, 485877, 494911, 504579, 515184, 527270, 541324, 557658, 576552, 598320, 623213, 651430, 683237, 718851, 758063, 800133, 844157, 889259, 934204, 977069, 1015744, 1048793, 1075536, 1095299, 1107021, 1109838, 1103875, 1090211, 1070201, 1044989]
62574A044989k9519l3133l6262l8854m0423m0449l9008l6838l4595l2327k9769
62563F53812k6948k4225k1787j9437j7017j4767j3013j1702j0461r063p614o355
62551D71423n490n116n082m950m450l927l926m218l803k227m71J57k50l22O70
62536D28018J834K066J659J747K471K750J974J022J177K620M587O500Q244R663
62522D76332J0651J1713J3687J6662J9728K2107K4078K6429K9533L3296L7618
62511G21834M2321M6770N0149N2121N2910N2707N1381M8822M5179M0561L4761
62500A239516K7472J8770R239l81r546j7903k5008l0243l3162l3876l2949l0901
62488A081028k7967k4246j9844j4760r009k929K841P959J2671J7369K2068K6476
$$ y = [1044989, 1015470, 982337, 946075, 907221, 866798, 826349, 787341, 750503, 715908, 683581, 653812, 626864, 602639, 580852, 561415, 544398, 529631, 516618, 504916, 494455, 485392, 477778, 471423, 465933, 460817, 455735, 450785, 446335, 442408, 438482, 434264, 430461, 428234, 427763, 427920, 427670, 427348, 428018, 429852, 431918, 433577, 435324, 437795, 440545, 442519, 443541, 444718, 447338, 451925, 458425, 466669, 476332, 486983, 498696, 512383, 529045, 548773, 570880, 594958, 621387, 650920, 684216, 721834, 764155, 810925, 861074, 913195, 966105, 1018812, 1070193, 1119015, 1164194, 1204755, 1239516, 1266988, 1285758, 1294997, 1294616, 1285070, 1267167, 1242159, 1211916, 1178754, 1144878, 1111929, 1081028, 1053061, 1028815, 1008971, 994211, 985202, 982273, 985114, 993073, 1005744, 1023113, 1045181, 1071657]
62476A071657L0286L3073L4161L2917K9189K3285J5852P883M11o286j3038k0771
62464A238619k9291l7395m4013m8820n1836n3179n3228n2496n1120m8771m5233
62453G23237m0766l5866l0984k6540k2801j9591j6471j3281j0249p588n315l517
62441D90268k297j387k98R74J882K208K524L362M322M534L763K569J442K49j415
62426E12700l551n618p003p638q049q661r115q645p231n893n567o039o382o138
62412D17170n566m942m238l480k872k443k027j732j912k405k340j210K60Q70M28
62397C83561j99l83l35k53L29J715L236L937L804L494L105K156Q09J31O98J753
62381D07558K370K772L793N382O516O499N757N232N469O339P361Q162Q771R505
$$ y = [1071657, 1101943, 1135016, 1169177, 1202094, 1231283, 1254568, 1270420, 1278303, 1278714, 1272428, 1259390, 1238619, 1209328, 1171933, 1127920, 1079100, 1027264, 974085, 920857, 868361, 817241, 768470, 723237, 682471, 646605, 615621, 589081, 566280, 546689, 530218, 516937, 506688, 499100, 493785, 490268, 487971, 486584, 486286, 487260, 489142, 491350, 493874, 497236, 501558, 506092, 509855, 512424, 513866, 514115, 512700, 509149, 503531, 496528, 488890, 480841, 472180, 463065, 454420, 447189, 441296, 435729, 429690, 423308, 417170, 411604, 406662, 402424, 398944, 396072, 393629, 391602, 389870, 387958, 385553, 383213, 382003, 382263, 383133, 383561, 383362, 382979, 382644, 382391, 382720, 384435, 387671, 391608, 395412, 398906, 402011, 404167, 404976, 405107, 405805, 407558, 409928, 412700, 416493, 421875, 428391, 434890, 440647, 445879, 451348, 457687, 465048, 473210, 481981, 491486]
62367D91486J0481J1566J2739J4123J5501J6431J7208J9007K2487K6844L0973
62356F88846L5020L9829M5276N0221N4000N6834N8711N8891N6790N2545M6488
62345A243451L8808K9922K0489J0946J706o340j2529j7738k3753l0875l7262m1190
62333A175635m2998m4047m4780m4655m3273m0583l6538l1533k6802k3459k1345
62322G75622j9554j7791j6514j5966j5903j6170j6809j7586j8040j8093j8012
62311E85184j7771j6911j5262j3375j2021j1355j0757r574p980o762o134n243
62299D52039l444j642j312k267k677j597j86K38P4M15J204J652J772K186K847
62284D49302L226L435L964M472M114L095K667L411M491M920M640M114L662L572
$$ y = [491486, 501967, 513533, 526272, 540395, 555896, 572327, 589535, 608542, 631029, 657873, 688846, 723866, 763695, 808971, 859192, 913192, 970026, 1028737, 1087628, 1144418, 1196963, 1243451, 1282259, 1312181, 1332670, 1343616, 1345322, 1338982, 1326453, 1308715, 1284962, 1254087, 1216825, 1175635, 1132637, 1088590, 1043810, 999155, 955882, 915299, 878761, 847228, 820426, 796967, 775622, 756068, 738277, 721763, 705797, 689894, 673724, 656915, 639329, 621289, 603196, 585184, 567413, 550502, 535240, 521865, 509844, 498489, 487732, 478158, 470178, 463416, 457282, 452039, 448595, 446953, 445641, 443374, 440697, 439100, 438914, 439152, 439226, 439641, 440845, 442497, 444269, 446455, 449302, 452528, 455963, 459927, 464399, 468513, 471608, 474275, 477686, 482177, 487097, 491737, 495851, 499513, 503085]
62270E03085M134N185O151O811P554Q692J0104J1793J4166J7427K1010K4107K6550
62257F66769K9070L2617L7546M3260M8791N3675N7971O1335O2704O1310N7507
62246A212555N2026M4951L6184K6418J6767P639j158r473j6980k4062l1414l8798
62234A274655m5239n0491n5026n8539n9756n8289n5416n2330m8687m3757l8086
62223G09039l2998k8972k5535k2405j9753j7459j5064j2524j0383q972p930o785
62211E00259n623m908m719m462l486j839k33P89J389K038K913L990N337O916Q345
62196E06706R336J0209J1390J2620J3244J3182J2961J2812J2465J1876J1444J1353
62184F49598J1300J1058J0719J0279R522Q479P463O466N062L074Q40j234k890
$$ y = [503085, 507219, 512404, 518555, 525366, 532920, 541612, 551716, 563509, 577675, 595102, 616112, 640219, 666769, 695839, 728456, 766002, 809262, 858053, 911728, 969699, 1031034, 1093738, 1155048, 1212555, 1264581, 1309532, 1345716, 1372134, 1388901, 1396540, 1395382, 1385909, 1368929, 1344867, 1313453, 1274655, 1229416, 1178925, 1123899, 1065360, 1005604, 947315, 891899, 839569, 790882, 747125, 709039, 676041, 647069, 621534, 599129, 579376, 561917, 546853, 534329, 523946, 514974, 507044, 500259, 494636, 489728, 485009, 480547, 477061, 475222, 474989, 475778, 477167, 479205, 482118, 486108, 491445, 498361, 506706, 516042, 526251, 537641, 550261, 563505, 576687, 589648, 602460, 614925, 626801, 638245, 649598, 660898, 671956, 682675, 692954, 702476, 710955, 718418, 724884, 729946, 733020, 733860, 732626, 729736]
62171G29736l714l211j320J652N579J0372J5442K0098K4544K9542L4965L9620
62159I03305M2719M4446M4701M2474L7193K9923K2319J5097Q183J700m073r265
62147A178722j4216j9003k3669k8461l3214l6918l8612l8408l7067l4961l2071
62136H42122k8687k5327k2081j8589j4677j0706p341n166m212l729k842j557o72
62123F96536m06J67J856M245O377Q039R627J1162J2099J1889J0165O845K609j017
62109G80193k786k811k158j687j734k476l986o026q271j0449j2011j2127j0529
62096G03142p977n404l043p87J164K660M097N789P305Q114Q475Q963R490R639
62082G51627R537R591R727R758J0254J2085J5135J8345K0904K2732K3991K4834
$$ y = [729736, 726022, 722811, 721491, 723143, 728722, 739094, 754536, 774634, 799178, 828720, 863685, 903305, 946024, 990470, 1035171, 1077645, 1114838, 1144761, 1167080, 1182177, 1190360, 1192060, 1187987, 1178722, 1164506, 1145503, 1121834, 1093373, 1060159, 1023241, 984629, 946221, 909154, 874193, 842122, 813435, 788108, 766027, 747438, 732761, 722055, 714714, 709548, 705336, 701607, 698765, 697208, 696536, 696130, 696297, 698153, 702398, 708775, 716814, 726441, 737603, 749702, 761591, 771756, 778601, 781210, 780193, 777407, 774596, 772438, 770751, 769017, 766541, 762555, 756529, 748258, 737809, 725798, 713671, 703142, 695165, 689761, 686718, 685931, 687095, 689755, 693852, 699641, 706946, 715060, 723535, 732498, 741988, 751627, 761164, 770755, 780482, 790240, 800494, 812579, 827714, 846059, 866963, 889695, 913686, 938520]
62070I38520K5528K6033K5683K4076K2004K0677K0261K0169K0487K1945K4469
62059A189852K6935K8487K9014K8192K5319K0576J5441J1170P572L724p73n663
62047A379846j0586j5228j9483k3841k9081l5148m0760m4504m6080m6182m5621
62036A023332m4765m3560m1809l9583l7307l5189l2742k9473k5798k2628k0144
62025F50334j7827j5616j4009j2940j1652j0040r055r190r616r516r310r652j0024
62012E01887r421p931o504n519m591l675l210l111k547j096O49J963K897L888
61998D63679M899N458N335M769M091L407K682J910J158M95n3n50j187k172l511
61983D90410m921o139p242q456r593r998r256p736o205n094m360l810l207k286
$$ y = [938520, 964048, 990081, 1015764, 1039840, 1061844, 1082521, 1102782, 1122951, 1143438, 1165383, 1189852, 1216787, 1245274, 1274288, 1302480, 1327799, 1348375, 1363816, 1374986, 1382558, 1386282, 1385509, 1379846, 1369260, 1354032, 1334549, 1310708, 1281627, 1246479, 1205719, 1161215, 1115135, 1068953, 1023332, 978567, 935007, 893198, 853615, 816308, 781119, 748377, 718904, 693106, 670478, 650334, 632507, 616891, 602882, 589942, 578290, 568250, 559195, 550005, 540389, 530873, 521563, 511911, 501887, 492466, 484535, 478031, 472512, 467921, 464246, 461036, 457925, 455378, 454282, 454931, 456894, 459791, 463679, 468578, 474036, 479371, 484140, 488231, 491638, 494320, 496230, 497388, 497883, 497830, 497280, 496093, 493921, 490410, 485489, 479350, 472108, 463652, 454059, 444061, 434805, 427069, 420864, 415770, 411410, 407600, 404393, 402107]
61969D02107j132l86n72j240j307l41R83J815K017J922J678J230P64P37J439K645
61953D12359L745M245M158L855L510L028K519K491L200M220N086O038P495R138
61939D75087J0235J0800J1660J3268J5175J6762J7824J8257J7879J6850J5735
61928F39532J4838J3923J2793J1573J0247Q443O036L441J025j344l763n813o993
61915G03938p311p128o692o083n194l581p86K896O418R057J1089J3075J4959J6185
61901G40842J6319J5122J2504Q862N077J701j584n215q833j1603j3206j4024j4483
61888G31479j4698j4663j4387j3853j3140j2452j1879j1330j0879j0827j1176
61877E92195j1408j1172j0791j0681j0689j0436r992r576q913p586n916m704m120
$$ y = [402107, 400975, 400589, 400017, 398777, 397470, 397129, 398112, 399927, 401944, 403866, 405544, 406774, 407538, 408275, 409714, 412359, 416104, 420349, 424507, 428362, 431872, 434900, 437419, 439910, 443110, 447330, 452416, 458454, 465949, 475087, 485322, 496122, 507782, 521050, 536225, 552987, 570811, 589068, 606947, 623797, 639532, 654370, 668293, 681086, 692659, 702906, 711349, 717385, 720826, 721851, 720507, 716744, 710931, 703938, 696627, 689499, 682807, 676724, 671530, 667949, 667163, 670059, 676477, 685534, 696623, 709698, 724657, 740842, 757161, 772283, 784787, 793649, 798726, 800427, 798843, 793628, 784795, 773192, 759986, 745962, 731479, 716781, 702118, 687731, 673878, 660738, 648286, 636407, 625077, 614198, 603371, 592195, 580787, 569615, 558824, 548143, 537454, 527018, 517026, 507450, 498537, 490951, 485035, 480331, 476211]
61864D76211l433k028j30J674L155M420N542O567P714R295J1345J3521J5452J7229
61850E66534J9417K2297K5215K7139K7918K8551K9807L1045L0905K8888K5686
61839H63402K2127J8395J4328R893N119O8m905r072j1813j2986j2702j0983p868
61826H63003l747O95M915Q741J2110J4760J6347J6769J6160J4501J1575P377K352
61813I85558l089q955j5154k0856k4996k7390k8762k9641k9869k9344k8486k7565
61801G11451k6193k3989k1364j9074j7368j5949j4517j2909j1027r099p682o960
61789E25320o378n456m578m410m787m985m801m670m730m594m058l381k765k196
61775D63531j884k083k372j926q24k63r42j953k010j225p48r23q74JJ050J384
$$ y = [476211, 472778, 470750, 470620, 472294, 475449, 479869, 485411, 491978, 499692, 508987, 520332, 533853, 549305, 566534, 585951, 608248, 633463, 660602, 688520, 717071, 746878, 777923, 808828, 837716, 863402, 885529, 903924, 918252, 928145, 933264, 933332, 928427, 919355, 907542, 894556, 881854, 870871, 863003, 859256, 859951, 864866, 873607, 885717, 900477, 916824, 933593, 949753, 964254, 975829, 983206, 985558, 982469, 973514, 958360, 937504, 912508, 885118, 856356, 826715, 796846, 767502, 739016, 711451, 685258, 661269, 639905, 620831, 603463, 587514, 572997, 560088, 549061, 539962, 532280, 525320, 518942, 513486, 508908, 504498, 499711, 494726, 489925, 485255, 480525, 475931, 471873, 468492, 465727, 463531, 461647, 459564, 457192, 455266, 454442, 454179, 453237, 451284, 449274, 448049, 447301, 446378, 445504, 445505, 446555, 447939]
61759D47939J143J184J809K521K834K744K349J613P75M66R35J472J077l13j736
61744D66812k281j898j166o47o28j077j693k192k625l092l250k539j043M24J289
61729D44394J798K299K550K258J813J769J895J538Q53Q13J821L095L743L814L837
61714D78290L840L570L240L280L323K383L68j336j516q83j242l023m637m594l382
61699D77681k609k910l526l640l239k734k470k665l222l523l015k055j581j844
61685D38648k179k141k094k380k587k167j255m45j72n49j399k140k215j843j767
61670D13315k030j780p39J07m5n53m43n9m57j618k490k588k362k040j296k22M17
61653C95117K74o4%L32N76P15P52M55j04k89L70J565K661L429L906L957L458K722
$$ y = [447939, 449082, 450266, 452075, 454596, 457430, 460174, 462523, 464136, 464911, 465377, 466312, 467784, 468861, 468548, 466812, 464531, 462633, 461467, 460820, 460192, 459115, 457422, 455230, 452605, 449513, 446263, 443724, 442681, 443105, 444394, 446192, 448491, 451041, 453299, 455112, 456881, 458776, 460314, 461167, 461980, 463801, 466896, 470639, 474453, 478290, 482130, 485700, 488940, 492220, 495543, 497926, 498294, 496958, 495442, 494559, 493317, 490294, 485657, 481063, 477681, 475072, 472162, 468636, 464996, 461757, 459023, 456553, 453888, 450666, 447143, 444128, 442073, 440492, 438648, 436469, 434328, 432234, 429854, 427267, 425100, 423845, 423400, 423228, 422679, 421280, 419140, 416925, 415082, 413315, 411285, 409505, 408766, 408873, 408828, 408275, 407832, 407773, 407316, 405698, 403208, 400620, 398258, 396218, 394922, 394700, 395117, 395391, 395327, 395327, 395659, 396235, 396950, 397702, 398157, 398053, 397764, 398134, 399699, 402360, 405789, 409695, 413652, 417110, 419832]
61635D19832K215J906J308K28q63j427j583j904k553k981k775k427k735l486l520
61620C99235k325r58p29j477j891j322m91l64j027j830k200k106k024k526l641
61605C74324m656m896m574m457m759m969m765m534m687m973m824m077l079k291
61591C12783k025k410l284m151m403l707k292r11l42p00j289j338p90j96k3k80
61575B84642p48j174j350j242j078j073j150j125r91q12n31j40J31J12l6j59m28
61558B72848r20j162o58K95Q89Q27N01K62J11J35N85J389K025K119J785J383J198
61541B83612J364J679J601Q98J91L14J137J674J389P98N83P29Q15O84M88L99M97
61524B98852O56M73l42j401j935j723j353j367j630j702j508j365j569k089k443
$$ y = [419832, 422047, 423953, 425261, 425489, 424626, 423199, 421616, 419712, 417159, 414178, 411403, 408976, 406241, 402755, 399235, 396910, 395952, 395223, 393746, 391855, 390533, 390042, 389678, 388651, 386821, 384621, 382515, 380491, 377965, 374324, 369668, 364772, 360198, 355741, 350982, 346013, 341248, 336714, 332027, 327054, 322230, 318153, 315074, 312783, 310758, 308348, 305064, 300913, 296510, 292803, 290511, 289600, 289258, 288558, 287269, 285931, 285141, 284945, 284922, 284642, 283894, 282720, 281370, 280128, 279050, 277977, 276827, 275702, 274711, 273899, 273368, 273228, 273359, 273471, 273435, 273276, 272848, 271928, 270766, 270108, 270403, 271292, 272119, 272620, 272882, 272993, 273128, 273713, 275102, 277127, 279246, 281031, 282414, 283612, 284976, 286655, 288256, 289154, 289345, 289659, 290796, 292470, 293859, 294657, 295240, 295969, 296784, 297468, 297956, 298355, 298852, 299508, 299981, 299639, 298238, 296303, 294580, 293227, 291860, 290230, 288528, 287020, 285655, 284086, 281997, 279554]
61509B79554k016p88L55N58R7J9O56J234J027K06o85j404j816j621q06J16O55
61492B75341Q49R26Q42N10J05j40k20j89J2L23N38O37Q46J192J386J322J288J464
61474B87032J621J542J321J059O84K38m0j32k72l88q6N84R49O75L32N45J122J442
61456B98228J311R29N24L76Q02J549J761J092L66M04O88R5j270j955j005Q94K315
61439C07104K609K201J830J841K036K028J775J681K075K689K895K471J827J488
61425C36550J498J445J012M39L46R27J529J370O80N72J598K932L352K633J539
61410C58422P51L37P8j90o29j333k121k561k332j531o35k17m73j025j331j303
61394C43907j280j354j157m89K84O48M81q1q99j636j746j065j07N84J054J548
$$ y = [279554, 277538, 276750, 277105, 277663, 277760, 277779, 278435, 279669, 280696, 280902, 280217, 278813, 276997, 275376, 274570, 274686, 275341, 276190, 277116, 277958, 278468, 278573, 278433, 278213, 278024, 278036, 278359, 278897, 279534, 280380, 281572, 282958, 284280, 285568, 287032, 288653, 290195, 291516, 292575, 293259, 293497, 293457, 293325, 293053, 292665, 292579, 293163, 294112, 294787, 295119, 295664, 296786, 298228, 299539, 300468, 300992, 301368, 302170, 303719, 305480, 306572, 306938, 307342, 308030, 308125, 306855, 304900, 303895, 304789, 307104, 309713, 311914, 313744, 315585, 317621, 319649, 321424, 323105, 325180, 327869, 330764, 333235, 335062, 336550, 338048, 339493, 340505, 340944, 341290, 342217, 343746, 345116, 345796, 346368, 347966, 350898, 354250, 356883, 358422, 359173, 359510, 359588, 359398, 358769, 357436, 355315, 352754, 350422, 348891, 348256, 348039, 347566, 346541, 345210, 343907, 342627, 341273, 340116, 339627, 339911, 340559, 341040, 340959, 340060, 338424, 336678, 335613, 335506, 336090, 337144, 338692]
61378C38692J840J556R37O72R32J108O80j8j42O63J744K026J198K12L00J499K551
61361C56450K394J312L77J75M90R25J331J787K493L651N179O633P644Q249Q625
61346D07715Q750Q536Q073P496O770N867M906M011L249K791K814L020K790K036
61332D78824J458J574J932J791J135M76l6o77j502k187k524k596k506k226j711
61317D71225r62p6O65J042J321K000K962L502L533M028N650P647Q937R751J1112
61302E32337J3013J4260J4181J3378J2479J1120Q701N483K335k24k261l983n427
61289F15392o550p358p939q442q913r197r117q735q302p933p509o811n704m284
61275E08598k888j832j033j79P39J440K053L127M662N642N145L509J887J008R60
$$ y = [338692, 340532, 342088, 343025, 343697, 344629, 345737, 346417, 346399, 346257, 346920, 348664, 350690, 351888, 352100, 352400, 353899, 356450, 358844, 360156, 360533, 360708, 361198, 362123, 363454, 365241, 367734, 371385, 376564, 383197, 390841, 399090, 407715, 416465, 425001, 433074, 440570, 447340, 453207, 458113, 462124, 465373, 468164, 470978, 473998, 476788, 478824, 480282, 481856, 483788, 485579, 486714, 487190, 487154, 486477, 484975, 482788, 480264, 477668, 475162, 472936, 471225, 470263, 470187, 470852, 471894, 473215, 475215, 478177, 481679, 485212, 489240, 494890, 502537, 511474, 521225, 532337, 545350, 559610, 573791, 587169, 599648, 610768, 619469, 624952, 627287, 627063, 624802, 620819, 615392, 608842, 601484, 593545, 585103, 576190, 566993, 557876, 549141, 540839, 532906, 525397, 518586, 512882, 508598, 505710, 503878, 502845, 502666, 503405, 504845, 506898, 510025, 514687, 520329, 525474, 528983, 530870, 531878, 532838]
61260E32838J767L360N222O731P846Q751R151Q537P125N703M634L723K972K600
61246F10960K276J267m23j860k423k575l034l809m463m687m278l136j736j016
61232E81063j322j850j726j077m72K49J734L822N427N892N837O250P146P605O992
61217F25570N726M739M501M734N009N294N803O432O585N714L938K059Q36L33R9
61202F87372q9N3P48J705K548L447M811O590Q419J0357J2798J5481J7345J7675
61188G89260J6830J5494J3734J1260Q184N099K665J370J243J521J166L7r85j441
61174H65437k079l591n375o429o918p714q762r116q513p907q207r333j0708j2038
61160G58747j3289j4432j5331j5647j4937j3264j1531j0652j0483j0096q884o859
$$ y = [532838, 534605, 537965, 543187, 549918, 557764, 566515, 575666, 584203, 591328, 597031, 601665, 605388, 608360, 610960, 613236, 614503, 614080, 612220, 609797, 607222, 604188, 600379, 595916, 591229, 586951, 583815, 582079, 581063, 579741, 577891, 576165, 575088, 574616, 574865, 576599, 580421, 585848, 591740, 597577, 603827, 610973, 618578, 625570, 631296, 636035, 640536, 645270, 650279, 655573, 661376, 667808, 674393, 680107, 684045, 686104, 686940, 687273, 687372, 687283, 687336, 688084, 689789, 692337, 695784, 700595, 707185, 715604, 725961, 738759, 754240, 771585, 789260, 806090, 821584, 835318, 846578, 854762, 859861, 862526, 863896, 865139, 866660, 867826, 867863, 866878, 865437, 863358, 859767, 854392, 847963, 841045, 833331, 824569, 815453, 806940, 799033, 790826, 781493, 770785, 758747, 745458, 731026, 715695, 700048, 685111, 671847, 660316, 649664, 639181, 629085, 620201, 613342]
61148F13342m210j346Q52J700J515J077L27j450m222o964q910j0066j0348r230
61134E62067o813m320k841k134j215L22K023L347M157M693N421O780Q821J1139
61120E91447J3255J4943J6267J7520J9051K0890K2610K3808K4580K5252K5902
61109H15525K6430K6908K7367K7486K6935K5826K4426K2746K0754J8593J6085
61098A079081J2615Q140L704N2l559q075j2770j6078j7920j9632k1709k3239k3726
61085I56884k3898k4248k4333k4034k4102k4677k4523k2641j9685j6943j4874
61074G12926j3445j2885j3040j2743j1014q515o795o254n741m160j775K39J151
61061F17949J389J921L051M123M589M884N644O581O995P124P891R432J0958J2112
$$ y = [613342, 609132, 607786, 608638, 610338, 611853, 612930, 613257, 611807, 607585, 600621, 591711, 581645, 571297, 562067, 555254, 550934, 548093, 545959, 544744, 545066, 547089, 550436, 554593, 559286, 564707, 571487, 580308, 591447, 604702, 619645, 635912, 653432, 672483, 693373, 715983, 739791, 764371, 789623, 815525, 841955, 868863, 896230, 923716, 950651, 976477, 1000903, 1023649, 1044403, 1062996, 1079081, 1091696, 1099836, 1103540, 1103592, 1100033, 1091958, 1079188, 1063110, 1045190, 1025558, 1003849, 980610, 956884, 932986, 908738, 884405, 860371, 836269, 811592, 787069, 764428, 744743, 727800, 712926, 699481, 686596, 673556, 660813, 649799, 641284, 634489, 628235, 622494, 618334, 616559, 616798, 617949, 619338, 621259, 624310, 628433, 633022, 637906, 643550, 650131, 657126, 664250, 672141, 681573, 692531, 704643]
61047G04643J3323J4771J6137J7537J9484K1772K3595K4978K6747K8894L0438
61036I42319L1302L2677L4977L7006L8048L9190M1567M4664M7416M9731N1779
61025A390676N2993N2973N2440N2297N2798N4462N8502O5276P3538Q2267R1895
61014B080117J02626J13281J23385J35022J51125J73518K04136K46169L01783
61005C631162L70567M52886N52903O75912Q26025J011214J246357J539082J865190
60996A2171298K160318K339137K323949K065197J561983Q90276K10944k81884
60988B3441218m59666l30915k4537K91073M75325M32129J12688m56722j149975
60979B2330618j777861k183417k318028k235268k025465j761487j488581j235078
$$ y = [704643, 717966, 732737, 748874, 766411, 785895, 807667, 831262, 856240, 882987, 911881, 942319, 973621, 1006298, 1041275, 1078281, 1116329, 1155519, 1197086, 1241750, 1289166, 1338897, 1390676, 1443669, 1496642, 1549082, 1601379, 1654177, 1708639, 1767141, 1832417, 1905955, 1988222, 2080117, 2182743, 2296024, 2419409, 2554431, 2705556, 2879074, 3083210, 3329379, 3631162, 4001729, 4454615, 5007518, 5683430, 6509455, 7520669, 8767026, 10306108, 12171298, 14331616, 16670753, 18994702, 21059899, 22621882, 23512158, 23723102, 23441218, 22981552, 22650637, 22626100, 22917173, 23392498, 23824627, 23937315, 23480593, 22330618, 20552757, 18369340, 16051312, 13816044, 11790579, 10029092, 8540511, 7305433]
60971G305433j016510q35064o85314n62143m62052l80872l14751k62216k22414
60962B564097j92324j68092j47984j31923j18960j07350r6357q6144p6418o6744
60952A371801n7658m9938m3328l7346l2848l1160l1899l2972l2671l0800k8020
60941I63161k5162k2930k1363j9706j7534j5603j4830j4886j4709j3953j2994
60930G69491j1974j0852j0090j0164j0534j0095q667p170o361o176o272o421o292
60917F58423n539m305l133k354j869j503j153p24k79j9J34O60J791L147M406N810
60901F53493P489Q889R526R870J0653J1791J2746J3585J4732J6001J6886J7621
60889H03282J8834K0318K1141K1088K0921K0995K0739J9767J8589J7637J6421
$$ y = [7305433, 6288923, 5453859, 4768545, 4206402, 3744350, 3363478, 3048727, 2786511, 2564097, 2371773, 2203681, 2055697, 1923774, 1804814, 1697464, 1601107, 1514963, 1438545, 1371801, 1314143, 1264205, 1220877, 1183531, 1150683, 1119523, 1087624, 1054652, 1021981, 991181, 963161, 937999, 915069, 893706, 874000, 856466, 840863, 826033, 811147, 796438, 782485, 769491, 757517, 746665, 736575, 726411, 715877, 705782, 697115, 689945, 683584, 677408, 671136, 664715, 658423, 652884, 648579, 645446, 643092, 641223, 639720, 638567, 637843, 637564, 637545, 637679, 638339, 640130, 643277, 647683, 653493, 660982, 669871, 679397, 689267, 699920, 711711, 724457, 738042, 752774, 768775, 785661, 803282, 822116, 842434, 863575, 884663, 905584, 926579, 947318, 967085, 985674, 1003311, 1019732]
60878A019732J4303J1568R071P208N707M118K095n76l769p001r927j2573j4910
60865A025046j6518j7046j6796j6423j6247j6158j6093j6192j6450j6582j6409
60854H44132j6200j6438j7216j7972j7902j6747j5135j4043j3910j4286j4417
60843F69866j4051j3596j3523j3737j3690j3145j2607j2736j3359j3448j2248
60832E23726j0195q461p774p937q337q503q143p143n734m477l751l303k600j574
60818D35794q07q01j288j543j292q81n46J1R22J518J048j14p15k01O65J015R99
60801D33784J211J558J532J240J334J869K034J306K79j00K39N41K93k69p71j372
60785D44708k425l678m247l567k178j282j527k463l252l642m040m762n478n561
$$ y = [1019732, 1034035, 1045603, 1054674, 1061882, 1067589, 1071707, 1073802, 1073226, 1069457, 1062456, 1052529, 1039956, 1025046, 1008528, 991482, 974686, 958263, 942016, 925858, 909765, 893573, 877123, 860541, 844132, 827932, 811494, 794278, 776306, 758404, 741657, 726522, 712479, 698569, 684283, 669866, 655815, 642219, 628696, 614959, 601269, 588124, 575517, 562781, 549422, 535974, 523726, 513531, 505070, 497296, 489359, 481022, 472519, 464376, 457233, 451499, 447022, 443271, 439968, 437368, 435794, 434987, 434186, 432898, 431355, 430063, 429182, 428636, 428647, 429569, 431087, 432135, 432021, 431306, 431105, 431770, 432785, 433784, 434995, 436553, 438085, 439325, 440659, 442528, 444562, 445868, 446147, 446047, 446286, 446827, 447120, 446851, 446080, 444708, 442283, 438605, 434358, 430791, 428613, 427331, 425804, 423341, 420089, 416447, 412407, 407645, 402167, 396606]
60771C96606m815l752l110l153l428l178k038m00Q03Q11k74j570k271k405k455
60756C65371k423j791n42M40M28q8n5P85J766K450L046L733M241M416M519M639
60740C90935M341L297J891P42k2o23j055j154j130j564k733m166n006m735l671
60725C75347k751k736l533m436m958n158n139m624l406j928j059j246k097k752
60711C29524k651j977j441j533k006k212j898j358q84m94k24k62o11r42j026q97
60695C09108m68N19J745K165J234j01m26K39M82m05j314q03J004K733L633M194
60679C23539M895N284M830M050L965M640N063M647M091M319N141N552N086M253
60665C89355L663L301K776J965J149O94O48O48L09k21l76m7J32k99q41p57k29
$$ y = [396606, 391791, 388039, 384929, 381776, 378348, 375170, 373132, 372732, 373535, 374346, 374072, 372502, 370231, 367826, 365371, 362948, 361157, 360615, 361055, 361483, 361395, 361340, 362125, 363891, 366341, 369387, 373120, 377361, 381777, 386296, 390935, 395276, 398573, 400464, 401206, 401184, 400561, 399506, 398352, 397222, 395658, 392925, 388759, 383753, 379018, 375347, 372596, 369860, 366327, 361891, 356933, 351775, 346636, 342012, 338606, 336678, 335619, 334373, 332276, 329524, 326873, 324896, 323455, 321922, 319916, 317704, 315806, 314448, 313564, 313070, 312846, 312584, 311973, 311031, 310005, 309108, 308640, 309159, 310904, 313069, 314303, 314202, 313776, 314015, 314497, 314092, 312778, 311975, 312979, 315712, 319345, 323539, 328434, 333718, 338548, 342598, 346563, 351203, 356266, 360913, 365004, 369323, 374464, 380016, 385102, 389355, 393018, 396319, 399095, 401060, 402209, 402903, 403551, 404199, 404508, 404287, 403911, 403864, 403996, 403697, 402856, 402099, 401870]
60648D01870o6m02n50j79J77j3o17j354k241l230l919m077m010m075m252m442
60632C68620m719m904m496l399k311j920k038k003j531p74R4Q36J024N17j10j08
60616C42778N54J217J341R15K37l50n78m71l87o15r56r30l45N06J095J071N82
60599C45664K88P36J620K024J544P64M54O77R72J011P28J50m70p03m38r2LM6L14
60580C55292O25O30L50M4j17Q0R21K200L122L288L392M317N905P311Q271R225
60564D04856J0374J1389J2068J2452J2248J0860Q262N221K415k53l109n925p988
60551D72870q735q119o552m668k989j619k29J524L548N290O267O733P591R368
60537D80280J1420J2650J2983J3422J4402J4942J3871J1284Q013M348K09l797
$$ y = [401870, 401804, 401402, 400852, 400673, 400850, 400837, 400220, 398866, 396625, 393395, 389476, 385399, 381389, 377314, 373062, 368620, 363901, 358997, 354501, 351102, 348791, 346871, 344833, 342830, 341299, 340525, 340619, 341455, 342479, 342996, 342886, 342778, 343332, 344549, 345890, 346805, 347042, 346692, 346114, 345643, 345256, 344641, 343685, 342755, 342410, 342916, 344011, 345082, 345664, 345952, 346688, 348308, 350332, 351876, 352640, 353094, 353771, 354743, 355754, 356482, 356632, 356162, 355459, 355021, 354929, 354932, 354978, 355292, 355917, 356547, 356897, 356941, 356824, 356904, 357825, 360025, 363147, 366435, 369827, 374144, 380049, 387360, 395631, 404856, 415230, 426619, 438687, 451139, 463387, 474247, 482509, 487730, 490145, 489892, 486783, 480858, 472870, 464135, 456016, 449464, 444796, 441807, 440188, 439959, 441483, 445031, 450321, 456588, 463321, 470912, 480280, 491700, 504350, 517333, 530755, 545157, 560099, 573970, 585254, 593267, 597615, 597824, 594027]
60525E94027o533p652p828p636o971n829m859m637m884m872m329l564k862k103
60511E19468j064J33J061J455J574J832K265K697L453N277Q300J1685J4712J7773
60497E90621K1657K6314L0968L5158L8932M2155M4356M5240M4764M2678L8574
60486A001417L2443K4698J5683N605n095j5748k5841l4929m2296m7233m9608m9758
60474H09338m7931m4372l9820l5247l1048k7050k3314k0322j8276j6763j5256
60463D89939j3516j1531r512p974p267p038o612n852n141m593l960l291k946k900
60449C97806k737k463k568l121l524l375k872k183j197j82J40l46p38l30M31P19
60433C73460M70N4o08j740k835k957j932o37j6j98o48p86l80L91J096J410J355
$$ y = [594027, 587494, 579842, 572014, 564378, 557407, 551578, 546719, 542082, 537198, 532326, 527997, 524433, 521571, 519468, 518404, 518537, 519598, 521053, 522627, 524459, 526724, 529421, 532874, 538151, 546451, 558136, 572848, 590621, 612278, 638592, 669560, 704718, 743650, 785805, 830161, 875401, 920165, 962843, 1001417, 1033860, 1058558, 1074241, 1079846, 1074751, 1059003, 1033162, 998233, 955937, 908704, 859096, 809338, 761407, 717035, 677215, 641968, 610920, 583870, 560556, 540234, 521958, 505195, 489939, 476423, 464892, 455380, 447406, 440139, 433101, 426489, 420637, 415496, 410903, 406943, 403652, 400706, 397806, 395069, 392606, 390038, 386917, 383393, 380018, 377146, 374963, 373766, 373584, 373724, 373378, 372640, 372310, 372741, 373460, 373930, 373984, 373376, 371636, 368801, 365844, 363912, 363275, 363259, 363061, 362413, 361627, 361247, 361638, 362734, 364144, 365499]
60416C65499J218J238J430J584J522J346J330J423J196N19l9RK15j84r42r53K12
60399C76623J747K749L128L112K723K145J885J994J880J409J469K693M219M619
60385D12395L746K761K511K754K882K693K277J756J331J231J515K097K893L648
60371D46490L910L535L037K983L226L244L001K797K467J515J70m85J28J201J490
60356D78709P86l3j51M78J489K618L734M683N393O045O932Q093R121R363Q353
60341E45613O102L129J90k060l383l985m235m374m444m440m376m255m061l795
60327E11626l491l258l319l842m630n153n134m943n116n611n844n409m416l144
60313D48316j757m16P42J853L196M698N968P002Q446J0790J3657J6218J8197J9987
$$ y = [365499, 366717, 367955, 369385, 370969, 372491, 373837, 375167, 376590, 377786, 378305, 378266, 378275, 378490, 378306, 377364, 376411, 376623, 378370, 381119, 384247, 387359, 390082, 392227, 394112, 396106, 397986, 399395, 400864, 403557, 407776, 412395, 416141, 418902, 421413, 424167, 427049, 429742, 432019, 433775, 435106, 436337, 437852, 439949, 442842, 446490, 450400, 453935, 456972, 459955, 463181, 466425, 469426, 472223, 474690, 476205, 476375, 475890, 476018, 477219, 478709, 479495, 479462, 479311, 479789, 481278, 483896, 487630, 492313, 497706, 503751, 510683, 518776, 527897, 537260, 545613, 551715, 554844, 555034, 552974, 549591, 545606, 541371, 536997, 532553, 528113, 523737, 519482, 515421, 511626, 508135, 504877, 501558, 497716, 493086, 487933, 482799, 477856, 472740, 467129, 461285, 455876, 451460, 448316, 446559, 446143, 446885, 448738, 451934, 456632, 462600, 469602, 478048, 488838, 502495, 518713, 536910, 556897]
60299E56897K1740K2692K1592J7820J1984N353j270p845j4230j9383k2000k1854
60287E71496k0022j7710j5305j2764j0293q290o835n677m618l682k993k657k608
60274D58042k585k382k163k245k508k504k201k120k436k511j869j164j424k473
60260D27457k913j916l46L36j20o62m94q2l03j084j484j013k49P6O3L18R99J687
60242D20270K006J880J325M52l13n66m56m68o62o11j25N15J072J600K032K076
60226D30027J797J750K220K774K855K435J861J377J139J324J944K794L811N109
60212D63217O457P197O950O122N378M984M904N171N777O467O965P171O964O184
60198E49908N061M255M084M107L795L296L113L333L520L191K134N80p50j240j266
$$ y = [556897, 578637, 601329, 622921, 640741, 652725, 658078, 656808, 648963, 634733, 615350, 593350, 571496, 551474, 533764, 518459, 505695, 495402, 487112, 480277, 474600, 469982, 466300, 463307, 460650, 458042, 455457, 453075, 450912, 448667, 446159, 443655, 441454, 439334, 436898, 434387, 432518, 431354, 429930, 427457, 424544, 422628, 422282, 422618, 422498, 421836, 421342, 421260, 420957, 419873, 418389, 417376, 417127, 417203, 417266, 417584, 418583, 420270, 422276, 424156, 425481, 425933, 425620, 425054, 424598, 424130, 423468, 422857, 422732, 423247, 424319, 425919, 427951, 430027, 431824, 433574, 435794, 438568, 441423, 443858, 445719, 447096, 448235, 449559, 451503, 454297, 458108, 463217, 469674, 476871, 483821, 489943, 495321, 500305, 505209, 510380, 516157, 522624, 529589, 536760, 543724, 549908, 554969, 559224, 563308, 567415, 571210, 574506, 577619, 580952, 584472, 587663, 589797, 590377, 589627, 588387, 587121]
60183E87121j928l573n156n653n412n409n700n578m948m547m761n063m751l713
60169E20929k306j079n39p53j172j277j308j764k389k416j794j367j584j800j262
60154D98119j77O97J063J248J564J952K126J889J385J174J804L055L869L361J816
60139E24945M52K78J348L024M640N817O380O291N725M999M254L290J929M86m50
60124E73408o78n61m17j62L19Q28J207J735K733L979M832M864M097K825J552Q65
60108F01426R22J179R67K33o85j720k983m124m472l935l210k913k986l123l290
60093E71286l467l323k593j558p71l62R0R06J827K276K034J525J287J259Q46j33
60077E71129r80r67m75o40j869l291l985m107m355m781m827m397m125m476n184
$$ y = [587121, 585193, 581620, 576464, 570811, 565399, 559990, 554290, 548712, 543764, 539217, 534456, 529393, 524642, 520929, 518623, 517544, 517005, 516252, 515080, 513803, 512495, 510731, 508342, 505926, 504132, 502765, 501181, 499381, 498119, 497942, 498639, 499702, 500950, 502514, 504466, 506592, 508481, 509866, 511040, 512844, 515899, 519768, 523129, 524945, 525397, 525675, 527023, 530047, 534687, 540504, 546884, 553175, 558900, 563899, 568153, 571443, 573372, 573858, 573408, 572730, 572169, 571752, 571590, 571909, 572737, 573944, 575679, 578412, 582391, 587223, 592087, 596184, 599009, 600561, 601426, 602348, 603527, 604494, 604727, 604042, 602322, 599339, 595215, 590743, 586808, 583598, 580685, 577699, 574576, 571286, 567819, 564496, 561903, 560345, 559574, 559212, 559302, 560208, 562035, 564311, 566345, 567870, 569157, 570416, 571262, 571129, 570149, 569182, 568707, 568067, 566198, 562907, 558922, 554815, 550460, 545679, 540852, 536455, 532330, 527854, 522670]
60062E22670n846o487p112p166o189m814m303m910n400m603k876j509j072r76
60048D59407n39K35R99J613K132K604L094L676M301M888N532O242O514N682L897
60033E10277K303J926K596L196K760J198p73k254k907l267m117n515o742p281
60019D91400p429p720q132q148p362n834m106k967k825l193l121k392j762j840
60005D24569k267k393k228k174k164j772j012m11k72l11r4M81J158J579J574J366
59989D15629J401J848K367K566K515K608L024L449L351K484J261M78M58O09J64
59974D44212p87j572k010k506l046l014k268j611j678k021j861j173n07j93j50
59959D19815j22K39J102K023K357K223K293K414J553l10j450n01J657L104L216
$$ y = [522670, 516824, 510337, 503225, 496059, 489870, 485056, 480753, 475843, 470443, 465840, 462964, 461455, 460383, 459407, 458868, 459103, 460102, 461715, 463847, 466451, 469545, 473221, 477522, 482410, 487942, 494184, 500698, 506380, 510277, 512580, 514506, 517102, 520298, 523058, 524256, 523483, 521229, 518322, 515055, 510938, 505423, 498681, 491400, 483971, 476251, 468119, 459971, 452609, 446775, 442669, 439702, 436877, 433684, 430563, 428171, 426409, 424569, 422302, 419909, 417681, 415507, 413343, 411571, 410559, 410148, 409876, 409565, 409471, 409952, 411110, 412689, 414263, 415629, 417030, 418878, 421245, 423811, 426326, 428934, 431958, 435407, 438758, 441242, 442503, 442981, 443439, 444048, 444212, 443425, 441853, 439843, 437337, 434291, 431277, 429009, 427398, 425720, 423699, 421838, 420665, 420158, 419965, 419815, 419693, 419932, 421034, 423057, 425414, 427637, 429930, 432344, 433897, 433587, 432137, 431636, 433293, 436397, 439613]
59944D39613K697K056J417J253J907K650K474J629J155J133P22j67o26l05L1j66
59928D57473m79m32k42k37l30l44k74n6L18N04L41M84J550K807K948K197K251
59911D68479L813N502N873N284M884M766M166K857J324q1j349k337k776k705k438
59896D95262k117j589o82N23J591K016J809J717K375L432M089M359M991O113O809
59881E30698O340N057L815L098L048L646M436M635L926K769J679O81l79j543k957
59866E68949m783o588p565p567p327p282o972n996m809l895k905j282O47K025
59852E04650K657L186M246N948Q064J0252J2016J2812J2238J0195P084L826J307
59839E98481k11r08p31M43K037K862K255N30j748m273o577p944q121p564o633
$$ y = [439613, 442310, 444366, 445783, 447036, 448943, 451593, 454067, 455696, 456851, 457984, 458706, 458539, 457913, 457608, 457639, 457473, 456994, 456562, 456320, 456083, 455753, 455409, 455135, 455079, 455397, 455901, 456242, 456726, 458276, 461083, 464031, 466228, 468479, 472292, 477794, 483667, 488951, 493835, 498601, 502767, 505624, 506948, 506867, 505518, 503181, 500405, 497700, 495262, 493145, 491556, 490874, 491397, 492988, 495004, 496813, 498530, 500905, 504337, 508426, 512785, 517776, 523889, 530698, 537038, 542095, 545910, 549008, 552056, 555702, 560138, 564773, 568699, 571468, 573147, 573828, 573449, 571906, 568949, 564166, 557578, 550013, 542446, 535119, 527837, 520865, 514869, 510060, 506165, 503260, 501978, 502625, 504650, 507307, 510493, 514739, 520687, 528751, 539003, 551019, 563831, 576069, 586264, 593348, 597174, 598481, 598270, 597362, 596631, 597074, 599111, 601973, 604228, 604758, 603010, 598737, 592160, 584216, 576095, 568531, 561898]
59824E61898n376m267m259n408o384o121n239n032n627o061n729m795l533k120
59810D91947r51l57q9L16P22N66k87j377k245k706k684k271j856j797k088k566
59794D72277l143l461k902j494l55m01r76o83N71J401R09j64o09k65J72L10L22
59777D61509L13k4r14k013k609k319j528r95j035j221r67k11O41J200J361J223
59761D52411J032J057J298J421J194Q92R57J374J712J776J905K528L618M700N338
59746D83213N505N462N380N141M649M108L796L597L106K276J656J731K233K462
59732E34315K135J636J365J219R28O84R97J807K265J806J100J255K230K825K380
59717E58947J565J079N65m55j367j216j98O57R83J175J241P00k34n54K00J260
$$ y = [561898, 556522, 552255, 547996, 542588, 536204, 530083, 524844, 519812, 514185, 508124, 502395, 497600, 494067, 491947, 490996, 490639, 490550, 490866, 491588, 492154, 491867, 490490, 488245, 485539, 482855, 480584, 478728, 476931, 474843, 472277, 469134, 465673, 462771, 461277, 460922, 460521, 459545, 458862, 459433, 460834, 461743, 461579, 460970, 460705, 460877, 461187, 461509, 461822, 461798, 460884, 458871, 456262, 453943, 452415, 451420, 450385, 449164, 448197, 447986, 448627, 449827, 451188, 452411, 453443, 454500, 455798, 457219, 458413, 459305, 460262, 461636, 463348, 465124, 467029, 469557, 473175, 477875, 483213, 488718, 494180, 499560, 504701, 509350, 513458, 517254, 520851, 523957, 526233, 527889, 529620, 531853, 534315, 536450, 538086, 539451, 540670, 541598, 542282, 543279, 545086, 547351, 549157, 550257, 551512, 553742, 556567, 558947, 560512, 561591, 562156, 561701, 560334, 559118, 558920, 559577, 560560, 561735, 562976, 563676, 563442, 562888, 563088, 564348]
59701E64348J656J212L48m28p08l52L13R72J830L011L773L235J781O82L77J94
59685E82244k33m99n17q48j532j827j425r14o97n79p47j856l673m955n248n523
59669E51171o398p064o764o014n482m936m225l897l840k733k33J690J290k86o54
59654E01625M69J489J795K218K951L105K514K178K558K890K570J918J286M69o58
59639E29377j862l141m659n944o140n186l893k736j524l51J61j65p29j127j586
59624D90495k142k245j680j155j472k465l267l300k748k207k104k352k530k412
59610D58416k071j481m81O20J091Q31P93J636K603K535J525O15K18j13n71q04
59594D65362p02n70m47n4N49R58J081J127R87M04l93q44q63q37r68j213j668k319
$$ y = [564348, 566004, 567216, 567564, 567136, 566428, 566076, 566389, 567361, 569191, 572202, 575975, 579210, 580991, 581673, 582050, 582244, 582011, 581512, 580995, 580147, 578615, 576788, 575363, 574449, 573752, 573173, 572426, 570570, 566897, 561942, 556694, 551171, 544773, 537709, 530945, 524931, 519449, 514513, 510288, 506391, 502551, 499818, 499585, 501275, 502565, 502279, 501625, 502094, 503583, 505378, 507596, 510547, 513652, 516166, 518344, 520902, 523792, 526362, 528280, 529566, 530035, 529377, 527515, 524374, 519715, 513771, 507631, 502445, 498552, 495816, 494292, 493941, 494102, 493937, 493208, 492081, 490495, 488353, 486108, 484428, 483273, 481801, 479336, 476069, 472769, 470021, 467814, 465710, 463358, 460828, 458416, 456345, 454864, 454383, 455003, 456094, 456925, 457718, 459354, 461957, 464492, 466017, 466632, 466850, 466737, 466166, 465362, 464660, 464090, 463643, 463589, 464138, 465096, 466177, 467304, 468291, 468695, 468302, 467458, 466595, 465758, 464790, 463577, 461909, 459590]
59576D59590k620k103j191p11p94j029j375j957k305j808q79n65j024j351r90
59561D38888l34J15K95K21n9j19L89R81R13L95K63N44N31K66O34J764K632K762
59543D51081L032M158N498O208O759Q351J1307J4826J8015K0462K1756K0984J6976
59530F09413R398j67q548j3074j3430j1213q030m612j364J287L201M462M931M507
59516E76761L682L035K291P33j552l755n586p382r000r760r649r545r897j0098
59502E10278r529q307o785n155l793l167l081k852k361k103k118j833j207q67
59488D57120r32p46j53J66P0M30J581K489K318J823K158L140L745L806M115N033
59472D86163N985O271N772M784L550K157P64j68j39P12J505J653J609K023K553
$$ y = [459590, 456970, 454867, 453676, 452965, 452171, 451142, 449767, 447810, 445505, 443697, 442818, 442253, 441229, 439878, 438888, 438554, 438669, 438964, 439185, 439126, 439007, 439396, 440377, 441290, 441685, 441948, 442492, 443023, 443289, 443923, 445687, 448319, 451081, 454113, 458271, 463769, 469977, 476736, 485087, 496394, 511220, 529235, 549697, 571453, 592437, 609413, 618811, 618644, 610096, 597022, 583592, 572379, 564349, 559737, 558373, 559660, 562861, 567323, 572254, 576761, 580443, 583478, 585769, 586502, 584950, 581195, 575609, 568227, 559227, 549467, 539818, 530273, 520376, 510278, 500749, 492442, 485657, 480502, 476709, 473542, 470461, 467609, 465248, 463145, 461027, 459194, 457987, 457120, 456188, 455442, 455289, 455455, 455525, 455955, 457536, 460025, 462343, 464166, 466324, 469464, 473209, 477015, 481130, 486163, 492148, 498419, 504191, 508975, 512525, 514682, 515446, 515278, 515139, 515851, 517356, 519009, 520618, 522641, 525194]
59457E25194K527K319L035M829O732Q157R387J0451J0721R974Q813P780O943O476
59443F23338O477O046L861L1l779o388q073r205r442q807q196q062p800p083o507
59428E56411o249n462l805k306j724j280K8K028M180O603R291J1512J3060J4958
59414E97245J7844K0924K3501K6225K9392L1391L0344K6073J8963Q494m782j7103
59402H08511k3989k4656k1723j7031j0278j892N530R505R486N618k265j3060k3304
59389G00452k9393l0517k8464k5113k1085j6498j1918q175n633l981k707j656
59377E15312q86j88P48J696K069K001K388L459M231M041L724M231M974M766L826
59362E56392L423L868M363M680N520O997Q157Q367Q181Q415R250J0539J2120J3485
$$ y = [525194, 527721, 530040, 533075, 537904, 544636, 552793, 562180, 572631, 583352, 593326, 602139, 609919, 616862, 623338, 629815, 635861, 639722, 639753, 635974, 629586, 621513, 612308, 602866, 594059, 585863, 577801, 570001, 562918, 556411, 550162, 544700, 540895, 538589, 536865, 535585, 535613, 537641, 541821, 548424, 557715, 569227, 582287, 597245, 615089, 636013, 659514, 685739, 715131, 746522, 776866, 802939, 821902, 830396, 825614, 808511, 784522, 759866, 738143, 721112, 710834, 708942, 714472, 723977, 733463, 739081, 736816, 723756, 700452, 671059, 640542, 612078, 586965, 565880, 549382, 537464, 529289, 523656, 519675, 516968, 515312, 514426, 514238, 514986, 516682, 518751, 520752, 523140, 526599, 530830, 534871, 538595, 542826, 547800, 552566, 556392, 559815, 563683, 568046, 572726, 578246, 585243, 593400, 601767, 609948, 618363, 627613, 638152, 650272, 663757]
59348F63757J4049J4079J4541J5678J6591J6626J6364J6568J6857J6183J4217
59337H35510J1606R026O506L719N34k838o066r006j1700j4053j5707j6436j6557
59324G74538j6598j6652j6317j5282j3759j2284j1264j0621r821q419o685n424
59312F31412n012m938m473l415j971l51J166K259L069M324O510R268J2033J4739
59298F64620J7329J8988J8545J5446R854K288o163j3656j8562k0653k0772j9539
59286F47725j7071j3800j0683q436p060o119n072l420j143R72K034K151K332L301
59272E85711M882O622Q393J0097J1265J1446J0924J0620J1034J1405J0364P586
59260G00349M350K031M04j775m820p718r739j1228j2424j2687j1605r986q863
$$ y = [663757, 677806, 691885, 706426, 722104, 738695, 755321, 771685, 788253, 805110, 821293, 835510, 847116, 856142, 862648, 866367, 866901, 864063, 857997, 848991, 837291, 823238, 807531, 791095, 774538, 757940, 741288, 724971, 709689, 695930, 683646, 672382, 661761, 651940, 643521, 636836, 631412, 626400, 621462, 616989, 613574, 611603, 611252, 612418, 614677, 617746, 622070, 628580, 637848, 649881, 664620, 681949, 700937, 719482, 734928, 744782, 747070, 740907, 727251, 708689, 688036, 667264, 647725, 630654, 616854, 606171, 597735, 590675, 584556, 579484, 576064, 574921, 575893, 577927, 580078, 582410, 585711, 590593, 597215, 605608, 615705, 626970, 638416, 649340, 659960, 670994, 682399, 692763, 700349, 704699, 706730, 707134, 705359, 700539, 692821, 683082, 671854, 659430, 646743, 635138, 625152, 616289]
59247F16289q252p596o840o195n454m308k934j551K9J759K956L326L683M705N676
59232E95293N573M738M261M145L530K391J624J413Q70n10k176l575m873o240p278
59217E99186p538p071o181n119m170l550l110k476j543n00M77J168J228O34p3
59202E61362l96m85o15o19l52j94l14qJ309K865L325K563J687J465J674J821J650
59185E76738J009R7l45J02P18N32k21m91mN88Q92J070J039N97L06J080K741M107
59167E90555M643N042N979P321Q797J0357J1540J1506J0147Q421P121O009M545
59154F91983K780J081m85k115l879n605o884p274o846o394o559p059p266p223
59140F28255p352p472p085o420o185o301n902m811l991m292n405o408o665o055
$$ y = [616289, 608037, 600441, 593601, 587406, 581952, 577644, 574710, 573159, 573188, 574947, 577903, 581229, 584912, 589617, 595293, 600866, 605604, 609865, 614010, 617540, 619931, 621555, 622968, 623838, 623328, 621152, 617577, 612704, 606464, 599186, 591648, 584577, 578396, 573277, 569107, 565557, 562447, 559971, 558428, 557928, 558405, 559573, 560801, 561435, 561362, 560966, 560481, 559866, 559247, 558895, 558701, 558387, 558379, 559688, 562553, 565878, 568441, 570128, 571593, 573267, 575088, 576738, 577747, 577844, 577499, 577601, 578319, 578851, 578630, 578139, 578135, 578723, 579615, 580685, 581724, 582321, 582627, 583707, 586448, 590555, 595198, 600240, 606219, 613540, 622337, 632694, 644234, 655740, 665887, 674308, 681429, 687438, 691983, 694763, 695844, 695359, 693244, 689365, 683760, 676876, 669602, 662756, 656362, 649803, 642744, 635478, 628255, 620903, 613431, 606346, 599926, 593741, 587440, 581538, 576727, 572736, 568444, 563039, 556631, 549966, 543911]
59126E43911m780l267j922q95k79j40m6R09K992N198O493P138Q028R260J0279
59111E82879J0948J1405J1295J0305R028Q211P613O743O148O501O985O260M658
59098F88979L689L518K847J315P2l14o46j359j770j626j701k173k057j016k00
59083F87558n01j394k313l694n718p369p869p867q221q684q776q846r213r219
59069E97874q271o948o042n343m405l671l710m038l880l532l717m106l678k380
59055E34153j231q51q53q28j007j599k106j846r58m21r21j908k224j551p15l91
59039E14743k90j04k93j076j475o34N80P85L60Q23K190K906K520K446L605N152
59023E32238O267P461R179J0632J1135J1259J1667J1867J1232J0167R224Q017
$$ y = [543911, 539131, 535864, 533942, 533047, 532768, 532628, 532582, 533491, 536483, 541681, 548174, 555312, 563340, 572600, 582879, 593827, 605232, 616527, 626832, 635860, 644071, 651684, 658427, 664575, 671076, 678061, 684321, 688979, 692668, 696186, 699033, 700348, 700420, 700106, 699460, 698101, 696331, 694705, 693004, 690831, 688774, 687758, 687558, 687057, 685663, 683350, 679656, 673938, 666569, 658700, 650833, 642612, 633928, 625152, 616306, 607093, 597874, 589603, 582655, 576613, 571270, 566865, 563194, 559484, 555446, 551566, 548034, 544317, 540211, 536533, 534153, 532922, 532071, 531218, 530390, 529383, 527784, 525678, 523832, 522874, 522453, 521532, 519624, 517400, 515849, 515134, 514743, 514453, 514349, 514056, 512980, 511505, 510871, 511451, 512236, 512596, 513419, 515609, 518515, 521035, 523481, 527086, 532238, 538505, 545966, 555145, 565777, 576912, 588171, 599838, 611705, 622937, 633104, 642328, 650345]
59011F50345O050L838K119P19q76k379l088k849j967o69P59J844K524L249M173
58996F63792M969N675O689P522O795M250J603N34P79J036Q21L54n20k132m139
58981F98028n747o482o260n199l802k742k013r62O19K220L636N232O926Q137R062
58966G00653J0634J2673J3663J3104J2515J2999J3382J2150R882Q168P119N577
58954H32519L107K94k499n329p989j0240j2372j4621j6475j7379j7569j7415j6641
58941F97391j5066j3413j2404j1662j0411q663o901n304m074l745m222m268k989
58928E94269j150j10r0m32p96j169j318j146j022j010o08J35K40o04j202n80N82
58911E83989J276J753K540L151L127L256M244N277N518N942P879J0632J2495J3351
$$ y = [650345, 656395, 660233, 662352, 663071, 662195, 659816, 656728, 653879, 651912, 651243, 652002, 653846, 656370, 659619, 663792, 668761, 674436, 681125, 688647, 695442, 699692, 701295, 701829, 702608, 703644, 704465, 704819, 704299, 702167, 698028, 692281, 685799, 679539, 674340, 670538, 667796, 665783, 664821, 665440, 667660, 671296, 676528, 683454, 691591, 700653, 711287, 723960, 737623, 750727, 763242, 776241, 789623, 801773, 811655, 819823, 826942, 832519, 835626, 835920, 833421, 828092, 820103, 809863, 797491, 782870, 766395, 749016, 731447, 714032, 697391, 682325, 668912, 656508, 644846, 634435, 625772, 618871, 613567, 609493, 605748, 601526, 597258, 594269, 593119, 593009, 592919, 592487, 591691, 590522, 589204, 588058, 587036, 586026, 585418, 585553, 585793, 585189, 583987, 583407, 583989, 585265, 587018, 589558, 592709, 595836, 599092, 603336, 608613, 614131, 620073, 627952, 638584, 651079, 664430]
58897F64430J4246J5045J4675J3396J2668J2745J2379J1156J0334J1014J2973
58886H05061J5539J8360K0967K2735K3485K3282K1739J8621J4794J1392Q240M388
58874A008603q5m153p606j1161j4833j7706j9439k0549k0992j9969j7569j5266
58862H39275j4104j3491j2417j0949r923r718j0004j0248j0121r723r493r713
58850G09371j0146j0425j0519j0468j0061r262q519q032p288n969m809m714n469
58837F03690o118o243o043n643n160n012n315n389m702l796l334k855j533L03
58823E42850J479J631J440J482J761K172K623K896L065L630M662N383N294M961
58809E85329M853M349K929J433R29J048P43l9o80j171j752k013j737j914l430
$$ y = [664430, 678676, 693721, 708396, 721792, 734460, 747205, 759584, 770740, 781074, 792088, 805061, 820600, 838960, 859927, 882662, 906147, 929429, 951168, 969789, 984583, 995975, 1004215, 1008603, 1008518, 1004365, 996759, 985598, 970765, 953059, 933620, 913071, 892079, 872110, 854541, 839275, 825171, 811680, 799263, 788314, 778391, 768673, 758669, 748421, 738300, 728577, 719084, 709371, 699225, 688800, 678281, 667813, 657752, 648490, 639971, 631939, 624651, 618682, 613873, 609159, 603690, 597572, 591329, 585286, 579643, 574483, 569471, 564156, 558767, 554065, 550269, 546935, 544080, 542547, 542850, 544329, 545960, 547400, 548882, 550643, 552815, 555438, 558334, 561399, 565029, 569691, 575074, 580368, 585329, 590182, 594531, 597460, 598893, 599822, 600870, 601613, 601574, 600894, 599723, 597971, 595958, 594221, 592307, 588877]
58794E88877n354o119n814n672n842n479m644m250m219l483j839k70O76J434K284
58779E40286K969L426L787L795L304L012L433L629K297k67k684m463n913o651
58765E49960o011m650l959m021l822l252l132l420l239k618k383k299j271N01
58751E06384J503J292J095J693K464K932L542M398M834M783N046N749N975N467
58737E57157N192N647N992N553M875M583M358L851L580M138N145N687N361M512
58723F25631L750L378L048K131P31j94j38K78N73J361L119M971N966O562P481
58708F68648Q039P238N646M360K912J59l331n833o985p857q953j0018j1397j3534
58694F29094j5492j5960j5356j4957j4495j2818j0405q858q146o943n362m865
$$ y = [588877, 583523, 577404, 571590, 565918, 560076, 554597, 549953, 545703, 541484, 538001, 536162, 535892, 536568, 538002, 540286, 543255, 546681, 550468, 554263, 557567, 560579, 564012, 567641, 569938, 569671, 566987, 562524, 556611, 549960, 543949, 539299, 535340, 531319, 527497, 524245, 521113, 517693, 514454, 511836, 509453, 507154, 505883, 506384, 507887, 509179, 510274, 511967, 514431, 517363, 520905, 525303, 530137, 534920, 539966, 545715, 551690, 557157, 562349, 567996, 573988, 579541, 584416, 588999, 593357, 597208, 600788, 604926, 610071, 615758, 621119, 625631, 629381, 632759, 635807, 637938, 638669, 638475, 638337, 638615, 639188, 640549, 643668, 648639, 654605, 661167, 668648, 676687, 683925, 689571, 693931, 696843, 697002, 693671, 687838, 680853, 672996, 664043, 654025, 642628, 629094, 613602, 597642, 582286, 567329, 552834, 540016, 529611, 520753, 512607, 505664, 500302, 495437]
58682D95437n437n585n091n112n479m728l086k497l151k850p04J361J799J627
58668D56504K265L463M554N740P061P929Q509R701J1126J1119R320P187N350K771
58654E52599p43l608m935n684o398o153m810l983m489n045m671m322m767m995
58640D87996m145l115k864k807k234j652j469r32M53J925K857L538L880L183J942
58625D86556J841K970L202J415p04j303o76K94J856M122O013P031Q299J0329J1546
58610E42791J0567Q372O658N551M314K967J834O99m13q88q23j239k360l200l467
58595E71363m092n138n267m034k710j982j044K72Q50P52J764M337O536P281Q089
58580E76977J0042J1684J1558J0506R625Q357O401N095N045M683L183K441M115
$$ y = [495437, 490000, 484415, 479324, 474212, 468733, 464005, 460919, 458422, 455271, 452421, 451717, 453078, 454877, 456504, 458769, 462232, 466786, 472526, 479587, 487516, 496025, 505726, 516852, 527971, 537291, 544478, 549828, 552599, 551856, 548248, 543313, 537629, 531231, 525078, 520268, 516285, 511796, 506751, 502080, 497758, 492991, 487996, 483851, 480736, 477872, 475065, 472831, 471179, 469710, 468778, 469231, 471156, 474013, 477551, 481431, 484614, 486556, 488397, 491367, 494569, 495984, 495280, 493977, 493301, 493595, 495451, 499573, 505586, 512617, 520916, 531245, 542791, 553358, 561730, 568388, 573939, 578253, 581220, 583054, 583753, 583340, 582452, 581629, 580390, 578030, 574830, 571363, 567271, 562133, 556866, 552832, 550122, 548140, 547096, 547368, 548218, 548970, 550734, 555071, 561607, 568888, 576977, 587019, 598703, 610261, 620767, 630392, 638749, 645150, 650245, 655290, 659973, 663156, 665597, 669712]
58567F69712O905Q913J0476J2527J4359J5330J6715J9465K2052K2886K2974K3758
58555H66072K4225K2693J9733J6754J3295Q332K850j352m196o434p549o911n690
58542I41822n448n928o292p125r172j1550j3322j5451j8950k2451k3913k3397
58530G78823k2075j9849j6271j2579j0394r317p815n611l417j356N41J492J269
58517F73441J105J768K166J409N66O81P84k74j650k038j761j623j430j239k074
58502F69831l810m439l257k334l034l675k800j964k684l363k195o05o50j322n94
58487F33105R60J765K391L920N115M571L818N004P274Q732J0093J2932J6048J7136
58473G32864J6627J6368J5886J3399R286N291J533k615o155q016r367j1270j1890
$$ y = [669712, 676617, 685530, 696006, 708533, 722892, 738222, 754937, 774402, 796454, 819340, 842314, 866072, 890297, 912990, 932723, 949477, 962772, 971104, 973954, 972602, 968406, 961972, 954423, 947512, 941822, 936374, 930446, 924154, 917029, 907857, 896307, 882985, 867534, 848584, 826133, 802220, 778823, 756748, 736899, 720628, 708049, 697655, 688338, 680523, 674912, 671495, 670139, 670680, 672172, 673441, 674546, 676314, 678480, 679889, 680455, 681136, 681920, 681646, 679996, 677958, 676197, 674574, 673144, 671905, 669831, 666021, 661582, 658325, 655991, 652957, 649282, 646482, 644518, 641834, 638471, 636276, 635671, 635021, 633699, 633105, 634065, 635830, 638221, 642141, 647256, 651827, 655645, 660649, 667923, 676655, 686748, 699680, 715728, 732864, 749491, 765859, 781745, 795144, 804430, 809721, 811254, 808639, 802484, 794468, 785101, 773831, 761941]
58460G61941r403n735l842l074j033J881L702M953P313R741J0183R683J0423J1015
58446H07748Q363L219o72k378m232o970q866r496j0239j0976j0077p722n701m226
58432G37775k166oQ81J260K892N104N957O035P443R766J0773J0426J0549J1158
58418H17847J0747R440Q346O624K825j747m624o050p666q757p824o464p317r363
58404G96017r654q471q267q617p084m168k558k212r43Q91J178P15K088M544N046
58389G58505L853L854M926M264K022J295K498L002K361K769M294M728M196M901
58375H07468O381O104M608M830O509O623N261N532P609Q461P698Q081R955J0794
58361I05914J0543J1755J4183J4901J4043J4610J6272J5459J2055R824R509P770
$$ y = [761941, 752538, 746803, 742961, 739887, 738854, 740735, 744437, 749390, 756703, 766444, 776627, 786310, 796733, 807748, 816111, 819330, 818658, 816280, 812048, 805078, 796212, 786716, 776477, 765501, 755424, 747702, 742001, 737775, 735609, 735603, 736484, 737744, 740636, 745740, 751697, 757732, 765175, 774941, 785714, 796140, 806689, 817847, 828594, 838034, 846380, 853004, 855829, 854082, 849458, 843408, 835742, 826985, 819161, 812697, 805380, 796017, 786363, 777892, 769625, 761008, 753924, 749756, 747198, 744986, 744043, 744934, 746112, 746827, 748915, 753459, 758505, 762358, 766212, 771138, 775402, 777424, 778719, 781217, 784219, 786580, 789349, 793643, 798371, 802567, 807468, 813849, 819953, 824561, 829391, 835900, 842523, 847784, 853316, 860925, 869386, 877084, 885165, 895120, 905914, 916457, 928212, 942395, 957296, 971339, 985949, 1002221, 1017680, 1029735, 1039559, 1049068, 1056838]
58349A056838L890J268J096O29r66r44J410L342M001N669Q486R578Q591Q506J0033
58334A121427J0807J0809J2670J5947J7212J6479J7275J9644J9616J6475J3899
58323A292260J3023J1153Q177P279Q236P174M091L357N580O464N023N202P837
58310A384856Q913P512P634J0261J1609J1133J3009J7565J9652J8020J7755K0837
58298A548756K2785K1579K1231K3398K3974K1498K0446K2744K4288K3238K3391
58287A797328K6007K6899K5037K5298K9124L1353K9969K9859L3133L5063L3628
58276B122698L3653L7192L9313L7867L7885M1720M4480M3869M4805M9524N3042
58265B586048N3252N5334O1252O5304O5193O6826P2883P7551P8053Q0007Q5720
$$ y = [1056838, 1060728, 1061996, 1063092, 1063721, 1062755, 1061811, 1063221, 1066563, 1070564, 1076233, 1084719, 1094297, 1102888, 1111394, 1121427, 1132234, 1143043, 1155713, 1171660, 1188872, 1205351, 1222626, 1242270, 1261886, 1278361, 1292260, 1305283, 1316436, 1324613, 1331892, 1340128, 1347302, 1351393, 1354750, 1360330, 1366794, 1371817, 1377019, 1384856, 1393769, 1401281, 1408915, 1419176, 1430785, 1441918, 1454927, 1472492, 1492144, 1510164, 1527919, 1548756, 1571541, 1593120, 1614351, 1637749, 1661723, 1683221, 1703667, 1726411, 1750699, 1773937, 1797328, 1823335, 1850234, 1875271, 1900569, 1929693, 1961046, 1991015, 2020874, 2054007, 2089070, 2122698, 2156351, 2193543, 2232856, 2270723, 2308608, 2350328, 2394808, 2438677, 2483482, 2533006, 2586048, 2639300, 2694634, 2755886, 2821190, 2886383, 2953209, 3026092, 3103643, 3181696, 3261703, 3347423]
58254C347423Q8770Q6374Q5220Q8750R0833Q8639Q9189R6039J02096J03175J05793
58243D372301J13939J21331J24701J31186J44108J55379J60684J67940J81758
58234E673327J94229K00725K09521K25753K41332K51238K63877K84430L04513
58225G848945L19537L39041L68172L96918M20042M48683M89302N31123N68235
58216A1729998O13037O72983P36305P96669Q68622R61686J063991J169895J297334
58207A9910520J458053J638985J834638K067713K354625K684435L058795L517959
58199C8525723M099677M813009N685396O790654Q192006R906199J1967969J4477919
58191A04458552J7543442K1237189K5637750L0733780L6077933M0561636M2710157
$$ y = [3347423, 3436193, 3522567, 3607787, 3696537, 3787370, 3876009, 3965198, 4061237, 4163333, 4266508, 4372301, 4486240, 4607571, 4732272, 4863458, 5007566, 5162945, 5323629, 5491569, 5673327, 5867556, 6068281, 6277802, 6503555, 6744887, 6996125, 7260002, 7544432, 7848945, 8168482, 8507523, 8875695, 9272613, 9692655, 10141338, 10630640, 11161763, 11729998, 12343035, 13016018, 13752323, 14548992, 15417614, 16379300, 17443291, 18613186, 19910520, 21368573, 23007558, 24842196, 26909909, 29264534, 31948969, 35007764, 38525723, 42625400, 47438409, 53123805, 59914459, 68106465, 78012664, 89980633, 104458552, 122001994, 143239183, 168876933, 199610713, 235688646, 276250282, 318960439]
58184C18960439M1263264L5496757K5293580J1404541m223537j8808792k9948989
58177C79437263l6687303l9456929l9219226l6846551l3114140k8796680k4517127
58170A40799307k0596227j7144100j4213999j1809581r849896q233852o911754
58163E2039898n851772m989228m261035l651037l157390k749094k392345k087507
58155B2900490j843471j642538j462176j305882j182665j078947r77940q85460
58147A2521411q11372p45510o75437o08910n56516n09992m58849m11272l78134
58138G365419l52520l24475l00440k88954k81607k66726k48595k35887k24046
58129D842169k06048j88097j78230j70819j57984j45017j39482j35997j26678
$$ y = [318960439, 360223703, 395720460, 421014040, 432418581, 428195044, 409386252, 379437263, 342749960, 303293031, 264073805, 227227254, 194113114, 165316434, 140799307, 120203080, 103058980, 88844981, 77035400, 67185504, 58951652, 52039898, 46188126, 41198898, 36937863, 33286826, 30129436, 27380342, 24987997, 22900490, 21057019, 19414481, 17952305, 16646423, 15463758, 14384811, 13406871, 12521411, 11710039, 10964529, 10289092, 9680182, 9123666, 8613674, 8154825, 7743553, 7365419, 7012899, 6688424, 6387984, 6099030, 5817423, 5550697, 5302102, 5066215, 4842169, 4636121, 4448024, 4269794, 4098975, 3940991, 3795974, 3656492, 3520495, 3393817]
58120C393817j16037j11108j07186r7613q7719q4866q4038p7356o8901o6357o6448
58109B426188o2148n6439n5608n6338n2356m6912m6274m7579m5115m1977m3640
58098A871802m6497m4552m1181m2577m5537m3403l8525l7244l7788l4494k9255
58087A430749k7503k7340k3515j8285j7612k0210k0498j9048k0262k2974k2801
58076A190701k0858k1141k2287k0539j7770j8100j9767j8532j5916j5909j6832
58065I83050j4674j1269j1011j2524j1572r201r138j0132q744o764q037j0850
58053H59134j1086j0087j1646j4107j3288j0561j0216j1353j0069p323o938q012
58041G34448o967m987n810q132p742n428n316p059p038n707o439q463q242o628
$$ y = [3393817, 3277780, 3166672, 3059486, 2961873, 2874154, 2789288, 2705250, 2627894, 2558993, 2492636, 2426188, 2364040, 2307601, 2251993, 2195655, 2143299, 2096387, 2050113, 2002534, 1957419, 1915442, 1871802, 1825305, 1780753, 1739572, 1696995, 1651458, 1608055, 1569530, 1532286, 1494498, 1460004, 1430749, 1403246, 1375906, 1352391, 1334106, 1316494, 1296284, 1275786, 1256738, 1236476, 1213502, 1190701, 1169843, 1148702, 1126415, 1105876, 1088106, 1070006, 1050239, 1031707, 1015791, 999882, 983050, 968376, 957107, 946096, 933572, 922000, 912799, 903661, 893529, 884785, 878021, 869984, 859134, 848048, 837961, 826315, 812208, 798920, 788359, 778143, 766790, 756721, 749398, 742460, 734448, 727481, 722494, 716684, 708552, 700810, 695382, 690066, 683007, 675969, 670262, 663823, 655360, 647118, 640490]
58027F40490p498j0350j1217r988j0013j1292j0791q741q177q820p735n304m522
58014E26042n051m086k251k584m445m460k748k345l171k588j089j460k949k330
58000D84485k24l15k637l634k630k414l464l313j721j047j376n11J305J707R88
57985D65199J488K560J420j321k261j147r19k065k241j445k105l891l778j674
57971D47820q32k173l106k520k150k469j825k31L07l11k65L32k30j263n06J233
57955D31811R55j104j752n85n31k299l254k395j681j700o10J763L071K580K127
57940D26396K381K166J936L759P281R720J0355J1099J2357J2502J1635J1650J2212
57927E35449J0956P989N822M565J796k364m846n041n878q485j0387j0301j0175
$$ y = [640490, 632992, 622642, 611425, 601437, 591424, 580132, 569341, 560600, 552423, 543603, 535868, 530564, 526042, 520991, 516905, 514654, 512070, 507625, 503165, 500417, 498072, 494901, 492313, 491224, 489764, 486815, 484485, 484261, 483946, 481309, 477675, 475045, 472631, 469167, 465854, 464133, 463086, 461710, 461199, 462504, 464211, 465199, 466687, 469247, 470667, 469346, 467085, 465938, 465019, 462954, 460713, 459268, 457163, 453272, 449494, 447820, 446988, 444815, 441709, 439189, 437039, 434570, 432745, 432514, 432821, 432510, 432245, 432577, 432347, 431084, 430578, 431811, 432766, 431662, 429910, 429325, 428794, 426495, 423241, 420846, 419165, 417465, 416855, 418618, 421689, 424269, 426396, 428777, 430943, 432879, 436638, 443919, 453639, 463994, 475093, 487450, 499952, 511587, 523237, 535449, 546405, 554394, 560216, 564781, 566577, 564213, 559367, 554326, 548448, 539963, 529576, 519275, 509100]
57914E09100j1098j1365j0146r130r121q692p437o848o921n708l237k049k730
57901D14618k876j592j024k175l162l042l375m598m647k829j271j028l83J408
57887C84024K502K205K633M762O396N963M948M684M090K479J399J569J108j129
57873D27633l286l576l014l164l721l991m408m994m739l745l591m473m634l587
57859C72710l000l358k830p11J169J738K288L496M086L854M660O735P361N137
57845D03335K356J137L53j383k798k513j832k455l689m181m315m740m669l594
57831C71012k709k784k606j289j8J05n6M52J032J279K112L684M442L799L454M457
57815C86366N357M868L969L635K888R00j200k450l793n883p424p432o966o897
$$ y = [509100, 498002, 486637, 476491, 467361, 458240, 449548, 442111, 435263, 428342, 422634, 419397, 417348, 414618, 411742, 410150, 409126, 406951, 403789, 400747, 397372, 392774, 388127, 385298, 384027, 382999, 382616, 384024, 386526, 388731, 391364, 396126, 402522, 408485, 413433, 418117, 422207, 424686, 426085, 427654, 428762, 427633, 424347, 420771, 417757, 414593, 410872, 406881, 402473, 397479, 392740, 388995, 385404, 380931, 376297, 372710, 369710, 366352, 363522, 362811, 363980, 365718, 368006, 371502, 375588, 379442, 384102, 390837, 398198, 403335, 405691, 406828, 407181, 405798, 403000, 400487, 398655, 396200, 392511, 388330, 384015, 379275, 374606, 371012, 368303, 365519, 362913, 361624, 361606, 361711, 361655, 362107, 363139, 364418, 366530, 370214, 374656, 378455, 381909, 386366, 391723, 396591, 400560, 404195, 407083, 407983, 406783, 404333, 400540, 394657, 387233, 379801, 372835, 365938]
57801C65938o130l922j704p68k52P36J180K05j034j422j784k844l400k514j435
57786C40850j405j503n75N70Q63R62J719K501K764L391M716N318M467L693M020
57771C72351L970K277M08J04N00m6j145j699k204l464m645m738m353m104l097
57756C50115r63O15N37M35J815L220K780J562J622K440K201J161Q13J000N95M5
57740C69993M34R61O1j749k585k149j673j622j577j723k435l050k891k685l179
57725C44131l457k497j288j293j899j576o03m01r96j228r05p09o28k46Km53j070
57708C24884j196j385k208k913k777k571l011l135k055q57p42p43N64K420L230
57693C07505L269L628L637K041k61j272j087j440k644l397l258k990k707j803
$$ y = [365938, 359808, 355886, 354182, 353414, 353162, 353898, 355078, 355283, 354249, 352827, 351043, 348199, 344799, 342285, 340850, 339445, 337942, 337367, 337937, 338800, 339762, 341481, 343982, 346746, 350137, 354853, 360171, 364638, 368331, 372351, 376321, 378598, 379006, 379110, 379610, 379564, 378419, 376720, 374516, 371052, 366407, 361669, 357316, 353212, 350115, 349152, 349767, 350304, 350739, 352554, 355774, 358554, 360116, 361738, 364178, 366379, 367540, 368353, 369353, 369948, 369993, 370427, 371388, 371449, 369700, 367115, 364966, 363293, 361671, 360094, 358371, 355936, 352886, 349995, 347310, 344131, 340674, 338177, 336889, 335596, 333697, 332121, 331518, 331117, 330121, 328893, 327988, 327279, 326651, 326405, 326407, 325954, 324884, 323688, 322303, 320095, 317182, 314405, 311834, 308823, 305688, 303633, 302776, 302034, 301291, 301855, 304275, 307505, 310774, 314402, 318039, 320080, 319819, 318547, 317460, 316020, 313376, 309979, 306721, 303731, 301024, 299221]
57679B99221m64P04K117M495P253R484J1860J5607K0305K4786K9586L6281M4795
57666E06030N3269O0066O3802O1948N1801L3224R151j6131l8015n2400n7941n7178
57654F17626n3610m8285m0896l2860k6638k2605j9160j5626j2695j0359p795n241
57642C21856l758l186k413j428j133j287p83J98N24L72J004K226K368J003l63
57627C15200o29k96o0R8Q6m61j256j618j648j914k222k073j906k368k736j847
57611B94350k01N90K37j07J06M29Q14J564K090J513M16K51J112J707J468R00J04
57594C07343j299k812l328k834k329k203k107k124k511k617j698l99J33J44N36
57579B81895Q92J74j064j274m07J76O9Qk0p38j804k118j794j840k061j321J99
$$ y = [299221, 298757, 299461, 301578, 306073, 313326, 322810, 334670, 350277, 370582, 395368, 424954, 461235, 506030, 559299, 619365, 683167, 745115, 796916, 830140, 839291, 823160, 785145, 732745, 674804, 617626, 564016, 515731, 474835, 441975, 415337, 392732, 373572, 357946, 345251, 334892, 327097, 321856, 318098, 314912, 312499, 311071, 309938, 308651, 307868, 308066, 308590, 308962, 309966, 312192, 314560, 315563, 315200, 314571, 314275, 314215, 314313, 314399, 313938, 312682, 311064, 309416, 307502, 305280, 303207, 301301, 298933, 296197, 294350, 294149, 294739, 294976, 294869, 294975, 295404, 296218, 297782, 299872, 301385, 301801, 302052, 303164, 304871, 306339, 307239, 307343, 306044, 303232, 299904, 297070, 294741, 292538, 290431, 288307, 285796, 283179, 281481, 281082, 281215, 281359, 281895, 282787, 282961, 281897, 280623, 280216, 280392, 280461, 280469, 280449, 279711, 277907, 275789, 273995, 272155, 270094, 268773, 268972]
57562B68972J137J213J295J417Q71J70O07J887K409J975J913K513K690K325K503
57547B93897L172L016K006J681K364K477J291R7q1K04M29J006J891K214J903J828
57531C19395J952J350L42L98J421J542K52o63j57N73N88Q97K283L643L890L756
57515C41462M185M649M398L906L789L626K998K448K371K223J725J505J718J469
57501C82472M92o0N21J202Q48j33p44q12o00r0N05O19L34M42R99J153P66P74J418
57482C90106J739J419J478K381L094K853K344K229K052J478J129J224R02j15o61
57467D13652jQ49P46J04j45m6K8L96J374K452L092L448L680L531L100L010L272
57450D42542L196K769K818L376L466K919K794L398L683L249L146L859M390M314
$$ y = [268972, 270109, 271322, 272617, 274034, 274905, 275075, 275682, 277569, 279978, 281953, 283866, 286379, 289069, 291394, 293897, 297069, 300085, 302091, 303772, 306136, 308613, 309904, 310001, 309920, 310124, 310553, 311559, 313450, 315664, 317567, 319395, 321347, 322697, 323039, 323437, 324858, 326400, 326652, 325989, 325832, 326405, 326993, 327890, 330173, 333816, 337706, 341462, 345647, 350296, 354694, 358600, 362389, 366015, 369013, 371461, 373832, 376055, 377780, 379285, 381003, 382472, 382964, 382904, 383425, 384627, 385475, 385342, 384598, 383786, 383186, 383096, 383601, 384220, 384554, 384996, 385995, 387148, 387914, 388688, 390106, 391845, 393264, 394742, 397123, 400217, 403070, 405414, 407643, 409695, 411173, 412302, 413526, 414428, 414313, 413652, 413651, 414500, 415246, 415350, 415205, 415159, 415187, 415583, 416957, 419409, 422501, 425949, 429629, 433160, 436260, 439270, 442542, 445738, 448507, 451325, 454701, 458167, 461086, 463880, 467278, 470961, 474210, 477356, 481215, 485605, 489919]
57436D89919M720N996O603N523M149M109M728M426L333K766L061L522L771L885
57422E50511L871M021M886O086O219M923L755M035N052N534N544N694N703N171
57408F21005M754N178N965O311O331O399O183N485N071N532O150N948N078M265
57394F99655L839M025N157O804P790P780P695P904P630O831O864Q203R281Q970
57380G98428Q454R143J0362J0694J0240R811R313Q506Q075Q328Q186P053O253
57367I12846O871P705P312O625P275Q659R053Q600Q715R316R229Q740R296J0828
57353A031070J1757J1584J1396J1763J2054J1953J1912J1933J1552J1060J1261
57342A159295J1982J2221J1818J1644J2084J2579J2694J2528J2187J1781J1754
$$ y = [489919, 494639, 500635, 507238, 512761, 516910, 521019, 525747, 530173, 533506, 536272, 539333, 542855, 546626, 550511, 554382, 558403, 563289, 569375, 575594, 580517, 584272, 588307, 593359, 598893, 604437, 610131, 615834, 621005, 625759, 630937, 636902, 643213, 649544, 655943, 662126, 667611, 672682, 678214, 684364, 690312, 695390, 699655, 703494, 707519, 712676, 719480, 727270, 735050, 742745, 750649, 758279, 765110, 771974, 780177, 789458, 798428, 806882, 816025, 826387, 837081, 847321, 857132, 866445, 874951, 883026, 891354, 899540, 906593, 912846, 919717, 927422, 934734, 941359, 948634, 957293, 966346, 974946, 983661, 992977, 1002206, 1010946, 1020242, 1031070, 1042827, 1054411, 1065807, 1077570, 1089624, 1101577, 1113489, 1125422, 1136974, 1148034, 1159295, 1171277, 1183498, 1195316, 1206960, 1219044, 1231623, 1244317, 1256845, 1269032, 1280813, 1292567]
57331A292567J2289J2801J2886J3099J3863J4460J4298J4256J5214J6228J5853
57320A447814J4560J4009J4435J4643J4328J4384J5075J5620J5719J5888J6248
57309A612723J6403J6525J7121J7857J7956J7661J7912J8705J9157J9156J9475
57298A810651K0280K0944K1313K1855K2496K2637K2376K2454K2925K3044K2582
57287B053557K2120K2092K2483K3341K4540K5308K5068K4455K4459K4954K5180
57276B317557K5202K5540K5893K5681K5376K5763K6299K5847K4698K4161K4405
57265B596422K4461K4218K4505K5241K5389K4927K4976K5677K5818K5015K4481
57254B871130K5032K5912K6317K6558K7023K7341K7242K7135K7075K6451K5264
$$ y = [1292567, 1304856, 1317657, 1330543, 1343642, 1357505, 1371965, 1386263, 1400519, 1415733, 1431961, 1447814, 1462374, 1476383, 1490818, 1505461, 1519789, 1534173, 1549248, 1564868, 1580587, 1596475, 1612723, 1629126, 1645651, 1662772, 1680629, 1698585, 1716246, 1734158, 1752863, 1772020, 1791176, 1810651, 1830931, 1851875, 1873188, 1895043, 1917539, 1940176, 1962552, 1985006, 2007931, 2030975, 2053557, 2075677, 2097769, 2120252, 2143593, 2168133, 2193441, 2218509, 2242964, 2267423, 2292377, 2317557, 2342759, 2368299, 2394192, 2419873, 2445249, 2471012, 2497311, 2523158, 2547856, 2572017, 2596422, 2620883, 2645101, 2669606, 2694847, 2720236, 2745163, 2770139, 2795816, 2821634, 2846649, 2871130, 2896162, 2922074, 2948391, 2974949, 3001972, 3029313, 3056555, 3083690, 3110765, 3137216, 3162480]
57243C162480K4605K5108K5949K6120K5814K5794K6150K6393K6238K5731K5047
57232C445429K4464K4146K3855K3302K2802K2886K3400K3743K3893K4313K4895
57221C707128K4951K4338K3721K3625K3979K4601K5271K5442K4792K3963K3819
57210C975630K4057K3595K2259K0899J9885J8702J7133J5682J4490J3003J1049
57199D176384R274Q168P429O691O031N502M901M235L822L717L635L466L315L092
57185D249662K729K656L356M590N795O988Q513J0072J0896J0780J0184R447Q644
57172D344312P986P609P233O748O681P372Q252Q732R182J0043J0789J0941J1292
57159D457172J2756J4582J5330J5066J5045J5576J5760J4969J3185J0272O426
$$ y = [3162480, 3187085, 3212193, 3238142, 3264262, 3290076, 3315870, 3342020, 3368413, 3394651, 3420382, 3445429, 3469893, 3494039, 3517894, 3541196, 3563998, 3586884, 3610284, 3634027, 3657920, 3682233, 3707128, 3732079, 3756417, 3780138, 3803763, 3827742, 3852343, 3877614, 3903056, 3927848, 3951811, 3975630, 3999687, 4023282, 4045541, 4066440, 4086325, 4105027, 4122160, 4137842, 4152332, 4165335, 4176384, 4185658, 4193826, 4201255, 4207946, 4213977, 4219479, 4224380, 4228615, 4232437, 4236154, 4239789, 4243255, 4246570, 4249662, 4252391, 4255047, 4258403, 4262993, 4268788, 4275776, 4284289, 4294361, 4305257, 4316037, 4326221, 4335668, 4344312, 4352298, 4359907, 4367140, 4373888, 4380569, 4387941, 4396193, 4404925, 4414107, 4424150, 4434939, 4445880, 4457172, 4469928, 4484510, 4499840, 4514906, 4529951, 4545527, 4561287, 4576256, 4589441, 4599713, 4606139]
57148D606139K812J63k658o982j1849j5257j7340j9965k3513k6481k8221k9511
57136D427337l0291k9369k6859k4419k2459j9474j4938j0582p917o601o269p746
57124D220413j1226j5212j8608k2087k6145k9443l0437k9250k6636k2468j6566
57113C972335r771k931M100J1499J8612K5147L2132M0796N1499O4627Q1252J01985
57101D391282J26381J54614J88859K32067K86239L52483M31643N23941O28689
57092G316198P44648Q69366R97907J123669J240884J344681J428608J484362J504706
57083A8055029J484611J419925J310121J165743J008677Q57432P09481N40574
57075B6551593L23455M8279k71607o08124r30558j213563j440028j600911j694298
$$ y = [4606139, 4608951, 4609114, 4606456, 4599474, 4587625, 4572368, 4555028, 4535063, 4511550, 4485069, 4456848, 4427337, 4397046, 4367677, 4340818, 4316399, 4293940, 4274466, 4259528, 4248946, 4241029, 4234428, 4228159, 4220413, 4209187, 4193975, 4175367, 4153280, 4127135, 4097692, 4067255, 4038005, 4011369, 3988901, 3972335, 3962564, 3959633, 3963733, 3975232, 3993844, 4018991, 4051123, 4091919, 4143418, 4208045, 4289297, 4391282, 4517663, 4672277, 4861136, 5093203, 5379442, 5731925, 6163568, 6687509, 7316198, 8060846, 8930212, 9928119, 11051788, 12292672, 13637353, 15065961, 16550323, 18055029, 19539640, 20959565, 22269686, 23435429, 24444106, 25301538, 26011019, 26551593, 26875048, 26923327, 26651720, 26043596, 25113038, 23899475, 22459447, 20858536, 19164238]
57066A9164238j724426j700106j632391j532726j412241j281089j147298j016452
57058G717509q92643p79005o77071n86607n06880m37546l78069l27242k83950
57049B848496k47610k17345j91626j69356j50511j35093j22320j11284j01607
57040A401744r2873q4378p5948o8127o1071n4154m7035m0056l3187k5752j7414
57029H01749q183K712J6122L0670M2924N0348N2018M5877K8448l07l3650o2009
57017I66719p9562q5879q3284p5188o5668n7559n0649m3339l5609k8882k3707
57006C37393j9498j6098j3806j2109j0093p992o834o688o630o199n648m988m077
56993B16733l434l647m202l981k749j053R67L560O441Q984J1022J2491J2674J0907
$$ y = [19164238, 17439812, 15739706, 14107315, 12574589, 11162348, 9881259, 8733961, 7717509, 6824866, 6045861, 5368790, 4782183, 4275303, 3837757, 3459688, 3132446, 2848496, 2600886, 2383541, 2191915, 2022559, 1872048, 1736955, 1614635, 1503351, 1401744, 1308871, 1224493, 1148545, 1080418, 1019347, 965193, 918158, 878102, 844915, 819163, 801749, 793566, 796278, 812400, 843070, 885994, 936342, 988360, 1034237, 1062685, 1062378, 1028728, 966719, 887157, 801278, 717994, 642806, 577138, 519579, 468930, 425591, 389982, 361100, 337393, 317895, 301797, 287991, 275882, 265789, 257797, 250963, 244275, 237645, 231446, 225798, 220810, 216733, 213299, 209652, 205450, 201469, 198720, 197667, 198634, 202194, 208635, 217619, 228641, 241132, 253806, 264713]
56979B64713P609L682o93n632j0408j3830j5396j5257j3642j1143q865p247n459
56966A68432k875l04J323K472M023N840P696J0475J4709J8874K1058K1400K0907
56953B94030J8722J3041M406m286j1078j6100j9431k0237j8597j6089j3703j0817
56941A99861o987l224o19J079K750M773P289J0659J4975J9723K4288K8124L0200
56928C32891K9146K4294J6116N622n953j6840k5026k9304k9817k7712k4572k1806
56916B27039j9802j7854j5359j2696j0447q469o531n080m415l856k809j931j948
56903A15842k076j085O26J695K109L083M793N980O029N876O513P844R295J0560
56889A77084J1571J2597J4328J6907J9151J9724J8689J6738J3404P696L00o505
$$ y = [264713, 272322, 276004, 275311, 269679, 259271, 245441, 230045, 214788, 201146, 190003, 181138, 173891, 168432, 165557, 165253, 166576, 169048, 173071, 178911, 186607, 197082, 211791, 230665, 251723, 273123, 294030, 312752, 325793, 330199, 325913, 314835, 298735, 279304, 259067, 240470, 224381, 210678, 199861, 192874, 189650, 189031, 190110, 192860, 197633, 204922, 215581, 230556, 250279, 274567, 302691, 332891, 362037, 386331, 402447, 408069, 402116, 385276, 360250, 330946, 301129, 273417, 248845, 227039, 207237, 189383, 174024, 161328, 150881, 142412, 135881, 130801, 126386, 122530, 119721, 117790, 115842, 113766, 112681, 113307, 115002, 117111, 120194, 124987, 130967, 136996, 142872, 149385, 157229, 166524, 177084, 188655, 201252, 215580, 232487, 251638, 271362, 290051, 306789, 320193, 327889, 328189, 321684]
56877C21684j1204j3881j4826j3930j1698r260o954m129o49K722N736R198J3717
56864B66526J8957K4483L0381L6670M2938M8625N2833N3850M9765L9712K4167
56853F88907M809j5056l0895l9685m2097m0830l7350l1729k4758j7893j1251l856
56841C98316M087J1298J7888K5529L4883M4984N5501O7142P8925Q7222Q8536Q1556
56829I95867O5827M1036R284k3644n1340p0452q0622q2527p7556o8318n7589m6947
56817E53019l6964k7920j9458j0599j090Q033J6050K3844L2709M2551N1991N9346
56805F91512O2701N9894M9563L2066R226j5939l9142n6030o4725o6640o4197n8633
56793E39656n0549m1342l2807k5777j9976j4723r240l036L453R195J4058J9085
$$ y = [321684, 310480, 296599, 281773, 267843, 256145, 246885, 239931, 235802, 235153, 237875, 243611, 252809, 266526, 285483, 309966, 340347, 377017, 419955, 468580, 521413, 575263, 625028, 664740, 688907, 693716, 678660, 647765, 608080, 565983, 525153, 487803, 456074, 431316, 413423, 402172, 398316, 402403, 413701, 431589, 457118, 492001, 536985, 592486, 659628, 738553, 825775, 914311, 995867, 1061694, 1102730, 1112014, 1088370, 1037030, 966578, 885956, 803429, 725873, 657555, 599966, 553019, 516055, 488135, 468677, 458078, 456988, 465021, 481071, 504915, 537624, 580175, 632166, 691512, 754213, 814107, 863670, 895736, 904962, 889023, 849881, 793851, 729126, 662486, 598289, 539656, 489107, 447765, 414958, 389181, 369205, 354482, 345242, 342206, 345659, 354854, 368912, 387997]
56781C87997K4739K9690L2028L0885K6189J7809N979p804k1178l2001l8898m1399
56769D14036m0209l6857l2680k8370k4480k1478j9162j6806j4229j1878r850p810
56757A50227o082n567o167o459n500l944k767j993j272p47o21o54o77q47j082
56742A05848j021q66j228j874j810q97j64p8N2M99M41l64p89j49N87M73J32M83
56724I9275J145J388J610K465L393L327K315J201L45l36o25l02J68K34M8L4J98
56707A15883M46R57J583J708J249R63J155J071K97l16j2O01O02J91L8Q7l5j78
56689A26290j40k38m42O6J565K887K896K093J656J703J577J149O86J66l65l96
56673A41153J25K31o34j574j638j377j735k259j840o59P9o8m82o75o25k21O09
$$ y = [387997, 412736, 442426, 474454, 505339, 531528, 549337, 555316, 547512, 526334, 494333, 455435, 414036, 373827, 336970, 304290, 275920, 251440, 229962, 210800, 193994, 179765, 167887, 158037, 150227, 144145, 138578, 132411, 125952, 120452, 116508, 113741, 111748, 110476, 109729, 109108, 108454, 107777, 106930, 105848, 104827, 103961, 102733, 100859, 99049, 98152, 97988, 97910, 97962, 98461, 98902, 98538, 97749, 97600, 98187, 98660, 98792, 99275, 100420, 101808, 103418, 105883, 109276, 112603, 114918, 116119, 116464, 116128, 115503, 115201, 115369, 115603, 115651, 115685, 115883, 116329, 117286, 118869, 120577, 121826, 122789, 123944, 125015, 125312, 124996, 124984, 125585, 126187, 126378, 126416, 126503, 126468, 126290, 126150, 125912, 125470, 125536, 127101, 129988, 132884, 134977, 136633, 138336, 139913, 141062, 141748, 141914, 141549, 141153, 141278, 141509, 140875, 139301, 137663, 136286, 134551, 132292, 130452, 129793, 129872, 129804, 129322, 128647, 128022, 127801, 128410]
56656A28410J448J985K624L670M483M326L537K893K459J968J721J974K113J494
56642A65105O14L59O37Q06Q93J327J892K096K056K010J484K8j641k398k222j931
56626A71115j830j641j331j106q93p41j129k081k599j985j016q13j271j629j830
56611A49220k087j953j058j34P0J06O99J071P5j611k229j517q07p18n70r5m1p18
56593A37703j325j127k52Q71J898K358J967J211P79N17j87j152j524r92J4J101
56577A41860K091K585K271J479P56K54J47R64K601L705L169J736J037J596K837
56562A69088M356O028P405Q279R312J0870J1911J1268R319P022M155K21l535n101
56548B50598m422l364l050k941k465j924j625j564j986k930l467k748j613j590
$$ y = [128410, 129858, 131843, 134467, 138137, 142620, 146946, 150483, 153376, 155835, 157803, 159524, 161498, 163611, 165105, 165719, 166078, 166715, 167521, 168414, 169741, 171633, 173729, 175785, 177795, 179279, 179307, 177666, 175268, 173046, 171115, 169285, 167644, 166313, 165207, 164314, 163573, 162444, 160363, 157764, 155779, 154763, 153950, 152679, 151050, 149220, 147133, 145180, 144122, 143988, 144058, 144164, 144863, 145934, 146009, 144398, 142169, 140652, 139845, 139127, 138557, 138462, 138421, 137703, 136378, 135251, 134999, 135870, 137768, 140126, 142093, 143304, 144083, 144600, 144413, 143261, 141737, 140745, 140759, 141860, 143951, 146536, 148807, 150286, 151042, 151296, 151443, 152407, 155008, 158713, 161882, 163618, 164655, 166251, 169088, 173444, 179472, 186877, 195156, 204468, 215338, 227249, 238517, 247836, 254858, 259013, 259234, 255699, 250598, 246176, 242812, 239762, 236821, 234356, 232432, 230807, 229243, 227257, 224327, 220860, 218112, 216499, 214909]
56534B14909k549k918k167j330j125j191j341j900k615k633j883j158p24j38O12
56519A91849J043J220J472J335K02j156j425r22j168k324k983k606k252k507k586
56504A77192j988j344j041o07L7K60J05M59J339J580Q71M01Q01J038K55o83o16
56487A78059J59N80M43L16M37N14K96j50m47j61O09J103R01N90P35Q58N39O81
56469A86062K059L371K666M02j075r27m87n24k43N23N23o27j488j177p46j073
56453A87239j204j36J284J690J246J026J265J421J328J233J257J431J744J748
56439B02572Q79n15j303j083n62k60J06O36Q13M77K16L51N19N35O30O68J48p52
56421B04075j253j193j055p87Q4J170J456R17N00M36J64j60K82J233J476Q25K14
$$ y = [214909, 212360, 209442, 207275, 205945, 204820, 203629, 202288, 200388, 197773, 195140, 193257, 192099, 191375, 191237, 191849, 192892, 194112, 195584, 196919, 197121, 195965, 194540, 193618, 192450, 190126, 187143, 184537, 182285, 179778, 177192, 175204, 173860, 172819, 172212, 172249, 172509, 172614, 173073, 174412, 175992, 176863, 177264, 178065, 179103, 179358, 178675, 178059, 178218, 178798, 179241, 179557, 179994, 180508, 180804, 180654, 180207, 180046, 180655, 181758, 182659, 183249, 183984, 184842, 185381, 186062, 188121, 191492, 194158, 194560, 193485, 192558, 192071, 191547, 191304, 191827, 192350, 191723, 190235, 189058, 188312, 187239, 186035, 185899, 187183, 188873, 190119, 191145, 192410, 193831, 195159, 196392, 197649, 199080, 200824, 202572, 203451, 202936, 201633, 200550, 199988, 199728, 199834, 200470, 201283, 201760, 201976, 202327, 202846, 203381, 204011, 204679, 204827, 204075, 202822, 201629, 200574, 199787, 199871, 201041, 202497, 203414, 203914, 204350, 204514, 204354, 204636, 205869, 207345, 208170, 208384]
56404B08384k36j278k481k331q58R3k09l51N03J188P85J79J90J62m05o41j8N38
56386B03214M33O13J728K781K850K540K504K207J357R65J568K099J826J808K976
56371B31469M284M353L501K695J818N53l43k12K39K19K37Q17J146M86k99j81K24
56354B51006j91j027j138m99J17O21J372K186K680K979L172K922K373K392L103
56339B72068L405K775K248K602L029K647J999J870J943J735J593J731J559J067
56325C02271J367K776L880L665K977K699K188Q91j94k20k4m40o85n0M87L5l55
56308C21268M70J607J696J297J695K596L025L332M350N502N679N075M553M025
56294C66170L162K631L063L737L792L632L775L645K912K658L621M773N188N664
$$ y = [208384, 208148, 206870, 204389, 202058, 201200, 201293, 201084, 200733, 201236, 202424, 203209, 203388, 203578, 203740, 203335, 202694, 202676, 203214, 203647, 204260, 205988, 208769, 211619, 214159, 216663, 218870, 220227, 221192, 222760, 224859, 226685, 228493, 231469, 235753, 240106, 243607, 246302, 248120, 248673, 248330, 248118, 248357, 248576, 248813, 249630, 250776, 251262, 250963, 250782, 251006, 250815, 249788, 248650, 248151, 248268, 248889, 250261, 252447, 255127, 258106, 261278, 264200, 266573, 268965, 272068, 275473, 278248, 280496, 283098, 286127, 288774, 290773, 292643, 294586, 296321, 297914, 299645, 301204, 302271, 303638, 306414, 310294, 313959, 316936, 319635, 321823, 322714, 322520, 322300, 322276, 321836, 321151, 321101, 321588, 321623, 321268, 321738, 323345, 325041, 326338, 328033, 330629, 333654, 336986, 341336, 346838, 352517, 357592, 362145, 366170, 369332, 371963, 375026, 378763, 382555, 386187, 389962, 393607, 396519, 399177, 402798, 407571, 412759, 418423]
56280D18423O822P428O562N692O437P910Q499Q580R192R697R331R472J1564J4162
56266E39771J4922J4430J5081J7114J8714J9374K0356K2237K4566K7465L1264
56255G65294L5054L7933M0998M5946N2504N9519O7487P7364Q7828R6548J03599
56244A470074J10879J18592J25015J29285J31852J32486J30303J25393J18055
56235B591934J07015R0954P1215N0459K9255O673j6359l7259n5086p0835q4659
56224B683307r5546j03655j10221j15058j16688j15046j11721j07617j02582r7121
56214A608052r2116q7048q0857p4168o8378o3126n7171n1206m6953m3951m0195
56203I02883l5662l2132k9718k6687k2858k0016j8650j7216j5046j3267j2270
$$ y = [418423, 425245, 432673, 439235, 444927, 451364, 459274, 467773, 476353, 485545, 495242, 504573, 514045, 525609, 539771, 554693, 569123, 584204, 601318, 620032, 639406, 659762, 681999, 706565, 734030, 765294, 800348, 838281, 879279, 925225, 977729, 1037248, 1104735, 1182099, 1269927, 1366475, 1470074, 1580953, 1699545, 1824560, 1953845, 2085697, 2218183, 2348486, 2473879, 2591934, 2698949, 2789903, 2861118, 2911577, 2940832, 2947505, 2931146, 2893887, 2838801, 2767966, 2683307, 2587761, 2484106, 2373885, 2258827, 2142139, 2027093, 1915372, 1807755, 1705173, 1608052, 1515936, 1428888, 1348031, 1273863, 1205485, 1142359, 1085188, 1033982, 987029, 943078, 902883, 867221, 835089, 805371, 778684, 755826, 735810, 717160, 699944, 684898, 671631, 659361]
56192F59361j0943r025p750p582p456o671n555m161k316q94r14j614j544j100
56178E91836j581k322j489O35K031K246K480K757K099J233J894L443L523K147
56164F10932J859L476N051N507O078P441Q445Q556Q753R364R580R683J1058J3581
56150G19364J5529J6533J8092K0845K3910K7131L1408L6742M2465M9336N8587
56139A059942O9195P9008Q8216R8375J08150J13614J12877J07103R7211Q3461
56129B017152O8499N6730M9681M5276M2017M0173L8431L3413K3843J2073P01r318
56117B418671j7048k1737k5299l1239m0608n2001o5169q0530r5207j04144j05902
56106A779787j03269r7812q8445p6040o4393n5193m6470l7328k9860k4874k0229
$$ y = [659361, 648418, 639393, 631643, 624061, 616605, 609934, 604379, 600218, 597902, 597008, 596094, 594480, 592936, 591836, 590255, 587933, 586444, 587079, 589110, 591356, 593836, 596593, 598692, 599925, 601819, 605262, 608785, 610932, 612791, 616267, 621318, 626825, 632903, 640344, 648789, 657345, 666098, 675462, 685042, 694725, 705783, 719364, 734893, 751426, 769518, 790363, 814273, 841404, 872812, 909554, 952019, 1001355, 1059942, 1129137, 1208145, 1296361, 1394736, 1502886, 1616500, 1729377, 1836480, 1933691, 2017152, 2085651, 2142381, 2192062, 2237338, 2279355, 2319528, 2357959, 2391372, 2415215, 2427288, 2427989, 2418671, 2401623, 2379886, 2354587, 2323348, 2282740, 2230739, 2165570, 2085040, 1989833, 1885689, 1779787, 1676518, 1578706, 1490261, 1414221, 1349828, 1294635, 1248165, 1210837, 1180977, 1156103, 1135874]
56095A135874j5005j1136r331p464m536k261j269J42K184K739J734K042M567O735
56081A105015P262Q032R805J0602R921J0039J1496J1876J0570J0141J1375J1867
56069A228001J1126J1958J4971J6835J6138J5814J7644J9398J9641K0307K2237
56058A414070K3242K2821K3624K6054K6716K4495K2709K3008K2789K1008K0588
56047A671124K2487K3383K2042K1941K4635K6752K6531K7028K9667L1139L0052
56036A956781L0063L2895L4901L4264L4681L8037M0577M0474M1894M6982N1132
56025B382681N1193N1137N4386N7760N8408N9597O3914O7804O8608O9995P4677
56014C060160P8876P9878Q1774Q7648R3496R6060R9064J05366J10718J12001J13643
$$ y = [1135874, 1120869, 1109733, 1100402, 1092938, 1088402, 1086141, 1084872, 1085014, 1087198, 1089937, 1091671, 1093713, 1098280, 1105015, 1112277, 1120309, 1130114, 1140716, 1150637, 1160676, 1172172, 1184048, 1194618, 1204759, 1216134, 1228001, 1239127, 1251085, 1266056, 1282891, 1299029, 1314843, 1332487, 1351885, 1371526, 1391833, 1414070, 1437312, 1460133, 1483757, 1509811, 1536527, 1561022, 1583731, 1606739, 1629528, 1650536, 1671124, 1693611, 1716994, 1739036, 1760977, 1785612, 1812364, 1838895, 1865923, 1895590, 1926729, 1956781, 1986844, 2019739, 2054640, 2088904, 2123585, 2161622, 2202199, 2242673, 2284567, 2331549, 2382681, 2433874, 2485011, 2539397, 2597157, 2655565, 2715162, 2779076, 2846880, 2915488, 2985483, 3060160, 3139036, 3218914, 3300688, 3388336, 3481832, 3577892, 3676956, 3782322, 3893040, 4005041, 4118684]
56003D118684J19122J24356J26541J30884J41013J51417J57402J63760J75288
55994E408467J87658J96331K05505K19299K33263K43680K55848K73962K92613
55985G516626L07854L26066L51993L79184M02848M30283M67321N06962N43578
55976A1232715N85217O38790O96911P53488Q18018Q99530R91599J089400J205272
55967A8910940J350063J516375J699320J915427K180865K492013K851189L290057
55959C6206249L842612M520523N345101O376444P676363R271497J1192541J3519389
55951I7950719J6348348J9756448K3827834K8584803L3690519L8178471M0604467
55944B98941609L9570375L4177927K4246083J0536499n024361j9649174l0754492
$$ y = [4118684, 4237806, 4362162, 4488703, 4619587, 4760600, 4912017, 5069419, 5233179, 5408467, 5596125, 5792456, 5997961, 6217260, 6450523, 6694203, 6950051, 7224013, 7516626, 7824480, 8150546, 8502539, 8881723, 9284571, 9714854, 10182175, 10689137, 11232715, 11817932, 12456722, 13153633, 13907121, 14725139, 15624669, 16616268, 17705668, 18910940, 20261003, 21777378, 23476698, 25392125, 27572990, 30065003, 32916192, 36206249, 40048861, 44569384, 49914485, 56290929, 63967292, 73238789, 84431330, 97950719, 114299067, 134055515, 157883349, 186468152, 220158671, 258337142, 298941609, 338511984, 372689911, 396935994, 407472493, 402448132, 382798958, 352044466]
55937C52044466l7089231l8982404l7655152l4399783l0229449k5876212k1804807
55930A26007428j8216333j5145765j2581083j0486632q783000p381061o228868
55923D7184686n294718m530311l886494l344761k900543k531933k212278j936645
55915B0547003j708963j517183j344859j193471j070440r67318q70749p83316
55907A1090704p13287o54467n95490n39239m94736m58542m21564l86030l59160
55898F468189l37493l13145k88607k70498k55397k36077k15439k00476j88575
55889D162482j73121j56825j46359j39144j28208j15213j06459j00659r2699q5089
55879B918706q3920q7184q8260q7275q8251q8818q3714p5374p0526o9037o5959
$$ y = [352044466, 314955235, 275972831, 238317679, 203917896, 173688447, 147812235, 126007428, 107791095, 92645330, 80064247, 69577615, 60794615, 53413554, 47184686, 41889968, 37359657, 33473163, 30128402, 27227859, 24695926, 22483648, 20547003, 18838040, 17320857, 15975998, 14782527, 13712087, 12744769, 11874020, 11090704, 10377417, 9722950, 9127460, 8588221, 8093485, 7634943, 7213379, 6827349, 6468189, 6130696, 5817551, 5528944, 5258446, 5003049, 4766972, 4551533, 4351057, 4162482, 3989361, 3832536, 3686177, 3547033, 3418825, 3303612, 3197153, 3096494, 3003795, 2918706, 2834786, 2747602, 2659342, 2572067, 2483816, 2394998, 2311284, 2235910, 2165384, 2096347, 2030388]
55868B030388o1813o0922o1990o0054n5684n3245n2055m8072m2376l9384l8577
55857A456216l6168l3147l3391l5605l5105l2127l0599l0341k8102k4824k4248
55846A112559k5588k4964k2888k3097k5073k4866k2453k1391k1921k1026j8588
55835H60704j7198j6625j4672j2529j3095j4933j4078j0969r426r666q634o544
55823G12335o678q980j0002r262r774j2102j3453j2888j2379j2452j1641j0201
55811E82523r794r748q157o099o081p059n856k910j565k086j487R03K656K969
55797E28209L437M183L710K487K343K585J055j419k145j526k196l767l358j130
55783E32468k53j442k401k934n550j0539j5013j7449j8862j9096j6487j1692p557
$$ y = [2030388, 1968575, 1907653, 1845663, 1785609, 1729925, 1676680, 1624625, 1576553, 1534177, 1494793, 1456216, 1420048, 1386901, 1353510, 1317905, 1282800, 1250673, 1220074, 1189733, 1161631, 1136807, 1112559, 1086971, 1062007, 1039119, 1016022, 990949, 966083, 943630, 922239, 900318, 879292, 860704, 843506, 826881, 812209, 799680, 786585, 771652, 757574, 746605, 737179, 727513, 718879, 712335, 705657, 696677, 686675, 677413, 667639, 655537, 642084, 629196, 616817, 604365, 592724, 582523, 572729, 562981, 554824, 548725, 542644, 535585, 529729, 526819, 525254, 523168, 521681, 522584, 525240, 528209, 531646, 535829, 539539, 542026, 544369, 546954, 548009, 546590, 544445, 542919, 540723, 536956, 533598, 532468, 532215, 530773, 528372, 525438, 519888, 509349, 494336, 476887, 458025, 438929, 422442, 410750, 403193]
55770D03193m588p71L741O142N649M337K688j198o994j1174j1919j1214j0860
55757C67032j0140q604p534p389o940n982n759o038n018k855j962l059m126l953
55743B87673l550l463k897k125k460l349k751q91k73j420k125j483j103j595j478
55728B56710n20o07k204l322l086l068m024m592m291m534n434m952k535n05m24
55713B12612r33n12M42J451L056M869N349M532M197M462L361P48p23N0N92j176
55697B42377l976n894p054p778p018m686k983l320m125l543k098r61J59J559K187
55682A92846J565J100J801K600K562K692L886N008M769L711K732J390o40k159
55668B23863k152j516j522j994k212k203j938q67O99J328P13M21J368K332K172
$$ y = [403193, 398605, 397834, 401575, 407717, 413366, 417703, 420391, 419193, 412199, 401025, 389106, 377892, 367032, 356892, 348288, 340754, 333365, 326425, 320443, 314684, 308646, 303628, 300773, 298811, 295752, 291626, 287673, 284123, 280660, 277763, 275638, 273178, 269829, 267078, 266187, 265914, 264494, 262369, 260886, 259783, 258188, 256710, 256190, 255583, 253379, 250057, 246971, 243903, 239879, 235287, 230996, 226462, 221028, 216076, 213541, 213036, 212612, 211679, 211167, 211609, 213060, 216116, 220985, 226334, 230866, 235063, 239525, 242886, 243634, 242911, 242961, 243553, 242377, 238401, 232507, 225453, 217675, 210657, 205971, 202988, 199668, 195543, 192000, 189902, 188941, 189100, 190659, 192846, 194411, 195511, 197312, 199912, 202474, 205166, 209052, 214060, 218829, 222540, 225272, 226662, 226022, 223863, 221711, 220195, 218673, 216679, 214467, 212264, 210326, 209459, 210158, 211486, 212199, 212620, 213988, 216320, 218492]
55653B18492J643J695J792J254O34M02j13j215j939j812j897k861l684l558l357
55638B05476l918m562m631m848n748o333n734m734m294l987l227k575k508k253
55624A46124j148M2M01K12L1l00p66p28k25k80j082j498j183j320k322k770j856
55607A31332r00j144j868k086k218k537j929P6J766J508J25o89q26r75q79k21
55591A18535P9p35j706j671j152j124j100k18R01J090N92L99N62O90J210K632
55575A18984M263N112N329N519N551N281N445O530P618P638O880O063M886K808
55561A97907L17j769l403m634m945m404m269n248o295o340o004o213o390n547
55547A32763m092k998k212j327q03j000r71J59J455J363o5j509k191k059r92P33
$$ y = [218492, 220135, 221830, 223622, 224876, 225510, 225912, 225799, 224584, 222645, 220833, 218936, 216075, 212391, 208833, 205476, 201558, 196996, 192365, 187517, 181769, 175436, 169702, 164968, 160674, 156687, 153460, 150885, 148377, 146124, 144976, 145018, 145419, 145631, 145662, 145362, 144596, 143868, 143643, 143363, 142281, 140783, 139600, 138280, 135958, 133188, 131332, 130432, 129288, 127420, 125334, 123116, 120579, 118650, 118726, 120492, 122000, 122125, 121436, 120610, 119635, 118756, 118535, 118614, 117879, 116173, 114502, 113350, 112226, 111126, 110908, 111809, 112899, 113491, 113890, 114452, 115142, 116352, 118984, 123247, 128359, 133688, 139207, 144758, 150039, 155484, 162014, 169632, 177270, 184150, 190213, 195099, 197907, 198224, 196455, 193052, 188418, 183473, 179069, 174800, 169552, 163257, 156917, 150913, 144700, 138310, 132763, 128671, 125673, 123461, 122134, 121331, 120331, 119360, 119519, 120974, 122337, 122272, 120763, 118572, 116513, 115521, 116254]
55531A16254J909J711R05O48Q27O98K38k53r63j839k039j288p33j219j864j611
55515A11381j018j136j676j803j705j889j910j264n86n41n45N9O43N03K32M40
55499I9185L89n58j385j039l25m14o93j02O79M04m15n30l19q44j573j280n06o59
55481I0015j390j230l39j25n43k39P58R64J34k89L34R39O77j06r64j766j947r91
55463H3892L17O65J47j59k17q38j706j630o87j54k52L3Q55J204R04Q68J168P90
55445H5200k95p84l06o9o23q66j29N55K12m56l18M99J143J277R95L22m88q66o64
55426H4339l41j84k0J70J66J13L08M29m2o16j97J161K104J815R66M55K79k1n48
55407I0336j106j380j036j97K89k18j173j620j578j650j705j219n69o00j050q82
$$ y = [116254, 118163, 119874, 120779, 121427, 122254, 122952, 123190, 122937, 121974, 120135, 118096, 116808, 116075, 114856, 112992, 111381, 110363, 109227, 107551, 105748, 104043, 102154, 100244, 98980, 98394, 97853, 97308, 97367, 98010, 98513, 98745, 99185, 99574, 99016, 97631, 96592, 96267, 95853, 95160, 95058, 95737, 96141, 95726, 95196, 94877, 94033, 92460, 91180, 90674, 90015, 88625, 87395, 87056, 86931, 86388, 86149, 86907, 87871, 88005, 87716, 88050, 88989, 89666, 89560, 88596, 86830, 84883, 83892, 84209, 84874, 85021, 84862, 84645, 83807, 82101, 80471, 79784, 79630, 79378, 79411, 80266, 81470, 82374, 83242, 84410, 85200, 84905, 84121, 83815, 83746, 83123, 82257, 82128, 82683, 82895, 82439, 82121, 82620, 83763, 85040, 86035, 86357, 85869, 85003, 84339, 83998, 83814, 83794, 83964, 84130, 84243, 84551, 84980, 84938, 84322, 84125, 85286, 87390, 89205, 90171, 90626, 90905, 90884, 90336, 89230, 87850, 86814, 86617, 86906, 86688, 85515, 83895, 82317, 80667, 78962, 77743, 77174, 76574, 75524, 74642]
55391G4642j35J14l12l34N02J266J182O59L27J73J04L22O90O74K34j16k91p23
55373G8978j342j466r47l85l3N27J366J894J820J527J250P90J75k08k89l04j66
55356H3187L29P39M38k33l83n0q6n70o27RN21L42p5j87p7pm7k44m13L0J093J481
55334H5170O1k175l090k161q32j40K62O43N39P5K71J370K174J789P71j0n02q43
55316H3372p60k72m6m11q15p27k98J96O60P69J64p33j116j096j476k089j787m00
55298G3135O65L82n27q46m22J62N84P84P69Q65J452K150K065J023k05j025j427
55281G9584j284l79P89J314J166J050J075P35J87J19K89k34j218j306k01Q24R59
55264H3469P92P96N55P5J17O32N02m27q36k10J72n30j271j061o61j019j509j162
$$ y = [74642, 74507, 74621, 74309, 73975, 74477, 75743, 76925, 77584, 77911, 78084, 78188, 78510, 79200, 79874, 80108, 79992, 79701, 78978, 77636, 76170, 75223, 74838, 74805, 75332, 76698, 78592, 80412, 81939, 83189, 83979, 84154, 83946, 83657, 83353, 83187, 83516, 84255, 84693, 84460, 84077, 84027, 83941, 83371, 82744, 82753, 83274, 83616, 83541, 83354, 83277, 83270, 83223, 82979, 82566, 82596, 83689, 85170, 85231, 83056, 79966, 77805, 76973, 76833, 77095, 77738, 78277, 78352, 78623, 79993, 82167, 83956, 84727, 84717, 84215, 83372, 82612, 82340, 82294, 81883, 81068, 80341, 80043, 80239, 80899, 81668, 81832, 81099, 79983, 78887, 77411, 75322, 73535, 73135, 73800, 74182, 73655, 72809, 72387, 72549, 73133, 73917, 74686, 75551, 77003, 79153, 81218, 82241, 82036, 81011, 79584, 78300, 77921, 78710, 80024, 81190, 82240, 83315, 84050, 84237, 84356, 84645, 84411, 83193, 81887, 81686, 82510, 83469, 84261, 85057, 85612, 85687, 85804, 86436, 86938, 86511, 85675, 85465, 85637, 85107, 83836, 82775, 82114, 81095, 79586, 78424]
55246G8424l24K70Q68J788K281J659O06Q4n9l03l41M2O4p15j238n33N54O69Q9
55227H3885J5N01O52L10K9j57n39p47k57M62O17M64P66J262J001J6o38m76pL36
55207H7495O15P04J82q79j738j761j010m2N10L83j6j9M45Q33R27J018R74K19r89
55188H7851j376m49N94N64j06l97l29m43n40j28M96P12N99M91J68n20r06m49J46
55169H5978j01q36r28k73J65q6m08p5R41K001K210J137m40j087m75J80L6j50M79
55150H8268J238J002J02k92l7J12O0L33P75N81l89j342j599j109j30Q20J056N34
55132H9983J48M63P64J83q19j144o85j72R1K42J03n00r50n50L33Q13P93P43O19
55113I0458J28l67l50j76m28o88j18J042J780J849J743J475O04n79j135o89K92
$$ y = [78424, 78100, 78370, 79238, 81026, 83307, 84966, 85572, 85656, 85597, 85294, 84953, 84995, 85059, 84344, 83106, 82573, 83127, 83796, 83885, 83900, 84401, 85053, 85363, 85392, 85235, 84696, 83949, 83692, 84154, 84771, 85235, 86001, 87263, 88264, 88280, 87642, 87166, 87159, 87495, 88110, 88814, 88996, 88117, 86379, 84618, 83608, 83566, 84076, 84459, 84443, 84424, 84869, 85702, 86629, 87647, 88621, 88840, 87851, 86475, 86026, 86620, 87184, 87078, 86681, 86352, 85909, 85369, 85241, 85737, 86449, 87048, 87539, 87707, 87187, 86281, 85832, 85978, 85877, 85041, 84113, 83840, 84005, 83919, 83511, 83436, 84377, 86378, 88588, 89725, 89285, 88198, 87723, 87903, 87939, 87789, 88268, 89506, 90508, 90610, 90318, 90281, 90393, 90453, 90786, 91561, 92142, 91753, 90411, 88812, 87703, 87573, 88393, 89449, 89983, 90131, 90594, 91358, 91541, 90722, 89578, 88893, 88721, 88812, 89054, 89157, 88657, 87707, 87157, 87490, 88303, 89096, 89839, 90458, 90586, 90219, 89869, 89693, 89265, 88577, 88459, 89501, 91281, 93130, 94873, 96348, 96952, 96373, 95238, 94549, 94841]
55096I4841J287J831J348j12j362j437r60r55j009q8J340J825J307J123J658J849
55080A02486J215O09M81N6j064j940j673o30L30Q95J059Q18M78M21L49l41j256
55063A02293j282l67K15k07p82p44o67j313k169k148j063L54J435J932J819J328
55047I8634Q88O37L17j85o17q46j073j331j302p96j4P55J231J013l0j198j469
55030I4614p56rN2k98m28j51K63M49J72l79n58Q6J144J766J587Q64l2o85o62l1
55010I7008M72L83J82L39M36O0j47M78J236J089M73N02Q58K73j043j452m95M50
54992A01102N01L86P22R16O47P25J500J846Q60o28j375j444j554j607j102l02
54976A01193J36K10L47N13L85N9r8J2L07P44J113J077P70P36R36N72o29j696j540
$$ y = [94841, 96128, 97959, 99307, 99195, 97833, 96396, 95436, 94481, 93472, 93384, 94724, 96549, 97856, 98979, 100637, 102486, 103701, 104310, 104791, 104847, 103783, 101843, 100170, 99540, 99870, 100765, 101824, 102642, 103120, 103541, 103890, 103549, 102293, 101011, 100644, 100859, 100652, 99870, 99126, 98459, 97146, 94977, 92829, 91766, 92120, 93555, 95487, 97306, 98634, 99522, 100159, 100476, 100291, 99674, 98828, 97755, 96424, 95122, 94326, 94312, 95067, 96298, 97311, 97281, 96083, 94614, 93858, 93849, 93901, 93603, 93175, 93024, 93287, 93736, 93908, 93529, 92971, 93057, 94201, 95967, 97554, 98418, 98386, 97701, 97039, 97008, 97480, 97863, 98045, 98384, 98820, 98880, 98733, 99211, 100447, 101536, 102009, 102511, 103369, 103642, 102599, 101147, 100652, 101102, 101603, 101989, 102711, 103627, 104274, 104999, 106499, 108345, 109205, 108577, 107202, 105758, 104204, 102597, 101495, 101193, 101329, 101539, 101886, 102399, 102784, 102843, 102745, 102757, 103064, 103808, 104921, 105998, 106768, 107504, 108440, 109012, 108383, 106687, 105147]
54957A05147k11J382K405K398J359M3n37k87p4k72k70K24M53q6o35l86J52N3m80
54938A10378n49l8L86L28l0m59o56j26J136K172K087J260P84R64J187J108J078
54921A21010J464K200L054L819M299M544M954N675O070N368L760K244J423R35
54907A70819J37j115k483l642m509n114n332m999m285l775l767l686k796j384
54893A24069n75q14j335j370j100r56p28o0P52J166J267J484J782J802J610J613
54877A28607J839J954J994K440L458M559N257N652O040O199N502L739J526l02
54863A78464j605k907m451n733o176n887n342m672l767k847k383k418k528k400
54849A25348k054j605j231j248j675j927j492p15l17l22k06O8j2n57j106j402
$$ y = [105147, 104936, 106318, 108723, 111121, 112480, 112523, 111986, 111699, 111625, 111353, 111083, 111307, 111760, 111674, 111039, 110653, 110805, 110858, 110378, 109829, 109791, 110177, 110505, 110475, 110016, 109360, 109234, 110370, 112542, 114629, 115889, 116673, 117637, 118824, 119932, 121010, 122474, 124674, 127728, 131547, 135846, 140390, 145344, 151019, 157089, 162457, 166217, 168461, 169884, 170819, 170956, 169841, 167358, 163716, 159207, 154093, 148761, 143762, 139477, 135702, 131935, 128249, 125453, 124069, 123494, 122680, 121345, 119975, 118875, 117919, 117191, 117131, 117883, 119049, 120316, 121800, 123582, 125384, 126994, 128607, 130446, 132400, 134394, 136834, 140292, 144851, 150108, 155760, 161800, 167999, 173501, 177240, 178766, 178464, 176859, 173952, 169501, 163768, 157592, 151705, 146363, 141691, 137924, 135077, 132694, 130276, 127748, 125348, 123294, 121689, 120458, 119210, 117535, 115608, 114116, 113401, 113084, 112762, 112556, 112624, 112612, 112055, 110949, 109547]
54833A09547j549j448q74j15K92M11O34O66r7j241j606j038o05p65o69K23J122
54816A02888J212Q68P48P16M15R3Rj36m61l64M81J344J405Q80M45J90r1k56j66
54797A10220j41l07j03Q17J749J780R88J24l88n08j82L60M67p0m70M6J126J827
54779A17335J768J158J93q26j270q23K7P24J436K488L509L904L776L716L966M375
54763A45456M818N208N425N639O198O808O536N062L208J674R6j992m088n470o240
54748A78338o768o828o187n391n011m717m031l381l354l505l033k135j612j469
54734A20916j083m36p1L5M80J325J893J718J069N60O87J546K621L207L382L902
54718A41751M864N409N283N385N959N573L241L79r97j081j603l013m249m822n240
$$ y = [109547, 107998, 106550, 105676, 105561, 105853, 106264, 106898, 107564, 107467, 106226, 104620, 103582, 102977, 102212, 101543, 101766, 102888, 104100, 104968, 105716, 106432, 106847, 106940, 106949, 106813, 106352, 105988, 106469, 107813, 109218, 110098, 110543, 110733, 110642, 110386, 110220, 110079, 109772, 109669, 110486, 112235, 114015, 115003, 115127, 114739, 114231, 114049, 114409, 114876, 114806, 114336, 114382, 115508, 117335, 119103, 120261, 120454, 119628, 118358, 117535, 117562, 118286, 119722, 122210, 125719, 129623, 133399, 137115, 141081, 145456, 150274, 155482, 160907, 166546, 172744, 179552, 186088, 191150, 194358, 196032, 196128, 194136, 190048, 184578, 178338, 171570, 164742, 158555, 153164, 148153, 143436, 139405, 136024, 132670, 129165, 126132, 123997, 122385, 120916, 119833, 119397, 119326, 119361, 119841, 121166, 123059, 124777, 125846, 126406, 127093, 128639, 131260, 134467, 137849, 141751, 146615, 152024, 157307, 162692, 168651, 174224, 177465, 177844, 176847, 175766, 174163, 171150, 166901, 162079, 156839]
54703A56839n536n145m238l567l025j881m36J26m14j116j557k104k556k222j491
54688A21677j538k210j964m15R03Q49J96m7j14l54j93O69J284Q27q5n35p49j276
54670A16925j725j457q32n79n41j52L53L69R3J97O18P21N26O95J267J390N66m74
54652A17960o53N8N85O2j095j687j276o59n86n94J48J281J607Q98K02J99L10q4
54634A16676o10o78m89n25o91o38m78m96n64l95q7P3P7Q8J68L69O82P47J28p75
54614A12582q45L06J595J747Q34l4j03M84J161J371Q14k09r64j141j170j339j199
54597A13890m22L59L98N0J85O90N84k98q22r9J294K116J950J359R45Q24Q57R30
54579A24790Q68M68k54r50j216r15k76K20N8q53j801j683k18J397J654N42l89
$$ y = [156839, 151303, 146158, 141920, 138353, 135328, 133447, 133011, 133137, 132723, 131607, 130050, 127946, 125390, 123168, 121677, 120139, 117929, 115965, 115550, 116453, 117302, 117498, 117451, 117337, 116983, 116790, 117459, 118743, 119570, 119485, 118950, 118201, 116925, 115200, 113743, 112911, 112332, 111791, 111639, 111992, 112361, 112454, 112651, 113269, 113990, 114516, 115211, 116478, 117868, 118434, 117960, 117307, 117365, 117950, 118012, 116917, 115230, 113954, 113295, 112709, 112115, 112263, 113544, 115151, 116049, 116251, 116450, 116760, 116676, 116066, 115388, 114899, 114374, 113683, 113045, 112567, 112071, 111507, 111112, 111025, 111098, 111175, 111263, 111431, 111800, 112482, 113229, 113357, 112582, 111737, 112043, 113638, 115385, 116219, 116185, 116082, 116566, 117727, 119098, 119912, 119703, 118739, 117598, 116428, 115089, 113890, 113468, 113827, 114225, 114275, 114460, 115150, 115734, 115436, 114614, 114515, 115809, 117925, 119875, 121234, 122179, 123003, 123860, 124790, 125658, 126126, 125872, 124922, 123706, 122791, 122515, 122735, 122793, 121940, 120139, 118456, 118238, 119635, 121289, 121831, 121442]
54562A21442mJ041J333N42m52q21n25P9O39Q55O79M64M54L26k62r01q99l65m9
54543A23576j42o0M77R83J134J324J877K380K275J694J179Q91N76M4o37j272j582
54526A34717j286m24M49O75J05p39j161j009p70q72j027p05j63k89j182j735j208
54509A23376m11m11q27n06N31J155R03M12J18j41j42P07J984K222R04n68p20J22
54491A28708N86J37o38j073r79m75J42N21O19O57O13K44k44j95N37J280J502J385
54473A33327J139N64k67o33j19P10J142J252J387J357Q58J93j14r0p1q1M3J99
54455A40796K53L33M41K24l81p54n23k86o86j228r20J78R58Q38L47J24K1m21j136
54436A38178j560j274m50K78M23J17q8L5J69P4Q3O04J429J881J524N37n07j021
$$ y = [121442, 121438, 122479, 123812, 124354, 123902, 123081, 122556, 122635, 123274, 124129, 124808, 125272, 125726, 126052, 125790, 124889, 123990, 123625, 123576, 123434, 123374, 123851, 124834, 125968, 127292, 129169, 131549, 133824, 135518, 136697, 137588, 138164, 138208, 137571, 136299, 134717, 133431, 133007, 133456, 134131, 134236, 133497, 132336, 131327, 130557, 129685, 128658, 127953, 127790, 127501, 126319, 124584, 123376, 122965, 122554, 121727, 121221, 121752, 122907, 123810, 124222, 124340, 124199, 124057, 124764, 126748, 128970, 129874, 129306, 128586, 128708, 129294, 129431, 128793, 127720, 126741, 126266, 126408, 126929, 127548, 128205, 128818, 129062, 128818, 128623, 129160, 130440, 131942, 133327, 134466, 135030, 134763, 134130, 134011, 134721, 135863, 137115, 138502, 139859, 140717, 140910, 140796, 140706, 140635, 140554, 140597, 140796, 141049, 141382, 141823, 142047, 141666, 140912, 140389, 140103, 139417, 138189, 137269, 137447, 138405, 139243, 139590, 139714, 139735, 139314, 138178, 136618, 135344, 134894, 135172, 135595, 135712, 135624, 135659, 135828, 135902, 135985, 136589, 138018, 139899, 141423, 141960, 141453, 140432]
54418A40432q23l01L0J76N54J148J332P44j33o71q71j001r66n39N8L92M54N38
54400A40553O64N99L79L53O13Q37P72O88J058J863K339J708J55j128j234m88J67
54383A49898M25O02O45N3j107j926j735q80j45J09n6m24o51m90j45j4k5J84M70
54364A44788L61M3K51R36J118M99J00O60J452J497J092J109J509J616J394J409
54348A59834J728J859J648J508J743K256K850L291L190K317R91k28j046j468j588
54333A78885j657j988k459k538k092j727j959k465k552k014j143l42k3l82r81
54318A54563j102p25m67m10J01J024J152j55j750k167j572j172j338j397r00l1
54302A43654R18J662J756J114L27j26n50j201j467q24Qq8r78j560j359q33l50
$$ y = [140432, 139609, 139308, 139338, 139514, 140068, 141216, 142548, 143292, 143159, 142488, 141617, 140616, 139650, 139111, 139169, 139561, 140015, 140553, 141217, 141816, 142195, 142548, 143161, 143998, 144770, 145458, 146516, 148379, 150718, 152426, 152581, 151453, 150219, 149731, 149898, 150323, 150925, 151570, 151623, 150516, 148590, 146855, 145975, 145830, 145939, 145883, 145459, 144808, 144318, 144173, 144159, 144134, 144318, 144788, 145149, 145192, 145443, 146379, 147497, 147996, 148096, 148756, 150208, 151705, 152797, 153906, 155415, 157031, 158425, 159834, 161562, 163421, 165069, 166577, 168320, 170576, 173426, 176717, 179907, 182224, 183215, 182987, 181941, 180473, 178885, 177228, 175240, 172781, 170243, 168151, 166424, 164465, 162000, 159448, 157434, 156291, 155949, 155926, 155544, 154563, 153461, 152736, 152269, 151859, 151960, 152984, 154136, 153981, 152231, 150064, 148492, 147320, 145982, 144585, 143685, 143654, 144572, 146234, 147990, 149104, 149431, 149305, 148755, 147554, 146087, 145263, 145271, 145183, 144205, 142645, 141286, 140453, 140103]
54285A40103J30M98N30M00L90L55J54K04Q18J454J439J013P31M31j75n12L5P82
54267A48780O36q3j68M16N92J47M5O23J021P76N41Q08J162J213J142R46K62n83
54249A58276o15K61Q02J43j030j602j447j139j056j271j664j709q57M82J112N59
54233A49245l15o07m17k26m2L04O25P16O71N25J27l84o26o52q64j111p92oL80
54214A46551J67K46J064J801J717J324J317J289N37n87j130q51k34M25J006J146
54198A55788O21p9m06o40j348k244k445j762r05m64l53k98k01L1M59Q42Q45N49
54180A47990L66M34N11M79N18O82P04L99Oo5K61O42P11M68J84k8l36q21j142r36
54160A51027l93r4k70n95p41p31o46l93OK51J39q1K4N53J111J164N40l15o92l43
$$ y = [140103, 140233, 140731, 141261, 141661, 142051, 142406, 142560, 142764, 143582, 145036, 146475, 147488, 148219, 148650, 148475, 147963, 147998, 148780, 149416, 149333, 149165, 149581, 150173, 150320, 150365, 150988, 152009, 152785, 153326, 154134, 155296, 156509, 157651, 158597, 158859, 158276, 157661, 157922, 158724, 158867, 157837, 156235, 154788, 153649, 152593, 151322, 149658, 147949, 147092, 147574, 148686, 149245, 148930, 148323, 147906, 147680, 147638, 147942, 148567, 149283, 149954, 150479, 150606, 150222, 149596, 148944, 148080, 146969, 146177, 146171, 146551, 146718, 146964, 148028, 149829, 151546, 152870, 154187, 155476, 156013, 155426, 154296, 153445, 153211, 153636, 154642, 155788, 156409, 156330, 155924, 155284, 153936, 151692, 149247, 147485, 146580, 146116, 145763, 145465, 145264, 145295, 145754, 146596, 147441, 147990, 148356, 148790, 149301, 149780, 150298, 150980, 151684, 152083, 152089, 152024, 152285, 152927, 153638, 154106, 154290, 154262, 153926, 153105, 151963, 151027, 150634, 150540, 150270, 149675, 148934, 148203, 147557, 147164, 147170, 147421, 147560, 147479, 147503, 148056, 149167, 150331, 150871, 150556, 149864, 149521]
54140A49521K75N98N68L84K7m94p24j87Q57J665J902J766J332M92m84j006r57
54123A55535q44r88j106q41k38M70J089J431J431J304J154O31l92j087n12Q60
54107A57897J460P03k60k43M86R61R55Q88Q69N86K8l41j72K75L08m85j562j751
54089A60602o12Q10J150M68N1N65J294J331O69j40o53n88J08R60J295J084Q98
54072A69292R46R10P17P27R98J134J016Q08L07o67j244j80K162L872M074M007
54056A88879M931O343P263P930Q933R771R538Q374O859M755J572k022m701o014
54042B52411o337n742m143k253j115o50J75J723L192L900M084M237M400M365M057
54027B62304L547L055K958L381L824L635K798J890J307R63N84J4p12j350j719
$$ y = [149521, 149796, 150394, 150962, 151346, 151373, 150879, 150155, 149968, 150825, 152490, 154392, 156158, 157490, 157982, 157498, 156492, 155535, 154691, 153703, 152597, 151756, 151518, 151988, 153077, 154508, 155939, 157243, 158397, 159028, 158636, 157549, 157037, 157897, 159357, 160060, 159800, 159557, 160043, 161004, 161959, 162847, 163716, 164302, 164330, 163989, 163817, 164092, 164400, 163915, 162353, 160602, 159990, 160800, 161950, 162418, 162469, 163034, 164328, 165659, 166328, 166188, 165535, 164947, 165055, 166015, 167310, 168394, 169292, 170238, 171148, 171865, 172592, 173590, 174724, 175740, 176548, 176855, 176188, 174944, 174764, 176926, 180798, 184872, 188879, 193810, 200153, 207416, 215346, 224279, 234050, 243588, 251962, 258821, 263576, 265148, 263126, 258425, 252411, 246074, 240332, 236189, 233936, 232821, 232171, 232346, 234069, 237261, 241161, 245245, 249482, 253882, 258247, 262304, 265851, 268906, 271864, 275245, 279069, 282704, 285502, 287392, 288699, 289662, 290246, 290260, 289548, 288198, 286479]
54012B86479k094k920l992m506m253m067m604n373n548n141m666m229l714l356
53998B28016l321l214k748k418k646k770j966p21l07r40j553j377p13j01K92K96
53982B03809m03j684k855l264k690j280L13R89J99j168j663r52K1N16P26R55J016
53965A92585P74O09Q98J480J931K079K106K346L032L973M575M512M232M376M887
53950B34395N155M927M507M089L463K413J044l03j138j022o3R68J433J538J864
53935B63270K484L027L315L362L044K410K033K343K843K708J993J549J797K392
53921B98570L004L724M602N440O117O605O805O824P268Q526J0029J0903J1173
53908C89590J1516J2014J2123J1906J2270J3653J5273J5894J4706J1260N367k385
$$ y = [286479, 284385, 281465, 277473, 272967, 268714, 264647, 260043, 254670, 249122, 243981, 239315, 235086, 231372, 228016, 224695, 221481, 218733, 216315, 213669, 210899, 208933, 208212, 207905, 206965, 205412, 204035, 203322, 203221, 203513, 203809, 203406, 201722, 198867, 195603, 192913, 191633, 191946, 192935, 193134, 191966, 190303, 189351, 189372, 189888, 190614, 191569, 192585, 193359, 193968, 194866, 196346, 198277, 200356, 202462, 204808, 207840, 211813, 216388, 220900, 225132, 229508, 234395, 239550, 244477, 248984, 253073, 256536, 258949, 259993, 259690, 258552, 257530, 257467, 258435, 259868, 261406, 263270, 265754, 268781, 272096, 275458, 278502, 280912, 282945, 285288, 288131, 290839, 292832, 294381, 296178, 298570, 301574, 305298, 309900, 315340, 321457, 328062, 334867, 341691, 348959, 357485, 367514, 378417, 389590, 401106, 413120, 425243, 437149, 449419, 463072, 478345, 494239, 508945, 520205, 525572, 523187]
53896E23187j0368j6633j9925k0273j8929j7490j6568j5494j3672j1770j0818
53885C51247j0689j0431r821r455r445r143q257p138n968m727l992m502n690n926
53871B46063m645l062k299k004j457r24r97j481j850k106k420k499k103j639j524
53856B15053j503j285j279j838k338j923q45j42j40j48L25Q51P52Kp88j025o57
53839B03072j91j34m48o82o68o36o90o36n05o26q98o15M37J378J304N86K84N79
53821B00911O28m2p64o61K00R44R86O67P71J543K338K398J855J679K509L827M495
53804B24284M033L122K927L910N362O138N845N122M695M599M514M451M517M407
53790B87926L847L208K932K572J404p2m54N44J484J117j34j238k088l175m464
$$ y = [523187, 512819, 496186, 476261, 455988, 437059, 419569, 403001, 387507, 373835, 362065, 351247, 340558, 330127, 320306, 310851, 301406, 292263, 284006, 276868, 270900, 266173, 262181, 257679, 251989, 246063, 241418, 238356, 236057, 234053, 232596, 231672, 230675, 229194, 227344, 225238, 222818, 220319, 218216, 216577, 215053, 213550, 212265, 210986, 209148, 206810, 204887, 204042, 203900, 203760, 203612, 203937, 204788, 205540, 205542, 204754, 203729, 203072, 202881, 202747, 202299, 201617, 200949, 200313, 199623, 198987, 198482, 197856, 196958, 196343, 196780, 198158, 199462, 200048, 200332, 200911, 201539, 201497, 200733, 200072, 200272, 201216, 202202, 202869, 203640, 205183, 207521, 209919, 211774, 213453, 215962, 219789, 224284, 228317, 231439, 234366, 238276, 243638, 249776, 255621, 260743, 265438, 270037, 274551, 279002, 283519, 287926, 291773, 294981, 297913, 300485, 301889, 301817, 301363, 301907, 303391, 304508, 304374, 303136, 301048, 297873, 293409]
53775B93409n494o119o335n887m853m175m556n234m842l428k506k990m051m367
53761B28572l732k862k282j964j780j706j606j280p91n39q69j644k314k328j581
53746B01294m95L02M43J22j18Q1N48Q75R45R36Q43M69m2j35L47P79O32L21N59
53727B08706J176J320P62K43M45J245K047K342J909J038N10Q16J460J602J298
53712B26919J290J691J856J610J550J881K055J946K307L383M130L626K477J911
53698B58632K106K368K452K695L092L209K936K636K562K608K569K194J240j18
53684B91181j175j451j241j049q82n81l77n17p06n89m41o15p67m37j05o13j677
53667B77958k022j160p6K18r9k85j67r9j78k03q9Q5L25O28P57M68p8m10l70l68
$$ y = [293409, 287915, 281796, 275461, 269574, 264721, 260546, 255990, 250756, 245914, 242486, 239980, 236990, 232939, 228572, 224840, 221978, 219696, 217732, 215952, 214246, 212640, 211360, 210569, 210030, 209161, 207517, 205203, 202875, 201294, 200799, 201101, 201544, 201666, 201548, 201629, 202177, 203052, 203997, 204933, 205776, 206245, 206203, 206068, 206415, 207194, 207826, 208147, 208706, 209882, 211202, 211964, 212207, 212652, 213897, 215944, 218286, 220195, 221233, 221743, 222559, 224019, 225621, 226919, 228209, 229900, 231756, 233366, 234916, 236797, 238852, 240798, 243105, 246488, 250618, 254244, 256721, 258632, 260738, 263106, 265558, 268253, 271345, 274554, 277490, 280126, 282688, 285296, 287865, 290059, 291299, 291181, 290006, 288555, 287314, 286265, 285383, 284802, 284425, 283908, 283202, 282613, 282172, 281557, 280790, 280353, 280248, 279635, 277958, 275936, 274776, 274700, 274918, 274819, 274534, 274367, 274268, 274090, 273887, 273798, 273883, 274208, 274836, 275593, 276061, 275983, 275573, 275203, 274835]
53647B74835q54j620j867j115J32R05Q53N24N25P52P18L33O7L23R48J393J358
53630B78210J195J537K444L147K941K169J818K248K831K988K896K906K860K455
53616C12645J965K039K912M176N212N674N645N490N449N319M750L849L194L157
53602C71476L601M193M685M787M317L574L120L118L299L570L985M120L327J800
53588D22972N24j25q35k044l136l600l924m593n069m700l912l481l246k638j987
53573C80206k130k956l478l192k471j713j060q65j377j966j573q3J461K109J846
53558C62758J155M53J3j17j45j28K83J150J714J355P50J142K560L795M053L695
53542C84486L292K978K894L294L975M379M520M936N663O145O438P366R073J0395
$$ y = [274835, 273981, 272361, 270494, 269379, 269511, 270416, 271269, 271793, 272318, 273070, 273788, 274121, 274188, 274511, 275459, 276852, 278210, 279405, 280942, 283386, 286533, 289474, 291643, 293461, 295709, 298540, 301528, 304424, 307330, 310190, 312645, 314610, 316649, 319561, 323737, 328949, 334623, 340268, 345758, 351207, 356526, 361276, 365125, 368319, 371476, 375077, 379270, 383955, 388742, 393059, 396633, 399753, 402871, 406170, 409740, 413725, 417845, 421172, 422972, 423496, 423371, 422536, 420492, 417356, 413756, 409832, 405239, 400170, 395470, 391558, 388077, 384831, 382193, 380206, 378076, 375120, 371642, 368450, 365979, 364266, 363206, 362341, 360964, 358998, 357425, 357342, 358803, 360912, 362758, 363913, 364366, 364379, 364262, 364117, 363989, 364272, 365422, 367136, 368491, 369241, 370383, 372943, 376738, 380791, 384486, 387778, 390756, 393650, 396944, 400919, 405298, 409818, 414754, 420417, 426562, 433000, 440366, 449439, 459834]
53528D59834J0399R692R475R961J0534J0980J1659J2688J3680J4276J4532J4810
53516F02520J5541J6849J8293J9233J9663K0280K1420K2491K2852K2884K3577
53505H25603K5178K6768K7242K6377K4899K3693K3037K2498K1594K0388J9294
53494A086571J8452J7697J7080J6940J7361J7951J8335J8481J8397J7999J7490
53483A282754J7427J8041J8846J9181J8941J8407J7616J6280J4298J1995R853
53472A463639Q036O245M021J333j301l478n528q063j0995j3528j5168j6182j6896
53459A392135j7121j6716j6190j6221j6872j7686j8406j9185k0203k1424k2654
53448A189457k3493k3364k2042k0179j8915j8694j8720j7854j5891j3671j1890
$$ y = [459834, 470233, 479925, 489400, 499361, 509895, 520875, 532534, 545222, 558902, 573178, 587710, 602520, 618061, 634910, 653203, 672436, 692099, 712379, 733799, 756290, 779142, 802026, 825603, 850781, 877549, 904791, 931168, 956067, 979760, 1002797, 1025295, 1046889, 1067277, 1086571, 1105023, 1122720, 1139800, 1156740, 1174101, 1192052, 1210387, 1228868, 1247265, 1265264, 1282754, 1300181, 1318222, 1337068, 1356249, 1375190, 1393597, 1411213, 1427493, 1441791, 1453786, 1463639, 1471675, 1477920, 1481941, 1483274, 1481973, 1478495, 1472967, 1464904, 1453909, 1440381, 1425213, 1409031, 1392135, 1375014, 1358298, 1342108, 1325887, 1309015, 1291329, 1272923, 1253738, 1233535, 1212111, 1189457, 1165964, 1142600, 1120558, 1100379, 1081464, 1062770, 1044050, 1026196, 1010305, 996634, 984744]
53437I84744j0297q305o053m307l266k180m09J656L155L914M413M945N402N866
53423I79278O790Q466J0664J2851J4547J5558J6235J7326J9168K1173K2603K3572
53411A168231K4712K6090K7279K8440L0344L3114L5785L7558L8734M0001M1453
53400A531741M2907M4602M6837M9276N1214N2461N3425N4437N5420N6156N6517
53389B094993N6514N6295N6079N5804N5025N3362N1021M8653M6710M4997M2804
53378B662257L9428L4830K9786K5236K1420J7829J3897R495M651p06o601j2889
53366B838633j9483k6452l3720m0823m7108n1994n5156n6730n7343n7565n7361
53355B334898n6434n5063n3998n3368n2341n0195m7315m4751m3098m2231m1821
$$ y = [984744, 974447, 966142, 960089, 955782, 952516, 950336, 949927, 951583, 954738, 958652, 963065, 968010, 973412, 979278, 986068, 994534, 1005198, 1018049, 1032596, 1048154, 1064389, 1081715, 1100883, 1122056, 1144659, 1168231, 1192943, 1219033, 1246312, 1274752, 1305096, 1338210, 1373995, 1411553, 1450287, 1490288, 1531741, 1574648, 1619250, 1666087, 1715363, 1766577, 1819038, 1872463, 1926900, 1982320, 2038476, 2094993, 2151507, 2207802, 2263881, 2319685, 2374710, 2428072, 2479093, 2527746, 2574456, 2619453, 2662257, 2701685, 2736515, 2766301, 2791537, 2812957, 2830786, 2844683, 2854178, 2858829, 2858123, 2851522, 2838633, 2819150, 2792698, 2758978, 2718155, 2671047, 2619053, 2563897, 2507167, 2449824, 2392259, 2334898, 2278464, 2223401, 2169403, 2116035, 2063694, 2013499, 1966184, 1921433, 1878335, 1836104, 1794283]
53344A794283m1737m1963m2385m2591m1986m0288l7911l5519l3262l0822k8138
53333A377681k5521k3046k0480j7955j6077j5068j4452j3934j3857j4381j4852
53322A188058j4604j3922j3471j3197j2432j0907r078p524o503n865n068l535
53310A071952j445J45N48M64J231L261N793Q057R967J1741J3420J4954J6327J7552
53296A173967J8788K0404K2542K4743K6427K7619K8818L0168L1212L1388L0412
53285A466488K8380K5892K3863K2608K1296J8942J5820J3092J0994Q377M441N9
53273A660252l308n446p449j0192j3443j6439j8721k0390k1865k3514k5260k6588
53261A467637k7135k7205k7420k7938k8414k8683k8983k9360k9372k8779k8139
$$ y = [1794283, 1752546, 1710583, 1668198, 1625607, 1583621, 1543333, 1505422, 1469903, 1436641, 1405819, 1377681, 1352160, 1329114, 1308634, 1290679, 1274602, 1259534, 1245082, 1231148, 1217291, 1202910, 1188058, 1173454, 1159532, 1146061, 1132864, 1120432, 1109525, 1100447, 1092923, 1086420, 1080555, 1075487, 1071952, 1070507, 1070652, 1071200, 1071664, 1072895, 1076156, 1081949, 1090006, 1099973, 1111714, 1125134, 1140088, 1156415, 1173967, 1192755, 1213159, 1235701, 1260444, 1286871, 1314490, 1343308, 1373476, 1404688, 1436076, 1466488, 1494868, 1520760, 1544623, 1567231, 1588527, 1607469, 1623289, 1636381, 1647375, 1655752, 1660193, 1660252, 1656944, 1651498, 1644049, 1633857, 1620414, 1603975, 1585254, 1564864, 1542999, 1519485, 1494225, 1467637, 1440502, 1413297, 1385877, 1357939, 1329525, 1300842, 1271859, 1242499, 1213127, 1184348, 1156209]
53250A156209k8120k8407k7997k6666k5448k5318k5968k6348k6079k5585k5095
53239H65178k4253k2910k1542k0576j9749j8530j6906j5372j4280j3531j2802
53228F64727j1827j0572r338q576q454q671q935r431j0506j1967j3089j3434j3406
53215E26521j3689j4260j4266j3111j1351j0144r847r675q960q140q026q404q202
53202C88446o958n454m721m963n700o412o769o619o123n590n055m363l791l979
53188C11949m900n491m846l406k390k313k672k860k741k341j600o56J1k8p24j591
53172B73401k024j773j188r40j258j614j410p57k67k26l66m19n00q38j446k070
53156B56305k341j992j167m65m12q73j213j052o14k97k25l19n61r65j355j390
$$ y = [1156209, 1128089, 1099682, 1071685, 1045019, 1019571, 994253, 968285, 941937, 915858, 890273, 865178, 840925, 818015, 796473, 775897, 756148, 737618, 720712, 705340, 691060, 677529, 664727, 652900, 642328, 632990, 624414, 615960, 607289, 598354, 588923, 578417, 566450, 553361, 539927, 526521, 512832, 498572, 484306, 471195, 459844, 449700, 439853, 430178, 421218, 413078, 405052, 396648, 388446, 381488, 376034, 371313, 366350, 360650, 354238, 347469, 340850, 334727, 329137, 324082, 319719, 315928, 311949, 307049, 301558, 296712, 293306, 290916, 288603, 285931, 283071, 280330, 277989, 276389, 275733, 275744, 275716, 274992, 273401, 271377, 269604, 268416, 267476, 266218, 264604, 263194, 262437, 262170, 261944, 261578, 261159, 260659, 259821, 258375, 256305, 253964, 251972, 250805, 250340, 249928, 249055, 247842, 246790, 246176, 245879, 245654, 245335, 244774, 243809, 242454, 241064]
53140B41064q60N6Q66J167R81O76N76O64O89M34q5m84k16Q26J857J809N16r49
53122B49587j436q98q4N72J273K130K700K495J603O21O7k6mk05o10q80p85n03
53104B55617l89m93n19k91o9k73j038k112l090l632l497k683j569p53n42o85p37
53087B33245n54k60J39O72J046Q43K22j28M5J79j25k97K90J089R25l47j552j631
53069B33801p21L53R89R99N20l1k73l64p07j175j147m81J54J82j47k62l0L21O09
53050B32590P30O49N57O80Q17N21j09l99j60n7n99j328j517j189r00r27j176j525
53032B26658j795j647r93k52J25J59P9m5j10J63P42J068P80K52KJ2O1K11N01N49
53012B26520J21k99j02N10Q37P03N58P15J005J142J001O20K36J49L93P35J118
$$ y = [241064, 240204, 240260, 241126, 242293, 243274, 243950, 244526, 245190, 245879, 246313, 246228, 245744, 245528, 246354, 248211, 250020, 250536, 249587, 248151, 247253, 247169, 247741, 249014, 251144, 253844, 256339, 257942, 258563, 258630, 258604, 258600, 258395, 257785, 256905, 256120, 255617, 255228, 254735, 254216, 253925, 253856, 253583, 252545, 250433, 247343, 243711, 240214, 237531, 235962, 235209, 234667, 233982, 233245, 232691, 232431, 232570, 233242, 234288, 235131, 235353, 235225, 235270, 235449, 235324, 235027, 235317, 236406, 237331, 236984, 235432, 233801, 233080, 233433, 234422, 235421, 235941, 235910, 235637, 235273, 234566, 233391, 232244, 231763, 231917, 232099, 231952, 231690, 231660, 231981, 232590, 233320, 233969, 234526, 235206, 236023, 236544, 236435, 236036, 235876, 235819, 235220, 233892, 232375, 231186, 230286, 229359, 228183, 226658, 224863, 223216, 222223, 221971, 222096, 222255, 222334, 222289, 222179, 222342, 223084, 224152, 224932, 225184, 225186, 225198, 225259, 225470, 225971, 226520, 226641, 226342, 226240, 226750, 227587, 228290, 228848, 229563, 230568, 231710, 232711, 233331, 233567, 233716, 234109, 234844, 235962]
52995B35962J663K067J755Q51K53K50j2j009j750j207k6M20J23K19R90J567J553
52978B43669J575J957K111J643J117J110J382J457J385J443J617J756J831J716
52964B65769J140K31k96J09J080J615J056k36j185j022j22L59j20q68j022p38
52948B65750p96j364j892k048k033j997j801j456j221j205j257j240j056n99m1
52933B45744P4n10j262j559j502j481j342p61r4J0l43n29m89o66r80r24o01o38
52915B32147r98q72k4P98J022J024J298J601J382N53m73j126j015k86L79N41N61
52898B36512Q16Q55J76o00m28M69R22O54M57N22J09q37j221n24L72O93P97R96
52880B40740P38j52o90j94M29O0r05j358j140p46n5J249K440K365J185L06N53
$$ y = [235962, 237625, 239692, 241447, 242298, 242551, 242801, 242789, 241780, 240030, 238823, 238797, 239217, 239340, 239559, 240549, 242116, 243669, 245244, 247201, 249312, 250955, 252072, 253182, 254564, 256021, 257406, 258849, 260466, 262222, 264053, 265769, 266909, 267140, 266844, 266953, 268033, 269648, 270704, 270468, 269283, 268261, 268139, 268498, 268378, 267510, 266488, 265750, 264954, 263590, 261698, 259650, 257617, 255620, 253819, 252363, 251142, 249937, 248680, 247440, 246384, 245785, 245744, 245818, 245308, 244046, 242487, 240985, 239504, 238162, 237401, 237307, 237317, 236974, 236445, 235956, 235290, 234310, 233386, 232785, 232147, 231149, 230277, 230253, 231051, 232073, 233097, 234395, 235996, 237378, 237931, 237458, 236332, 235317, 235031, 235410, 235951, 236512, 237328, 238183, 238359, 237759, 237331, 237800, 238722, 239376, 239833, 240355, 240464, 239627, 238406, 237882, 238254, 238947, 239744, 240740, 241478, 241326, 240636, 240442, 240871, 240931, 240026, 238668, 237528, 236782, 236727, 237976, 240416, 242781, 243966, 244272, 244825]
52863B44825J351J843J823J429O97j83p47o90k35J53K40J42R3J19p1p16j597k276
52845B46200k670k970l131k944k686k934l593l763k908j526m10J66K25j79o69
52830B16208n91J89J039J408J314R02K58j52J90P66L81r71j830j486j080j545
52814B15000j893r12O28J182R85J530K890L568K967K220K195K279J646M90o71
52799B34104j834k991l619l329k452j467m31N80J021M80o19j389j351o41L71J235
52783B17668J457Q23k17p22p8J333K382K294J473R57J112J284Q21o3p15q92p85
52766B28132o15n90r13j474j782j615j320j182r11j93O84J211J280J025M42k87
52750B21892o18l57q1k35l67J11Q52J172J165J364J661J594J437J882K725K966
$$ y = [244825, 246176, 248019, 249842, 251271, 251968, 251785, 251038, 250348, 250113, 250266, 250506, 250648, 250741, 250860, 250789, 250073, 248476, 246200, 243530, 240560, 237429, 234485, 231799, 228865, 225272, 221509, 218601, 217075, 216665, 216831, 217056, 216877, 216208, 215617, 215806, 216845, 218253, 219567, 220469, 220727, 220575, 220765, 221531, 221912, 220941, 219111, 217625, 216545, 215000, 213107, 212195, 212823, 214005, 214990, 216520, 219410, 222978, 225945, 228165, 230360, 232639, 234285, 234775, 234104, 232270, 229279, 225660, 222331, 219879, 218412, 217981, 218561, 219582, 220062, 219443, 218054, 216703, 216062, 216433, 217668, 219125, 219948, 219731, 219009, 218931, 220264, 222646, 224940, 226413, 227370, 228482, 229766, 230587, 230524, 229809, 228917, 228132, 227517, 226927, 226014, 224540, 222758, 221143, 219823, 218641, 217730, 217537, 218221, 219432, 220712, 221737, 222179, 221892, 221274, 220917, 220836, 220601, 220234, 220345, 221197, 222369, 223534, 224898, 226559, 228153, 229590, 231472, 234197, 237163]
52734B37163K297J555J492J928K316K407K136J483O99K08J70M57R33J298R63k78
52718B57227j670k303k269k220k143j546o89m62j010j547j650j663j680j233l75
52703B34767N6k81o62n11k05j23J92J153K163K377J862J297R53O52L38N4l03o76
52685B43103o57p6O09R56J131J287R48k88j734k220j534n84j35r7n6J12M09Q61
52667B42035J281J249N88l41j078j533j854j991j663p52M33J384J782J679J381
52652B42600J321J839K797L444L050J811P13K62j64j266k567k980k376j722j608
52637B45154j499p71K29P15N73L17K36J71O0K02Q37J770K580L037L179L030K401
52620B62221J138n21j988k832l048k782k065j026p8M55P60J178J601J583R95J99
$$ y = [237163, 239460, 241015, 242507, 244435, 246751, 249158, 251294, 252777, 253476, 253684, 253854, 254311, 255244, 256542, 257505, 257227, 255557, 253254, 250985, 248765, 246622, 245076, 244387, 243925, 242915, 241368, 239718, 238055, 236375, 235142, 234767, 234823, 234542, 233880, 233369, 233164, 233041, 233233, 234386, 236549, 238926, 240788, 242085, 243038, 243690, 244028, 244082, 243779, 243103, 242446, 242370, 242979, 243935, 245066, 246353, 247301, 247013, 245279, 243059, 241525, 240941, 240806, 240709, 240653, 240765, 241174, 242035, 243316, 244565, 245153, 244812, 243734, 242201, 240347, 238356, 236693, 235941, 236374, 237758, 239540, 241219, 242600, 243921, 245760, 248557, 252001, 255051, 256862, 257575, 257837, 257673, 256407, 253840, 250860, 248484, 246762, 245154, 243655, 242884, 243113, 243828, 244401, 244718, 244954, 245125, 245185, 245387, 246224, 247994, 250574, 253611, 256790, 259820, 262221, 263359, 262838, 260850, 258018, 254970, 252188, 250123, 249097, 249019, 249474, 250234, 251412, 253013, 254596, 255591, 255790]
52604B55790l55m39o1M05K49q77k298k757j735QJ286J573J246R85J095J227Q31
52587B56173k6n75k91L94P15O21O12P83P54M13J03J9L6J89O61J219J245N31m57
52568B63119j179j414j135n21j86o35j425j551q45k25l33o70n33m0K19J29m6k24
52550B52505n30r38j317j564j487q99o4L56O9m43o19m74k90p7K52N01M86M25O38
52531B46530R67R30L19n45j163j218p21L7P20J104J029M24l68n96N2Q01P10Q1
52513B49093J28J160K100K175K111K897M192M807M389L661L135K446J078q17k599
52498B79956l795m432m733m674l948k543j115m42n57q40q90p91n43O1Q46J211
52482B52771J018Q22R65J085Q95P37Q56Q82O03N82J236J895J709J008Q38J436
$$ y = [255790, 255435, 254996, 254935, 255340, 255589, 254712, 252414, 249657, 247922, 247930, 249216, 250789, 252035, 253020, 254115, 255342, 256173, 256147, 255572, 255281, 255675, 256390, 257011, 257623, 258406, 259160, 259573, 259676, 259695, 259731, 259920, 260581, 261800, 263045, 263576, 263119, 261940, 260526, 259391, 258870, 258684, 258049, 256624, 255073, 254228, 254003, 253670, 253000, 252467, 252427, 252646, 252775, 252729, 252505, 251975, 251037, 249720, 248156, 246669, 245770, 245706, 246062, 246131, 245688, 245069, 244595, 244305, 244228, 244480, 244981, 245467, 245892, 246530, 247497, 248427, 248746, 248201, 247038, 245820, 245099, 245136, 245856, 246960, 247989, 248413, 248045, 247449, 247501, 248302, 249012, 249093, 249221, 250381, 252481, 254656, 256767, 259664, 263856, 268663, 273052, 276713, 279848, 282294, 283372, 282555, 279956, 276161, 271729, 266996, 262322, 258374, 255831, 254716, 254274, 253717, 252877, 251987, 251196, 250653, 250714, 251560, 252771, 253789, 254611, 255576, 256661, 257556, 258293, 259149, 260031, 260634, 261216, 262452, 264347, 266056, 267064, 267902, 269338]
52466B69338K081K322K380K349J938J240R19J333J947K020J415N12k94p75r36
52451B87789j104j688k609l232l116k645k562k978l184k568j440p02p63j162j356
52436B56680j406j587j629r80K17J094J064M91N7m2l7o7m1J39M27O25N46L33M71
52417B56355J167J889K008J726J742K130K360K420K960M076M966N254N705P016
52403C01774Q685R753R979R525Q120N388J593k547o366r022r543p991o018n199
52389C08131n222m675l212j859j311j198j081j003q45j25J102K052K276K310K730
52374B98070L218L124K574K410L188M564N723O085N671M875M032L198K388J676
52360C50796R68k2j290k192k042r86P5M32J77j77l56m23l42K52J593L120L735
$$ y = [269338, 271419, 273741, 276121, 278470, 280408, 281648, 282567, 283900, 285847, 287867, 289282, 289794, 289500, 288725, 287789, 286685, 284997, 282388, 279156, 276040, 273395, 270833, 267855, 264671, 262103, 260663, 259961, 259198, 258036, 256680, 255274, 253687, 252058, 251078, 251295, 252389, 253453, 253944, 254001, 253959, 253922, 253855, 253814, 253953, 254380, 255005, 255551, 255884, 256355, 257522, 259411, 261419, 263145, 264887, 267017, 269377, 271797, 274757, 278833, 283799, 289053, 294758, 301774, 310459, 320212, 330191, 339716, 347836, 353224, 354817, 352270, 345904, 336882, 327339, 319348, 313330, 308131, 302909, 298234, 295022, 293163, 291852, 290654, 289573, 288570, 287725, 287600, 288702, 290754, 293030, 295340, 298070, 301288, 304412, 306986, 309396, 312584, 317148, 322871, 328956, 334627, 339502, 343534, 346732, 349120, 350796, 351764, 351742, 350452, 348260, 346218, 345232, 345307, 345739, 345916, 345739, 345383, 344960, 344618, 344870, 346463, 349583, 353318]
52343C53318L128K370K604L434L624L172L474N108O787P236O964P219Q119Q957
52329D25514R614J0493J1517J2396J3547J5480J7602J8733J8767J8708J9094J9518
52317F10983J9712J9982K0319K0105J9058J7678J6529J5712J5228J5174J5383
52306H05863J5534J5640J5823J5687J4715J3252J2203J1684J0908R584Q460Q057
52294I57410P739O518M177J209j783m321o225p777r214j0057r611q200p019o567
52280I06279o108n023l788l055k522j369O93L302N908P980R230R959J0766J1697
52266I43949J2266J2451J2904J3854J4585J4517J4044J3800J3679J3279J2647
52255A091975J2038J1446J0967J1073J1867J2503J2049J0525Q511O121L166k6
$$ y = [353318, 356446, 358816, 361420, 364854, 368478, 371650, 375124, 380232, 387019, 394255, 401219, 408438, 416557, 425514, 435128, 445621, 457138, 469534, 483081, 498561, 516163, 534896, 553663, 572371, 591465, 610983, 630695, 650677, 670996, 691101, 710159, 727837, 744366, 760078, 775306, 790480, 805863, 821397, 837037, 852860, 868547, 883262, 896514, 908717, 920401, 931309, 940893, 949353, 957410, 965149, 971667, 975844, 977053, 975270, 970949, 964724, 956947, 947733, 937676, 928065, 919865, 912846, 906279, 900171, 895148, 891360, 888305, 885783, 884414, 885107, 888409, 894317, 902297, 911527, 921486, 932252, 943949, 956215, 968666, 981570, 995424, 1010009, 1024526, 1038570, 1052370, 1066049, 1079328, 1091975, 1104013, 1115459, 1126426, 1137499, 1149366, 1161869, 1173918, 1184443, 1192954, 1199075, 1202241, 1202215]
52243A202215k752m789o497q091r325r950j0052j0009j0271j0979j1669j1625
52231A096206j0761r694q809p757o334n112m635m547m167l494k862k066p24P74
52217A026018J602J703J821K365L066L777M711N816O625P038P500Q091Q185P396
52203A095714O318N715N434M761L613K766K897L812M794N402N695N963O322O584
52189A165790O392N518M185L064K690K837K691J727K62j157k578m488o873q998
52175A171062j0222j0609j0589j0379r945r193q007o370m615l306k639k259j753
52162A081176j082l21O11J758K926L896M530M597L855K542J361O72Q8q32j883
52147A103894k529k537j940q45L35Q45M12k37k00M47Q33L68p71k002k587j820
$$ y = [1202215, 1199463, 1194674, 1188177, 1180086, 1170761, 1160811, 1150759, 1140750, 1130479, 1119500, 1107831, 1096206, 1085445, 1075751, 1066942, 1059185, 1052851, 1047739, 1043104, 1038557, 1034390, 1030896, 1028034, 1025968, 1025244, 1026018, 1027620, 1029323, 1031144, 1033509, 1036575, 1040352, 1045063, 1050879, 1057504, 1064542, 1072042, 1080133, 1088318, 1095714, 1102032, 1107747, 1113181, 1117942, 1121555, 1124321, 1127218, 1131030, 1135824, 1141226, 1146921, 1152884, 1159206, 1165790, 1172182, 1177700, 1181885, 1184949, 1187639, 1190476, 1193167, 1194894, 1195156, 1193999, 1191421, 1186933, 1180060, 1171062, 1160840, 1150231, 1139642, 1129263, 1119318, 1110125, 1102118, 1095748, 1091133, 1087827, 1085188, 1082929, 1081176, 1080094, 1079773, 1080384, 1082142, 1085068, 1088964, 1093494, 1098091, 1101946, 1104488, 1105849, 1106521, 1106609, 1105777, 1103894, 1101365, 1098828, 1096888, 1096043, 1096378, 1097223, 1097635, 1097398, 1097198, 1097645, 1098478, 1098846, 1098075, 1096073, 1093486, 1091666]
52131A091666L30K878M752O030P709J0317J3368J6219J8729K0983K2904K4479
52119A240364K5948K7479K8900K9903L0303L0061K9320K8312K7032K5073K2255
52108A544950J9241J6911J5189J3126J0274P299M965L206J693O37M48Q14Q83J95
52094A639831r92k317l712n219o844q692j0937j3521j6086j8228j9650k0072j9279
$$ y = [1091666, 1091996, 1094874, 1099626, 1105656, 1113365, 1123682, 1137050, 1153269, 1171998, 1192981, 1215885, 1240364, 1266312, 1293791, 1322691, 1352594, 1382897, 1412958, 1442278, 1470590, 1497622, 1522695, 1544950, 1564191, 1581102, 1596291, 1609417, 1619691, 1626990, 1631955, 1635161, 1636854, 1637491, 1637939, 1638753, 1639636, 1639831, 1638839, 1636522, 1632810, 1627591, 1620747, 1612055, 1601118, 1587597, 1571511, 1553283, 1533633, 1513561, 1494282]
$$ [...]
##END NTUPLES=NMR SPECTRUM
##END=
