
##TITLE=AC1291_CRIAH12101_6615412_yoWf9zGV4d
##JCAMPDX= 6.0         $$ Bruker NMR JCAMP-DX V2.0
##DATA TYPE= NMR SPECTRUM
##DATA CLASS= NTUPLES
##ORIGIN= BRUKER
##OWNER= Administrator
$$ 1.72 TOPSPIN		Version 2.1
$$ 2012-08-02 20:23:46.031 -0500  Administrator@TOPSPIN
$$ Compression mode = diff/dup
##.OBSERVE FREQUENCY= 400.02188249412
##.OBSERVE NUCLEUS= ^1H
##.ACQUISITION MODE= SIMULTANEOUS (DQD)
##.ACQUISITION SCHEME= undefined
##.AVERAGES= 8
##.DIGITISER RES= 22
##SPECTROMETER/DATA SYSTEM= spect
##.PULSE SEQUENCE= zg30
##.SOLVENT NAME= COFFEE_meoh
##.SHIFT REFERENCE= INTERNAL, COFFEE_meoh, 1, 14.98509
##AUDIT TRAIL= $$ (NUMBER, WHEN, WHO, WHERE, PROCESS, VERSION, WHAT)
$$ ##TITLE= Audit trail, TOPSPIN		Version 2.1
$$ ##JCAMPDX= 5.01
$$ ##ORIGIN= Bruker BioSpin GmbH
$$ ##OWNER= Administrator
$$ $$ C:\Bruker\TOPSPIN/data/COFFEE/nmr/AC1291_CRIAH12101_6615412_yoWf9zGV4d/10/pdata/1/auditp.txt
$$ ##AUDIT TRAIL=  $$ (NUMBER, WHEN, WHO, WHERE, PROCESS, VERSION, WHAT)
(   1,<2012-08-02 20:23:39.156 -0500>,<Administrator>,<TOPSPIN>,<go>,<TOPSPIN 2.1>,
      <created by zg
	started at 2012-08-02 20:22:32.609 -0500,
	POWCHK enabled, PULCHK disabled,
       configuration hash MD5:
       6B 1B 68 BB D9 2E 58 E2 7F 35 AD 54 07 DF 0E 41
       data hash MD5: 64K
       89 6F 30 1B F8 64 CD F3 D7 18 AF CC C7 6F 07 3C>)
(   2,<2012-08-02 20:23:41.921 -0500>,<Administrator>,<TOPSPIN>,<proc1d>,<TOPSPIN 2.1>,
      <Start of raw data processing
       efp LB = 0 FT_mod = 6 PKNL = 1 PHC0 = 0 PHC1 = 0 SI = 32K 
       data hash MD5: 32K
       DD 9E 97 48 CD 75 28 24 F9 1D A9 9A F5 5B AD 29>)
(   3,<2012-08-02 20:23:42.328 -0500>,<Administrator>,<TOPSPIN>,<proc1d>,<TOPSPIN 2.1>,
      <pk PHC0 = 179.3408 PHC1 = 0 
       data hash MD5: 32K
       23 AE 3F B0 6C B8 14 0F CF 8A 81 2F 51 CF DC A5>)
(   4,<2012-08-02 20:23:42.421 -0500>,<Administrator>,<TOPSPIN>,<proc1d>,<TOPSPIN 2.1>,
      <abs ABSG = 1 
       data hash MD5: 32K
       3B DE 80 B0 E4 B2 97 78 E0 91 9C B0 83 C1 23 BB>)
(   5,<2012-08-02 20:23:42.468 -0500>,<Administrator>,<TOPSPIN>,<proc1d>,<TOPSPIN 2.1>,
      <abs ABSG = 2 
       data hash MD5: 32K
       E0 2C 24 87 2E 22 6F F4 4C BF 0F 60 9C B8 11 9D>)
(   6,<2012-08-02 20:23:42.500 -0500>,<Administrator>,<TOPSPIN>,<proc1d>,<TOPSPIN 2.1>,
      <abs ABSG = 3 
       data hash MD5: 32K
       55 03 F5 C0 37 A8 A6 EF 03 A4 FE 05 88 2A 44 F4>)
(   7,<2012-08-02 20:23:42.531 -0500>,<Administrator>,<TOPSPIN>,<proc1d>,<TOPSPIN 2.1>,
      <abs ABSG = 4 
       data hash MD5: 32K
       B3 01 86 1B 14 EF 2B A2 11 E2 C9 60 3E 37 C0 29>)
(   8,<2012-08-02 20:23:42.562 -0500>,<Administrator>,<TOPSPIN>,<proc1d>,<TOPSPIN 2.1>,
      <abs ABSG = 5 
       data hash MD5: 32K
       2A E4 AA 29 27 A2 B4 38 E5 39 C7 EB 53 3F 0F 2D>)
$$ ##END=
$$ 
$$ $$ hash MD5
$$ $$ 4B 90 19 7D 79 67 E0 31 E1 CC 45 A4 36 D9 3A E4
##$RELAX= 
##$RELAX= 
##$RELAX= 
##$RELAX= 
##$RELAX= 
##$RELAX= 
##$RELAX= 
$$ Bruker specific parameters
$$ --------------------------
$$ [...]
##$TP= (0..7)
150 150 150 150 150 150 150 150
##$TP07= 0
##$TPNAME0= <>
##$TPNAME1= <>
##$TPNAME2= <>
##$TPNAME3= <>
##$TPNAME4= <>
##$TPNAME5= <>
##$TPNAME6= <>
##$TPNAME7= <>
##$TPOAL= (0..7)
0.5 0.5 0.5 0.5 0.5 0.5 0.5 0.5
##$TPOFFS= (0..7)
0 0 0 0 0 0 0 0
##$TUNHIN= 0
##$TUNHOUT= 0
##$TUNXOUT= 0
##$USERA1= <user>
##$USERA2= <user>
##$USERA3= <user>
##$USERA4= <user>
##$USERA5= <user>
##$V9= 5
##$VALIST= <valist>
##$VCLIST= <CCCCCCCCCCCCCCC>
##$VD= 0
##$VDLIST= <DDDDDDDDDDDDDDD>
##$VPLIST= <PPPPPPPPPPPPPPP>
##$VTLIST= <TTTTTTTTTTTTTTT>
##$WBST= 1024
##$WBSW= 4
##$XGAIN= (0..3)
0 0 0 0
##$XL= 0
##$YL= 0
##$YMAX_a= 487566
##$YMIN_a= -635739
##$ZGOPTNS= <>
##$ZL1= 120
##$ZL2= 120
##$ZL3= 120
##$ZL4= 120
##$ABSF1= 14.98509
##$ABSF2= -5.573092
##$ABSG= 5
##$ABSL= 3
##$ALPHA= 0
##$AQORDER= 0
##$ASSFAC= 0
##$ASSFACI= 0
##$ASSFACX= 0
##$ASSWID= 0
##$AUNMP= <proc_prof1d_extract_pilot.lims>
##$AXLEFT= 0
##$AXNAME= <>
##$AXNUC= <1H>
##$AXRIGHT= 0
##$AXTYPE= 0
##$AXUNIT= <>
##$AZFE= 0.1
##$AZFW= 0.1
##$BCFW= 0
##$BC_mod= 0
##$BYTORDP= 0
##$COROFFS= 0
##$CY= 15
##$DATMOD= 1
##$DC= 0
##$DFILT= <>
##$DTYPP= 0
##$F1P= 0
##$F2P= 0
##$FCOR= 0.5
##$FTSIZE= 32768
##$FT_mod= 6
##$GAMMA= 0
##$GB= 0
##$INTBC= 1
##$INTSCL= 1
##$ISEN= 128
##$LB= 0
##$LEV0= 0
##$LPBIN= 0
##$MAXI= 10000
##$MC2= 0
##$MEAN= 0
##$ME_mod= 0
##$MI= 0
##$NCOEF= 0
##$NC_proc= -8
##$NLEV= 6
##$NOISF1= 0
##$NOISF2= 0
##$NSP= 0
##$NTH_PI= 0
##$NZP= 0
##$OFFSET= 14.98509
##$PC= 1
##$PHC0= 179.3408
##$PHC1= 0
##$PH_mod= 1
##$PKNL= yes
##$PPARMOD= 0
##$PPDIAG= 0
##$PPIPTYP= 0
##$PPMPNUM= 2147483647
##$PPRESOL= 1
##$PSCAL= 4
##$PSIGN= 0
##$PYNMP= <proc.py>
##$REVERSE= no
##$SF= 400.02
##$SI= 32768
##$SIGF1= 0
##$SIGF2= 0
##$SINO= 400
##$SIOLD= 32768
##$SPECTYP= <>
##$SREGLST= <1H.CDCl3>
##$SSB= 0
##$STSI= 32768
##$STSR= 0
##$SW_p= 8223.68421052631
##$SYMM= 0
##$S_DEV= 0
##$TDeff= 65536
##$TDoff= 0
##$TI= <>
##$TILT= no
##$TM1= 0
##$TM2= 0
##$TOPLEV= 0
##$USERP1= <user>
##$USERP2= <user>
##$USERP3= <user>
##$USERP4= <user>
##$USERP5= <user>
##$WDW= 1
##$XDIM= 32768
##$YMAX_p= 462337165
##$YMIN_p= -845259
##$CURPLOT= <Network HP LaserJet P1505>
##$CURPRIN= <$Network HP LaserJet P1505>
##$DFORMAT= <normdp>
##$LAYOUT= <+/1D_H.xwp>
##$LFORMAT= <normlp>
##$PFORMAT= <normpl>
##$SURQMSG= 1
$$ End of Bruker specific parameters
$$ ---------------------------------
##NTUPLES= NMR SPECTRUM
##VAR_NAME=  FREQUENCY,     SPECTRUM/REAL,   SPECTRUM/IMAG
##SYMBOL=    X,             R,               I
##VAR_TYPE=  INDEPENDENT,   DEPENDENT,       DEPENDENT
##VAR_FORM=  AFFN,          ASDF,            ASDF
##VAR_DIM=   32768,         32768,           32768
##UNITS=     HZ,            ARBITRARY UNITS, ARBITRARY UNITS
##FACTOR=    0.250966925370066, 1,           1
##FIRST=     8223.43324360094, -89604,       -123611
##LAST=      0,             30547,           26275
##MIN=       0,             -845259,         0
##MAX=       8223.43324360094, 462337165,    0
$$ Real data points
##PAGE= N=1
##DATA TABLE= (X++(R..R)), XYDATA
$$ [...]
19470F841a50507k9276h0186l7324M2422m47164c5411C2395h3302r6491k23213
19459d03006d3477m92651B21947F5202K1831C1077P7369g7015l36879E2680a89393
19447a78173f7269m5203j65237J30273A55023p508d2019B17387a64011L598j4823
19436a75236A99695J73219A39141d249j57612e40n0728B48564b04285A90697b56275
19424G5410B0418d2785j0202l12725i1972m0561L464A28724d9995n7648d3820
19412a8074n6941b227k13354f0006l60669a6615j44166E533c2696A1873a58316
19400F6573b56518r2055A2227f2945k36399a44620G1010b56278a08098E1148a46128
19388A04616b76054d7139m0069B32679g0236B79482b01256B2841i00I2778b30720
$$ plain form
19470 6841 -150507 -179783 -80186 -117510 -75088 -522252 -35411 32395 -83302 -179793 -403006
19459 -403006 -43477 -536128 221947 65202 87033 31077 108446 -77015 -413894 52680 -189393
19447 -178173 -67269 -112472 -277709 -147436 155023 147515 -42019 217387 -164011 -160413 -175236
19436 -175236 199695 372914 139141 -4249 -161861 -540 -51268 248564 -204285 190697 -256275
19424 75410 20418 -42785 -52987 -365712 -91972 -132533 -129069 128724 -49995 -107643 -43820
19412 -18074 -75015 -2227 -215581 -60006 -420675 -16615 -160781 5533 -32696 11873 -158316
19400 66573 -256518 -348573 12227 -62945 -299344 -144620 71010 -256278 -108098 51148 -146128
19388 104616 -276054 -47139 -87208 232679 -70236 279482 -201256 22841 -900 92778 -230720
19376a34851q7636D9225J05878b319l92551g7386m06802C34906D2558a07276j86829
19365b94105H7232n962c46626Q3114A43348l5904g3825A3536j902c3430k67219
19354c00649g4194A49183a47958a1197A49973b3751k66326a27125N4555a2397
19343a36197f6201a9480j20650k72060A20625a88888i732E143a42883O4559A6359
19331c95248d7508l0818a0028j60296A84305a74245A42298c85393B09598k7348
19321A82250c59906d7863k0649l39451a76156P225G4239J86271b21197h7748q7526
19310a75274e3467F9553b36691I1026L9218F0210a02079J5443m5124k4768K5020
19299a31508r6960O3961A04047f2724j30476G9263a57458e3742l3134G6243b4898
$$ plain form
19376 -134851 -222487 49225 155103 -2319 -394870 -77386 -484188 334906 42558 -107276 -294105
19365 -294105 87232 81270 -346626 -263512 143348 107444 -73825 13536 11634 -33430 -300649
19354 -300649 -74194 149183 -147958 -11197 149973 -23751 -290077 -127125 -72570 -12397
19343 -136197 -66201 -19480 -140130 -412190 120625 -188888 -9732 5143 -142883 -78324 16359
19331 -395248 -47508 -78326 -10028 -170324 184305 -174245 142298 -385393 209598 182250
19321 182250 -359906 -47863 -68512 -407963 -176156 -168931 74239 260510 -221197 -87748 -175274
19310 -175274 -53467 69553 -236691 91026 130244 60210 -102079 -86636 -131760 -156528 -131508
19299 -131508 -228468 -164507 104047 -62724 -193200 79263 -157458 -53742 -86876 76243 -24898
19287B02200a92785P1943I2817e1675k7086A8555a21214j10060L0792B32978e9153
19275b85005J39719N6994B51017g5479k1593B45796D5984h3426q3126p6415d0742
19263a76136C0417b24491B42434i6741A09325D4685a72034d0922C21560c2300
19252a66186O4891j62559j0713i7445j33369G1309d4565D1926f6459A17189P750
19241A24939b0732I4287a69078B4060a40661E7640a76184P9143k86755g0516n8841
19230a29357L5802j76791d83j33814D1313i2300p5503a5506o082G4876d5753j66369
19218b12122d0840k41565a14879j8548o5564j33100A1408e5707j2995E4696a80092
19206b01558j87472J65559n1491J33007n4457d9187k40393F0515J34431b91505
$$ plain form
19287 202200 -192785 -120842 92817 -51675 -78761 18555 -121214 -231274 -200482 232978 -59153
19275 -285005 -145286 -88292 251017 -75479 -97072 245796 45984 -83426 -166552 -242967 -40742
19263 -176136 30417 -224491 242434 -96741 109325 44685 -172034 -40922 321560 -32300
19252 -166186 -101295 -263854 -274567 -97445 -230814 71309 -44565 41926 -66459 117189 124939
19241 124939 -20732 94287 -169078 24060 -140661 57640 -176184 -97041 -383796 -70516 -129357
19230 -129357 -93555 -270346 -483 -134297 41313 -92300 -167803 -15506 -21588 74876 -45753 -212122
19218 -212122 -40840 -282405 -114879 -133427 -198991 -332091 11408 -55707 -68702 54696 -180092
19206 -201558 -389030 -223471 -274962 -141955 -196412 -49187 -289580 60515 194946 -291505
19195e18390J57431j6229a5652A13851A1599J83383I3873c0705n8147E0201i3332
19183e7218A55161J46677J43153i7046F8799J5257l7642L2541b4594A44647C3792
19171D5596c53639a49319E580L2888h7071A65413K46383a85811B64984K0300A4445
19159A50118c80040e0529j18653d7729A47835b0939H1717a56929A6996Q1698a50743
19147d4426j04953j71721H1486h9020k4819L9900j3813F0653L3832b30408G5825
19135g810k09760o5234F6161M1397E1063a42735D8343a14909d2858B9136a14200
19123a08031E0556M0235A857K4783b50880A35202n6956M4261b46713l9853a12040
19111b68747O0913c3150j54661k3840E3538R9961b53935A80277a03818k07789
$$ plain form
19195 -518390 -360959 -377188 -15652 113851 11599 194982 93873 -30705 -88852 50201 -93332
19183 -57218 155161 301838 444991 -97046 68799 84056 46414 78955 -24594 144647 33792
19171 45596 -353639 -149319 5580 38468 -87071 165413 411796 -185811 264984 285284 14445
19159 150118 -380040 -50529 -169182 -47729 147835 -20939 81717 -156929 16996 98694 -150743
19147 -44426 -149379 -321100 81486 -89020 -113839 -73939 -87752 60653 94485 -230408 75825
19135 -7810 -217570 -282804 66161 107558 51063 -142735 48343 -114909 -42858 29136 -114200
19123 -108031 50556 90791 1857 26640 -250880 135202 78246 122507 -246713 -286566 -112040
19111 -268747 -207834 -33150 -187811 -211651 53538 153499 -253935 180277 -103818 -311607
19101c11607c4533F5116a92323D22K63839a50784g4768c1987p6583A09039a7483
19089b8705k9568H3045d51998D7448K26309o5507a55196D2440i9555l0391D9751
19077b76792C09570a64039B59950b79984e3566p3023A34172a2644o645m5461I2145
19065b16096k8551R5965A40784i4858D35960b43696B65594a22081B1357M21644
19055D43001A16576c58607B6528a96028L0590j11317j4022B52887a72740a9317
19044a5552F0624b14815A85676a26179j9850j32478R5517F00515i3559A21471
19033B15249F295a57519A4870L82413A59604J68208a77438A5081L24105b05823
19022B38637k9574H493b04356b7532j83832K4324B46170c00334A81760b0094B40614
$$ plain form
19101 -311607 -34533 65116 -192323 422 264261 -150784 -74768 -31987 -108570 109039 -17483
19089 -28705 -58273 83045 -451998 47448 273757 208250 -155196 42440 -99555 -129946 49751
19077 -276792 309570 -164039 259950 -279984 -53566 -126589 134172 -12644 -19289 -64750 92145
19065 -216096 -244647 -148682 140784 -94858 435960 -243696 265594 -122081 21357 443001
19055 443001 116576 -358607 26528 -196028 -165438 -276755 -290777 252887 -172740 -19317
19044 -15552 60624 -214815 185676 -126179 -146029 -278507 -182990 600515 -93559 121471
19033 215249 6295 -157519 14870 397283 159604 327812 -177438 15081 339186 -205823
19022 238637 209063 8493 -204356 -27532 -211364 -187040 246170 -300334 181760 -20094 240614
19010A5645h1620o6139A69362J99127A4586J3917a07953F0886J84322r8071m3655
18999A03482a38734k34559A45535a52654N9584L3059b2741C3843a06515d0469
18988c76391J66855B1852a88037A02546D6789b49893B09224C1308b58054E7155
18977f0084B99650e7E3399J92359c45756I3113m5193O31863A28091a32277G8610
18965c19695J13247b5007l00622J17223L3993k22288g6167B12087a73729q6101
18955b59830E0663a67804A52451K75153h6146j09016j77197g7886A63354l7171
18945A26183a04868E2269a08878i721j94841b2019m5098I8376a06925q6008m8944
18934b41877i0065k04776C5638j4597J96205B8929d24284I9525M8417K16214a0249
$$ plain form
19010 15645 -81620 -147759 169362 368489 14586 28503 -107953 60886 245208 147137 103482
18999 103482 -138734 -373293 145535 -152654 -93070 -60011 -22741 33843 -106515 -40469
18988 -376391 -209536 21852 -188037 102546 46789 -249893 209224 31308 -258054 57155
18977 -60084 299650 -57 53399 245758 -345756 93113 47920 679783 128091 -132277 78610
18965 -319695 -206448 -25007 -325629 -208406 -174413 -396701 -76167 212087 -173729 -259830
18955 -259830 50663 -167804 152451 427604 -86146 -195162 -372359 -77886 163354 126183
18945 126183 -104868 52269 -108878 -9721 -204562 -22019 -67117 98376 -106925 -192933 -241877
18934 -241877 -90065 -294841 35638 21041 217246 28929 -424284 99525 147942 364156 -10249
18922C07810j01511I4379l8235J779a91268A51327a55205H0396a80709G3866M8629
18911A22495c1991H3100O256N36411k72874L35011k83273a37434A2521M41232
18901D53753B11525k1896a2477k18637K0147k08071j1164g7838J1351a1957j09622
18890a21579k39114C6778M6632O1614b24026B39868B5969a28548L753j49711A87389
18878A86220F1066b31195Q0260A21443a76727m15091g8250L3813A99423f4640
18867b01890R9540j02627b3286j72716a4505F7448Q076e9053m9546A95608m00
18856A95208a601p5315k39781i4938G3623a35901B06033b07768C9590a19427l9326
18845a58753A18060d1749k53943A53571M3797P160G3622M6172l3047d42371h0366
$$ plain form
18922 307810 206299 94379 56144 57923 -191268 151327 -155205 80396 -180709 73866 122495
18911 122495 -31991 83100 89356 625767 352893 687904 404631 -137434 12521 453753
18901 453753 211525 189629 -12477 -231114 -210967 -419038 -430202 -77838 -66487 -11957 -121579
18890 -121579 -360693 36778 83410 145024 -224026 239868 25969 -128548 -124795 -274506 187389
18878 186220 61066 -231195 -150935 121443 -176727 -591818 -78250 -44437 199423 -64640
18867 -201890 -102350 -204977 -23286 -196002 -14505 67448 75524 -59053 -108599 195608 195208
18856 195208 -1601 -76916 -316697 -94938 73623 -135901 206033 -207768 39590 -119427 -158753
18845 -158753 118060 -41749 -295692 153571 197368 204528 73622 119794 86747 -442371 -80366
18833h6602G1635c36841a44130H8510a11975j51602i0708A13207e6870a9846C2280
18821B9349j1059a10908L2819o0686b2870n3189B99382A40245o7733b4904A26110
18809a53122O2472A53813n3450K37335D3815c38014L0067e2193j59019Q9088J9487
18798a02637I1898j414D0214b92166C9386g6246o2870m5273L8602j1558p066j1531
18786a75942E3a05482B34623a50465F8826b11249r7150J43079A9461K16296b25508
18774f560k63481b5931k7615G4859k9035c22981A20414B8851a32537A23201f0451
18762A2746a74392A54828e40222B78307A13727c06076B3432K8422K1337e4814
18751a47899b0867C1948i3778j39855B4478a4903n8655A62310a35564L1500l18628
$$ plain form
18833 -86602 71635 -336841 -144130 88510 -111975 -263577 -90708 113207 -56870 -19846 32280
18821 29349 18290 -110908 -78089 -138775 -22870 -76059 299382 140245 72512 -24904 126110
18809 -153122 -90650 153813 100363 337698 43815 -338014 -307947 -52193 -211212 -122124 -102637
18798 -102637 91898 90484 40214 -292166 39386 -76246 -139116 -184389 -145787 -157345 -164411 -175942
18786 -175942 53 -105482 234623 -150465 68826 -211249 -308399 -165320 19461 235757 -225508
18774 -6560 -270041 -25931 -53546 74859 45824 -322981 120414 28851 -132537 123201 -60451
18762 12746 -174392 154828 -540222 278307 113727 -306076 23432 51854 73191 -54814
18751 -147899 -20867 31948 -93778 -233633 24478 -14903 -73558 162310 -135564 -104064 -422692
18740d22692A32241b00914Q6546D9077b64297a7533r6551j33519d2688F4434b01927
18728B37100A15149M7438b16850D9968a04114K9376B32015h1303A68258a12960
18717B93248G5185g3702j47906B00136a14141H681J28558b18322k10065B62304
18706a05943j95895f2315j85912P0425C9933K6943i3401n6537l40663A61645b20278
18694C0832e3268k1681l09496A66420J0807d6836l11338H2177J41406d3142j6389
18683e9531q0625K4843m5126b7885l7002A88202o7919a96072C53452b35061c8624
18671a86229A91K8284a85921A19520b72968h0036J939j06578E16M9667c7040E9288
18658e7892B7950a6319B21574C6291b06907e3397K0827l1903k23551a01789A52293
$$ plain form
18740 -422692 132241 -200914 -114368 49077 -264297 -17533 -114084 -247603 -42688 64434 -201927
18728 237100 115149 162587 -216850 49968 -104114 -74738 232015 -81303 168258 -112960
18717 293248 75185 -73702 -221608 200136 -114141 8681 137239 -218322 -428387 262304
18706 -105943 -301838 -62315 -248227 -177802 39933 66876 -93401 -149938 -490601 161645 -220278
18694 30832 -53268 -74949 -384445 166420 177227 -46836 -358174 82177 223583 -43142 -59531
18683 -59531 -140156 -115313 -160439 -27885 -64887 188202 120283 -196072 353452 -235061 -38624
18671 -186229 191 28475 -185921 119520 -272968 -80036 -78097 -184675 516 50183 -37040 59288
18658 -57892 27950 -16319 221574 36291 -206907 -53397 -32570 -64473 -288024 -101789 152293
18646a36394m5072H7917J4364L9937m0955a3668j29359C20465b0928B43303K63915
18635E07218a92522j39773C3336a19247M5668a636k35144A44072a46377k9594
18625a75971q7040G1453e67742b81158G2561b10532m9736h3852A67186C6213b64598
18613c94623A68418g9798m2157C5555i2331q0587O2100k57068H5468P3890b55418
18601A3804b16955B0670b68910a27592E6543e4402j47932n9580g1731E3817L3718
18590H7535D215b10051J2255Q9815C1012K8061a18197b0102A09775g7722k07072
18579b84794D23770A7673M3471b74758i3657j19726H6757b432k48900A81350f5716
18567b43485A2618O3490e7578A43147a22800j85462A53193b24m37251a62415H108
$$ plain form
18646 -136394 -181466 87917 102281 142218 101263 -13668 -143027 320465 -20928 243303 507218
18635 507218 -192522 -332295 33336 -119247 -73579 -1636 -236780 144072 -146377 -175971
18625 -175971 -263011 71453 -567742 -281158 72561 -210532 -260268 -83852 167186 36213 -264598
18613 -394623 168418 -79798 -121955 35555 -92331 -172918 -110818 -367886 85468 159358 -255418
18601 13804 -216955 20670 -268910 -127592 56543 -54402 -202334 -261914 -71731 53817 87535
18590 87535 4215 -210051 -197796 -107981 31012 59073 -118197 -20102 109775 -77722 -284794
18579 -284794 423770 17673 61144 -274758 -93657 -213383 86757 -2432 -251332 181350 -65716
18567 -243485 12618 76108 -57578 143147 -122800 -308262 153193 -224 -437475 -162415 8108
18555a50114A8467M05388g1251B21760D780a69065C535d3811B97407b4159q1331
18544a05490A11417f1623p7854H1937b5457k26849k055O0877Q8413L7328k53450
18533c21193E1908J08535E3528g4169k5286C9830b12928h6995o0642A0220J04440
18522A14660j4033a66281J3877B89952I8403f630p8431H499g4318l86711J35566
18511c25463J32575i2692l7731B10121b50226k4360A470b85743F7282d0563C30787
18499G8682b37216C9523a16481q1640g5391j1972j5798a7062D6694J02201b02858
18487G2681e0208q4976j80493A07558N3686m9743b40269A0415a30967A84470P210
18476A91680e4080N080j44391g0022A36630a5922C3051L6972a46479G7565j6231
$$ plain form
18555 -150114 18467 423855 -71251 221760 4780 -169065 3535 -43811 297407 -24159 -105490
18544 -105490 111417 -61623 -139477 81937 -25457 -252306 -254361 -193484 -105071 -67743 -321193
18533 -321193 51908 160443 53528 -74169 -99455 39830 -212928 -86995 -147637 10220 114660
18522 114660 100627 -166281 -152404 289952 98403 -6630 -85061 8499 -74318 -461029 -325463
18511 -325463 -192888 -92692 -130423 210121 -250226 -274586 1470 -285743 67282 -40563 330787
18499 78682 -237216 39523 -116481 -198121 -75391 -87363 -103161 -17062 46694 148895 -202858
18487 72681 -50208 -135184 -315677 107558 161244 111501 -240269 10415 -130967 184470 191680
18476 191680 -54080 -49000 -193391 -70022 136630 -15922 33051 70023 -146479 77565 61334
18465F1334j3103d1741a5168l0555P55H1581a85261B520b06763B08726k3510a14712
18452d2657D3652a06511l5440l37163a63455N4798o0804B28860F7193M7195a1150
18440b70027B78115p9998G146a45792A08636J10330p2271b39465k56735a32993
18429d1996l12360g8687k1673j09677m1984A19199b5796k85851J54246k05611
18419c63012A47528a31869d1497l4941A34026e5990C0087Q6132K1311b74590b8897
18407e0089J3133j67167J3923h9054J0432J7056A66045c2664C78270b17046B0804
18395A46826K3205b5915a303B3616L28352f0102b5922A68637q2384b69342j20693
18384c90035F0820B1064i5907B29708C535a7271A2790e5790j7840i053B5755J05097
$$ plain form
18465 61334 48231 -41741 -15168 -45723 -44968 81581 -185261 2520 -206763 208726 185216 -114712
18452 -42657 43652 -106511 -141951 -479114 -163455 -108657 -169461 228860 67193 114388 -11150
18440 -270027 278115 198117 7146 -145792 108636 218966 146695 -239465 -496200 -132993
18429 -41996 -354356 -78687 -100360 -210037 -252021 119199 -25796 -311647 -157401 -363012
18419 -363012 147528 -131869 -41497 -76438 134026 -55990 30087 116219 137530 -274590 -28897
18407 -50089 -36956 -204123 -190200 -89054 -78622 -61566 166045 -32664 378270 -217046 20804
18395 146826 170031 -25915 -1303 23616 351968 -60102 -25922 168637 86253 -269342 -390035
18384 -390035 60820 21064 -95907 229708 3535 -17271 12790 -55790 -73630 -9053 25755 130852
18372A30852a79050D0467b6028j57672C4373c06888E3311L6057J22696d87403
18361a86214c8038A12896k8261k5254O8170E6514K35535b86231a05411A15413
18350b69837b630r0368c1682B81524F0996Q8915c40354A25958b94056a7751B68389
18338B19101b10671A79886E8772b15832k55485a53651B6023b2593j31163o894
18328a60650H4176B1289b36371B2210K43359J63182b32171A08096j5102J55697
18318B48691a2251D5833a64576A21250e0932H922P4061C5976r485J65620N7948
18307B50059A0265h7929b3812j7691C50291H0337K4528d9347e804m6025j20203
18296a72032e6203B16660F9345a0578G0013M03d37224a97167K7556B580K7380
$$ plain form
18372 130852 -179050 40467 -26028 -183700 34373 -306888 53311 89368 212064 -487403
18361 -186214 -38038 112896 84635 59381 127551 56514 292049 -286231 -105411 115413
18350 -269837 -2630 -92998 -31682 281524 60996 149911 -340354 125958 -294056 -17751 268389
18338 219101 -210671 179886 58772 -215832 -471317 -153651 26023 -22593 -153756 -160650
18328 -160650 84176 21289 -236371 22210 265569 428751 -232171 108096 92994 248691
18318 248691 -12251 45833 -164576 121250 -50932 8922 82983 35976 26491 192111 250059
18307 250059 10265 -87929 -23812 -41503 350291 80337 104865 -49347 -5804 -51829 -172032
18296 -172032 -56203 216660 69345 -10578 70013 70416 -437224 -197167 -169611 2580 29960
18285B9960a33140A04868a1021A0574d9593j11609B29958C6595b44495B06775
18274a49390A65434a78075G2125g5248N940o0030A55952c57412a13448A26167
18263h4560q0576g8655G601N6988F106a24696K061A65257C8098J9390a26603J3528
18251a13075N6012a5654E7608Q5643k5823c05508A66940b4347A13043C5932L2424
18240F8356f8434B42197b38608h5960k06151A80042a26455f385k53966n8120J59190
18229a59281D4679f803C10832A07764C4252J15787m8318i2151r6546c6642A34462
18217b64538B3415Q1318a14101D5258k2437g051A01843J0620J62495b16790e7782
18205b9769A09199J10369a96639p5730L1309D2014A1772Q6481B3259a5143F6063
$$ plain form
18285 29960 -133140 104868 -11021 10574 -49593 -161202 229958 36595 -244495 206775
18274 -149390 165434 -178075 72125 -75248 -69308 -129338 155952 -357412 -113448 126167
18263 -84560 -165136 -78655 7601 64589 6106 -124696 -122635 165257 38098 57488 -126603 -113075
18251 -113075 -57063 -15654 57608 143251 117428 -305508 166940 -24347 113043 35932 68356
18240 68356 -68434 242197 -238608 -85960 -292111 180042 -126455 -6385 -260351 -318471 -159281
18229 -159281 44679 -6803 310832 107764 34252 150039 101721 -92151 -188697 -36642 134462
18217 -264538 23415 104733 -114101 45258 22821 -7051 101843 112463 274958 -216790 -57782
18205 -29769 109199 219568 -196639 -272369 -241060 42014 11772 98253 23259 -15143 66063
18193b6509n3119m4782l63819A17207J04476a75886L3321i695A86288A2512a39044
18181a85804O8297A34373F2979a84343a3374l90B15082b49342o948B1388b04175
18169A51818B6205f3563k11743B40696F352a33848A60125l6318J14742b00432
18158a34488K0480r5560C7237b40624g9529G8897Q3900d43617d8336n868a0733
18146a58319g1432A80218E0981a77415g4287e633C06243j23741b3150A12918A2389
18134I8323e7058B12856g644l36833G0303Q5166p6363N749g837n8369H51g5720
18121i46E01f8664n702B67602i8199k05710g9239a1949F060a82154j51181B11167
18108i009j7313A28653b0308k47192R3192k3632m6271h7094k34324C040b09193
$$ plain form
18193 -26509 -79628 -124410 -488229 117207 221683 -175886 -142565 -9695 186288 12512 -139044
18181 -185804 -117507 134373 62979 -184343 -13374 -13764 215082 -249342 -256290 21388 -204175
18169 151818 26205 -63563 -275306 240696 6352 -133848 160125 123807 238549 -200432
18158 -134488 -114008 -209568 37237 -240624 -79529 78897 162797 -443617 -48336 -54204 -10733
18146 -158319 -71432 180218 50981 -177415 -74287 -5633 306243 182502 -23150 112918 12389
18134 98323 -57058 212856 -7644 -344477 70303 155469 79106 84855 -7837 -66206 851 -75720
18121 -946 501 -68664 -74366 267602 -98199 -303909 -79239 -11949 6060 -182154 -333335 211167
18108 -9009 -26322 128653 -20308 -267500 -174308 -197940 -244211 -87094 -321418 3040 -209193
18096a29313B8054b4861B38162I457L99402b04577A72574K22164A26680a44095
18085A60635i1509K3030A59498k8970c8741B5366L7287J00230j8484E7969L6917
18074I4886i2751j29123j04883R9028d0235l39050b122D2100J5250c89071F534
18062A30775f4920L184j12565C89511A21336m7079h9203B43834j00606Q6144J21597
18051C50969D5896M6465j997K37236b03733e6412C3648d0519A717b68404a00682
18039b41321L7899H4287K95840g5413A18899d4569q3507c9226C6741F749K78109
18028B84858F4627a80352l173k324A65167a18009L4026B9378K04663c30424B0467
18016E541K18005o7153g3593A78441G2801a17127q3640k9022B41188e9495B29907
$$ plain form
18096 -129313 28054 -24861 238162 9457 408859 -204577 172574 394738 126680 -144095
18085 160635 -91509 -68479 159498 130528 -38741 25366 62653 162883 144399 57969 94886
18074 94886 -92751 -221874 -326757 -227729 -40235 -379285 -2122 42100 57350 -389071 6534
18062 130775 -64920 -61736 -174301 389511 121336 74257 -89203 243834 143228 229372 350969
18051 350969 45896 92361 90364 327600 -203733 -56412 33648 -40519 1717 -268404 -100682
18039 -241321 -203422 84287 380127 -75413 118899 -44569 -128076 -39226 36741 6749 284858
18028 284858 64627 -180352 -183525 -185849 165167 -118009 -83983 29378 234041 -330424 20467
18016 5541 223546 156393 -73593 178441 72801 -117127 -200767 -229789 241188 -59495 229907
18004d8396B77331j27826k1666n4717b61145N7176A04996a39717f3204A21872
17993a55391a2326B21493J41008A61308G3416a24457G777c09285n5665F2106J13411
17982A75517c16450H3350f7365C9177J5102J81975o2158C66c4179A75130J17225
17971B92355a03553j3571d760l00751h9302l676A12440p606h2865m2266K9464
17960i5667C85262C9545h1066j38455h7109C59167d7491k6125k2533M2376B61072
17948C7505a24544N2713B02593a17041A38742J48261a37141F6660L43078c49103
17937c12759i217G7001b360A4838b64097J7310E965R7971h1105B15496F4631P0053
17925A34684A2384J64297D4225b26927A86452a43007H0423J05624J5524Q187J73280
$$ plain form
18004 -48396 277331 149505 127839 73122 -261145 -203969 104996 -139717 -63204 121872
17993 -155391 -12326 221493 362501 161308 73416 -124457 7777 -309285 -364950 62106 175517
17982 175517 -316450 83350 -67365 39177 54279 236254 174096 366 -34179 175130 292355
17971 292355 -103553 -117124 -4760 -305511 -89302 -92978 112440 104834 -82865 -125131 -95667
17960 -95667 385262 39545 -81066 -219521 -87109 359167 -47491 -73616 -96149 -53773 261072
17948 37505 -124544 -71831 202593 -117041 138742 287003 -137141 66660 409738 -349103
17937 -312759 -9217 77001 -2360 14838 -264097 -246787 5965 103936 -81105 215496 64631 134684
17925 134684 12384 176681 44225 -226927 186452 -143007 80423 186047 201571 209758 383038
17914C83038f616A4560h4693B33335j15129L3343m7714e3484B58429n3334d0218
17902D8676K8161b54129B40974b44128A31461b2320A8537J04444a43888J893A44395
17890G4454b58269a17014A14012d8406C3623L23215A42191g7290l13624a30051
17879a66359A57415b299k1709A10760n2184K05369A01134c58280a41018C7857
17868A7420g2445B06040l0124a14491B6500J69509d008p9492p9301I9794K34266
17857C34060A08530a90221D5449L08547A0270K98043a8165K589A18671A3321L677
17846A6998g2281C14808b72483F1307K43092H0169J63795c6917j48357C23230
17835A37949a15126G6566b15407L4090E8046g044F2481a26682A26170a35538C70919
$$ plain form
17914 383038 -6616 14560 -84693 233335 118206 151549 103835 -53484 258429 205095 -40218
17902 48676 76837 -254129 240974 -244128 131461 -22320 18537 122981 -143888 -141995 144395
17890 74454 -258269 -117014 114012 -48406 33623 356838 142191 -77290 -390914 -130051
17879 -166359 157415 -2299 -24008 110760 58576 263945 101134 -358280 -141018 37857
17868 17420 -72445 206040 175916 -114491 26500 196009 -4008 -83500 -162801 99794 334060
17857 334060 108530 -190221 45449 353996 10270 308313 -18165 -15576 118671 13321 16998
17846 16998 -72281 314808 -272483 61307 304399 80169 243964 -36917 -185274 323230
17835 137949 -115126 76566 -215407 -181317 58046 -7044 62481 -126682 126170 -135538 370919
17823A5826J76614c3434G9797J47807Q2022L8637B3875K60646a45955P0288A20604
17811C32246d8242A50158F8337J84650A08186b5236A66346j848a7030B41326a58037
17799a69099B70914j00841a4771r0815A629e8870A89329a39540A4975L2652N020
17788E2647R7070a48500B35624C711J8085J47807o4510J9369g1565A3276J86059
17777A99335a14658I5000K22540i4411l57018E2932L00582E8376J91971h5924
17766A51608K92337a25581d9357B19198j4012a20832A34375K13479e563A41763
17755a6251l8678B25203k8378L3018I2071C7983M12450H7863B2582b10800C09491
17743d53079B7490N7124j5685B1365b41467C3806N2596J63045k8339j5232q0749
$$ plain form
17823 15826 192440 -33434 79797 227604 309626 348263 23875 284521 -145955 -75667 120604
17811 332246 -48242 150158 68337 252987 108186 -25236 166346 164498 -17030 241326 -158037
17799 -169099 270914 170073 -14771 -105586 1629 -58870 189329 -139540 14975 47627 52647
17788 52647 149717 -148500 235624 3711 21796 169603 105093 124462 -71565 13276 199335
17777 199335 -114658 95000 317540 -94411 -451429 52932 353514 58376 250347 -85924
17766 151608 443945 -125581 -49357 219198 205186 -120832 134375 347854 -5563 141763
17755 -16251 -54929 225203 196825 229843 92071 37983 450433 87863 22582 -210800 309491
17743 -453079 27490 84614 68929 21365 -241467 33806 86402 249447 221108 205876 125127
17732A25127l5333O8043c5811A59287O4718p4073a59464e1770b186C16292F7938
17720A47589h5175C73059D8105a11704G9312b19070d4828B4332J10472a34337
17709B23766R9315c6495A45724J32609I2899P4742f9760b7525C0089j2766f9076
17697a77240A50460a84017D7481J32787a06380A85395J58821j55548o8752j1042
17687A08874m1925e3594G1409L2286J03743h747B91627j2674k1360B7968P8980
17676A06948L2553a47262A097a25587C46119J89619E4123K97749A23286N5999
17666A79285L1618f7197B17310K23727n5446D2506h2862A73150K05959A81982
17655A03123R2164J24816A09636c6291B2871a29820B03269b63680a163D3587J77114
$$ plain form
17732 125127 89794 157837 -35811 159287 224005 149932 -159464 -51770 -2186 316292 67938
17720 147589 -85175 373059 48105 -111704 79312 -219070 -44828 24332 134804 -134337
17709 223766 323081 -36495 145724 278333 92899 167641 -69760 -27525 30089 17323 -69076
17697 -177240 150460 -184017 47481 180268 -106380 185395 344216 188668 119916 108874
17687 108874 66949 -53594 71409 103695 207438 -8747 291627 278953 257593 27968 106948
17676 106948 139501 -147262 1097 -125587 346119 535738 54123 351872 123286 179285
17666 179285 210903 -67197 217310 441037 385591 42506 -82862 173150 379109 181982
17655 103123 195287 320103 109636 -36291 22871 -129820 203269 -263680 -1163 43587 220701
17644B20701b41280O0246C4871L19958F4110J05889h5639F4458K92581a05561
17633D28335d7022a6266I2347N4873B6092K5603M5357b837B59168e1158A26987
17621c50598a28796G2642K80511b56745c1997A75708D6920d4384D9406e8396k07685
17610b66081a00130B9148J96826R9331A41874c1388A50347a16303D97280a27885
17599G9396J32708M37526A08904b08944A39340a13032B56428c46308J28078C4549
17588B51808d6437H8919e5813J4287B4719J84364E3658J18752J34682a42118A72553
17576A37233C7335K2207B6175J40337m203d0080D90101B07250J99537J4121A85669
17564A87935i6039A00835K70202n2665a4404r8632H7873L22721A11268L08296
$$ plain form
17644 220701 -241280 -181034 34871 354829 64110 169999 -85639 64458 357039 -105561
17633 428335 -47022 -16266 92347 147220 26092 51695 97052 -2837 259168 -51158 126987
17621 -350598 -128796 72642 353153 -256745 -31997 175708 46920 -44384 49406 -58396 -266081
17610 -266081 -100130 29148 225974 325305 141874 -31388 150347 -116303 497280 -127885
17599 79396 212104 649630 108904 -208944 139340 -113032 256428 -346308 -218230 34549
17588 251808 -46437 88919 -55813 -41526 24719 209083 53658 172410 307092 -142118 172553
17576 137233 37335 59542 26175 166512 162309 -40080 490101 207250 406787 420908 185669
17564 187935 -96039 100835 371037 318372 -14404 -113036 87873 410594 111268 419564
17554D19564j61458j20148J4447P6258A12256P0234I0282J63349L4877J58698
17544D47206M8299C1456a0217r51B0210K00269J4745a3111G406J95914G6420K9515
17532A05935M43361k02158L52983A24963L55658j57009J79205M58382j54440M20137
17522A226896j85857n09956k9709j04636L66079B71110j05585K16222L2180J20730
17512E34657j0223J65563Q6523K17219p1125N8791k04115p1289l09717K29357
17502F25641B11453r2419J1667M24464B19202A03384C0369N21818A46915P4512
17492B21427C4949K87130n6709L5537J33879K09155A96154J26824C6099L15867
17482C51966A30328j2750g9345E10908k38896K35056A89406K80819A73180a2805
$$ plain form
17554 419564 258106 137958 152405 228663 112256 182490 90282 253631 288508 447206
17544 447206 495505 31456 -10217 -11168 20210 220479 235224 -13111 7406 203320 76420 105935
17532 105935 549296 347138 700121 124963 480621 323612 502817 961199 806759 1226896
17522 1226896 1041039 531083 501374 396738 762817 271110 165525 381747 413927 534657
17512 534657 524434 689997 776520 993739 922614 981405 777290 706001 396284 625641
17502 625641 211453 119034 130701 555165 219202 103384 30369 552187 146915 221427
17492 221427 34949 322079 265370 300907 434786 643941 196154 322978 36099 351966
17482 351966 130328 117578 -79345 510908 272012 507068 189406 470225 173180 -12805
17471D16466K0273J24565A37953M6392K6692J30524j04011j1606O2135J61873
17461D49952j01762M0062A78879p6484d4249j81156F06776B5951K39629J12149
17451C77729l1557k142O7439j60511K7211J08108J44269B39310Q9285L30271k10135
17440D48731B06576M80985B67827L39180k86452m7067J57823Q818j10546l5574
17430B94009R7835L2729A34332D4689g653A49712K08019N1108m0505A58142J56340
17419C14482j3091K95203A63965M2199J19489J48108m8637J63738j9118J34390
17409G04134k56409A47896J43471I7473m7358L42061R7199j30851l5418H4361
17398F1747b2961B42801d2139j21868B41978K8393J00088I2137L79268A84280
$$ plain form
17471 416466 436739 561304 137953 184345 211037 341561 237550 225944 288079 449952
17461 449952 348190 388252 178879 102395 -44249 -225405 606776 25951 265580 377729
17451 377729 346172 344030 411469 250958 278169 386277 530546 239310 328595 658866 448731
17440 448731 206576 687561 267827 607007 320555 273488 431311 440129 329583 294009
17430 294009 391844 424573 134332 44689 -7653 149712 357731 408839 368334 158142 314482
17419 314482 301391 596594 163965 206164 325653 473761 425124 588862 569744 704134
17409 704134 447725 147896 291367 97473 50115 392176 489375 358524 323106 84361
17398 61747 -22961 242801 -42139 -164007 241978 270371 370459 92137 471405 184280
17387B96831J30519I1991L36033c4126C29423J81981j23731j89481A2273K94417
17377C06690Q4416p6670K25180B14910J15333H7202K45967A01142K19897o7830
17367B53209a94502E63125k17486J11287j16034o9923J48875a05411C87961r1754
17357B96207m4485A24663J42130L06241c7712A37893E017J13855K95406j19387
17347B94891L57395A064M84674E5295a0137A53780J22582L953o6866r344q0220
17336A23885n9424J80391r1022K31304o5354Q6523M6411J5953B6768K38675p0389
17325A95054M08425j41878L2645q3728n5579j34015J3662p2840K5316L03490k33948
17314B56604J22771j48433H5112K90732F4745P0806J90393O0401n8880r7340k9295
$$ plain form
17387 296831 427350 91991 428024 -34126 329423 511404 387673 198192 12273 306690
17377 306690 391106 314436 539616 214910 330243 87202 333169 101142 321039 253209
17367 253209 -194502 563125 345639 456926 340892 270969 419844 -105411 387961 296207
17357 296207 251722 124663 266793 573034 -37712 137893 5017 118872 414278 294891
17347 294891 652286 1064 485738 55295 -10137 153780 276362 280315 213449 204105 123885
17336 123885 64461 244852 153830 385134 319780 406303 452714 468667 26768 265443 195054
17325 195054 603479 461601 494246 410518 354939 220924 234586 161746 187062 490552 256604
17314 256604 379375 230942 85112 375844 64745 135551 325944 386345 327465 230125 200830
17303B00830k5074o0248c4980C95262l4873H2414M6995m4884K52390C9529J2897
17292E2426j0913O2048J54347F8233J85603J48893o1197Q2584k1741j81507o1524
17281A59344L23818n4878D8403L11159J69093o7982j11511j00267G9907N1032
17271A30939K66536J71445q0246j59359J85048O8663j41854q4205K54995k96512
17261C15450Q8365A19722J16774n3667F9881L36075H4072K41140A47060j65o3372
17250H3523R9431N713F8114L16100Q972L882j49271o3930L94766k16229J84579
17239E46983B50156J30836J08925J1494G8877L39866A35583J33249J58034A36866
17228D25259k05999J83521A45256K30371p589o936p3064o8972J66855K7997j19362
$$ plain form
17303 200830 175756 115508 -34980 395262 360389 82414 129409 84525 336915 39529 52426
17292 52426 41513 103561 257908 68233 253836 402729 341532 424116 402375 220868 159344
17281 159344 483162 428284 48403 359562 528655 460673 349162 248895 79907 130939
17271 130939 397475 568920 488674 329315 514363 583026 441172 356967 611962 315450
17261 315450 403815 119722 236496 182829 69881 405956 84072 325212 147060 146895 83523
17250 83523 182954 188667 68114 384214 393186 397068 247797 183867 578633 362404 546983
17239 546983 250156 380992 489917 501411 78877 418743 135583 268832 426866 136866
17228 425259 219260 402781 145256 375627 368038 361102 288038 219066 385921 413918 294556
17217B94556K04820q7015A61306M08724I3385N85014j78668J75667B98511J23581
17207D22092J97340p4010k60635J87868l0504r294n5185J54324r8233J30466j53248
17196D10981o1459K0772J34630j77057J42700j63389o4209O5697j5418K47222
17186E40470L6866p021R5354B46705q8233R1086A07346L06955K47695l25186J31405
17175D68215l2731o7009L70634k57999j64248L24446k81447Q4745N7414m8967
17165D53053Q8249j96966J21839K25266k33517K66304j99682N7343B25880p6834
17155A49046P49361D16302L8537j97207K16186J79303R6055k38682k44320M26403
17145F92577C27673J88800j81764K07531K08564C64280L11881q3439N4833k72254
$$ plain form
17217 294556 499376 412361 161306 570030 93385 678399 499731 675398 298511 422092
17207 422092 619432 545422 284787 472655 442151 432857 377672 531996 433763 564229 410981
17196 410981 349522 370294 504924 327867 470567 307178 242969 308666 293248 540470
17186 540470 577336 570315 665669 246705 158472 249558 107346 414301 661996 336810 468215
17175 468215 435484 368475 739109 481110 316862 641308 359861 444606 502020 453053
17165 453053 541302 344336 466175 691441 457924 724228 524546 581889 225880 149046
17155 149046 898407 416302 454839 257632 473818 653121 749176 510494 266174 692577
17145 692577 327673 516473 334709 542240 750804 364280 676161 592722 647555 375301
17135C75301J78682R7078m1089j02406R6886l3940j74863J33826P157J71882k60028
17124D48486K12005R0085k60127P525q385J13089q445q5521K21716k46235L4370
17113E18563K28314k82360j97642K92115q4473L81193j66241L23186l07048k54065
17103D51542q7287J48173K72042k61465l2735J19913j84521J30174J14834j60900
17093E09770K89054k36613m8657M07808k54250J50282k20024n624L47032l36093
17083F02685J53487k65019l8968j4653L38069K20248n1180k10736K64303l82987
17073F15249K13104j07977L32871k28203J30345P0072l6029l88315L98969j00512
17063H99574k62114J23950J49127k64908J29166P4691K21564P3138j12946l2079
$$ plain form
17135 375301 553983 651061 609972 507566 604452 570512 395649 529475 536632 708514 448486
17124 448486 660491 750576 490449 497974 489589 602678 594233 508712 730428 484193 518563
17113 518563 746877 464517 266875 558990 474517 855710 689469 1012655 705607 451542
17103 451542 364255 512428 784470 523005 490270 610183 425662 555836 670670 509770
17093 509770 798824 562211 513554 921362 667112 817394 597370 591746 938778 602685
17083 602685 756172 491153 452185 437532 775601 995849 944669 733933 998236 615249
17073 615249 828353 720376 1053247 825044 955389 1025461 989432 601117 1000086 899574
17063 899574 637460 761410 910537 645629 774795 849486 1071050 1144188 1031242 999163
17053I99163k8169j78686q4572L08237l59732K60713j27155J89701k4051k81270
17043F74179M44142j54991j10250J90595L5077k04943j09261M57069k37931J18021
17033A101707l17647J18433R4598M11321k14296m37824K72384j76254L51559l43546
17023H60435k05692J53081N00689j80444m56877M37635k30163L641J96133j09307
17013I69131J95729N1582l05710O241J42199L9650K65132K3470L37734p01621
17003A023537R0847j46191M70784l31177L47566m3743l89953J4108J27186K24935
16993A387899Q0400p1851r9033j25734M36905k15094j11656M14683K7163l28987
16983A394695R1807m10054K18707k49081K83845j50306K24866O5285o5684j88319
$$ plain form
17053 999163 970994 792308 707736 1015973 656241 916954 789799 979500 955449 674179
17043 674179 1118321 963330 853080 1043675 1078752 873809 764548 1221617 983686 1101707
17033 1101707 784060 902493 997091 1408412 1194116 756292 1028676 852422 1203981 860435
17023 860435 654743 807824 1308513 1128069 671192 1108827 878664 882305 1078438 969131
17013 969131 1164860 1216442 910732 916973 1059172 1098822 1363954 1387424 1725158 1023537
17003 1023537 1114384 968193 1438977 1107800 1455366 1411623 1021670 1035778 1162964 1387899
16993 1387899 1468299 1396448 1297415 1171681 1608586 1393492 1281836 1696519 1723682 1394695
16983 1394695 1486502 1076448 1295155 1046074 1329919 1179613 1404479 1469764 1404080 1215761
16973A215761J71490L11602k79600O4888K46940k10112m32719M42621M4178o8431
16963A506618J30286j40374K88506Q7076j6596k7763k81422J58388P1562M2391
16953A818672J94780j87823j65372Q718L03167k39235J78177N2259m05168L59146
16943A917321N5931P2415m4834l3788J37074j26688k33945K82010K65224q673
16933B282047o8376k53476J23125K553P5876q8938O13824n20600j05843L88641
16923B448833j08989J38083j36029j22347L1047L06296K49717m63966K30192J78768
16913B751605k58919J54906P2080k12187J79862k2909N9534K92994j55889P6614
16903B937691n553q3323Q38R9911L0211L19566l09001L8158M4577J03440k50469
$$ plain form
16973 1215761 1387251 1698853 1419253 1484141 1731081 1520969 1088250 1530871 1575049 1506618
16963 1506618 1636904 1496530 1785036 1872112 1855516 1827753 1546331 1704719 1776281 1818672
16953 1818672 2013452 1825629 1660257 1668975 1972142 1732907 1911084 1963343 1558175 1917321
16943 1917321 1973252 2045667 2000833 1967045 2104119 1977431 1743486 2025496 2290720 2282047
16933 2282047 2213671 1960195 2083320 2085873 2161749 2072811 2686635 2166035 2060192 2448833
16923 2448833 2339844 2477927 2341898 2219551 2250598 2556894 2806611 2342645 2572837 2751605
16913 2751605 2492686 2647592 2719672 2507485 2687347 2664438 2723972 3016966 2861077 2937691
16903 2937691 2932138 2848815 2849653 2949564 2979775 3299341 2990340 3028498 3073075 3176515 2926046
16892B926046O43598m82326j95808N72387j84448K1703j7099K44416l00389J34762
16882C362842K20033L648L29225j73249K38554j87084K10248k89862J13220J41167
16872C968742L0733K84891l2240k35438M31161k67042P6449J81465q2260M21592
16862D778053j16999K69195M7307j31911M57868n29471L15188j5779K60576j06458
16852E227569J02624K8420K18370J00692k9749J23717j1816K18755k32034N82278
16842F328826j94992N6664L96841p4618J34994j6669m3011N04504j61362L37522
16832G268699j49038N01822J6515j76635M12231P8362K6837L66269J21081J1565
16822H477708J94536J75409M68084j3292K03240n3141J56804M55609k7458K17663
$$ plain form
16892 2926046 3569644 3087318 2891510 3463897 3279449 3301152 3284053 3528469 3228080 3362842
16882 3362842 3582875 3586523 3915748 3742499 3981053 3793969 4004217 3714355 3827575 3968742
16872 3968742 3999475 4284366 4252126 4016688 4447849 4180807 4257256 4438721 4356461 4778053
16862 4778053 4661054 4930249 4977556 4845645 5303513 4774042 5089230 5073451 5334027 5227569
16852 5227569 5330193 5358613 5576983 5677675 5647926 5771643 5759827 5978582 5746548 6328826
16842 6328826 6133834 6190498 6587339 6512721 6647715 6631046 6588035 7092539 6931177 7268699
16832 7268699 7119661 7621483 7637998 7461363 7873594 7951956 7978793 8345062 8466143 8477708
16822 8477708 8672244 8847653 9315737 9302445 9505685 9452544 9609348 10064957 10037499 10255162
16812A0255162L57736K28280K15387j78426L10307M77221K83393L75473M71477
16803A2796010J56343p206L39077L31265L21284K75158M83950O0678L57805N41523
16793A5655887J54417N62375M47273N07949O46983L01938J46619M54639M76538
16784A9354618R22207O26356M58983N37805L02810R09807O92272P34085M39704
16775B4978647P64461P36402Q41680Q55300J138627R64581N79366J333435O18185
16766C2810684J635417Q22355J249091J074958J088113J533970J317799J380091
16758D2912478J717190J474004J446016J539789J817345J849685K124059K032341
16750E6912907J835030K495438J859614J998830K798459K081540K675952K695337
$$ plain form
16812 10255162 10612898 10841178 11056565 10878139 11188446 11665667 11949060 12324533 12796010
16803 12796010 12952353 12945147 13284224 13615489 13936773 14211931 14695881 14756559 15114364 15655887
16793 15655887 15810304 16372679 16819952 17327901 17974884 18276822 18423441 18878080 19354618
16784 19354618 20276825 20903181 21362164 21899969 22202779 23112586 23804858 24538943 24978647
16775 24978647 25743108 26479510 27321190 28176490 29315117 30279698 30859064 32192499 32810684
16766 32810684 34446101 35268456 36517547 37592505 38680618 40214588 41532387 42912478
16758 42912478 44629668 46103672 47549688 49089477 50906822 52756507 54880566 56912907
16750 56912907 58747937 61243375 63102989 65101819 67900278 69981818 72657770 75353107
16742G5353107K041924K826188K828527K551479K660102L098058K758555K546455
16734I6664395K702169K613738K604075K237440K676646K105815K197137J424669
16726A15226084J603306R17535J095361Q59134K72071J99251m9017n37049j052075
16717A18534601j192058j472467j476978k044983k083045j893830k412813k649652
16709A03308775k705365k643925k760970k928850k584357k854481l050887k960587
16701H0819353k419813k873007k509638k556981k695868k270766k539110k289789
16693F0664381k092483k015947k058507k316347j518323j642278k293477j341384
16685D5385635j696693j449937j341400j741025j333442p84502j361880j227413
$$ plain form
16742 75353107 77395031 80221219 83049746 85601225 88261327 91359385 94117940 96664395
16734 96664395 99366564 101980302 104584377 106821817 109498463 111604278 113801415 115226084
16726 115226084 116829390 117746925 118842286 119701420 119973491 120172742 120123725 119586676 118534601
16717 118534601 117342543 115870076 114393098 112348115 110265070 108371240 105958427 103308775
16709 103308775 100603410 97959485 95198515 92269665 89685308 86830827 83779940 80819353
16701 80819353 78399540 75526533 73016895 70459914 67764046 65493280 62954170 60664381
16693 60664381 58571898 56555951 54497444 52181097 50662774 49020496 46727019 45385635
16685 45385635 43688942 42239005 40897605 39156580 37823138 37038636 35676756 34449343
16677C4449343r28572j029121j316634j108485r72796o95328j005754l68211j021382
16668B6003060p94460r18886r73981m93357j49941r92048p15851n80644p23331
16659A9660561k95935k77288o91473m13664n28718n67733m97189k26341l12427
16650A5849793k82943o39848l40615k65873l45785l95187l36324k66747j96838
16641A2779633k44817l89176l38029j49172l55506k93603m70650Q3796m97944
16632A0124532j28612m4440q6283n82877Q3446P4492n71784j75256J68479j32930
16622H728767k98642n32739K77039k76931N9058j98516l12354r3046p3846J1212
16612G290002j03549j25501q565l55973k91526R0091J19016o72685L64551j49268
$$ plain form
16677 34449343 33520771 32491650 31175016 30066531 29093735 28398407 27392653 27024442 26003060
16668 26003060 25208600 24289714 23315733 22822376 22672435 21680387 20964536 20383892 19660561
16659 19660561 19364626 19087338 18395865 17982201 17453483 16885750 16388561 16162220 15849793
16650 15849793 15566850 14927002 14586387 14320514 13974729 13579542 13243218 12976471 12779633
16641 12779633 12534816 12145640 11807611 11658439 11302933 11009330 10538680 10622476 10124532
16632 10124532 9995920 9951480 9865197 9282320 9365766 9440258 8868474 8693218 8861697 8728767
16622 8728767 8430125 7897386 8174425 7897494 7956552 7758036 7445682 7352636 7278790 7290002
16612 7290002 7186453 7060952 7052387 6696414 6404888 6494979 6613995 5941310 6305861 6156593
16602F156593j07317j69220m79522j1215J26678J824m19841o5155K91592m56097
16592D868320K60309n09461M20584l23113Q3804k12227R4204m55301J46564J91591
16582D565274q8160p8274j10763l6929k72912M4153N1497k07609j8988J61485
16572D008774j44515j58011K4397l86046K10513k06266K49230r7229j23780P566
16562C384633j44624K67942J3279n37619M64665j24524k00239J00852k33276q6579
16552B904510J64888j83325j20603j0347J80246M8192J98559n75261K88325j64221
16542B730963j44892J95730k38482J21202j39127k14224K5112J23870K93487O8233
16532B821872m27311q969l06612J85647m00488M60706j69548O4878J40437j25221
$$ plain form
16602 6156593 6049276 5880056 5400534 5389319 5515997 5517821 5097980 5032825 5324417 4868320
16592 4868320 5128629 4619168 5039752 4716639 4800443 4588216 4682420 4227119 4373683 4565274
16582 4565274 4477114 4398840 4288077 4251148 3978236 4022389 4073886 3866277 3847289 4008774
16572 4008774 3864259 3706248 3730645 3344599 3555112 3348846 3598076 3500847 3377067 3384633
16562 3384633 3240009 3507951 3521230 2983611 3448276 3323752 3123513 3224365 2991089 2904510
16552 2904510 3069398 2886073 2765470 2755123 2935369 2983561 3182120 2606859 2895184 2730963
16542 2730963 2586071 2781801 2543319 2664521 2525394 2311170 2336282 2460152 2753639 2821872
16532 2821872 2394561 2385592 2078980 2264627 1864139 2324845 2155297 2220175 2360612 2235391
16522B235391k17796J50119L7586k79494N339K37541q0633o5555L9534p1633j32656
16511A857743K54331j90633k2656n9824j98553N1375P3462K3670p3851J33177
16501A848241l65226L26669k58926L96181l00174J3318J32676l76951M79310k49186
16491A645932J3708k24383J73481J68975k1136l49623Q3462p6673Q3059O9746
16481A566548j93752l9116J85170j90700l76879M56598K81456k16709k8147n2529
16471A391940J55904m72996J99182N5487m9933j96386M21139l47396j15660J31405
16461A172686R3055l33792M35826m6222l5652j27575K93725n09576m9223K98836
16451A192088j64627L17835l10424K06858k03321p2847J25554O8980k38596K2049
$$ plain form
16522 2235391 2017595 2167714 2205300 1925806 1931145 2168686 2088053 2022498 2062032 1990399 1857743
16511 1857743 2112074 1921441 1898785 1838961 1640408 1691783 1765245 1788915 1715064 1848241
16501 1848241 1483015 1809684 1550758 1946939 1646765 1660083 1792759 1415808 1895118 1645932
16491 1645932 1659640 1435257 1608738 1777713 1756577 1406954 1490416 1413743 1496802 1566548
16481 1566548 1372796 1333680 1518850 1328150 951271 1407869 1689325 1472616 1444469 1391940
16471 1391940 1547844 1074848 1274030 1329517 1279584 1083198 1504337 1156941 1041281 1172686
16461 1172686 1265741 931949 1367775 1321553 1285901 1158326 1452051 942475 893252 1192088
16451 1192088 1027461 1345296 1034872 1241730 1038409 965562 1091116 1160096 921500 943549
16441I43549K18835k19967K50914m56548K12328J52597j51085R9033j35343K13174
16431A127487k83590K19888J60572k08209j53568J75866j80669p5929M07626j98119
16421I91355l8838l06774J29340O9018n1040P7368l35051L55450O5790p2202J19092
16410A003508K54262r3509l43407m2165j77365L09218j80875K73007j61878j79547
16400F61249P3750K44343m60287M18162n9569k61127M8189r5537K08960M4455
16390H22588J31335K4732m52848K29194k01802M14366l16011j8503K67955j12223
16380G88783J95972l35184K57440m31883J81228j4661n94J86214k50587L02521
16370H79249j19856r0973l8747M20963j17029l3885j76012k37002M11754C14279
$$ plain form
16441 943549 1162384 942417 1193331 736783 949111 1101708 950623 1049656 914313 1127487
16431 1127487 843897 1063785 1224357 1016148 862580 1038446 857777 781848 1189474 991355
16421 991355 952517 645743 775083 844101 793061 870429 535378 890828 956618 884416 1003508
16410 1003508 1257770 1164261 820854 778689 601324 910542 729667 1002674 840796 661249
16400 661249 734999 979342 519055 937217 877648 616521 664710 569173 778133 822588
16390 822588 953923 978655 525807 755001 553199 967565 651554 633051 901006 788783
16380 788783 984755 649571 907011 475128 656356 641695 641101 827315 576728 879249
16370 879249 759393 668420 629673 1050636 933607 899722 723710 486708 898462 314279
16359D99384K84575k42318K28007l65599L65279p3423J167k43504K73267C01711
16348B25744K12635L54699l04798L08362B53639O0807L16030j57487K53217j59595
16338E66611k6490p0596K3479R5504l6382r2522P0085k61040J98020k0166m2308
16327D04195J81595J66602C47810K68630P0569r304q6912n7444K42984C51603
16316G54820J38795B45121J89527o1723J18847j42675M03336k62942j93201J04800
16306D01090R8186K3739k48038K10550c2353B71188J77499O7862o1146r7371j40061
16295B17971K06393a93633E95619j68608q5684A50406L72089J83675k46618J65108
16285F24660B27972J36086Q2917R188j56929J21259p7995K33124L26902k04350
$$ plain form
16359 499384 783959 541641 769648 404049 769328 695905 697072 453568 726835 301711
16348 225744 438379 793078 488280 796642 253639 314446 630476 472989 726206 566611
16338 566611 540121 469525 493004 588508 552126 459604 529689 268649 466669 446503 404195
16327 404195 585790 752392 347810 616440 687009 677705 590793 533349 776333 351603
16316 754820 893615 245121 434648 372925 491772 349097 752433 489491 296290 401090
16306 401090 499276 523015 274977 485527 -32353 271188 448687 516549 455403 358032 217971
16295 217971 424364 -193633 595619 427011 341327 150406 522495 706170 459552 624660
16285 624660 227972 364058 446975 456163 299234 420493 342498 575622 902524 698174
16275F98174k83195j9392I7735D6330K94825N06338B75875J35807r1420n3208
16265B67054l5107L21273B19781J11513K5695H8517O06896B18200R4426J09921
16255D22547Q6333K41796A23736J30895L6697H3479O1425K746D5705L25294K0597
16244C91596j55881K30294j08093K40953H3780P8878L9480L477H6903M13498j58540
16233C41861Q7182j76950Q2806H1305M15423L5618P584I4180L17583A37210D0208
16221I1286M7901J00395O4417b6582D17525o9067K8405j07876K79138B13365K36768
16210D50133A42174j916J84806J50634J14465A34592C6870b6957A95127J67856
16200C62983R866p3025K9218J16817a02944B89448n4364b2369m9441F4242K30372
$$ plain form
16275 698174 414979 395587 97735 46330 341155 847493 275875 411682 320262 267054
16265 267054 231947 553220 219781 331294 356989 88517 695413 218200 312626 422547
16255 422547 508880 750676 123736 254631 291328 83479 144904 147650 45705 370999 391596
16244 391596 235715 466009 357916 598869 83780 162658 202138 205615 86903 500401 341861
16233 341861 429043 252093 334899 81305 496728 532346 539930 94180 411763 137210 40208
16221 91286 139187 239582 303999 -26582 417525 348458 376863 268987 548125 213365 450133
16210 450133 142174 140258 325064 475698 590163 134592 36870 -26957 195127 362983
16200 362983 372849 299824 329042 445859 -102944 289448 235084 -22369 -71810 64242 294614
16189B94614J75274d7331B10848i3194A16200L29482A02239k5441g814B61467
16178D85948j46483k5019A48124F6849J20746n7335P1280J76393A50476D9777
16167A19702g5092D49106p7048M2297A23266l5659M16322a91370A8755J41945
16157A60700R2698r5764O5121O7686G6264J67202E3406O1560J26330a5862L624
16146a2238C99739A39510R3538L9725B9050L30993l7907l1423k5973A30791B5930
16134H7805M6437K22322B8797b47740a1146A37860J7717Q7446i9956A45200H706
16122D95703E8224J25124c5993C4801a35203C16883j25370m1295Q172k8929J98867
16111C28328L0694b7007A71334o1289D2010J44300C4962J1477b7422B13944m2614
$$ plain form
16189 294614 469888 -47331 210848 -93194 116200 445682 102239 76798 -7814 261467
16178 485948 339465 314446 148124 66849 187595 130260 201540 377933 150476 49777
16167 119702 -75092 449106 372058 414355 123266 87607 503929 -191370 18755 160700
16157 160700 253398 157634 222755 290441 76264 243466 53406 114966 241296 -15862 -12238
16146 -12238 399739 139510 233048 272773 29050 360043 322136 290713 264740 130791 25930
16134 87805 134242 356564 28797 -247740 -11146 137860 155577 243023 -99956 145200 8706
16122 495703 58224 183348 -35993 34801 -135203 316883 191513 150218 158390 129461 328328
16111 328328 359022 -27007 171334 110045 42010 186310 34962 46439 -27422 213944 171330
16100A71330J35897A40525Q0201n0614J4044J9579e0465A73078E7591R373M67063
16089E34027I3884J83858A18221d5197H9699P3105k1099K51154g4117B32367G7673
16077A77809L4422C7210i4128D0701K57298F7618a35891A94882G9415J5386N666
16066A00467f6177H2323a57611a8206A60661J18239r4529L0018N4495D2767d4314
16054A05969O4546c1746C10995A47002C573L6883a88950c9892c105j50453A01691
16042D52697H0427a25790A43326C1725J40387L32642a25087A9428Q5486A5754
16031B14488a07059k22805d9535k2097D87085c5070A00502g6187j50464A15516
16020c33103N5211h9527A26980J35645Q2518g1102A19651a14268C670J69632p2309
$$ plain form
16100 171330 307227 140525 220726 170112 184156 203735 -50465 173078 57591 66964 534027
16089 534027 93884 277742 118221 -45197 89699 162804 141705 392859 -74117 232367 77673
16077 177809 212231 37210 -94128 40701 297999 67618 -135891 194882 79415 94801 100467
16066 100467 -66177 82323 -157611 -18206 160661 278900 184371 214389 268884 42767 -44314
16054 105969 170515 -31746 310995 147002 3573 40456 -188950 -39892 -3105 -153558 101691
16042 452697 80427 -125790 143326 31725 172112 504754 -125087 19428 104914 15754
16031 214488 -107059 -329864 -49535 -71632 487085 -35070 100502 -76187 -226651 115516
16020 -333103 -277892 -89527 126980 262625 345143 -71102 119651 -114268 3670 173302 100993
16009A00993O8430a9667p360B44337E2103J60161K41672C4579J43829q2511c31358
15997e5485n0730a373A4295B045O9892e6235A63616b24186B64093J03606Q0960
15986D48659J96021M89283p1031K7549j46382j23641k16117H5807K00839a8346
15975B67257a14263A37221a44248o0818G7916J77115a25043r0155M0749e6521
15964E8032M7469Q4141K67550b0389k17232J11280C08914a53087B97925H1353
15953C25016E4236c0072o840B89042g4939K7648R30G761a90361i2443m7531l8405
15941a78379B20062J05337a11208B59474A09626a14095j43067B29554F662d6872
15930A42751e326o8242k85778J56101g8073B64163b41960A90469M0253A01671
$$ plain form
16009 100993 169423 -19667 -27027 244337 52103 212264 453936 34579 178408 95897 -331358
15997 -55485 -106215 -1373 14295 2045 71937 -56235 163616 -224186 264093 367699 448659
15986 448659 644680 1133963 1062932 1090481 944099 820458 604341 85807 286646 -18346
15975 267257 -114263 137221 -144248 -205066 77916 255031 -125043 -215198 -174449 -56521
15964 58032 105501 189642 457192 -20389 -237621 -126341 308914 -153087 297925 81353
15953 325016 54236 -30072 -36912 289042 -74939 -47291 -46361 7761 -190361 -92443 -139974 -178379
15941 -178379 220062 325399 -111208 259474 109626 -114095 -257162 229554 6662 -46872
15930 142751 -5326 -73568 -359346 -203245 -78073 264163 -241960 190469 230722 101671
15919B74056G998c02646B60308B7164a03409A41520f3878F7055i8502D6939a65968
15907a79986A75659a8990E93115a63387k6306e3794B00251a84272D9860N4084
15897A03944A8199O2172J322h4320G5354L2385J87135j40039b09018D2608b88387
15885i2745F413f9638A0165J44189J02689p0191c66239Q6967h1170q0588h248
15873g9000K4034j6640I2731a27313c5678k0145B33911g1848k16458A55452a11520
15861A75839h8364j94311a32112D51689A44506F4557i4566r1253h1829p8264L4063
15850a26030a5354A7346O6591b99446D9822f9737p9335I887d4570f976A32324
15838a84751A02758P9337c01665A14438R345f6748n4222K8167M2607g530n4767
$$ plain form
15919 274056 7998 -302646 260308 27164 -103409 141520 -63878 67055 -98502 46939 -165968
15907 -179986 175659 -18990 593115 -163387 -189693 -53794 200251 -184272 49860 103944
15897 103944 18199 80371 81693 -84320 75354 107739 294874 154835 -209018 42608 -288387
15885 -92745 6413 -69638 10165 154354 257043 186852 -366239 -279272 -81170 -161758 -8248
15873 -79000 -54966 -71606 92731 -127313 -35678 -55823 233911 -71848 -288306 155452 -111520
15861 175839 -88364 -282675 -132112 451689 144506 64557 -94566 -185819 -81829 -160093 -126030
15850 -126030 -15354 17346 83937 -299446 49822 -69737 -149072 9887 -44570 -6976 132324
15838 -184751 102758 182095 -301665 114438 123783 -66748 -120970 -92803 -50196 -7530 -62297
15827f2297r4967c5561j20738C78626b0329A00205j6316l1390a22840l05153a4761
15815E2835J72266J13433b05064F247R2899a76780n1506Q1791k2526j73531D20217
15803A22772l0379l2479h6131p6721o5889N609F4838e6682A49171i9402k9010
15792a28412F713f4436E0790A8419c4892j86809A94649f7203a4287F1303k6920
15781C4383a22629j70477A03438f058k52977A5684a47562C08570a13137d7197
15770A45360m077d8713k1613B58935j18558K74553A45189a46423I4151K0561J62508
15759B77220a56894D29459E075a14043A32511E6796h6586A66296f1928A55236
15748i7587M550A88576c9978m0811A89448E1332N6758A417c87693A11716M498
$$ plain form
15827 -62297 -157264 -35561 -156299 378626 -20329 100205 83889 52499 -122840 -427993 -14761
15815 52835 225101 338534 -205064 6247 99146 -176780 -228286 -146495 -169021 -342552 420217
15803 122772 92393 59914 -86131 -162852 -228741 -223132 64838 -56682 149171 -99402 -128412
15792 -128412 6713 -64436 50790 18419 -34892 -221701 194649 -67203 -14287 61303 34383
15781 34383 -122629 -293106 103438 -6058 -259035 15684 -147562 308570 -113137 -47197
15770 145360 141283 -48713 -70326 258935 140377 414930 145189 -146423 94151 114712 277220
15759 277220 -156894 429459 5075 -114043 132511 56796 -86586 166296 -61928 155236
15748 -97587 -93037 188576 -39978 -80789 189448 51332 108090 1417 -387693 111716 116214
15737A16214O902A9015a24068M1613g663C87795a78077k59305f6999b4335A93398
15725b11871A76470H2036a4804l94461A21586a21588d6337H4448J0035K37442
15715C31925A45461a39039A5957J09688a41542F6507R5902k5521p02c0571l17375
15704c47946a9240j255A11676r786i1896n0848n4640e9403k06980p0689J25383
15693b11689B62832a56213A49013a48786A21281K9540J05067a17511A46228a64477
15682a12828I5635B0251M6607b90516A68289l5031J082e6853B9932M7439g5141
15670d95993C20939N6751i7972C105K06076a15898E615K10222b10309a4723o641
15659b1364m0052E8310a75986f8885A05193N9580i2492A53923C8944r529a3152
$$ plain form
15737 116214 123116 19015 -124068 -82455 -7663 387795 -178077 -437382 -66999 -24335 193398
15725 -211871 176470 82036 -14804 -409265 121586 -121588 -46337 84448 94483 331925
15715 331925 145461 -139039 15957 125645 -141542 66507 162409 136888 136186 -30571 -347946
15704 -347946 -19240 -20495 111676 101890 -91896 -142744 -197384 -59403 -266383 -337072 -211689
15693 -211689 262832 -156213 149013 -148786 121281 150821 255888 -117511 146228 -164477
15682 -112828 95635 20251 66858 -290516 168289 133258 134340 -56853 29932 77371 -75141
15670 -495993 320939 377690 -97972 3105 209181 -115898 5615 215837 -210309 -14723 -21364
15659 -21364 -61416 58310 -175986 -68885 105193 164773 -92492 153923 38944 29415 -13152
15647h1637B35427F76J56447b72308K9853i1183C0686j1429J0291a02436F8817
15635f3688j40928J9391H8449C2379J35037a33753K4527A73311R5396p9669b6682
15623A83696n3998Q7999a52914H1923J53505A02656j4913a08858c8164l1069G0154
15611A11480C6335N0930f4553H780J44281f5248j62622B36909I2507b12841d652
15599a64306P4046j42727l3252f5751E8271J52358C2604a96198E6788k3061d8649
15587i6304F2381a83498g2777B0453K05316r0976g1607b3478n873B5828b49698
15575a9168o4444b6668B2269J71782p9054J70180c84917A75498a48095j57885
15565c05980B12203b3948I5896O4452b8708j13836C2510f6522Q472C32466G5678
$$ plain form
15647 -81637 235427 676 157123 -272308 -242455 -91183 30686 19257 29548 -102436 68817
15635 -63688 -204616 -185225 88449 32379 167416 -133753 -109226 173311 268707 189038 -26682
15623 183696 129698 217697 -152914 81923 235428 102656 87743 -108858 -38164 -69233 70154
15611 111480 36335 87265 -64553 8780 153061 -65248 -227870 236909 92507 -212841 -4652
15599 -164306 -90260 -232987 -266239 -65751 58271 210629 32604 -196198 56788 33727 -48649
15587 -96304 62381 -183498 -72777 20453 225769 134793 -71607 -23478 -29351 25828 -249698
15575 -19168 -83612 -26668 22269 194051 114997 285177 -384917 175498 -148095 -305980
15565 -305980 212203 -23948 95896 160348 -28708 -142544 32510 -66522 -58050 332466 75678
15553i8220I489J49848c5699k01315P6061E9140b01573p0668H7337e9662B6239
15541A10155J1755k6878B7648a42418C1959a98033C6313J99140c9849C3612b0363
15529A61023B8316L641J12000a32970n6459f5661C842a9822B21884a54063A29635
15517D64646j46128D0240J71195J3208b53118C4345o793J58020K05533j14297
15507B76808b71678a9009B51529a08510m2107C38949G7400K76224B6512K73644
15497C00156j12487e1347C96865D8408a1169A74705e2159B01754a31107C2269
15486i063A1619P855K84950B3139Q121Q7200m2563a38361K2623B58921E4531J64595
15474B19126K44709J34148L45886l04137A81864q9097G119M1086b7828C873h8240
$$ plain form
15553 -98220 9489 159337 -35699 -237014 -160953 59140 -201573 -272241 87337 -59662 26239
15541 110155 121910 95032 27648 -142418 31959 -198033 36313 235453 -39849 33612 -20363
15529 161023 28316 31957 143957 -132970 -189429 -65661 3842 -19822 221884 -154063 129635
15517 464646 318518 40240 211435 224643 -253118 34345 27552 185572 391105 276808
15507 276808 -271678 -19009 251529 -108510 -150617 338949 77400 353624 26512 300156
15497 300156 187669 -51347 396865 48408 -11169 174705 -52159 201754 -131107 32269
15486 -9063 11619 19474 304424 23139 31260 118460 75897 -138361 -115738 258921 54531 219126
15474 219126 463835 597983 943869 639732 181864 92767 7119 48205 -27828 3873 -88240
15462B84382d8362A30517a08184B67414a68559G2387P4282e0722E3081j4472r695
15451B8914a91858f0217A03933b85806A87533@C14720j02313p297M25409K66433
15440H96952M98935m97244l58484A18438a31577E2308c8599B63415a318A24699
15429f1443E0992k4118O9531M205J0229i3320C15906i1219j56262b5846j40722
15418a66568A17037b58840a04038G1795l2321b81550L4192B41648B9500a31117
15407a2264k57318H9791C9641P2721Q9594g7996G596N0757f9389J7842k80032
15396c31579h0045q4284J0523B4621J29216K249J47332b49067J18297j35300B09708
15384A63024e5405A06412a38069j84615A21814P0972K9324M0108E3290K13193
$$ plain form
15462 284382 -48362 130517 -108184 267414 -168559 72387 146669 -50722 53081 38609 28914
15451 28914 -191858 -60217 103933 -285806 187533 0 314720 212407 205110 630519 896952
15440 896952 1395887 898643 540159 118438 -131577 52308 -38599 263415 -1318 124699
15429 -61443 50992 26874 96405 100610 110839 -93320 315906 -91219 -247481 -25846 -166568
15418 -166568 117037 -258840 -104038 71795 39474 -281550 -247358 241648 29500 -131117
15407 -12264 -269582 89791 39641 112362 201956 -77996 7596 58353 -69389 -51547 -331579
15396 -331579 -80045 -164329 -153806 24621 153837 156086 303418 -249067 -130770 -266070 209708
15384 163024 -55405 106412 -138069 -322684 121814 192786 222110 262218 53290 266483
15374B66483p7092a16971C81797r8923A25341J47288B1832L4715G102i0163A31940
15362c42542a54894B15499N1190N3811R2731o0003G8358R8786J8516O557L7238
15351B39455A09385L12525J86856D7417M11838A65533N1665L8924J33714o564
15341C83272j55436F9260J80582b95759A00433J41366j3778b3584A12774E4905
15330b43111B45081e7850i167A15920J91792H2224L22151E4211a36013f5278H2988
15318D68912B18392c5170E6921K62060J06491j00111A53682b01196B7130N84130
15308F11260B75554n7162H5711Q7901J45637D2587d802A19065a49915C08586A53445
15296H9641L9844K34613a73650A32111J14635n2150h0514j38666A30872b31466
$$ plain form
15374 266483 189391 -116971 381797 282874 125341 272629 21832 56547 7102 -90163 131940
15362 -342542 -154894 215499 266689 320500 413231 353228 78358 177144 195660 202217 239455
15351 239455 109385 421910 608766 47417 459255 165533 217198 256122 389836 383272
15341 383272 227836 69260 249842 -295759 100433 241799 228021 -23584 112774 54905
15330 -243111 245081 -57850 -9167 115920 307712 82224 404375 54211 -136013 -65278 82988
15318 468912 218392 -35170 56921 318981 425472 325361 153682 -201196 27130 611260
15308 611260 275554 218392 85711 173612 319249 42587 -4802 119065 -149915 308586 153445
15296 89641 129485 364098 -173650 132111 246746 194596 -80514 -219180 130872 -231466
15285G5986M4832e998B73881P3054A8849a80657A14705a05407A47080J00236A08756
15273B92275p1785E626P1368j0740Q1680G1650J07195p3658c5042I4848A8140
15261B13109K3393a96848D0252g0675k67902a07144j14297D2389J485M27750A65646
15249C85656r3786l5656c0987D31718r4521K2973r704P57470R38261o81000L97338
15238A762535J42609E49642K2087B27272b53713B18941F5419B4784J34452M0690
15228A99926l5180J9332a72619B38832n9705K2557I8407N899k5892h6996B54592
15216e4412I2420O9459c2745H0615f1536I8895a85445e6344m5595j47735B98858
15204E0581K96738b61784R5254k2810A71694a89840A93828N3143a19148A9283
$$ plain form
15285 75986 120818 -5998 273881 346935 18849 -180657 114705 -105407 147080 247316 108756
15273 292275 220490 5626 76994 66254 147934 71650 178845 105187 -35042 94848 18140
15261 213109 236502 -196848 40252 -70675 -338577 -107144 -221441 42389 43874 471624 165646
15249 385656 291870 256214 -30987 431718 337197 360170 350466 1107936 2046197 1365197 1762535
15238 1762535 1905144 549642 571729 227272 -253713 218941 65419 24784 159236 199926
15228 199926 164746 184078 -172619 238832 179127 201684 98407 104306 78414 -86996 254592
15216 -54412 92420 161879 -32745 80615 -61536 98895 -185445 -56344 -101939 -249674 298858
15204 50581 347319 -261784 -166530 -189340 171694 -189840 193828 246971 -119148 19283
15193b58466A66257G1993a29957E1326a72656D33731a53373C04338a03310A84719
15182B159L18326A35690J13670j591A1808L88806A21748g4737D39814b8701k0352
15171d9053H1740c3195I2353B129R9481K01852K23086A29450K41365a42904p0521
15160b13425G0349L17860n0560h4666B22326D7121a97852A09352R6882e0409A1999
15148B73547p8455e7195B18461d7793B63920b92095A60839J16339c9922H7652
15137b84181a16119B3969J86011F2871J2186Q3111J52202G0340Q0235n2169N2286
15126A50692M4490I1792J53775A08070a40894D48974j27908K01996A94589K42236
15116D36825a2420D8446K7942c306C5667M52102h3633B06614I8078J21365R024
$$ plain form
15193 -258466 166257 71993 -129957 51326 -172656 433731 -153373 304338 -103310 184719
15182 2159 320485 135690 249360 247769 11808 400614 121748 -74737 439814 -28701 -49053
15171 -49053 81740 -33195 92353 2129 101610 303462 526548 129450 370815 -142904 -213425
15160 -213425 70349 388209 337649 -84666 222326 47121 -197852 109352 206234 -50409 11999
15148 273547 195092 -57195 218461 -47793 263920 -292095 160839 277178 -39922 87652
15137 -284181 -116119 23969 209980 62871 75057 158168 310370 70340 150575 98406 150692
15126 150692 195182 91792 245567 108070 -140894 448974 321066 523062 194589 436825
15116 436825 -12420 48446 76388 -3306 35667 487769 -83633 206614 98078 219443 228467
15105B28467A5385K62196a8544j14424H3815J685a43332A43110L17515f7369B43404
15093B58497B1282K44621I5829c7818C39485d9829A69356K08111j48957d4932
15082I8698J25107b2573I5196K93220n929H1561P6641m8947J01066r5879N5921
15071A70363N2980i1806H6632Q8135j6603J4007b13050B58903J00729r2114n5239
15060B12279l8386h0684B08972K44361A82269J21302o9855K02404j13356E9470
15049A52736J23081P3290J79918k11560K9742a23723L9321B39247E4603J70945
15039B25548Q925l0076p135N7164o5475J79585J11553N041O42Q6423J94505k22171
15027E44529j6603K06498j35770j30209J83084k01237K71474k52718J08065K1625
$$ plain form
15105 228467 15385 277581 -18544 -132968 83815 85500 -143332 143110 460625 -67369 243404
15093 258497 21282 265903 95829 -37818 339485 -49829 169356 377467 228510 -44932
15082 98698 223805 -22573 95196 388416 382487 81561 158202 109255 210321 114442 170363
15071 170363 223343 -91806 86632 174767 158164 172171 -213050 258903 359632 267518 212279
15060 212279 173893 -80684 208972 453333 182269 303571 233716 436120 322764 59470
15049 152736 275817 349107 529025 317465 347207 -123723 -84402 239247 54603 225548
15039 225548 234473 204397 197262 254426 188951 368536 480089 485130 485772 572195 766700 544529
15027 544529 527926 734424 598654 468445 651529 450292 721766 469048 577113 598738
15017E98738N7492B62454j5085J94531H6446K33999J67208l7566B06500N08986
15007G15486B43246L74580P3581k59804j12970p7753N7983q4508K09842P3557
14997D97754B03574L81564k40199j263K87655j39604n2042J63892H7692L18863
14987D06555j75730O56818C12664M43882k42198j23730K16472J45015j5172C61584
14976F09965B41824N8397J40126J94863L3956J31564n2004j42622N1352B60447
14965G19122k61473J73076B61542r2753J78265J31594k29955R0390F4799J02235
14955A67034L95354N6436A98159P562J67203K37744j08806n8967K55085B21157
14944G28003k13901J33162R5829k0160p2043l15304L440N1699J49131j37934J94009
$$ plain form
15017 598738 656230 262454 247369 441900 86446 320445 487653 450087 206500 715486
15007 715486 243246 617826 691407 431603 318633 240880 298863 214355 424197 497754
14997 497754 203574 585138 344939 343676 631331 491727 439685 603577 87692 406555
14987 406555 230825 887643 312664 756546 514348 390618 607090 752105 736933 361584
14976 609965 241824 300221 440347 635210 669166 800730 748726 606104 657456 260447
14965 719122 457649 630725 261542 168789 347054 478648 248693 339083 64799 167034
14955 167034 562388 618824 198159 205721 372924 610668 501862 442895 697980 221157
14944 728003 514102 647264 743093 722933 650890 335586 339026 390725 539856 401922 595931
14933E95931Q6391j26525m9983O14217L29384m41515K94019J67590L20578k54970
14923A535117k47288J24634L17290k48486K23451j39424N71017J31422l08089
14914A959644m35702l12727j44416J78889l65157j72702k56502L72978K6112C43964
14903D99172J4883j87889J15442L18397j71921k04768A7917K65570J22792L21540
14893G27819P498k49211k40686J11582J83135K05186j18279J60198j99731K89062
14883H76573n7739j59685J89o2432L52831m03789J90342j78895j25743K9237j74978
14872B85911R1292k3345j4399K09413o930J9654L31465m1760N9668k1491l48045
14861E41433J37083k39491o5268L56715j99173O6987q6990R3443c2426A73085
$$ plain form
14933 595931 682322 555797 505814 1120031 1449415 1007900 1301919 1469509 1790087 1535117
14923 1535117 1287829 1412463 1729753 1481267 1704718 1565294 2136311 2267733 1959644
14914 1959644 1523942 1211215 1066799 1245688 880531 707829 451327 824305 850417 343964
14903 499172 514055 326166 441608 760005 588084 383316 17917 283487 406279 727819
14893 727819 735317 486106 245420 357002 540137 745323 627044 787242 587511 876573
14883 876573 818834 659149 659338 596906 949737 545948 736290 557395 431652 460889 285911
14872 285911 377203 353858 339459 548872 541942 561596 893061 851301 910969 889478 541433
14861 541433 678516 439025 373757 730472 531299 598286 511296 604739 -32426 173085
14850B51438K09275p4270M2564L78587C93666J95917N63372k23688K49428K85359
14840A464054o99928K70913j79120L34918l25944J62801m08544j83324K18698
14831F54524P188C16769K27050p4158J38558j24198J58335N2090j28287j6549
14821E49610p0303J88262Q5001P2191k38665J48461j3649l13202L87175l20011
14811D74870J14851L29133j54822L32585n17781k798K3999N18455j60968l38576
14801F18948K65008r4199C24169J02087A81010K47587K7300j13154k9359J78265
14791D91649A07011O45259C58009K52565j12023o2439J58652L02421L0145B08782
14780H29409j00785m2438J35145J56856j02421K69148j19223q4137L4080D16208
$$ plain form
14850 251438 460713 386443 429007 807594 393666 589583 1152955 929267 1178695 1464054
14840 1464054 764126 1035039 855919 1190837 864893 1027694 619150 435826 654524
14831 654524 661712 316769 543819 469661 608219 484021 642356 694446 566159 549610
14821 549610 479307 667569 752570 824761 586096 734557 720908 407706 794881 474870
14811 474870 589721 918854 764032 1096617 578836 576038 600037 1118492 957524 618948
14801 618948 883956 789757 324169 426256 181010 428597 455897 342743 313384 491649
14791 491649 107011 752270 358009 610574 498551 436112 594764 897185 927330 208782
14780 829409 728624 686186 821331 978187 875766 1144914 1025691 941554 975634 416208
14769G72570K9100k95174J66461J80829l94218P1438j25254L62624P1338l66465
14759D73249R9581K7385j43512r7968N00607l41548M23285m65877K83907J5203
14749G74312J47872D42022K99186j49965J3279O9044q3329M49758r9492k57945
14739F82558l7942l8273L08612K4945j94847J53804L24635j48285J06467J95167
14729A376841k15668L06321J09174J92223j76735K50654o14917N9627l04088l1522
14719I51910N0518j25182J95783k46798L87747l44651J41104m18107J41775J52911
14709H87010q8417m2058J07802M9927l2805M63122m2194N59901O489j73365L26630
14698B022042k1340p29012K8856j12096K1522o1960N5980l04928J50954l07549
$$ plain form
14769 772570 801670 506496 672957 853786 459568 531006 405752 768376 839714 473249
14759 473249 572830 600215 456703 358735 859342 517794 941079 475202 759109 774312
14749 774312 922184 442022 741208 591243 604522 673566 590237 1039995 940503 682558
14739 682558 644616 606343 914955 939900 745053 898857 1223492 1075207 1181674 1376841
14729 1376841 1161173 1467494 1576668 1768891 1592156 1842810 1227893 1287520 983432 951910
14719 951910 1002428 877246 1073029 826231 1213978 869327 1010431 592324 734099 887010
14709 887010 798593 756535 864337 914264 881459 1344581 1302387 1862288 1868777 1695412 2022042
14698 2022042 2000702 1271690 1300546 1188450 1209972 1148012 1203992 899064 1050018 742469
14688G42469L98820M8765k38508k42480J91216R6787j56504J71874k68059J00933
14678H45313L14267k5326k14143K60606l19454J87549K14136m41762L03452j55452
14668I69186K11464j80841k33538K35940N7007q0323L32200n08118N10110N5892
14658A368979l37128K113K70128l47919J47349N5649J19692L24359j78310j98474
14648A226438l8331k57503M63260l5262m07676L08502O255p8723j68032L62978
14638A381906l64367O0398K05578N6250k27830O6314J21825J29963O4424l06592
14628A187869J58929p7269J21660m95003Q05316n1771M0047J7971k58013l05191
14618A144545K56657j92690K51819J74714q2112k07851J36565P7732l78902K53283
$$ plain form
14688 742469 1141289 1190054 951546 709066 900282 997069 840565 1012439 744380 845313
14678 845313 1159580 1134254 920111 1180717 861263 1048812 1262948 821186 1124638 969186
14668 969186 1180650 999809 766271 1002211 1059218 978895 1311095 802977 1313087 1368979
14658 1368979 1031851 1033964 1304092 956173 1103522 1159171 1278863 1603222 1424912 1226438
14648 1226438 1188107 930604 1393864 1358602 950926 1259428 1265683 1186960 1018928 1381906
14638 1381906 1017539 1077937 1283515 1339765 1111935 1178249 1300074 1430037 1494461 1187869
14628 1187869 1346798 1269529 1391189 896186 1701502 1649731 1689778 1707749 1449736 1144545
14618 1144545 1401202 1208512 1460331 1635045 1552933 1345082 1481647 1559379 1180477 1433760
14608A433760O1714K50991j96133m9085L7263q3059k11813Q0053K08032N8794
14598A590517L03915m51178k1288L92404R9560k59596K66560k05238J09168j09518
14588A715306j67584K46062k68918M66379l48858K14280N0523J05281k72870M18618
14578B158219j73628k24267K76810m02q1549J88023N8597J96194j67580N3733
14568B284150k09921K22385J18132Q0822M8963K2283P3942O8695K30181o1782
14558B877850K1438j24441M65288q881N36854J36770J71140P57777J016942K200484
14548H051221L813154P355639J7584854J0093625B0041676G234790l498506j066066
14540B670218j61699j859R80750J775597k12790k177834p28278k55702Q6047k5566
$$ plain form
14608 1433760 1495474 1746465 1550332 1501247 1538510 1455451 1243638 1323691 1531723 1590517
14598 1590517 1894432 1443254 1421966 1814370 1913930 1654334 1920894 1715656 1824824 1715306
14588 1715306 1547722 1793784 1524866 1991245 1642387 1856667 1907190 2012471 1739601 2158219
14578 2158219 1984591 1760324 2037134 2036732 1955183 2143206 2201803 2397997 2230417 2284150
14568 2284150 2074229 2296614 2414746 2495568 2544531 2566814 2640756 2709451 2939632 2877850
14558 2877850 2899288 2774847 3240135 3231254 3768108 3904878 4076018 4833795 5850737 8051221
14548 8051221 11864375 19220014 36804868 46898493 20041676 7234790 3736284 2670218
14540 2670218 2508519 2506660 3487410 5263007 5050217 2872383 2144105 1888403 1974450 1948884
14530A948884J96676l97989N02155j72321K33075l9692j4819j4508R8697J28382
14520B468540J07273Q4201m32774L94782j69082K00425j16763K11349k45703N53252
14510C055500m76817J30283L53975l81181L95360k59940J14927L9122L18374l62913
14500B926690N39525m60899K78315j47110K75403L2970q3723r0130k13290K73745
14490C331496r8510L38769k72023K90534j79842K53466o8371N11396r5127l48673
14480C663115L19150n31399O99336K7109l12206N69768n12530K20242Q8839j95001
14470D036423L29106M323p9774M81768n89375Q11561k91193k5416o8129K60320
14460D869614O4170n07111K60986K71894K46310k48211K48519k9712j0293K8446
$$ plain form
14530 1948884 2145560 1747571 2249726 2077405 2310480 2270788 2255969 2241461 2340158 2468540
14520 2468540 2575813 2660014 2227240 2622022 2452940 2653365 2536602 2747951 2502248 3055500
14510 3055500 2578683 2708966 3062941 2681760 3077120 2817180 2932107 2971229 3289603 2926690
14500 2926690 3466215 3005316 3283631 3136521 3411924 3444894 3361171 3271041 3057751 3331496
14490 3331496 3232986 3571755 3299732 3590266 3410424 3663890 3595519 4106915 4011788 3663115
14480 3663115 3982265 3450866 4150202 4177311 3865105 4434873 3922343 4142585 4231424 4036423
14470 4036423 4365529 4369852 4290078 4771846 4182471 4994032 4702839 4677423 4609294 4869614
14460 4869614 4933784 4426673 4687659 4959553 5205863 4957652 5206171 5176459 5166166 5194612
14450E194612K94142j09200J77425j38382Q1659M58713j82048M0903R4778J36714
14440F049316K53444N7729k67923Q7960Q4789J99858o6079L19248J30780l87133
14430F461989K52361J51347K75469j15032M97139j2758K85284N4228K44577l2453
14420H062151J91266L79798K21308p1088M3998J58314l28258K30914j69177N26374
14410I245600j42436K87250k12406N74545O7236L50770K22291J99336K46664j53256
14400A0685594J72408K1522j26174N67969K45283k03772L75164r2923L77688K80333
14390A2303092J20240N34024N3402j96330P04785M00531K58495r4879M32520J14506
14380A4630386O26602M73420R0685j69871N30384J39074J72019N57119L59151
$$ plain form
14450 5194612 5488754 5379554 5556979 5418597 5500256 5958969 5776921 5817824 5912602 6049316
14440 6049316 6302760 6360489 6092566 6180526 6265315 6465173 6399094 6718342 6849122 6461989
14430 6461989 6714350 6865697 7141166 7026134 7523273 7510515 7795799 7850027 8094604 8062151
14420 8062151 8253417 8633215 8854523 8783435 8827433 8985747 8657489 8888403 8719226 9245600
14410 9245600 9103164 9390414 9178008 9752553 9819789 10170559 10392850 10592186 10838850 10685594
14400 10685594 10858002 10879524 10753350 11321319 11566602 11362830 11737994 11645071 12022759 12303092
14390 12303092 12423332 12957356 13010758 12814428 13519213 13919744 14178239 14083360 14515880 14630386
14380 14630386 15256988 15730408 15821093 15651222 16181606 16320680 16492699 17049818 17408969
14371A7408969M07279L33470K77399K80618O80957L97387L75341M78849J61579
14362B0801848P56054K12801L45295O64913M26057N90645M41851M84685Q56023
14353B5580172L17673O22320Q32357M20136Q53433N89368J016324P30293P30075
14344C1692151P05464Q70063O53704J074947J068677P36522J184966J182559J118654
14335D0287707J195683J077271J316411J374516J349372J687877J278762J333619
14327E0901218K102391J634889K158560J471498J759645K801857J712438K544959
14319F7087455K086119L114148K653962K443712K917174L088173L178928L299844
14311H9869515L807012L623910M175068M309330M651665M488273N272169M920647
$$ plain form
14371 17408969 17816248 18149718 18427117 18707735 19388692 19786079 20161420 20640269 20801848
14362 20801848 21557902 21770703 22115998 22780911 23206968 23797613 24239464 24724149 25580172
14353 25580172 25897845 26520165 27352522 27772658 28626091 29215459 30231783 30962076 31692151
14344 31692151 32397615 33267678 33921382 34996329 36065006 36801528 37986494 39169053 40287707
14335 40287707 41483390 42560661 43877072 45251588 46600960 48288837 49567599 50901218
14327 50901218 53003609 54638498 56797058 58268556 60028201 62830058 64542496 67087455
14319 67087455 69173574 72287722 74941684 77385396 80302570 83390743 86569671 89869515
14311 89869515 93676527 97300437 101475505 105784835 110436500 114924773 120196942 125117589
14303A25117589N693092O162875O306851O561655P126960P525116P778807Q476322
14295A80749267Q649636R674915R660150J0597178J0949429J1394299J1823918
14288B53498792J2648293J3029907J3241143J4419196J3893612J4394633J4847973
14281C49973549J5197327J4804441J4317488J4061671J3434122J2273383J0378884
14274D44440865P438644L920806K420235J439966J367974J308675k945697l404820
14266D55986648o663823r547020j1884195j2767533j4573482j5031288j5995839
14259C69523468j6022502j5887205j5748952j5361365j4942727j4452074j3707076
14252B63401567j3304202j2926047j1979656j1566151j0027036q499969r721873
$$ plain form
14303 125117589 130810681 136973556 143280407 149842062 156969022 164494138 172272945 180749267
14295 180749267 189398903 199073818 208733968 219331146 230280575 241674874 253498792
14288 253498792 266147085 279176992 292418135 306837331 320730943 335125576 349973549
14281 349973549 365170876 379975317 394292805 408354476 421788598 434061981 444440865
14274 444440865 451879509 455800315 458220550 459660516 461028490 462337165 459391468 455986648
14266 455986648 449322825 439775805 427891610 415124077 400550595 385519307 369523468
14259 369523468 353500966 337613761 321864809 306503444 291560717 277108643 263401567
14252 263401567 250097365 237171318 225191662 213625511 203598475 195098506 185376633
14245A85376633r306227q444341p758509p868791p064683o526705o604039n496208
14237A26307130n195648n304332n484042m462623m669138l708159l631027l659347
14229I0192814m059584l249317l074217l154791k696209k672937k560510k560619
14221F6164630k300786j815607k110626k318429j697872j791369k133969r86112
14213E1009860j300752j660184j522127j523760j572277q56133o46242j039169
14205D0889216j891864j216418q85778r32384q67761o77655j076337p64756r13944
14196C1662319j014313o52287o26205n48624q83492p65516q53683m82977n63516
14187B5271706n84663o04788n58128n12268n68853l13301o14895n18735j66484
$$ plain form
14245 185376633 176070406 167626065 159867556 151998765 144934082 138407377 131803338 126307130
14237 126307130 121111482 115807150 110323108 105860485 101191347 97483188 93852161 90192814
14229 90192814 86133230 82883913 79809696 76654905 73958696 71285759 68725249 66164630
14221 66164630 63863844 62048237 59937611 57619182 55921310 54129941 51995972 51009860
14213 51009860 49709108 48048924 46526797 45003037 43430760 42574627 41928385 40889216
14205 40889216 38997352 37780934 36895156 35962772 35095011 34417356 33341019 32576263 31662319
14196 31662319 30648006 29995719 29369514 28820890 27937398 27171882 26318199 25835222 25271706
14187 25271706 24687043 24082255 23524127 23011859 22443006 22129705 21514810 20996075 20829591
14178B0829591n99222l61329m15140m11163k95884n06482j61734o46781l88359
14169A7043497k28765k25455q365l20480p71400l39514M5195q2449n55219j01992
14159A4455053l10305m36159j82904l07499o6410M4432n30298j67047l60596L0013
14149A2168280l34958k37159J11123l06137k89760k23594k65330J35223k11295
14140A0546393j39911j20052k31518j7074n0715n96883K10095j95792j83342k11316
14130I009885m29713K81884j69124P6738J3840k44137j54180j60514l5700k24743
14120G964236k68923K2733R9500m89933J59095l53950M03228m93802j11876P0091
14110G000399k74910K58082k41776j19823k39428Q641J3498j77058J89311k71369
$$ plain form
14178 20829591 20230369 19869040 19453900 19042737 18746853 18240371 18078637 17431856 17043497
14169 17043497 16814732 16589277 16580912 16260432 15489032 15149518 15194713 15112264 14557045 14455053
14159 14455053 14144748 13708589 13525685 13218186 13151776 13196208 12665910 12498863 12138267 12168280
14149 12168280 11833322 11596163 11707286 11401149 11111389 10887795 10622465 10757688 10546393
14140 10546393 10406482 10286430 10054912 10037838 9987123 9390240 9600335 9404543 9221201 9009885
14130 9009885 8580172 8862056 8692932 8769670 8783510 8539373 8385193 8224679 8188979 7964236
14120 7964236 7695313 7718046 7817546 7327613 7486708 7132758 7535986 7042184 6930308 7000399
14110 7000399 6725489 6983571 6741795 6621972 6382544 6391185 6404683 6227625 6416936 6145567
14100F145567L1900n3676k69113j52539j72613M04647k76798k22118J67039m09168
14090E193128K39414J66608k64818K46605k71043k28285P0409l17520m9129K80241
14080E065610k07131J66102m47384K02677m91262M01126k03440O1090l7694l00810
14070D208884L70264l53566n4325K64531j54845k42848N0070M13599l99289J02786
14060D205261k43900j11485L14519P1996k12100p3858n8558L7192k02669l05912
14050C420486K17155o6807J1844k90523J28128j56146p4810J95510j76736Q031
14040C216132j25364l746L75770l44247j9974M57053n03714L59843j40264K5500
14030C296989l28799L01082K60636k01721m13494J52549j88018O2447l74233K82026
$$ plain form
14100 6145567 6177467 6123791 5854678 5702139 5529526 5934173 5657375 5435257 5602296 5193128
14090 5193128 5432542 5599150 5334332 5580937 5309894 5081609 5152018 4834498 4785369 5065610
14080 5065610 4858479 5024581 4577197 4779874 4288612 4689738 4486298 4547388 4509694 4208884
14070 4208884 4579148 4225582 4171257 4435788 4280943 4038095 4088165 4501764 4102475 4205261
14060 4205261 3961361 3849876 4164395 4236391 4024291 3950433 3891875 3929067 3726398 3420486
14050 3420486 3637641 3570834 3582678 3292155 3420283 3264137 3189327 3384837 3208101 3216132
14040 3216132 3090768 3087022 3462792 3118545 3098571 3555624 3051910 3411753 3271489 3296989
14030 3296989 2968190 3269272 3529908 3328187 2914693 3067242 2879224 2941671 2567438 2849464
14020B849464j41852N6948j12095j93467M13808m25748q0890l4953J52346j51266
14010B332295j46311J13811L0167N1201k89823j4761L29848j39834K36768n89799
14000A913562N72948n43519K95988n1787N1509R4987l3611k3646M375M06771Q1809
13989B769386J338826K578285N815155J5488198K1964792k1988187A3159626n516350
13981G643276k138287r17256o26637k98268n47562j63985l34040p1841N6151P6797
13971B678348J0604j99754K00592l30477N95018n31736k00382p9434j59184L16107
13961B299702q0050j88460k27785L6395J60916M06120l19955J01971m03604K84562
13951B069812j78168J03319m0388m30247K79739n118q9831P1938K77528k31569
$$ plain form
14020 2849464 2707612 2764560 2652465 2458998 2872806 2447058 2366168 2331215 2483561 2332295
14010 2332295 2185984 2299795 2329962 2381163 2091340 2076579 2406427 2266593 2503361 1913562
14000 1913562 2486510 1942991 2238979 2187192 2238701 2333688 2300077 2276431 2280806 2687577 2769386
13989 2769386 4108212 6686497 12501652 27989850 49954642 27966455 13159626 7643276
13981 7643276 5504989 4587733 3961096 3662828 3115266 2951281 2617241 2545400 2601551 2678348
13971 2678348 2688952 2489198 2689790 2359313 2954331 2422595 2222213 2142779 1983595 2299702
13961 2299702 2219652 2031192 1803407 1839802 2000718 2406838 2086883 2188854 1785250 2069812
13951 2069812 1891644 1994963 1954575 1524328 1804067 1798949 1709118 1781056 2058584 1827015
13941A827015k14346K02909q4437m03366J78995K74282j45725q04k67931L30127
13931A696719L31582l75443j75444J92668l8784J24991O6468j79566j20522L80434
13921A903103n19241J04388j22590J89350R9588k16081R6213K78651k53846j31430
13911A428105K93430j31323k0026k40368J79926K19472o95624M08090k78657L90971
13901A553996j41195q0188j43484M3791p3789J18650O1229P7418k69160j22544
13891A024724m4055J14957L38145l93238K70403r0138j3066J87320m21090L18701
13881A292663J21857l986k89887J54144j58006K2517r3883M73410n59641N14602
13871A473790l44394O4468j54445j06643M20586m66257K89382K9367j12109J5553
$$ plain form
13941 1827015 1612669 1815578 1731141 1327775 1506770 1781052 1635327 1634523 1366592 1696719
13931 1696719 2028301 1652858 1477414 1670082 1631298 1756289 1822757 1643191 1522669 1903103
13921 1903103 1383862 1488250 1365660 1555010 1654598 1438517 1534730 1813381 1559535 1428105
13911 1428105 1721535 1590212 1570186 1329818 1509744 1729216 1033592 1441682 1163025 1553996
13901 1553996 1412801 1332613 1189129 1232920 1159131 1277781 1339010 1416428 1147268 1024724
13891 1024724 980669 1095626 1433771 1040533 1310936 1220798 1207732 1395052 973962 1292663
13881 1292663 1414520 1410534 1120647 1274791 1116785 1139302 1045419 1518829 959188 1473790
13871 1473790 1129396 1193864 1039419 932776 1353362 887105 1176487 1205854 1093745 1109298
13861A109298J49536m15575P3315L52338k44418r4339j06344K14809J24544j44674
13851A018490J90383l17090n6545p578K39914j11273J64693l26014N88127n11392
13841H71715M48309n13147J88594l96O7882j21025J18850m25847N3348P6374K89051
13830A053708j35156j73467K61253k4882q2329j72614M20905k79604J23982k6089
13820I65707k0390m11547M78738k12012P8303r675K35164l70792L27829j69945
13810H91380p3150j4666j9198l1034Q3332m2686M86213n84825j73331K41454K87317
13799A050806j95932j28883j07386K97534j56377R4417k33203J72712m9838j45296
13789E98554P4322J57395M4759m0532k04655j66818N11531j2923D53172J08635
$$ plain form
13861 1109298 1258834 843259 916574 1268912 1024494 930155 823811 1038620 1163164 1018490
13851 1018490 1208873 891783 835238 827660 1067574 956301 1120994 794980 1383107 871715
13841 871715 1320024 806877 995471 995075 1062957 941932 1060782 634935 688283 764657 1053708
13830 1053708 918552 745085 1006338 981456 899127 726513 1147418 867814 991796 965707
13820 965707 945317 533770 1012508 800496 878799 869124 1104288 733496 1061325 891380
13810 891380 818230 803564 784366 753332 836664 793978 1280191 695366 522035 763489 1050806
13799 1050806 854874 725991 618605 916139 759762 854179 620976 793688 743850 598554
13789 598554 672876 830271 875030 834498 629843 463025 974556 961633 453172 561807
13779E61807L5494J29K12544j08514K20369m1987l95502L46812j28231k05611
13769D97310L49739C76251J76505J24881m4977L65517N8182D80808L0940Q1851
13759E93599J42964k33010P4324J60513j14523p305J49590J38672m13582l6206
13749D55036k682P8936K68486K35854m20639M8449O3989R5299B64935N31396N0106
13738H46437k07900l7092L03526k78502K22369j63574l0126j10103J14963n30
13728F59468q3453r6404J86935j46662k19395L45457M5113p6036j5229k8060J59224
13717G30958j81183j65948n0003L13543R2207L70366k67341l67520J26687n3741
13707E48025k9804J68609j02803B69622N7681K57306M8365J7132J40206p2400
$$ plain form
13779 561807 597301 597430 809974 701460 921829 879842 484340 831152 702921 497310
13769 497310 847049 376251 552756 677637 632660 998177 1056359 480808 511748 593599
13759 593599 736563 503553 577877 738390 623867 616562 766152 904824 491242 455036
13749 455036 452354 531290 799776 1035630 614991 663440 727429 822728 264935 796331 846437
13738 846437 638537 601445 904971 626469 848838 685264 655138 545035 659998 659468
13728 659468 576015 479611 666546 519884 300489 645946 691059 615023 599794 571734 730958
13717 730958 549775 383827 333824 647367 739574 1109940 842599 475079 601766 548025
13707 548025 518221 686830 584027 269622 327303 584609 632974 650106 790312 717912
13697G17912j84366j32374k1522K13038k91635L40310Q3396l41069K19828k340
13687F01178K60129j98114p3630m8607M5431Q2214A49936K57929A54546M09335
13677E63881j78589P0367A59735J92343L9534K36575L04787m28416J48756k8525
13667F24789k84295L2869k0480p2128L53173j93624N6603j2885n7818L17651A91886
13655B53693L06432A27143N60593k52031A89844K48177o2222q9488j00198J29647
13645C15760O3707j07824l2511O2507O1627L68039k12855n9238J30891q2840p4993
13634D32270J00035B35770N050L67055j52369o0960J21506B51960K99948j39530
13624D12378m4319N2332J11886k23185J01701j70171J11840j57917M97059j82966
$$ plain form
13697 717912 533546 401172 379650 592688 301053 641363 724759 383690 603518 601178
13687 601178 861307 663193 589563 540956 586387 668601 149936 407865 154546 563881
13677 563881 385292 455659 159735 352078 391612 628187 932974 504558 653314 624789
13667 624789 340494 373363 352883 280755 633928 440304 496907 484022 426204 743855 191886
13655 253693 560125 127143 687736 435705 189844 438021 375799 286311 186113 315760
13645 315760 379467 271643 239132 301639 363266 731305 518450 459212 590103 507263 432270
13634 432270 532305 235770 240820 607875 455506 394546 516052 251960 551908 412378
13624 412378 368059 420391 532277 309092 410793 240622 352462 194545 691604 508638
13614E08638q3839A11456M2191p0861k5224L58073K4638o0801J15073n5538j85455
13603B53552K72006j23480P6300j9209A77480N19920B46916n4121K5449n2481
13593A65763l5446J5993J80355A59596m9498D6242J84353m2845L19381B01117
13582C10421K59584A51961L08784j42742N5178J0508J5545a5770C15614p4723
13572B40891M510n8206O11565l14704d7148F3283J57256J25714J19373A98898
13561A11836J68659o2684K96506k10434K64002j40494J60376k30160f3829C8388
13550F00973k93655M1233I7382K14400P7396N6763A75735K7342R2178o8507G5570
13538B73075j4676J67113N6717A26901K35198k1249j04130J47123j89118K01624
$$ plain form
13614 508638 424799 111456 153647 82786 57562 415635 440273 379472 494545 439007 253552
13603 253552 525558 402078 478378 459169 177480 697400 246916 192795 218244 165763
13593 165763 130317 146310 326665 159596 110098 46242 230595 187750 507131 201117
13582 310421 570005 151961 460745 318003 373181 383689 399234 -15770 315614 240891
13572 240891 245401 187195 798760 484056 -47148 63283 220539 346253 465626 198898
13561 111836 280495 217811 514317 303883 567885 427391 587767 357607 -63829 38388
13550 600973 307318 348551 97382 311782 389178 445941 175735 203077 295255 226748 75570
13538 273075 258399 425512 482229 126901 362099 340850 236720 383843 194725 396349
13528C96349A74514L65107g0981B75265j19056H208J85211R6635k0733J12271
13518C81592M2569L26919a7902C56045e8631B47303j09537J53574P536K78892
13508E77768k49389a5889G1833J19708R8937J00338A16689K50189m6730j17293
13498B02855J3128J440P5628K4490a31485C00210A37845J98779A29630J07591
13488B37221q562j5292P5193A12739D6216K13193A0480L78936j59303J71914a01535
13476D54932k0553j57171l6126N9164G6326J12201l9143L22903B08781P5972N89
13465B85342i861D00993P8284a21027B37885j09504J69687P3444K7352c0087B2123
13453B70928O4862J08795d677C23570a1458A69667J7576L1142J86980A05389K06235
$$ plain form
13528 396349 174514 539621 -70981 275265 156209 8208 193419 290054 269321 381592
13518 381592 424161 751080 -17902 356045 -58631 247303 137766 291340 298876 577768
13508 577768 328379 -15889 71833 191541 290478 390816 116689 366878 320148 202855
13498 202855 215983 217423 293051 317541 -131485 300210 137845 336624 129630 237221
13488 237221 228659 213367 288560 112739 46216 259409 10480 389416 230113 402027 -101535
13476 454932 434379 277208 241082 300246 76326 188527 149384 472287 208781 284753 285342
13465 285342 -9861 400993 479277 -121027 237885 128381 298068 371512 398864 -30087 22123
13453 270928 335790 444585 -4677 323570 -11458 169667 187243 218385 405365 105389 311624
13442C11624B1454K37680q3718N4848J87164i9991A57932b2437C5647J13702c3200
13430A61781n2352J0796d0040C2230a2333A78060J42909G3695e5037E33722B36482
13418C01688g792C44194F1032K03908M0833J10827o9441j20286K139f8596B17124
13406A75273b68078A89584b03912C41766A07008J43664G3554c0748B39303n5110
13396A84193L46601J04527A57600D6012L00456B4614K77647l169J0994O4770A61580
13384B03758J04777j02754P1815a17745A55929D2264M7393Q8396n648j4408L19294
13373D77291j37913A62381L46083G2837M4876M11107k06497E2305K88019M6162
13363C86486I6803J69971j2953M2714N0915A14517K33045j48687J05326m4455
$$ plain form
13442 311624 21454 259134 175416 230264 417428 -99991 157932 -22437 35647 149349 -33200
13430 161781 109429 120225 -40040 32230 -12333 178060 320969 73695 -55037 533722 236482
13418 301688 -7792 344194 61032 264940 305773 416600 347159 226873 229012 -68596 217124
13406 175273 -268078 189584 -203912 341766 107008 250672 73554 -30748 239303 184193
13396 184193 530794 635321 157600 46012 346468 24614 302261 299092 310086 374856 161580
13384 203758 308535 205781 277596 -117745 155929 42264 89657 178053 172405 157997 477291
13373 477291 339378 162381 508464 72837 117713 528820 322323 52305 340324 386486
13363 386486 96803 266774 253821 296535 347450 114517 347562 198875 304201 259746
13353B59746J04467A19062K83664J51578c98E75233k09943p7791q3909Q9164K96108
13342E88862k91233R4083j83079J00242J3608J62229B42093a2142A50998J33573
13332B84571h22G3720a35130I2320F648L21044j04558b2045A82351l008q0634
13321I8709J6152O0890M04578A9313I344K11381P8863a9374A79513B5313L2624
13310E7937J15274j8934n4793M10152B33027a80598C58091A58684M11868j84194
13300C86358j34400c7926A47094A7910c6623L071I7922L9084a23278C45354a2647
13288d1750D53293j68945a47277B8591O0487P1192n9431K37985I8756a0527D38391
13276A93167C6502d3170H7549a38379B35854L1882J54181G5540C4853J31245a87941
$$ plain form
13353 259746 364213 119062 402726 554304 -398 575233 365290 287499 203590 292754 588862
13342 588862 297629 391712 208633 308875 322483 484712 242093 -12142 150998 284571
13332 284571 -822 73720 -135130 92320 6648 327692 223134 -22045 182351 179343 98709
13321 98709 114861 175751 580329 19313 9344 220725 299588 -19374 179513 25313 57937
13310 57937 173211 154277 99484 509636 233027 -180598 358091 158684 570552 386358
13300 386358 251958 -37926 147094 17910 -36623 -33552 97922 137006 -123278 345354 -12647
13288 -41750 453293 284348 -147277 28591 89078 160270 100839 338824 98756 -10527 438391
13276 193167 36502 -43170 87549 -138379 235854 267736 421917 75540 34853 166098 -187941
13264F780a13566r7067B5124d8203A70784c0125A41901L42478B07076K4317C7786
13252C52843I0491Q6993E0891h0627H5558R6949J4462H0854c05203B83782q056
13241B75726I9604m4256j0083J71882a9969C04551j49552a78988G4921L6829M6210
13230A57960G4518J8459a12092A97063a05737l6559A02205J52603a30983A62681
13219B83190I0870M35178c43654A4652d3113B10178G2063K22866O9680I8942M08392
13208E07334B7536a59603I1325Q1165c9697a8382p072o8601j08205g8733B93330
13196a25974d1722A61033e5731I2715D4314e0954A6678g3757l771p0885A35865
13184I7335l1092a82647l8920B33576j6231L1183H461Q5571a74373B6789J23967
$$ plain form
13264 6780 -113566 -210633 25124 -48203 170784 -30125 141901 484379 207076 231393 37786
13252 352843 90491 177484 50891 -80627 85558 182507 196969 80854 -305203 283782 275726
13241 275726 99604 55348 45265 217147 -19969 304551 154999 -178988 74921 111750 157960
13230 157960 74518 92977 -112092 197063 -105737 -142296 102205 254808 -130983 162681
13219 283190 90870 526048 -343654 14652 -43113 210178 72063 294929 364609 98942 507334
13208 507334 27536 -159603 91325 172490 -39697 -18382 -25454 -94055 -202260 -78733 293330
13196 -125974 -41722 161033 -55731 92715 44314 -50954 16678 -73757 -77528 -148413 135865
13184 97335 66243 -182647 -221567 233576 217345 248528 8461 94032 -174373 26789 150756
13173A50756a15136j24561B37129o2708f8562b7660A49135G94R1147K26023i2910
13161b3849n1020A1047A076L13892A3402n97d9513K1279A08381J66590F6440c042
13148C3274d5564E3487R2644i4985B24606i1809D77405A73588M1766E9741P743
13137F7484J57961a4396k1355p3983j28380i1900A06543l5990K1450J03052o1276
13126A33779J3587g7063L1829G3350g2956j68543c1521B58212f047C16027J8902
13115C34929j03270l4145m3404b53647B64481a1866E2963a4015I0749a75314L456
13104a71858B14507e2113A21973L53363b03044C51557a49391B38746H6320c7317
13093b75031C4301a03752j05868e505k10348F2485A4070J81670K91803A04466
$$ plain form
13173 150756 -115136 -239697 237129 174421 -68562 -27660 149135 794 91941 317964 -92910
13161 -23849 -74869 11047 1076 314968 13402 12805 -49513 -28234 108381 274971 66440 -3042
13148 33274 -45564 53487 146131 -94985 224606 -91809 477405 173588 215354 59741 67484
13137 67484 225445 -14396 -35751 -109734 -238114 -91900 106543 70553 92003 195055 133779
13126 133779 147366 -77063 -45234 73350 -72956 -241499 -31521 258212 -6047 316027 334929
13115 334929 231659 197514 154110 -253647 264481 -11866 52963 -14015 90749 -175314 -171858
13104 -171858 214507 -52113 121973 475336 -203044 351557 -149391 238746 86320 -37317
13093 -275031 34301 -103752 -209620 -5505 -215853 62485 14070 195740 487543 104466
13082A54960K35359h1431C82006h78A47682a01646m3325B7266J04353b57322e695
13070A91397g9180H7761a76638A38149K13577a98860A41442L47990B8926j1349
13060A7577J70201K09123A80344P4000h636G7161J04005b33376F7979J28035I3896
13048H7001h5713G2664a78033B88075N0214a11130m4318A52555i9397l09571J94477
13037b14491N7134C11635j03125q3298J22449a83973N4175B56291a32533E21317
13026E69275k23013A61953F6116N4924O9129b9251p6265J769B23416b17414C36869
13014h8801b4175G6694Q4207b46113H9886J58564E4059a2686q2550B29396a01545
13002a31699D01808a09016a212F7565O821k2187K6896N175c520q3862C62241a74377
$$ plain form
13082 154960 390319 -81431 382006 -878 147682 -101646 -144971 27266 131619 -257322 -5695
13070 191397 -79180 87761 -176638 138149 351726 -198860 141442 489432 28926 17577
13060 17577 187778 396901 180344 254344 -8636 77161 181166 -233376 67979 196014 93896
13048 87001 -85713 72664 -178033 288075 338289 -111130 -155448 152555 -99397 -408968 -214491
13037 -214491 -157357 311635 208510 125212 247661 -183973 -129798 256291 -132533 521317
13026 569275 346262 161953 66116 121040 190169 -29251 -105516 -103747 223416 -217414 336869
13014 -88801 -24175 76694 160901 -246113 89886 248450 54059 -12686 -95236 229396 -101545
13002 -131699 401808 -109016 -1212 67565 74386 52199 79095 84270 -3520 -87382 362241 -174377
12989a72036A79234K0884j5524M7201a03836A53481M451J24479n5624a01235j8593
12978a19828i909H3657a11394j82452E0038a63333A55106f5763B63303m6386d9604
12966g1085A764P6970f9064C1511L80926g7743B22082a66520B80679k6559a16420
12954c75238a02527q9028E6404c84576e4199A68497o0983L5771F397J23297a65703
12942a10596l8630B5376J05588a07555B15059a00665A00501k9931K16021A42812
12931A1651P5102k4436K3081k2525b21883d6875B48755O5949A0944a66604O7167
12920i9437I5855a26375E51409c5186J3348A2792e4923j42294I0303J02011n0695
12909A41619i0409B7488p370F759b11857n9071l3103l4372E2971a98224b8413
$$ plain form
12989 -172036 179234 200118 184594 231795 -103836 153481 157932 282411 226787 -101235 -119828
12978 -119828 -9909 83657 -111394 -293846 50038 -163333 155106 -65763 263303 216917 -49604
12966 -71085 1764 78734 -69064 31511 412437 -77743 222082 -166520 280679 254120 -116420
12954 -375238 -102527 -191555 56404 -384576 -54199 168497 107514 143285 6397 129694 -165703
12942 -110596 -149226 25376 130964 -107555 215059 -100665 100501 70570 286591 142812
12931 11651 86753 62317 85398 62873 -221883 -46875 248755 314704 10944 -166604 -99437
12920 -99437 95855 -126375 551409 -35186 -21838 12792 -54923 -197217 90303 192314 141619
12909 141619 -90409 27488 20118 6759 -211857 -270928 -304031 -338403 52971 -198224 -28413
12897A33061E8449c4401B10940r6726A5244J05827K7717c9083J7380k36812A88597
12885g2017B31062J32410J34403a10320j2762a1227j42350p3545A15643a71648
12874B69470C8610J77093O2143b16046L7740A4766K66554J89325d19002C97757
12863C48757j57180C7829c47399G4145e8790d898I1341K47785c49526B804J34936
12852A37740c01284A055J17252P1886a64819k06860a50328J4320j2852a2216q4706
12841i6922j87247H565N5010B441d8721C5689O5526a04374e199A64299Q9318H8128
12828b68893D49466k11563i8888H5455J58194a43841A06641F75b11688I4274a42984
12816c44014A67574a05521j15301a06538k33362A20482l6437a97237B85587A6160
$$ plain form
12897 133061 58449 -34401 210940 114214 15244 121071 148788 -39083 -21703 -258515 188597
12885 -72017 231062 363472 497875 -110320 -123082 -11227 -153577 -227122 115643 -171648
12874 269470 38610 215703 277846 -216046 -178306 14766 281320 470645 -419002 397757
12863 348757 191577 37829 -347399 74145 -58790 -4898 91341 339126 -349526 2804 137740
12852 137740 -301284 1055 118307 190193 -164819 -371679 -150328 -136008 -148860 -12216 -96922
12841 -96922 -284169 8565 63575 2441 -48721 35689 101215 -104374 -5199 164299 253617 88128
12828 -268893 449466 237903 -98888 85455 243649 -143841 106641 675 -211688 94274 -142984
12816 -344014 167574 -105521 -220822 -106538 -339900 120482 84045 -197237 285587 16160
12805I7676b61643J8980A05194g1141m03098A92706a9522k39776J15353D0094
12794b2469O822j10006K8938d3204j47915M6516K7339F5911a30273E3536a29569
12782H6279a00184A73255j147j3725B8917b45003A22066a22546G4002i5728A14766
12770d6657R311a1229H5216a06779A80071a68818A30318a74252A6265J35226L6510
12759A88001e9435j08566B6115b14672B17562c13997J3905F1740a57614a2179
12748h7551B32604E5871a54035E4655e5947A4188L4088a7195l67402C88977A59197
12736a17895e2375p5208A33345L04743j92989K78279e5914A43539H723K80977
12726B89700d0131j09929a3058B16136b12113D2835A8932J5887a04821G7716N2665
$$ plain form
12805 97676 -261643 -242663 105194 -71141 -474239 192706 -19522 -259298 -143945 40094
12794 -22469 -15647 -125653 -96715 -43204 -191119 -144603 -117264 65911 -130273 53536 -129569
12782 86279 -100184 173255 172108 158383 28917 -245003 122066 -122546 74002 -95728 114766
12770 -46657 -37346 -11229 85216 -106779 180071 -168818 130318 -174252 16265 151491 188001
12759 188001 -59435 -168001 26115 -214672 217562 -313997 -300092 61740 -157614 -12179
12748 -87551 232604 55871 -154035 54655 -55947 14188 48276 -17195 -384597 388977 159197
12736 -117895 -52375 -127583 133345 438088 245099 523378 -55914 143539 8723 289700
12726 289700 -40131 -150060 -13058 216136 -212113 42835 18932 34819 -104821 77716 130381
12715A30381A4500K6200a20732B94263j15238p9369C026L30595L5869k662p7430
12704B89398P3536A18664J74683n619F6574R4895h1954c8463A9156G413d44168
12692d344A47059f1209A35432c00199A23584Q3401a35249B52832N4491e36734
12681A7406K5821r898L19782J5904A43868a20971A53376k2616A530F23L7370Q648
12669D6641P0503C501f5145a5594p6590A01165A4035J50572N4180g1987l94375
12658d66362c8307C59576A10112K04334A18765K21537J11599A75674H7005a03674
12647a633A83539e7389j7935A53201G235a60732A23607J49594G506b01705E7429
12635G867J56463a009B85595I1471J48184A11654J34215j08858M9160a52826B61889
$$ plain form
12715 130381 14500 40700 -120732 294263 179025 99656 3026 333621 369490 366828 289398
12704 289398 362934 118664 293347 287728 66574 161469 -81954 -38463 19156 7413 -444168
12692 -4344 147059 -61209 135432 -300199 123584 206985 -135249 252832 307323 -536734
12681 17406 43227 33329 353111 369015 143868 -120971 153376 130760 1530 623 37993 46641
12669 46641 117144 3501 -65145 -15594 -92184 101165 14035 164607 218787 -71987 -466362
12658 -466362 -38307 359576 110112 314446 118765 340302 451901 175674 87005 -103674
12647 -1633 183539 -57389 -75324 153201 7235 -160732 123607 273201 7506 -201705 57429
12635 7867 164330 -1009 285595 91471 239655 111654 245869 137011 186171 -152826 261889
12623G0447f5513C81825h8775A64523b27381A43480Q2698E8645J0291j7421a43357
12611a8990j38715B65572a23380O0491j9707E5524P646B7218K28487J7086B8543
12599E2643B2503L52173a5717A59022b91080e7375A54259P4156E0505a4840a260
12587h2571c6624F9750k8253K9673c7230J3677o7097K7655B68067c0148B55942
12575E14061E4217O4450a77549C1840O1433J13900h7272B83298j38989o0338b30474
12563a14823l5115B10848a25723a4960k75954A43873o5965c8935q1846A86902
12552C86117H0132b24968J03294e9762A39629Q2126G6882C6442a09377A84075
12541H4183R9754F8765J71224B6826c8590D3262h8190B26988b15122A07959a60720
$$ plain form
12623 70447 -65513 381825 -88775 164523 -227381 143480 226178 58645 68936 51515 -143357
12611 -18990 -157705 265572 -123380 -62889 -82596 55524 63170 27218 255705 272791 28543
12599 52643 22503 374676 -15717 159022 -291080 -57375 154259 228415 50505 -14840 -1260
12587 -82571 -36624 69750 41497 71170 -37230 -23553 -90650 -62995 268067 -30148 255942
12575 514061 54217 118667 -177549 31840 93273 207173 -87272 283298 144309 83971 -230474
12563 -114823 -149938 210848 -125723 -14960 -290914 143873 77908 -38935 -120781 186902
12552 386117 80132 -224968 -121674 -59762 139629 221755 76882 36442 -109377 184075
12541 84183 183937 68765 239989 26826 -38590 43262 -88190 226988 -215122 107959 -160720
12529b50643b3850k04675c2173j92747A0076a09853L6669A83906a78047B7129
12518g8101C30581a78308o8236C18654a53959e119l9007G8366a53663G2465L6728
12507A09193i3748j01492g3495E2041a77083C20897a82671c9912k0028k6960A69997
12495C60931f1088j12759A40643d03263g6346B80301A8551J17140a25669e7363
12484b58457b8524o2901c1641B39763E2799L21393a03371c14B99959G5736O2653
12473A38389K59155o1278m3278r6281M7793i5871b9938C46766A04347J6533m0324
12462H0556c2229k292l6521C14011A19247O7540b12009I7051b70142b649m6446
12451d9095A51006C6112b18052N4647f0032C30226A17268J18564o1659c35952
$$ plain form
12529 -250643 -23850 -228525 -32173 -224920 10076 -109853 -73184 183906 -178047 27129
12518 -78101 330581 -178308 -246544 318654 -153959 -5119 -44126 78366 -153663 72465 109193
12507 109193 -93748 -195240 -73495 52041 -177083 320897 -182671 -39912 -59940 -86900 169997
12495 360931 -61088 -173847 140643 -403263 -76346 280301 18551 135691 -125669 -57363
12484 -258457 -28524 -91425 -31641 239763 52799 374192 -103371 -314 299959 75736 138389
12473 138389 397544 336266 292988 196707 244500 -95871 -29938 346766 104347 120880 80556
12462 80556 -32229 -34521 -71042 314011 119247 186787 -212009 97051 -270142 -2649 -49095
12451 -49095 151006 36112 -218052 -163405 -60032 330226 117268 235832 174173 -335952
12440E9265k6408K2452c50874k3614N8907A79140r86a02673b6527p8536A43251
12428a9883i838j22314B2396K8164c2917A92058j8462a31441a5225m2809j01676
12417a59710A81801G171k947b54471C4051K0105b3218o6831a018I7917a22684
12405D0847R132e3906D0201b14869i9742j15735I7209L1703C3382L6465d2124
12393F4036J6153b59177I725J53336a91486B93275F8871K11297I8692a94642A91444
12381f623j9256k25245B40089l1306C7700C390J18586f6981j04980B16103m4116
12370A71987a95733C70971A54300f7352r4939e3526B85318a40383A4270J10664
12360A24934b38819i3273L1487A05556J21305D2995R463k5290N0578a83651A87492
$$ plain form
12440 59265 32857 55309 -350874 -374488 -315581 179140 178154 -102673 -26527 -105063 143251
12428 -19883 -9838 -132152 22396 50560 -32917 192058 173596 -131441 -15225 -58034 -159710
12417 -159710 181801 7171 4224 -254471 34051 54156 -23218 -90049 -1018 97917 -122684
12405 40847 49979 -53906 40201 -214869 -99742 -215477 97209 128912 33382 69847 -42124
12393 64036 80189 -259177 9725 163061 -191486 293275 68871 280168 98692 -194642 191444
12381 -6623 -25879 -251124 240089 208783 37700 3390 121976 -66981 -171961 216103 171987
12370 171987 -195733 370971 154300 -67352 -162291 -53526 285318 -140383 14270 124934
12360 124934 -238819 -93273 -61786 105556 226861 42995 52458 27168 77746 -183651 187492
12348a24938E5542f5399E3805a6401C9232M48037A75471k2304a4755A11060K44211
12337C55271a32167r924I9089B9896N61355A29031K98007a56723D63420A11287
12326B50386J32165A79867J41233a74350C36622j56462J37575n8767E0160J74698
12316B24858N4169R6488A43332j2222a41160K7942j63354c3004B52779A01047
12305I1199d6500C25882q1605B17a30587G9638Q5737j2892Q461E7282c6732A41555
12292A74725E3962b453q1576j2522B48736J35876a35377B67875Q151D7613J49792
12281A97405D8266R5454j3099k3425O173J29051i7897M4295j32889A13342g8970
12269B26192b53796B87504m7552L24780B70771j01915J36881j17900I1688J40627
$$ plain form
12348 -124938 55542 -65399 53805 -16401 39232 487269 175471 153167 -14755 111060 355271
12337 355271 -132167 -142091 99089 29896 591251 129031 427038 -156723 463420 111287
12326 250386 382551 179867 321100 -174350 336622 180160 317735 258968 50160 224858
12316 224858 279027 375515 143332 131110 -141160 -113218 -276572 -33004 252779 101047
12305 91199 -46500 325882 244277 217 -130587 79638 165375 152483 160944 57282 -36732 141555
12292 174725 53962 -2453 -84029 -96551 248736 384612 -135377 267875 276026 47613 197405
12281 197405 48266 143720 130621 107196 113369 242420 -97897 -53602 -186491 113342 -78970
12269 226192 -253796 287504 239952 564732 270771 168856 305737 187837 91688 232315
12259B32315L832c7635D16178p7244j63355M2334J9792K22384b10005A72614d48925
12247C63899A03052E484M99497A09019A2026K29999a69612B97907E8032d4030
12236h9727A16484n7881n811a60050C17568A51755K3070D3724J43909G8396O8832
12225A47228R5299K35146j11527A6354M5370J66397q6540K77596A16696R3841
12215B10537e569A37769J21857q9412l9600L234R3985D8550a9025B12585J1781
12204B24366k9169J09645q7296J23753A44819P0049l1411J51780A38647L61877
12194E00524j89488r2661B9090Q0869J59641M44522A35380J20148g6002k202B53655
12182B03365a1863A93276k5333m728H1473M5995a77521C80713G0723K19973j27219
$$ plain form
12259 232315 236147 -37635 416178 338934 175579 217913 237705 460089 -210005 172614 -448925
12247 363899 103052 5484 504981 109019 12026 242025 -169612 297907 58032 -44030
12236 -89727 116484 58603 52792 -160050 317568 151755 174825 43724 187633 78396 147228
12225 147228 242527 477673 366146 16354 61724 228121 141581 419177 116696 210537
12215 210537 -5569 137769 259626 170214 130614 133848 227833 48550 -19025 212585 224366
12204 224366 195197 304842 217546 341299 144819 214868 183457 335237 138647 500524
12194 500524 311036 218375 29090 109959 269600 714122 135380 255528 -76002 -78204 253655
12182 203365 -11863 193276 167943 163215 81473 127468 -177521 380713 70723 290696 163477
12171A63477J55076J04910r6214j13444r950n9539J72433p8861Q9754d5076B41484
12159B2009J71016K25467k575A36743N3252A6882K46389j12485J40825a61365
12148A27084b4009C5805K09891j08579b96314A58450b52220A23153K8559a24817
12137I2752g2274A22518K00883F583J19136F1004a66031G65703a75241C73027
12126C6098g4788B07284r8447a23567H3514k3220K71586j33450O8749K42027A00780
12114a00710m6938I4518K86140o9548c4745A87273f1839C94353E5425J23103a80873
12102A99650f4067F0877c08059G6343K08236j3019d0607j2202q5607F846M71074
12091D77920I964K11975m6817K10232A03650Q3268q9350B076M4181M16071B24222
$$ plain form
12171 163477 318553 423463 327249 213805 203855 144316 316749 237888 327642 -45076 241484
12159 22009 193025 418492 415917 136743 189995 16882 263271 150786 291611 -161365
12148 127084 -24009 35805 245696 137117 -296314 158450 -252220 123153 151712 -124817
12137 92752 -72274 122518 323401 6583 125719 61004 -166031 765703 -175241 373027
12126 36098 -74788 207284 108837 -123567 83514 60294 331880 198430 267179 509206 100780
12114 -100710 -147648 94518 380658 311110 -34745 187273 -61839 394353 55425 178528 -180873
12102 199650 -64067 60877 -308059 76343 284579 271560 -40607 -52809 -138416 6846 477920
12091 477920 9964 221939 175122 385354 103650 186918 97568 2076 46257 462328 224222
12079A44010D3860J78388L6212J76701A65978a1538B23683b31975D24680A21588
12068A42167J91199G3586a22553A23954j1135L64059E8064A3642c3908l7782A74890
12056A13205f598l08471b3408A09334D9478R4728l1944R3641a39200D14186i4242
12044b06150i2410j05245O2077M6796j34708l0433J05195o622B26184n817F4300
12032A46128J4424m1774j3206m7190j4695d5677A94108H3787b15920F34048c85653
12020e29369d2762E4974a45582f5025B65204g9668r3272L412K5220N5754B59520
12008f0817A60337E1339M0574b04007B53134I0912C7509K9167O62R2053b40913
11996C8642b50561F9911J69766a1931q9326a8802F1069a69803D2467c29880F0130
$$ plain form
12079 144010 43860 222248 258460 435161 165978 -11538 223683 -231975 424680 121588
12068 142167 333366 73586 -122553 123954 112819 476878 58064 13642 -33908 -71690 174890
12056 113205 -6598 -315069 -23408 109334 49478 144206 112262 205903 -139200 414186 -94242
12044 -206150 -92410 -197655 -135578 -88782 -223490 -253923 -148728 -155350 226184 220367 64300
12032 146128 160552 118778 105572 58382 43687 -45677 194108 83787 -215920 634048 -385653
12020 -529369 -42762 54974 -145582 -65025 265204 -79668 -172940 -169528 -144308 -88554 259520
12008 -60817 160337 51339 91913 -204007 253134 90912 37509 66676 67338 159391 -240913
11996 38642 -250561 69911 239677 -11931 -101257 -18802 61069 -169803 42467 -329880 60130
11984C90787I4158L980a15141L2637j37486i1968A42630c15005H9437b40343M6122
11973a94221B6985b96755G3929a77230L4069A56870Q0758c56371B236a25866j04200
11962b30066O2221D3982K21638a28977k92703d4248A07466c35064A00339a22113
11951b15338j40666a30916j72888a43005F3426B3078i5340B7121f5642j669k66591
11940c33902C7712N395J45419a45873L9812G8676a86766A7442a87024A18857C9605
11928c62691F9310a41912b7482A67437J40065q5878H1852d09633A2608L77279
11918C89887G9849J19482K0193a61814d9397k6017A07326b34025A25674m0653
11908H5021a34251A26036k9186P6042J21826b45543B48924h6803p9450J1408C15671
$$ plain form
11984 390787 94158 98138 -115141 -82504 -219990 -91968 142630 -315005 89437 -240343 -194221
11973 -194221 26985 -296755 73929 -177230 -143161 156870 237628 -356371 2236 -125866 -230066
11962 -230066 -167845 43982 265620 -128977 -421680 -44248 107466 -335064 100339 -122113
11951 -215338 -356004 -130916 -303804 -143005 63426 23078 -95340 27121 -65642 -67311 -333902
11940 -333902 37712 43107 188526 -145873 -106061 78676 -186766 17442 -187024 118857 39605
11928 -362691 69310 -141912 -27482 167437 307502 221624 81852 -409633 12608 389887
11918 389887 79849 199331 219524 -161814 -49397 -75414 107326 -234025 125674 85021
11908 85021 -134251 126036 96850 172892 294718 -245543 248924 -86803 -166253 -154845 315671
11896a5278G7359e45696d8A79727a11885A51429C0584O7862J69005d1897j5006
11885e6903k66144b9520A09746m1954A8283R4361J45534g3338C2809R8141b3614
11873c62947F5495K10050G8412a21074a8795F3880J04540n0700b74701A14415
11862b64000J765Q2757B97719b21103a05846B1934a97883R0694j06085M6573B53424
11850a29946A35181r188a64829D78485a37026K007a5216A39442b15189M3763g3296
11838A71154i9495a9960A49083P4575C5365j0874J14230a28410I1464J80413A20664
11826a45577A480f6849G0062a34295N4835q6238J7124j72497a4601j55787A71103
11814a33592A58925D3624b0574j47704B4099c64566e5151r5244P3750B18439e256
$$ plain form
11896 -15278 77359 -545696 -48 179727 -111885 151429 30584 98446 267451 -41897 -56903
11885 -56903 -323047 -29520 109746 67792 18283 112644 258178 -73338 32809 130950 -23614
11873 -362947 65495 275545 78412 -121074 -18795 63880 168420 117720 -274701 114415
11862 -264000 -262235 -179478 297719 -221103 -105846 21934 -197883 -107189 -213274 -166701 253424
11850 -129946 135181 125993 -164829 478485 -137026 -135019 -15216 139442 -215189 -171426 -73296
11838 171154 -99495 -19960 149083 223658 35365 24491 138721 -128410 91464 271877 120664
11826 -145577 1480 -66849 70062 -134295 -79460 -165698 -148574 -321071 -14601 -170388 171103
11814 -133592 158925 43624 -20574 -168278 24099 -364566 -55151 -150395 -76645 218439 -5256
11802D198M2216e19444a78991N4258B33290b30531O9733m3732l8733N6018A58200
11790B87216b01911A2949h0349a4942J808o9253A08773a37339d3437A10337r493
11779A00844g3328k06412D0185a30432A41093a09009D9414M436P7053F3400j5054
11768D8346e47220A95871D0181d4377j91272C2322L0703O3403a56776o5468j68677
11757c90921h0322J9016m7476A1716a45684N1677K6367k8033A64631a97931I4713
11745D4240c38279B94485F9843a32932J8453G0069K6205c09989e8350m3021p6536
11734a77907c2775p5305A28554c28118G8146a04998H3543c0888A72949a410G3208
11722h5951P030r311L8009j13174A33557J21537j25885g3439A50136g0709A66903
$$ plain form
11802 4198 46414 -519444 -178991 -124733 233290 -230531 -160798 -204530 -243263 -187245 158200
11790 287216 -201911 12949 -80349 -14942 -13134 -82387 108773 -137339 -43437 110337 100844
11779 100844 -73328 -279740 40185 -130432 141093 -109009 49414 53850 130903 63400 48346
11768 48346 -547220 195871 40181 -44377 -235649 32322 63025 126428 -156776 -222244 -390921
11757 -390921 -80322 -61306 -108782 11716 -145684 -94007 -67640 -95673 164631 -197931 94713
11745 44240 -338279 294485 69843 -132932 -114479 70069 96274 -309989 -58350 -101371 -177907
11734 -177907 -32775 -108080 128554 -328118 78146 -104998 83543 -30888 172949 -1410 73208
11722 -85951 -78921 -88232 -50223 -163397 133557 255094 129209 -73439 150136 -70709 166903
11710G831a78922k4888i6160k41550A28690a44197A47153a22848A41121J53223
11700B94344F26a79803N0758A01583a5372A99147l7466K3933a3295k05185A99925
11688b1254C4286g4625a7622j56497A35776J29739G5564J27757B0870H22K49966
11677B50788n1682J54508a56484K5328e2808l5343L8502A39755a07064A64857
11666A50923a69651B64870C2100i0735c2924B745Q1387i4410N337a1251A2678
11654G8066h6221C3282a83657O5608K3436B43043q8899c1553A97068H0649P7920
11643A58569b30228J12425k433o4591A64014b64743N6066l9204G5628J71705a37649
11631A39561i6017A25836d1975m6511j01414B77029r4678b311m8816j70199E1521
$$ plain form
11710 7831 -178922 -203810 -96160 -337710 128690 -144197 147153 -122848 141121 294344
11700 294344 626 -179803 -129045 101583 -15372 199147 161681 185614 -13295 -218480 199925
11688 -21254 34286 -74625 -17622 -174119 135776 265515 75564 203321 20870 822 250788
11677 250788 199106 353614 -156484 -131156 -52808 -88151 -49649 139755 -107064 164857
11666 150923 -169651 264870 32100 -90735 -32924 2745 84132 -94410 -89073 -11251 12678
11654 78066 -86221 33282 -183657 -118049 -94613 243043 154144 -31553 197068 80649 158569
11643 158569 -230228 -117803 -120236 -184827 164014 -264743 -208677 -247881 75628 247333 -137649
11631 139561 -96017 125836 -41975 -88486 -189900 277029 182351 -2311 -51127 -221326 51521
11619B81P3942J89784H7670Q26c4633G0601J56106D1048A0955c9627C2038g2511
11606B636J69185b71775i5956a2340n1770k07D2366O6962c58125H1353a01422
11594F7436A0748K85350A38485a22351A02283b61571H3890B644K48416b01115
11583f7256C81322a41756B35854m7262Q087K850a52293J592j27919I236l746d8649
11570b49159A0106L81095j12630P0722A26159E2188K99565F201a5203k26010i5168
11558I512M8813f6177A1844a4499k1638A67705a16678L275B38848a07588B75063
11546a91662b4022G4163L2688a03389K935A36709a6753l19669E5135K44268b52582
11534C70848e8625F6264F444r38g5134I204N9457c9740E2097i9640d3249a8584
$$ plain form
11619 281 74223 264007 87670 88496 -34633 70601 226707 41048 10955 -39627 32038 -72511
11606 2636 171821 -271775 -95956 -12340 -64110 -64317 42366 109328 -358125 81353 -101422
11594 67436 10748 296098 138485 -122351 102283 -261571 83890 2644 251060 -201115
11583 -67256 381322 -141756 235854 188592 196679 199529 -152293 -150701 -278620 9236 5490 -48649
11570 -249159 10106 391201 278571 349293 126159 52188 351753 6201 -15203 -241213 -95168
11558 9512 58325 -66177 11844 -14499 -36137 167705 -116678 -113403 238848 -107588 275063
11546 -191662 -24022 74163 106851 -103389 -100454 136709 -16753 -336422 55135 299403 -252582
11534 370848 -58625 66264 6444 5506 -75134 9204 68661 -39740 52097 -99640 -43249 -18584
11521a4930D09695a05488C26803G2842K12213F6573a05748M4811j4772j36881
11511b12590C46300A00242f3503I4011Q0167b36664b2313B72153j9643E5424h7677
11499a40941B24387j11855P2541n9042C7214K3878L64825H6271P4604A179J70819
11488A71998C6825a45786A24400K56602B0173c4464B51100A7454K81240b7801
11477c3389A05480L03456G0275j2580k5034R7462P9854Q2336J46874A38704P0672
11466B09376m840p0342K2940Q0855J93310q9455J933A58464l0141O996d147E3301
11453A01446h416A94849m1936J27540d5713l2782j20814A26796k4071C7509h9783
11441A82683a30280e4369C59396j44289o7806j5708B2590a22843B278a98004I3408
$$ plain form
11521 -14930 409695 -105488 326803 72842 285055 66573 -105748 -60937 -75709 -212590
11511 -212590 346300 100242 -63503 94011 174178 -236664 -22313 272153 252510 55424 -87677
11499 -140941 224387 112532 185073 126031 37214 61092 425917 86271 160875 1179 171998
11488 171998 36825 -145786 124400 381002 20173 -34464 251100 17454 298694 -27801
11477 -33389 105480 408936 70275 57695 32661 130123 209977 292313 439187 138704 209376
11466 209376 204536 134194 157134 237989 431299 341844 343777 158464 128323 135319 -4147 53301
11453 101446 -8416 194849 152913 280453 -45713 -78495 -199309 126796 102725 37509 -89783
11441 182683 -130280 -54369 359396 215107 147301 131593 22590 -122843 2278 -198004 93408
11429E2411i8609B72367f8264c0281k10230A88135l9783b7593p337I6645K39897
11418C36542c1306B49131D1057b44435h3238A1422d3052r6800m9823B11852J52387
11407C64239j62445b00261A46964P5881a89797B74109c13805J25896o3354b7320
11396C350J75991a94295q8702h8024B87812a25097q4246J4104A81791k579a014
11384I7560c01920A55378a04252A71904a83136A07320m2474J72680C1637K43860
11374B75497I5877C4140J93269a83150D3095a90806N7906A86295D0018b80709
11363a08724G7914l1843K71146I8786a35972M2045H8971J9733K35C7457e258j00812
11351a06070a8693j65061D045e81167G4151c13964J45694b6386p979j67767j33105
$$ plain form
11429 52411 -98609 272367 -68264 -30281 -240511 188135 148352 -27593 -34930 96645 336542
11418 336542 -31306 249131 41057 -244435 -83238 11422 -43052 -139852 -189675 211852 364239
11407 364239 201794 -200261 146964 222845 -189797 274109 -313805 -187909 -251263 -27320
11396 3350 179341 -194295 -282997 -88024 287812 -125097 -209343 -195239 181791 179212 -1014
11384 97560 -301920 155378 -104252 171904 -183136 107320 64846 237526 31637 275497
11374 275497 95877 34140 227409 -183150 43095 -190806 -132900 186295 40018 -280709
11363 -108724 77914 46071 317217 98786 -135972 -93927 88971 108704 108939 37457 -5258 -106070
11351 -106070 -18693 -183754 4045 -581167 74151 -313964 -168270 -26386 -34365 -202132 -335237
11340c35237H1434K6560c35159A25460m0261J12405G0577C1652a04248p8521H5014
11328a98746A91301h2126G9837c11609a35469I192K5146b71820r8614A8011b18654
11316a32216k34988B88521A23391J47979a68834J8823e6421j75712M1722k799
11306a93210l5629k8522B60183e19160c2431l84353a34711k6290c497j85828o5222
11295b54547b5259p8372c3558K014l6814b5464j4652n1635k63925B18238b56308
11283c72503a76762b6705n8686J8771k481k5716J9548A69740p4461E045h2317
11271B00930h4602j9397F8039B9150i8167l7754O6962E5747B3921b1854l5951
11260e7805m4444k0700C7375g0823j2163l4868a7899k68630K1410H4918e8027
$$ plain form
11340 -335237 81434 107994 -335159 125460 85199 197604 70577 31652 -104248 -182769 85014
11328 -198746 191301 -82126 79837 -311609 -135469 9192 34338 -271820 -370434 18011 -218654
11316 -132216 -367204 288521 123391 271370 -168834 -150011 -56421 -232133 -190411 -193210
11306 -193210 -228839 -257361 260183 -519160 -32431 -416784 -134711 -161001 -3497 -189325 -254547
11295 -254547 -25259 -103631 -33558 -31544 -68358 -25464 -40116 -91751 -355676 218238 -256308
11283 -372503 -176762 -26705 -85391 -66620 -69101 -94817 -75269 169740 95279 5045 -82317
11271 200930 -84602 -103999 68039 29150 -98167 -135921 -68959 55747 23921 -21854 -57805
11260 -57805 -102249 -122949 37375 -70823 -82986 -117854 -17899 -286529 -265119 84918 -58027
11248c78395C3046J54978b0009B30501A7282b92103j2597c3060K86j22427H1670
11236A55682J05395e0080d03k2136p8462l14572b3191B4477J44106j6274n7368
11225I4941h3347D109K0158h8979r5854j11646E038g5575f70k1620j77969j500
11213b01759k07959D3775b7645j5482j57664B58022M9094b9363k99221n5996C2762
11201d95677H4448c25948a16777A02585m142b61012P3191d2552A49673B277L7323
11190C9600M0480a83944j59706h6622j07764a3000k08215g4018A01742d1117j140
11179d2257r1138m1954G2046f6874j5962A18748r377g3914a4527k54722e4340
11167b23942A76280h9079a4076k12837a09701C25097a78578A15959b00963h7868
$$ plain form
11248 -378395 33046 188024 -20009 230501 17282 -292103 -304700 -33060 -32774 -155201 81670
11236 155682 261077 -50080 -403 -22539 -101001 -415573 -23191 24477 168583 152309 94941
11225 94941 -83347 4109 24267 -88979 -184833 -296479 5038 -75575 -670 -22290 -200259 -201759
11213 -201759 -409718 43775 -27645 -43127 -200791 258022 307116 -29363 -328584 -384580 32762
11201 -495677 84448 -325948 -116777 102585 98443 -261012 -187821 -42552 149673 2277 39600
11190 39600 80080 -183944 -343650 -86622 -194386 -13000 -221215 -74018 101742 -41117 -42257
11179 -42257 -133395 -175349 72046 -66874 -82836 118748 109371 -73914 -14527 -269249 -54340
11167 -223942 176280 -89079 -14076 -226913 -109701 325097 -178578 115959 -200963 -87868
11156A46590B2290g0717o4840j42690D9134k2591a37055I2353d41403B9930h8590
11144c11239e3719q5778J444m1923L5938f3995D53777E7494P9513b74771b4400
11132b444j0195A59733k8758i5005B12581f4021A58291N6947a40581E03620a5187
11120B57681B3963b03064A43273i7431c6489B34141a10236A68422J08485a864
11109F1399j5853e4348B80018I2294e070C2512K52798a18019B32701p3783L02745
11098D61663B04524o8650C8857K27663m8566q3753M3876j8803K87096A68448g2246
11086D365K58558L17131k58032E3306J75038M34419B76649d4944E80448A65737
11075D27345B05013K42311K4903k14911J40892r0522p3558P4460n2112D8417K58042
$$ plain form
11156 146590 22290 -70717 -135557 -278247 49134 26543 -137055 92353 -441403 29930 -88590
11144 -311239 -53719 -139497 -138053 -179976 -144038 -63995 453777 57494 137007 -274771 -24400
11132 -2444 -12639 159733 130975 -95005 212581 -64021 158291 215238 -140581 503620 -15187
11120 257681 23963 -203064 143273 -97431 -36489 234141 -110236 168422 276907 -1864
11109 61399 45546 -54348 280018 92294 -5070 32512 285310 -118019 232701 158918 461663
11098 461663 204524 135874 38857 266520 217954 134201 178077 159274 446370 168448 -72246
11086 4365 262923 580054 322022 53306 228344 662763 276649 -44944 580448 165737
11075 427345 205013 447324 472227 257316 398208 307686 234128 308588 256476 48417 306459
11064C06459L89855o0163n0393A09766K16194K28952j16793j61197L40527K0306
11054F37755k24437K51619Q0733K74419m24465j31257J40428L81798k26933J71390
11044I31050j66410J97159k50452L78324o8166k48322R3818k32572J59097M88474
11034A282000o24772L65077k04915o958L04047m01112q0474K23814j20694O6392
11024H02405K52864k84846r9867J13162J16949m9486j33027L4890k65541N82300
11014A069803j69901k68842j28433O0039k239K40131k26776k5624M51189l24351
11004F74996K04359m10917J19371N1486K87759k42134q4255n7897K70193n1373
10994G61588l17815L32693l57713K40458k02615J92273L89923m25988K5196J05674
$$ plain form
11064 306459 696314 636151 585758 109766 325960 554912 438119 276922 617449 637755
11054 637755 413318 664937 745670 1020089 595624 464367 604795 986593 759660 931050
11044 931050 764640 961799 711347 1089671 1021505 773183 867001 634429 793526 1282000
11034 1282000 657228 1022305 817390 810432 1114479 713367 632893 856707 736013 802405
11024 802405 1055269 770423 670556 783718 900667 851181 718154 753044 487503 1069803
11014 1069803 899902 631060 502627 562666 560427 800558 573782 548158 999347 674996
11004 674996 879355 468438 587809 639295 927054 684920 600665 542768 812961 761588
10994 761588 443773 776466 418753 659211 456596 648869 1038792 612804 638000 743674
10984G43674L9001J1549K79559k70750J02127K03388L55530J71726k72680k72741
10974A090383N47181L11541K40377K51815K01174j49424Q31839n54085K75370
10965C046171K39439j65832N6029n82477j57190n28775K2056l37008L3478o9458
10955A556433K51974m3868l68309L98533m59205L09021p16461r4451M0176J98013
10945A071856l19322C47563K90836o0654O936A36073K11767A17609K19021j47995
10935A88635o3559K301a33697A89432r868f8395n6697C17302c3115B62390r3526
10924A68864b16665B21996E9030K67932j55783M2973n9194c72457B2141P1378
10914I3519g9758B07480o1100J31355e3311D02699D8435d9290k38054h496B67452
$$ plain form
10984 743674 782675 794224 1073783 803033 905160 1108548 1464078 1635804 1363124 1090383
10974 1090383 1637564 1949105 2189482 2441297 2642471 2493047 3324886 2770801 3046171
10965 3046171 3285610 3119778 3175807 2593330 2436140 1907365 1929421 1592413 1625891 1556433
10955 1556433 1808407 1764539 1396230 1794763 1335558 1644579 928118 833667 873843 1071856
10945 1071856 752534 347563 638399 577745 584681 136073 347840 117609 336630 188635
10935 188635 125076 127377 -133697 189432 179564 -68395 -125092 317302 -33115 262390 168864
10924 168864 -216665 221996 59030 326962 171179 214152 154958 -372457 22141 93519
10914 93519 -79758 207480 146380 277735 -53311 402699 48435 -49290 -287344 -8496 267452
10902c5387l1309k03679N019o8177h7451F760K56460B8353h8080A08235a02622
10890c1213j46926a8072A77194K9619c2180G3346e6878A26091D1880b45887A30807
10878a111o6605j57858j6570r0725a59937c1678A31019b20638b3832A9884J61008
10867A80892J0094a31797j0477B98496a02266D3050e9100j47877C5971a37837
10856b51719A21421M3042K4779B5579a18375j5309j56119k03433f2586l342m3743
10845a09671A4054h1943N068B06726Q3582m0320c04738c6531B10888E8516c39960
10833E0431b63886f7402P34A64445a92717C9353K49508a14406p911B25553A5314
10821b96755A6700a34669H4352Q4090h2855B78803E6001A1J53345e7167D1051
$$ plain form
10902 -35387 -66696 -270375 -265356 -333533 -87451 6760 263220 28353 -88080 108235 -102622
10890 -31213 -178139 -18072 177194 206813 -32180 73346 -56878 126091 41880 -245887 130807
10878 -1111 -67716 -225574 -242144 -332869 -159937 -31678 131019 -220638 -23832 19884 180892
10867 180892 190986 -131797 -142274 298496 -102266 43050 -59100 -206977 35971 -137837
10856 -251719 121421 164463 189242 25579 -118375 -133684 -289803 -493236 -62586 -65928 -109671
10845 -109671 14054 -81943 -76875 206726 290308 249988 -304738 -36531 210888 58516 -339960
10833 50431 -263886 -67402 -66668 164445 -192717 39353 288861 -114406 -122317 225553 15314
10821 -296755 16700 -134669 84352 168442 -82855 278803 56001 11 153356 -57167 41051
10809A04719h4355A8324f800C7684a28905C3350b98459L9078H8292c9170F0947
10797a13154C953a35246I0980J0469b1619B8803e8136F3172a91464a9466i386
10785a94734e7607j00046f537j46493j65615O8219j56503G3380d6659n6881B0024
10773b34626a10641d9064j16953D3017a30750D8278K26598f6249P503A97237c89991
10761G7073b0128k72799A04528D1951J29394a72659N3473b3541i946k6835r1277
10750a28058j84734d8105B01217e04454b38906a10645l7555H8019l7853b68117
10739i3912j23598b7825B8887J7939f2213D7008J03678k0974a58914d483o0971
10728f5454H4354b23255k02586b07729M2737l16799a02966E2937P760b52797g4861
$$ plain form
10809 104719 -84355 18324 -6800 37684 -128905 33350 -298459 -259381 88292 -39170 60947
10797 -113154 3953 -135246 90980 101449 -21619 28803 -58136 63172 -191464 -19466 -9386
10785 -194734 -57607 -157653 -6537 -153030 -318645 -250426 -406929 73380 -46659 -103540 20024
10773 -234626 -110641 -49064 -166017 43017 -130750 48278 274876 -66249 -58746 197237 -389991
10761 77073 -20128 -292927 104528 41951 171345 -172659 -119186 -23541 -9946 -36781 -128058
10750 -128058 -312792 -48105 201217 -504454 -238906 -110645 -148200 88019 50166 -268117
10739 -93912 -217510 -27825 28887 46826 -62213 47008 150686 129712 -158914 -4483 -65454
10728 -65454 84354 -223255 -425841 -207729 -164992 -481791 -102966 52937 60697 -252797 -74861
10716e61389d2361B4438b35554d5991K2441k72361j66610k1143g8208c3541p7818
10705a11359d2556A57507a00357l2911A55483d5766p1471k05909J46659h943m3583
10694e2526M312k83380a2330k52531J32374B28650A10021d15m82605a05758P47
10683a05011A82991b17249F8081b95313P7066B25369b15078N6166I1279g6861
10672b67576A06902a89006j13169a48252N3267K9519J9969p8703c2643A96735
10661b3607j20750j21866J28396K2344I1385a62470A02626O5499e2696J7119A43986
10649c54627B05881q6513a03173d4467I0153b83625h3745K3664j75182O9639A69293
10637a39198q7958D8213a75859L1050E6728a93302Q6369q3893i1702J5016C12729
$$ plain form
10716 -561389 -42361 24438 -235554 -45991 -23550 -295911 -462521 -483664 -78208 -33541 -111359
10705 -111359 -42556 157507 -100357 -133268 155483 -45766 -117237 -323146 -176487 -8943 -52526
10694 -52526 -48214 -331594 -12330 -264861 -132487 228650 110021 -415 -483020 -105758 -105011
10683 -105011 182991 -217249 68081 -295313 -218247 225369 -215078 -158912 91279 -76861
10672 -267576 106902 -189006 -302175 -148252 -94985 -65466 -45497 -124200 -32643 196735
10661 -23607 -144357 -266223 -137827 -115483 91385 -162470 102626 168125 -52696 -35577 143986
10649 -354627 205881 119368 -103173 -44467 90153 -283625 -83745 -60081 -235263 -165624 169293
10637 -139198 -227156 48213 -175859 -144809 56728 -193302 -106933 -190826 -91702 -76686 312729
10625a11373B264e1147A57761c49066J70256e0641j59531a019j14575j64185B98528
10613C3a32886G9407a13631A13066K07556c08843J37037f2500j2125L5552A23694
10601i9500o3974C22010c62051a57775A25683k5658d7714j35082j06737B18757
10590b06355O6710e5129j67493K2520f1467n4172j05155a9794I2259D4166b78840
10578a62301B07821c01177A07729a78724g0052k36479a17907j2484A2423K05771
10568B18194j07074f2940E3008J28732c741B7370a03314B23849A9739b63271b0337
10556A64543N104b26707D8403a00106j2202j33737h431r0662H150a91712f7255
10544C8048M8878c58342a47413j15625A19675M416l2943h8930k7006l7521C3332
$$ plain form
10625 -111373 2264 -51147 157761 -349066 -178810 -50641 -210172 -1019 -115594 -279779 298528
10613 33 -132886 79407 -113631 113066 320622 -308843 -171806 -62500 -74625 -39073 123694
10601 -99500 -163474 322010 -362051 -157775 125683 100025 -47714 -182796 -289533 218757
10590 -206355 -139645 -55129 -222622 -200102 -61467 -115639 -220794 -19794 92259 44166 -278840
10578 -162301 207821 -301177 107729 -178724 -70052 -306531 -117907 -130391 12423 218194
10568 218194 111120 -62940 53008 181740 -3741 27370 -103314 223849 19739 -263271 -20337
10556 164543 169647 -226707 48403 -100106 -112308 -246045 -8431 -99093 8150 -191712 -67255
10544 38048 86926 -358342 -147413 -263038 119675 124091 91148 -88930 -115936 -153457 33332
10532b37096P8818d8897q997A29631b18305A52612d13206b02567a3834A06274
10521a88648B49217c2361C6544N1369f8879L2402A99519d5616B81047B0907R9405
10510A20312A3273R764b27698B3718i2587A29387h6080I6244i5238l05143D9847
10498c9300j06022B12934n5563c1749k75684a46241M1496A27154a05939o9830
10488a75769J912F1120e1102a4209C49278b15679h320j77957j62495C12723C54
10476B83606P9472a49960C17339j16528J22622l7401i5547A14827G642e2026j45244
10465a97270a2112C06928i5536F0672A9773I195L02457A7566N505i0757E9251
10453A83449a66649j42958a26399l1613c3853a6448r9814B54695a80712P8751
$$ plain form
10532 -237096 -158278 -48897 -57894 129631 -218305 152612 -413206 -202567 -13834 106274
10521 -188648 249217 -32361 36544 87913 -68879 -36477 199519 -45616 281047 20907 120312
10510 120312 13273 23037 -227698 23718 -92587 129387 -86080 96244 -95238 -400381 49847
10498 -39300 -145322 212934 157371 -31749 -307433 -146241 -104745 127154 -105939 -175769
10488 -175769 -173857 61120 -51102 -14209 349278 -215679 -8320 -186277 -348772 312723 354
10476 283606 363078 -149960 317339 200811 323433 286032 -95547 114827 7642 -52026 -197270
10465 -197270 -12112 306928 -95536 60672 19773 9195 311652 17566 23071 -90757 59251
10453 183449 -166649 -309607 -126399 -158012 -33853 -16448 -116262 254695 -180712 -101961
10443a01961M5303A115c26114a21368o9463B5045L5370K98459A36743a6584r1828
10432a08412A85878a24141b283j29495A54985M373c92876A44667f1281A95196
10421C86869a90998A91929i8302j0013B51170a11270L9591A31731a52633k75414
10411d28047a47577l5122A64154D3988b73991J14935f2946j24200A82004j9610
10401A62394l1665b46873b4762A01139J69945A01157J15237r17c05738C3214k410
10390C0804N1531J48662C0232R9566f3767P125A6409K20107b7270j18493A36223
10378A6876J7596K61100j9597j07118K82295A72489J790a67006I1932N75327k33611
10367D33648j08195K30787A28623M84952n1877j34173A13631K33643P686N7327
$$ plain form
10443 -101961 -56658 1115 -326114 -121368 -190831 25045 60415 358874 136743 -16584 -108412
10432 -108412 185878 -124141 -2283 -131778 154985 159358 -392876 144667 -61281 195196
10421 386869 -190998 191929 -98302 -108315 251170 -111270 -71679 131731 -152633 -428047
10411 -428047 -147577 -182699 164154 43988 -273991 -159056 -62946 -187146 182004 162394
10401 162394 130729 -246873 -24762 101139 271084 101157 216394 215477 -305738 33214 30804
10390 30804 82335 230997 30232 129798 -63767 -56642 16409 236516 -27270 -145763 136223
10378 16876 34472 295572 275975 168857 451152 172489 174279 -167006 91932 667259 433648
10367 433648 325453 556240 128623 613575 561698 427525 113631 347274 354960 412287
10357D12287j91452m918h9158d3462C00015K24516D0280M90740J92462J35959
10347H59441k27660J9439l00937j4597L9735j81110K08434M9035j22080j49321
10337A80379J7966h4700F0756q643L8868J33469K18467A88197G1670K3178a90465
10325A34900E5410h6042r7827B05614j8282J60662b42250D30177H5428J3656J49416
10314B48500K39568b80889c2780r6174A18344O3869b30273J02295A62202B6308
10303h9864A80335G1442H347J02851M5349d9986j07399k4426E4063e7935j76933
10292b34868A21612O3399G0809h2670m3439o643M7731K2316G9268K0301G606a07460
10279D01273F3702f7144L699k77099A76757d07574a94037e3042n5820B23587b14332
$$ plain form
10357 412287 220835 215917 -89158 -43462 300015 524531 40280 531020 723482 859441
10347 859441 631781 651220 350283 335686 375421 194311 402745 451780 329700 180379
10337 180379 198345 -84700 60756 52113 90981 224450 442917 188197 71670 94848 -190465
10325 134900 55410 -86042 -183869 205614 187332 347994 -242250 430177 85428 99084 248500
10314 248500 488068 -280889 -32780 -128954 118344 182213 -230273 -127978 162202 26308
10303 -89864 180335 71442 8347 111198 156547 -49986 -157385 -181811 54063 -57935 -234868
10292 -234868 121612 185011 70809 -82670 -126109 -132752 -85021 -62705 79268 99569 7606 -107460
10279 401273 63702 -67144 -63445 -340544 176757 -407574 -194037 -53042 -108862 223587 -214332
10267c99396J81556C3879J20652b15762B21789A7175h5818F8641A6837R2308P4678
10256A83823I296K89369j20919K08378O076e3127C98967p3552j52968L56735B1645
10244b1117F3310a07216a9145o4861k41657I2690g9292A97590r3615a27561j39024
10233b66585f3818B6459m990a9913B18759d57589A94767C8409a1488o2043l56394
10222d29925A75367d2651k18987e5662j75217B12031k4823g085k16296B5581a29051
10210b04757A85553a24807K3577k09288d8358E7022b50245A23212b4512F876a5120
10198a72806h500E4667b03369R9001B30577g3150J3434j36938b8507j23656C2390
10186a1097j04404E0476j1870b25089f8412A13922d0681k52028c6741A19408Q1862
$$ plain form
10267 -399396 -217840 33879 154531 -215762 221789 17175 -85818 68641 16837 109145 183823
10256 183823 9296 298665 177746 386124 392200 -53127 398967 325415 172447 529182 21645
10244 -21117 63310 -107216 -19145 -84006 -325663 92690 -79292 197590 103975 -127561 -266585
10233 -266585 -63818 26459 21469 -19913 218759 -457589 194767 38409 -11488 -73531 -429925
10222 -429925 175367 -42651 -261638 -55662 -230879 212031 187208 -7085 -223381 25581 -129051
10210 -204757 185553 -124807 -101230 -310518 -48358 57022 -250245 123212 -24512 6876 -15120
10198 -172806 -8500 54667 -203369 -104368 230577 -73150 -59716 -196654 -28507 -152163 32390
10186 -11097 -115501 50476 38606 -225089 -68412 113922 -40681 -292709 -36741 119408 201270
10175B01270g2579k5951n247n8477P6278p8538N8354C7605g6665J1473o554A99635
10162h9893m3748H2212L93527c8312l2556k86873d9001J1591k60389b5593A01213
10150C86799a3270l8999I6826a04496j74664d4155j10679A45428b7717j77799
10140b05516L8753A66312f6349E5823b3728k17060j37553J63983c8840k25365
10130b64205p3508L2956A9369b2549D1558b35586j87572G9833b8815H202b58694
10118a06933j34479J00656M7895k2976A69775c62850A30971g635j23727q4010
10108b15372A32844a38034a8588A89744B9474a77594E795J83008A9516a10500
10097c61571A52521d22624D8978A5756c93489c2601j22089G0797c19959g624K884
$$ plain form
10175 201270 -72579 -98530 -103777 -162254 -85976 -164514 -106160 37605 -76665 -65192 -71746 199635
10162 -89893 -133641 82212 475739 -38312 -70868 -357741 -49001 -37410 -297799 -25593 101213
10150 386799 -13270 -52269 96826 -104496 -279160 -44155 -154834 145428 -27717 -205516
10140 -205516 -166763 166312 -66349 55823 -23728 -240788 -378341 -214358 -38840 -264205
10130 -264205 -337713 -304757 19369 -22549 41558 -235586 -423158 79833 -28815 8202 -258694
10118 -106933 -241412 -140756 -92861 -115837 169775 -362850 130971 -7635 -131362 -215372
10108 -215372 132844 -138034 -18588 189744 29474 -177594 5795 188803 19516 -110500
10097 -361571 152521 -422624 48978 15756 -393489 -32601 -154690 70797 -319959 -7624 -4740
10086d740l7399a788k59271B1029c11931h7077j0151q7594q2919M9029A02846
10074A15150g8601A72924a65714j50099A65460o2235k8683a3956j51272B31762
10063b61829O7744C06946b56329c8104k33585A5088J4188a34761j93306J4554
10053c13513a35926A64408g8013j00670q6251B49495n4063h1634b4675k59911
10043b84586B1841a05602A73540G7776k3471a76116O0069q498N0884n9171j27117
10032b59949l8565Q4517L7899H903a02349D8168a11998k81511a61861d0678H5750
10020d7567I1738J13926E6640f8561l77419E4899i9102k72835J82871A00669a87808
10008b67038K2461K6491k33748A09074n4183A110a93090F3732a32677A02741b17113
$$ plain form
10086 -4740 -42139 -1788 -261059 21029 -311931 -87077 -97228 -184822 -267741 -218712 102846
10074 115150 -78601 172924 -165714 -315813 165460 103225 74542 -13956 -165228 231762
10063 -261829 -194085 306946 -256329 -38104 -271689 15088 29276 -134761 -328067 -313513
10053 -313513 -135926 164408 -78013 -178683 -264934 249495 195432 -81634 -24675 -284586
10043 -284586 21841 -105602 173540 77776 54305 -176116 -116047 -124545 -73661 -132832 -259949
10032 -259949 -298514 -213997 -176098 8903 -102349 48168 -111998 -393509 -161861 -40678 85750
10020 -47567 91738 205664 56640 -68561 -445980 54899 -99102 -371937 -189066 100669 -187808
10008 -267038 -244577 -218086 -451834 109074 54891 1110 -193090 63732 -132677 102741 -217113
9996b59115c8010A62632D164a01824n1785C16113j13024b2577m7004m681j29530
9985b03792B20265J44018A81147a9692j76846l9705m9449C7773k740b80500r0048
9974c70548M1368a61608b8613A13726b23922H0833P8165h943j74043B33256j10195
9963A23061Q8700d9394n12491J99143a12715F8139b4268I9461b54640k3064E6327
9951c8631a8548l1589A90023K9737a63625M3531K6683l00129J94389C7875P3154
9940A11029b92267D2199a02056B38207b62521h6436B8843a11293N1249j28339
9930a88383B77804A07333O6945B5153J60595A9805b56454A63323F2176A4108b49185
9918A21342O1061d3606j91844c8882j53780Q9103c683j91853j40203A2895K07111
$$ plain form
9996 -259115 -38010 162632 4164 -101824 -153609 316113 203089 -22577 -69581 -74262 -203792
9985 -203792 220265 364283 181147 -19692 -196538 -236243 -285692 37773 35033 -280500 -370548
9974 -370548 -329180 -161608 -28613 113726 -223922 80833 158998 -8943 -182986 233256 123061
9963 123061 211761 -49394 -561885 -362742 -112715 68139 -24268 99461 -254640 -277704 56327
9951 -38631 -18548 -50137 190023 219760 -163625 -120094 -93411 -393540 -199151 37875 111029
9940 111029 -292267 42199 -102056 238207 -262521 -86436 28843 -111293 -60044 -188383
9930 -188383 277804 107333 174278 25153 185748 19805 -256454 163323 62176 14108 -249185
9918 121342 182403 -43606 -235450 -38882 -192662 -103559 -3683 -195536 -335739 12895 220006
9907B20006f4442F7384b3536l0851A78215D1677c42206E38790d08105P8624J21770
9896b07711C7722a12845c8829j02035B41737e2299n5996e1252j3505j17457d0414
9884a89168A24150b1479a0293l0863j16980A32958b13019A82523D9876a65157
9873b15544P1202e9993A38364b7813A3040i9460a5364j74450J4991j95713I7481
9861b77310f1529j51044N0590f6551D6707a92453M4105L409o0334A14221d12188
9849b54059m4010a47795j5380c586m1555B9481P8114h01I9895c38323g8133k5924
9837a04057k77696L2261h6218b6715C5491c60902B41507h8578M353B10861g9755
9825A40397C8030a06475I3533b15333e515k38314i3171L2485E7830c4910E8706
$$ plain form
9907 220006 -64442 67384 -23536 -54387 178215 41677 -342206 538790 -408105 -329481 -207711
9896 -207711 37722 -112845 -38829 -140864 241737 -52299 -108295 -51252 -64757 -182214 -40414
9884 -189168 124150 -21479 -10293 -41156 -158136 132958 -213019 182523 49876 -165157
9873 -215544 -144342 -59993 138364 -27813 13040 -99460 -15364 -189814 -174823 -370536 97481
9861 -277310 -61529 -212573 -161983 -66551 46707 -192453 -148348 -144939 -205273 114221 -412188
9849 -254059 -298069 -147795 -163175 -3586 -45141 29481 107595 -801 99895 -338323 -78133 -104057
9837 -104057 -381753 -349492 -86218 -26715 35491 -360902 241507 -88578 -84225 210861 -79755
9825 140397 38030 -106475 93533 -215333 -5515 -243829 -93171 -60686 57830 -34910 58706
9813a85491B68923J27796H2497c04705a35282j9475N3641A6911c00176a15200
9802C94704A47871a17317k67258A51062b00327N0108A59057B1471J37274a38443
9791a13607N4767G4255a78625k03238a64333C6605h1950E8196B7742a2015l9357
9780e1372F5170a74668e2866j63351a6575C04790g101j82079l03732J83992J11949
9769a96971I0431k2049d15261c8478k06116O8800n0344j33J04746D1800c30528
9757b18345l049b7542l35227A79126a89371f9919B08645E2781c07007L4634a20349
9745c23885a23871A84204A1105e092b49m9801F3678a39236b7597G486J11511i4181
9732b24832a03569j30112J10059P02A43142b06890h9489b7866C9840a33372A06793
$$ plain form
9813 -185491 268923 396719 82497 -304705 -135282 -154757 -101116 16911 -300176 -115200
9802 394704 147871 -117317 -384575 151062 -200327 -150219 159057 21471 158745 -138443
9791 -113607 -58840 74255 -178625 -381863 -164333 36605 -81950 58196 27742 -12015 -51372
9780 -51372 65170 -174668 -52866 -216217 -16575 304790 -7101 -189180 -492912 -308920 -196971
9769 -196971 90431 68382 -415261 -38478 -244594 -175794 -226138 -226271 -121525 41800 -330528
9757 -218345 -221394 -27542 -362769 179126 -189371 -69919 208645 52781 -307007 -272373 -120349
9745 -323885 -123871 184204 11105 -5092 -249 -50050 63678 -139236 -27597 7486 118997 -94181
9732 -224832 -103569 -233681 -123622 -122920 143142 -206890 -89489 -27866 39840 -133372 106793
9720A2542M4594D993M1152a98323G150a90119c4487l5134b0140B5000c0929j45010
9708a75939Q6677D0577b42418L7351j23873e5249B76684C2199a25508f2332q2082
9697a44414L907F9901d88244B6114J34004d12511a92765B58359F995b02710B2510
9685d9555r479l07760R0044p0202a31802M7710j58914J5876G4492J0443J98758
9674B83693b27286F5154i0752a557n0502k5392F7266c0737k93902b6791I7845
9662I4338a44686j13554M5095k4496A13467b22134A66453e9730B91782H6236a25739
9650C34429a6132l50526c0900k9499G987f7395K327B21378G8054i6786A3648K52503
9638B66151g7957F4512L9230a99275J4682B69647a6961j88023B60388b02448M5455
$$ plain form
9720 12542 57136 4993 46145 -198323 7150 -190119 -34487 -69621 -20140 25000 -30929 -175939
9708 -175939 -89262 40577 -242418 -205067 -328940 -55249 276684 32199 -125508 -62332 -144414
9697 -144414 -140507 69901 -488244 26114 160118 -412511 -192765 258359 6995 -202710 22510
9685 -49555 -59034 -366794 -276750 -346952 -131802 -84092 -243006 -227130 74492 84935 283693
9674 283693 -227286 65154 -90752 -1557 -52059 -77451 67266 -30737 -324639 -26791 97845
9662 94338 -144686 -258240 -213145 -237641 113467 -222134 166453 -59730 291782 86236 -125739
9650 334429 -16132 -366658 -30900 -60399 7987 -67395 -65068 221378 78054 -96786 13648 266151
9638 266151 -77957 64512 103742 -199275 -184593 269647 -16961 -204984 260388 -202448 -156993
9627a56993K6490N7014A04674e786j54078A72731E7391c75631d3289C9181J71404
9616B10585e8296j01408G2535b45165R0105j79040a949m22404a26291M6563O688
9605g3040A52297l3428b01237F1676j2969h3894A82048B014a75184A5753J77300
9594A93053b10272J03160A8805a34844B7359a32109A17140e7096a4213j59931
9584a74144F7463b95361M5007R5902g5151o9020e0804p2727a7221r1383F2026
9572b33012J0899d4434D3260a84052A5823l54c41116J14156d2122N417q067l23543
9560c68315J54280B78668i33j01202B79449i1882B11867a02835M4455k54673D9950
9548b79303f3793F419Q7605C3201b22265M5142e7178n2735c8695l06347A05557
$$ plain form
9627 -156993 -130503 -73489 104674 -5786 -159864 172731 57391 -375631 -43289 39181 210585
9616 210585 -58296 -159704 72535 -245165 -155060 -334100 -1949 -424353 -126291 -79728 -73040
9605 -73040 152297 118869 -201237 61676 48707 -83894 182048 2014 -175184 15753 193053
9594 193053 -210272 -107112 18805 -134844 27359 -132109 117140 -57096 -14213 -174144
9584 -174144 67463 -295361 -250354 -154452 -75151 -144171 -50804 -123531 -17221 -108604 62026
9572 -233012 -222113 -44434 43260 -184052 15823 15469 -341116 -226960 -42122 -36705 -44772 -368315
9560 -368315 -214035 278668 -933 -102135 279449 -91882 211867 -102835 -58380 -313053 49950
9548 -279303 -63793 6419 94024 33201 -222265 -177123 -57178 -109913 -38695 -345042 105557
9536g9466F8957c91758f8510o5334E8662d5805B24154k3397A1941a79631e4223
9524b25808A75646a85850q1682h8286c191l3195E5319a11430b6832k77445a22871
9512h4213j5598d2636j80056a07937c3877j42252A79524b4820k3263D5992a4487
9500d79909a29636C3216a80104m4535D2039a55005j8251O0873k638b6354B3905
9488b00369O8335A18912a22105j61645e3362A01718C2178a68749H4933K41005
9478C25938a40491f4283K1792j66445R1490R801M5734A00781d3898C08537I3453
9466i6140A84736g045l00433J43994A35851h7667c7557j31689j00649E3020a50175
9454A06734i8303j76931a7495p2237l6084d5849j17390j1779L3130A01182j2858
$$ plain form
9536 -79466 68957 -391758 -68510 -133844 58662 -45805 224154 200757 11941 -179631 -54223
9524 -225808 175646 -185850 -267532 -88286 -3191 -36386 55319 -111430 -26832 -304277 -122871
9512 -84213 -99811 -42636 -222692 -107937 -33877 -176129 179524 -24820 -48083 45992 -14487
9500 -479909 -129636 33216 -180104 -224639 42039 -155005 -173256 -112383 -115021 -26354 23905
9488 -200369 -132034 118912 -122105 -283750 -53362 101718 32178 -168749 84933 325938
9478 325938 -140491 -64283 -42491 -208936 -117446 -107645 -61911 100781 -43898 308537 93453
9466 -96140 184736 -7045 -307478 -163484 135851 -87667 -37557 -169246 -269895 53020 -150175
9454 106734 -98303 -275234 -17495 -89732 -125816 -45849 -163239 -175018 -141888 101182 88324
9443H8324b4491m3731j51536a08855C9001c5376j41357N35P0589A2498J3827J528
9431B7853L42237b87763A8291b01027b8769p7808j28406o1778B99606c57853C3285
9419h241A05548a07921H0134L5101C4204a11075c5579q9648A03581d0496j08374
9408a48870N8879A09896N8980e3603r500A39740k3H602b33269B56843a62728A44215
9395c18274B23777b2935H5815c6151j00188M7288b2807k44076f8458J1041q8853
9384a46270c4207j08077O7481k461c1158j08630k1199O0836D6026g885A84267
9372a68281H5958J129M606d1084p5113r7893J03251j12319B76936H6850K15639
9361C02489a08646B8329b93387l8114G960b1181A6258c4125A06803C6697e7580
$$ plain form
9443 88324 -24491 -68222 -219758 -108855 39001 -35376 -176733 -176198 -105609 12498 26325 27853
9431 27853 370090 -287763 18291 -201027 -28769 -106577 -234983 -296761 299606 -357853 33285
9419 -8241 105548 -107921 80134 115235 34204 -111075 -35579 -125227 103581 -40496 -148870
9408 -148870 -89991 109896 168876 -53603 -63103 139740 139717 8602 -233269 256843 -162728 144215
9395 -318274 223777 -22935 85815 -36151 -136339 -89051 -22807 -266883 -68458 -57417 -146270
9384 -146270 -34207 -142284 -74803 -77264 -31158 -139788 -160987 -100151 46026 -7885 184267
9372 -168281 85958 87087 91693 -41084 -116197 -214090 -110839 -223158 276936 86850 302489
9361 302489 -108646 28329 -293387 -331501 7960 -21181 16258 -34125 106803 36697 -57580
9349e2732C88601j43834a61942k0435C4869c33739C3043a46912C8323J21987a28157
9337c6589C44274b68263b4282A63628a17260j34803b5933B64418a89580j2445
9327b02025O0710A32053b75140a25807C5231O2004Q5348a71093p7242B4578b18747
9315F5363a23656c9829C325L19888b46264E6699a495j45696k53583d3053A11518
9303a64522j31334c1372A64854a31640A79468K0961c83246A30219m731b13687
9292a13533H3697J60836g4415G6684a55524B22120c49816h1408G9587K25726d5504
9280A10997b34671o5828J22974j60216J68620A63403c579j66927K0559F5351a32908
9268a19195j71161a32291J6429j05812a00144B23508g4757A30063b03302b0156
$$ plain form
9349 -52732 388601 244767 -161942 -182377 34869 -333739 33043 -146912 38323 160310 -128157
9337 -36589 344274 -268263 -24282 163628 -117260 -252063 -25933 264418 -189580 -202025
9327 -202025 -141315 132053 -275140 -125807 35231 97235 182583 -171093 -248335 24578 -218747
9315 65363 -123656 -39829 3325 323213 -246264 56699 -1495 -147191 -400774 -43053 111518
9303 -164522 -295856 -31372 164854 -131640 179468 200429 -383246 130219 125488 -213687
9292 -113533 83697 244533 -74415 76684 -155524 222120 -349816 -81408 79587 305313 -45504
9280 110997 -234671 -300499 -177525 -337741 -169121 163403 -3579 -170506 -149947 65351 -132908
9268 -119195 -290356 -132291 -115862 -221674 -100144 223508 -74757 130063 -203302 -20156
9257b47201f7601K8400j57199a4997l90535a56420B05102d5956A48629O6354b78163
9245a26232d763p5522a5979g823l8781P791j03924j50738a17612A3179b50324
9233e1273A65609c20027i1318d4872p7410k80063J23881j09319h8362p6308k73628
9222d38298d296n1950r6241A03329a57835j84057J68916C31066a33518A78131
9211a95476D5028L9644b92436C0434a06780b0281A83785N8425o8001G8322a05521
9199a20922m1766Q564c1505k00419i1847l24310d8203C9348J8379b33557E0480
9187C1097J1394h6649K0117C8708f4969A94447a2299j46247K9330e9307A31556
9175e5682b1563k52140K6264n912e4925A16005a76236H9852c151k51970e1843
$$ plain form
9257 -247201 -67601 -39201 -196400 -14997 -405532 -156420 205102 -45956 148629 214983 -278163
9245 -126232 -4763 -80285 -15979 -7823 -46604 -38813 -142737 -293475 -117612 13179 -250324
9233 -51273 165609 -320027 -91318 -44872 -122282 -402345 -278464 -387783 -88362 -164670 -438298
9222 -438298 -4296 -56246 -152487 103329 -157835 -341892 -172976 331066 -133518 178131
9211 -195476 45028 84672 -292436 30434 -106780 -20281 183785 242210 174209 78322 -105521
9199 -120922 -162688 -154124 -31505 -231924 -91847 -416157 -48203 39348 57727 -233557 50480
9187 31097 42491 -86649 -66532 38708 -64969 194447 -12299 -158546 -129216 -59307 131556
9175 -55682 -21563 -273703 -247439 -253351 -54925 116005 -176236 89852 -3151 -255121 -51843
9163A37898a16239k5717C05078A27768c08130f8848A12444b07444N8212j11843
9153b61075A46e0938b3078C2870P576i0327k95750J87391h2260E1328c12688c4772
9140C5263p220i1033c2477E6423e5589j8670H4109a82778c7697j14073A80319
9128c5894k48699B28711a71349J9339j05531J00836j03673B15965g7917G3936
9117a30615j36396A61207e5845B1199C641J45944F2952R8705K3262B4140a95292
9105E7426J08809J4093G8423a67651a1616G1126a88371B0591K4333i958n9742
9094f9700j86616E0098a57314B7596a11828B7688a67228B41241A01479c72195
9083A42146a75023H7149a0232k63662N2065b8768A36201h3168j6583g785j28430
$$ plain form
9163 137898 -116239 -141956 305078 127768 -308130 -68848 112444 -207444 -149232 -261075
9153 -261075 146 -50938 -23078 32870 40446 -90327 -386077 -198686 -82260 51328 -312688 -34772
9140 35263 28043 -91033 -32477 56423 -55589 -74259 84109 -182778 -37697 -151770 180319
9128 -35894 -284593 228711 -171349 -152010 -257541 -156705 -260378 215965 -77917 73936
9117 -130615 -267011 161207 -55845 21199 3641 149585 62952 161657 184919 24140 -195292
9105 57426 166235 180328 78423 -167651 -11616 71126 -188371 20591 44924 -9958 -69700
9094 -69700 -256316 50098 -157314 27596 -111828 27688 -167228 241241 101479 -372195
9083 142146 -175023 87149 -10232 -273894 -221829 -28768 136201 -83168 -99751 -7785 -136215
9072a36215H4352b22447C7525P8025E2237J5152a8814g712H8223f8163l1724M460
9060i5427d5257B68034b53784C35693a17705j26276n8005f5453j32209b4128H7385
9048a37147N0201P411k69054a03781m9586a2964l15274b8442D6433J26479d7684
9036C185b10190A3192a55405c9376D2079a11121B56850a97577L5006E723L02178
9025C07901A5819J06388A7107b38962M3835B51973a06752L3112Q207k36587k6686
9014c28706P7874E1969a76319A05271l0184a72327D0471N346J31678J02507a95017
9002a07551j88268A67105c4952a6859B47868b18609l38468K75327a37165O2124
8992g5041j77716A85156q8504a65112M0310C30K36971f1621j38963F7126N7437
$$ plain form
9072 -136215 84352 -222447 37525 115550 52237 67389 -18814 -7712 88223 -68163 -99887 -95427
9060 -95427 -45257 268034 -253784 335693 -117705 -243981 -301986 -65453 -197662 -24128 87385
9048 -137147 -86946 -79535 -348589 -103781 -153367 -12964 -328238 -28442 46433 172912 -47684
9036 3185 -210190 13192 -155405 -39376 42079 -111121 256850 -197577 -162571 5723 307901
9025 307901 15819 122207 17107 -238962 -195127 251973 -106752 -73640 -65433 -302020 -328706
9014 -328706 -250832 51969 -176319 105271 75087 -172327 40471 45817 177495 280002 -195017
9002 -107551 -295819 167105 -34952 -16859 247868 -218609 -557077 -281750 -137165 -75041
8992 -75041 -252757 185156 96652 -165112 -124802 330 237301 -61621 -200584 67126 124563
8981A24563i2164q0234Q2655n8026p3372k1084d4606F7854k0657a93505K1608
8970a71897L7137F2816A9897c26629A3288a53501k92764K15946I7722a31828K8333
8959a03495O59I438c41353B43070i9203c0900l05868g7093A10854f3370O685C06875
8946D6236a8533r3078k75976C7162a85564F7116K45483b42603J13139k13029F035
8934D90711m1584A79105A3682O7649c15455i6513A31682K5501A1616Q8008g6350
8922F52085o5010N55522J976781N708232B664900E65653B64424J31474b3878r0222
8912a14100I5657j2760P5262c501n4913l8751L9353A45867i3120o1748N0983J6472
8900h7413J1928A36043c8644k10566a00735H6499k7232G364a60001d6836n9493
$$ plain form
8981 124563 -92164 -172398 -89743 -147769 -221141 -242225 -44606 67854 47197 -193505 -171897
8970 -171897 -134760 62816 19897 -326629 13288 -153501 -446265 -230319 97722 -131828 -103495
8959 -103495 -102836 9438 -341353 243070 -99203 -30900 -336768 -77093 110854 -63370 -56685 306875
8946 46236 -18533 -111611 -387587 37162 -185564 67116 312599 -242603 -129464 -342493 6035
8934 490711 449127 179105 13682 81331 -315455 -96513 131682 157183 11616 99624 -76350
8922 652085 587075 1142597 3119378 8827610 2664900 565653 264424 395898 -23878 -114100
8912 -114100 95657 82897 158159 -3501 -58414 -97165 -57812 145867 -93120 -154868 -103885 -87413
8900 -87413 -75485 136043 -38644 -249210 -100735 86499 59267 7364 -160001 -46836 -106329
8889a06329b1964I7299P3312c20641J0112Q8613b0489m1780a071C7781a44279
8877b76810J0120C3383K48582g0584A43037a32502d6380k29614a3001j70619d6789
8865H1867O0968a83813a0505m30372B606b4613n8130j74153f542j28337K2989
8854a11890B56073i4386r5833L2992c880C59861b44108A19711m1683j880b40305
$$ plain form
8889 -106329 -21964 97299 170611 -320641 -310529 -221916 -20489 -62269 -1071 37781 -144279
8877 -276810 -266690 33383 281965 -70584 143037 -132502 -46380 -275994 -13001 -183620 -46789
8865 81867 142835 -183813 -10505 -440877 2606 -24613 -82743 -256896 -6542 -134879 -111890
8854 -111890 256073 -94386 -190219 -157227 -3880 359861 -244108 119711 78028 76148 -240305
$$ [...]
##END NTUPLES=NMR SPECTRUM
##END=
