
##TITLE=AC1291_CRIAH12101_6615412_yoWf9zGV4d
##JCAMPDX= 6.0         $$ Bruker NMR JCAMP-DX V2.0
##DATA TYPE= NMR SPECTRUM
##DATA CLASS= NTUPLES
##ORIGIN= BRUKER
##OWNER= Administrator
$$ 1.72 TOPSPIN		Version 2.1
$$ 2012-08-02 20:36:53.000 -0500  Administrator@TOPSPIN
$$ Compression mode = diff/dup
##.OBSERVE FREQUENCY= 400.02188249412
##.OBSERVE NUCLEUS= ^1H
##.ACQUISITION MODE= SIMULTANEOUS (DQD)
##.ACQUISITION SCHEME= undefined
##.AVERAGES= 64
##.DIGITISER RES= 22
##SPECTROMETER/DATA SYSTEM= spect
##.PULSE SEQUENCE= noesygpps1d.comp
##.SOLVENT NAME= COFFEE_meoh
##.SHIFT REFERENCE= INTERNAL, COFFEE_meoh, 1, 14.9624
##AUDIT TRAIL= $$ (NUMBER, WHEN, WHO, WHERE, PROCESS, VERSION, WHAT)
$$ ##TITLE= Audit trail, TOPSPIN		Version 2.1
$$ ##JCAMPDX= 5.01
$$ ##ORIGIN= Bruker BioSpin GmbH
$$ ##OWNER= Administrator
$$ $$ C:\Bruker\TOPSPIN/data/COFFEE/nmr/AC1291_CRIAH12101_6615412_yoWf9zGV4d/12/pdata/1/auditp.txt
$$ ##AUDIT TRAIL=  $$ (NUMBER, WHEN, WHO, WHERE, PROCESS, VERSION, WHAT)
(   1,<2012-08-02 20:36:48.062 -0500>,<Administrator>,<TOPSPIN>,<go>,<TOPSPIN 2.1>,
      <created by zg
	started at 2012-08-02 20:25:17.859 -0500,
	POWCHK enabled, PULCHK disabled,
       configuration hash MD5:
       6B 1B 68 BB D9 2E 58 E2 7F 35 AD 54 07 DF 0E 41
       data hash MD5: 64K
       5A 0A 6B 95 78 34 DC 0C 5D 6B 7C 8E 94 71 64 C6>)
(   2,<2012-08-02 20:36:51.062 -0500>,<Administrator>,<TOPSPIN>,<proc1d>,<TOPSPIN 2.1>,
      <Start of raw data processing
       efp LB = 0.3 FT_mod = 6 PKNL = 1 PHC0 = 0 PHC1 = 0 SI = 128K 
       data hash MD5: 128K
       E9 0B 31 80 FE D8 33 C0 D6 B0 0E BF DA 9C 66 79>)
(   3,<2012-08-02 20:36:52.218 -0500>,<Administrator>,<TOPSPIN>,<proc1d>,<TOPSPIN 2.1>,
      <pk PHC0 = 1.763306 PHC1 = 0 
       data hash MD5: 128K
       05 11 0C 41 AF 72 F9 B9 AD 2F 62 33 D9 80 E3 F0>)
(   4,<2012-08-02 20:36:52.453 -0500>,<Administrator>,<TOPSPIN>,<proc1d>,<TOPSPIN 2.1>,
      <abs ABSG = 1 
       data hash MD5: 128K
       F7 0E F7 49 EC 49 4B CC D5 51 74 B6 45 BE 51 8D>)
(   5,<2012-08-02 20:36:52.546 -0500>,<Administrator>,<TOPSPIN>,<proc1d>,<TOPSPIN 2.1>,
      <abs ABSG = 2 
       data hash MD5: 128K
       CB 56 1A 7D 1C 07 DE CC 26 22 DA 7F 40 83 14 DF>)
(   6,<2012-08-02 20:36:52.671 -0500>,<Administrator>,<TOPSPIN>,<proc1d>,<TOPSPIN 2.1>,
      <abs ABSG = 3 
       data hash MD5: 128K
       7C 65 6D D1 EA 49 B0 5C 28 69 35 F4 17 99 EE CE>)
(   7,<2012-08-02 20:36:52.859 -0500>,<Administrator>,<TOPSPIN>,<proc1d>,<TOPSPIN 2.1>,
      <abs ABSG = 4 
       data hash MD5: 128K
       EE D2 19 EA 4F FB 02 17 CD E9 B6 A7 74 EF CA 65>)
(   8,<2012-08-02 20:36:52.921 -0500>,<Administrator>,<TOPSPIN>,<proc1d>,<TOPSPIN 2.1>,
      <abs ABSG = 5 
       data hash MD5: 128K
       8C 7E 3A 50 F0 D6 F8 37 5F 69 15 DA 91 67 28 3F>)
$$ ##END=
$$ 
$$ $$ hash MD5
$$ $$ 75 8A E1 AA ED 03 82 9F 9B B7 06 E9 5F 39 87 BC
##$RELAX= 
##$RELAX= 
##$RELAX= 
##$RELAX= 
##$RELAX= 
##$RELAX= 
##$RELAX= 
##$RELAX= 
$$ Bruker specific parameters
$$ [...]
150 150 150 150 150 150 150 150
##$TP07= 0
##$TPNAME0= <>
##$TPNAME1= <>
##$TPNAME2= <>
##$TPNAME3= <>
##$TPNAME4= <>
##$TPNAME5= <>
##$TPNAME6= <>
##$TPNAME7= <>
##$TPOAL= (0..7)
0.5 0.5 0.5 0.5 0.5 0.5 0.5 0.5
##$TPOFFS= (0..7)
0 0 0 0 0 0 0 0
##$TUNHIN= 0
##$TUNHOUT= 0
##$TUNXOUT= 0
##$USERA1= <user>
##$USERA2= <user>
##$USERA3= <user>
##$USERA4= <user>
##$USERA5= <user>
##$V9= 5
##$VALIST= <valist>
##$VCLIST= <CCCCCCCCCCCCCCC>
##$VD= 0
##$VDLIST= <DDDDDDDDDDDDDDD>
##$VPLIST= <PPPPPPPPPPPPPPP>
##$VTLIST= <TTTTTTTTTTTTTTT>
##$WBST= 1024
##$WBSW= 4
##$XGAIN= (0..3)
0 0 0 0
##$XL= 0
##$YL= 0
##$YMAX_a= 16818294
##$YMIN_a= -10195892
##$ZGOPTNS= <>
##$ZL1= 120
##$ZL2= 120
##$ZL3= 120
##$ZL4= 120
##$ABSF1= 14.9624
##$ABSF2= -5.595781
##$ABSG= 5
##$ABSL= 3
##$ALPHA= 0
##$AQORDER= 0
##$ASSFAC= 0
##$ASSFACI= 0
##$ASSFACX= 0
##$ASSWID= 0
##$AUNMP= <proc_prof1d_extract.lims>
##$AXLEFT= 0
##$AXNAME= <>
##$AXNUC= <1H>
##$AXRIGHT= 0
##$AXTYPE= 0
##$AXUNIT= <>
##$AZFE= 0.1
##$AZFW= 0.1
##$BCFW= 0
##$BC_mod= 0
##$BYTORDP= 0
##$COROFFS= 0
##$CY= 15
##$DATMOD= 1
##$DC= 0
##$DFILT= <>
##$DTYPP= 0
##$F1P= 0
##$F2P= 0
##$FCOR= 0.5
##$FTSIZE= 131072
##$FT_mod= 6
##$GAMMA= 0
##$GB= 0
##$INTBC= 1
##$INTSCL= 1
##$ISEN= 128
##$LB= 0.3
##$LEV0= 0
##$LPBIN= 0
##$MAXI= 10000
##$MC2= 0
##$MEAN= 0
##$ME_mod= 0
##$MI= 0
##$NCOEF= 0
##$NC_proc= -2
##$NLEV= 6
##$NOISF1= 0
##$NOISF2= 0
##$NSP= 0
##$NTH_PI= 0
##$NZP= 0
##$OFFSET= 14.9624
##$PC= 1
##$PHC0= 1.763306
##$PHC1= 0
##$PH_mod= 1
##$PKNL= yes
##$PPARMOD= 0
##$PPDIAG= 0
##$PPIPTYP= 0
##$PPMPNUM= 2147483647
##$PPRESOL= 1
##$PSCAL= 4
##$PSIGN= 0
##$PYNMP= <proc.py>
##$REVERSE= no
##$SF= 400.02000907598
##$SI= 131072
##$SIGF1= 0
##$SIGF2= 0
##$SINO= 400
##$SIOLD= 131072
##$SPECTYP= <>
##$SREGLST= <1H.CDCl3>
##$SSB= 0
##$STSI= 131072
##$STSR= 0
##$SW_p= 8223.68421052631
##$SYMM= 0
##$S_DEV= 0
##$TDeff= 65536
##$TDoff= 0
##$TI= <>
##$TILT= no
##$TM1= 0
##$TM2= 0
##$TOPLEV= 0
##$USERP1= <user>
##$USERP2= <user>
##$USERP3= <user>
##$USERP4= <user>
##$USERP5= <user>
##$WDW= 1
##$XDIM= 131072
##$YMAX_p= 429098735
##$YMIN_p= -13374
##$CURPLOT= <Network HP LaserJet P1505>
##$CURPRIN= <$Network HP LaserJet P1505>
##$DFORMAT= <normdp>
##$LAYOUT= <+/1D_H.xwp>
##$LFORMAT= <normlp>
##$PFORMAT= <normpl>
##$SURQMSG= 1
$$ End of Bruker specific parameters
$$ ---------------------------------
##NTUPLES= NMR SPECTRUM
##VAR_NAME=  FREQUENCY,     SPECTRUM/REAL,   SPECTRUM/IMAG
##SYMBOL=    X,             R,               I
##VAR_TYPE=  INDEPENDENT,   DEPENDENT,       DEPENDENT
##VAR_FORM=  AFFN,          ASDF,            ASDF
##VAR_DIM=   131072,        131072,          131072
##UNITS=     HZ,            ARBITRARY UNITS, ARBITRARY UNITS
##FACTOR=    0.0627417313425164, 1,          1
##FIRST=     8223.62146879497, 2312,         -65517
##LAST=      0,             5105,            -65464
##MIN=       0,             -13374,          0
##MAX=       8223.62146879497, 429098735,    0
$$ Real data points
##PAGE= N=1
##DATA TABLE= (X++(R..R)), XYDATA
$$ [...]
63233D86729J2852J4576J6681J8560K0112K1535K2660K3045K2675K1996K1249
63222G02670K0344J9403J8772J8351J7569J6366J5540J5731J6534J7129J7278
63211H95687J7070J6143J3930J0538O588K326k400p345j1834j5621j9014k1986
63199H84082k3973k4863k5327k5702k5241k3189k0052j7021j4433j1547p759l427
63187F61548N50L532N543P253R490J2437J5351J7396J8601J9679K1043K2532K3887
63174H38842K5051K5902K6219K6046K5777K5746K5950K6144K5947K4891K2749
63163A119264J9841J6697J3404R568M954k74n949j2081j8417k4216k8701l1655
63151A062435l3364l4220l4508l4373l3726l2320l0128k7576k5242k3335k1577
$$ plain form
63233 486729 499581 514157 530838 549398 569510 591045 613705 636750 659425 681421 702670
63222 702670 723014 742417 761189 779540 797109 813475 829015 844746 861280 878409 895687
63211 895687 912757 928900 942830 953368 959956 962282 959882 952537 940703 925082 906068 884082
63199 884082 860109 835246 809919 784217 758976 735787 715735 698714 684281 672734 664975 661548
63187 661548 662098 665630 671173 678426 687916 700353 715704 733100 751701 771380 792423 814955 838842
63174 838842 863893 889795 916014 942060 967837 993583 1019533 1045677 1071624 1096515 1119264
63163 1119264 1139105 1155802 1169206 1178774 1183728 1183454 1177505 1165424 1147007 1122791 1094090 1062435
63151 1062435 1029071 994851 960343 925970 892244 859924 829796 802220 776978 753643 732066
63140G32066j9570j7187j4696j2565j1076j0078r168q164p297o795o376n401l631
63127F00062j619j89M24O60R29J240J571K172L093L830L947L881M423N462N952
63112F35838N337M313L856M023M303M590N146N855O182N943N615N685O022O022
63098G08730N310M158L173K551J849P29l24n76k11k20j008j872k163k144k185
63083G15797j899q86L29R16R79J232J799K251K660L610N134O539P401P963Q427
63068G62252Q667Q883R736J1415J3156J4106J4299J4480J5267J6809J8885K1132
63056I29087K3256K5220K7092K8774L0171L1530L3234L5286L7336L9159M0692
63045A280837M1713M1956M1615M1206M0879M0304L9273L8036L6967L6304L6185
$$ plain form
63140 732066 712496 695309 680613 668048 656972 646894 637726 629562 622265 615470 609094 603693 600062
63127 600062 598443 598254 598678 599338 600267 601507 603078 605250 608343 612173 616120 620001 624424 629886 635838
63112 635838 641175 645488 649344 653367 657670 662260 667406 673261 679443 685386 691001 696686 702708 708730
63098 708730 714040 718198 721371 723922 725771 726500 726176 725600 725389 725169 724161 722289 720126 717982 715797
63083 715797 713898 713012 713341 714257 715236 716468 718267 720518 723178 726788 731922 738461 745862 753825 762252
63068 762252 770919 779802 789538 800953 814109 828215 842514 856994 872261 889070 907955 929087
63056 929087 952343 977563 1004655 1033429 1063600 1095130 1128364 1163650 1200986 1240145 1280837
63045 1280837 1322550 1364506 1406121 1447327 1488206 1528510 1567783 1605819 1642786 1679090 1715275
63034A715275L6506L6764L6479L5834L5362L5056L4225L2286K9036K4190J7347
63023B068360Q776m17r326j8027k6935l5656m2999m8056n1030n2900n4249n4485
63011A683056n2440m7810m1598l5012k8423k1794j5431r596l832K387Q671J4238
62999A452416J9157K4044K8789L2687L5795L8822M1711M3562M4246M4701M5303
62988A851233M5269M4234M3017M2088M0568L7773L4466L1358K7457K1288J3064
62977B231815M150n084j5355k6651l7824m8086n7643o6526p3846p8676q0991q1394
62965A663889q0462p8510p5595p1587o6603o1326n6466n1969m7285m2347l7722
62954I94017l3785l0234k6686k3270k0489j8598j7285j5771j3433j0492p958o625
$$ plain form
63034 1715275 1751781 1788545 1825024 1860858 1896220 1931276 1965501 1997787 2026823 2051013 2068360
63023 2068360 2077136 2076719 2067393 2049366 2022431 1986775 1943776 1895720 1844690 1791790 1737541 1683056
63011 1683056 1630616 1582806 1541208 1506196 1477773 1455979 1440548 1430952 1427120 1429507 1438178 1452416
62999 1452416 1471573 1495617 1524406 1557093 1592888 1631710 1673421 1716983 1761229 1805930 1851233
62988 1851233 1896502 1940736 1983753 2025841 2066409 2104182 2138648 2170006 2197463 2218751 2231815
62977 2231815 2235965 2230881 2215526 2188875 2151051 2102965 2045322 1978796 1904950 1826274 1745283 1663889
62965 1663889 1583427 1504917 1429322 1357735 1291132 1229806 1173340 1121371 1074086 1031739 994017
62954 994017 960232 929998 903312 880042 859553 840955 823670 807899 794466 783974 776016 769391
62942G69391o361o591p082p785q323q312q009q005q375q683q736q710q596q156
62928F57667p480o969o695o354n930n845o247o672o680o336n875n339m820m593
62914E71832m667m565l940l189l081l871n040n802n716m927m008l484l271k788
62900E13483j763p54n50j134j639j400p28m15p28j221j489j701k208k948l527
62885D91278l730l652l350k768k075j742k047k640k835k306j386o83m76m77k09
62870D60902L99R30J075J079J347J819K067J909J515R39Q4q94j540j668j511j233
62854D67219p39j18K11J00k7K40O68P60M23m4l44k62L67J397K233K346J818J169
62836D77417P72O73Q15J109J375J404J114N98J18LK93N11J37o63j228j337j476
$$ plain form
62942 769391 763030 756439 749357 741572 733249 724937 716928 708923 700548 691865 683129 674419 665823 657667
62928 657667 650187 643218 636523 630169 624239 618394 612147 605475 598795 592459 586584 581245 576425 571832
62914 571832 567165 562600 558660 555471 552390 548519 543479 537677 531961 527034 523026 519542 516271 513483
62900 513483 511720 510966 510416 509282 507643 506243 505515 505100 504372 503151 501662 499961 497753 494805 491278
62885 491278 487548 483896 480546 477778 475703 473961 471914 469274 466439 464133 462747 462064 461588 461111 460902
62870 460902 461301 462231 463306 464385 465732 467551 469618 471527 473042 473981 474065 473171 471631 469963 468452 467219
62854 467219 466480 466362 466573 466673 466646 466886 467554 468314 468737 468693 468349 468087 468454 469851 472084 474430 476248 477417
62836 477417 478189 478862 479677 480786 482161 483565 484679 485277 485395 485398 485691 486202 486339 485676 484448 483111 481635
62819D81635j980k459k427k061j840j817j691j410j283j497j834j851j222o5J058
62804D59256J655J836K038K309K357K276K573L326L971M282M840O158P877R399
62790E14153J0761J2322J4018J5462J6469J7124J7634J8516K0454K3517K6974
62779G07404L0219L3380L6644L9756M2800M6627N1658N6900O1140O4561O8071
62768A239160P1395P3099P2398O9758O5597N9547N1290M1229K9966J7759M856
62757A796054q243k1016l3003m3539n2031n8584o3835o8020p0747p1747p1227
62746A234062o9441o6527o2965n9414n5869n1594m6327m0985l6689l3584l1048
62735F79619k8690k6469k4172k1488j8659j6449j5133j3919j1835r065o904o208
$$ plain form
62819 481635 479655 477196 474769 472708 470868 469051 467360 465950 464667 463170 461336 459485 458263 458198 459256
62804 459256 460911 462747 464785 467094 469451 471727 474300 477626 481597 485879 490719 496877 504754 514153
62790 514153 524914 537236 551254 566716 583185 600309 617943 636459 656913 680430 707404
62779 707404 737623 771003 807647 847403 890203 936830 988488 1045388 1106528 1171089 1239160
62768 1239160 1310555 1383654 1456052 1525810 1591407 1650954 1702244 1743473 1773439 1791198 1796054
62757 1796054 1787811 1766795 1733792 1690253 1638222 1579638 1515803 1447783 1377036 1305289 1234062
62746 1234062 1164621 1098094 1035129 975715 919846 868252 821925 780940 744251 710667 679619
62735 679619 650929 624460 600288 578800 560141 543692 528559 514640 502805 493740 486836 480628
62723D80628o311n874m478k761j290j6J062J603J667K025L167M582N610O450P734
62708D93798R529J1459J3433J5515J7454J9065K0900K3795K7772L2055L6050L9764
62696G60589M3323M6758N0282N4315N9080O4421O9838P4537P7856P9912Q1336
62685A462247Q1985Q0535P5937O8533N9068M7337L2929J6722L76j5243l0081m3635
62673A836710n5036o4217p1764p7639q1265q2800q3068q2126p9286p4682o9504
62662A015323o4479n9383n4323m9984m6226m1900l6818l2479k9927k8193k5853
62651E45758k3005k0528j8389j6016j3765j2542j2324j2137j1390j0320r226q146
62639C77970p223o669o318n810n169m741m630m589m445m225l970l732l576l382
$$ plain form
62723 480628 474317 468443 463965 461204 459914 459898 460960 462563 464230 466255 469422 474004 479614 486064 493798
62708 493798 503327 514786 528219 543734 561188 580253 601153 624948 652720 684775 720825 760589
62696 760589 803912 850670 900952 955267 1014347 1078768 1148606 1223143 1300999 1380911 1462247
62685 1462247 1544232 1624767 1700704 1769237 1828305 1875642 1908571 1925293 1925669 1910426 1880345 1836710
62673 1836710 1781674 1717457 1645693 1568054 1486789 1403989 1320921 1238795 1159509 1084827 1015323
62662 1015323 950844 891461 837138 787154 740928 699028 662210 629731 599804 571611 545758
62651 545758 522753 502225 483836 467820 454055 441513 429189 417052 405662 395342 386116 377970
62639 377970 370747 364078 357760 351950 346781 342040 337410 332821 328376 324151 320181 316449 312873 309491
62625C09491k916k277j925k017k080j615o73M84J742K803L045K312J429J297J733
62610C10833J876J576J647K753M555O128O942P242P637Q407R266R855J0380J1436
62596D00533J3249J5401J7374J9014K0456K1973K3988K6655K9464L1689L3315
62585F53111L4898L6457L7262L6917L5823L4144L1159K6230J9858J3096O428k09
62573I65174o750j2970j8815k4142k8433l1258l2815l3605l3866l3558l2539l0506
62561F45917k7380k4050k1958k1369k0759j8705j5694j3295j2111j1598j1381
62550D47617j1484j1537j0916r847r303r587r860r306q073o805n906n446n199
62537C34348m600l260j607m65P4O82J538J971J716J679K754M445N564N897O349
$$ plain form
62625 309491 306575 304298 302373 300356 298276 296661 295988 296472 298214 301017 304062 306374 307803 309100 310833
62610 310833 312709 314285 315932 318685 323240 329368 336310 343552 351189 359596 368862 378717 389097 400533
62596 400533 413782 429183 446557 465571 486027 508000 531988 558643 588107 619796 653111
62585 653111 688009 724466 761728 798645 834468 868612 899771 926001 945859 958955 965383 965174
62573 965174 958424 945454 926639 902497 874064 842806 809991 776386 742520 708962 676423 645917
62561 645917 618537 594487 572529 551160 530401 511696 496002 482707 470596 458998 447617
62550 447617 436133 424596 413680 403833 394530 384943 375083 365777 357704 350899 344993 339547 334348
62537 334348 329748 326488 324881 324416 324490 325172 326710 328681 330397 332076 334830 339275 344839 350736 357085
62522C57085P477Q805R786J0730J2204J4048J5566J6631J7944K0097K2852K5612
62510E38837K8171L0708L3305L5883L8521M1347M4110M6220M7211M6867M4956
62499I76136M1307L6112K9745K2228J3410L716n836j4524k2310k9149l4549l8194
62487I78092m0460m1867m2429m1983m0769l9164l7100l4251l0597k6521k2500
62476E80451j9065j6701j5318j4103j2363j0388q981q369q031p452o536n368m030
62463D43746k774j820r85J26J453K431K795L080L916N070N636N333N140O165Q098
62448D87410R365R026P862P194P157O822N638L855J720q30l614o171q460j0797
62434E16177j2955j4169j4296j4122j4100j3697j2428j0733r238p926o669n871
$$ plain form
62522 357085 364562 373367 383153 393883 406087 420135 435701 452332 470276 490373 513225 538837
62510 538837 567008 597716 631021 666904 705425 746772 790882 837102 884313 931180 976136
62499 976136 1017443 1053555 1083300 1105528 1118938 1122654 1116818 1102294 1079984 1050835 1016286 978092
62487 978092 937632 895765 853336 811353 770584 731420 694320 660069 629472 602951 580451
62476 580451 561386 544685 529367 515264 502901 492513 483532 475163 467132 459680 453144 447776 443746
62463 443746 440972 439152 438167 438293 439746 442177 444972 448052 451968 457038 462674 468007 473147 479312 487410
62448 487410 496775 505801 513663 520857 528014 534836 540474 544329 546049 545219 541605 535434 526974 516177
62434 516177 503222 489053 474757 460635 446535 432838 420410 409677 400439 392513 385844 379973
62422C79973n789n765m909l162j100Q84K566L621M069M508N308N989O099O085
62408C98377O617P561Q383R019R519R409Q411P345P198P595P336O172M936M031
62394E01909L014J708N38m36j722l338m525m937n186n822o471o484n736m442k763
62379D55307j012K92J066J900L357N366P532R725J2044J4550J7287K0249K3261
62366E70924K6135K9044L2355L6044L9650M2868M5784M8477N0745N2344N3062
62355A027432N2508N0249M6263M0834L3963K5422J5515N335l986j1959j8522k3661
62343A239393k7473l0401l3054l5817l8635m0987m2226m2134m1094l9448l6970
62332H31154l3445k9515k6283k4116k2445k0865j9692j9187j8838j7895j6182
$$ plain form
62422 379973 374184 368419 363510 360348 359248 360132 362698 366319 370388 374896 380204 386193 392292 398377
62408 398377 404994 412555 420938 429957 439476 448885 457296 464641 471839 479434 486770 492942 497878 501909
62394 501909 504923 506631 507169 506733 505011 501673 497148 492211 487025 481203 474732 468248 462512 458070 455307
62379 455307 454295 454587 455653 457553 460910 466276 473808 483533 495577 510127 527414 547663 570924
62366 570924 597059 626103 658458 694502 734152 777020 822804 871281 922026 974370 1027432
62355 1027432 1079940 1130189 1176452 1217286 1251249 1276671 1292186 1297521 1293535 1281576 1263054 1239393
62343 1239393 1211920 1181519 1148465 1112648 1074013 1033026 990800 948666 907572 868124 831154
62332 831154 797709 768194 741911 717795 695350 674485 654793 635606 616768 598873 582691
62321E82691j4034j1698r225o836m948l839l310k771j678o0J448K209K091J344
62307E31384J58j309k642l299l136k589k370k994m366n666n960n169m114l384
62293D84544k624j343J34J180J909K915M205N148N444N437N490N642N845O037
62279E29963O053N954O231P162Q280R089R923J1236J2442J2563J1934J2064J3735
62266F56629J6240J8705K1005K3198K5140K7191L0248L4514L8985M2705M5786
62255I80346M8667N1101N2400N2007M9306M3541L4743K4264J3789M032n159j3889
62243A335148k1898k8840l4471l8796m2222m5100m6993m7025m5242m2832m0641
62232I01088l8188l4737l0569k6438k2446j8332j4453j1498r417p504n476l764
$$ plain form
62321 582691 568657 556959 547734 540898 535950 532111 528801 526030 524352 524292 525740 527949 530040 531384
62307 531384 531542 530233 527591 524292 521156 518567 516197 513203 508837 503171 497211 492042 487928 484544
62293 484544 481920 480577 480711 481891 483800 486715 490920 496068 501512 506949 512439 518081 523926 529963
62279 529963 536016 541970 548201 555363 563643 572732 582655 593891 606333 618896 630830 642894 656629
62266 656629 672869 691574 712579 735777 760917 788108 818356 852870 891855 934560 980346
62255 980346 1029013 1080114 1132514 1184521 1233827 1277368 1312111 1336375 1350164 1354196 1349037 1335148
62243 1335148 1313250 1284410 1249939 1211143 1168921 1123821 1076828 1029803 984561 941729 901088
62232 901088 862900 828163 797594 771156 748710 730378 715925 704427 695010 687506 682030 678266
62220F78266k732k182j770j397j172j245j643j995j624l05J283K258K546K714
62206F71002K989L052K803K813L721N515P566R324J0803J2418J4383J6419J8202
62193G81010J9911K2020K4569K7061K9164L1094L3078L4803L5611L4936L2352
62182A105609K7696K1501J5001R285M669J070j388k540k589j874l62K266O143
62169A184487J1037J6422K1494K5399K7833K9218L0034L0152K9033K6319K2015
62158A453443J6493J0601N392J332k031n303q463j1267j3922j6781j9610k1842
62146A388042k3334k4212k4150k2564j9641j6438j3764j1593r758q500p890p257
62134A198941n888m001k521j919j795j531q50L87K337M809P109Q660R660J0751
$$ plain form
62220 678266 675534 673352 671582 670185 669013 667768 666125 664130 662506 662201 663484 665742 668288 671002
62206 671002 673991 677043 679846 682659 686380 691895 699461 708785 719588 732006 746389 762808 781010
62193 781010 800921 822941 847510 874571 903735 934829 967907 1002710 1038321 1073257 1105609
62182 1105609 1133305 1154806 1169807 1179092 1183761 1184831 1183443 1180903 1178314 1176440 1176078 1178344 1184487
62169 1184487 1195524 1211946 1233440 1258839 1286672 1315890 1345924 1376076 1405109 1431428 1453443
62158 1453443 1469936 1480537 1485929 1487261 1485230 1479927 1471464 1460197 1446275 1429494 1409884 1388042
62146 1388042 1364708 1340496 1316346 1293782 1274141 1257703 1243939 1232346 1222588 1214088 1206198 1198941
62134 1198941 1193053 1189052 1186531 1184612 1182817 1181286 1180436 1180823 1183160 1187969 1195078 1203738 1213398 1224149
62120A224149J2219J3830J5333J6662J7691J8290J8720J9396K0178K0449K0219
62109A417136K0432K1736K3481K4637K5185K5905K7076K8235K9099K9959L1152
62098A704033L2710L4580L6641L8578M0249M2043M4361M6966M9453N1959N4487
62087B176060N5968N5111N2242M9157M7195M6586M7700N1255N6559O0868O1477
62076B760178N7835N1124M2929L5008K9193K6190K5058K4780K5638K8126L1349
62065C137408L3812L5251L6439L7445L7466L6180L4046L1233K7539K3556K0682
62054C491057J9440J8717J7216J4892J2402R868P011M025J507m35k291m252n712
62041C583445n995n342m814n177o186p071p442p534p731q252r128j0129j0792
$$ plain form
62120 1224149 1236368 1250198 1265531 1282193 1299884 1318174 1336894 1356290 1376468 1396917 1417136
62109 1417136 1437568 1459304 1482785 1507422 1532607 1558512 1585588 1613823 1642922 1672881 1704033
62098 1704033 1736743 1771323 1807964 1846542 1886791 1928834 1973195 2020161 2069614 2121573 2176060
62087 2176060 2232028 2287139 2339381 2388538 2435733 2482319 2530019 2581274 2637833 2698701 2760178
62076 2760178 2818013 2869137 2912066 2947074 2976267 3002457 3027515 3052295 3077933 3106059 3137408
62065 3137408 3171220 3206471 3242910 3280355 3317821 3354001 3388047 3419280 3446819 3470375 3491057
62054 3491057 3510497 3529214 3546430 3561322 3573724 3583592 3590603 3594628 3596135 3595700 3593409 3589157 3583445
62041 3583445 3577450 3572108 3567294 3562117 3555931 3548860 3541418 3533884 3526153 3517901 3508773 3498644 3487852
62028C487852j0923j1036j1831j3292j4704j5534j5707j5217j4167j3181j2877
62017C339383j2828j1975j0250q724p744o131k978Q79M159O913R874J2864J5265
62004C328707J7434K0262K3605K6534K8940L1408L3446L3359L0308K5221J9130
61993C618354J1774K625p534j7034k4818l0895l5553l8875m0901m1874m2171m2120
61981C310978m1830m1199m0220l9164l8243l7279l6147l5365l5614l6657l7302
61970B891958l6641l4879l2751l0773k9217k8278k7772k7064k5701k3988k2527
61959B572367k1438k0385j9215j8163j7330j6329j4680j2506j0547r395q760p760
61947B395859n932l680j584L67K545M898O886Q217R198J0251J1391J2377J3192
$$ plain form
62028 3487852 3476929 3465893 3454062 3440770 3426066 3410532 3394825 3379608 3365441 3352260 3339383
62017 3339383 3326555 3314580 3304330 3295606 3287862 3281731 3278753 3279632 3283791 3290704 3300578 3313442 3328707
62004 3328707 3346141 3366403 3390008 3416542 3445482 3476890 3510336 3543695 3574003 3599224 3618354
61993 3618354 3630128 3632753 3625219 3608185 3583367 3552472 3516919 3478044 3437143 3395269 3353098 3310978
61981 3310978 3269148 3227949 3187729 3148565 3110322 3073043 3036896 3001531 2965917 2929260 2891958
61970 2891958 2855317 2820438 2787687 2756914 2727697 2699419 2671647 2644583 2618882 2594894 2572367
61959 2572367 2550929 2530544 2511329 2493166 2475836 2459507 2444827 2432321 2421774 2412379 2403619 2395859
61947 2395859 2389927 2386247 2384663 2385030 2387575 2392473 2399359 2407576 2416774 2427025 2438416 2450793 2463985
61934B463985J4059J5108J6131J6842J7223J7517J7861J8155J8438J9193K0959
61923B655471K3763K7235L1311L6365M2730N0489N9762P0747Q3340R7206J12355
61912C290774J29188J47907J68386J90739K15291K41850K69921L00025L33915
61903E287996L72798M16024M62246N10848N61001O09508O50545O76978O80752
61894A0228696O52469N83023M67862L10718J23884p4683k65638m32338n63710
61885A1030283o55109p07514p25987p17764o90138o49187n99923n46744m93035
61876E244882m40781l91302l46109l06315k71551k40463k12333j87388j65671
61867B682969j46589j29650j14769j01556q9229p7504o6864n7548m9054m1002
$$ plain form
61934 2463985 2478044 2493152 2509283 2526125 2543348 2560865 2578726 2596881 2615319 2634512 2655471
61923 2655471 2679234 2706469 2737780 2774145 2816875 2867364 2927126 2997873 3081213 3178419 3290774
61912 3290774 3419962 3567869 3736255 3926994 4142285 4384135 4654056 4954081 5287996
61903 5287996 5660794 6076818 6539064 7049912 7610913 8220421 8870966 9547944 10228696
61894 10228696 10881165 11464188 11932050 12242768 12366652 12291969 12026331 11593993 11030283
61885 11030283 10375174 9667660 8941673 8223909 7533771 6884584 6284661 5737917 5244882
61876 5244882 4804101 4412799 4066690 3760375 3488824 3248361 3036028 2848640 2682969
61867 2682969 2536380 2406730 2291961 2190405 2101176 2023672 1956808 1899260 1850206 1809204
61857A809204l3796k7834k2600j7181j1350n695q56K935N778P924R553J0479J0118
61844A736679Q060M590O23k913n666p928j0046j1700j1999j0492p772m753j637
61831A675046J888N674Q959J1182J2331J2462J1430R243O203K527j721o169j0084
61818A738971j2991j5007j6364j6861j6020j3711j0431p034l998r24L053Q175
61806A636858J3691J8716K3169K7454L1732L6013M0607M5860N1631N7584O3770
61795B047085P0373P7214Q4187R1820J00647J10364J20492J31594J44768J60082
61785C138626J76685J94586K15060K39061K66344K96588L30353L68373M10777
61776E636453M57640N09606N67476O31798P03163P82028Q67473R56621J045482
$$ plain form
61857 1809204 1775408 1747574 1724974 1707793 1696443 1690748 1689892 1692827 1698605 1706529 1716082 1726561 1736679
61844 1736679 1744739 1749329 1749952 1747039 1741373 1733445 1723399 1711699 1699700 1689208 1681436 1676683 1675046
61831 1675046 1676934 1682608 1691567 1702749 1715080 1727542 1738972 1748215 1754418 1756945 1755224 1749055 1738971
61818 1738971 1725980 1710973 1694609 1677748 1661728 1648017 1637586 1630552 1626554 1625630 1628683 1636858
61806 1636858 1650549 1669265 1692434 1719888 1751620 1787633 1828240 1874100 1925731 1983315 2047085
61795 2047085 2117458 2194672 2278859 2370679 2471326 2581690 2702182 2833776 2978544 3138626
61785 3138626 3315311 3509897 3724957 3964018 4230362 4526950 4857303 5225676 5636453
61776 5636453 6094093 6603699 7171175 7802973 8506136 9288164 10155637 11112258 12157740
61767A2157740J129181J200011J245437J248781J192630J063077Q54237N72471
61759B0663565K37993j18413m62533p64239j002735j168765j263695j296272j278852
61750A3546054j224698j146336j054337r56773q59501p66603o80422o01842n31193
61741E724349m68788m14449l66973l24762k86965k53671k25014k00409j78713
61732C004605j58932j40718j24254j09632r6524q4613p4082o5321n8315n2789
61722B039425m8803m6552m5629m5147m4660m4270m3767m2573m0719l8952l7461
61711A560892l5356l2049k8344k5405k3347k1592k0117j9349j9230j9236j9219
61700A297648j9344j9371j8816j7886j7480j8028j8814j8730j7396j5377j3594
$$ plain form
61767 12157740 13286921 14486932 15732369 16981150 18173780 19236857 20091094 20663565
61759 20663565 20901558 20783145 20320612 19556373 18553638 17384873 16121178 14824906 13546054
61750 13546054 12321356 11175020 10120683 9163910 8304409 7537806 6857384 6255542 5724349
61741 5724349 5255561 4841112 4474139 4149377 3862412 3608741 3383727 3183318 3004605
61732 3004605 2845673 2704955 2580701 2471069 2374545 2289932 2215850 2150529 2092214 2039425
61722 2039425 1990622 1944070 1898441 1853294 1808634 1764364 1720597 1678024 1637305 1598353 1560892
61711 1560892 1525536 1493487 1465143 1439738 1416391 1394799 1374682 1355333 1336103 1316867 1297648
61700 1297648 1278304 1258933 1240117 1222231 1204751 1186723 1167909 1149179 1131783 1116406 1102812
61689A102812j2593j2245j2062j1734j1219j0431r206p804o838o475o108n269
61677I90828m386m095m138l645k379j033k93k35n99j165j689j934j970k124k552
61662I58591l127l818m710n575n784m999l705k739k411k355k198k047k124k230
61648I10769j873r28O6M53J23m53o61j61Q87J795J896J425J596L276N874P988
61632I32072R115J0036J1575J3655J5705J7321J8130J7594J5485J2300Q812N318
61620A087118J608k476o620j0061j2049j2492j2231j2333j3108j3990j4390j4231
61608I64745j3700j3006j2467j2375j2584j2642j2401j2096j1771j1171j0325
61597H30207r643r260q853q272p703p030n715l759k021j104n10N74K110L454M292
$$ plain form
61689 1102812 1090219 1077974 1065912 1054178 1042959 1032528 1023322 1015518 1008680 1002205 996097 990828
61677 990828 986442 982347 978209 974564 972185 971152 970859 970624 970025 968860 967171 965237 963267 961143 958591
61662 958591 955464 951646 946936 941361 935577 930578 926873 924134 921723 919368 917170 915123 912999 910769
61648 910769 908896 907968 908034 908487 908610 908157 907496 907335 908222 910017 911913 913338 914934 918210 924084 932072
61632 932072 941187 951223 962798 976453 992158 1009479 1027609 1045203 1060688 1072988 1081800 1087118
61620 1087118 1088726 1086250 1079630 1069569 1057520 1045028 1032797 1020464 1007356 993366 978976 964745
61608 964745 951045 938039 925572 913197 900613 887971 875570 863474 851703 840532 830207
61597 830207 820564 811304 802451 794179 786476 779446 773731 769972 767951 766847 766337 766911 769021 772475 776767
61582G76767M845N454O492Q191J0192J1706J2658J4064J6607J9381K0902K1050
61570I28309K1071K1907K3425K5228K7175K8905K9719K9389K8590K8111K7962
61559A219791K7557K6491K4860K3031K1332J9938J8832J7865J6860J5760J4681
61548A446998J3778J2890J1448Q993N832K725j64l533p877j2598j6606j9500k1634
61535A420752k3177k3706k2788k0630j7993j5622j3758j2057r995p412m596j854
61523A247164Q08L519O379R576J3424J8027K3130K8440L3925L9654M5610N1876
61511A521532N8780O6679P5717Q5896R7072J08808J20651J32808J46193J61385
61501B575521J77813J94232K09844K24427K37330K46564K49029K41779K23294
$$ plain form
61582 776767 781612 787066 793558 801749 811941 823647 836305 850369 866976 886357 907259 928309
61570 928309 949380 971287 994712 1019940 1047115 1076020 1105739 1135128 1163718 1191829 1219791
61559 1219791 1247348 1273839 1298699 1321730 1343062 1363000 1381832 1399697 1416557 1432317 1446998
61548 1446998 1460776 1473666 1485114 1494107 1499939 1502664 1502500 1498967 1491090 1478492 1461886 1442386 1420752
61535 1420752 1397575 1373869 1351081 1330451 1312458 1296836 1283078 1271021 1261026 1253614 1249018 1247164
61523 1247164 1247972 1251491 1257870 1267446 1280870 1298897 1322027 1350467 1384392 1424046 1469656 1521532
61511 1521532 1580312 1646991 1722708 1808604 1905676 2014484 2135135 2267943 2414136 2575521
61501 2575521 2753334 2947566 3157410 3381837 3619167 3865731 4114760 4356539 4579833
61492D579833J93768J54495J07426N5534K954m6173q9233j25187j53376j73079
61482D506962j84365j88493j87055j81146j71624j59561j45991j31574j16766
61473C040387j01963q7364p3128n9722m7546l6142k4544j2613j231Q993J8349
61462B623476K6933L4047L9306M3520M7503N0864N2807N3600N4101N4242N3104
61451C133503N0400M7038M4195M2512M2124M2707M3458M3652M3383M3369M3942
61440C620283M4619M4562M3245M0781L7852L5134L2486K9044K4339J8946J3602
61429C984893Q120J667o083j4604k3060l0711l6962m1540m4601m6413m7032m6464
61417C657210m4834m2166l8351l3538k8236k2785j7151j1488o380k206J195L878
$$ plain form
61492 4579833 4773601 4928096 5035522 5091056 5094010 5047837 4958604 4833417 4680041 4506962
61482 4506962 4322597 4134104 3947049 3765903 3594279 3434718 3288727 3157153 3040387
61473 3040387 2938424 2851060 2777932 2718210 2670664 2634522 2609978 2597365 2596134 2605127 2623476
61462 2623476 2650409 2684456 2723762 2767282 2814785 2865649 2918456 2972056 3026157 3080399 3133503
61451 3133503 3183903 3230941 3275136 3317648 3359772 3402479 3445937 3489589 3532972 3576341 3620283
61440 3620283 3664902 3709464 3752709 3793490 3831342 3866476 3898962 3928006 3952345 3971291 3984893
61429 3984893 3993013 3994680 3988597 3973993 3950933 3920222 3883260 3841720 3797119 3750706 3703674 3657210
61417 3657210 3612376 3570210 3531859 3498321 3470085 3447300 3430149 3418661 3412281 3410075 3411270 3415148
61405C415148N411N504M398K240j286o053j0887j4516j6704j7857j8040j6969
61393C330389j4510j0490m414L995J4347K6149L9379N4042O9774Q6408J04288
61382C699357J23394J42900J62242J81859K02022K21647K39232K54172K65901
61373E492726K72284K70165K57369K33368J98526J54117J03002M9247l207n1228
61363F976369r2737j27490j57078j82993k04802k21253k32472k39699k43215k42311
61353E032319k37280k29855k21288k11328j99561j86562j73244j60021j47035
61344C266145j34309j21376j07662r3597q0494o8943n8172m7340l6647k6655j7241
61333B473709p858J617J0731J8926K5917L1805L6932M1421M4996M7452M8972M9575
$$ plain form
61405 3415148 3420559 3426063 3430461 3432701 3431415 3425362 3414475 3399959 3383255 3365398 3347358 3330389
61393 3330389 3315879 3305389 3300975 3304970 3319317 3345466 3384845 3438887 3508661 3595069 3699357
61382 3699357 3822751 3965651 4127893 4309752 4511774 4733421 4972653 5226825 5492726
61373 5492726 5765010 6035175 6292544 6525912 6724438 6878555 6981557 7030804 7027597 6976369
61363 6976369 6883632 6756142 6599064 6416071 6211269 5990016 5757544 5517845 5274630 5032319
61353 5032319 4795039 4565184 4343896 4132568 3933007 3746445 3573201 3413180 3266145
61344 3266145 3131836 3010460 2902798 2809201 2728707 2659764 2601592 2554252 2517605 2490950 2473709
61333 2473709 2465851 2467468 2478199 2497125 2523042 2554847 2591779 2633200 2678196 2725648 2774620 2824195
61321B824195M8792M6559M3940M2011M0312L7471L3237K8844K5409K2910K0887
61310C214567J9195J7798J6535J5157J3070R260L326l587r778j4843j9620k4567
61298C236513k9334l3814l8392m2919m6590m9081n0834n1991n2128n1262n0099
61287B740069m8910m7039m3889l9631l4687k9293k3759j8415j3208q117l868j244
61275B428009J44J291J984R64j837m716o252o748p074p314p140o507n344l530
61261B375930j697r62j327j352J29L010P174J3390K2113L2444M3304N4656O6727
61248B613539P8919R0488J01367J11273J18786J22443J22044J17627J07739R0109
61238C674334O3996L1044n881m3713p9295j09813j33604j50186j59636j62397
$$ plain form
61321 2824195 2872987 2919546 2963486 3005497 3045809 3083280 3116517 3145361 3170770 3193680 3214567
61310 3214567 3233762 3251560 3268095 3283252 3296322 3305582 3308908 3305321 3295543 3280700 3261080 3236513
61298 3236513 3207179 3173365 3134973 3092054 3045464 2996383 2945549 2893558 2841430 2790168 2740069
61287 2740069 2691159 2644120 2600231 2560600 2525913 2496620 2472861 2454446 2441238 2433121 2429253 2428009
61275 2428009 2428153 2429444 2431428 2432392 2430555 2425839 2419587 2412839 2405765 2398451 2391311 2384804 2379460 2375930
61261 2375930 2374233 2373271 2371944 2370592 2370721 2373731 2380905 2394295 2416408 2448852 2492156 2546812 2613539
61248 2613539 2692458 2782946 2884313 2995586 3114372 3236815 3358859 3476486 3584225 3674334
61238 3674334 3738330 3769374 3763493 3719780 3640485 3530672 3397068 3246882 3087246 2924849
61228B924849j59608j52953j43949j33620j22631j11453j00445r0010q0463p1643
61218A758074o3026n4461m6506l9837l4639l0589k7083k3383j9103j4704j0909
61207A393834p617l991J89M154P462J0750J4659J8686K1848K3840K4956K5263
61195A534033K4515K2526J9251J4895J0286O564M018J764r25l558n318o427p857
61182A613767r947j2161j4128j6115j8376k0547k2054k2850k3463k4273k4995
61171A404858k5106k4801k4982k6034k7128k7326k6902k6825k7243k7428k7062
61160A114021k6565k6092k5200k3679k1886j9987j7703j5033j2537j0800j0242
61149I04297j1368j4235j7642j9944k0785k1077k1191k0492j8783j6838j5004
$$ plain form
61228 2924849 2765241 2612288 2468339 2334719 2212088 2100635 2000190 1910180 1829717 1758074
61218 1758074 1695048 1640587 1594081 1554244 1519605 1489016 1461933 1438550 1419447 1404743 1393834
61207 1393834 1386217 1382226 1382415 1386569 1394031 1404781 1419440 1438126 1459974 1483814 1508770 1534033
61195 1534033 1558548 1581074 1600325 1615220 1625506 1632070 1636088 1637852 1636927 1633369 1628051 1621624 1613767
61182 1613767 1603820 1591659 1577531 1561416 1543040 1522493 1500439 1477589 1454126 1429853 1404858
61171 1404858 1379752 1354951 1329969 1303935 1276807 1249481 1222579 1195754 1168511 1141083 1114021
61160 1114021 1087456 1061364 1036164 1012485 990599 970612 952909 937876 925339 914539 904297
61149 904297 892929 878694 861052 841108 820323 799246 778055 757563 738780 721942 706938
61138G06938j2697r788p225n508l884j864k59K96P60K318M540O114O759P272Q076
61123G01848Q910R570J0076J0285J0179J0277J1096J2415J3632J4511J5075J5194
61111H43068J4887J4645J4875J5230J4958J3708J1667R220O728M297J614j538
61099I63359m629o836q121r078r734r520q625q147q512q825q442q087q691j0024
61085H46088j1226j1941j2209j1980j1372j0858j0623j0314r785r332q965q275
61073G19208p393p000p040o478m875l110k029j455j061j050j309j069j49O01P29
61058F76520R22J616K145K065K045K496K652K026J521J932K502K257J665J719
61044G04083K263K525K594L102M056N008N794O302O188N671N800P224R342J1249
$$ plain form
61138 706938 694241 684453 677228 671720 667836 665972 665713 666009 666769 669087 673627 679741 686500 693772 701848
61123 701848 710758 720328 730404 740689 750868 761145 772241 784656 798288 812799 827874 843068
61111 843068 857955 872600 887475 902705 917663 931371 943038 952258 958986 963283 964897 963359
61099 963359 958730 951894 943773 934695 924961 915441 906816 898669 890157 881332 872890 864803 856112 846088
61085 846088 834862 822921 810712 798732 787360 776502 765879 755565 745780 736448 727483 719208
61073 719208 711815 704815 697775 691297 686422 683312 681283 679828 678767 677717 676408 675339 675190 675791 676520
61058 676520 677442 679058 681203 683268 685313 687809 690461 692487 694008 695940 698442 700699 702364 704083
61044 704083 706346 708871 711465 714567 718623 723631 729425 735727 741915 747586 753386 760610 769952 781201
61030G81201J2622J3308J3159J2774J3158J4207J4835J4935J5479J6331J6156
61019I38165J5139J5399J7551J9380J9308J8768J9334K0088J9914K0103K2151
61008A145300K5021K7138K9325L3004L7232M0354M3180M7658N3511N8866O3137
60997A603726O6807O9660P1851P5585Q3068R3883J06674J21858J40037J59621
60987B592770J79007J99397K22518K47882K75774L10473L56211M12413M77658
60978E274103N55620O51670P66959R03013J068970J276125J531025J846557K246998
60969A6121040K719326L134180L248747K856472J975488Q81966o3836o32227p85245
60960B9455911n86118j24768M44837Q57736Q27931K44215p23717j732329k485680
$$ plain form
61030 781201 793823 807131 820290 833064 846222 860429 875264 890199 905678 922009 938165
61019 938165 953304 968703 986254 1005634 1024942 1043710 1063044 1083132 1103046 1123149 1145300
61008 1145300 1170321 1197459 1226784 1259788 1297020 1337374 1380554 1428212 1481723 1540589 1603726
60997 1603726 1670533 1740193 1812044 1887629 1970697 2064580 2171254 2293112 2433149 2592770
60987 2592770 2771777 2971174 3193692 3441574 3717348 4027821 4384032 4796445 5274103
60978 5274103 5829723 6481393 7248352 8151365 9220335 10496460 12027485 13874042 16121040
60969 16121040 18840366 21974546 25223293 28079765 30055253 30937219 30873383 30241156 29455911
60960 29455911 28869793 28745025 29189862 30047598 30875529 31119744 30396027 28663698 26178018
60951B6178018k872060k937955k787207k514888k193433j872285j575860j310895
60943H113435j080117q86319p27381n96453m88663m02932l37289k87151k48710
60934C058420k20038j98442j80231j63672j49237j36587j23993j10946r8746q8049
60924A588479p8106o8869o1736n7659n6032n5709n5675n4762n2130m8300m4435
60913I55066m0817l7021l3145k9567k6013k2190j8906j7047j5986j4455j2557
60902F87362j1335j0799j0019q901q165p719o695n057l627k457p19J603L377M084
60888F20933M645O019P920R423J0108J0203J0083R861R270P972O075M168K577
60875G19257J104l52j608k867m729p040q745r400r828j0589j0978j0420r686r577
$$ plain form
60951 26178018 23305958 20368003 17580796 15065908 12872475 11000190 9424330 8113435
60943 8113435 7033318 6146999 5419618 4823165 4334502 3931570 3594281 3307130 3058420
60934 3058420 2838382 2639940 2459709 2296037 2146800 2010213 1886220 1775274 1676528 1588479
60924 1588479 1510373 1441504 1379768 1322109 1266077 1210368 1154693 1099931 1047801 999501 955066
60913 955066 914249 877228 844083 814516 788503 766313 747407 730360 714374 699919 687362
60902 687362 676027 665228 655209 646308 638143 630424 623729 618672 615045 612588 611869 613472 616849 620933
60888 620933 625578 631597 639517 648940 659048 669251 679334 689195 698465 706437 712512 716680 719257
60875 719257 720361 720009 718401 715534 710805 703765 695020 685620 675792 665203 654225 643805 634119 624542
60861F24542r528q753p797p419o883m905j776J020K831M066M830M902M891N906
60847F05927Q070J0477J2555J4436J6089J7270J8236J9466K0706K1177K0628J9418
60835H04455J7737J5551J3143J0961R188Q052Q007Q897R499Q791P117N284L227
60822I29909O10j867l095l047k570k034j338q96j367k609l969n431p518j0233
60808H84545j2927j5018j6147j6082j5333j5200j6220j7125j6396j4334j2432
60797G17331j1244j0129q710p257n901m563l445k563j227R98L309M786N889P563
60783F84837R428J0366J0471J0823J1622J2057J1955J1951J2167J2116J1866J1841
60771H21500J1552J0143Q145P135P485Q015Q072Q279Q864Q923Q016P069O948P243
$$ plain form
60861 624542 615014 606261 598464 591045 584162 579257 577481 578501 581332 585398 590228 595130 600021 605927
60847 605927 613997 624474 637029 651465 667554 684824 703060 722526 743232 764409 785037 804455
60835 804455 822192 837743 850886 861847 871035 879087 887094 895991 905490 914281 921398 926682 929909
60822 929909 930519 928652 925557 922510 919940 917906 916568 915672 914305 911696 907727 902296 894778 884545
60808 884545 871618 856600 840453 824371 809038 793838 777618 760493 744097 729763 717331
60797 717331 706087 695958 687248 679991 674090 669527 666082 663519 662292 663290 666599 671385 677274 684837
60783 684837 694265 704631 715102 725925 737547 749604 761559 773510 785677 797793 809659 821500
60771 821500 833052 843195 851340 858475 865960 873975 882047 890326 899190 908113 916129 923198 930146 937389
60757I37389P247P136P363P729P723P201O211M763L206K225K073K222K084J612
60743A006184J047N22L1o12j696l154m403n128n796o792p625p883q278r581j0993
60728I35843j1096j0147r802j0509j0832r755q081o925o122m983l617k681k470
60715H38823k932m005n359o307o462o140n886n952o350o860o970o271m990l618
60701G60721k121j95J821L100L494L735M383N186N632N484M679L202J216j068
60687G99269l591o207q567j0641j2852j5163j6664j6856j6595j6742j6627j5192
60675F43572j3032j1672j1157j0014p674n245l663k586j492n63K7N49J055J257
60661E79362J403K119L182L493K643J492R51J098J720K618L238L037K450K427
$$ plain form
60757 937389 944636 951772 959135 966864 974587 981788 987999 992762 995968 998193 1000266 1002488 1004572 1006184
60743 1006184 1007231 1007753 1007784 1007172 1005476 1002322 997919 992791 986995 980203 972578 964695 956417 946836 935843
60728 935843 924747 914600 904798 894289 883457 873702 865621 858696 852574 847591 843974 841293 838823
60715 838823 835891 831886 826527 820220 813758 807618 801732 795780 789430 782570 775600 769329 764339 760721
60701 760721 758600 758405 760226 763326 766820 770555 774938 780124 785756 791240 795919 799121 800337 799269
60687 799269 795678 789471 780904 770263 757411 742248 725584 708728 692133 675391 658764 643572
60675 643572 630540 618868 607711 597697 590023 584778 581115 578529 577037 576474 576501 577050 578105 579362
60661 579362 580765 582884 586066 589559 592202 593694 594645 595743 597463 600081 603319 606356 608806 611233
60647F11233K944L156L053L557M634M927L811K500K355L285M492N675O806P736
60633F70164Q696J0245J2122J3193J3142J3080J3900J5085J5920J6733J8003J9198
60621H39481J9463J8843J7926J6936J5798J4419J2335Q866M362L82k135l982o244
60608I56450q574r947j0337j0527j0753j0575r835q824p769o863o588p314q726
60595H39818j0174j1324j2041j1995j0983r345p638o083m673l387k033k88J675
60582G51529L074L323K585J338m7j079j242o68r0K44Q79K061L104L405L317L448
60566G75181L691L653L431L295L060K394J336L6j541l191m310m718n048n743o222
60551G65304n704m274k518n88J612L775N615P573J0320J3666J6785J9422K2206
$$ plain form
60647 611233 614177 617333 620386 623943 628577 633504 637315 639815 642170 645455 649947 655622 662428 670164
60633 670164 678860 689105 701227 714420 727562 740642 754542 769627 785547 802280 820283 839481
60621 839481 858944 877787 895713 912649 928447 942866 955201 964067 968429 968811 966676 962694 956450
60608 956450 947876 937929 927592 917065 906312 895737 885902 877078 869309 862446 855858 848544 839818
60595 839818 829644 818320 806279 794284 783301 773956 766318 760235 755562 752175 750142 749854 751529
60582 751529 754603 757926 760511 761849 761802 760723 759481 758813 758723 758967 759846 761907 765011 768416 771733 775181
60566 775181 778872 782525 785956 789251 792311 794705 796041 796077 794536 791345 787035 782317 777269 771526 765304
60551 765304 759600 755326 752808 752220 753832 757607 763222 770795 781115 794781 811566 830988 853194
60538H53194K5759L0078L4921M0172M5570N0270N2909N2137M7170L8037K5441
60527A295658J0566m936j9169l0683l8963m3921m5244m2839l7663l1315k4652
60516I86839j7553j0104l279J901N316P544R167J0484J1494J1987J1954J1794
60504A037544J1865J2149J2986J5614K0976K8272L5812M3228N1680O1927P3520
60493A405573Q6090R9949J14885J29643J43211J55757J67907J80221J93891K10759
60483B887886K31975K57374K85909L14665L36486L40721L18626K68125J92884
60474E434651R8497q585j19315k21956l05221l61838l90102l93374l78039l50817
60464C003901l17054k80802k45332k12802j83858j58331j36048j16813j00241
$$ plain form
60538 853194 878953 909031 943952 984124 1029694 1079964 1132873 1185010 1232180 1270217 1295658
60527 1295658 1306224 1301288 1282119 1251436 1212473 1168552 1123308 1080469 1042806 1011491 986839
60516 986839 969286 959182 955903 957804 963120 970664 979831 990315 1001809 1013796 1025750 1037544
60504 1037544 1049409 1061558 1074544 1090158 1111134 1139406 1175218 1218446 1270126 1332053 1405573
60493 1405573 1491663 1591612 1706497 1836140 1979351 2135108 2303015 2483236 2677127 2887886
60483 2887886 3119861 3377235 3663144 3977809 4314295 4655016 4973642 5241767 5434651
60474 5434651 5533148 5524563 5405248 5183292 4878071 4516233 4126131 3732757 3354718 3003901
60464 3003901 2686847 2406045 2160713 1947911 1764053 1605722 1469674 1352861 1252620
60455A252620q6160p4646o5313n7215m9853m3526l8281l3421k8625k4578k1739
60444G29263j9375j6692j4129j2582j2026j1838j1852j2138j2272j1805j1015
60433E83539j0348r555q253o778n732n024m241l507l193l160l042k867k669k068
60419E13102r22J00M57P20J769L425M751N290N230M753M046L569L521L476L139
60404E56426K945L200L320K802K290K681L774M875O094P791R313R560Q644P643
60390F31358O969O136N113M570M652M610L831K476R64m47j540k365l434n003o314
60375F51576o391n510m906n021m989m038k552j448j054q89k63J013K317K787K414
60360F23046K128K498K922K660K052J951K432K935L342L954M708N198N390N506
$$ plain form
60455 1252620 1166460 1091814 1026501 969286 919433 875907 837626 804205 775580 751002 729263
60444 729263 709888 693196 679067 666485 654459 642621 630769 618631 606359 594554 583539
60433 583539 573191 563636 555383 548605 542873 537849 533608 530101 526908 523748 520706 517839 515170 513102
60419 513102 512180 512280 512737 513457 515226 518651 523402 528692 533922 538675 542721 546290 549811 553287 556426
60404 556426 559371 562571 565891 568693 570983 573664 577438 582313 588407 596198 605511 615071 623715 631358
60390 631358 638327 644463 649576 654146 658798 663408 667239 669715 670679 670232 668692 666327 662893 657890 651576
60375 651576 645185 639675 634769 629748 624759 620721 618169 616721 615667 614778 614515 615528 617845 620632 623046
60360 623046 625174 627672 630594 633254 635306 637257 639689 642624 645966 649920 654628 659826 665216 670722
60346F70722N503N285N209N592O077O241O361O729O678N362L200J467O15Q3l67
60331G34757k79N28J661K979M775O947Q832J0002J0523J0374R317P383M820J650
60317H14269j977n145o828p225p536q356r109r126q420p199n499l644k345j935
60303G29925j995j951j659j291j040j043j217j178o59J22Q65J679K667L394L364
60288G29983K871K557K424J984J321J142J727K487K732K374J826J666K226L163
60274G60483L636L341L083L701M885N752O277P204Q746J0339J1655J2985J4491
60261H56578J5855J6938J8155J9980K2425K5144K7826L0580L3981L8477M3526
60250A149465M7896N1212N4563N9060O4529P0229P6183Q2851R0087R7269J03995
$$ plain form
60346 670722 676225 681510 686719 692311 698388 704629 710990 717719 724397 729759 732959 734426 735041 735124 734757
60331 734757 734478 735006 736667 739646 744421 751368 760200 770202 780725 791099 800416 807799 812619 814269
60317 814269 812292 807147 800319 793094 785558 777202 768093 758967 750547 743348 737849 734205 731860 729925
60303 729925 727930 725979 724320 723029 721989 720946 719729 718551 717892 718014 718879 720558 723225 726619 729983
60288 729983 732854 735411 737835 739819 741140 742282 744009 746496 749228 751602 753428 755094 757320 760483
60274 760483 764119 767460 770543 774244 779129 784881 791158 798362 807108 817447 829102 842087 856578
60261 856578 872433 889371 907526 927506 949931 975075 1002901 1033481 1067462 1105939 1149465
60250 1149465 1197361 1248573 1303136 1362196 1426725 1496954 1573137 1655988 1746075 1843344 1947339
60239A947339J09797J13834J15773J16382J16158J14013J08523R9947Q9736P8543
60229C010045O6125N2815L9497K6288J2673j083j3994k5680l6248m4901n0173
60218C035364n1749n0792m8303m4362l9043l2635k4770j4684k729R621K1608L3811
60206B791337M6702N9763P2452Q4826R6685J07169J15628J21982J25828J26193
60196C748565J22474J14851J03608Q9077P2296N4536L6008J6206m340k4011m2104
60185D287166n9329p5717q9521r8946j03843j04873j02213r6028q7155p6364o3640
60174C329537m9026l3377j7553j533J4820L0873M5790N9393P1649Q1836Q8947
60163C621356R2493R2374Q8354Q0326O8840N5062M0391K6006J2232j598j5887
$$ plain form
60239 1947339 2057136 2170970 2286743 2403125 2519283 2633296 2741819 2841766 2931502 3010045
60229 3010045 3076170 3128985 3168482 3194770 3207443 3206360 3192366 3166686 3130438 3085537 3035364
60218 3035364 2983615 2932823 2884520 2840158 2801115 2768480 2743710 2729026 2726297 2735918 2757526 2791337
60206 2791337 2838039 2897802 2970254 3055080 3151765 3258934 3374562 3496544 3622372 3748565
60196 3748565 3871039 3985890 4089498 4178575 4250871 4305407 4341415 4357621 4353281 4329270 4287166
60185 4287166 4227837 4152120 4062599 3963653 3859810 3754937 3652724 3556696 3469541 3393177 3329537
60174 3329537 3280511 3247134 3229581 3228048 3242868 3273741 3319531 3378924 3450573 3532409 3621356
60163 3621356 3713849 3806223 3894577 3974903 4043743 4098805 4139196 4165202 4177434 4175836 4159949
60152D159949k9335l9711m6091m9245m9685m6695l9822k9929j7969l879J2395
60141C819983K9787M7212O4973Q4024J04359J25224J46466J68680J92247K17035
60131D999990K42795K69076K94840L18797L40025L57819L71174L78907L80222
60122G953645L74742L62209L42455L15579K81958K42322J97908J50192J00262
60113A0321272M8615m404n8285j12332j65389k15534k60526k98512l27951l47211
60103H579743l55204l52466l40857l22122k97419k67993k35220j99907j62632
60094F045923j24791q8212n3374j9262J4609M7005P6144J00987J20822J34665
60084F254516J41736J41845J34877J20817J00664P6487N0006K2037o384l3410
$$ plain form
60152 4159949 4130614 4090903 4044812 3995567 3945882 3899187 3859365 3829436 3811467 3807588 3819983
60141 3819983 3849770 3896982 3961955 4045979 4150338 4275562 4422028 4590708 4782955 4999990
60131 4999990 5242785 5511861 5806701 6125498 6465523 6823342 7194516 7573423 7953645
60122 7953645 8328387 8690596 9033051 9348630 9630588 9872910 10070818 10221010 10321272
60113 10321272 10369887 10365483 10307198 10194866 10029477 9813943 9553417 9254905 8926954 8579743
60103 8579743 8224539 7872073 7531216 7209094 6911675 6643682 6408462 6208555 6045923
60094 6045923 5921132 5832920 5779546 5760284 5774893 5821898 5898042 5999029 6119851 6254516
60084 6254516 6396252 6538097 6672974 6793791 6894455 6970942 7020948 7042985 7036601 7003191
60074G003191n7632p9006r8014j14804j29697j43528j56553j67722j75735j80183
60064E700317j81223j78935j73560j65608j55158j41884j26215j09611r3097p6403
60054D298623n9045m1261k3316m926J3882L2312M9948O7305Q4509J00381J13651
60043D632063J24101J31596J35067J33436J26660J14916R7877P5958N1321K6193
60033E649188Q75k5291n1652p6388r8444j17896j34499j47111j54636j56707j53617
60022D533822j46250j35831j23138j08331r2065p5957o1122m6905l2055j6519
60012C695649j034J4368L0339M7126O4619Q3064J02592J22298J40826J57483J71924
60001D629254J83114J89715J91089J86943J76459J59099J36025J09510Q1072N1266
$$ plain form
60074 7003191 6945559 6866553 6768539 6653735 6524038 6380510 6223957 6056235 5880500 5700317
60064 5700317 5519094 5340159 5166599 5000991 4845833 4703949 4577734 4468123 4375026 4298623
60054 4298623 4239578 4198317 4175001 4170075 4183957 4216269 4266217 4333522 4418031 4518412 4632063
60043 4632063 4756164 4887760 5022827 5156263 5282923 5397839 5495716 5571674 5622995 5649188
60033 5649188 5650063 5624772 5573120 5496732 5398288 5280392 5145893 4998782 4844146 4687439 4533822
60022 4533822 4387572 4251741 4128603 4020272 3928207 3852250 3791128 3744223 3712168 3695649
60012 3695649 3694615 3708983 3739322 3786448 3851067 3934131 4036723 4159021 4299847 4457330 4629254
60001 4629254 4812368 5002083 5193172 5380115 5556574 5715673 5851698 5961208 6042280 6093546
59991F093546K0933q795l7764o6626r5014j20901j42103j57551j66911j69980
59981E148834j67028j59125j47572j33175j16274r7168p6566n5642l5358j5538
59971D145388M720K5296M4456O0721P4594Q7360R8887J07906J13979J17668J18780
59960D999755J16116J09304R9621Q8457P6070O2441M8381L4979K2607J1230J330
59949E670291o112j0383j1329q894k658Q109K3858M4101O7575R3306J21352J52209
59937F141425J85735K21144K57806K95334L32860L68689M00788M27011M44812
59928I075604M51215M43428M19250L77013L15870K36823J43495M1682o2038j61471
59918A1280871k51276l27060l85691m25734m47539m52827m44205m24816l97715
$$ plain form
59991 6093546 6114479 6105684 6067920 6001294 5906280 5785379 5643276 5485725 5318814 5148834
59981 5148834 4981806 4822681 4675109 4541934 4425660 4328492 4251926 4196284 4160926 4145388
59971 4145388 4150108 4175404 4219860 4280581 4355175 4442535 4541422 4649328 4763307 4880975 4999755
59960 4999755 5115871 5225175 5324796 5413253 5489323 5551764 5600145 5635124 5657731 5668961 5670291
59949 5670291 5664179 5653796 5642467 5633573 5630915 5639024 5662882 5706983 5774558 5867864 5989216 6141425
59937 6141425 6327160 6548304 6806110 7101444 7434304 7802993 8203781 8630792 9075604
59928 9075604 9526819 9970247 10389497 10766510 11082380 11319203 11462698 11504380 11442342 11280871
59918 11280871 11029595 10702535 10316844 9891110 9443571 8990744 8546539 8121723 7724008
59909G724008l65149l28539k89407k49732k10983j73246j36055r9584o4332l0106
59899E776875L490L5875O5999R3910J20494J45578J67609J85290J97994K04289
59889F997403K01651J88390J64617J30782Q6915L4286k3542q2439j39414j91815
59879G366834k36340k70448k93963l08062l13492l10845l01650k87762k70186
59870D774086k49598k27327k04712j82153j59830j38622j19232j01168q3900o8244
59860C239300n5380m5253l7274l1897l0000l1104l3640l6526l9206m0718m0175
59849B818127l7865l4545l0006k3640j6060q768k642J981M230L195p57o619j4248
59836B652383k3694l3441m1117m5894m8597m9587m8299m4833m0237l4864k8137
$$ plain form
59909 7724008 7358859 7030320 6740913 6491181 6280198 6106952 5970897 5871313 5806981 5776875
59899 5776875 5780365 5816240 5882239 5976149 6096643 6242221 6409830 6595120 6793114 6997403
59889 6997403 7199054 7387444 7552061 7682843 7769758 7804044 7780502 7698063 7558649 7366834
59879 7366834 7130494 6860046 6566083 6258021 5944529 5633684 5332034 5044272 4774086
59870 4774086 4524488 4297161 4092449 3910296 3750466 3611844 3492612 3391444 3307544 3239300
59860 3239300 3183920 3138667 3101393 3069496 3039496 3008392 2974752 2938226 2899020 2858302 2818127
59849 2818127 2780262 2745717 2715711 2692071 2676011 2667243 2664601 2666582 2670812 2674007 2673250 2666631 2652383
59836 2652383 2628689 2595248 2554131 2508237 2459640 2410053 2361754 2316921 2276684 2241820 2213683
59825B213683k0219j2374n220J966R753J7712K5363L2632L8918M3107M5160M6573
59813B437054M8764N2012N6222O1473O7133P1443P2594O9549O1866M9917L5723
59802C083750K2154J0713R79p336j3086j5210j4369j2046q707l778L119J1803
59790C057986K1996L3460M5820N8894P3045Q8851J06510J25861J46914J70163
59780C929500J96338K25820K58276K93037L29550L66622M00378M23224M25339
59771F848084L97627L34584K37124J14620j6515j38509k38138l08621l48612l61333
59761F520311l53517l32436l03030k68312k31426j95497j61875j30397j01367
59752D442454p5619n2850l1738j1940N763K1425L6338N1273O5982Q0719R6453
$$ plain form
59825 2213683 2193464 2181090 2175870 2177836 2187589 2205301 2230664 2263296 2302214 2345321 2390481 2437054
59813 2437054 2485818 2537830 2594052 2655525 2722658 2794101 2866695 2936244 2998110 3048027 3083750
59802 3083750 3105904 3116617 3117596 3110260 3097174 3081964 3067595 3055549 3046842 3043064 3046183 3057986
59790 3057986 3079982 3113442 3159262 3218156 3291201 3380052 3486562 3612423 3759337 3929500
59780 3929500 4125838 4351658 4609934 4902971 5232521 5599143 5999521 6422745 6848084
59771 6848084 7245711 7580295 7817419 7932039 7915524 7777015 7538877 7230256 6881644 6520311
59761 6520311 6166794 5834358 5531328 5263016 5031590 4836093 4674218 4543821 4442454
59752 4442454 4366835 4313985 4282247 4270307 4276070 4297495 4333833 4385106 4451088 4531807 4628260
59741D628260J13169J29727J46002J63338J82324K01951K21816K43414K67968
59732F297969K94627L22111L50916L82475M17069M53921M92386N31679N69893
59723A0113046O04493O33433O54844O66018O63813O46391O14447N71203N21748
59714A5689436M71894M27124L92234L71252L66521L77696M02347M37502M79751
59705A9415757N24171N64670N95907O13748O13873N91741N44919M74526L83926
59696B4323238K77419J61027M2953o8299j66081k45563l02992l36295l45813l33429
59686B3006165l01361k52300j89779j17263l7129M9003J39683K34112L32463M34774
59676B3298368N39830O45566P49729Q49252R39209J012800J061776J076486J046604
$$ plain form
59741 4628260 4741429 4871156 5017158 5180496 5362820 5564771 5786587 6030001 6297969
59732 6297969 6592596 6914707 7265623 7648098 8065167 8519088 9011474 9543153 10113046
59723 10113046 10717539 11350972 12005816 12671834 13335647 13982038 14596485 15167688 15689436
59714 15689436 16161330 16588454 16980688 17351940 17718461 18096157 18498504 18936006 19415757
59705 19415757 19939928 20504598 21100505 21714253 22328126 22919867 23464786 23939312 24323238
59696 24323238 24600657 24761684 24804637 24736338 24570257 24324694 24021702 23685407 23339594 23006165
59686 23006165 22704804 22452504 22262725 22145462 22108333 22157336 22297019 22531131 22863594 23298368
59676 23298368 23838198 24483764 25233493 26082745 27021954 28034754 29096530 30173016 31219620
59667C1219620R63360Q21843O22289L71147Q2314k23533n22737p93322j017949
59658C1523032j185364j291336j338247j332786j283678j201112j096610r81787
59650B1812112q67262p63427o81610o32760o23604o52906p10265p78539q39445
59641A5262294q79752q94184q83765q52483q05361p47950o85654o22750n61975
59632H328420n04718m51455m02356l57782l17985k82495k50481k21724j96512
59623E342912j74553j54795j36478j19552j03950q9308p5682o3673n3596m5314
59613D326011l8987l5030l3231l3104l5291m1151n0427o0664o9712p7522q4683
59602C766209r0539r3972r5010r4375r2069q7631q1321p4088o6677n9422n2454
$$ plain form
59667 31219620 32182980 33004823 33627112 33998259 34080573 33857040 33334303 32540981 31523032
59658 31523032 30337668 29046332 27708085 26375299 25091621 23890509 22793899 21812112
59650 21812112 20944850 20181423 19499813 18867053 18243449 17590543 16880278 16101739 15262294
59641 15262294 14382542 13488358 12604593 11752110 10946749 10198799 9513145 8890395 8328420
59632 8328420 7823702 7372247 6969891 6612109 6294124 6011629 5761148 5539424 5342912
59623 5342912 5168359 5013564 4877086 4757534 4653584 4564276 4488594 4424921 4371325 4326011
59613 4326011 4287024 4251994 4218763 4185659 4150368 4109217 4058790 3998126 3928414 3850892 3766209
59602 3766209 3675670 3581698 3486688 3392313 3300244 3212613 3131292 3057204 2990527 2931105 2878651
59591B878651m5469l7845k9660k1981j5551r761l631K827Q879J4117J8519K2037
59579B781132K4702K6665K7658K7134K5404K3819K3195K2909K2252K1886K3103
59568C049859K6334L1176L7109M3510M9750N6176O4206P4446Q5483R5622J05175
59557C718846J15909J28670J42813J57614J73080J89346K06272K23653K41144
59548E297347K57890K72858K85445K95250L01527L03391L00528K93173K81655
59539G889064K66448K48653K29887K11359J92902J72789J48960J21273R2682O7525
59529I641542M8544L5995K9350K8641L3921M4655O0184P9820J01843J23133J40186
59518A0367814J49839J48933J34656J05991O4178J1467m9692j16095j83839k49638
$$ plain form
59591 2878651 2833182 2795337 2765677 2743696 2728145 2718384 2714753 2717580 2726459 2740576 2759095 2781132
59579 2781132 2805834 2832499 2860157 2887291 2912695 2936514 2959709 2982618 3004870 3026756 3049859
59568 3049859 3076193 3107369 3144478 3187988 3237738 3293914 3358120 3432566 3518049 3613671 3718846
59557 3718846 3834755 3963425 4106238 4263852 4436932 4626278 4832550 5056203 5297347
59548 5297347 5555237 5828095 6113540 6408790 6710317 7013708 7314236 7607409 7889064
59539 7889064 8155512 8404165 8634052 8845411 9038313 9211102 9360062 9481335 9574017 9641542
59529 9641542 9690086 9726081 9755431 9784072 9817993 9862648 9922832 10002652 10104495 10227628 10367814
59518 10367814 10517653 10666586 10801242 10907233 10971411 10982878 10933186 10817091 10633252 10383614
59508A0383614l11151l65671m09938m41861m61277m68487m63558m47863m24682
59499F589126l97066l66284l33215k99784k67678k36921k07180j79311j54314
59490D147373j31758j10715r1262p3679n7098m0505k4334r545M175J7960L2226
59479C662838M6876O2292P8626R4882J10234J25696J42906J61712J80432J98090
59469D864584K14916K30964K45535K57660K65867K67831K61597K46832K23813
59460G079599J91756J49697R8739M2013j7303p6717j33470j84546k27794k62164
59450F659810k87006l02218l08797l08186l01253k88876k73026k55993k38637
59441D095818k20497k01459j82338j64049j47106j31812j18047j05223r3085q2141
$$ plain form
59508 10383614 10072463 9706792 9296854 8854993 8393716 7925229 7461671 7013808 6589126
59499 6589126 6192060 5825776 5492561 5192777 4925099 4688178 4480998 4301687 4147373
59490 4147373 4015615 3904900 3813638 3739959 3682861 3642356 3618022 3608477 3612652 3630612 3662838
59479 3662838 3709714 3772006 3850632 3945514 4055748 4181444 4324350 4486062 4666494 4864584
59469 4864584 5079500 5310464 5555999 5813659 6079526 6347357 6608954 6855786 7079599
59460 7079599 7271355 7421052 7519791 7561804 7544501 7467784 7334314 7149768 6921974 6659810
59450 6659810 6372804 6070586 5761789 5453603 5152350 4863474 4590448 4334455 4095818
59441 4095818 3875321 3673862 3491524 3327475 3180369 3048557 2930510 2825287 2732202 2650061
59431B650061p2543o3428n4200m5609l8405l1862k4991j8326j2999q669m011J136
59419B276154N721R267J2323J5307J8189K1197K4792K9242L4755M1004M5584M4583
59407B578118L6776K6331J9318J8162K1281K6986L5100M5279N6702O9600Q4328
59396C017981R8540J07948J11090J11515J14400J22578J36396J55331J78403K04221
59386D358403K31946K61740K93912L28484L65696M05764M47678M89248N28325
59377G711196N62927N90120O06259O08753N96691N70038N29874M79644M24472
59368A2679974L68546L14118K62968K17068J77181J42202J10483Q0562N0294J6788
59358A4420184k1856o5650j13846j65662k19242k70984l16733l53067l77523l89090
$$ plain form
59431 2650061 2577518 2514090 2459890 2414281 2375876 2344014 2319023 2300697 2287698 2279029 2275018 2276154
59419 2276154 2281875 2291142 2303465 2318772 2336961 2358158 2382950 2412192 2446947 2487951 2533535 2578118
59407 2578118 2614894 2641225 2660543 2678705 2699986 2726972 2762072 2807351 2864053 2933653 3017981
59396 3017981 3116521 3224469 3335559 3447074 3561474 3684052 3820448 3975779 4154182 4358403
59386 4358403 4590349 4852089 5146001 5474485 5840181 6245945 6693623 7182871 7711196
59377 7711196 8274123 8864243 9470502 10079255 10675946 11245984 11775858 12255502 12679974
59368 12679974 13048520 13362638 13625606 13842674 14019855 14162057 14272540 14353102 14403396 14420184
59358 14420184 14398328 14332678 14218832 14053170 13833928 13562944 13246211 12893144 12515621 12126531
59348A2126531l89275l81847l70858l59435l50242l45582l46313l51528l59624
59339H871827l68781l76457l79965l78253l72139l62380l48640l30748l09683
59330E644781k86656k62231k37054k12419j89324j67700j47156j27772j09677
59321C904792r2682p6808o2534m9964l8418k7257j6509o367L315J2714K1814L0701
59309C602797L9508M7984N5747O2880O9618P5513P9746Q2218Q3425Q3232Q0786
59298D363454P5660O8251N9005M8136L6172K3917J1977J099p410j2675j5354j6532
59286D635700j5843j1991m817M736J6376L0382M5792O0714P4755Q9279J04606
59275E029689J18787J29910J37942J43295J45036J41793J33352J20243J02372
$$ plain form
59348 12126531 11737256 11355409 10984551 10625116 10274874 9929292 9582979 9231451 8871827
59339 8871827 8503046 8126589 7746624 7368371 6996232 6633852 6285212 5954464 5644781
59330 5644781 5358125 5095894 4858840 4646421 4457097 4289397 4142241 4014469 3904792
59321 3904792 3812110 3735302 3672768 3622804 3584386 3557129 3540620 3534253 3537568 3550282 3572096 3602797
59309 3602797 3642305 3690289 3746036 3808916 3878534 3954047 4033793 4116011 4199436 4282668 4363454
59298 4363454 4439114 4507365 4566370 4614506 4650678 4674595 4686572 4687671 4680261 4667586 4652232 4635700
59286 4635700 4619857 4607866 4603049 4607785 4624161 4654543 4700335 4761049 4835804 4925083 5029689
59275 5029689 5148476 5278386 5416328 5559623 5704659 5846452 5979804 6100047 6202419
59266F202419P8999M9715J5208k2155n8172q8187j09444j21825j26463j24532
59256E695563j17311j06209r2334p6761o1191m7289l5355k4760j5661r094n438
59245E104160m126m780p235j0401j2663j3587j3693j2523q603j414Q424K1177
59233E044736L8195N9569Q3599J09271J37491J68996K02882K38004K74059L10152
59223F666954L43834L72428L93764M04706M00877L79332L40282K85281K15348
59214I802806J32168L9572n7669j55421k49336l33852m03788m56273m90340n05919
59204G321948n04612m90214m66753m36579m01350l63759l26717k91561k58427
59195C781976k27806k00467j76381j54977j36104j19820j05755r3565q3451p5366
$$ plain form
59266 6202419 6281418 6331133 6346341 6324186 6266014 6177827 6068383 5946558 5820095 5695563
59256 5695563 5578252 5472043 5379709 5302948 5241757 5194468 5159113 5134353 5118692 5109598 5104160
59245 5104160 5100034 5095254 5088019 5077618 5064955 5051368 5037675 5025152 5016549 5015135 5023559 5044736
59233 5044736 5082931 5142500 5226099 5335370 5472861 5641857 5844739 6082743 6356802 6666954
59223 6666954 7010788 7383216 7776980 8181686 8582563 8961895 9302177 9587458 9802806
59214 9802806 9934974 9974546 9916877 9761456 9512120 9178268 8774480 8318207 7827867 7321948
59204 7321948 6817336 6327122 5860369 5423790 5022440 4658681 4331964 4040403 3781976
59195 3781976 3554170 3353703 3177322 3022345 2886241 2766421 2660666 2567101 2483650 2408284
59185B408284o8390o1735n5702n0739m6256m1333l6044l1106k6745k2688j8824
59174A948722j5069j1093o884k977L84L776P692J1788J5647J9465K3435K7178
59162B022064L0498L3948L7998M2237M6089M9648N3313N7207O1430O6154P1089
59151B571675P5590P9600Q3629Q7587R0643R2512R3656R3840R1828Q7045Q0297
59140C527902P2296O2758N1554L9450K6936J3745L74j1283j9759k5323k8669k9593
59128C680388k7915k4391j9581j2902l786P214J9431L3072M8260O4182Q0140R6436
59116C940548J13325J30155J46340J62143J77628J92126K05506K18629K31524
59107E517924K42405K49357K51635K48282K37120K16488J86790J49284J04905
$$ plain form
59185 2408284 2339894 2278159 2222457 2171718 2125462 2084129 2048085 2016979 1990234 1967546 1948722
59174 1948722 1933653 1922560 1915676 1912699 1913083 1916859 1924551 1936339 1951986 1971451 1994886 2022064
59162 2022064 2052562 2086510 2124508 2166745 2212834 2262482 2315795 2373002 2434432 2500586 2571675
59151 2571675 2647265 2726865 2810494 2898081 2988724 3081236 3174892 3268732 3360560 3447605 3527902
59140 3527902 3600198 3662956 3714510 3753960 3780896 3794641 3795015 3783732 3763973 3738650 3709981 3680388
59128 3680388 3652473 3628082 3608501 3595599 3591813 3599027 3618458 3651530 3699790 3763972 3844112 3940548
59116 3940548 4053873 4184028 4330368 4492511 4670139 4862265 5067771 5286400 5517924
59107 5517924 5760329 6009686 6261321 6509603 6746723 6963211 7150001 7299285 7404190
59098G404190N5712O005l9865q0105j14727j43466j65900j82603j94644k02761
59088F341836k08065k12448k16835k20156k21357k21282k21117k20231k17191
59079D383154k11963k05457j97900j89259j80366j71954j63277j53295j42543
59070B767140j32363j23032j14067j05616r7992r0608q2824p5212o8634o2759
59060A814033n6878n1321m6697m2516l8166l4415l2381l1581l0483k8507k6193
59049A394895k3990k2085k0792j9962j8760j7026j5764j5175j3568r742n109j753
59037A211169M21K698M905N962O277P414R736J2340J4900J7783K0698K2901K4480
59024A361684K5825K6217K4459K0620J5822J0711N416N74k946m955n603m880l234
$$ plain form
59098 7404190 7459902 7465907 7426042 7345937 7231210 7087744 6921844 6739241 6544597 6341836
59088 6341836 6133771 5921323 5704488 5484332 5262975 5041693 4820576 4600345 4383154
59079 4383154 4171191 3965734 3767834 3578575 3398209 3226255 3062978 2909683 2767140
59070 2767140 2634777 2511745 2397678 2292062 2194070 2103462 2020638 1945426 1876792 1814033
59060 1814033 1757155 1705834 1659137 1616621 1578455 1544040 1511659 1480078 1449595 1421088 1394895
59049 1394895 1370905 1348820 1328028 1308066 1289306 1272280 1256516 1241341 1227773 1218031 1212922 1211169
59037 1211169 1211590 1214288 1219193 1225155 1231432 1238846 1248582 1260922 1275822 1293605 1314303 1337204 1361684
59024 1361684 1387509 1413726 1438185 1458805 1474627 1485338 1490754 1491328 1488382 1483427 1477824 1472944 1469710
59011A469710j632L0L178Q023J2391J4618J5845J7566J8653J7158J3566R633N360
58998A604099k18o222j0796j3976j7008j9479j9919j8746j7729j6866j4626j1101
58986A437413q126o242m240j793J03J449L441O056P855Q606R671J1473J2889J3545
58972A492100J4501J6184J7892J9604K2161K5182K7068K7608K8366K9995L1280
58961A751941L1585L1961L3060L3904L3757L3439L3777L4377L4832L5716L7590
58950B125939M0229M3506M7771N2819N7734O2211O6942P2283P7821Q3520R0066
58939B820841R7796J06392J15719J25747J35788J45204J54869J66449J80281J95440
58929D244526K11835K30492K51699K74585K98793L25012L53684L84575M17751
$$ plain form
59011 1469710 1468078 1468108 1471286 1479309 1491700 1506318 1522163 1539729 1558382 1575540 1589106 1598739 1604099
58998 1604099 1603881 1597659 1586863 1572887 1555879 1536400 1516481 1497735 1480006 1463140 1448514 1437413
58986 1437413 1429287 1423045 1418805 1417012 1417115 1418564 1422005 1428061 1435916 1444522 1454193 1465666 1478555 1492100
58972 1492100 1506601 1522785 1540677 1560281 1582442 1607624 1634692 1662300 1690666 1720661 1751941
58961 1751941 1783526 1815487 1848547 1882451 1916208 1949647 1983424 2017801 2052633 2088349 2125939
58950 2125939 2166168 2209674 2257445 2310264 2367998 2430209 2497151 2569434 2647255 2730775 2820841
58939 2820841 2918637 3025029 3140748 3266495 3402283 3547487 3702356 3868805 4049086 4244526
58929 4244526 4456361 4686853 4938552 5213137 5511930 5836942 6190626 6575201 6992952
58920F992952M53534M91433N30502N70597O11715O52395O90234P23694P51370
58911A2468426P69796P73968P59976P25236O66620N81228M69593L36170J86644
58902A7737657K7066j34293k87458m24588n41759o36653p06925p52018p74467
58893A3506562p78060p65987p41451p08203o69245o26160n80461n34327m89421
58884G613247m46320m05575l68094l34052l02911k74807k50523k29764k11128
58875D790073j94058j79177j66354j54251j42236j31082j21190j11804j02528
58866C487393r3985q6379p8947p1425o4562n8646n3010m7404m2446l8246l4012
58855B818331k9351k4581j9571j3826p836k666J934P288J3461J9109K3888K9119
$$ plain form
58920 6992952 7446486 7937919 8468421 9039018 9650733 10303128 10993362 11717056 12468426
58911 12468426 13238222 14012190 14772166 15497402 16164022 16745250 17214843 17551013 17737657
58902 17737657 17764723 17630430 17342972 16918384 16376625 15739972 15033047 14281029 13506562
58893 13506562 12728502 11962515 11221064 10512861 9843616 9217456 8636995 8102668 7613247
58884 7613247 7166927 6761352 6393258 6059206 5756295 5481488 5230965 5001201 4790073
58875 4790073 4596015 4416838 4250484 4096233 3953997 3822915 3701725 3589921 3487393
58866 3487393 3393408 3307029 3228082 3156657 3092095 3033449 2980439 2933035 2890589 2852343 2818331
58855 2818331 2788980 2764399 2744828 2731002 2723166 2720500 2722434 2729722 2743183 2762292 2786180 2815299
58843B815299L5587M2519M9210N5993O3137P0397P8000Q6442R5161J03126J10764
58832C605635J19496J29383J39391J49955J62887J78319J94224K09567K25762
58823E114619K44371K65508K89140L15792L45297L76696M09942M45782M83766
58814H290913N22496N61938O02903O43813O80486P09567P29543P37849P29863
58805A4209371P01653O51114N75947M74016L47235K02514M7644j11065k66229
58796A6832200m08367n29988o28487p03346p53294p78478p82916p72011p49113
58787A0726200p16309o76630o33185n87620n41381m97053m56546m19272l83873
58778E814331l50491l19914k91813k65582k41740k21138k03763j89292j77483
$$ plain form
58843 2815299 2850886 2893405 2942615 2998608 3061745 3132142 3210142 3296584 3391745 3494871 3605635
58832 3605635 3725131 3854514 3993905 4143860 4306747 4485066 4679290 4888857 5114619
58823 5114619 5358990 5624498 5913638 6229430 6574727 6951423 7361365 7807147 8290913
58814 8290913 8813409 9375347 9978250 10622063 11302549 12012116 12741659 13479508 14209371
58805 14209371 14911024 15562138 16138085 16612101 16959336 17161850 17209494 17098429 16832200
58796 16832200 16423833 15893845 15265358 14562012 13808718 13030240 12247324 11475313 10726200
58787 10726200 10009891 9333261 8700076 8112456 7571075 7074022 6617476 6198204 5814331
58778 5814331 5463840 5143926 4852113 4586531 4344791 4123653 3919890 3730598 3553115
58769C553115j67283j57069j46671j37396j29303j20543j10411j00734r2943q5963
58759B304799p8519p1351o5379n9675n3125m6454m0826l6006l1414k7436k4237
58748A770377k0956j7426j4971j4106j3178j0887q342p097o911p020p938j0345
58736A631200j3669j7218k1242k5522k8576k9608k9605k9393k8406k6525k5108
58725A356328k4792k4349k3045k2138k2649k3662k4244k4821k5423k4821k2987
58714A093397k1912k2401k2478k0727j8589j7508j6384j4043j1696j0688j0132
58703I06839r044q428q886q663o605m781n422p397q388q478q783q647p122n383
58689H00812m756m080j822Q84K155K603L716M663L761J684K29q12k665m693n368
$$ plain form
58769 3553115 3385832 3228763 3082092 2944696 2815393 2694850 2584439 2483705 2390762 2304799
58759 2304799 2226280 2154929 2089550 2029875 1976750 1930296 1889470 1853464 1822050 1794614 1770377
58748 1770377 1749421 1731995 1717024 1702918 1689740 1678853 1670511 1663414 1656503 1649483 1641545 1631200
58736 1631200 1617531 1600313 1579071 1553549 1524973 1495365 1465760 1436367 1407961 1381436 1356328
58725 1356328 1331536 1307187 1284142 1262004 1239355 1215693 1191449 1166628 1141205 1116384 1093397
58714 1093397 1071485 1049084 1026606 1005879 987290 969782 953398 939355 927659 916971 906839
58703 906839 897795 889367 880481 871818 865213 860432 855010 847613 839225 830747 821964 813317 806195 800812
58689 800812 796056 791976 790154 791038 793193 795796 799512 804175 807936 809620 809849 809037 806372 801679 796311
58674G96311m939m433l216l71K684L784L188K597K151J073J22O42K004K549K185
58659H06331J815J178m25k373l858n477p656q974q271o675n334l067J123N299
58645G63636P350Q524J1058J4168J5832J6763J8915K1545K2628K3040K5371K9394
58633I78224L2593L4667L7699M2175M6475N0318N5307O1915O8946P6113Q4434
58622A568866R4012J03974J14497J26541J39882J53651J68280J84571K01361K16354
58612C071989K28471K37105K40053K34636K19943J95657J60165J12830N7221p15
58602D757355n6824j08609j52595j85411k06812k18706k22042k17446k07693j96180
58592B985037j83728j69749j55488j42866j31349j19319j07542r7834q9321p9736
$$ plain form
58674 796311 791372 786939 783723 783352 786036 789820 793008 795605 797756 798829 798951 799593 801597 804146 806331
58659 806331 808146 809324 808899 806526 802668 797191 789535 780561 772290 765615 760281 757214 758337 763636
58645 763636 770986 779510 790568 804736 820568 837331 856246 877791 900419 923459 948830 978224
58633 978224 1010817 1045484 1083183 1125358 1171833 1222151 1277458 1339373 1408319 1484432 1568866
58622 1568866 1662878 1766852 1881349 2007890 2147772 2301423 2469703 2654274 2855635 3071989
58612 3071989 3300460 3537565 3777618 4012254 4232197 4427854 4588019 4700849 4758070 4757355
58602 4757355 4700531 4591922 4439327 4253916 4047104 3828398 3606356 3388910 3181217 2985037
58592 2985037 2801309 2631560 2476072 2333206 2201857 2082538 1974996 1877162 1787841 1708105
58582A708105o9512o0857n3559m5529l7025l0382k5891k1649j7221j3909j1536
58571A321035q605n475l933l815l368k637l127m474n067n560q133j2503j6328
58558A238010j9357k3421k8366l1781l2858l2961l2316k9773k5982k3211k1702
58547I36282j9492j6104j3070j0881q622o634o149o419n504l783l279l839l580
58534H28926k804l625n838p055o939p468q882r361q935r753j2027j3469j3277
58521G19493j3095j3541j3309j2124j1241j0672r228p332o565o523n514l980l631
58508F02738l664j872R09J700M97J31J220J742J530K643M963O053N705O206P796
58493F38297Q390Q073R154J1410J2027J0707J0023J0218Q711N437L581L977L832
$$ plain form
58582 1708105 1638593 1577736 1524177 1478648 1441623 1411241 1385350 1363701 1346480 1332571 1321035
58571 1321035 1312430 1306955 1303022 1299207 1295839 1293202 1290075 1285601 1280534 1274974 1266841 1254338 1238010
58558 1238010 1218653 1195232 1166866 1135085 1102227 1069266 1036950 1007177 981195 957984 936282
58547 936282 916790 900686 887616 876735 868113 861479 855330 848911 843407 839624 836345 832506 828926
58534 828926 826122 822497 816659 809604 802665 795197 786315 776954 768019 758266 746239 732770 719493
58521 719493 706398 692857 679548 667424 656183 645511 636283 628951 622386 615863 610349 606369 602738
58508 602738 599074 597202 598111 599811 600308 600439 601659 603401 604931 607574 612537 618590 624295 630501 638297
58493 638297 646687 654760 663914 675324 687351 698058 708081 718299 727010 732447 736028 740005 743837
58480G43837K098J067J400O08j994l649l037k227k345j916q85j633m498o813p696
58465G12317r269j1884j2999j2044j1522j1870j0374o722m344m435l919j390J44
58452F11689j118k542j908q10o68j9J731K392J290J120L234N344O077P354J0086
58437F43252J2101J2502J3454J5385J5198J1614P623N216K419k004n675p015p776
58424G16294q750p699m193j550j284m37K815N816O556P125R114J0366R523Q988
58410G52684J0280J1061R937R409J0965J1940J0498Q919Q742P395L125j470m167
58397H49318o712j0386j2710j2028j0797j0966j0660q559o836o573n277k100l46
58384G45368j492k058J11J972J301Q51K585L492J447l72N93J568L42K07L984Q317
$$ plain form
58480 743837 745935 747002 748402 749010 747016 743367 740330 738103 735758 733842 732957 731324 726826 720013 712317
58465 712317 703048 691164 678165 666121 654599 642729 632355 625633 621289 616854 612935 611545 611689
58452 611689 610571 608029 606121 605311 604643 604624 606355 608747 610037 611157 614391 619735 625812 633166 643252
58437 643252 655353 667855 681309 696694 711892 723506 731129 736345 738764 736760 731085 724070 716294
58424 716294 707544 699845 695652 694102 692818 692381 695196 701012 707568 714693 723807 734173 743696 752684
58410 752684 762964 774025 783962 793371 804336 816276 826774 835693 844435 851830 854955 853485 849318
58397 849318 842606 832220 819510 807482 796685 785719 775059 766500 759664 753091 747814 745714 745368
58384 745368 743876 741818 741929 743901 745202 746053 748638 752130 753577 753205 753798 755366 755708 755915 759899 768216
58368G68216R172Q159Q377Q810P850P562R452J0619R010P770R589J1587J0714
58355H86887R335J0437J2169J2200J2540J4865J6014J3369R869Q576P127K799
58343A016187j905l925m966p063p954n908l834l621j979K957O890O652O078Q787
58329A006396J1554J0967J0287J3007J5854J5050J3487J4737J6061J4510J3663
58318A155573J6859J9986J8733J6901J9371K2933K2454K0300K0897K1584J7752
58307A373343J1933R042P609M262J759L897P481P923P756J1110J5117J5470J5033
58294A491735J8093K1648K1246J9884K2000K4580K3423K2120K5281K9082K8394
58283A747486K6897K9970L4122L4082L3655L8491M4732M6262M6525N1337N6715
$$ plain form
58368 768216 777388 785547 793924 802734 810584 818146 827598 838217 847227 854997 864586 876173 886887
58355 886887 896222 906659 918828 931028 943568 958433 974447 987816 997685 1006261 1013388 1016187
58343 1016187 1014282 1010357 1005391 998328 990374 984466 980632 977011 975032 977989 984879 991531 997609 1006396
58329 1006396 1017950 1028917 1039204 1052211 1068065 1083115 1096602 1111339 1127400 1141910 1155573
58318 1155573 1172432 1192418 1211151 1228052 1247423 1270356 1292810 1313110 1334007 1355591 1373343
58307 1373343 1385276 1394318 1401927 1406189 1407948 1411845 1419326 1427249 1435005 1446115 1461232 1476702 1491735
58294 1491735 1509828 1531476 1552722 1572606 1594606 1619186 1642609 1664729 1690010 1719092 1747486
58283 1747486 1774383 1804353 1838475 1872557 1906212 1944703 1989435 2035697 2082222 2133559 2190274
58272B190274N6133N3216N4552N6543N2460M6031M4530M4880M0451L5264L7089
58261B711423M2709M4446M5109N1588N9967O2334O2195O7615P5313P7413P7435
58250C377547Q3149R0338R0730Q9160R5143J04361J06937J06979J14625J25800
58240D384769J30148J31994J42353J56937J64035J67531J79298J95536K04297
58231E856898K09984K25618K47199K61337K71972K92830L19872L39092L55261
58222H380063L83689M19992M48676M75130N16747N69005O14702O60078P25471
58213A3193553Q06979Q86190R70991J085186J224833J369785J531653J742218
58205B2811388K002096K293508K635311L065526L576499M132955M747936N469975
$$ plain form
58272 2190274 2246407 2299623 2354175 2410718 2463178 2509209 2553739 2598619 2639070 2674334 2711423
58261 2711423 2754132 2798578 2843687 2895275 2955242 3017576 3079771 3147386 3222699 3300112 3377547
58250 3377547 3460696 3551034 3641764 3730924 3826067 3930428 4037365 4144344 4258969 4384769
58240 4384769 4514917 4646911 4789264 4946201 5110236 5277767 5457065 5652601 5856898
58231 5856898 6066882 6292500 6539699 6801036 7073008 7365838 7685710 8024802 8380063
58222 8380063 8763752 9183744 9632420 10107550 10624297 11193302 11808004 12468082 13193553
58213 13193553 14000532 14886722 15857713 16942899 18167732 19537517 21069170 22811388
58205 22811388 24813484 27106992 29742303 32807829 36384328 40517283 45265219 50735194
58197E0735194O306589P248677Q365990R781329J1555482J3709341J6348750J9632717
58189A43684069K3652247K8525905L4459582M1073415M6265101M6260323L7852033
58182D01772675K1222934M92620j8744987l2580791m0036418m2173976m0679669
58175B49272388l7088793l2571411k7880117k3410858j9376207j5910123j3037780
58168G9997099j0673486q720045p129161n851667m802360l912896l167158k550264
58160C3190062k008812j495045j007156n47676p8917M39342J006155J631720K397971
58151C3527644L350767M269521M619080L875667J989492m82027k735335m232284
58143D4182525m902405m961977m652738m146992l572772l019202k519391k074637
$$ plain form
58197 50735194 57041783 64290460 72656450 82437779 93993261 107702602 124051352 143684069
58189 143684069 167336316 195862221 230321803 271395218 317660319 363920642 401772675
58182 401772675 422995609 423488229 404743242 372162451 332126033 289952057 249272388
58175 249272388 212183595 179612184 151732067 128321209 108945002 93034879 79997099
58168 79997099 69323613 60603568 53474407 47622740 42820380 38907484 35740326 33190062
58160 33190062 31181250 29686205 28679049 28131373 28052456 28491798 29497953 31129673 33527644
58151 33527644 36878411 41147932 45767012 49642679 51632171 51150144 48414809 44182525
58143 44182525 39280120 34318143 29665405 25518413 21945641 18926439 16407048 14332411
58135A4332411j694813j392765j156694r61141p98003o71522n72544m84557m08342
58126F192030l55261l21133k90149k60230k41697k34061k25668k13948k05639
58117C844244j98784j84116j63063j46056j34047j18886j00581q7171p9012o9871
58107B562657o2202o4476p4109p9371p7789p6975p7838p3298o3788n8032n7272
58096A797507n3690m5821m1032m1217m0000l5945l5044l8076l8438l4696l2971
58085A360577l4837l4674l1075k9348l0762l0382k7403k6729k8690k7881k3807
58074A034989k1985k3061k1450j6399j3707j4672j3869r898p987r749j0388q335
58062H63489p820r674r274n939m849p313q492p006p440j0857j2212r888q645j0269
$$ plain form
58135 14332411 12637598 11244833 10088139 9126998 8328995 7657473 7084929 6600372 6192030
58126 6192030 5836769 5515636 5225487 4965257 4723560 4489499 4263831 4049883 3844244
58117 3844244 3645460 3461344 3298281 3152225 3018178 2899292 2798711 2711540 2632528 2562657
58107 2562657 2500455 2435979 2361870 2282499 2204710 2127735 2049897 1976599 1912811 1854779 1797507
58096 1797507 1743817 1697996 1656964 1615747 1575747 1539802 1504758 1466682 1428244 1393548 1360577
58085 1360577 1325740 1291066 1259991 1230643 1199881 1169499 1142096 1115367 1086677 1058796 1034989
58074 1034989 1013004 989943 968493 952094 938387 923715 909846 899948 891961 882212 871824 863489
58062 863489 855669 845995 836721 830782 825933 818620 810128 803122 795682 784825 772613 762725 754080 743811
58048G43811j0280o908m578n293n073k188o48k183k773n05Q83m20p82J597L270
58033G07930K587K881N449O496M313K473K748J909j259k854j088J92j289k276
58019G28212p04J93j733l405k470j518k633l491k401j728k948l754l196m100p236
58004F87088q713o434l620k765j695J029K450N86j795k347k999n267o840o297
57990F42381o203q071r069p193m879m126k926P2K199J682J143K617L719K464J258
57975F15068K286L418K536J655K802L900K685Q51M41n4k244m200m037l613m908
57960F16586o220n502m198m184m324l485l546n797p692o840m996m591m422k501
57946E48288j27O61Q91K319L864L800L074L199L195J716j61j084j932l632n074
$$ plain form
58048 743811 733531 726623 722045 716752 711679 709491 708843 706660 703887 703382 704265 703845 703063 704660 707930
58033 707930 710517 713398 718847 725343 729656 732129 734877 736786 735527 732673 731585 731777 730488 728212
58019 728212 727508 727701 725968 722563 720093 718575 715942 712451 710050 708322 705374 701620 698424 694324 687088
58004 687088 678375 671941 668321 665556 663861 664890 667340 667926 666131 663784 660785 655518 648678 642381
57990 642381 636178 628107 619038 611845 606966 602840 599914 599986 602185 603867 605010 607627 611346 613810 615068
57975 615068 617354 620772 623308 624963 627765 631665 634350 635201 635642 635588 633344 629144 625107 621494 616586
57960 616586 610366 604864 600666 596482 592158 588673 585127 579330 571638 564798 559802 555211 550789 548288
57946 548288 548161 548822 549713 552032 555896 559696 562770 565969 569164 570880 570719 569635 567703 564071 558997
57931E58997n721p270j0251j2139j1566j1072j2720j4358j3419j1174r802q415
57919D31090n625l024k392k125p3K585L784M387O020P574P485P178Q688J0904
57905D76456J1648J1372J1555J1489R971Q176P619P244N545L530K598J686l77
57892E68512k058j821j342k710m798n658o221q069r811r395p909p450p259n651
57878D88360l828l785m335l162j206r53j812j199Q53K232K807M189O211P265P485
57863D99122Q195Q952Q347O983O463O263M816K832K236K607J852j50j668k280
57849E54570k999l891m307m727n734o084m591k773k827m045m226l446l350l842
57835D97728l761l770n093o426n618l678l506n205o307o181o531p694q141p777
$$ plain form
57931 558997 553276 546006 535755 523616 512050 500978 488258 473900 460481 449307 439505 431090
57919 431090 425465 422441 420049 417924 417851 420436 424220 428607 434627 442201 449686 456864 465552 476456
57905 476456 488104 499476 511031 522520 532491 540667 548286 555530 561075 564605 567203 568889 568512
57892 568512 566454 564633 563291 560581 555783 550125 543904 535835 526024 516629 508720 501270 494011 488360
57878 488360 484532 480747 476412 473250 472044 471091 469279 468080 468933 471165 473972 478161 484372 491637 499122
57863 499122 507317 516269 524616 531599 538062 544325 549141 551973 554209 556816 558668 558518 556850 554570
57849 554570 551571 547680 543373 538646 532912 526828 522237 519464 516637 512592 508366 504920 501570 497728
57835 497728 493967 490197 485104 478678 473060 469382 465876 460671 454364 448183 441652 433958 425817 418040
57821D18040q274r739j0314r459q684q579q000o611n608n411n013m013l092k329
57807C22914j237m14r03j960j690J20J898K827L391L764L873M637O856R351J0512
57792C63939J1079J2794J4884J4745J1858Q328N638L591K176J784J598L55j374
57779D51395k096k211l287m962n472m999n382o631o919o052n764o208n483l193
57765C82736j322p98j78J363K594K761K898L518L577K735K321K900L219K571K103
57750D12998K695L502L692L702L932L938L718M030M776M874M261M115M584M412
57736D69229L355K883L660M479M533M702N599O322O144N780N962O441P152Q685
57722E44926J0768J1981J1765J1204J1124J1038J0578J0308J0416J0373J0526
$$ plain form
57821 418040 409766 400027 389713 380254 371570 362991 354991 348380 342772 337361 332348 328335 325243 322914
57807 322914 321677 321263 320360 318400 316710 316830 318728 321555 324946 328710 332583 337220 344076 353427 363939
57792 363939 375018 387812 402696 417441 429299 437627 443265 446856 449032 450816 452414 452769 451395
57779 451395 449299 447088 443801 438839 433367 428368 422986 416355 409436 403384 397620 391412 385929 382736
57765 382736 381414 380616 380438 381801 384395 387156 390054 393572 397149 399884 402205 405105 408324 410895 412998
57750 412998 415693 419195 422887 426589 430521 434459 438177 442207 446983 451857 456118 460233 464817 469229
57736 469229 472584 475467 479127 483606 488139 492841 498440 504762 510906 516686 522648 529089 536241 544926
57722 544926 555694 567675 579440 590644 601768 612806 623384 633692 644108 654481 665007
57711F65007J2220J5465J8320J9528K0196K1869K4512K7331L0197L3238L6232
57700I24115L9224M2744M6970N1733N7406O4326P1306P6706Q1223Q7597R7104
57689A640454J08410J20437J34020J49813J66726J83665K00797K17768K32332
57680C154422K41959K45201K40404K24948J97356J59092J13426O4171J6389k3721
57670D633647n1567o5959o7843n9957m9616m9310p0075j12826j66871k16879k51156
57659C471588k65384k61640k45185k21396j94453j67517j42653j20361j00148
57650A752851q2034o6721n4282m3869l4838k6998j9644j1854m105K042O362J0529
57638A427439J5805K1777K7978L4962M2912N0909N8589O6988P6801Q7263R7803
$$ plain form
57711 665007 677227 692692 711012 730540 750736 772605 797117 824448 854645 887883 924115
57700 924115 963339 1006083 1053053 1104786 1162192 1226518 1297824 1374530 1455753 1543350 1640454
57689 1640454 1748864 1869301 2003321 2153134 2319860 2503525 2704322 2922090 3154422
57680 3154422 3396381 3641582 3881986 4106934 4304290 4463382 4576808 4640979 4657368 4633647
57670 4633647 4582080 4516121 4448278 4388321 4338705 4289395 4219320 4106494 3939623 3722744 3471588
57659 3471588 3206204 2944564 2699379 2477983 2283530 2116013 1973360 1852999 1752851
57650 1752851 1670817 1604096 1549814 1505945 1471107 1444109 1424465 1412611 1408506 1410548 1416910 1427439
57638 1427439 1443244 1465021 1492999 1527961 1570873 1621782 1680371 1747359 1824160 1911423 2009226
57627B009226J09198J21970J35143J47821J60532J73634J85572J93978J97270
57618C434344J94007J82007J59653J27271Q6178L7746j5226o7491j13675j51132
57608C873682j79481j98439k07771k08687k03577j94412j82437j68901j54963
57599B175014j41149j27733j15256j03973r3446q3484p4769o7784o1869n6120
57589A249431n0487m5254m0293l5630l1882k9199k6706k3793k1150j9479j8226
57578I07332j6528j4606j3082j1726j0071q528p694p117n876l929j953k88J082
57565H07016J953K256K519L247M296N372O563P806Q590Q832R296J0487J1917J3143
57551I03293J4600J6665J8755K0185K1220K2572K4638K7691L1909L6657M0825
$$ plain form
57627 2009226 2118424 2240394 2375537 2523358 2683890 2857524 3043096 3237074 3434344
57618 3434344 3628351 3810358 3970011 4097282 4183460 4221206 4205980 4138489 4024814 3873682
57608 3873682 3694201 3495762 3287991 3079304 2875727 2681315 2498878 2329977 2175014
57599 2175014 2033865 1906132 1790876 1686903 1593457 1509973 1435204 1367420 1305551 1249431
57589 1249431 1198944 1153690 1113397 1077767 1045885 1016686 989980 966187 945037 925558 907332
57578 907332 890804 876198 863116 851390 841319 832791 825097 817980 812104 808175 806222 805934 807016
57565 807016 808969 811225 813744 816991 821287 826659 833222 841028 849618 858450 867746 878233 890150 903293
57551 903293 917893 934558 953313 973498 994718 1017290 1041928 1069619 1101528 1138185 1179010
57540A179010M4464M8892N4663O0800O6798P3704Q2181R1149R9666J08604J18925
57529B028856J29690J39484J48378J56619J62353J62728J56411J43219J22138
57520C349876R2081N4463J3104k8408o7710j02416j29881j48774j59678j63874
57510B708783j62389j56169j46273j33940j20851j08826r8403q8390p7703o6954
57500A548885n7384m9185m1945l5832l0950k6384k1242j6034j1637p745l660J59
57488A247046L056N828R726J4362J8416K1802K5390K9094L2263L5593M0608M7285
57476A530469N4141O0644O7720P5744Q3997R2319J01570J12074J23006J33560
57466B435244J43261J50995J55127J54680J48948J36030J13644Q1780M3138Q80
$$ plain form
57540 1179010 1223474 1272366 1327029 1387829 1454627 1528331 1610512 1701661 1801327 1909931 2028856
57529 2028856 2158546 2298030 2446408 2603027 2765380 2928108 3084519 3227738 3349876
57520 3349876 3441957 3496420 3509524 3481116 3413406 3310990 3181109 3032335 2872657 2708783
57510 2708783 2546394 2390225 2243952 2110012 1989161 1880335 1781932 1693542 1615839 1548885
57500 1548885 1491501 1442316 1400371 1364539 1333589 1307205 1285963 1269929 1258292 1250547 1246887 1247046
57488 1247046 1250102 1255930 1265656 1280018 1298434 1320236 1345626 1374720 1406983 1442576 1483184 1530469
57476 1530469 1584610 1645254 1712974 1788718 1872715 1965034 2066604 2178678 2301684 2435244
57466 2435244 2578505 2729500 2884627 3039307 3188255 3324285 3437929 3519709 3562847 3563727
57456C563727m2346q3117j17292j42458j58999j68144j70436j66713j58932j48875
57446B206415j37138j24180j11240r9426q8803p9088p0305o2234n4254m6455l9885
57435A293407l5048l1144k7412k4181k1789j9523j6635j3633j1564j0504r652
57424A072322q458o996n516m249l372k723j835o21M49J068J502J970K169J929
57410A047639J804K443L597M311M054L405L522M884O611P319O793O266O716P580
57396A116944P846P723Q100Q853R010Q461Q154Q452Q633Q299Q120Q621R327R641
57382A236184R736R996J0308J0496J0748J1153J1354J1108J0751J0683J0810J0808
57370A364135J0571J0248J0150J0685J1912J3210J3866J3973J4135J4438J4434
$$ plain form
57456 3563727 3521381 3438264 3320972 3178514 3019515 2851371 2680935 2514222 2355290 2206415
57446 2206415 2069277 1945097 1833857 1734431 1645628 1566540 1496235 1434001 1379747 1333292 1293407
57435 1293407 1258359 1227215 1199803 1175622 1153833 1134310 1117675 1104042 1092478 1081974 1072322
57424 1072322 1063864 1056868 1051352 1047103 1043731 1041008 1039173 1038552 1039001 1040069 1041571 1043541 1045710 1047639
57410 1047639 1049443 1051886 1055483 1059794 1063848 1067253 1070775 1075659 1082270 1089589 1096382 1102648 1109364 1116944
57396 1116944 1124790 1132513 1140613 1149466 1158476 1166937 1175091 1183543 1192176 1200475 1208595 1217216 1226543 1236184
57382 1236184 1245920 1255916 1266224 1276720 1287468 1298621 1309975 1321083 1331834 1342517 1353327 1364135
57370 1364135 1374706 1384954 1395104 1405789 1417701 1430911 1444777 1458750 1472885 1487323 1501757
57359A501757J4089J3893J3954J3854J3518J3475J3974J4591J4938J5176J5577
57348A658796J6157J6824J7468J7824J7806J7814J8215J8665J8590J8143J7992
57337A854294J8381J9067J9901K0675K0880K0490K0519K1707K3103K3271K2506
57326B084794K2292K2905K3157K2582K2111K2375K2899K3358K4123K5117K5660
57315B341373K5766K6239K7071K7285K6829K7057K8694L0757L2223L3231L3953
57304B660478L3800L2740L2005L2487L3612L4710L6184L8286M0009M0507M0640
57293C055458M1919M4585M7697N0339N1952N2396N2454N3410N5341N6838N7130
57282C619519N7243N8152N9147N9147N8428N7633N6218N3374M9528M5450M0673
$$ plain form
57359 1501757 1515846 1529739 1543693 1557547 1571065 1584540 1598514 1613105 1628043 1643219 1658796
57348 1658796 1674953 1691777 1709245 1727069 1744875 1762689 1780904 1799569 1818159 1836302 1854294
57337 1854294 1872675 1891742 1911643 1932318 1953198 1973688 1994207 2015914 2039017 2062288 2084794
57326 2084794 2107086 2129991 2153148 2175730 2197841 2220216 2243115 2266473 2290596 2315713 2341373
57315 2341373 2367139 2393378 2420449 2447734 2474563 2501620 2530314 2561071 2593294 2626525 2660478
57304 2660478 2694278 2727018 2759023 2791510 2825122 2859832 2896016 2934302 2974311 3014818 3055458
57293 3055458 3097377 3141962 3189659 3239998 3291950 3344346 3396800 3450210 3505551 3562389 3619519
57282 3619519 3676762 3734914 3794061 3853208 3911636 3969269 4025487 4078861 4128389 4173839 4214512
57271D214512L4483K7760K2193J8075J4472J1301R583R698J0751J1944J3416J5538
57259D413726J8224K1172K4106K6790K9256L1783L4246L5842L6080L5558L5241
57248D742024L5446L6062L7157L8659M0020M0892M1573M2244M2499M2277M2315
57237E181168M2912M3229M2717M2225M2534M2852M2109M0848M0317M0433M0185
57226E641529L9585L9533M0058M0277L9900L9381L8663L7266L5585L4698L4778
57215F061253L4898L4503L3995L3820L3997L4647L6018L7928L9905M1793M3452
57204F466209M4338M4271M4238M5225M6683M7284M6878M6426M6280M5917M5221
57193F968970M4651M4138M3171M1940M1149M0783M0263L9664L9404L8868L6910
$$ plain form
57271 4214512 4248995 4276755 4298948 4317023 4331495 4342796 4352379 4362077 4372828 4384772 4398188 4413726
57259 4413726 4431950 4453122 4477228 4504018 4533274 4565057 4599303 4635145 4671225 4706783 4742024
57248 4742024 4777470 4813532 4850689 4889348 4929368 4970260 5011833 5054077 5096576 5138853 5181168
57237 5181168 5224080 5267309 5310026 5352251 5394785 5437637 5479746 5520594 5560911 5601344 5641529
57226 5641529 5681114 5720647 5760705 5800982 5840882 5880263 5918926 5956192 5991777 6026475 6061253
57215 6061253 6096151 6130654 6164649 6198469 6232466 6267113 6303131 6341059 6380964 6422757 6466209
57204 6466209 6510547 6554818 6599056 6644281 6690964 6738248 6785126 6831552 6877832 6923749 6968970
57193 6968970 7013621 7057759 7100930 7142870 7184019 7224802 7265065 7304729 7344133 7383001 7419911
57182G419911L3764L0896K8864K6851K4482K2459K0988J9286J7136J5388J4249
57171G674274J2679J0172P731O070M257J308k034m395n715o919q201q858q507
57158G671862p544o474n452m416l252j924o14N30J745L279M719N273M739L458
57144G665929J438j686n783j0453j6034k3296l1914m0444m8062n4988o0822o3951
57132G309934o3372n9872n4639m7891l9807l1619k4697j9453j6049j5232j7335
57121F919968k1296k5814l0560l5046l7232l4786k7407j6554l474J1083K5514
57110F724396L7650M6970N5649O7318Q5492J12871J50669J98120K53683L17197
57100H050015L90692M77488N81606P07890Q61376J046290J266445J526235J829229
$$ plain form
57182 7419911 7453675 7484571 7513435 7540286 7564768 7587227 7608215 7627501 7644637 7660025 7674274
57171 7674274 7686953 7697125 7704856 7710926 7715183 7716491 7714457 7710062 7704347 7697428 7689227 7680369 7671862
57158 7671862 7664318 7657844 7652392 7647976 7644724 7642800 7642186 7642716 7644461 7647740 7652459 7657732 7662471 7665929
57144 7665929 7667367 7665681 7659898 7649445 7633411 7610115 7578201 7537757 7489695 7434707 7373885 7309934
57132 7309934 7246562 7186690 7132051 7084160 7044353 7012734 6988037 6968584 6952535 6937303 6919968
57121 6919968 6898672 6872858 6842298 6807252 6770020 6735234 6707827 6691273 6687799 6698882 6724396
57110 6724396 6762046 6809016 6864665 6931983 7017475 7130346 7281015 7479135 7732818 8050015
57100 8050015 8440707 8918195 9499801 10207691 11069067 12115357 13381802 14908037 16737266
57091A6737266K175012K558316K970819L400815L829429M229009M567227M812193
57083D5280086M935488M919715M773115M533127M237113L873612L365150K616392
57075G8533798J595337L74985r00704k090953l109642l927682m547146m978104
57067F0949889n229763n311484n237123n028365m714226m327074l898472l456692
57059B3746690l024990k620207k252759j927943j646895j407109j203887j032408
57051H630492q88445p67691o65698n78906n04917m41851l88139l42823l04988
57042C747034k72877k44582k19497j97863j79021j61610j45617j32416j22233
57033B071318j13194j03684r4186q5770p8224p0896o4200n8867n4481n0127m5782
$$ plain form
57091 16737266 18912278 21470594 24441413 27842228 31671657 35900666 40467893 45280086
57083 45280086 50215574 55135289 59908404 64441531 68678644 72552256 75917406 78533798
57075 78533798 80129135 80504120 79603416 77512463 74402821 70475139 65927993 60949889
57067 60949889 55720126 50408642 45171519 40143154 35428928 31101854 27203382 23746690
57059 23746690 20721700 18101493 15848734 13920791 12273896 10866787 9662900 8630492
57051 8630492 7742047 6974356 6308658 5729752 5224835 4782984 4394845 4052022 3747034
57042 3747034 3474157 3229575 3010078 2812215 2633194 2471584 2325967 2193551 2071318
57033 2071318 1958124 1854440 1760254 1674484 1596260 1525364 1461164 1402297 1347816 1297689 1251907
57022A251907m1901l8213l4195l0223k6986k4170k0921j7361j4365j2079r791
57011I81702p149m308r31L663R314J5289K1853L0249M0873N2906O6267Q2438J02744
56998A394910J28096J61526K06937K59163K95016K81583K01226P0175o9890j79789
56988B748953k43385k65959k60410k37988k07011j73586j41717j14467r4912q4438
56978I25080q0587p8742p6025p2120o6909n9649n0717m1937l4411k7563k0876
56967C15544j4899r895n048Q2M727Q342J1693J5595J9839K4278K9581L5566L9540
56954D74945L7836K8976J4812r36j4625k4019k8844l0231k9363k6833k3148j8967
56942C59603j4545r750m950j050J738M364P759J1920J6491K1473K7063L3327L9947
$$ plain form
57022 1251907 1210006 1171793 1137598 1107375 1080389 1056219 1035298 1017937 1003572 991493 981702
57011 981702 974553 970245 969314 972977 982291 997580 1019433 1049682 1090555 1143461 1209728 1292166 1394910
56998 1394910 1523006 1684532 1891469 2150632 2445648 2727231 2928457 2998632 2928742 2748953
56988 2748953 2505568 2239609 1979199 1741211 1534200 1360614 1218897 1104430 1009518 925080
56978 925080 844493 765751 689726 617606 550697 491048 440331 398394 363983 336420 315544
56967 315544 300645 290750 285702 285784 290511 298853 310546 326141 345980 370258 399839 435405 474945
56954 474945 512781 541757 556569 555633 541008 516989 488145 457914 428551 401718 378570 359603
56942 359603 345058 335308 330358 329308 331046 335410 343169 355089 371580 393053 420116 453443 493390
56929D93390M5213M5492L7283K0670j46j9952l5170m3889m5590m1983l6546l1845
56917C86927k8038k4406k1033j8184j5523j2947j1024r764q236o218m752m266
56905B22536l581j953m40MK45J276K380K609K709L756N110N706O284Q278J1334
56890B66253J4044J6468J9905K4564K9365L3606L6864L7430L2935K2900R511m015
56878E39830j4796k0797k1875k0172j8058j5724j2019p050k278J643N415R533
56866D23652J3868J8728K4817L2027L9707M8259N8962P1499Q2330Q5625P5993
56855I75467N1826J7699j7016m3749n9477o5888o5489o0002n1307m1248l0510
56844F10306j9302q790j33P496J6031K5961L6506M7888O1326P7088R4598J13569
$$ plain form
56929 493390 538603 584095 621378 642048 641902 621950 586780 542891 497301 455318 418772 386927
56917 386927 358889 334483 313450 295266 279743 266796 255772 246008 237772 231554 226802 222536
56905 222536 218955 217002 216562 216566 216811 218087 220467 223076 225785 229541 234651 240357 246641 254919 266253
56890 266253 280297 296765 316670 341234 370599 404205 441069 478499 511434 534334 543845 539830
56878 539830 525034 504237 482362 462190 444132 428408 416389 409339 407061 408704 414119 423652
56866 423652 437520 456248 481065 513092 552799 601058 660020 731519 813849 899474 975467
56855 975467 1027293 1044992 1027976 984227 924750 858862 793373 733371 682064 640816 610306
56844 610306 591004 582214 582081 589577 605608 631569 668075 715963 777289 854377 948975 1062544
56832A062544J31695J40909J29942R3457L7922k2200p3052j06729j22032j22868
56822A149588j15137j03216q8905p3319n8173m4597l2189k0221q729K170J2964
56811F20236K3995L5040M6435N9573P5145R0778J00504R6693P4159L4761j1610
56800A245709n2419q0011r3934r7230r2882q3755p2908o2148n1428m0614l0536
56789D87844k1706j3492n510J545P425J3332K0437K8534L6916M5028N0976N0754
56777G02083M0838K1577k641k6014m3869n4089n7518n6686n3449m8161m1209l4188
56765C46674k8662k4629k1114j7618j4328j1485r139p210n397l605k404k351k803
56752A95929k502j403o78p21n42L47R56M36n74j092j177j313j452j439j515j714
$$ plain form
56832 1062544 1194239 1335148 1465090 1558547 1596469 1574269 1501217 1394488 1272456 1149588
56822 1149588 1034451 931235 842330 769011 710838 666241 634052 613831 605102 607272 620236
56811 620236 644231 679271 725706 785279 860424 951202 1051706 1148399 1222558 1257319 1245709
56800 1245709 1193290 1113279 1019345 922115 829233 745478 672570 610422 558994 518380 487844
56789 487844 466138 452646 447136 448681 456106 469438 489875 518409 555325 600353 651329 702083
56777 702083 742921 764498 761857 735843 691974 637885 580367 523681 470232 422071 380862 346674
56765 346674 318012 293383 272269 254651 240323 228838 219699 212489 207092 203487 201083 198732 195929
56752 195929 193427 192024 191346 190625 190083 190430 191386 191822 191248 190156 188979 187666 186214 184775 183260 181546
56736A81546j574j053q11j061j122p26o46j361k206k521k600k780k683k151j818
56721A56433j874j380J62J571J439J06r11q69k16L95O40M08r1l57j72J64L86N21
56703A56355M26j70r98j391j259j141j191j058q06q20q12j75O40N52j50K0J244
56686A49266J837R28o1M14J851K781K719K030J014M4l62l47n78r27n74K63K90
56669A60588o35j114p45r90k456l415k510j049q90j642j830j449j450j744j613
56654A37056j250j209j055j05J119J547J087L44m22r96p94J14N35j73r16n29N18
56637A34871J221J609J915J439j53j492j195N5N89K13q7r5l69q36q82n40l20l01
56619A35642l28n12o54j0J433K434K197J453J021N91N2M40K133L521L194K030
$$ plain form
56736 181546 179972 178919 178108 177047 175925 175199 174553 173192 170986 168465 165865 163085 160402 158251 156433
56721 156433 154559 153179 153341 154912 156351 156457 155546 154677 154461 154856 155496 155904 155813 155456 155284 155448 155834 156355
56703 156355 156781 156611 155613 154222 152963 151822 150631 149573 148767 147947 147135 146960 147600 148152 148002 148022 149266
56686 149266 151103 152031 151970 152384 154235 157016 159735 161765 162779 162823 162461 162114 161536 160609 160035 160298 160588
56669 160588 159953 158839 158094 157104 154648 151233 148723 147674 146784 145142 143312 141863 140413 138669 137056
56654 137056 135806 134597 133542 133437 134556 136103 137190 137534 137112 136116 135322 135436 135971 135798 134882 134353 134871
56637 134871 136092 137701 139616 141055 140902 139410 138215 138270 138859 139072 138985 138890 138521 137685 136803 136263 135943 135642
56619 135642 135314 134802 134148 134138 135571 138005 140202 141655 142676 143267 143319 143759 145892 149413 152607 154637
56603A54637J487J213K66n83K1J558K382K184J778J227J44q67r28n04m97n26J66
56586A63158R12O47r1k7O73J015J151J757K232J670Q84J297K379K503J814J884
56570A83858K824L143K460K122K940M232N307O121O447O022N513N805O459O442
56556B49695N997O146O735O710O044N568N174M036K410J414J161P74J5o96j549
56541B99634k965m342m867n036n630n885m716l137l103m395n035m530m242m590
56527B37161m393l297k428k246j825q33l01q71j910k728l195l054k155j383j742
56512B04800k670k869k563l020m063m210l247k535k583k418j592r04p08l73K73
56497A71318O89Q92J431J907J337J3p02m79j86p7L78R20P61L25P81J896K347K092
$$ plain form
56603 154637 156124 157337 157603 157020 157041 158599 160981 163165 164943 166170 166314 165447 164519 164015 163518 162992 163158
56586 163158 164070 164717 164626 164599 165272 166287 167438 169195 171427 173097 173981 175278 177657 180160 181974 183858
56570 183858 186682 189825 192285 194407 197347 201579 206886 213007 219454 225476 230989 236794 243253 249695
56556 249695 255692 261838 268573 275283 281327 286895 292069 296105 298515 299929 301090 301864 301879 301183 299634
56541 299634 296669 292327 287460 282424 276794 270909 266193 263056 259953 255558 250523 245993 241751 237161
56527 237161 232768 229471 227043 224797 222972 222139 221838 220967 219057 216329 213134 210080 207925 206542 204800
56512 204800 202130 199261 196698 193678 189615 185405 182158 179623 177040 174622 173030 172126 171418 171045 171318
56497 171318 172007 172899 174330 176237 177574 177587 176885 176406 176220 176143 176521 177441 178202 178527 179308 181204 183551 185643
56479A85643K310K986K865J925J655K523L291L251L074L088K734K131K274L269
56465B23019M086M314M428M269L309K364K964M811N924N485M521L685K521J138
56451B76838L80J13o25j648j829j312j284j565q40O32J129M63K91J157J739J446
56435B75085J180J164N36m70n70o9p04k371k870j571n25j075k087k452k723l187
56419B57291k916j843j407k149k927l321m337o000o747o153n648n736n096l352
56405A99659j968j374j32J926K635J064o32n46L46M89K59M56N73J91J37P56R88
56388B04827L99J44P94J326J343J923L191L463K108Q99J174J927K039K016K267
56373B29840K042J324J414K356K340R30K35J458K901L002K715L180L538K918K307
$$ plain form
56479 185643 187953 190939 193804 195729 197384 199907 203198 206449 209523 212611 215345 217476 219750 223019
56465 223019 227105 231419 235847 240116 243425 245789 248753 253564 259488 264973 269494 273179 275700 276838
56451 276838 277218 277331 276706 275058 273229 271917 270633 269068 268228 268860 269989 270452 270743 271900 273639 275085
56435 275085 276265 277429 277965 277495 276925 276856 276152 273781 270911 269340 268815 267740 265653 263201 260478 257291
56419 257291 254375 252532 251125 248976 246049 242728 238391 232391 225644 219491 213843 208107 203011 199659
56405 199659 197691 196317 196185 198111 200746 201810 201178 200632 200978 201467 201726 202182 202755 202946 203083 203839 204827
56388 204827 205226 205370 206164 207490 208833 210756 213947 217410 219518 220417 221591 223518 225557 227573 229840
56373 229840 231882 233206 234620 236976 239316 240246 240481 241939 244840 247842 250557 253737 257275 260193 262500
56358B62500K585K855K354J884J936J552M83J09R10J441J074J137K037K089P34
56343B85680n3P84J492R04O00J731K697K283K185L901N838O000N193N123N607
56328C29965N915O575P717P917O817O401P675Q656P802O648O850P356O934O735
56314D29963P698Q149O703M929M498M197K522P04K87J80j006k116j756j102j558
56299D62292j986j118l43j104j906q59J008J916K544M059N327N214N326P329R641
56284D97340J0088R691J0652J2584J3979J5383J7802J9979K0488K0739K2744K5689
56272F97158K7838K9851L3144L6896L9930M3535M9258N5773O1102O6092P2553
56261A213130P9938Q7010R4785J04598J15213J24965J34666J45216J54605J60567
$$ plain form
56358 262500 265085 267940 270294 272178 274114 275666 276149 276258 277168 278609 279683 280820 282857 284946 285680
56343 285680 285627 286411 287903 288807 289407 291138 293835 296118 298303 302204 308042 314042 319235 324358 329965
56328 329965 335880 342455 350172 358089 364906 371307 378982 387638 395440 402088 408938 416294 423228 429963
56314 429963 437661 445810 452513 457442 461940 466137 468659 469363 469650 469830 468824 466708 464952 463850 462292
56299 462292 460306 459188 458845 457741 455835 454976 455984 457900 460444 464503 469830 475044 480370 487699 497340
56284 497340 507428 517119 527771 540355 554334 569717 587519 607498 627986 648725 671469 697158
56272 697158 724996 754847 787991 824887 864817 908352 957610 1013383 1074485 1140577 1213130
56261 1213130 1293068 1380078 1474863 1579461 1694674 1819639 1954305 2099521 2254126 2414693
56251B414693J64081J66802J67278J63155J54912J43849J28753J08331Q4818O1377
56241C758049L7971J3586r700k8772m3745n6348o6088p1809p4934p7343p8086
56230C302781p6081p3834p4428p6946p8866q0837q4768q9539r2973r6000j00440
56219B378069j04667j06069j05709j06010j05873j02849r8155r4605r1380q5773
56209A376979p8454p2119o6501n9599n2327m7072m3093l8167l3195l0385k8504
56198H27563k4958k0919j9321j9301j7763j4966j3418j2642j0355p418o406o549
56186F53547n230l110k560k571n50K351L174K839M355O922P573P169Q804J1625
56172F94338J2275J1238J1700J3251J2903J1242J1331J2495J1492Q885P961Q249
$$ plain form
56251 2414693 2578774 2745576 2912854 3076009 3230921 3374770 3503523 3611854 3696672 3758049
56241 3758049 3796020 3809606 3799906 3771134 3727389 3671041 3604953 3533144 3458210 3380867 3302781
56230 3302781 3226700 3152866 3078438 3001492 2922626 2841789 2757021 2667482 2574509 2478509 2378069
56219 2378069 2273402 2167333 2061624 1955614 1849741 1746892 1648737 1554132 1462752 1376979
56209 1376979 1298525 1226406 1159905 1100306 1047979 1000907 957814 919647 886452 856067 827563
56198 827563 802605 781686 762365 743064 725301 710335 696917 684275 673920 666502 660096 653547
56186 653547 648317 645207 642647 640076 639526 641877 645051 647890 652245 659167 666740 673909 682713 694338
56172 694338 706613 717851 729551 742802 755705 766947 778278 790773 802265 811150 819111 827360
56160H27360O542L528K824M174M167L012L950O562P421O956Q825J2884J5573J6975
56146I30753K0543K6109L0167L3044L8703M7397N5561O3197P4177Q8970J04032
56135A512653J18698J35518J53147J65855J70746J68970J59906J41661J17889
56126B845043R6883Q2743P3636O8419O7429O6415N7717L9193J5818p753k9530
56115C376013m5757n2592n3272n6314o5754p9605r7130j19213j41432j55604j59484
56104B349856j57383j50963j37820j19536j02137q7396p2132n6950m6795m1840
56094A376904l6767l0314k6654k6136k3907j9188j6665j7126j5895j2050r936
56083A142266j0007p770l251j712l333k314K026L765J866K465P202J0081Q799
$$ plain form
56160 827360 833902 837430 840254 844428 848595 851607 855557 862119 869540 876496 885321 898205 913778 930753
56146 930753 951296 977405 1007572 1040616 1079319 1126716 1182277 1245474 1319651 1408621 1512653
56135 1512653 1631351 1766869 1920016 2085871 2256617 2425587 2585493 2727154 2845043
56126 2845043 2941926 3024669 3098305 3166724 3234153 3300568 3358285 3397478 3413296 3405543 3376013
56115 3376013 3330256 3277664 3224392 3168078 3102324 3022719 2925589 2806376 2664944 2509340 2349856
56104 2349856 2192473 2041510 1903690 1784154 1682017 1594621 1522489 1465539 1418744 1376904
56094 1376904 1340137 1309823 1283169 1257033 1233126 1213938 1197273 1180147 1164252 1152202 1142266
56083 1142266 1132259 1124489 1121238 1119526 1116193 1113879 1115905 1119670 1121536 1124001 1131203 1141284 1150083
56070A150083Q461J0973J1547R021Q925J2763J4823J3197J3351J7153J9039J6894
56058A306230J6057J8759K0138J8528J8917K2550K3885K1503K1074K4044K4678
56047A536363K1751K1391K4969K6242K3951K4636K9369L0889K7788K7889L3342
56036A828580L6445L4776L5844M1726M4088M0220L8839M3824M7384M5869M6894
56025B284489N3729N8187N6428N6437O2234O6304O5204O6697P3713P7461P4435
56014B995318P3636P8979Q1777P8799P9674Q7790R2659R0316R1872J02029J09325
56003C962174J08231J10246J21683J31570J33573J38421J52056J63460J67237
55994E188651J75500J93744K08434K12838K20851K40189K57401K65223K78206
$$ plain form
56070 1150083 1158544 1169517 1181064 1190085 1199010 1211773 1226596 1239793 1253144 1270297 1289336 1306230
56058 1306230 1322287 1341046 1361184 1379712 1398629 1421179 1445064 1466567 1487641 1511685 1536363
56047 1536363 1558114 1579505 1604474 1630716 1654667 1679303 1708672 1739561 1767349 1795238 1828580
56036 1828580 1865025 1899801 1935645 1977371 2021459 2061679 2100518 2144342 2191726 2237595 2284489
56025 2284489 2338218 2396405 2452833 2509270 2571504 2637808 2703012 2769709 2843422 2920883 2995318
56014 2995318 3068954 3147933 3229710 3308509 3388183 3475973 3568632 3658948 3750820 3852849 3962174
56003 3962174 4070405 4180651 4302334 4433904 4567477 4705898 4857954 5021414 5188651
55994 5188651 5364151 5557895 5766329 5979167 6200018 6440207 6697608 6962831 7241037
55985G241037L04294L28539L42908L63447L98933M32745M56095M87469N37629
55976A0893096N88777O31477O86758P66746Q51084R29364J026895J159313J304733
55967A8838243J453049J636975J879428K160188K472895K859636L344795L894156
55959C8539365M488786N174735N987745O908036P956994R253305J0896743J2894881
55951A02100590J5292754J8255122K1926755K6391091L1855542L8383167M4752897
55944B98957918M7677406M3165401K9610796R687214j1070837k7671788l7930705
55937C52425405m2250119m2176867l9349761l5125556l0448404k5838418k1561580
55930A15674700j7798737j4637942j2031260r879944q131626o747433n643098
$$ plain form
55985 7241037 7545331 7873870 8216778 8580225 8979158 9411903 9867998 10355467 10893096
55976 10893096 11481873 12113350 12800108 13566854 14417938 15347302 16374197 17533510 18838243
55967 18838243 20291292 21928267 23807695 25967883 28440778 31300414 34645209 38539365
55959 38539365 43028151 48202886 54190631 61098667 69055661 78308966 89205709 102100590
55951 102100590 117393344 135648466 157575221 183966312 215821854 254205021 298957918
55944 298957918 346635324 389800725 419411521 429098735 418027898 390356110 352425405
55937 352425405 310175286 267998419 228648658 193523102 163074698 137236280 115674700
55930 115674700 97875963 83238021 71206761 61326817 53195191 46447758 40804660
55923D0804660m733249l989958l403504k928434k517819k170293j895854j669913
55915A7495636j462952j281769j141195j025063r11958q10827p36121o74101o06656
55906H844994n43454m99346m63356m19825l77982l51928l32134l04076k75556
55897E277337k59285k47091k26579k05623j96010j89613j74293j57417j50813
55888C470613j47548j35826j21710j16602j15532j08306r9417r7234r5917q7048
55878B345473p7214p5625p5979o8549n8721n5973n5704m9445m2165m2168m4196
55867A699734l9575l3337l4512l8857l7556l4009l5882l9110l5649k9049k6997
55856A315201k6196j9601j0873p012m432K844Q584L041j0264k0677k6970l3919
$$ plain form
55923 40804660 36071411 32081453 28677949 25749515 23231696 21061403 19165549 17495636
55915 17495636 16032684 14750915 13609720 12584657 11672699 10861872 10125751 9451650 8844994
55906 8844994 8301540 7802194 7338838 6919013 6541031 6189103 5856969 5552893 5277337
55897 5277337 5018052 4770961 4544382 4338759 4142749 3953136 3778843 3621426 3470613
55888 3470613 3323065 3187239 3065529 2948927 2833395 2725089 2625672 2528438 2432521 2345473
55878 2345473 2268259 2192634 2116655 2048106 1989385 1933412 1877708 1828263 1786098 1743930 1699734
55867 1699734 1660159 1626822 1592310 1553453 1515897 1481888 1446006 1406896 1371247 1342198 1315201
55856 1315201 1289005 1269404 1258531 1251519 1247087 1249931 1258515 1261556 1251292 1230615 1203645 1169726
55844A169726l8917l6443l0434k8416k8274k3708j7548j6678j8809j7195j3761
55833H99543j4853j8403j7890j4960j5884j9163j8492j4613j3000j3189j1247
55822G27849r300j1834j6009j6091j3980j5136j7704j6060j1620r891j0099p765
55810E72360m299m070n187k871J127K024J539M339Q325Q140N191M602N274K601
55796E99095j916l398l165o026j0616j1854j0492j1033j2652j1421r091j0222
55784D97209j2970j2031q576p855q968o595j249J499O58l13j730o678j2923j4894
55770D04584j2963j2288j3392j2477r898r585j0658q424l430j134k579l551k896
55757C01309l628n691n468l037k532m775o393o444p289q757q047n522m363m716
$$ plain form
55844 1169726 1130809 1094366 1063932 1035516 1007242 983534 965986 949308 930499 913304 899543
55833 899543 884690 866287 848397 833437 817553 798390 779898 765285 752285 739096 727849
55822 727849 718549 706715 690706 674615 660635 645499 627795 611735 600115 590224 580125 572360
55810 572360 568061 563991 558804 555933 557060 559084 560623 564962 573287 581427 586618 591220 596494 599095
55796 599095 597179 593781 590616 584590 573974 562120 551628 540595 527943 516522 507431 497209
55784 497209 484239 472208 463632 455777 446809 440214 438965 440464 441122 440809 439079 432401 419478 404584
55770 404584 391621 379333 365941 353464 343566 333981 323323 314899 311469 310335 307756 304205 301309
55757 301309 297681 291990 286522 283485 280953 276178 269785 263341 256052 247295 239248 233726 229363 224647
55743B24647m181l359m668o599n601k879k579m236l815j387o84j660p43J932K708
55728A86896J554J886L302J750k788n733n486m968n178l917j469j016k648l027
55714A59158j641j359k406j897K38R39J23J053M083O002O130P105R079R017O540
55699B02164M614L791J532k011l383j830m52m98L1J380J225m16p59M97O55n61
55683B05979m78J162J645O57Q53K509L079K618L895O452O364L025M58O30R69j04
55667B39713o68J71M10n28m28J237K087J404J338K465K749J852J842K735K180
55652B58559L97M08K353K709K87k057k948m512p483r331q990q655r283q991p471
55637A94992p223q787r385p910o757p071o874n454m994o064o091m107k584k797
$$ plain form
55743 224647 220466 217107 212439 205840 200239 197360 194781 190545 186730 185343 184659 182999 182256 184188 186896
55728 186896 188450 190336 193638 195388 192600 186867 181381 176413 171235 167318 165849 164833 162185 159158
55714 159158 157517 156158 153752 151855 152093 153032 153155 154208 158291 164293 170423 177528 186607 195624 202164
55699 202164 206778 210569 212101 210090 206707 204877 204425 203927 203958 205338 206563 206147 205388 205885 206540 205979
55683 205979 205501 206663 208308 208965 209818 212327 215406 218024 221919 228371 234735 237760 238218 238848 239817 239713
55667 239713 239045 239216 239626 239098 238670 239907 241994 243398 244736 247201 249950 251802 253644 256379 258559
55652 258559 258956 259364 261717 264426 264713 262656 259708 255196 247713 238382 229392 220737 211454 202463 194992
55637 194992 187769 178982 169597 161687 154930 147859 140985 135531 130537 124473 118382 114275 111691 108894
55623A08894k759j538j127k192k442j108o58k032k593r27N83J55n30p7Rj245k037
55606H8376j224m15o87o46L31N36o16j212m90l44j488j925r03n11j665k292j328
55589G3497o41j180j093M48J448R56R21K195K646J324N11J515K227J200L90J416
55573H7780K745K924L172M453N409N485O585R420J1581J1498J0779J0556R102
55560A81489N531K118M40j322m597p455q091q018q980r821r132q073p867p338
55546A08884n450l542k712j810k28L69o89j216O2J170O60M11K014L677L537K991
55530A08128L786M763M381L655L707L207J214k31O40K020J464l17j425k158l516
55515A29318m644m526m164m528m558l504k877l702m364l609k930l616m174l298
$$ plain form
55623 108894 106135 104597 103470 101278 98836 97728 97070 95038 92445 91518 92101 92256 91726 91649 91658 90413 88376
55606 88376 87152 86737 86050 85404 85735 86271 85655 84443 83953 83609 82121 80196 79293 78782 77117 74825 73497
55589 73497 72856 71676 70583 71031 72479 73435 74356 76551 79197 80521 81032 82547 84774 85974 86364 87780
55573 87780 90525 93449 96621 101074 106483 111968 118553 127973 139554 151052 161831 172387 181489
55560 181489 187020 189138 189578 188256 183659 176204 168113 160095 151115 141294 132162 124089 116222 108884
55546 108884 103434 99892 97180 95370 95142 95511 94822 93606 93668 94838 95498 95909 97923 101600 105137 108128
55530 108128 111914 116677 121058 124713 128420 131627 132841 132610 133250 135270 136734 136417 134992 132834 129318
55515 129318 124674 120148 115984 111456 106898 103394 100517 96815 92451 88842 85912 82296 78122 74824
55501G4824k516l090l274j583P7k91j198o72m1j197k684k256j010j254k338k248
55485D9249j509j697j917m69J474J564K77l13m41j828m052n234n431o055o752
55470A6866o034m281l106I88a54B84Q99M28K96M25n3o00n3J163J738J617J457
55453G601R88j5m14N97J676J366N21N84Q84R4j097j216o94q11j179o59K72M51
55435H949K06M35P06L37R9P29J206O29J98J056J881J158P5N09J742J937J350J186
55417B4388Q03q35k312j634K08P59J87N83J979K431J625J223J763K022J448P36
55401C5374J39n37o44L90J331N04j588l083l482l451k851j290J45R3p45p83k67
55384A9255n30j294j165j88M48O49J124J470Q35j70l96k63p43j142k75J013R79
$$ plain form
55501 74824 72308 69218 65944 64361 64438 64147 62949 62277 62236 61039 58355 56099 55089 53835 51497 49249
55485 49249 47740 46043 44126 43657 45131 46695 46972 46659 46218 44390 40338 35104 29673 23618 16866
55470 16866 10832 6551 3445 988 -154 284 1183 1611 1907 2332 2279 1679 1626 2789 4527 6144 7601
55453 7601 8589 8574 8160 8757 10433 11799 12320 12904 13788 13882 12785 11569 10875 10064 8885 8226 8498 8949
55435 8949 9155 9590 10296 10633 10732 11461 12667 13296 13494 14550 16431 17589 17664 18173 19915 21852 23202 24388
55417 24388 25191 24356 22044 20410 20618 21377 21564 22147 24126 26557 28182 29405 31168 33190 34638 35374
55401 35374 35513 34976 34332 34722 36053 36557 34969 31886 28404 24953 22102 20812 20957 21050 20305 19522 19255
55384 19255 18725 17431 16266 16078 16526 17175 18299 19769 20604 20434 20038 19775 19032 17890 17615 18628 19607
55367A9607k9k84L26M74M5N5L23k34j320j555q22j79K11R49J698J575Q81M19j35
55348B2005j292k036j211K07N11O8M01J252J084q9q39q31q62r30m22K32K00o9
55330A7379J56J75q07j681j132j25k33o75J30J246O81q50r70J81K87r10j218M5
55312A1679R76M59k96j47N61J284J819J465j63j574r99P55J438Q97Q85J622J562
55295B2223N31J49Q20J071K69m79n81p03r73p37l73j065k560l269k776k119j630
55278G798p12L46N71L16P71J614J488N49J50K87j24p51l66M38K1j045o29J045
55260A1767J479J46o41K27J034N48p6J53M42K39L91J119J207K55m78l62l96j026
55242A6028j231o16k44n12k97Q99J967K134J923J596O26o33q65oM66L0k31J48
$$ plain form
55367 19607 19578 19294 19620 20094 20139 20194 20517 20283 18963 17408 16586 16407 16618 17567 19265 20840 21721 22140 22005
55348 22005 20713 18677 17466 17673 18184 18252 18653 19905 20989 20900 20061 19230 18368 17438 17016 17248 17448 17379
55330 17379 17535 17710 16903 15222 14090 13965 13732 13057 13187 14433 15114 14264 13294 13475 13762 12852 11634 11679
55312 11679 12655 13114 12818 12671 13232 14516 16335 17800 17637 16063 15064 15819 17257 18154 19039 20661 22223
55295 22223 22754 22903 23723 24794 25063 24584 24003 23300 22327 21590 21217 20152 17592 14323 11547 9428 7798
55278 7798 7086 7432 8003 8319 9090 10704 12192 12741 12891 13178 13054 12303 11937 12375 12396 11351 10722 11767
55260 11767 13246 13392 12751 12978 14012 14560 14484 14637 15079 15318 15709 16828 18035 18290 17812 17450 17054 16028
55242 16028 14797 14181 13937 13425 13128 14027 15994 18128 20051 21647 22273 21640 20775 20769 21235 21265 21034 21182
55224B1182K62q5J18R11R25j12o97n9P73J068J353J674J154K7k24N37O28n10j282
55205B7643p22Q8K92N79J185R47m60j505j232o91p60o47K21Q40M58q1oJ31p0J15
55185B6325Q89J113K27o82p00l93l48j47L31L13l23n67j04J43j01R1Q12P51m59
55166B7171j408j207o89m93n0P03P11j36m79M0K2r31j133K68J562J218J89l4K60
55147B5584K14N5P1l74j391j787j023k72l23k13P42J433Q82n0k49k9L6L66J191
55128B4863J803K010K633L521L164J394L28J200K435K378J727J588J204k76j724
55113D8248j773j081r23r81m59O7k21p23n89l17n47o36k0M10j62q54n89J53M63
55094C9466N18O42L59k50J1J237J558R5j208n15J049J527J213J359J546Q23J2
$$ plain form
55224 21182 21444 21359 21477 22388 23313 23201 22504 22445 23218 24286 25639 27313 28467 28494 28270 28807 29435 28925 27643
55205 27643 26921 27009 27301 27880 29065 30012 29552 28047 26815 26124 25364 24717 24938 25778 26236 26155 26149 26280 26210 26325
55185 26325 27214 28327 28554 27872 27172 26779 26431 26284 26615 26928 26605 26038 25934 26077 25976 26067 26879 27630 27171
55166 27171 25763 24556 23867 23374 23324 24027 24738 24602 24123 24163 24185 23254 22121 22389 23951 25169 25358 25324 25584
55147 25584 25798 25853 25924 25550 24159 22372 21349 21077 20754 20541 21283 22716 23598 23548 23299 23270 23306 23672 24863
55128 24863 26666 28676 31309 34830 37994 39388 39716 40916 43351 45729 47456 49044 50248 49972 48248
55113 48248 46475 45394 44471 43490 43031 43098 42877 42154 41565 41248 40701 40065 40045 40455 40293 39439 38850 39003 39466
55094 39466 39984 40626 40985 40735 40746 41983 43541 43636 42428 41913 42962 44489 45702 47061 48607 49430 49442
55077D9442L42J044O73k41k09N41P14L96O03J201J277R28P05K22q30j298k81Q32
55059E6061K78j115j171J58J020P68M57N40L56j98m45l49m39n08j1N71L96j29
55041E6240J8O16O76L17N10J234J502J050N09J68j64m00m70q25j492j414n0J258
55023E9283J027r4m20J96O47O83R19J226R48L79L55P04O36K43R8j32j078k163
55005F3457k321j740j353j098l00O31O67j8l10l5k8n39j020j256j454j482j173
54988E0628r62j032n73Q79K175K092J278J127J517J445J153J608K384K075N89
54973F6383p02q93j56J211K729L254K202Q37P83J686K089J903K187K947L235L148
54957I2843L686M823N640O186P362R049J0224J0842J1690J2581J2573J1912J1711
$$ plain form
55077 49442 49784 50828 51501 51260 51051 51592 52306 52702 53305 54506 55783 56711 57416 57638 56808 55510 55229 56061
55059 56061 56339 55224 54053 54211 55231 55999 56456 56996 57352 57154 56709 56360 55921 55413 55402 55973 56369 56240
55041 56240 56258 56874 57550 57867 58377 59611 61113 62163 62672 62840 62676 62276 61806 60981 59489 58075 58025 59283
55023 59283 60310 60216 59796 59992 60639 61322 62241 63467 64415 64794 65149 65853 66489 66732 66830 66698 65620 63457
55005 63457 61136 59396 58043 56945 56645 57276 57943 57925 57615 57580 57552 57013 55993 54737 53283 51801 50628
54988 50628 49666 48634 48061 48940 51115 53207 54485 55612 57129 58574 59727 61335 63719 65794 66383
54973 66383 65681 64788 64632 65843 68572 71826 74028 74865 75648 77334 79423 81326 83513 86460 89695 92843
54957 92843 96529 101352 106992 113178 120540 129589 139813 150655 162345 174926 187499 199411 211122
54944B11122J1661J0131O712K766q68m746r008j2572j4706j5770j5949j4833j2750
54931A41190j1039j0356r960r050p696o095m220k518j762j882j958j512q42j05
54917G2195Q03J549J788K125L386N040N787N648N945P190Q521R385J0292J1598
54903A51252J2831J3563J3714J2827J0252O255J865k450o885j1091j4039j5237
54891A72857j5022j3780j1907j0308r634r231q016o176m693l621k366j229j107
54878G5767j741k034j901k104k435j940r23p30j459j772j270r64j140p52M54J196
54862E6252P84J72P5j95j139j925j851j481j406j126k23N84N35K6j86q1N3K24
54844D9092K15n31j868k630k104j009l72k34j05R9K40M42P43Q24N50K48J27lj77
$$ plain form
54944 211122 222783 232914 239626 242392 241524 236778 227770 215198 200492 184722 168773 153940 141190
54931 141190 130151 119795 109835 100785 93089 86994 82774 80256 78494 76612 74654 73142 72300 72195
54917 72195 72998 74547 76335 78460 81846 86886 92673 98321 104266 111456 119977 129362 139654 151252
54903 151252 164083 177646 191360 204187 214439 220694 222559 220109 213224 202133 188094 172857
54891 172857 157835 144055 132148 121840 112206 102975 94959 88783 84090 80469 78103 76874 75767
54878 75767 74026 71992 70091 67987 65552 63612 62689 61959 60500 58728 57458 56494 55354 54602 55056 56252
54862 56252 57036 57208 57283 57088 55949 54024 52173 50692 49286 48160 47937 48521 49056 49082 48896 48815 48868 49092
54844 49092 49307 48776 46908 44278 42174 41165 40793 40559 40454 40553 40793 41235 41978 42802 43352 43600 43727 43724 43547
54825D3547K0Q06J776K358K283J613P11J27N1Q5oK57J181K068K130J753J766K052
54807F4578K063K151K987L983L960L183L183M540O334P804R013R941J0373J0862
54793A44955J2220J3984J4788J4324J3381J1888Q748L979p52m214o764q933j0430
54780B07174j1144j1703j2339j2404j1518j0137q549o499m225k620j997j744j454
54767A10841j252q74K26J634K257K066K143K804L271L499M566O721Q658R538J0183
54752A66281J1563J3468J5382J7337J9084J9663J8529J6097J2660P963K344l050
54740C17321p693j2096j6284j9178k0128j9710j8490j6396j3857j2108j1566j1218
54728A38597j0255r077p994o410m166k296j581j517j544j973k825l078k101q05
$$ plain form
54825 43547 43567 44373 46149 48507 50790 52403 53114 53241 53292 53377 53371 53628 54809 56877 59007 60760 62526 64578
54807 64578 66641 68792 71779 75762 79722 82905 86088 90628 96962 104766 113779 123720 134093 144955
54793 144955 157175 171159 185947 200271 213652 225540 234288 238267 237515 233301 226537 217604 207174
54780 207174 196030 184327 171988 159584 148066 137929 129380 122881 118656 116036 114039 112295 110841
54767 110841 109589 108715 108941 110575 112832 114898 117041 119845 123116 126615 131181 137902 146560 156098 166281
54752 166281 177844 191312 206694 224031 243115 262778 281307 297404 310064 318027 320371 317321
54740 317321 309628 297532 281248 262070 241942 222232 203742 187346 173489 161381 149815 138597
54728 138597 128342 119265 111271 104861 100695 98399 96818 95301 93757 91784 88959 85881 83780 82975
54714H2975l32n83q67j085j401j564j331q46j88O85J275R14P7P0J076J802J467
54697H2144P50L41P5k4N36J392J282L5j008j109j006j068n32O05R52Q5m04N04
54679H3550J539J471J165J751K503K344J912K164K369J534N76J001K382L219L455
54664A12935M116N081N238M480L714L226K589J928J704J570R11K40O95K253L698
54649A54378M220L983L417K961L209M315N608O534P461Q758R836J0167J0394J1225
54635B46466J1877J0955Q291M817J131k618o030q892j1760j4825j6809j6354j4064
54622A92185j1821j0464r480q584p995p329n793l622k025j516j413j093o61k16
54608A20173N33J558K285K366K054J585P87l98j525k020j842j558j746k313k554
$$ plain form
54714 82975 82643 82060 81193 80108 78707 77143 75812 74966 74778 75463 76738 77652 77729 77799 78875 80677 82144
54697 82144 82894 83235 83310 83286 83822 85214 86496 86531 85523 84414 83408 82340 81808 82413 83365 83450 83046 83550
54679 83550 85089 86560 87725 89476 91979 94323 96235 98399 100768 102302 102878 103879 106261 109480 112935
54664 112935 117051 122132 127370 131850 135564 138790 141379 143307 145011 146581 147492 147732 148427 150680 154378
54649 154378 158598 162581 165998 168959 172168 176483 182091 188625 196086 204844 214680 224847 235241 246466
54635 246466 258343 269298 277589 282406 283537 280919 274889 265997 254237 239412 222603 206249 192185
54622 192185 180364 169900 160420 151836 143841 136512 130719 127097 125072 123556 122143 121050 120389 120173
54608 120173 120706 122264 124549 126915 128969 130554 131341 130943 129418 127398 125556 123998 122252 119939 117385
54593A17385k139j720k036k734k956k856l357m385m708l871k879k527k339j862
54579G7016j583j809j861j333r27j133j272q45n84j035j355p04K74O16O49J054
54563F5168J414J130P87J096J298K94j330j959j237j92M75R16J239J305J199R57
54547G2560L05o23r79m68l8k48p3J413L188L661L011K552K564K468K468L256M436
54530I9453M985N010N502O519P122O836N889M246J875m14j749k592l983n746o771
54515A26182o734o191n366m259l559l857m349l848k784k519k978k679j167L39
54501G6231Q30N10k22j223j826j163L88J267O72n42j144p33L44J275J131j62j289
54484G4344r91K91J234J630K233K974K974K163J438J219J187J326J774J871Q74
$$ plain form
54593 117385 115246 113526 111490 108756 105800 102944 99587 95202 90494 86623 83744 81217 78878 77016
54579 77016 75433 73624 71763 70430 69503 68370 67098 66253 65669 64634 63279 62575 62849 63465 64114 65168
54563 65168 66582 67712 68499 69595 70893 71187 69857 67898 66661 66469 66944 67860 69099 70404 71603 72560
54547 72560 72865 72242 71263 70795 70757 70509 70436 71849 75037 78698 81709 84261 86825 89293 91761 95017 99453
54530 99453 104438 109448 114950 121469 128591 135427 141316 145562 147437 147023 145274 142682 138699 132953 126182
54515 126182 119448 113257 107891 103632 100073 96216 91867 88019 85235 82716 79738 77059 75892 76231
54501 76231 77061 77571 77349 76126 74300 73137 73525 74792 75464 74922 73778 73045 73389 74664 75795 75633 74344
54484 74344 73353 73644 74878 76508 78741 81715 84689 86852 88290 89509 90696 92022 93796 95667 96541
54469I6541m34n33M67R44L45j76K2P7n50j006o51k34n59j153j211q86p88r95j269
54450H7951j562j709j290l22M66M72j43q66j363j453j190j033j314j605j253m88
54434G3298j67m60o35k59K60L96R2l96o61k36Q24J633J495Q93P29R70R44N74K84
54415G9578O0k86k72N88J618J735J124Q79J206J390J376J892K938L610L547L378
54399A04361L567L916M248M482M206L324K815L573M726M654L346K148J394K19
54385A50979j319j970j556j438k215k789k472k207k808l528l456l010l012l340
54371A15859l430l228k920k448j953j850k045j881j166m11J65P69J096M81p00
54356I6338j134m67J72Nl49k01J90N26J149K101K629K364J953J941K071K208K812
$$ plain form
54469 96541 96107 95574 96041 96985 97330 97154 97176 97253 96703 95697 95046 94812 94253 93100 91889 91003 90215 89220 87951
54450 87951 86389 84680 83390 83068 83534 84006 83863 82997 81634 80181 78991 77958 76644 75039 73786 73298
54434 73298 73131 72671 72036 71777 72037 72433 72525 72129 71468 71232 72056 73689 75184 76077 76806 77776 78720 79294 79578
54415 79578 79638 79352 79080 79668 81286 83021 84145 85024 86230 87620 88996 90888 93826 97436 100983 104361
54399 104361 107928 111844 116092 120574 124780 128104 130919 134492 139218 143872 147218 149366 150760 150979
54385 150979 149660 147690 146134 144696 142481 139692 137220 135013 132205 128677 125221 122211 119199 115859
54371 115859 112429 109201 106281 103833 101880 100030 97985 96104 94938 94527 94692 95461 96557 97038 96338
54356 96338 95204 94737 94909 94914 94565 94364 94554 95080 96229 98330 100959 103323 105276 107217 109288 111496 114308
54339A14308L856M421M065L529L486L551L218K665K059J029m56j724k448l128
54325A38431l994m480m381m398m881n128m626l891l408k863k146j984k741l572
54311H5938l663l357l261l138k585j902j513j235q81p50q83p05k0M94M52L78N18
54294F3887J96q40j581j304q67j321k116j990r48m0L29O62J142J259P06p9l88
54277E6707N3Q01R75K35n76l72O47J292J229J339K037K495K110J437J027M84l92
54260G1528p24J82J540K081J668R66K38n90j240j356j121r22q05o92o52m78K71
54243F9894J375J855J220J27o59j076j239j018o34p12j148j021j45L70j93r89
54227F6007j013n48l81m69l45o1K04O66J308J489R54M04L39K44l00p12m39k7j67
$$ plain form
54339 114308 118164 122585 126650 130179 133665 137216 140434 143099 145158 146187 145731 144007 141559 138431
54325 138431 134437 129957 125576 121178 116297 111169 106543 102652 99244 96381 94235 92251 89510 85938
54311 85938 82275 78918 75657 72519 69934 68032 66519 65284 64403 63653 62770 62065 62045 62539 62991 63369 63887
54294 63887 64083 63243 61662 60358 59491 58170 56054 54064 53116 53076 53405 54067 55209 56468 57174 57095 56707
54277 56707 56760 57561 58536 58771 58195 57823 58470 59762 60991 62330 64367 66862 68972 70409 71436 71920 71528
54260 71528 70804 70986 72526 74607 76275 77241 77479 76889 75649 74293 73172 72250 71445 70753 70101 69623 69894
54243 69894 71269 73124 74344 74471 73812 72736 71497 70479 69845 69133 67985 66964 66819 67189 66996 66007
54227 66007 64994 64446 64065 63596 63251 63190 63394 64060 65368 66857 67811 68215 68554 68798 68498 67786 67347 67320 67153
54208F7153n56n92m10l17l9O06J020P48K58M8j68n99o80j53J63l38r31p63k39
54189F4211j36k66j43j14o73j380j540j290j026n86K7O4p42j340q45R2N61Q77
54171E5751J538J798R01k10q7R58J446R95L98Lm40o94l19K41K37q8p1K6m00r23
54151F1060p28j61r4l04pM22J2p62m13J114K158J703N13l39o49m92K22J119J411
54132F5785R01J55m59j051j515j502j112p99o44n05o79j457k224j978p37M80R33
54115E3592O84K5o84q75l12L94N34K40kk30n20l20O81J611J533R18P43P79J80
54096E8971p20q33j77K40K15M27Q25M99o28j496j468j005o06k24J22J72j2j49
54078E4153k89l97J16J397K292J806Q41Q74J495J083l53j095n03K29L19M56J041
$$ plain form
54208 67153 66597 66005 65595 65278 65239 65845 66865 67613 67871 67919 67751 67152 66472 66319 66482 66144 65213 64450 64211
54189 64211 64075 63809 63666 63552 62879 61499 59959 58669 57643 57057 57084 57148 56406 55066 54221 54313 54874 55751
54171 55751 57289 59087 59988 59778 59691 60649 62095 63090 63488 63491 63051 62357 62038 62279 62516 62428 62357 62383 61983 61060
54151 61060 60332 60171 60077 59773 59766 60188 60200 59438 59025 60139 62297 64000 64513 64174 63525 63033 63255 64374 65785
54132 65785 66686 66841 66382 65331 63816 62314 61202 60403 59759 59254 58575 57118 54894 52916 52179 52659 53592
54115 53592 54276 54301 53617 52742 52430 52824 53358 53598 53596 53366 52846 52526 53207 54818 56351 57269 58012 58791 58971
54096 58971 58251 57418 57241 57481 57696 58123 58948 59447 58819 57323 55855 54850 54244 54020 54142 54314 54302 54153
54078 54153 53864 53467 53583 54980 57272 59078 59919 60793 62288 63371 63018 61923 61420 61649 61968 62424 63465
54061F3465J258O42j7j6K99N31Q64J196R72L81L96J113J454R89O49R54J059M40
54043G6629Q6R20K252K873K798K784K970K984K880L018L381L679L861M056M363
54028A19534M955N878O668O788O518O572O833O455N359M506M356M224L587K923
54014A95156K667K395J672R15O78P52N13l45j739l245m077l772l027k997l659
53999A81887l990l816m126n186n800n150m057l567l482l127k604k282j928j299
53985A31473q29q74j001q39q91j597k342k247j424n57J37O24M35o75j842j944
53969A15607j098l77k16J9Q31J797K112J569P69N72J238K101K258J676J178J280
53953A31316J558J396P94J70j90j39L98J167J639J614J484J681K274L159M194
$$ plain form
54061 63465 64723 65365 65348 65332 65631 66162 67026 68222 69194 69575 69971 71084 72538 73527 74176 75130 76189 76629
54043 76629 76715 77635 79887 82760 85558 88342 91312 94296 97176 100194 103575 107254 111115 115171 119534
54028 119534 124489 130367 137035 143823 150341 156913 163746 170201 175560 180066 184422 188646 192233 195156
54014 195156 197823 200218 201890 202805 203483 204235 204748 204403 202664 199419 195342 191570 188543 185546 181887
53999 181887 177897 174081 169955 164769 158969 153819 149762 146195 142713 139586 136982 134700 132772 131473
53985 131473 130644 129770 128769 127930 127039 125442 123100 120853 119429 118872 119009 119633 120068 119393 117551 115607
53969 115607 114509 114132 113916 113935 114766 116563 118675 120244 121013 121585 122823 124924 127182 128858 130036 131316
53953 131316 132874 134270 135064 135234 135044 134905 135303 136470 138109 139723 141207 142888 145162 148321 152515
53938A52515N067N493N656N899N977N324M088L081K565J855N34q31j516j566j425
53923A92716j236r00l39N31J639K490K653K544K953L792M241M134M236M847N354
53908B29655N473N822O639P097O628N955N917O131N700M516L055J429l85j947
53894B91685k784l113l385l519l229k803k872l599m630n595o266o509o392o175
53880B30814n986n833n966o614p339p362o717o172n874n082l655k668k846l381
53866A55319l175k459k210k626l119l366l473l456l331l363l605l527k774j854
53852A12981j448j424j257j004j077j403j554j490j473j382q18J24P88P12N9o46
53836I9688r72q70o90p99j038r17l54J12R9j39j72P6M45P95R21O72L19L17O20
$$ plain form
53938 152515 157582 163075 168731 174630 180607 185931 190019 193100 195665 197520 198054 197223 195707 194141 192716
53923 192716 191480 190580 190241 190772 192411 194901 197554 200098 203051 206843 211084 215218 219454 224301 229655
53908 229655 235128 240950 247589 254686 261314 267269 273186 279317 285017 289533 292588 294017 293632 291685
53894 291685 288901 285788 282403 278884 275655 272852 269980 266381 261751 256156 249890 243381 236989 230814
53880 230814 224828 218995 213029 206415 199076 191714 184997 178825 172951 167869 164214 161546 158700 155319
53866 155319 152144 149685 147475 144849 141730 138364 134891 131435 128104 124741 121136 117609 114835 112981
53852 112981 111533 110109 108852 107848 106771 105368 103814 102324 100851 99469 98651 98775 99563 100275 100334 99688
53836 99688 98716 97846 97156 96357 95319 94402 94048 94160 94259 94120 93948 94024 94469 95264 96185 96857 97176 97493 98113
53817I8113Q04P87Q65J020R69Q96J213J558J129J82J2J027K066K179J920K145
53801A16885K695L096L605M532N384N612N514N532N385M812M370M591M954M645
53787A81612L794L058K558K093J818J838J682J029M23L48K75m23j235j249o85
53772A96936n14r88j494j684j725j655j380j140j232j504j742k134k709k893k363
53757A71779j806j915k293k301k299k891l561l322k392j843j866j701j132o88
53743A41769m69o1L92K93p4K91J369J823Q52p32j780k146k199j955j367q48p70
53726A34388q74p16l95l62p01r66o70K71J405K000J610M92n98j023o41K25J040
53709A34485J523J909K551L147K973K019J278J449J974J982J558J405J710K159
$$ plain form
53817 98113 98917 99704 100569 101589 102558 103454 104667 106225 107354 107536 107548 108575 110641 112820 114740 116885
53801 116885 119580 122676 126281 130813 136197 141809 147323 152855 158240 163052 167422 172013 176967 181612
53787 181612 185406 188464 191022 193115 194933 196771 198453 199482 199905 200253 200528 200105 198870 197621 196936
53772 196936 196422 195434 193940 192256 190531 188876 187496 186356 185124 183620 181878 179744 177035 174142 171779
53757 171779 169973 168058 165765 163464 161165 158274 154713 151391 148999 147156 145290 143589 142457 141769
53743 141769 141300 141239 141631 141924 141850 142141 143510 145333 146185 145453 143673 141527 139328 137373 136006 135158 134388
53726 134388 133514 132798 132403 132041 131340 130374 129704 129975 131380 133380 134990 135482 134884 133861 133220 133445 134485
53709 134485 136008 137917 140468 143615 146588 148607 149885 151334 153308 155290 156848 158253 159963 162122
53695A62122K682L378M059M540N099N844O038M982L342K542K880L271K933K397
53681B16109K547L377M062L828K594J075K90O09J354J653J410J029M91m83j565
53666B38380j952j414n91j19k3j15m55j077j658j696j062k44Jn92j480j968k085
53649B21850k315k582k306j536j007q48l04P20J020q3j413j556q55n40n69M1J239
53632B08956J852J478R65R23R45O57L99N49R68J398J775J991J943J886K188K716
53616B31589L050L166L308L399L191K829K644K574K511K881M089N617O473O424
53602B83745O065N893N968O192O186N373L935L153L795M842M936M513M942O080
53588C55618O414N531M756N013N664N832N477M758L711K924L259M312M504L209
$$ plain form
53695 162122 164804 168182 172241 176781 181880 187724 193762 198744 202086 204628 207508 210779 213712 216109
53681 216109 218656 222033 226095 229923 232517 233592 233882 234491 235845 237498 238908 239937 240428 239945 238380
53666 238380 236428 235014 234423 234304 234281 234166 233711 232634 230976 229280 228218 227974 227975 227383 225903 223935 221850
53649 221850 219535 216953 214647 213111 212104 211256 210952 211672 212692 212609 211196 209640 208785 208245 207676 207717 208956
53632 208956 210808 212286 213251 214174 215119 215776 216175 216724 217692 219090 220865 222856 224799 226685 228873 231589
53616 231589 234639 237805 241113 244512 247703 250532 253176 255750 258261 261142 265231 270848 277321 283745
53602 283745 289810 295703 301671 307863 314049 319422 323357 326510 330305 335147 340083 344596 349538 355618
53588 355618 362032 367563 372319 377332 382996 388828 394305 399063 402774 405698 408957 413269 417773 420982
53574D20982J650J038J038P91L17K4j53k60J88J309K206K052J254P07M89J44k98
53557D33478m42l54l88m13J2P52J065N88j39k85L37J130J425J229J113J380J686
53540D42174J685J596J679J587R63K76L59J182J952K310K601L063L586M324N597
53525D74934P052P881Q009Q222Q854R356R434R727J0790J2139J2982J3355J3923
53512F06658J4950J5973J6421J6390J6670J7964J9905K1362K1917K2469K3772
53501H14451K5238K6048K6721K8215L0062L0950L0952L1414L2668L3642L3963
53490A144324L4566L5621L5698L4045L2023L1187L1191L0849L0207L0130L0700
53479A500541L1258L1523L1587L1227L0282K9231K8620K8292K7853K7293K6473
$$ plain form
53574 420982 422632 423670 424708 425499 425816 425840 425687 425427 425615 426924 429130 431182 432436 433143 433632 433776 433478
53557 433478 433036 432682 432294 431881 431893 432645 433710 434298 434159 433874 434211 435341 436766 437995 439108 440488 442174
53540 442174 443859 445455 447134 448721 449684 449960 450319 451501 453453 455763 458364 461427 465013 469337 474934
53525 474934 481986 489867 497876 506098 514952 524308 533742 543469 554259 566398 579380 592735 606658
53512 606658 621608 637581 654002 670392 687062 705026 724931 746293 768210 790679 814451
53501 814451 839689 865737 892458 920673 950735 981685 1012637 1044051 1076719 1110361 1144324
53490 1144324 1178890 1214511 1250209 1284254 1316277 1347464 1378655 1409504 1439711 1469841 1500541
53479 1500541 1531799 1563322 1594909 1626136 1656418 1685649 1714269 1742561 1770414 1797707 1824180
53468A824180K4815K2374K0427J9898J9791J8380J5523J2542J0153P877N545L936
53456B005441L488L326K183k84l537o973j0249j3110j5406j7235j8840k0307k1544
53443A886953k2634k4053k6219k8806l0833l1722l1913l2133l2384l2258l1956
53432A562042l2125l2776l3200l2979l2267l1044k8995k6394k4139k2562k1021
53421A244540j9086j7225j5863j4577j2862j0956r183p153m434j529O24J945L320
53408A137561N531Q488J1482J3914J5897J8154K1110K4133K6220K7331K8384K9901
53396A368106L1561L3249L5504L8475M1325M3330M4841M6600M8692N0779N2771
53385A835233N4801N6966N9486O2515O5510O7544O8636O9848P1638P3086P3353
$$ plain form
53468 1824180 1848995 1871369 1891796 1911694 1931485 1949865 1965388 1977930 1988083 1995960 2001505 2005441
53456 2005441 2008929 2012255 2014438 2014154 2010617 2003644 1993395 1980285 1964879 1947644 1928804 1908497 1886953
53443 1886953 1864319 1840266 1814047 1785241 1754408 1722686 1690773 1658640 1626256 1593998 1562042
53432 1562042 1529917 1497141 1463941 1430962 1398695 1367651 1338656 1312262 1288123 1265561 1244540
53421 1244540 1225454 1208229 1192366 1177789 1164927 1153971 1144788 1137635 1133201 1131672 1132296 1134241 1137561
53408 1137561 1143092 1151580 1163062 1176976 1192873 1211027 1232137 1256270 1282490 1309821 1338205 1368106
53396 1368106 1399667 1432916 1468420 1506895 1548220 1591550 1636391 1682991 1731683 1782462 1835233
53385 1835233 1890034 1947000 2006486 2069001 2134511 2202055 2270691 2340539 2412177 2485263 2558616
53374B558616P2938P2670P2410P1725P0917P0363O9478O7470O4567O1362N7474
53363C309990N2035M5277L8524L2733K7927K3869K0292J6563J2048O802J302m324
53351C583038j0114j5620k0270k4294k8491l3354l9095m6191n4769o3500p0230
53340C177110p4028p5770p6531p6336p4917p2868p1310p0679p0444o9904o8968
53329B375355o7993o7086o5859o4033o2015o0419n9097n7249n4645n1990m9708
53318A715261m7110m3409l8998l5005l1933k9509k7504k5943k4569k2891k0855
53307A367535j8862j7105j5266j2978j0253p411m850k759q82J204L403M993N534
53294A292303N534N893O924Q317R784J1326J3062J5107J7466J9865K1942K3744
$$ plain form
53374 2558616 2631554 2704224 2776634 2848359 2919276 2989639 3059117 3126587 3191154 3252516 3309990
53363 3309990 3362025 3407302 3445826 3478559 3506486 3530355 3550647 3567210 3579258 3586060 3587362 3583038
53351 3583038 3572924 3557304 3537034 3512740 3484249 3450895 3411800 3365609 3310840 3247340 3177110
53340 3177110 3103082 3027312 2950781 2874445 2799528 2726660 2655350 2584671 2514227 2444323 2375355
53329 2375355 2307362 2240276 2174417 2110384 2048369 1987950 1928853 1871604 1816959 1764969 1715261
53318 1715261 1668151 1624742 1585744 1550739 1518806 1489297 1461793 1435850 1411281 1388390 1367535
53307 1367535 1348673 1331568 1316302 1303324 1293071 1285660 1280810 1278051 1277169 1278373 1281776 1286769 1292303
53294 1292303 1297837 1303730 1310654 1318971 1328755 1340081 1353143 1368250 1385716 1405581 1427523 1451267
53282A451267K5644K7713K9610L1246L2887L4429L5276L5307L5126L5005L4372
53271A807882L2988L1665L1105L0703K9466K7411K5169K2795K0031J7292J5245
53260B091752J3673J1751R344P059N144L184Q48j844m859q050j0880j3013j5051
53247B089058j7846k1267k4416k6956k9373l1902l4135l5720l6781l7467l7765
53236A755430l7846l7970l7955l7371l6319l5415l4830l3959l2278l0152k8527
53225A372808k8032k8482k9084k9131k8597k7965k7461k6861k6108k5491k4915
53214A070681k3661k1449j9170j7910j7653j7625j7417j7068j6507j5795j5547
53203H70879j6231j7292j7807j7740j7670j7510j6541j4769j3307j3123j4000
$$ plain form
53282 1451267 1476911 1504624 1534234 1565480 1598367 1632796 1668072 1703379 1738505 1773510 1807882
53271 1807882 1840870 1872535 1903640 1934343 1963809 1991220 2016389 2039184 2059215 2076507 2091752
53260 2091752 2105425 2117176 2126520 2133579 2138723 2141907 2142755 2140911 2136052 2128002 2117122 2104109 2089058
53247 2089058 2071212 2049945 2025529 1998573 1969200 1937298 1903163 1867443 1830662 1793195 1755430
53236 1755430 1717584 1679614 1641659 1604288 1567969 1532554 1497724 1463765 1431487 1401335 1372808
53225 1372808 1344776 1316294 1287210 1258079 1229482 1201517 1174056 1147195 1121087 1095596 1070681
53214 1070681 1047020 1025571 1006401 988491 970838 953213 935796 918728 902221 886426 870879
53203 870879 854648 837356 819549 801809 784139 766629 750088 735319 722012 708889 694889
53192F94889j4900j4980j4205j3325j3195j3816j4335j4306j4383j5202j6223
53181E36019j6422j5679j4658j3767j3118j2976j3265j3089j1794j0163r422r464
53169C82202r236q622q432q708q509p578o740o371n882n108m862n470n948n482
53155B85254m686m581n094n378n065m428l746l117k598k120j551j104j252k010
53141B38524k749k984k836k529j995j303q38p34o10k48m0l67r51j217r75m54J13
53124B17807O20J074J607K280K846K970K752K625K654K436J807J274J397K062
53110B46211K553K229J090k37j040j280j567k309l114l388l157k867k762k854
53096B27508l251l874m257m195m222m764n238m864l987l598l741l575k931k592
$$ plain form
53192 694889 679989 665009 650804 637479 624284 610468 596133 581827 567444 552242 536019
53181 536019 519597 503918 489260 475493 462375 449399 436134 423045 411251 401088 391666 382202
53169 382202 372966 364344 355912 347204 338695 331117 324377 318006 312124 307016 302154 296684 290736 285254
53155 285254 280568 275987 270893 265515 260450 256022 252276 249159 246561 244441 242890 241786 240534 238524
53141 238524 235775 232791 229955 227426 225431 224128 223290 222556 221946 221698 221658 221291 220340 219123 218148 217694 217807
53124 217807 218427 219501 221108 223388 226234 229204 231956 234581 237235 239671 241478 242752 244149 246211
53110 246211 248764 250993 252083 251846 250806 249526 247959 245650 242536 239148 235991 233124 230362 227508
53096 227508 224257 220383 216126 211931 207709 202945 197707 192843 188856 185258 181517 177942 175011 172419
53082A72419k863k993k408j542j014q11o60n85o84r05j296j862k127j526m01J55
53066A50897l10j058j291j071q81q97j032j186j170q60m50j49L32J244J901J275
53050A45294m35j798j955j441r79m63L47J036J128P73L24k18q89j355j313q58
53034A37198k71J82J23o25j531j765j287q51q27q57p63q55j139j156q97r36j281
53017A22462j174m22J13p7l21kM03L61L36Q62J367J039K17j15K07N56O53O96N98
52998A27759L7p31r41k84O67J123P76j6n10k13N54R61P13L31K49K08j4J6P03J564
52978A32952J834J623J773K678L752M184L786L119K929L488M398N166N741O223
52964A83646O325N666M587L816L381K577J233O6n35j174k337l408l512k772k040
$$ plain form
53082 172419 169556 166563 164155 162613 161599 160788 160128 159543 158859 157954 156658 154796 152669 151143 150742 150897
53066 150897 150587 149529 148238 147167 146286 145389 144357 143171 142001 141141 140691 140542 140874 142118 144019 145294
53050 145294 144859 143061 141106 139665 138686 138223 138570 139606 140734 141507 141831 141613 140724 139369 138056 137198
53034 137198 136927 137109 137232 136607 135076 133311 132024 131173 130346 129489 128726 127871 126732 125576 124679 123743 122462
53017 122462 121288 120866 120979 120902 120581 120579 120982 121343 121679 122541 123908 124947 125164 125049 125256 125812 126465 127161 127759
52998 127759 127796 127065 126124 125840 126507 127630 128406 128390 127880 127667 128221 129182 129895 130226 130475 130683 130669 130685 131388 132952
52978 132952 134786 136409 138182 140860 144612 148796 152582 155701 158630 162118 166516 171682 177423 183646
52964 183646 189971 195637 200224 204040 207421 209998 211231 211297 210762 209588 207251 203843 200331 197559 195519
52949A95519j810j939k154k260k101j694j254q92o11n92j044j663j905j844k065
52934A71691k603k772k259j519q39M2J039J392Q57K59K71M94L61J43K35K75j97
52917A66870q48j033o87p4P27J478J584Q95L7n09r56j318j030j19L02l13q45k16
52899A63945Q27R24K94J68O32O93J85M4O38J200J167Q93Q01Q31Q95J109J327J159
52881A77732N54j27o07p43l30N26J093P87O8j25L73R51J233J256R52K93k16J4
52863A83684P59J302J486J682J890J691J072N33L88N63R55J370J370Q88O85J424
52847B01742K598L237L362L735M420M714M465M280M271L717K315Q26R2mj67q46
52831B42757j996l221l975m064l913l955l902l200k085j502j972l077m021m210
$$ plain form
52949 195519 193709 191770 189616 187356 185255 183561 182307 181415 180804 180212 179168 177505 175600 173756 171691
52934 171691 169088 166316 164057 162538 161699 161741 162780 164172 165029 165288 165559 166053 166414 166557 166792 167067 166870
52917 166870 166022 164989 164302 164228 164955 166433 168017 168912 168949 168440 167484 166166 165136 165017 165319 165006 164161 163945
52899 163945 164772 165696 165990 166158 166790 167483 167668 167712 168350 169550 170717 171610 172411 173242 174137 175246 176573 177732
52881 177732 178286 178159 177552 176809 176479 177005 178098 178885 178953 178828 179201 180152 181385 182641 183593 183886 183670 183684
52863 183684 184443 185745 187231 188913 190803 192494 193566 194099 194487 195050 196005 197375 198745 199633 200318 201742
52847 201742 204340 207577 210939 214674 219094 223808 228273 232553 236824 240541 242856 243682 243774 243770 243603 242757
52831 242757 240761 237540 233565 229501 225588 221633 217731 214531 212446 210944 208972 205895 201874 197664
52817A97664l478k292j644k081l021l530l427l076k521j761j335j659k068j669
52803A64102q63p84j394j526q48l46o24j081j247j570k277k609j960q93k57j04
52787A45719j32m61j222j962k169j979j777j600j376j331j604j871j798j538j386
52772A23513j312j185j092j053q06j95M84Q07N87j39j131j876j968j716j826k400
52756A08692k798k558j862r45J09P60J26j731l367l420k096o19K08L90J53l10
52740I0732p58j112j509j887j771r68o1K56P1J9L18N57L51j49m26p4P75J414J209
52721H6987L52l30l92k26k97m44l06PR9j30m10m40j07M23O98M45J59O76J920K802
52701I1486K709K414K787L314K907J722J035J358J854J849J802K185K334J375
$$ plain form
52817 197664 194186 191894 190250 188169 185148 181618 178191 175115 172594 170833 169498 167839 165771 164102
52803 164102 163239 162455 161061 159535 158687 158341 157717 156636 155389 153819 151542 148933 146973 146080 145823 145719
52787 145719 145587 145126 143904 141942 139773 137794 136017 134417 133041 131710 130106 128235 126437 124899 123513
52772 123513 122201 121016 119924 118871 118065 117870 118354 119161 119748 119609 118478 116602 114634 112918 111092 108692
52756 108692 105894 103336 101474 100529 100638 101398 101524 99793 96426 93006 90910 90291 90499 90889 91042 90732
52740 90732 89974 88862 87353 85466 83695 82727 82666 82922 82993 83012 83330 83887 84238 84089 83663 83589 84364 85778 86987
52721 86987 87339 87009 86617 86391 86094 85650 85344 85351 85450 85320 84910 84470 84363 84786 85484 85929 86088 86764 88684 91486
52701 91486 94195 96609 99396 102710 105617 107339 108374 109732 111586 113435 115237 117422 119756 121131
52687A21131k47j151q55l21n61j434k184k548k741k745k281j483r68j105j632
52672I8875k132k522k810k768k191j349q45r99j534j814j406n27P9o4n38n50K9
52655G6934N65O62O08O48N16J16n4K53L94k96j358j838j621j364j256p90J86J079
52637G3384J371J277J297J560J843J903J712J480J397J146J17j561k667k226q27
52622H1206Q4lm04n89p92j209j517j459j131n17N75J758K019Q91p92j740j535
52605G4845p40o3K85M92O77O53K39k43j84L91O63K29j68K56J023J132P10P63J424
52586H2384J687J069L76M51J096J648J856J769J429J133J316J825J922J327O86
52571A01974O11R40J289J775K638L564L884L234J834L40n67p21o72r00j004k37
$$ plain form
52687 121131 120884 119733 118878 118557 117996 116562 114378 111830 109089 106344 104063 102580 101612 100507 98875
52672 98875 96743 94221 91411 88643 86452 85103 84258 83259 81725 79911 78505 77978 78057 77993 77455 76905 76934
52655 76934 77499 78161 78769 79417 79933 80049 79995 80248 80642 80346 78988 77150 75529 74165 72909 72119 72305 73384
52637 73384 74755 76032 77329 78889 80732 82635 84347 85827 87224 88370 88487 86926 84259 82033 81206
52622 81206 81290 81287 80883 80294 79502 78293 76776 75317 74186 73669 74244 76002 78021 78912 78120 76380 74845
52605 74845 74105 74042 74327 74819 75496 76149 76388 76145 75961 76352 77015 77244 77076 77332 78355 79487 80197 80960 82384
52586 82384 84071 85140 85516 85967 87063 88711 90567 92336 93765 94898 96214 98039 99961 101288 101974
52571 101974 102585 103525 104814 106589 109227 112791 116675 119909 121743 122083 121516 120795 120123 119223 118219 117982
52555A17982J271K527K869K483J767J031P52J207J719J346M01K25J159J954J619
52540A40312P03J61k5k98n26m21j39J49O41J217J204M62p4K34P47P22O12J081
52522A46762J615J322N33K74N32L66m16r38o68q4J92K6n44j460k287k481k103
52505A40641j676j326p50n3J94j18l89k49l2q7j91o6P2l3m7N86J725K512K303
52486A43016J387N57K19J11p3j90k1J59q6n57m63M58J438J539P02l28q23n00M69
52467A47014J489J819J273N19L68Q14J120Q00K35J89Q71J609J523N07o47j118
52451A58385q62l54J11N17P46O83N23M65K41m53j190j151k76O56J060J082J007
52434A61190Q97Q46R74J047P93M83M76L25o12j751j799q21l77j129j857j546r92
$$ plain form
52555 117982 119253 121780 124649 127132 128899 129930 130682 131889 133608 134954 135355 135580 136739 138693 140312
52540 140312 141015 141176 141151 140853 140327 139906 139767 139916 140557 141774 142978 143440 143366 143600 144347 145069 145681 146762
52522 146762 148377 149699 150232 150506 151038 151404 150988 150050 149382 149298 149490 149516 148972 147512 145225 142744 140641
52505 140641 138965 137639 136889 136836 137030 136912 136523 136274 136242 136155 135964 135898 135970 135937 135890 136476 138201 140713 143016
52486 143016 144403 144960 145179 145290 145217 145027 145006 145165 145079 144522 144059 144517 145955 147494 148196 147868 147045 146545 147014
52467 147014 148503 150322 151595 152114 152482 153296 154416 155216 155451 155640 156511 158120 159643 160150 159503 158385
52451 158385 157523 157169 157280 157797 158543 159226 159749 160214 160455 160002 158812 157661 157385 158041 159101 160183 161190
52434 161190 162087 162933 163907 164954 165747 166230 166706 167031 166419 164668 162869 162048 161671 160542 158685 157139 156147
52417A56147j245j776j534q00n55p34n61j93n24j502j995j355j22Q84J325J162
52401A46622N61J0k7L27N95N38J64n49j360j636j010M1Q15J104R67M02j72J41
52383A47533J432K426K122J338J453K295K544J891J290J182R91M63K57P81J504
52368A69502J785J611J263R54R77J486K043K114K024K573L711M460M304L754L380
52353B05941L183L130L397L761L627L033K851L504M213M053L110K104J449J096
52339B48452R55R26Q29P16R07J430J806J702J457J618K213K835L186L235L037
52324B75304K698K392K189J964J616J352J537K323L406M219M370L976L536L504
52310C14386L994M877N857O517O625O422O380O604O907P454Q642J0263J1473J1905
$$ plain form
52417 156147 154902 153126 151592 150792 150237 149503 148942 148749 148225 146723 144728 143373 143251 144135 145460 146622
52401 146622 147183 147193 147166 147493 148088 148626 148790 148241 146881 145245 144235 144276 145091 146195 147162 147564 147392 147533
52383 147533 148965 151391 153513 154851 156304 158599 161143 163034 164324 165506 166497 166960 167217 167998 169502
52368 169502 171287 172898 174161 175115 176092 177578 179621 181735 183759 186332 190043 194503 198807 202561 205941
52353 205941 209124 212254 215651 219412 223039 226072 228923 232427 236640 240693 243803 245907 247356 248452
52339 248452 249407 250333 251162 251878 252785 254215 256021 257723 259180 260798 263011 265846 269032 272267 275304
52324 275304 278002 280394 282583 284547 286163 287515 289052 291375 294781 299000 303370 307346 310882 314386
52310 314386 318380 323257 329114 335631 342256 348678 355058 361662 368569 376023 384665 394928 406401 418306
52296D18306J2126J2632J3171J3560J4205J5191J5715J5342J4996J5607J6500
52285E77351J6386J5430J4941J5361J5926J6190J6507J6897J6765J5986J5057
52274G52797J4022J2369J0308Q958Q780Q846Q135O737N289M049L044K372J881
52261H47587J121O6o53n93m1M95P68O39N8n68o29j50K48L43N12Q57J000R88J486
52242H53534K703L925M624N145N847O411O583O833P648Q778R813J0816J1799J2222
52228I56681J1742J0933J0498J0307R833R158Q780Q704Q477P853O855N424L625
52215A068870J991J076Q02P16N27N2r71k396l373l384l232m134n927p195p220
52200A036202o871p130p660p515o668n961n739n397m435l224k341j679q41o6j08
$$ plain form
52296 418306 430432 443064 456235 469795 484000 499191 514906 530248 545244 560851 577351
52285 577351 593737 609167 624108 639469 655395 671585 688092 704989 721754 737740 752797
52274 752797 766819 779188 789496 798454 807234 816080 824215 830952 836241 840290 843334 845706 847587
52261 847587 848708 848774 848121 847528 847487 847982 848750 849389 849447 848879 848250 848100 848348 848691 849203 850060 851060 852048 853534
52242 853534 856237 860162 864786 869931 875778 882189 888772 895605 903253 912031 921844 932660 944459 956681
52228 956681 968423 979356 989854 1000161 1009994 1019152 1027932 1036636 1045113 1052966 1059821 1065245 1068870
52215 1068870 1070861 1071937 1072739 1073455 1073982 1074034 1073063 1070667 1067294 1063910 1060678 1056544 1050617 1043422 1036202
52200 1036202 1029331 1022201 1014541 1007026 1000358 994397 988658 983261 978826 975602 973261 971582 970741 970675 970567
52185I70567j064k038k151j457n97k8M0n59j617k349k126j287p17p35r28r91j127
52168I50836j618k352k884k725j727m74qp45j983k837l255l615l825l636l346
52153I15806l331l156k257j230j265k403l503l948m160m279l787k796k434l253
52139H74004m353m757m702m830n071n145n252n451n128l994k939k963l783m446
52125H11190m719n006n318n340n186n132m879m051l194l240m007m195l107j508
$$ plain form
52185 970567 969503 967465 965314 963857 963260 963232 963272 962713 961096 958747 956621 955334 954617 953882 952954 951963 950836
52168 950836 949218 946866 943982 941257 939530 939056 939048 938303 936320 933483 930228 926613 922788 919152 915806
52153 915806 912475 909319 907062 905832 904567 902164 898661 894713 890553 886274 882487 879691 877257 874004
52139 874004 869651 864894 860192 855362 850291 845146 839894 834443 829315 825321 822382 819419 815636 811190
52125 811190 806471 801465 796147 790807 785621 780489 775610 771559 768365 765125 761118 756923 753816 752308
$$ [...]
##END NTUPLES=NMR SPECTRUM
##END=
