
##TITLE=AC1292_BRARS11103_6524801_OX77LkaJgg
##JCAMPDX= 6.0         $$ Bruker NMR JCAMP-DX V2.0
##DATA TYPE= NMR SPECTRUM
##DATA CLASS= NTUPLES
##ORIGIN= BRUKER
##OWNER= Administrator
$$ 1.72 TOPSPIN		Version 2.1
$$ 2012-07-14 23:27:22.468 -0500  Administrator@TOPSPIN
$$ Compression mode = diff/dup
##.OBSERVE FREQUENCY= 400.02188249412
##.OBSERVE NUCLEUS= ^1H
##.ACQUISITION MODE= SIMULTANEOUS (DQD)
##.ACQUISITION SCHEME= undefined
##.AVERAGES= 8
##.DIGITISER RES= 22
##SPECTROMETER/DATA SYSTEM= spect
##.PULSE SEQUENCE= zg30
##.SOLVENT NAME= COFFEE_meoh
##.SHIFT REFERENCE= INTERNAL, COFFEE_meoh, 1, 14.98509
##AUDIT TRAIL= $$ (NUMBER, WHEN, WHO, WHERE, PROCESS, VERSION, WHAT)
$$ ##TITLE= Audit trail, TOPSPIN		Version 2.1
$$ ##JCAMPDX= 5.01
$$ ##ORIGIN= Bruker BioSpin GmbH
$$ ##OWNER= Administrator
$$ $$ C:\Bruker\TOPSPIN/data/COFFEE/nmr/AC1292_BRARS11103_6524801_OX77LkaJgg/10/pdata/1/auditp.txt
$$ ##AUDIT TRAIL=  $$ (NUMBER, WHEN, WHO, WHERE, PROCESS, VERSION, WHAT)
(   1,<2012-07-14 23:27:15.765 -0500>,<Administrator>,<TOPSPIN>,<go>,<TOPSPIN 2.1>,
      <created by zg
	started at 2012-07-14 23:26:09.093 -0500,
	POWCHK enabled, PULCHK disabled,
       configuration hash MD5:
       6B 1B 68 BB D9 2E 58 E2 7F 35 AD 54 07 DF 0E 41
       data hash MD5: 64K
       22 23 80 D1 B5 4A 9C 33 F1 58 92 31 59 B0 02 3D>)
(   2,<2012-07-14 23:27:18.343 -0500>,<Administrator>,<TOPSPIN>,<proc1d>,<TOPSPIN 2.1>,
      <Start of raw data processing
       efp LB = 0 FT_mod = 6 PKNL = 1 PHC0 = 0 PHC1 = 0 SI = 32K 
       data hash MD5: 32K
       0B 07 C8 A3 71 72 E3 2A FC 25 A4 6A BB 06 BF 10>)
(   3,<2012-07-14 23:27:18.734 -0500>,<Administrator>,<TOPSPIN>,<proc1d>,<TOPSPIN 2.1>,
      <pk PHC0 = 176.8579 PHC1 = 0 
       data hash MD5: 32K
       57 CB 73 10 9F 65 30 79 2D 3C AD E2 5D BB 35 7C>)
(   4,<2012-07-14 23:27:18.843 -0500>,<Administrator>,<TOPSPIN>,<proc1d>,<TOPSPIN 2.1>,
      <abs ABSG = 1 
       data hash MD5: 32K
       33 5E 8A 5A 96 26 95 91 72 3E 71 F0 90 4B 57 C6>)
(   5,<2012-07-14 23:27:18.875 -0500>,<Administrator>,<TOPSPIN>,<proc1d>,<TOPSPIN 2.1>,
      <abs ABSG = 2 
       data hash MD5: 32K
       BC 54 52 61 0E D3 A5 B5 45 97 E8 4E F8 F3 EA A2>)
(   6,<2012-07-14 23:27:18.906 -0500>,<Administrator>,<TOPSPIN>,<proc1d>,<TOPSPIN 2.1>,
      <abs ABSG = 3 
       data hash MD5: 32K
       50 F3 B2 16 00 5E EB A1 D4 8D 91 61 8F 3D 22 48>)
(   7,<2012-07-14 23:27:18.937 -0500>,<Administrator>,<TOPSPIN>,<proc1d>,<TOPSPIN 2.1>,
      <abs ABSG = 4 
       data hash MD5: 32K
       74 0D 7D BE BC 98 A2 1F 20 D3 CD 93 9A 96 16 82>)
(   8,<2012-07-14 23:27:18.968 -0500>,<Administrator>,<TOPSPIN>,<proc1d>,<TOPSPIN 2.1>,
      <abs ABSG = 5 
       data hash MD5: 32K
       67 38 50 27 60 87 9E 93 9D B5 64 CA 8E 32 C5 21>)
$$ ##END=
$$ 
$$ $$ hash MD5
$$ $$ 4E 6C 30 37 CA E9 92 C0 D1 90 F3 8F 8B 1A 00 F5
##$RELAX= 
##$RELAX= 
##$RELAX= 
##$RELAX= 
##$RELAX= 
##$RELAX= 
##$RELAX= 
$$ Bruker specific parameters
$$ --------------------------
$$ [...]
##$TP= (0..7)
150 150 150 150 150 150 150 150
##$TP07= 0
##$TPNAME0= <>
##$TPNAME1= <>
##$TPNAME2= <>
##$TPNAME3= <>
##$TPNAME4= <>
##$TPNAME5= <>
##$TPNAME6= <>
##$TPNAME7= <>
##$TPOAL= (0..7)
0.5 0.5 0.5 0.5 0.5 0.5 0.5 0.5
##$TPOFFS= (0..7)
0 0 0 0 0 0 0 0
##$TUNHIN= 0
##$TUNHOUT= 0
##$TUNXOUT= 0
##$USERA1= <user>
##$USERA2= <user>
##$USERA3= <user>
##$USERA4= <user>
##$USERA5= <user>
##$V9= 5
##$VALIST= <valist>
##$VCLIST= <CCCCCCCCCCCCCCC>
##$VD= 0
##$VDLIST= <DDDDDDDDDDDDDDD>
##$VPLIST= <PPPPPPPPPPPPPPP>
##$VTLIST= <TTTTTTTTTTTTTTT>
##$WBST= 2048
##$WBSW= 25
##$XGAIN= (0..3)
0 0 0 0
##$XL= 0
##$YL= 0
##$YMAX_a= 507346
##$YMIN_a= -649665
##$ZGOPTNS= <>
##$ZL1= 120
##$ZL2= 120
##$ZL3= 120
##$ZL4= 120
##$ABSF1= 14.98509
##$ABSF2= -5.573092
##$ABSG= 5
##$ABSL= 3
##$ALPHA= 0
##$AQORDER= 0
##$ASSFAC= 0
##$ASSFACI= 0
##$ASSFACX= 0
##$ASSWID= 0
##$AUNMP= <proc_prof1d_extract_pilot.lims>
##$AXLEFT= 0
##$AXNAME= <>
##$AXNUC= <1H>
##$AXRIGHT= 0
##$AXTYPE= 0
##$AXUNIT= <>
##$AZFE= 0.1
##$AZFW= 0.1
##$BCFW= 0
##$BC_mod= 0
##$BYTORDP= 0
##$COROFFS= 0
##$CY= 15
##$DATMOD= 1
##$DC= 0
##$DFILT= <>
##$DTYPP= 0
##$F1P= 0
##$F2P= 0
##$FCOR= 0.5
##$FTSIZE= 32768
##$FT_mod= 6
##$GAMMA= 0
##$GB= 0
##$INTBC= 1
##$INTSCL= 1
##$ISEN= 128
##$LB= 0
##$LEV0= 0
##$LPBIN= 0
##$MAXI= 10000
##$MC2= 0
##$MEAN= 0
##$ME_mod= 0
##$MI= 0
##$NCOEF= 0
##$NC_proc= -8
##$NLEV= 6
##$NOISF1= 0
##$NOISF2= 0
##$NSP= 0
##$NTH_PI= 0
##$NZP= 0
##$OFFSET= 14.98509
##$PC= 1
##$PHC0= 176.8579
##$PHC1= 0
##$PH_mod= 1
##$PKNL= yes
##$PPARMOD= 0
##$PPDIAG= 0
##$PPIPTYP= 0
##$PPMPNUM= 2147483647
##$PPRESOL= 1
##$PSCAL= 4
##$PSIGN= 0
##$PYNMP= <proc.py>
##$REVERSE= no
##$SF= 400.02
##$SI= 32768
##$SIGF1= 0
##$SIGF2= 0
##$SINO= 400
##$SIOLD= 32768
##$SPECTYP= <>
##$SREGLST= <1H.CDCl3>
##$SSB= 0
##$STSI= 32768
##$STSR= 0
##$SW_p= 8223.68421052631
##$SYMM= 0
##$S_DEV= 0
##$TDeff= 65536
##$TDoff= 0
##$TI= <>
##$TILT= no
##$TM1= 0
##$TM2= 0
##$TOPLEV= 0
##$USERP1= <user>
##$USERP2= <user>
##$USERP3= <user>
##$USERP4= <user>
##$USERP5= <user>
##$WDW= 1
##$XDIM= 32768
##$YMAX_p= 469678091
##$YMIN_p= -669222
##$CURPLOT= <Network HP LaserJet P1505>
##$CURPRIN= <$Network HP LaserJet P1505>
##$DFORMAT= <normdp>
##$LAYOUT= <+/1D_H.xwp>
##$LFORMAT= <normlp>
##$PFORMAT= <normpl>
##$SURQMSG= 1
$$ End of Bruker specific parameters
$$ ---------------------------------
##NTUPLES= NMR SPECTRUM
##VAR_NAME=  FREQUENCY,     SPECTRUM/REAL,   SPECTRUM/IMAG
##SYMBOL=    X,             R,               I
##VAR_TYPE=  INDEPENDENT,   DEPENDENT,       DEPENDENT
##VAR_FORM=  AFFN,          ASDF,            ASDF
##VAR_DIM=   32768,         32768,           32768
##UNITS=     HZ,            ARBITRARY UNITS, ARBITRARY UNITS
##FACTOR=    0.250966925370066, 1,           1
##FIRST=     8223.43324360094, -83219,       -17527
##LAST=      0,             -44258,          -7682
##MIN=       0,             -669222,         0
##MAX=       8223.43324360094, 469678091,    0
$$ Real data points
##PAGE= N=1
##DATA TABLE= (X++(R..R)), XYDATA
$$ [...]
$$ plain form
19532 -380834 33613 -204552 77427 -208801 219025 -112415 -302413 309546 -43818 57012
19521 122612 520376 -316170 -137057 -277626 -38964 -69825 -281959 264256 -52308 -334149
19511 -334149 130444 -4044 159529 -186808 301425 -202872 -84605 -155092 -173681 -12123 -83303
19500 -83303 -54112 148228 53110 -24767 739 137189 78319 215753 89408 280917 -224089
19488 -50033 -46928 19278 -164358 22619 -96916 -124796 -166733 -245904 17057 111776 -309984
19476 129343 -27408 -42238 -206281 -340257 2823 -269961 79254 -224028 -306764 -335064 189619
19464 -308992 159990 -142818 -63263 224736 -149361 -15081 -172002 -279497 -187483 -110344
19454 -110344 -213306 -336630 19371 -99270 118408 -9250 31389 156066 -194528 -76884 -99754
$$ packed form
19532c80834C3613b04552G7427b08801B19025a12415j89998C09546d3818E7012
19521A22612L97764c16170a37057j40569c8964l0861k12134B64256e2308k81841
19511c34149A30444d044A59529a86808C01425b02872h4605p0487j8589a2123p1180
19500h3303K9191A48228E3110b4767G39J36450n8870J37434H9408J91509b24089
19488e0033L105A9278a64358B2619i6916k7880m1937p9171A7057R4719c09984
19476A29343b7408j4830j64043j33976B823b69961G9254b24028q2736k8300A89619
19464c08992A59990a42818f3263B24736a49361a5081j56921j07495R2014P7139
19454a10344j02962j23324A9371i9270A18408i250C1389J24677a94528g6884k2870
$$ plain form
19443 -99754 -350003 -119079 -351279 -334016 -49917 179611 214088 -155852 34926 -62192 -21692
19431 -32885 149409 -325354 63675 -421822 7017 344859 222957 -277849 -272574 21302 104944
19420 104944 208275 -296545 72443 33719 -165670 -26962 -172968 -175860 85307 -180294 10141
19408 -127490 -156731 3551 78677 -71660 -134828 -106671 20749 -94319 -380586 -233949 363289
19396 -310842 -165794 -15797 -86317 49001 23471 11967 8995 34629 -206138 182990 27557
19384 148151 143320 -117172 -339279 269719 242179 73053 -97542 38535 96061 -42293 28893
19372 -271720 -592561 -126327 162461 -335390 -30718 53138 184863 293036 -100148 -134705
19362 -134705 -12185 -15438 305115 -391629 -58454 -155705 -13272 -168049 -101219 -91458 -63190
$$ packed form
19443i9754k50249a19079k32200J7263d9917A79611L4477a55852C4926f2192b1692
19431c2885A49409c25354F3675d21822G017L37842j21902b77849N275B1302Q3642
19420A04944J03331b96545G2443C3719a65670b6962j46006k892H5307a80294A0141
19408a27490k9241C551P5126g1660o3168K8157B0749i4319k86267J46637C63289
19396c10842J45048a5797p0520D9001B3471j1504k972K5634b06138A82990B7557
19384A48151m831a17172k22107B69719k7540G3053i7542C8535N7526d2293B8893
19372b71720l20841a26327A62461c35390c0718E3138J31725J08173a00148l4557
19362a34705a2185l253C05115c91629e8454r7251a3272j54777O6830R761K8268
$$ plain form
19351 -63190 -29133 -182321 -403377 -199346 -57281 110856 -125333 -79714 172 46027 -59546
19339 -137790 -161388 261888 27415 -126288 -179228 -143590 -80760 34462 -375319 -179445 -305052
19328 -305052 194930 -239213 -429821 -12466 -91325 364959 296810 -76938 -189654 -129804
19318 -129804 -230946 -75287 -28990 -162921 -311861 31907 -83443 23418 -241658 -21285 -20498
19307 -20498 -329253 -76214 -430299 38576 97880 332721 -210804 66685 76108 162309 -279200
19295 513648 4509 72366 -378262 -54305 32828 200670 -82082 -35074 -166128 -85938 -277
19283 -70222 107740 -68369 -26619 -195820 130984 -6654 -38454 36935 28303 -16160 -187875
19272 -187875 -155990 -224368 -135284 -169917 -14566 35985 -230380 -412640 -144357 -33351 -98546
$$ packed form
19351f3190b9133j53188k21056a99346e7281A10856a25333M5619A72M5855e9546
19339a37790k3598B61888B7415a26288n2940L5638O2830C4462c75319a79445j25607
19328c05052A94930b39213j90608a2466p8859C64959o8149g6938j12716N9850
19318a29804j01142g5287b8990j33931j48940C1907h3443B3418b41658b1285P87
19307b0498l08755g6214l54085C8576N9304K34841b10804F6685R423Q6201b79200
19295E13648D509O7857c78262e4305C2828J67842h2082c5074j31054Q0190b77
19283g0222A07740f8369b6619j69201A30984f654l1800C6935q632a6160j71715
19272a87875L1885o8378Q9084l4633a4566C5985b30380j82260a44357c3351o5195
$$ plain form
19261 -98546 -362134 106961 -181016 -136091 -258334 126648 -213340 -130269 -81159 104923
19250 -183698 -128765 -31436 122509 -194078 -83900 -187883 -166231 233397 246061 140548
19240 140548 -137718 -153936 -106323 -134197 -184283 5501 -149297 214025 -128014 -117743 -36326
19228 47164 -182914 -285352 -171308 -239565 157745 811 -293874 151639 6717 25787 219862
19217 219862 -124366 -143589 53507 -274869 -306383 261395 63498 136081 -78746 217086 7245
19205 153802 -280247 122108 -311513 -125979 -70139 26613 -109939 -180381 -74151 -38198
19195 -38198 -89078 -51997 -78266 -1345 -55214 95211 -113683 203897 4839 134345 -125922
19183 -215592 4898 -281033 -23169 -291960 18531 -223845 32954 -40443 33481 -74051 -266600
$$ packed form
19261i8546k63588A06961a81016M4925j22243A26648b13340Q3071M9110A04923
19250a83698N4933c1436A22509a94078h3900j03983K1652B33397J2664j05513
19240A40548a37718j6218M7613k7874n0086E501a49297B14025a28014J0271c6326
19228D7164a82914j02438J14044o8257A57745H11b93874A51639F717J9070J94075
19217B19862a24366j9223E3507b74869l1514B61395F3498P2583g8746B17086G245
19205A53802b80247A22108c11513a25979N5840B6613a09939p0442g4151L5953
19195c8198n0880L7081k6269a345n3869I5211a13683B03897D839J29506a25922
19183b15592D898b81033b3169k68791A8531b23845C2954d0443C3481g4051j92549
$$ plain form
19172 -266600 -53434 -155426 -150844 -86824 -83523 -42952 40370 -183288 -121678 360571 -276693
19160 -14768 127358 -37301 51689 129501 -157080 -470602 -236498 -44038 -122388 -4282 -293327
19149 -293327 154781 -285883 -107680 -554531 -86649 -38870 -130785 35914 -110331 192715
19138 -214571 10334 -27593 -123982 -328134 -195052 166554 -111883 119633 -114248 -19453
19127 134253 73340 -58349 78186 -243347 50761 -92685 -278912 -85317 -204847 -109207 -203366
19116 -203366 -66269 -88225 87372 188799 -271969 -59654 -119220 -104866 173183 55605 -282810
19104 -271705 -14001 87390 201272 -432745 -428855 -104587 190435 -310959 53594 178717
19094 178717 -125780 -64565 -386461 -335280 67792 148394 -736 28426 -190258 -22621 -35068
$$ packed form
19172b66600e3434j01992M582O4020L301M0571D0370a83288O1610C60571b76693
19160a4768A27358c7301E1689P7812a57080l13522K34104d4038p8350d282k89045
19149b93327A54781b85883a07680m46851h6649c8870r1915C5914a10331A92715
19138b14571A0334b7593r6389k04152J33082A66554a11883A19633a14248a9453
19127A34253o0913e8349G8186b43347E0761i2685j86227h5317j19530R5640r4159
19116b03366f6269k1956H7372J01427b71969e9654n9566J4354A73183E5605b82810
19104b71705a4001H7390J13882d32745L890a04587A90435c10959E3594J25123
19094A78717a25780O1215l21896N1181F7792Q0602g36B8426a90258b2621j2447
$$ plain form
19083 -35068 -32219 111696 90422 -119282 -216956 -532419 -191688 429918 -114952 -288677
19073 -288677 -225160 -251043 -183636 -201556 -51441 -75309 99161 45842 78342 -11624 -86386
19062 -86386 149753 103013 39246 -32411 -454384 222686 110874 111443 -437472 -121466 89548
19050 -340231 157750 17999 -1888 -201815 -113153 -94330 -132527 -236394 -131488 -239287 -34445
19038 -22994 154485 -193726 -147641 -107621 -44639 215923 -499787 82079 313650 40298 142197
19027 142197 -70535 -395841 140502 -149518 -33260 -189438 -72329 197657 58843 -247205
19016 -95037 -410914 22874 -138751 200902 77121 270959 -303812 -344656 -62485 21177 4127
19004 -384922 238026 25931 19981 263686 -81312 -92917 30100 223711 79845 135497 227187
$$ packed form
19083c5068K849A11696k1274a19282r7674l15463a91688D29918a14952j73725
19073b88677O3517k5883O7407j7920e1441k3868I9161D5842L2500a1624p4762
19062h6386A49753m6740C9246c2411m21973B22686A10874N69d37472a21466H9548
19050c40231A57750A7999a888j99927Q8662J8823l8197j03867J04906j07799c4445
19038b2994A54485a93726M6085M0020d4639B15923d99787H2079K31571D0298J01899
19027A42197g0535l25306A40502a49518c3260j56178g2329A97657E8843b47205
19016i5037l15877B2874a38751B00902G7121J93838c03812m0844f2485B1177D127
19004c84922B38026B5931n950K43705h1312j1605C0100J93611G9845N5652R1690
$$ plain form
18993 227187 55616 -255690 158116 50936 -193301 45212 -186697 -179735 -228669 -51951 86033
18981 -7996 -358405 -117734 24795 -14546 -128942 93652 13413 270542 -367674 -52893 -92776
18970 -92776 147617 -198731 62569 -189113 -250279 -297213 10115 -152844 -53615 105745 82979
18959 82979 -22117 122301 -301767 -104971 -344565 43128 210198 124196 -389506 -202090
18949 -202090 -415033 119086 22797 49351 52590 -306019 19336 -94611 -146858 137446 -89383
18937 -261273 -129256 57131 70549 -186861 -119772 -210268 25937 109836 -49974 138670 -269955
18925 -12264 -5922 -143554 -66609 -118121 -100671 35707 395679 -322477 38528 -117229 117372
18913 -271369 -107893 -131957 159901 160438 -2103 -54393 -270459 -553118 9371 -445486 -216788
$$ packed form
18993B27187E5616b55690A58116E0936a93301D5212a86697O962m8934e1951H6033
18981g996l50409a17734B4795a4546j14396I3652A3413K57129c67674e2893l9883
18970i2776A47617a98731F2569a89113o1166m6934A0115a52844e3615A05745k2766
18959H2979b2117A22301c01767a04971k39594D3128J67070q6002c89506J87416
18949b02090k12943A19086B2797K6554L239c06019A9336i4611n2247A37446h9383
18937b61273a29256E7131J3418a86861O7089r0496B5937Q3899d9974A38670b69955
18925a2264e922j37632f6609n1512J7450C5707L59972c22477C8528a17229A17372
18913b71369a07893k4064A59901N37b103n2290k16066k82659I371d45486b16788
$$ plain form
18901 135549 359838 273667 127822 -410631 -13705 -70552 71978 -45295 -161952 -127327 276122
18889 380697 148560 84 -218223 -352686 -383266 95500 -143532 94970 -19674 -374618 -79837
18877 -204502 -242415 -372576 -22460 -191893 208927 264110 308066 -215808 115209 -204544
18866 -219916 26736 7831 -91757 -75326 66105 2330 210692 -77 -218008 -184157 10626 -184416
18853 74992 -31185 -45703 -31567 -47325 -263584 173475 -298410 -228564 -39713 77579 115139
18842 115139 163816 101082 -186564 -114881 94686 -258584 -116207 41197 190952 -86669 52697
18830 326167 -171129 61424 -82534 -159228 294974 -72208 107537 -10169 -110442 195154
18819 95670 -84682 134488 202438 79636 238133 -198471 -20425 -100264 -100203 164706 -194492
$$ packed form
18901A35549K24289q6171A27822d10631a3705n6847G1978d5295j16657L4625B76122
18889C80697A48560H4b18223j34463l0580I5500a43532I4970a9674l54944g9837
18877b04502l7913j30161b2460j69433B08927N5183M3956b15808A15209b04544
18866b19916B6736G831i1757J6431F6105B330K08362g7k17931L3851A0626a84416
18853G4992c1185j4518J4136j5758k16259A73475b98410O9846c9713G7579L7560
18842A15139M8677o2734a86564P1683I4686b58584a16207D1197J49755h6669E2697
18830C26167a71129F1424h2534p6694B94974g2208A07537a0169j00273A95154
18819I5670h4682A34488O7950G9636J58497a98471b0425p9839O1A64706a94492
$$ plain form
18807 -297899 -39177 75719 -6504 -176282 208069 99319 68867 -247314 13631 -232381 141526
18795 -207736 167212 -391692 -231999 -75982 -174484 -226416 100165 -134370 -28073 -123802
18785 -123802 189466 -415262 -232710 -277880 -391780 254988 -134754 -143772 -174494 -354345
18775 -354345 20068 7073 26360 325316 39845 185535 -576987 -241155 -6165 -23298 -115246
18764 -115246 -43042 7353 -131245 -285425 -37761 -316121 175705 135981 -392994 6492 -81860
18752 245724 -201417 -46383 70901 -47333 -146231 -93598 -253488 163104 456627 -150352
18741 -10315 -123583 -174372 -59657 -301183 -251420 -254904 -167788 29965 -181940 -176217 138402
18729 247014 -176826 -127373 -74595 -47984 -258226 176536 210977 -142187 -20632 -82107 -69710
$$ packed form
18807b97899c9177G5719f504j69778B08069I9319l0452b47314A3631b32381A41526
18795b07736A67212c91692J59693g5982r8502n1932A00165a34370b8073r5729
18785a23802A89466d15262J82552m5170j13900B54988a34754r018l0722j79851
18775c54345B0068G073J9287K98956C9845J45690e76987b41155f165j7133r1948
18764a15246d3042G353a31245j54180c7761k78360A75705l9724c92994F492h1860
18752B45724b01417d6383G0901d7333r8898N2633j59890A63104K93523a50352
18741a0315j13268n0789e9657k41526M9763l484Q7116B9965a81940N723A38402
18729B47014a76826M9453N2778K6611k10242A76536L4441a42187b0632o1475J2397
$$ plain form
18718 -69710 -301949 53770 -42734 98014 -206556 51984 -66872 112615 46925 -213053 148046
18706 -203046 -40002 -273901 -380 156180 -51185 -40830 -25635 166334 292688 -325845 149517
18694 70826 13473 -528787 227033 22743 -316408 62237 -69699 8593 -134693 -226848 -508287
18683 -508287 -24355 166507 -18741 -161851 230765 86953 122219 -121565 -62992 62643 -34302
18671 76540 -297633 -16784 -111109 -63617 -377971 -112323 -109451 -501735 314067 -14980 51613
18659 -222093 214074 -66869 94233 -40238 -193195 59712 -20285 22886 -85289 -72214 215987
18647 -331177 293723 -93408 -191164 -232655 -92581 126010 58736 -195982 -28929 -140281 -124587
18636 -124587 -181500 273869 -337559 -10194 -220451 154337 66584 66249 94387 214723 -46266
$$ packed form
18718f9710k32239E3770d2734I8014b06556E1984f6872A12615D6925b13053A48046
18706b03046d0002k33899c80A56180e1185J0355J5195A66334J26354c25845A49517
18694G0826A3473e28787B27033B2743c16408F2237f9699H593a34693r2155k81439
18683e08287b4355A66507a8741j43110B30765H6953L5266a21565N8573F2643c4302
18671G6540b97633a6784r4325M7492l14354a12323K872l92284C14067a4980E1613
18659b22093B14074f6869I4233d0238j52957E9712b0285B2886h5289J3075B15987
18647c31177B93723i3408r7756m1491i2581A26010E8736a95982b8929j11352J5694
18636a24587n6913B73869c37559a0194k10257A54337F6584l35K8138J20336d6266
$$ plain form
18624 231548 -322528 -316659 -185873 -51079 -92873 -106540 -195152 -52526 186674 -147901 118037
18612 -73627 104962 -337598 -92261 -18453 -260574 -61061 -131496 6223 64439 360468 -194670
18600 343780 -82909 -377647 215983 -242199 -26787 274534 -64074 -120566 -85120 -57829 83469
18588 -23547 -155928 41546 15061 -14976 -483876 -219725 22300 -144904 -79717 -27601 -338936
18577 -338936 -59560 262425 -35507 -78257 -146244 48260 -90238 -19011 85234 43116 -319597
18565 -97630 -50423 -387968 -267246 3845 -39519 -110460 47863 -187775 10104 -274326 -183764
18554 -183764 49022 -70801 -28924 145129 136532 86684 261666 -152911 239968 -80449 -70396
18543 -70396 221300 9021 -171262 -198804 4255 -13389 -99917 402769 134847 -83905 48101
$$ packed form
18624B31548c22528N869J30786e1079m1794j3667q8612e2526A86674a47901A18037
18612g3627A04962c37598i2261a8453k42121f1061p0435F223N8216K96029a94670
18600C43780h2909k94738B15983b42199b6787B74534f4074n6492L5446K7291H3469
18588b3547j32381D1546A5061a4976m68900b19725B2300a44904O5187b7601l11335
18577c38936e9560B62425c5507m2750o7987D8260i0238a9011H5234m2118c19597
18565i7630M7207l37545J20722C845c9519p0941D7863a87775A0104b74326R0562
18554a83764D9022g0801b8924A45129q597m9848J74982a52911B39968h0449J0053
18543g0396B21300I021a71262k7542D255a3389q6528D02769A34847h3905D8101
$$ plain form
18531 -111151 91931 292505 83593 121747 151753 -238884 -373016 117402 -64073 96978 -49750
18519 176168 -80438 -66697 -4480 -27219 -15934 -90571 -43147 -14195 189708 -132 -184919 -66523
18506 -134264 -420229 -49610 104501 55691 -133186 317918 95970 -125037 -14129 -189085
18496 -189085 88152 -135286 208783 -81269 -401453 -284862 89336 -116150 50386 31978
18486 31978 -169697 118856 148648 -86681 -312557 105232 -66200 -80529 -134905 -183947 12730
18474 -130943 -77821 -35853 -431557 -34159 -124098 -214493 -272268 -93331 22026 -219431 -315942
18463 -315942 -110638 217284 8251 313345 -88505 -302305 -244256 -186852 -80737 47853 -5286
18451 150895 -278773 81200 -139605 -107805 156085 -207178 206994 -104502 150660 106949
$$ packed form
18531a11151I1931K00574H3593L8154L0006b38884j34132A17402f4073I6978d9750
18519A76168h0438J3741d480k2739J1285p4637d3147a4195A89708a32j84787f6523
18506a34264k85965d9610A04501m8810a33186C17918I5970a25037a4129j74956
18496a89085H8152a35286B08783h1269l20184J16591H9336a16150E0386j8408
18486C1978a69697A18856K9792h6681k25876A05232f6200j4329n4376m9042A2730
18474a30943N3122c5853l95704c4159q9939r0395n7775i3331B2026b19431r6511
18463c15942a10638B17284H251L05094h8505k13800N8049N7404h0737D7853e286
18451A50895b78773H1200a39605L1800A56085b07178B06994a04502A50660m3711
$$ plain form
18441 106949 73298 240744 7647 16307 91181 -25019 -191147 201681 84935 -220866 105947
18429 -161625 36167 -376489 -146408 -144310 -225881 29739 -121577 -233548 -383296 -207130
18419 -207130 -138086 -371903 -239368 -10799 143181 -253659 65627 43294 -132625 87470
18408 -32989 -62264 120944 294191 174236 -339586 -227948 23855 114514 -56989 -122843 10701
18396 -225841 -347453 -107672 -146890 -271805 -169538 165708 -170775 -19549 -139654 -295566
18386 -295566 165335 -137804 -109538 -303008 -10086 147852 -185795 40338 -19250 -37604
18376 -37604 38177 -256814 -249547 -214609 -211819 -70449 8946 -135338 220276 78754 4794 -51752
18363 181942 -82218 -195690 -10036 62516 -247361 -185395 40949 -34432 -44604 -230713 -95442
$$ packed form
18441A06949l3651J67446G647Q660P4874b5019j66128B01681H4935b20866A05947
18429a61625C6167c76489a46408K098q1571B9739a21577j11971j49748J76166
18419b07130O9044k33817J32535a0799A43181b53659F5627k2333a32625H7470
18408c2989k9275A20944J73247j19955c39586J11638B3855R0659e6989o5854A0701
18396b25841j21612a07672l9218j24915J02267A65708a70775a9549j20105j55912
18386b95566A65335a37804K8266j93470a0086A47852a85795D0338a9250j8354
18376c7604C8177b56814P267L4938K790g0449H946a35338B20276G8754D794e1752
18363A81942h2218j13472a0036F2516b47361O1966D0949c4432j0172j86109i5442
$$ plain form
18351 92626 28874 94008 -365578 -106742 -295614 125653 233246 107875 16351 -111750
18340 58653 129219 6874 -20738 -166416 96724 117488 181561 -102031 116889 -223022 316279
18328 83853 108148 79122 -14492 -14589 3925 -128553 -340668 145618 -225104 220063 -98848
18316 -105716 158035 107622 -212446 -92505 -320530 -10482 131 -85470 174043 -331939 57703
18304 -130205 133872 -69057 -382053 54814 -224227 -46259 -230767 76691 -130008 47211
18293 32602 -103601 -36651 137860 -90244 -388235 15721 76000 153679 183067 -78627 25042
18281 -64521 -150499 156436 8839 177359 -29230 -29777 57194 188617 -97082 47910 217956
18270 217956 297017 -124115 -57386 -16697 -144636 -52704 -83608 -199182 -224699 120027 -264205
$$ packed form
18351I2626B8874O5134c65578a06742j88872A25653J07593A07875A6351a11750
18340E8653P0566F874b0738j45678I6724K0764O4073a02031A16889b23022C16279
18328H3853K4295k9026a4492r7C925a28553k12115A45618b25104B20063i8848
18316a05716A58035n0413b12446i2505k28025a0482A31h5470A74043c31939E7703
18304a30205A33872f9057l12996E4814b24227d6259j84508G6691a30008D7211
18293C2602a03601c6651A37860i0244k97991A5721O0279P7679K9388g8627B5042
18281f4521q5978A56436H839J68520b9230n47E7194J31423i7082D7910J70046
18270B17956P9061a24115e7386a6697j27939e2704l0904j15574k5517A20027b64205
$$ plain form
18258 -2394 228823 66739 99761 -108752 176245 -189317 -382128 -108131 296229 76208
18247 -77899 -9796 -87121 -210572 -143228 179235 49772 87024 -104894 162206 89811 -156837
18235 -404849 207971 -94200 100461 296214 164943 137431 -29088 -202381 231376 -394956
18224 -294868 -127639 76157 45971 -18334 -148818 102788 -101321 -16461 243260 60824
18213 -149881 -47163 -251349 -53145 23566 36876 63485 -374753 196092 315299 -2991 -400096
18202 -400096 -59175 -237318 -30996 -54264 -58575 59902 -381851 -36617 -199638 -88116 -261723
18191 -261723 -149454 58320 91970 -112413 -2945 191533 55067 -66425 28253 60092 -42187
18179 -274515 4037 -27541 -144474 -47141 -201576 174697 14305 57197 -51571 -33577 205312
$$ packed form
18258b394B28823F6739L3022a08752A76245a89317j92811a08131B96229G6208
18247g7899i796p7325j23451O7344A79235D9772L7252a04894A62206p2395a56837
18235d04849B07971i4200A00461J95753j31271k7512b9088j73293B31376c94956
18224b94868a27639G6157l0186a8334j30484A02788a01321a6461B43260F0824
18213a49881d7163k04186e3145B3566J3310K6609c74753A96092J19207b991l97105
18202d00096e9175j78143c0996k3268m311E9902c81851c6617j63021h8116j73607
18191b61723J12269E8320L3650a12413b945A91533E5067f6425B8253L1839d2187
18179b74515D037b7541j16933d7141j54435A74697A4305M2892e1571J7994B05312
$$ plain form
18167 -53806 34087 254960 -488190 -211795 42548 -124045 -50776 74693 -214940 -123803 -189241
18156 -189241 -400906 11735 -26246 -30182 202293 59842 -121020 -42040 50514 -77456 48796
18144 -409410 200828 301001 236912 -104581 25983 -349774 -141381 -193070 199938 266334
18134 266334 32424 96763 -63863 -132745 35729 -205824 -308446 40198 109154 -172049 295765
18122 -104611 -266250 -170463 -464593 169220 47829 110438 -366387 -207057 -98545 211331
18111 -15080 232073 -24444 -178792 176213 -49791 154927 77877 -118506 -413791 -235068
18101 -235068 -242347 72062 -146008 199798 23485 100587 -340437 -194899 -136948 34578 -249167
18089 270290 -78627 -227932 96293 -9886 244464 62550 -272117 -87681 32888 -69478 -96166
$$ packed form
18167e3806C4087K20873d88190b11795D2548a24045e0776G4693b14940R1137o5438
18156a89241k11665A1735b6246l936B02293E9842a21020d2040E0514g7456D8796
18144d09410B00828J00173o4089a04581B5983c49774a41381n1689A99938O6396
18134B66334C2424O4339f3863o8882C5729b05824j02622D0198O8956a72049B95765
18122a04611j61639R5787k94130A69220D7829O2609c66387J59330i8545B11331
18111a5080B32073b4444j54348A76213d9791A54927p7050a18506k95285J78723
18101b35068p279G2062a46008A99798B3485P7102c40437J45538N7951C4578b49167
18089B70290g8627j49305I6293i886B44464F2550b72117h7681C2888f9478k6688
$$ plain form
18078 -96166 -127717 -34998 -258554 128179 -102520 -142154 17717 -86184 119000 -422992 -156704
18066 121726 16260 -131386 -88214 -43577 -161745 -140185 -76092 -73588 -27183 -74586 -395258
18055 -395258 -190897 100977 98155 68716 -80089 -202088 48023 -22177 -25721 29533 247187
18044 247187 -257697 -7475 -142229 -137673 106989 -32499 -164430 133799 182320 -107628 -148439
18033 -148439 -112032 285203 330001 150795 79489 107579 -232257 -6016 -21481 -91393 -216988
18022 -216988 -195885 -115166 -357138 -467909 -172425 128438 -175950 -239412 48192 321905
18012 321905 170088 -277573 -131517 42938 -121428 -81328 -111882 8404 -47688 -244849 52295
18000 374405 -87735 -169849 10562 -317585 6334 -127258 302353 40538 -62635 -1692 -254148
$$ packed form
18078i6166l1551c4998k23556A28179a02520l9634A7717h6184A19000d22992a56704
18066A21726A6260a31386M3172d3577j18168K1560O4093K504b7183m7403l20672
18055c95258a90897A00977k822k9439h0089j21999D8023b2177l544B9533K17654
18044B47187b57697g475j34754M556A06989c2499j31931A33799M8521a07628m0811
18033a48439L6407B85203M4798A50795p1306K8090b32257f016j5465o9912j25595
18022b16988K1103Q0719k41972j10771a72425A28438a75950o3462D8192K73713
18012C21905j51817b77573a31517D2938a21428M0100l0554H404d7688j97161E2295
18000C74405h7735q2114A0562c17585F334a27258C02353D0538f2635a692k52456
$$ plain form
17989 -254148 210999 185293 36026 101849 -86010 141296 -388321 587 -135654 -2490 -135884
17978 -135884 127970 93329 -66178 -65035 228376 95129 -41022 152268 -41596 -186287 157014
17966 -86469 -60880 -4899 85281 20924 -40868 -252533 163842 105978 12015 34899 -35921
17954 -185502 -360326 -112941 -139342 105517 64204 -354530 1578 -48770 -7071 -121294 -34093
17942 3077 -25183 -25275 70545 -1065 204244 -47975 26970 -164833 45546 22460 -77640 -50600
17930 -50600 -82613 -223219 242982 204681 -91899 228757 54478 -43199 -51045 -481719 -39691
17918 -104623 196642 -87142 37669 -44225 -281842 -112892 8419 -153019 -25025 232425 -470736
17906 73283 -61742 228869 -6732 107498 -394174 -620633 174909 -74415 -19590 165505 173403
$$ packed form
17989b54148B10999k5706C6026O5823h6010A41296c88321E87a35654b490j33394
17978a35884A27970l4641f6178J143B28376I5129d1022A52268d1596j44691A57014
17966h6469K5589d899H5281B0924d0868k11665A63842n7864A2015K2884c5921
17954a85502j74824a12941k6401A05517m1313c54530A578d8770g071j14223c4093
17942C077b5183r2G0545a065B04244d7975B6970a64833D5546B2460g7640K7040
17930e0600l2013j40606B42982l8301i1899B28757E4478d3199p846m30674c9691
17918a04623A96642h7142C7669d4225k37617a12892H419a53019b5025B32425d70736
17906G3283f1742B28869f732A07498c94174k26459A74909g4415a9590A65505P898
$$ plain form
17895 173403 115524 41740 37755 -202741 -161411 -361784 147772 -412614 269087 -247668
17884 -127805 231276 240843 -2445 -82686 177951 -51468 253185 -390480 -141892 -185962 -39973
17872 -218420 -254501 -269242 40729 -41449 176914 -219122 -226257 112005 160268 -18414 -9752
17861 -9752 -252025 -208779 55802 200965 105898 -155812 -110694 -103915 -280081 -101473 -112726
17850 -112726 84332 277261 158178 156810 229818 -9002 -157745 33781 259327 -26574 176626
17838 73012 62833 286390 -122144 -190945 -251787 118985 -67525 -125985 -240314 150270 180356
17827 180356 193938 -108077 23320 -141435 -260533 -52148 49491 -31244 -10469 196802 93675
17815 127169 218104 193776 -70672 85956 74763 -138258 -201324 167233 108132 -187593 -19465
$$ packed form
17895A73403n7879D1740l985b02741M1330k00373A47772d12614B69087b47668
17884a27805B31276R567b445q0241A77951e1468B53185c90480a41892m4070c9973
17872b18420l6081j4741D0729d1449A76914b19122p135A12005M8263a8414Q662
17861i752k42273M3246E5802J45163r5067a55812M5118O779j76166a01473j1253
17850a12726H4332J92929j19083j368P3008i002j48743C3781K25546b6574A76626
17838G3012j0179K23557a22144o8801o0842A18985f7525n8460j14329A50270L0086
17827A80356J3582a08077B3320a41435j19098e2148D9491c1244a0469A96802I3675
17815A27169R0935k4328g0672H5956j1193a38258o3066A67233n9101a87593a9465
$$ plain form
17803 -113648 -201810 -171300 124186 -96082 288695 535352 -68305 212655 -115774 -43316
17792 92206 -57595 105294 -16378 -44253 142146 5601 16595 -4014 -157658 -486594 215511
17780 -274845 -94251 30245 -15290 175581 -215932 350859 -71055 52738 33500 226237 -61831
17768 1037 233193 30764 -193108 -127335 -44651 236923 -176824 -9706 184331 -276593 8568
17756 -108143 -365985 188105 -41857 -142906 -49709 119529 84690 -168857 46961 76865
17746 76865 150196 -204856 -169092 33170 -266205 -276157 104864 266918 13160 -384723 67885
17734 -261717 -173503 -80468 -302167 -126191 -42684 -69604 11680 224493 55344 248164 -213739
17722 -154209 38621 -107266 42099 -107138 148684 -197949 -99365 -10905 -434800 -27107
$$ packed form
17803a13648q8162L0510A24186i6082B88695K46657f8305B12655a15774d3316
17792I2206e7595A05294a6378k7875A42146E601J0994d014j53644l28936B15511
17780b74845i4251C0245a5290A75581b15932C50859g1055E2738j9238J92737f1831
17768A037K32156C0764a93108O5773d4651B36923a76824i706A84331b76593H568
17756a08143k57842A88105d1857j01049d9709A19529l4839a68857D6961K9904
17746G6865P3331b04856L5764C3170b66205r952A04864J62054A3160c84723F7885
17734b61717Q8214h0468k21699a26191d2684k6920A1680K12813E5344J92820b13739
17722a54209C8621a07266D2099a07138A48684a97949R8584a0905m23895b7107
$$ plain form
17711 42907 -210311 185643 -72778 -173701 55184 -236831 140248 196771 31843 192588
17701 192588 -186742 -150187 309285 -82854 236705 -154088 94494 -85747 -126366 385134
17690 74355 -585 77880 70635 -118948 -218208 140241 -326213 69008 64532 -57113 -100396 93135
17677 -44116 168577 -158583 232402 121496 -301972 -29682 -203653 229880 57145 105870
17667 105870 1158 -23989 -141934 79523 275098 -156078 -115670 186380 -57542 79944 -136882
17655 -38446 -17550 268126 -22346 -387385 85454 -270121 18335 100343 155910 -13206 -172661
17644 -172661 -132302 -21715 -84730 43035 -211876 -47235 75582 -213907 115739 -5511 -168571
17633 -168571 -221010 25068 75606 156546 328052 -109467 100711 38276 98977 -59523 67147
$$ packed form
17711D2907b10311A85643g2778j00923E5184b36831A40248N6523C1843J60745
17701A92588a86742L6555C09285h2854B36705a54088I4494h5747m0619C85134
17690G4355e85G7880p245a18948r9260A40241c26213F9008m476e7113m3283I3135
17677d4116A68577a58583B32402j10906c01972b9682j73971B29880E7145M8725
17667A05870A158b3989j17945G9523J95575a56078M0408A86380e7542G9944a36882
17655c8446a7550B68126b2346l65039H5454b70121A8335Q2008N5567a3206j59455
17644a72661M0359b1715o3015D3035b11876d7235G5582b13907A15739e511j63060
17633a68571n2439B5068N0538Q0940J71506a09467A00711C8276O0701e9523F7147
$$ plain form
17621 45438 230830 -84189 344455 -275182 159424 -168516 67302 172040 -20042 -36564
17611 -36564 258752 -64722 20314 57290 55402 65195 154232 75538 -45299 -36410 -152632 -100071
17599 -100071 -47881 403522 -22879 79938 99169 -481819 592643 132663 74595 88050 -209903
17587 -146155 362581 -153264 -249409 326877 260373 -106896 -143300 238708 24247 152199
17577 152199 -26186 42272 156941 108710 -120239 162611 166564 64449 100919 -8742 179523
17565 -19942 -62505 92643 39835 -137423 -125779 -62466 189354 73554 10232 53260 87460
17554 87460 152555 52327 212548 71436 67633 170109 39127 -425435 157518 218060 -29845
17542 364144 -181801 185329 -342574 219505 -46239 164603 5822 -23131 231655 -13221
$$ packed form
17621D5438J85392h4189C44455b75182A59424a68516F7302J04738b0042j6522
17611c6564B58752f4722B0314L6976j888R793Q9037G5538d5299Q889j16222N2561
17599a00071d7881D03522b2879G9938J9231d81819E92643A32663n8068J3455b09903
17587a46155C62581a53264r6145C26877o6504a06896l6404B38708B4247J27952
17577A52199b6186D2272J14669m8231a20239A62611L953F4449L6470h742A79523
17565a9942m2563I2643C9835a37423J1644f2466A89354G3554A0232M3028L4200
17554H7460O5095E2327J60221G1436l803J02476C9127d25435A57518O0542b9845
17542C64144a81801A85329c42574B19505d6239A64603E822b3131B31655a3221
$$ plain form
17531 169692 -128742 47672 -123510 -30216 -23504 199701 315474 68925 51929 -96422 118426
17519 -26920 -284886 369520 217406 -120452 157898 -8960 -122535 -129945 -28753 -81795 -113935
17508 -113935 74499 -62419 -31394 356178 -114904 -24705 108687 178827 379023 237600
17498 237600 -162277 34655 64252 -285311 -201207 155259 198550 106288 -113962 -92700 -77852
17487 -77852 73839 409071 -17247 115814 -26230 -106829 -193897 463854 258782 368588 -5158
17475 306001 -123361 220766 164457 199142 -173853 101800 297808 -109220 -122177 -299834
17465 -299834 265832 110437 331841 -190232 98033 -155617 195444 -121195 205508 -49272
17454 87484 -25136 52046 352509 224441 262804 414015 -38290 192587 18842 85321 -170345
$$ packed form
17531A69692a28742D7672a23510c0216O712A99701J15773F8925j6996i6422A18426
17519b6920k57966C69520j52114a20452A57898h960j13575p410b8753n3042l2140
17508a13935G4499f2419L1025C56178a14904b4705A08687P0140K00196j41423
17498B37600a62277C4655K9597b85311Q4104A55259M3291r2262a13962K1262J4848
17487g7852G3839L35232a7247A15814b6230q0599q7068D63854k05072J09806e158
17475C06001a23361B20766n6309L4685a73853A01800J96008a09220j2957j77657
17465b99834B65832A10437K21404a90232I8033a55617A95444a21195B05508d9272
17454H7484b5136E2046L00463j28068L8363J51211c8290A92587A8842O6479a70345
$$ plain form
17442 373121 488872 29257 426499 295823 582910 446374 405172 37624 150189 531874
17432 531874 404280 166801 87185 681247 -128144 334551 418113 334239 485168 314432
17422 314432 124718 197672 207256 76543 286761 329015 364113 198462 375189 -151762 248081
17410 -34503 133067 -26378 92486 208231 -152807 -225467 -132736 89500 -82955 20553 -13112
17398 291402 195484 294738 142630 44144 222137 82199 -112594 58571 156020 258586 314237
17387 314237 28740 250931 95198 214168 236437 94290 63333 162982 166908 -78619 -111953
17376 -111953 213083 48617 -242837 -70634 -86582 96678 -24789 -113856 -110177 298199 -248347
17364 29045 27896 258438 98621 272038 157799 -223108 43515 100218 301725 558422 -142251
$$ packed form
17442C73121J15751B9257L97242j30676K87087j36536m1202C7624J12565L81685
17432E31874j27594A66801p9616N94062a28144C34551Q3562q3874J50929j70736
17422C14432A24718P2954R584G6543K10218M2254L5098j65651J76727a51762B48081
17410c4503A33067b6378I2486J15745a52807p2660R2731H9500h2955B0553a3112
17398B91402r5918R9254A42630D4144J77993H2199a12594E8571R7449J02566N5651
17387C14237B8740K22191I5198J18970K2269I4290l0957R9649L926g8619l3334
17376a11953B13083D8617b42837g0634j5948I6678b4789q9067L679B98199b48347
17364B9045j149K30542I8621J73417j14239b23108D3515N6703K01507K56697a42251
$$ plain form
17352 107673 140060 442486 187291 316714 -115919 79292 279185 227788 329059 267810
17342 267810 86400 319594 103604 -42704 -151644 337087 -227913 25249 106077 147855
17332 147855 -41587 86997 314066 -54498 38881 150886 87726 484391 58192 -48804 -224874
17321 -224874 -83683 196289 -70369 21803 330611 -84209 149556 356331 42286 -144759
17310 22779 283220 76950 -183390 -151027 -60433 139143 202190 187899 394302 138038 116668
17299 116668 186297 254925 235575 1168 33459 19090 516121 368771 226108 228574 -339739
17287 -9502 -180046 -18540 270616 79493 -13386 64839 250556 217009 6332 369147 484318
17276 484318 25174 -14885 583925 119191 -85747 177628 -361489 -142138 212739 434081
$$ packed form
17352A07673L2387L02426A87291J29423a15919G9292J99893n1397J01271o1249
17342B67810H6400K33194A03604d2704j08940C37087b27913B5249Q0828M1778
17332A47855d1587H6997K27069e4498C8881J12005o3160L96665E8192d8804j76070
17321b24874h3683A96289g0369B1803L08808h4209A49556K06775D2286a44759
17310B2779K60441G6950a83390L2363f0433A39143O3047j4291K06403A38038k1370
17299A16668O9629O8628j9350A168L2291j4369M97031j47350j42663K466c39739
17287i502j70544a8540B70616G9493a3386F4839J85717l3547F332L62815J15171
17276D84318B5174a4885E83925A19191h5747A77628c61489a42138B12739K21342
$$ plain form
17266 434081 518298 -225030 39101 444227 146152 161094 175282 63921 143355 198943 313243
17255 313243 268752 276410 192508 167797 366430 83696 19649 283528 -95834 86332 65640
17244 65640 202699 295168 175999 347569 49850 72237 352042 -167443 205663 321515
17234 321515 -71097 143344 108486 92190 318226 480143 187400 256503 414537 23916
17223 256263 301140 99810 -31528 249943 427220 317347 -222010 29419 -40950 -39748 -356601
17212 -356601 190155 186237 52378 129849 236274 326753 273755 92650 248687 170586 477296
17201 477296 114144 -74698 183296 231832 206484 210451 66860 210433 -5871 335103 281988
17190 281988 -255538 -158389 128144 536940 80053 201989 63559 27005 305937 220982
$$ packed form
17266D34081Q4217b25030C9101M05126A46152J4942J4188F3921P9434N5588J14300
17255C13243m4491P658q3902k4711J98633H3696A9649K63879i5834H6332k0692
17244F5640J37059R2469j19169J71570D9850K2387K79805a67443B05663J15852
17234C21515g1097A43344l4858j6296K26036J61917A87400O9103J58034B3916
17223B56263M4877I9810c1528B49943J77277j09873b22010B9419d0950J202l16853
17212c56601A90155l918E2378P7471J06425R0479n2998I2650J56037p8101L06710
17201D77296A14144g4698A83296M8536k5348L967F6860J43573e871C35103n3115
17190B81988b55538R7149A28144M08796H0053J21936F3559B7005K78932q4955
$$ plain form
17180 220982 61965 238799 373850 256422 508230 199516 131480 246751 150020 313929
17170 313929 39146 140692 -62481 325597 -60659 405046 112802 188716 282403 246239 230896
17159 230896 449571 384632 318406 112863 12322 133704 112484 238267 429804 206493
17148 284789 140815 287324 405511 474023 232125 417538 215121 441613 -217415 493242
17137 409743 16336 405733 264942 177481 37450 235870 433301 147367 33198 519663
17127 519663 237124 393851 -47617 558098 340221 367436 208902 522887 373337 303740
17117 303740 361316 396568 352127 172180 8891 260726 112215 280977 441201 457684 389040
17106 389040 361059 333876 388286 291997 389529 110141 525503 536693 404143 542080 301953
$$ packed form
17180B20982F1965J76834J35051j17428K51808A99516o8036J15271r6731J63909
17170C13929C9146J01546f2481C25597f0659D05046A12802P5914R3687l6164j5343
17159B30896K18675o4939o6226A12863A2322J21382k1220J25783J91537B06493
17148B84789A40815J46509J18187O8512B32125J85413k02417K26492b17415D93242
17137D09743A6336L89397j40791q7461C7450J98420J97431A47367C3198M86465
17127E19663B37124J56727d7617E58098k17877K7215j58534L13985j49550o9597
17117C03740N7576L5252m4441A72180H891K51835A12215J68762J60224J6483o8644
17106C89040k7981k7183N4410r6289R7532A10141M15362J1190j32550J37937k40127
$$ plain form
17095 301953 425335 377735 614618 520183 320701 268888 466505 341618 747212 395975
17085 395975 177172 465118 602059 245456 192648 65537 612204 462719 322008 562017
17075 562017 136676 318659 138140 93961 507827 393384 346942 524818 386861 329456
17065 329456 123883 218880 472070 450181 501477 403906 505287 727001 160847 345979
17055 345979 659409 393561 962314 467568 363847 312631 293592 485912 450788 510681
17045 510681 415404 870926 562817 502305 263642 321288 336429 639441 349361 702141
17035 702141 521013 514882 787358 695988 594729 654519 452139 535091 885890 917566 361434
17023 404093 612644 753321 277685 285241 324105 739593 566153 776712 666130 433996
$$ packed form
17095C01953J23382m7600K36883r4435j99482n1813J97617j24887M05594l51237
17085C95975A77172K87946J36941B45456n2808F5537N46667j49485j40711K40009
17075E62017A36676J81983A38140m4179M13866j14443m6442J77876j37957n7405
17065C29456A23883R4997K53190k1889N1296r7571J01381K21714A60847J85132
17055C45979L13430k65848N68753D67568j03721n1216j9039J92320l5124N9893
17045E10681r5277M55522l08109o0512k38663N7646J5141L03012k90080L52780
17035G02141j81128o131K72476r1370j01259N9790k02380Q2952L50799L1676C61434
17023D04093K08551J40677B77685P556L8864M15488j73440K10559j10582k32134
$$ plain form
17013 433996 644152 581852 573032 692050 473490 434073 323494 664160 526388 806406
17003 806406 979901 388978 606276 778560 610683 770782 520552 485361 840664 498932
16993 498932 558126 587113 897503 613276 844043 659069 622306 758646 956777 967919
16983 967919 762184 377202 847435 663322 725032 986523 711188 1021883 809642 803962
16973 803962 347589 724418 704764 777352 901341 461113 1065687 760848 759174 794764
16963 794764 819672 1084650 873399 808072 1248791 1023526 738397 767615 1040830 1207402
16953 1207402 1048157 815773 956389 963508 962125 860443 1103562 1027801 972558 1139602
16943 1139602 748229 1274464 832969 1101241 814899 1390592 1062825 1029340 1023261 1298939
$$ packed form
17013D33996K10156o2300q820J19018k18560l9417j10579L40666j37772K80018
17003H06406J73495C88978K17298J72284j67877J60099k50230l5191L55303l41732
16993D98932N9194K8987L10390k84227K30767j84974l6763J36340J98131J1142
16983I67919k05735C77202M70233j84113O1710K61491k75335L10695k12241n680
16973H03962C47589L76829j9654P2588J23989m40228O04574l04839j674L5590
16963G94764K4908K64978k11251o5327M40719k25265k85129K9218K73215J66572
16953A207402j59245k32384J40616P119j383j01682K43119p5761n5243J67044
16943A139602l91373N26235m41495K68272k86342N75693l27767l3485o079K75678
$$ plain form
16933 1298939 1247452 1345437 1191639 1322491 1437119 1495770 1398395 1042122 846978 1555120
16923 1555120 1317840 1380499 1415106 1313231 1243108 1386045 1554424 1674174 1629149 1351964
16913 1351964 1572457 1338813 1280791 1151155 1643621 1548702 1247474 1589750 1665916 1292778
16903 1292778 1383401 1391756 1704114 1648630 1629799 1372612 1717401 1755105 1672916 1745581 1846378
16892 1846378 1671094 1932280 1809854 1864821 1921660 1769595 1787734 2006674 1919097 1939227
16882 1939227 2259899 1932921 2183494 2005115 2328116 2098882 2142526 2382011 2132956 2624663
16872 2624663 2318696 2480109 2207844 2117630 2451717 2360252 2531813 2573009 2542515 2699621
16862 2699621 2794814 2555867 2278570 2598904 2704738 2754904 3073502 2938930 3056541 3148550
$$ packed form
16933A298939n1487R7985j53798J30852J14628N8651r7375l56273j95144P08142
16923A555120k37280O2659L4607j01875p0123J42937J68379J19750m5025k77185
16913A351964K20493k33644n8022j29636M92466r4919l01228L42276P6166l73138
16903A292778R0623Q355L12358n5484j8831k57187L44789L7704q2189P2665J00797
16892A846378j75284K61186j22426N4967N6839j52065J8139K18940q7577K0130
16882A939227L20672l26978K50573j78379L23001k29234M3644K39485k49055M91707
16872B624663l05967J61413k72265r0214L34087r1465J71561M1196l0494J57106
16862B699621R5193k38947k77297L20334J05834N0166L18598j34572J17611R2009
$$ plain form
16852 3148550 3140034 3050522 3228608 2964250 3229650 3320265 3456013 3706705 3309815 3404678
16842 3404678 3722206 3637484 3805894 3562407 3742656 3543037 4121006 3983734 4261707 4202314
16832 4202314 4254963 4163346 4195351 4458665 4277360 4642683 4625206 4894479 5017796 4973901
16822 4973901 5080585 5082036 5697765 5592465 5315682 5423847 6042694 5981420 6003594 6193994
16812 6193994 6252060 6506595 6664849 6992494 6995128 7050166 7107770 7150655 7557899 7444344
16802 7444344 8118124 7863438 8168323 8463230 8489253 8670248 9022031 8949231 9559761 9658125
16792 9658125 9734524 10088014 10416450 10499129 11117356 11133151 11621825 11892426 12256015 12365052
16782 12365052 12886446 13559300 13990987 14251770 14638365 15318832 15701629 15966821 16742224
$$ packed form
16852C148550q516q9512J78086k64358K65400R0615J35748K50692l96890R4863
16842C404678L17528q4722J68410k43487J80249j99619N77969j37272K77973n9393
16832D202314N2649r1617L2005K63314j81305L65323j7477K69273J23317m3895
16822D973901J06684J451O15729j05300k76783J08165O18847o1274K2174J90400
16812F193994N8066K54535J58254L27645K634N5038N7604M2885M07244j13555
16802G444344O73780k54686L04885K94907K6023J80995L51783p2800O10530R8364
16792I658125P6399L53490L28436Q2679O18227J5795M88674K70601L63589J09037
16782A2365052N21394O72854M31687K60783L86595O80467L82797K65192P75403
$$ plain form
16773 16742224 16924079 17682274 18355833 19177696 19954841 20421435 21162618 22034711 22694119
16764 22694119 23575004 24410735 25297442 26631528 27765512 28477432 30005352 31423588 32559995
16755 32559995 33941709 35312556 37053726 38927005 40471125 42880168 44503029 47201085
16747 47201085 49278362 51909830 54409455 57445774 60489994 64052360 67390945 71310879
16739 71310879 75251327 79529966 84434808 89267461 94391236 99973561 106053262 111909085
16731 111909085 118644360 125668711 132223479 139780879 146970080 153812584 161338500 168232824
16723 168232824 174782770 180872379 186088342 190050636 193602247 195672797 196783418 196578053
16715 196578053 195358855 192771874 189018492 184532416 179088684 172739322 166108717 158906052
$$ packed form
16773A6742224J81855P58195O73559Q21863P77145M66594P41183Q72093O59408
16764B2694119Q80885Q35731Q86707J334086J133984P11920J527920J418236J136407
16755C2559995J381714J370847J741170J873279J544120K409043J622861K698056
16747D7201085K077277K631468K499625L036319L044220L562366L338585L919934
16739G1310879L940448M278639M904842M832653N123775N582325O079701N855823
16731A11909085O735275P024351O554768P557400P189201O842504P525916O894324
16723A68232824O549946O089609N215963L962294L551611K070550J110621k05365
16715A96578053j219198k586981l753382m486076n443732o349362o630605p202665
$$ plain form
16707 158906052 151629515 144218381 136896220 129693972 122874858 116032448 109336533 103588511
16699 103588511 97411676 91872160 86806730 81801536 77334915 72882294 69122886 65086974
16691 65086974 62078186 58497724 55557415 52643228 49983147 47443052 45527369 42910153
16683 42910153 41156229 39394714 37249241 35549270 33763682 32395562 31343523 29919536
16675 29919536 28435907 27601928 26636832 25073639 24626692 23596400 22643968 22000859 20881280
16666 20881280 20273012 19783444 18940066 18207459 17478447 17074717 16521699 16060707 15527815
16657 15527815 15060862 14547880 14035917 13801048 12950858 12941381 12468509 12042684 11673283 11366117
16647 11366117 11230997 10570208 10474807 10144507 9740386 9534697 8958415 9052097 9153717 8678077
$$ packed form
16707A58906052p276537p411134p322161p202248o819114o842410o695915n748022
16699A03588511o176835n539516n065430n005194m466621m452621l759408m035912
16691F5086974l008788l580462k940309k914187k660081k540095j915683k617216
16683D2910153j753924j761515k145473j699971j785588j368120j052039j423987
16675B9919536j483629q33979r65096j563193m46947j030292r52432o43109j119579
16666B0881280o08268m89568q43378p32607p29012m03730n53018m60992n32892
16657A5527815m66953n12982n11963k34869q50190r477m72872m25825l69401l07166
16647A1366117j35120o60789r5401l30300m04121k05689n76282R3682J01620m75640
$$ plain form
16637 8678077 8367889 8366434 8354400 7969187 7728765 7754664 7431753 7201616 7210042 7140752 6645962
16626 6645962 6608094 6351225 6251640 6320818 6029916 5903388 5727819 5759239 5610370 5245581
16616 5245581 4985246 5159800 5101468 4798628 4884538 5066258 4723490 4763850 4739962 4460275
16606 4460275 4513023 4276630 4516883 4048221 4244960 4231841 3960105 3821491 3977779 3601682
16596 3601682 3572769 3564235 3389810 3383185 3434237 3282623 3292848 3356051 3036900 3344734 3378840
16585 3378840 3380993 3206208 2665752 2943907 2995746 2743331 3108050 3009793 2913454 3000659
16575 3000659 2677055 2777608 2348142 2333558 2677294 2177277 2388383 2934962 2803819 2128376
16565 2128376 2246633 2428036 2151400 2302347 2116767 1989322 1917370 2105198 1992368 2065869
$$ packed form
16637H678077l10188j455j2034l85213k40422K5899l22911k30137Q426o9290m94790
16626F645962l7868k56869r9585O9178k90902j26528j75569L1420j48869l64789
16616E245581k60335J74554n8332l02840Q5910J81720l42768M0360k3888k79687
16606D460275N2748k36393K40253m68662J96739j3119k71736j38614J56288l76097
16596C601682k8913q534j74425o625N1052j51614J0225O3203l19151L07834L4106
16585C378840K153j74785n40456K78155N1839k52415L64719r8257r6339Q7205
16575C000659l23604J00553m29466j4584L43736n00017K11106N46579j31143o75443
16565B128376J18257J81403k76636J50947j85580j27445p1952J87828j12830P3501
$$ plain form
16555 2065869 2301595 1792359 1705558 1982600 1881556 1917648 1821376 1621887 1817578 1660066
16545 1660066 2063661 1624827 1740586 1679828 1785977 1712204 1557492 1945834 1402166 1557104
16535 1557104 1777772 1539703 1622223 1398757 1767139 1277113 1385847 1694943 1801364 1440093
16525 1440093 1556852 1647834 896173 1323682 1346825 1127239 1567594 1273540 1392115 1062117
16515 1062117 1322529 1265478 1453813 1576140 1316826 1150332 1177023 1267166 1526113 1191771
16505 1191771 1268597 1276228 1007404 842950 1394003 1137085 1326603 1071554 1155510 1037425
16495 1037425 541505 1110777 866505 1439092 860642 1130924 1311005 1067533 1184495
16486 1184495 1069764 955560 1165557 453632 613861 1055687 1349687 835185 1067226
$$ packed form
16555B065869K35726n09236q6801K77042j01044L6092r6272j99489J95691j57512
16545A660066M03595m38834J15759o0758J06149p3773j54712L88342n43668J54938
16535A557104K20668k38069Q2520k23466L68382m90026J08734L09096J06421l61271
16525A440093J16759R0982p51661M27509K3143k19586M40355k94054J18575l29998
16515A062117K60412n7051J88335J22327k59314j66494K6691R0143K58947l34342
16505A191771P6826P631k68824j64454N51053k56918J89518k55049Q3956j18085
16495A037425m95920N69272k44272N72587n78450K70282J80081k43472J16962
16486A184495j14731j14204K09997D53632J60229M41826K94000n14502K32041
$$ plain form
16477 1067226 1121554 837934 836588 1038330 1081257 794198 600920 891623 1062173 705449
16467 705449 796499 951654 664979 468226 911997 386236 928519 897879 852516 914706
16457 914706 858232 1059490 1022173 917916 582420 748029 896435 590183 716018 630770
16447 630770 418204 798972 560572 861688 375731 717770 448862 847382 524983 531168
16437 531168 563051 1002421 659581 494859 734168 834173 629953 483310 802705 705711
16427 705711 365427 727476 711392 514499 405546 626233 620131 503914 512423 675121
16417 675121 491722 630847 350905 864460 317385 330705 669733 966342 811863 802539
16407 802539 421425 599423 701564 735709 621434 601558 527146 621330 675513 586186 783357
$$ packed form
16477A067226N4328k83620j346K01742M2927k87059j93278K90703J70550l56724
16467G05449R1050J55155k86675j96753M43771C86236N42283l0640m5363O2190
16457I14706n6474K01258l7317j04257l35496J65609J48406l06252J25835q5248
16447F30770k12566L80768k38400L01116C75731L42039k68908L98520l22399O185
16437E31168L1883M39370l42840j64722K39309J00005k04220j46643L19395r6994
16427G05711l40284L62049j6084j96893j08953K20687o102j16217Q509J62698
16417F75121j83399J39125k79942N13555C17385J3320L39028K96609j54479r324
16407H02539l81114J77998J02141L4145j14275j9876p4412R4184N4183q9327J97171
$$ plain form
16396 783357 421300 478488 693529 478437 556686 622788 475006 521478 456180 428661 603646
16385 603646 454058 381318 669193 643437 537263 546090 881511 651025 613861 617967 400466
16374 400466 690922 755189 585659 848260 585047 569658 469060 253307 85884 406540
16364 406540 594456 360971 597503 636488 690251 624905 320788 326091 413243 431416 575820
16353 575820 198537 598205 382541 387662 454011 304497 325285 567949 360299 168139
16342 152610 473065 377695 348517 474383 463918 491814 428453 408113 234571 457088 519098
16331 519098 566252 353996 344258 449365 428603 537797 189965 384570 122259 309876
16321 309876 489263 66411 574623 459882 456909 314925 139587 288692 -41369 111089
$$ packed form
16396G83357l62057N7188K15041k15092P8249O6102j47782M6472o5298k7519J74985
16385F03646j49588p2740K87875k5756j06174Q827L35421k30486l7164M106k17501
16374D00466K90456O4267j69530K62601k63213j5389j00598k15753H5884L20656
16364D06540J87916k33485K36532L8985N3763o5346l04117N303Q7152J8173J44404
16353E75820A98537L99668k15664N121O6349j49514K0788K42664k07650A68139
16342A52610L20455r5370k9178J25866j0465K7896o3361k0340j73542K22517O2010
16331E19098M7154k12256r738J05107k0762J09194A89965J94605A22259J87617
16321C09876J79387F6411N08212j14741k973j41984A39587J49105d1369A11089
$$ plain form
16310 193364 618023 178663 79388 483652 300041 415404 175924 278002 349145 392154
16300 392154 451713 240949 198778 327238 392531 118573 264758 212496 -118916 321939
16289 290535 248809 582905 297067 225185 512232 418510 23643 270428 253627 666218
16279 666218 392850 409187 487522 62482 492530 413846 535073 -10052 111017 175641 196385
16268 196385 179659 231118 398735 98207 421175 453765 367099 493313 252591 424804
16258 424804 359767 181706 333250 42625 212859 273253 153551 385394 23816 209243
16248 209243 515947 310566 305029 182141 394495 520727 611052 427411 239951 102408
16237 408681 405436 -6586 303839 360214 319718 71770 231353 355342 231301 292099 151958
$$ packed form
16310A93364M24659A78663G9388M04264j83611J15363A75924J02078P1143M3009
16300C92154N9559k10764m2171J28460O5293A18573J46185n2262a18916C21939
16289B90535m1726L34096k85838p1882K87047r3722B3643K46785j6801M12591
16279F66218k73368J6337P8335F2482M30048p8684J21227a0052A11017O4624K0744
16268A96385j6726N1459J67617I8207L22968L2590q6666J26214k40722J72213
16258D24804o5037j78061J51544D2625J70234O0394j19702K31843B3816J85427
16248B09243L06704k05381n537j22888K12354J26232R0325j83641j87460A02408
16237D08681l245f586C03839N6375m0496G1770J59583J23989j24041O0798j40141
$$ plain form
16226 151958 265137 -22068 464492 109591 209767 322640 464352 278455 137884 218073
16216 218073 549736 169150 338285 415550 299506 367834 231780 188880 77298 174252
16206 174252 38887 104580 183751 543755 93729 -103020 118647 -82709 -42864 330439 223463
16195 223463 37350 303017 115542 501684 85780 489527 -3264 310448 319186 308752 35264
16183 429610 183362 307389 51842 390737 -7787 232165 350507 201700 239493 51109
16172 236928 -134510 155864 136078 69328 20866 -58929 35957 -40741 284274 9494 86082
16161 86082 195706 212640 265154 67122 403013 -300831 179392 209173 -101648 164026
16150 247258 -95622 359479 256029 81530 262704 198348 79449 330660 114136 -106998
$$ packed form
16226A51958J13179b2068D64492A09591J00176J12873J41712j85897A37884Q0189
16216B18073L31663A69150J69135P7265j16044O8328j36054m2900G7298R6954
16206A74252C8887O5693P9171L60004I3729a03020A18647h2709L9845C30439j06976
16195B23463C7350K65667A15542L86142H5780M03747c264C10448Q738j0434C5264
16183D29610A83362J24027E1842L38895g787B32165J18342j48807L7793E1109
16172B36928a34510A55864j9786o6750B0866e8929C5957d0741B84274I494P6588
16161H6082J09624J6934N2514F7122L35891c00831A79392K9781a01648A64026
16150B47258i5622C59479j03450H1530J81174o4356G9449K51211A14136a06998
$$ plain form
16139 -55326 -60072 -29267 95095 119880 147339 -246214 52649 265785 8284 35359 11269 123003
16127 123003 264726 28089 177345 309390 334999 63871 -16189 -264445 479389 560402
16117 560402 -199205 -176650 62954 207532 23440 -134095 82968 179551 -102034 24176 -109823
16105 -172099 133188 -33026 -121254 353564 36837 181201 319873 -425333 279721 27864
16094 101466 33513 156341 56018 -253166 12454 75863 280277 -291275 53753 149191 163480
16083 163480 -5629 -283042 -14917 224543 -40380 116927 158765 112013 256666 340627 177110
16072 177110 -23622 21330 -200107 119400 158333 -42416 106122 130874 7941 196852 158420
16061 158420 483161 -141923 -68772 14728 19017 25738 7314 13902 -159817 -119942 -241966
$$ packed form
16139e5326m746b9267I5095K4785K7459b46214E2649K13136H284K7075A1269J11734
16127A23003J41723B8089J49256J32045K5609F3871a6189k48256D79389Q1013
16117E60402a99205K2555F2954J44578B3440a34095H2968R6583a02034B4176a09823
16105a72099A33188c3026q8228C53564C6837J44364J38672d25333B79721B7864
16094A01466C3513J22828E6018b53166A2454O3409K04414b91275E3753R5438J4289
16083A63480e629k77413a4917B24543d0380A16927M1838m6752J44653Q3961j63517
16072A77110b3622B1330b00107A19400L8933d2416A06122K4752G941J88911l8432
16061A58420L24741a41923f8772A4728M289O721G314O588a59817L9875j22024
$$ plain form
16050 -241966 -247706 150068 115646 20023 -344833 25185 -29731 349434 -53047 89626 -355449
16038 134978 -485103 86185 -165309 -132326 -132653 10612 294940 37104 -77454 -239399 -101930
16026 -213370 -87635 83313 -78617 -16619 154052 132783 89719 -306150 263995 -295262 -313572
16015 -313572 45650 -12077 -361981 -247264 340828 -136742 181679 99905 -132156 -37303
16004 -195554 135751 38147 -30846 -299462 -103599 28773 143976 -232917 -244395 -490880
15994 -490880 -383439 -282991 -116254 219381 -183864 -129334 58415 281678 -165718 132223
15983 30379 -91981 101744 385449 149143 578802 -416237 234716 71668 52749 -187545
15972 351611 -12980 -219439 40410 227552 65646 -68954 -126145 128639 172313 128703 18653
$$ packed form
16050b41966n740A50068l4422B0023c44833B5185b9731C49434e3047H9626c55449
16038A34978d85103H6185a65309L2983l27A0612K84328C7104g7454j61945a01930
16026b13370h7635H3313g8617a6619A54052k1269m3064c06150B63995b95262j8310
16015c13572D5650a2077l49904J14717C40828a36742A81679q1774a32156c7303
16004a95554A35751C8147c0846k68616a03599B8773J15203b32917j1478k46485
15994d90880J07441J00448a16254B19381a83864N4530E8415K23263a65718A32223
15983C0379i1981A01744K83705A49143M29659d16237B34716G1668j8919a87545
15972C51611a2980k06459D0410J87142F5646f8954n7191A28639M3674m3610A8653
$$ plain form
15960 -229744 59534 79511 -56316 -102117 -380105 -139872 168000 159281 -135654 -60320 -166551
15949 -166551 -42662 215795 -165308 67397 -96745 75658 -77954 -24974 -266954 -44134 49451
15937 -405266 -40683 -306695 -89329 199355 -26175 25129 36799 -250943 -56023 -91122 -121921
15926 -121921 44553 66778 932 -79285 -39509 -78884 -91032 -76981 225246 -1159 -41122 309154
15913 -7434 -59974 342928 163418 -331648 -262061 -110989 197235 -97996 20768 -257622 58404
15901 -216865 321948 -114718 -12879 243997 -8924 -186552 55404 153774 175398 -115576 143644
15889 -11770 163911 22871 -152070 51249 -256967 99554 -123951 16659 131726 151140 -127142
15877 -42292 -345368 -54160 -272678 -153459 -15255 -290356 -171416 107744 210506 -9840
$$ packed form
15960b29744E9534J9977e6316m5801k77988a39872A68000q719a35654f0320j06231
15949a66551d2662B15795a65308F7397i6745G5658g7954b4974k41980d4134D9451
15937d05266d0683k66012h9329A99355b6175B5129J1670b50943e6023l5099l0799
15926a21921D4553K2225I32g9285c9509l9375j2148J4051B25246a159l9963C09154
15913g434n2540C42928A63418c31648O9587a10989A97235i7996B0768b57622E8404
15901b16865C21948a14718a2879B43997h924j77628E5404R8370K1624a15576A43644
15889a1770A63911B2871a52070E1249b56967I9554a23951A6659J15067J9414a27142
15877d2292l03076e4160k18518J19219a5255k75101J18940A07744J02762i840
$$ plain form
15866 -61410 -223775 -81618 99970 -74107 304131 -105355 -52888 11701 74957 144839 364328
15855 364328 -115548 115677 37019 255336 182054 172064 -60078 447173 -148777 -107676 -22420
15843 132788 -183130 -348269 -67852 110075 87968 230714 -152310 191933 -41529 -212693
15833 -212693 3751 -27073 126134 -77933 160655 29273 65950 -124318 -156719 326393 -46650
15821 49337 -122987 65372 113447 184074 210807 -6012 92623 -140251 -32632 -117445 260795
15809 102570 -123093 204736 -76578 21577 -138938 -79893 222415 -222633 43037 -243751
15798 57420 -12935 230001 -49005 -139359 -93503 -224404 -235673 49416 -249351 -264151 80206
15786 -738 -103088 -105550 483412 27593 15019 -78083 -5131 -777 -50320 109099 24795 -24370
$$ packed form
15866f1410j62365h1618I9970g4107C04131a05355N2467A1701O3256O9882K19489
15855C64328a15548A15677C7019K18317p3282r990f0078D47173a48777M1101b2420
15843A32788a83130j65139f7852A10075k2107J42746a52310A91933d1529j71164
15833b12693C751b7073A26134g7933A60655B9273L6677a24318l2401C26393d6650
15821D9337a22987F5372M8075P0627K6733f012I2623a40251c2632q4813B60795
15809A02570a23093B04736g6578B1577a38938N9045B22415b22633D3037b43751
15798E7420a2935B30001d9005r0354M5856j30901j1269D9416b49351j4800H0206
15786g38j02350k462D83412B7593j2574g8083e131g77m9543A09099B4795b4370
$$ plain form
15773 188774 90690 48298 74022 31016 -93124 166735 -213980 -106722 75568 -378995 -58134
15761 -74013 372991 -531656 -89577 -182042 408319 -156477 -315684 94132 -84374 -52565 130113
15749 175541 -10256 236644 -6837 64012 10379 106715 -294653 226622 -267359 313203 -178872
15737 -12165 -409001 6861 -306609 27194 -341166 -64026 58051 -179474 -49950 -130921 -75876
15726 -75876 -190960 261691 72424 -26653 -137003 -417075 11091 -127825 -179914 323088
15715 -65899 -93170 -162241 215228 -291310 -73615 -310386 -299965 -86652 -342352 33103 -159682
15703 231832 -88646 -244728 -139897 34810 -146726 43853 -269805 -214438 -162038 -315550
15693 -315550 70486 -68539 -21114 -77214 244426 -329763 -51834 -483962 65726 -149692 -311644
$$ packed form
15773A88774I0690m2392K5724C1016i3124A66735b13980a06722G5568c78995e8134
15761g4013C72991e31656h9577r2465D08319a56477j59207I4132h4374L1809A30113
15749A75541a0256B36644f837F4012A0379R6336b94653B26622b67359C13203a78872
15737a2165l96836F861c06609B7194c41166f4026E8051a79474d9950q0971N5045
15726g5876j15084B61691G2424b6653j10350k80072A1091a27825n2089C23088
15715f5899k7271o9071B15228b91310g3615k36771J0421h6652k55700C3103a59682
15703B31832h8646j56082J04831C4810a46726D3853b69805N5367N2400j53512
15693c15550G0486f8539b1114n6100B44426c29763e1834m32128F5726a49692j61952
$$ plain form
15682 -311644 -175950 694 -316252 -273164 -409105 -258159 -6468 -108659 157890 -73764 -116168
15671 -116168 -21768 -48803 342007 -2479 128484 326294 198303 131658 -150970 18172 6090
15659 -140905 -359441 14374 42807 -162244 167547 -48567 148835 -201141 -154835 -281748
15649 -281748 -197336 -267832 -52756 -38017 -176698 -270848 -387339 121286 -75003 80093 4729
15637 -43728 -27438 131280 63286 -233610 -48779 -94368 -17544 -59054 29003 -108458 54046
15625 -130592 -225265 171953 -122091 73583 -36269 -96359 -221540 -98673 -10591 -113165 -127407
15614 -127407 -30195 190817 1050 -19625 76300 -30331 -385588 -299119 25380 331853 137852
15602 209746 32894 89862 -139111 -179203 1380 -172958 60847 -180091 41598 -166705 -143892
$$ packed form
15682c11644J35694F94c16252M3088j35941J50946f468j02191A57890g3764m2404
15671a16168b1768k7035C42007b479A28484J97810j27991o6645a50970A8172F090
15659a40905k18536A4374K8433a62244A67547d8567A48835b01141M6306j26913
15649b81748Q4412p0496e2756J4739j38681r4150j16491A21286g5003H0093D729
15637d3728J6290A31280F3286b33610d8779m5589a7544m1510B9003a08458E4046
15625a30592r4673A71953a22091G3583c6269o0090j25181i8673a0591j02574j4242
15614a27407c0195A90817A050a9625G6300c0331l55257Q6469B5380L06473A37852
15602B09746C2894N6968a39111m0092A380a72958F0847a80091D1598a66705K2813
$$ plain form
15591 -143892 -170049 123294 -366636 -220767 93652 -151991 -105657 -138047 -62389 3593 -9099
15579 10363 90589 11578 354901 -166676 78773 105238 5277 -171735 374611 317768 -358829
15567 70748 35594 121728 34505 -110051 7761 139790 -77203 64925 -74696 -60622 -77442
15556 -77442 354017 -25069 3728 72383 -101121 59565 -142231 139151 158942 -204152 264977
15544 89903 -208838 -160091 -196981 -388684 248706 -33666 386803 -40502 -82063 -46902 141566
15532 352931 333005 -185045 -25607 -70094 163899 134573 135762 207782 -37217 370160 -130831
15520 -227169 -65704 -226107 85136 115122 122545 -337444 -55213 -292516 61752 228697 -35243
15508 62072 -78807 -153940 -38284 21873 278086 84058 -148992 -187988 -124872 236372 110319
$$ packed form
15591a43892k6157A23294c66636J45869I3652a51991M6334l2390f2389C593i099
15579A0363Q0226A1578L43323a66676G8773K6465E277a71735C74611n6843c58829
15567G0748l5154Q6134C4505a10051G761J32029g7203F4925g4696J4074j6820
15556g7442C54017b5069C728O8655a01121E9565a42231A39151J9791b04152B64977
15544H9903b08838M8747l6890j91703B48706c3666C86803d0502m1561L5161A41566
15532C52931j9926a85045b5607m4487A63899k9326J189P2020c7217C70160a30831
15520b27169f5704j60403H5136K9986P423c37444e5213k37303F1752J66945c5243
15508F2072g8807p5133c8284B1873K56213H4058a48992l8996O3116B36372A10319
$$ plain form
15496 23877 159868 48625 132118 176583 -36962 -177455 16558 -39352 -78456 -94165 -22328
15484 291666 -94671 175254 253945 302665 -171965 -131434 -325143 -227699 108899 115136 -124111
15472 16907 -44972 -381156 -158116 -137141 -12241 277 -140777 81034 -257979 -226776 -43602
15460 -321175 231420 -90797 -73384 77567 247764 -9733 -305356 -6897 -46580 -126707 177995
15448 -129897 281553 -65288 -16411 -154918 427820 150004 -110785 45997 103252 66046
15438 66046 -186402 232861 278940 193250 87977 1181 -266210 56188 -114496 33295 -340759
15426 -160419 -21037 93191 -86503 -232611 90933 -262310 192205 147911 24024 56445 -193943
15414 -83946 -112064 59291 -264150 320578 98008 252855 39304 -71151 25997 -134648 -149916
$$ packed form
15496B3877J35991D8625Q3493M4465c6962j40493A6558c9352l9104j5709b2328
15484B91666i4671A75254P8691M8720a71965M0531j93709R7444A08899O237a24111
15472A6907d4972l36184a58116K0975a2241B77a40777H1034b57979L1203d3602
15460c21175B31420i0797J7413G7567J70197i733k95623f897l9683q0127A77995
15448a29897B81553f5288a6411j38507D27820A50004a10785D5997N7255l7206
15438F6046a86402B32861M6079q5690H7977A181b66210E6188a14496C3295c40759
15426a60419b1037I3191h6503j46108I0933b62310A92205m4294B4024L2421a93943
15414h3946k8118E9291b64150C20578I8008J54847C9304g1151B5997a34648j5268
$$ plain form
15403 -149916 54721 -88723 -225297 -121254 -93977 49207 12489 -129669 185400 158124 15781
15391 -65061 -82176 -276641 -104710 -201902 -32405 96609 -182494 -119852 44043 169734 -145553
15379 -78881 193671 -290145 -139891 85831 -24565 -96902 -273513 -4338 -157410 -39974 -138399
15368 -138399 193007 -29141 360716 68961 -26044 -194718 380596 35139 60251 -224288
15357 -87242 73311 180239 -15447 -77482 203808 177827 -74823 -82997 54316 -133286 25351
15345 61449 242450 -25935 38087 42014 -117211 -6693 -357309 -66303 -498 360553 -18067 -4386
15332 138616 -85256 -29563 -44382 -108164 63253 -116179 -69508 243114 25532 -374587 -43842
15320 -291395 -110216 302366 -175697 10604 -48492 8032 -151926 146137 -209335 -133501
$$ packed form
15403a49916E4721h8723j36574J04043K7277D9207A2489a29669A85400k7276A5781
15391f5061j7115j94465a04710r7192c2405I6609a82494O2642D4043J25691a45553
15379g8881A93671b90145a39891H5831b4565p2337j76611d338j53072c9974r8425
15368a38399A93007b9141C60716F8961b6044j68674C80596C5139K5112b24288
15357h7242G3311J06928a5447o2035B03808k5981g4823q174E4316a33286B5351
15345F1449J81001b5935C8087L927a17211f693l50616f6303d98C60553a8067d386
15332A38616h5256b9563j4819o3782F3253a16179M6671B43114B5532c74587d3842
15320b91395a10216C02366a75697A0604d8492H032a51926A46137b09335P5834
$$ plain form
15310 -133501 -19602 129184 -67944 -140176 34685 -116334 61701 -78079 -163712 36781 176317
15299 176317 -258070 243793 -60633 54378 -35495 -51221 -33335 137389 177621 -244766 122614
15287 -94253 -381417 343649 -92295 119666 -124438 -49047 79678 -200037 181843 28734
15276 69500 23168 125173 -38514 4427 159559 101862 -156917 291344 200479 77039 -57359
15264 112562 -54320 -216353 194273 -215292 -115869 -150234 -239406 80258 176315 -4328 224003
15252 114248 138802 696082 154840 451549 740141 2135608 1493367 1609412 1842838 1081905
15242 1081905 341897 429900 114550 -182228 241677 90143 77448 -257708 227989 63065
15231 -110309 -60729 11647 -49267 207013 -131834 387613 83106 -176629 -190071 178728
$$ packed form
15310a33501a9602A29184f7944p2232C4685a16334F1701g8079q5633C6781J39536
15299A76317b58070B43793f0633E4378c5495j5726J7886A37389M0232b44766A22614
15287i4253k87164C43649i2295A19666a24438d9047G9678b00037A81843B8734
15276F9500B3168J02005c8514D427J55132n7697a56917B91344r0865G7039e7359
15264A12562e4320j62033A94273b15292R9423l4365q9172H0258R6057d328B24003
15252A14248K4554N57280A54840K96709K88592J395467o42241J16045K33426p60933
15242A081905C41897Q8003A14550a82228B41677I0143j2695b57708B27989F3065
15231a10309M9580A1647d9267B07013a31834C87613H3106a76629j3442A78728
$$ plain form
15220 -109204 -302831 -181529 -3934 -53067 87618 141777 190891 150981 75578 22356 94391
15209 94391 -81622 27299 359882 232287 62151 166181 -15172 59490 -54184 -132973 118120
15197 45558 -53691 117841 -110261 32006 340767 66726 75507 321118 -136620 70310 65091
15186 65091 143428 94584 48813 -176597 72183 -45486 195531 111688 1079 -357178 333325
15174 229824 -229261 180042 233181 -230406 79657 -83958 248289 51316 176134 31911
15163 102475 -36437 326509 84033 178706 -83300 -5275 248020 37859 -50782 8372 142694
15152 142694 153288 -60267 264762 215572 -39801 119836 -24844 338104 364408 -214461 -98926
15140 23439 -66700 249528 176292 452337 -56062 156083 253175 78030 20638 6433 503598
$$ packed form
15220a09204j93627J21302c934m9133H7618N4159M9114l9910p5403B2356P2035
15209I4391h1622B7299L32583j27595F2151J04030a5172E9490e4184p8789A18120
15197D5558e3691A17841a10261C2006L08761F6726Q781K45611a36620G0310n219
15186F5091P8337m8844m5771a76597G2183d5486A95531q3843A079c57178C33325
15174B29824b29261A80042N3139b30406G9657h3958B48289E1316J24818C1911
15163A02475c6437C26509H4033R4673h3300e275B48020C7859e0782H372J34322
15152A42694J0594f0267B64762m9190c9801A19836b4844C38104K6304b14461i8926
15140B3439f6700B49528p3236K76045e6062A56083R7092G8030B0638F433M97165
$$ plain form
15129 503598 550 -140280 -11647 174779 71348 158417 312644 313120 521683 473430 86713
15117 213176 500067 311936 279311 93943 -81530 73894 -162496 -151981 134872 36148 363751
15106 363751 73656 181642 12311 16609 -258727 340966 339748 197488 21166 249313 103455
15094 -73628 91703 73588 287276 156324 6976 328001 143282 -114816 500404 -102921
15083 -147515 106837 -13610 58212 258172 -83381 207618 72762 245876 6787 7894 -23513
15071 275205 20434 189288 146850 405560 81360 455338 -29654 128446 166177 95591 291686
15060 291686 299670 321621 297947 -221315 -34745 135614 193171 27755 -9309 320550 95937
15048 188067 76927 359202 -52003 100866 143596 -111163 23352 -183742 161273 142170
$$ packed form
15129E03598E50a40280a1647A74779G1348Q7069J54227M76K08563m8253H6713
15117B13176K86891j88131l2625I3943h1530G3894a62496J0515A34872C6148L27603
15106C63751G3656J07986A2311M298b58727C40966j218j42260B1166K28147A03455
15094g3628I1703j8115K13688j30952F976L21025A43282a14816E00404a02921
15083a47515A06837a3610E8212J99960h3381B07618G2762J73114F787J107b3513
15071B75205B0434J68854m2438K58710H1360L73978b9654A28446L7731p0586J96095
15060B91686P984K1951k3674b21315c4745A35614N7557B7755i309C20550I5937
15048A88067G6927K82275e2003A00866M2730a11163B3352a83742A61273j9103
$$ plain form
15038 142170 342095 -20081 196636 80305 341566 274091 280078 259281 232351 267860 168571
15027 168571 -112542 33919 431142 -83351 316781 285965 217798 83838 408373 167340
15016 51483 475201 122052 107317 332956 148949 157712 96775 186304 72100 200953 49677
15004 111075 294454 254235 138459 636565 -11499 65157 316137 247505 261335 -39529 -21878
14993 -21878 267778 80144 450059 408494 -215763 5285 261187 145767 262903 324510 177660
14982 177660 386479 404421 443674 543468 242507 59177 588145 134046 324047 56169
14971 197853 -50413 65101 153429 434568 296701 520698 282790 387263 250215 405577
14961 405577 -175745 593670 43557 333969 309258 259766 -23981 309580 221987 594146
$$ packed form
15038A42170J99925b0081A96636H0305K61261o7475N987k0797k6930L5509r9289
15027A68571a12542C3919L97223h3351C16781l0816o8167H3838L24535A67340
15016E1483M23718A22052j4735K25639A48949Q763o0937Q9529G2100J28853D9677
15004A11075J83379m0219j15776M98106a1499F5157K50980o8632J3830c9529J7651
14993b1878B67778H0144L69915m1565b15763E285K55902j15420J17136O1607j46850
14982A77660K08819J7942L9253R9794B42507E9177N28968A34046J90001E6169
14971A97853e0413F5101Q8328K81139j37867K23997k37908J04473j37048J55362
14961D05577a75745E93670D3557K90412k4711m9492b3981C09580q7593L72159
$$ plain form
14951 594146 56451 154296 393342 572171 168771 148280 105914 179874 124445 -9287 400165
14939 403389 81490 68384 129697 188148 57059 288139 209431 144329 10590 585786 260094
14927 398230 350319 439080 363530 217353 371513 399462 119418 109617 337176 322236 263043
14916 263043 355844 578183 576499 -34258 575434 362658 94013 303382 434122 249285
14906 249285 228358 388735 106621 500326 544953 482170 341579 193835 345163 127027
14895 99170 169225 163133 95253 626777 433692 409588 322531 660284 497618 177923 327795
14884 327795 282225 523362 466169 316892 480480 268326 353442 148162 420970 45969
14873 160555 535765 293332 227992 494556 240016 350870 271103 337011 226233 240845
$$ packed form
14951E94146E6451R7845K39046J78829A68771k0491m2366P3960n5429i287D00165
14939D03389H1490j3106O1313N8451E7059K31080p8708o5102A0590N75196B60094
14927C98230m7911Q8761p5550j46177J54160K7949A19418r801K27559j4940n9193
14916B63043R2801K22339j684c4258E75434k12776I4013K09369J30740j84837
14906B49285k0927J60377A06621L93705M4627o2783j40591j47744J51328A27027
14895I9170P0055o092o7880N31524j93085k4104q7057L37753j62666A77923J49872
14884C27795m5570K41137n7193j49277J63588k12154Q5116A48162K72808D5969
14873A60555L75210k42433o5340K66564B40016J10854p9767O5908j10778J4612
$$ plain form
14863 240845 527102 192306 483117 120427 661406 648471 544549 169325 214601 317989
14853 317989 566316 -1138 454682 367112 251255 526015 493675 795159 552330 133423
14842 406597 374939 575274 133576 589161 116679 505140 541239 661195 540603 169099
14831 361696 322269 438696 588550 751747 429198 513722 482896 435349 650540 564173
14821 564173 148021 607381 404294 638775 247067 583614 340914 580973 484744 511542
14811 511542 556909 486694 382116 261055 344364 737810 498619 575230 506734 554674 477819
14800 477819 682498 421358 898768 709069 592212 552777 620121 73209 430886 230378
14790 230378 435416 477848 718601 504223 768163 266603 565865 435243 905646 170437
$$ packed form
14863B40845K86257A92306K90811A20427N40979j2935j03922A69325M5276J03388
14853C17989K48327a138D54682q7570j15857K74760l2340L01484k42829A33423
14842D06597l1658K00335A33576M55585A16679L88461L6099J19956j20592A69099
14831C61696l9427J16427J49854J63197l22549Q4524l0826m7547K15191q6367
14821E64173A48021M59360k03087K34481B47067L36547k42700K40059r6229K6798
14811E11542M5367p0215j04578j21061Q3309L93446k39191P6611o8496M7940p6855
14800D77819K04679k61140M77410j89699j16857l9435O7344G3209L57677k00508
14790B30378K05038M2432K40753k14378K63940B66603K99262j30622M70403A70437
$$ plain form
14779 263595 640408 770463 902842 414716 734675 831871 361336 454951 486392 391138
14769 391138 628179 729089 667363 659755 1076744 498223 426471 579574 877833 258977
14758 535745 547506 1097781 652370 609485 549837 751094 768429 576680 986327 915291
14748 915291 722788 830532 558179 1078675 895599 999653 470636 963598 616058 876416
14738 876416 503279 871371 981803 770228 693513 691537 696900 725761 889855 630418 1047816
14727 1047816 746008 526888 627769 984263 633318 720091 894088 821978 1070385 789367
14717 789367 788344 906065 742973 718670 427327 728523 862845 906463 916970 832539 785635
14706 785635 1134009 620315 582863 1209206 892544 951354 598726 1033568 866239 676495
$$ packed form
14779B63595L76813J30055J32379D14716L19959R7196C61336R3615L1441r5254
14769C91138K37041J00910o1726p608M16989D98223p1752J53103K98259B58977
14758E35745J1761N50275m45411m2885n9648K01257J7335j91749M09647p1036
14748I15291j92503J07744k72353N20496j83076J04054D70636M92962l47540K60358
14738H76416l73137L68092J10432k11575p6715j976N363K8861J64094k59437M17398
14727A047816l01808k19120J00881L56494l50945Q6773J73997p2110K48407k81018
14717G89367j023J17721j63092k4303k91343L01196J34322M3618J0507q4431m6904
14706G85635L48374n13694l7452O26343l16662N8810l52628M34842j67329j89744
$$ plain form
14696 676495 1060827 993039 787452 1050502 1361410 1160764 1030925 757189 859131 1020125
14686 1020125 900750 1003363 838008 1043074 969925 1043909 801760 889164 959721 921419
14676 921419 1044195 1218623 1124842 858286 1262716 1247605 882487 1172094 1070426 1200809
14666 1200809 941907 1397636 987959 1230774 1474051 1026319 884426 1683426 1176493
14657 1176493 1046519 1221838 1074831 1114621 1440473 1254959 1003120 1286893 1205000 1253627
14647 1253627 1140602 1092296 1333539 1318784 1195534 1279068 1462915 1434063 1420144 977726
14637 977726 1024298 1185630 1459721 1412478 1403547 1137571 1081271 1494979 1263329 1306913 1600216
14626 1600216 1393472 1658558 1553016 1387482 1336637 1281843 1245304 1768297 1347718 1520113
$$ packed form
14696F76495L84332o7788k05587K63050L10908k00646j29839k73736J01942J60994
14686A020125j19375J02613j65355K05066p3149P3984k42149Q7404P0557l8302
14676I21419J22776J74428r3781k66556M04430j5111l65118K89607j01668J30383
14666A200809k58902M55729m09677K42815K43277m47732j41893P99000n06933
14657A176493j29974J75319j47007L9790L25852j85514k51839K83773q1893M8627
14647A253627j13025m8306K41243j4755j23250Q3534J83847k8852j3919m42418
14637I77726M6572J61332K74091m7243q931k65976n6300M13708k31650M3584K93303
14626A600216k06744K65086j05542j65534n0845n4794l6539N22993m20579J72395
$$ plain form
14616 1520113 1469376 1273674 1497974 1902434 1565399 1235144 1771488 1390220 1597112 1375594
14606 1375594 1358678 1934166 1639050 1683160 1831417 1448478 1642492 1507602 1772095 1708329
14596 1708329 1800427 1770856 1696261 1884107 2007602 1532621 1643815 1763863 1830781 1884917
14586 1884917 2166135 1944048 2179785 2055954 2291889 2089739 2295051 1946357 1986440 2151891
14576 2151891 2356064 1942122 2052889 2311581 2446987 2097816 2441070 2549931 2473093 2558867
14566 2558867 2219670 2406223 2466671 2735198 2678187 2772242 2645137 3032551 3199695 3109965
14556 3109965 3306224 3576444 4011922 4394501 4593796 5548023 6481662 8925599 13289802
14547 13289802 21473921 33982541 39003617 26249798 15066419 8169002 4406476 3322873
$$ packed form
14616A520113n0737j95702K24300M04460l37035l30255N36344l81268K06892k21518
14606A375594j6916N75488k95116M4110J48257l82939J94014j34890K64493o3766
14596A708329R2098k9571p4595J87846J23495m74981J11194J20048O6918N4136
14586A884917K81218k22087K35737j23831K35935k02150K05312l48694M0083J65451
14576B151891K04173m13942J10767K58692J35406l49171L43254J08861p6838Q5774
14566B558867l39197J86553O0448K68527n7011R4055j27105L87414J67144q9730
14556C109965J96259K70220M35478L82579J99295R54227R33639K443937M364203
14547A3289802Q184119J2508620N021076j2753819j1183379o897417l762526j083603
$$ plain form
14539 3322873 2987227 2442147 2565479 2028209 2191321 2424753 2119912 2627780 2219697
14530 2219697 1841943 2278196 2441253 2500570 2400892 2036528 2616852 2656340 2802664 2896157
14520 2896157 2659686 2580678 2496061 2679315 2577576 2868828 2382053 2804306 2846087 3196176
14510 3196176 2936247 2812528 3004093 2784241 3127197 3221067 3162465 3323871 3074405 3308473
14500 3308473 3449345 3192026 3503062 3445559 3585637 3191075 3635461 3317535 3563459 3606281
14490 3606281 3550977 3863398 4016741 3808492 3842880 4064439 4049148 3769171 4047117 4240773
14480 4240773 4227034 4022217 4256305 4310237 4194749 4215896 4079189 4215855 4135856 4507801
14470 4507801 4562612 4483975 4803071 4584228 4682639 4689824 4986936 4894852 4680237 5107232
$$ packed form
14539C322873l35646n45080J23332n37270J63112K33432l04841N07868m08083
14530B219697l77754M36253J63057N9317r9678l64364N80324L9488J46324R3493
14520B896157k36471p9008q4617J83254j01739K91252m86775M22253M1781L50089
14510C196176k59929j23719J91565k19852L42956R3870n8602J61406k49466K34068
14500C308473J40872k57319L11036n7503J40078l94562M44386l17926K45924M2822
14490C606281n5304L12421J53343k08249L4388K21559j5291k79977K77946J93656
14480D240773j3739k04817K34088N3932j15488K1147j36707J36666p9999L71945
14470D507801N4811p8637L19096k18843R8411P185K97112r2084k14615M26995
$$ plain form
14460 5107232 5212282 5270036 5060933 5167108 5510775 5388610 5568744 5321440 5739589 5784140
14450 5784140 5520129 5869992 5905961 5931573 6174181 5870379 6550692 6139997 6147940 6467704
14440 6467704 6475046 6623949 6823453 6436368 6891834 6615212 7102496 7107080 7161736 7294860
14430 7294860 7148801 7204145 7755359 7758252 7619313 7805967 8002481 7852184 8092780 8085688
14420 8085688 8442397 8792992 8737379 8925838 8980598 9196147 9629160 9602677 9585900 9469825
14410 9469825 9954646 9989024 9941516 10213586 10529606 10622945 10775519 10892843 11084442 11228371
14400 11228371 11603010 11574141 11887405 11856419 11936765 12494292 12582948 13166202 12970219 13293539
14390 13293539 13030348 13562828 13859278 14678418 14642144 14484419 14808282 14977018 15329400
$$ packed form
14460E107232J05050N7754k09103J06175L43667j22165J80134k47304M18149M4551
14450E784140k64011L49863L5969K5612K42608l03802O80313m10695P943L19764
14440F467704P342J48903J99504l87085M55466k76622M87284M584N4656J33124
14430G294860j46059N5344N51214K893j38939J86654J96514j50297K40596p092
14420H085688L56709L50595n5613J88459N4760K15549M33013k6483j6777j16075
14410I469825M84821L4378m7508K72070L16020R3339J52574J17324J91599J43929
14400A1228371L74639k8869L13264l0986Q0346N57527Q8656N83254j95983L23320
14390A3293539k63191N32480K96450Q19140l6274j57725L23863J68736L52382
$$ plain form
14381 15329400 15434270 16289559 16712896 16721073 16936208 17354515 17571803 17905654 18217369 18529819
14371 18529819 19019533 19416186 19481333 19839776 20544658 21086112 21700101 21895691 22358569
14362 22358569 22713848 23330031 24055843 24631958 24714922 25494073 25804307 26601481 27371105
14353 27371105 28007006 28718555 29173832 30192151 31202834 31506448 32134666 33374369 33883102
14344 33883102 35035752 35750312 36915061 37745094 38718135 40442908 41052876 42397611 43461047
14335 43461047 44558335 45940968 47235759 49159039 50196065 52163123 53032233 55152159
14327 55152159 56920436 58643342 60662500 62975758 64937978 67200736 69721836 71688187
14319 71688187 74540549 77070884 80419626 83200630 86230392 89513529 92964758 97006578
$$ packed form
14381A5329400J04870Q55289M23337Q177K15135M18307K17288L33851L11715L12450
14371A8529819M89714L96653O5147L58443P04882N41454O13989J95590M62878
14362B2358569L55279O16183P25812N76115Q2964P79151L10234P97174P69624
14353B7371105O35901P11549M55277J018319J010683L03614O28218J239703N08733
14344C3883102J152650P14560J164749Q30033R73041J724773O09968J344735J063436
14335D3461047J097288J382633J294791J923280J037026J967058Q69110K119926
14327E5152159J768277J722906K019158K313258J962220K262758K521100J966351
14319G1688187K852362K530335L348742K781004L029762L283137L451229M041820
$$ plain form
14311 97006578 100703208 104687385 109190352 113717573 118605911 123444200 129175778 134929084
14303 134929084 140661818 146961425 153982050 161488208 168909488 177121736 185742152 194687464
14295 194687464 204346773 214305396 224815596 235779741 247549009 259719390 272258121
14288 272258121 285515574 298958388 313307630 327485344 342141852 357080090 371901864
14281 371901864 386309439 401054262 414804043 427646949 439781657 450531781 459325733
14274 459325733 465962607 469593906 469678091 468228419 466473155 464509522 460860307 456797067
14266 456797067 449322972 439902714 428626648 416394141 403036233 388851728 374657811
14259 374657811 359481227 344330878 329185627 314052168 299354764 285913421 272774501
$$ packed form
14311I7006578L696630L984177M502967M527221M888338M838289N731578N753306
14303A34929084N732734O299607P020625P506158P421280Q212248Q620416Q945312
14295A94687464R659309R958623J0510200J0964145J1769268J2170381J2538731
14288B72258121J3257453J3442814J4349242J4177714J4656508J4938238J4821774
14281C71901864J4407575J4744823J3749781J2842906J2134708J0750124Q793952
14274D59325733O636874L631299Q4185j449672j755264j963633l649215m063240
14266D56797067p474095r420258j1276066j2232507j3357908j4184505j4193917
14259C74657811j5176584j5150349j5145251j5133459j4697404j3441343j3138920
$$ plain form
14252 272774501 259904529 247366447 235262122 224109044 213318842 202908489 193591645
14245 193591645 184806111 176163063 168295368 159829754 153283934 146556319 139694452 133995852
14237 133995852 128599876 123013746 118027367 113260614 108163920 103845431 100317696 96416909
14229 96416909 92507547 88983120 85886381 82778936 79359560 76621169 74137303 71122633
14221 71122633 69002120 66645392 64621289 62620406 60359483 58571778 56520349 54899883
14213 54899883 53432373 52037739 50086856 48609072 47270362 46306605 45025133 44209243
14205 44209243 42629127 41522817 40164723 39225134 38425953 37720280 36343744 35308738
14197 35308738 34444880 33464775 32717907 31896481 31076201 30584056 29736324 28647061 28323822
$$ packed form
14252B72774501j2869972j2538082j2104325j1153078j0790202j0410353r316844
14245A93591645q785534q643048p867695q465614o545820o727615o861867n698600
14237A33995852n395976n586130m986379m766753n096694m318489l527735l900787
14229I6416909l909362l524427l096739l107445l419376k738391k483866l014670
14221G1122633k120513k356728k024103k000883k260923j787705k051429j620466
14213E4899883j467510j394634j950883j477784j338710r63757j281472q15890
14205D4209243j580116j106310j358094r39589p99181p05673j376536j035006
14197C5308738q63858r80105p46868q21426q20280m92145q47732j089263l23239
$$ plain form
14188 28323822 27903293 26899389 26174981 25828773 25201348 24852221 24192948 23594564 23177027
14179 23177027 22509761 22311674 21715112 21139684 20982680 20435913 19911376 19444443 19398240
14170 19398240 19005792 18568589 17934915 17901762 17486247 17054524 16957736 16823689 16342524 15562585
14160 15562585 15870805 15706256 15141033 14964645 14839905 14319972 14070524 13263912 13503328
14151 13503328 13546318 13002969 12814645 13142925 12765316 12260286 12316358 12001751 11928994 11651009
14141 11651009 11534259 11222817 11457438 11082454 10860684 10687093 10480063 10267455 10017968
14132 10017968 10239072 9976335 9754924 9525539 9935794 9496030 9394334 9187242 9199089
14123 9199089 9174169 8728581 8898852 8484340 8681272 8192202 7918189 7749587 7766129 7847745
$$ packed form
14188B8323822m20529j003904p24408l46208o27425l49127o59273n98384m17537
14179B3177027o67266j98087n96562n75428j57004n46767n24537m66933m6203
14170A9398240l92448m37203o33674l3153m15515m31723r6788j34047m81165p79939
14160A5562585L08220j64549n65223j76388j24740n19933k49448q06612K39416
14151A3503328M2990n43349j88324L28280l77609n05030N6072l14607p2757k77985
14141A1651009j16750l11442K34621l74984k21770j73591k07030k12608k49487
14132A0017968K21104k62737k21411k29385M10255m39764j01696k07092J1847
14123I199089k4920m45588J70271m14512J96932m89070k74013j68602J6542Q1616
$$ plain form
14113 7847745 7805878 7784492 7716489 7638214 7675199 7458833 7471010 7144035 7013422 6956796 6946850
14102 6946850 6923260 6891364 6599684 6416294 6552670 6209292 6710693 6381855 6426191 6191614
14092 6191614 6328747 6085045 5840012 5855549 6132946 5659098 5634834 5656960 5374900 5209899
14082 5209899 5683212 5313382 5128685 5312196 5110615 5331386 5291391 4893786 4749751 4817608
14072 4817608 4716988 4932505 4752762 4682559 4885364 4686058 4798045 4596211 4422118 4412947
14062 4412947 4224024 4652378 4325392 4514921 4612554 4515099 4108282 4069806 4246839 3870259
14052 3870259 3902141 4253639 4064885 3639739 3883795 3702617 3859368 3817066 3754396 3830852
14042 3830852 3704015 3749920 3375766 3493796 3552527 3599548 3558427 3557283 3601183 3292851 3187231
$$ packed form
14113G847745m1867k1386o8003p8275L6985k16366J2177l26975j30613n6626r946
14102F946850k3590l1896k91680j83390J36376l43378N01401l28838M4336k34577
14092F191614J37133k43702k45033J5537K77397m73848k4264K2126k82060j65001
14082E209899M73313l69830j84697J83511k01581K20771l9995l97605j44035O7857
14072D817608j00620K15517j79743p0203K02805j99306J11987k01834j74093r171
14062D412947j88923M28354l26986J89529R7633r7455m06817l8476J77033l76580
14052C870259L1882L51498j88754m25146K44056j81178J56751m2302o2670P6456
14042C830852j26837M5905l74154J18030N8731M7021m1121j144M3900l08332j05620
$$ plain form
14031 3187231 3435660 3409523 3457520 3442660 3330155 3113056 3370156 2904553 3300527 2867235
14021 2867235 3211309 2982021 2657882 2978198 2693846 2618646 2809215 2811699 2658047 2713517
14011 2713517 3038039 2985185 2352187 2558037 2779552 2675506 2618175 2641626 2613125 2519943
14001 2519943 2380418 2519736 2294114 2318451 2481216 2282441 2362538 2279417 2334771 2606799
13991 2606799 3164208 3570257 4972669 8471803 15287847 28576620 38625947 29636974
13983 29636974 16539019 10340255 7206511 5835357 4998364 4618215 4143454 3488468
13975 3488468 3501248 3109477 3582283 2948787 2937554 3042154 2858266 2616209 2689870 2883165
13965 2883165 2834987 2352416 2295620 2530318 2613386 2408135 2265443 2528980 2312027 2093720
$$ packed form
14031C187231K48429k6137M7997j4860j12505k17099K57100m65603L95974m33292
14021B867235L44074k29288l24139L20316k84352p5200J90569K484j53652N5470
14011B713517L24522n2854o32998K05850K21515j04046n7331K3451k8501r3182
14001B519943j39525J39318k25622K4337J62765j98775Q0097q3121N5354K72028
13991B606799N57409M06049J402412L499134O816044J3288773J0049327q988973
13983B9636974j3097955o198764l133744j371154q36993l80149m74761o54986
13975C488468J2780l91771M72806o33496j1233J04600j83888k42057P3661J93295
13965B883165m8178m82571n6796K34698Q3068k05251j42692K63537k16953k18307
$$ plain form
13955 2093720 2672470 2266750 2406519 2183613 2340439 2199254 2197976 2136180 2413324 2183944
13945 2183944 2366535 1980774 1882660 2185288 1936042 1719839 2016222 1945382 1827269 2158273
13935 2158273 2003611 2130322 1783200 1792044 1896258 1842688 1962373 1894797 1755368 1764416
13925 1764416 1715690 1718009 1659567 2130910 1882646 1515331 1503970 1636076 1670855 1803754
13915 1803754 1825403 1654307 1835003 1863182 1674927 1820151 1435006 1644731 1536265 1770532
13905 1770532 1557912 1797277 1751667 1453747 1525110 1096288 1553251 1293214 1341325 1569390
13895 1569390 1318127 1497168 1559532 1378890 1514219 1557857 1763050 1683624 1145280 1631825
13885 1631825 1352902 1274373 1401995 1370602 1097099 1524972 1489256 1246458 1411184 1010423
$$ packed form
13955B093720N78750m05720J39769k22906J56826j41185j278o1796K77144k29380
13945B183944J82591l85761r8114L02628k49246k16203K96383p0840j18113L31004
13935B158273j54662J26711l47122Q844J04214n3570J19685o7576j39429R048
13925A764416m8726K319n8442M71343k48264l67315j1361J32106L4779J32899
13915A803754K1649j71096J80696K8179j88255J45224l85145K09725j08466K34267
13905A770532k12620K39365m5610k97920P1363m28822M56963k60037M8111K28065
13895A569390k51263J79041O2364j80642J35329M3638K05193p9426n38344M86545
13885A631825k78923p8529J27622l1393k73503M27873l5716k42798J64726m00761
$$ plain form
13875 1010423 1201063 1601657 1414889 1235962 1048662 1276678 1395281 976770 1187601
13866 1187601 1323597 1282418 1226293 1087648 1105648 1250340 1141858 1096282 1008048 1268513
13856 1268513 1138324 1290347 1149678 1297897 1295673 561316 1377757 1323087 1415804 915507
13846 915507 1286849 1476633 1165992 948549 1311501 798522 709275 998671 1071895 1006141
13836 1006141 1373081 1104850 784432 852628 1175008 1279278 826358 1115390 1004806 1001373
13826 1001373 1179088 810760 850598 1004859 929560 1134792 1073357 1018531 977069 809436
13816 809436 1051382 1367908 837908 1184301 885189 666622 1201130 994181 831835 912187
13806 912187 1049886 692589 910932 785675 1143672 904376 587439 1132952 1031642 861297
$$ packed form
13875A010423J90640M00594j86768j78927j87300K28016J18603m18511K10831
13866A187601J35996m1179n6125j38645J8000J44692j08482m5576q8234K60465
13856A268513j30189J52023j40669J48219k224E61316Q16441n4670R2717n00297
13846I15507L71342J89784l10641k17443L62952n12979q9247K89396P3224o5754
13836A006141L66940k68231l20418O8196L22380J04270m52920K89032j10584l433
13826A001373J77715l68328L9838J54261p5299K05232o1435n4826m1462j67633
13816H09436K41946L16526n30000L46393k99112k18567N34508k06949j62346Q0352
13806I12187J37699l57297K18343j25257L57997k39296l16937N45513j01310j70345
$$ plain form
13796 861297 962605 710824 992908 1300251 1073367 1064410 1160754 667109 950401 690442
13786 690442 842400 838984 765865 926091 888210 917589 979056 1020958 787446 1099051 847958
13775 847958 832770 596523 879923 1096150 736418 649369 702565 816407 568437 799904
13765 799904 1018272 635396 783547 499559 926824 963554 553824 680543 661708 1047917
13755 1047917 621475 731430 460538 494772 887821 816578 535893 926095 690088 525958
13745 525958 1065990 621818 565392 816581 488212 493757 845215 760106 869023 645418
13735 645418 971314 598322 694931 614063 839572 806134 819097 698569 365580 635589
13725 635589 421300 674404 1027164 1018392 749195 645142 469617 770929 937181 647055
$$ packed form
13796H61297J01308k51781K82084L07343k26884q957R6344m93645K83292k59959
13786F90442J51958l416p3119J60226l7881K9379O1467M1902k33512L11605k51093
13775H47958j5188k36247K83400K16227l59732q7049N3196J13842k47970K31467
13765G99904K18368l82876J48151k83988M27265L6730m09730J26719j8835L86209
13755A047917m26442J09955k70892L4234L93049p1243k80685L90202k36007j64130
13745E25958N40032m44172n6426K51189l28369N545L51458q5109J08917k23605
13735F45418L25896l72992R6609q0868K25509l3438J2963j20528l32989K70009
13725F35589k14289K53104L52760q772k69197j04053j75525L01312J66252k90126
$$ plain form
13715 647055 495200 513785 890665 579442 631086 514996 468118 575352 797738 352780
13704 880872 720937 484824 721191 624485 659121 911861 833709 407018 758282 537484
13694 537484 450589 546164 752511 547425 463211 836752 393547 467008 708652 581236
13684 581236 711464 285580 679283 592883 353236 657454 457146 441916 457573 350927
13674 350927 575452 509626 991976 793369 701018 688589 600011 788251 470195 436527
13664 436527 759092 775018 367109 113824 687180 603887 378197 569225 493726 630748
13654 630748 406353 532794 459256 675603 532280 328835 365070 399739 642656 533169
13644 533169 713058 547420 384843 345163 412542 38141 535214 493316 384780 573084
$$ packed form
13715F47055j51855J8585L76880l11223N1644j16090m6878J07234K22386C52780
13704H80872j59935k36113K36367r6706L4636K52740p8152D07018L51264k20798
13694E37484q6895R5575K06347k05086q4214L73541C93547P3461K41644j27416
13684E81236J30228B85580L93703q6400k39647L04218k00308j5230J5657j06646
13674C50927K24525o5826M82350j98607r2351j2429q8578J88240l18056l3668
13664D36527L22565J5926C67109A13824N73356q3293k25690J91028p5499J37022
13654F30748k24395J26441p3538K16347j43323k03445L6235L4669K42917j09487
13644E33169J79889j65638j62577l9680O7379C8141M97073m1898j08536J88304
$$ plain form
13634 573084 898776 227681 514894 516251 460930 628186 507372 872267 85209 824008
13624 824008 529867 302217 220390 317911 497204 427896 275014 632513 255045 622679
13614 622679 410126 274737 341631 432949 348194 153483 936647 356978 517540 333063
13604 333063 216502 568898 298252 641014 342179 490634 369214 644956 400958 642796
13594 642796 184200 326612 121010 793938 493003 109418 159511 633201 461090 413948
13584 413948 545698 462047 471605 397699 685053 380678 410861 559244 335903 346922 113202
13572 406924 588345 132635 51966 408270 238365 253937 373469 668442 340247 421423
13562 421423 395471 450661 592799 420964 575892 731905 422047 600909 191402 584582
$$ packed form
13634E73084L25692B27681K87213J357n5321J67256j20814L64895H5209P38799
13624H24008k94141k27650q1827R7521J79293o9308j52882L57499B55045L67634
13614F22679k12553j35389O6894R1318q4755A53483P83164C56978J60562j84477
13604C33063j16561L52396k70646L42762k98835J48455j21420K75742k43998K41838
13594F42796A84200J42412A21010O72928l00935A09418N0093M73690j72111m7142
13584D13948J31750q3651R558p3906K87354l04375L0183J48383k23341J1019A13202
13572D06924J81421A32635E1966L56304j69905J5572J19532K94973l28195Q1176
13562D21423k5952N5190J42138j71835J54928J56013l09858J78862A91402L93180
$$ plain form
13552 584582 361122 688140 485879 354803 243559 608533 -99474 571876 208091 154458
13542 154458 528891 295079 614375 511518 52053 161582 80849 527607 432447 205349
13531 456506 110673 338516 539954 385565 227522 418044 465022 216223 584310 156827
13520 596378 487254 497951 731460 266191 289535 316362 660842 514474 579337 211629
13509 181303 362726 163543 185907 131330 222526 473437 478333 452111 270899 225042 237955
13498 237955 202748 307286 340064 420502 336737 560236 59111 482764 301556 309025 168273
13487 168273 449822 460147 423249 -110756 -236691 320493 496010 110913 353565 257657
13477 257657 443198 493641 695221 458316 3339 84114 314135 160348 62451 532342
$$ packed form
13552E84582k23460L27018k02261j31076j11244L64974i9474E71876B08091n3633
13542A54458L74433k33812L19296j02857E2053J09529q0733M46758r5160B05349
13531D56506A10673K27843K01438j54389j58043J90522M6978B16223L68087A56827
13520E96378j09124J0697K33509B66191K3344K6827L44480j46368O4863B11629
13509A81303J81423A63543K2364n4577R1196K50911M896k6222j81212m5857J2913
13498B37955l5207J04538L2778Q0438q3765K23499E9111M23653j81208P469j40752
13487A68273K81549J0325l6898a10756j25935C20493J75517A10913K42652r5908
13477B57657J85541N0443K01580k36905C339Q0775K30021j53787F2451M69891
$$ plain form
13467 532342 147839 345987 393975 -3206 132350 269126 320203 -159486 323844 327571 -62684
13455 154678 201441 313411 338021 4657 123853 362673 84934 216652 233832 177465 363767
13444 363767 235583 155750 300559 224819 217206 67381 -14893 150214 341849 -51978 362804
13432 444434 231845 104485 102247 481787 215800 220534 220181 72138 413700 194769 273777
13421 273777 337794 144590 344648 375106 132376 202659 249906 175907 44580 300448 412721
13410 412721 204385 451685 -130658 35734 364301 252593 -61386 209593 13182 163712
13400 163712 108067 126390 91135 99420 367341 197360 383564 283227 142065 405454
13390 405454 -18918 379304 138041 -126831 339011 162645 385146 517199 336378 288742
$$ packed form
13467E32342A47839J98148M7988c206A32350J36776N1077a59486C23844L727f2684
13455A54678M6763J11970K4610D657J19196K38820H4934J31718J7180n6367J86302
13444C63767j28184p9833J44809p5740p613F7381a4893A50214J91635e1978C62804
13432D44434k12589A04485k238L79540B15800M734l53G2138L41562A94769P9008
13421B73777O4017A44590K00058L0458A32376P0283M7247p3999D4580K55868J12273
13410D12721B04385K47300a30658C5734L28567j11708f1386B09593A3182J50530
13400A63712n5645J8323l5255Q285K67921j69981J86204j00337j41162K63389
13390D05454a8918C79304A38041a26831C39011A62645K22501J32053j80821m7636
$$ plain form
13380 288742 268334 291136 411571 159756 470115 -33682 314157 221282 201575 257974 259041
13369 259041 570787 43565 56810 328175 254655 326631 60106 662946 -27778 242344 469147
13358 469147 203056 249150 348139 261152 -47838 62951 369953 299948 223353 276110 414438
13347 414438 532216 486524 319812 293825 79348 410817 121691 228005 174723 325057
13337 325057 96300 552444 214338 131936 -59543 311911 272717 385883 265291 633579
13327 633579 82655 54269 234219 149031 345425 -4959 286513 372088 196319 425511 144811
13315 277234 313345 -70536 122298 292225 205685 674535 -148950 -176141 -29065 396243
13304 160622 -160071 54768 282552 168842 213361 142534 57432 168773 183218 165043 134935
$$ packed form
13380B88742k0408K2802J20435A59756L10359c3682C14157r2875j9707N6399J067
13369B59041L11746D3565J3245K71365p3520P1976F0106O02840b7778B42344K26803
13358D69147B03056M6094R8989q6987d7838F2951L07002p0005p6595N2757J38328
13347D14438J17778m5692j66712k5987G9348L31469A21691J06314n3282J50334
13337C25057I6300M56144B14338q2402e9543C11911l9194J13166j20592L68288
13327F33579H2655k8386J79950q5188J96394d959B86513Q5575j75769K29192A44811
13315B77234L6111g0536A22298J69927q6540M68850a48950k7191b9065C96243
13304A60622a60071E4768K27784j13710M4519p0827E7432J11341J4445j8175l0108
$$ plain form
13293 134935 75217 23320 174042 297499 264803 -220627 -16312 819 -31432 32205 -33217
13281 203349 374990 -50480 -108864 -100770 115661 58218 72034 329435 18307 269872 185245
13270 185245 129278 180149 569290 307623 22341 -152114 326524 320677 51867 523105 226901
13258 269601 53506 288913 106531 141629 -72017 141193 118857 27614 345956 20427 395921
13247 395921 347889 275995 280075 172992 262492 70208 20332 -193050 210078 160758 282934
13236 282934 -373294 408435 276444 372648 169506 -14945 177054 256577 30860 38600 398759
13225 398759 242755 280226 65039 382220 16851 -151573 144507 -156344 39625 160694
13215 160694 61339 391333 -115326 96757 184370 157637 -42431 110688 247025 -53378 290271
$$ packed form
13293A34935n9718B3320J50722J23457l2696b20627a6312H19c1432C2205c3217
13281B03349J71641e0480n8384Q094A15661n7443J3816K57401A8307K51565q4627
13270A85245n5967N0871L89141k61667B2341a52114C26524n847E1867M71238B26901
13258B69601E3506K35407A06531L5098g2017A41193k2336B7614L18342B0427L75494
13247C95921m8032p1894M080j07083Q9500G0208B0332a93050B10078m9320J22176
13236B82934c73294D08435j31991R6204A69506a4945A77054P9523C0860P740L60159
13225C98759j56004L7471F5039L17181A6851a51573A44507a56344C9625J21069
13215A60694F1339L29994a15326I6757Q7613k6733d2431A10688J36337e3378B90271
$$ plain form
13203 65956 -57968 1895 177993 -45068 543 263312 -36668 169194 256156 376301 70054
13191 17028 -113737 -93923 -215365 276226 259735 14149 283661 231308 23719 244655 41423
13179 -91090 128409 6102 95844 -284876 202970 31674 388561 443947 100315 174463 82571
13167 206210 45127 324222 193354 -33754 61231 -8883 100350 204189 24597 210257 -110182
13155 -148228 89843 85241 176147 -109143 197412 -68721 183962 41072 291355 195920 54924
13143 185694 97535 230061 69597 -139410 66705 410783 107756 192289 318797 93407
13132 67255 -14701 264399 -27292 217855 -125589 188290 -68127 -25409 250623 140254
13122 140254 270895 197739 21882 343394 37461 236082 139913 152486 164763 88050 -124159
$$ packed form
13203F5956e7968A895J76098d5068E43K62769c6668A69194Q6962J20145G0054
13191A7028a13737J9814j21442B76226j6491A4149K69512n2353B3719K20936D1423
13179i1090A28409F102Q9742b84876B02970C1674L56887N5386A00315P4148H2571
13167B06210D5127K79095j30868c3754F1231h883A00350J03839B4597J85660a10182
13155a48228H9843m602R0906a09143A97412f8721A83962D1072K50283r5435E4924
13143A85694q8159J32526F9597a39410F6705L44078A07756Q4533J26508I3407
13132F7255a4701B64399b7292B17855a25589A88290f8127b5409B50623j10369
13122A40254J30641p3156B1882L21512C7461J98621r6169J2573J2277p6713a24159
$$ plain form
13110 202519 -58960 304860 -81785 193864 191457 12277 84623 90199 -46010 209246 -300735
13098 -17169 66610 409005 -17370 388267 116086 190284 279188 107658 11662 8917 -64588
13086 -5583 229568 178732 189865 315928 375189 325396 144265 -70430 96502 159580 244432
13075 244432 162153 78126 112910 390474 53273 259724 -95082 -54662 240503 -22309 216107
13063 -384642 -212590 -28103 -83015 272991 157884 289330 362560 -5563 -56397 109985 102882
13052 102882 -61531 2716 350245 250671 93842 472153 -34626 275942 66147 255323 236935
13041 236935 370360 29941 89427 -31988 -18257 376996 29228 366427 318907 18637 298834
13030 298834 20265 315252 129953 300548 364076 246553 391283 -84384 49079 -51165
$$ packed form
13110B02519e8960C04860h1785A93864k407A2277P2346N576d6010B09246c00735
13098a7169F6610L42395a7370C88267A16086P4198Q8904A07658A1662k745f4588
13086e583B29568n0836J1133J26063N9261m9793A44265g0430I6502O3078Q4852
13075B44432q2279G8126L4784K77564E3273K06451i5082M0420B40503b2309B16107
13063c84642J72052b8103n4912B72991j15107J31446P3230e563n0834A09985p103
13052A02882f1531B716L47529r9574I3842L78311c4626B75942F6147J89176j8388
13041B36935J33425B9941N9486c1988J3731C76996B9228L37199m7520A8637K80197
13030B98834B0265K94987A29953J70595O3528j17523J44730h4384D9079e1165
$$ plain form
13019 256997 48866 -270058 -77055 155998 76735 50607 -43030 139353 53094 183640 33479
13007 294406 -192579 -354476 68269 -78831 65393 -211 113116 159336 56959 -11304 -92961
12996 -92961 209353 333307 118841 99845 -53511 -23459 -261851 482063 -274541 -64916
12985 60502 99989 114631 247293 103226 208398 53317 29615 17480 -163678 -303955 111084
12973 -514029 -65119 171269 -127041 348942 -151212 86869 -86472 443536 147898 92525
12963 92525 342347 12671 -264047 325047 297949 41574 -159637 377687 -52280 62034 263342
12952 263342 115427 52368 111575 158968 -171120 41482 48866 283566 455 53375 612408
12941 612408 -141301 128378 -123950 12703 109123 347875 82980 -612 41122 53406 -34449
$$ packed form
13019B56997D8866b70058g7055A55998G6735k6128d3030A39353E3094J30546C3479
13007B94406a92579j61897F8269g8831F5393b11A13116M6220E6959a1304q1657
12996i2961B09353J23954A18841j8996e3511b3459k38392D82063b74541f4916
12985F0502L9487J4642J32662A03226J05172E3317k3702j2135a63678j40277A11084
12973e14029f5119A71269a27041C48942a51212H6869h6472D43536A47898n5373
12963I2525K49822A2671b64047C25047k7098D1574a59637C77687e2280F2034K01308
12952B63342A15427E2368N9207M7393a71120D1482P384K34700D55N2920N59033
12941F12408a41301A28378a23950A2703R6420K38752H2980f12D1122J2284c4449
$$ plain form
12929 140224 226802 318702 200449 -210494 -91979 73883 113357 51872 -314379 -24677 50351
12917 156016 132607 90827 116699 8414 -123692 178434 86644 -93944 82203 -126487 58996
12905 2048 209527 9632 115223 -47984 -54511 181608 -413726 7125 532687 20807 123339
12894 123339 94647 -32469 121224 -59469 241560 -52535 -277725 220327 274916 150647
12884 150647 123023 207559 158367 -97955 -41190 135678 490411 154134 220746 -31856 322688
12872 196371 76281 355887 111990 29479 -83397 -127425 -374080 137867 141476 102316 9987
12860 -61446 122677 251086 -219354 228062 277819 29600 -86897 -142708 215265 -67765 201744
12848 399374 -19112 -73796 40018 -94002 -216239 -45921 199756 9708 -71205 66995 126713
$$ packed form
12929A40224Q6578R1900j18253b10494i1979G3883L9474E1872c14379b4677E0351
12917A56016k3409m1780K5872H414a23692A78434H6644i3944H2203a26487E8996
12905B048K07479I632J05591d7984o527A81608d13726G125N25562B0807J02532
12894A23339k8692c2469A21224e9469B41560e2535k25190B20327N4589j24269
12884A50647k7624Q4536m9192i7955d1190A35678L54733A54134O6612c1856C22688
12872A96371G6281K79606A11990B9479h3397m4028k46655A37867L609l9160I987
12860f1446A22677J28409b19354B28062M9757B9600h6897n5811B15265f7765B01744
12848C99374a9112n4684D0018i4002j22237d5921A99756I708g1205F6995N9718
$$ plain form
12837 126713 339728 42460 -69353 340880 37047 327406 229903 -137580 -59411 -246688
12827 -246688 132317 110504 79431 -75462 -8572 172453 -91403 -145819 -334101 157001 -131590
12815 101134 39852 -70331 147550 86230 -104242 172876 94320 477827 -66789 -278021
12805 -278021 51850 332223 102629 -294883 283386 127256 397920 155411 -39545 16887
12794 204858 89786 -193973 156902 -40055 120056 -174789 115467 -100394 -5354 172665
12783 -192548 -416757 276460 279382 86781 201991 29341 -75125 312467 157413 144600 -154528
12771 -320595 -95157 215840 -226819 75512 64270 116221 68768 -223124 -7002 147298 143111
12760 143111 251256 -44697 -113019 200036 -53209 -21259 118125 47047 191742 6096 234376
$$ packed form
12837A26713K13015D2460f9353C40880C7047K90359r7503a37580e9411j87277
12827b46688A32317k1813l1073g5462h572A72453i1403n4416j88282A57001a31590
12815A01134C9852g0331A47550o1320a04242A72876p8556L83507f6789k11232
12805b78021E1850K80373A02629b94883B83386A27256K70664A55411c9545A6887
12794B04858H9786a93973A56902d0055A20056a74789A15467a00394e354A72665
12783a92548k24209B76460K922H6781J15210B9341g5125C12467j55054j2813a54528
12771c20595i5157B15840b26819G5512j1242N1951m7453b23124g002A47298m187
12760A43111J08145d4697o8322B00036e3209b1259A18125D7047J44695F096K28280
$$ plain form
12749 234376 223519 -141482 51372 93326 -98499 158630 291717 -39467 -55139 352496 31846
12737 277994 61008 31188 883 295581 -28852 149476 171420 418022 305719 284135 -232434
12725 -188360 -311560 61746 -170239 -386136 184259 -50040 237419 -118076 12757 -113131
12714 -338193 162739 148608 27681 196236 -18387 -151202 -34494 -105193 291014 122111
12703 189769 311832 201112 -6344 148620 420959 268796 128382 330212 147143 -25512
12692 300134 -26740 -559263 183293 -88632 270995 -191349 115009 233113 -14141 52594
12681 -213730 85220 387007 -11604 -54674 233323 207545 308255 -158954 -123209 174971
12670 23939 363578 72501 -34924 137855 380377 234554 115866 -230394 -154860 -75111
$$ packed form
12749B34376j0857a41482E1372M1954i8499A58630J33087c9467j5672C52496C1846
12737B77994F1008k9820H83K94698b8852A49476K1944K46602j12303k1584b32434
12725a88360j23200F1746a70239k15897A84259e0040B37419a18076A2757a13131
12714c38193A62739j4131B7681J68555a8387j32815c4494p0699B91014A22111
12703A89769J22063j10720f344A48620K72339j52163A28382K01830A47143b5512
12692C00134b6740n32523A83293h8632B70995a91349A15009J18104a4141E2594
12681b13730H5220L01787a1604m3070B33323k5778J00710a58954L5745A74971
12670B3939L39639G2501c4924A37855K42522j45823A15866b30394P5534g5111
$$ plain form
12659 -52150 -4064 -121329 192019 94084 -3529 134913 206701 75887 -204065 377669 30814
12647 44614 -182021 -230622 68494 250336 -373171 40373 309776 80452 95699 -37716 91832
12635 -77383 79606 153408 -146030 132078 117821 48174 216832 514996 188527 213642 445960
12624 445960 298217 112817 29939 139684 -194854 71660 54153 410679 -24872 291688
12613 124380 -147654 -38037 331098 249371 -173975 89157 456933 157931 59598 26771
12602 155567 -13135 117572 90128 -36307 -61657 -112172 255403 93067 207160 16387 -111193
12590 318174 -183870 -205778 -22927 -115967 139319 -51827 316082 -221008 -146932 254254
12579 -406462 -175873 144568 46443 89799 105084 121004 -9971 272159 -171048 62829 -101547
$$ packed form
12659e2150d064j17265A92019I4084c529A34913P1788G5887b04065C77669C0814
12647D4614a82021m8601F8494J81842c73171D0373K69403H0452J5247c7716I1832
12635g7383G9606P3802a46030A32078j4257D8174J68658K98164A88527K5115K32318
12624D45960j47743A12817B9939J09745a94854G1660j7507L56526b4872B91688
12613A24380a47654c8037C31098q1727a73975H9157L67776A57931E9598B6771
12602A55567a3135A17572k7444c6307k5350n0515B55403I3067J14093A6387a11193
12590C18174a83870k1908b2927r3040A39319e1827C16082b21008P4076B54254
12579d06462a75873A44568D6443M3356J5285J5920i971B72159a71048F2829a01547
$$ plain form
12567 -132633 172301 95188 59621 5891 226813 -164567 291817 63492 447583 -341427
12556 84807 -7661 164382 180338 -187919 250608 -143477 -132897 63151 228613 53070 152178
12545 152178 -157648 155905 55352 56544 277554 154308 -117338 -191517 292067 -66753
12534 -219664 -31065 43566 202546 77584 -229606 82313 57305 66302 -18932 194113 -399612
12522 -129169 93295 -36442 1625 -111540 -44652 187841 -180218 374924 129575 -25788 -24715
12511 -24715 -12682 93259 -147146 96439 177020 108898 279359 38820 -258098 59028 31203
12500 31203 153864 308198 58829 146156 222943 87212 -50652 12867 -126924 -206220 -101639
12488 -33464 193031 -146748 42153 115344 288367 246377 -195580 -427738 267388 -142680
$$ packed form
12567a32633A72301p7113l5567E891K20922a64567B91817F3492L84091c41427
12556H4807g661A64382J5956a87919B50608a43477J0580F3151J65462E3070R9108
12545A52178a57648A55905E5352J192K21010j23246a17338p4179B92067f6753
12534b19664c1065D3566J58980G7584b29606H2313k5008Q997a8932A94113c99612
12522a29169I3295c6442A625a11540d4652A87841a80218C74924A29575b5788J073
12511b4715J2033I3259a47146I6439Q0581o8122J70461C8820b58098E9028k7825
12500C1203J22661J54334E8829Q7327P6787H7212e0652A2867a26924p9296a01639
12488c3464A93031a46748D2153P3191J73023m1990a95580k32158B67388a42680
$$ plain form
12477 523190 -323699 150232 28096 103039 -194397 -100956 -291986 -469343 -13748 46725
12466 6594 146245 179424 -203597 -95342 -438692 -233601 175819 -76615 -45971 -25153 30692
12454 -62785 -115300 465482 -163570 23097 -153283 -319358 -67517 136833 230585 -59997 -14866
12442 -83393 -166681 2605 3098 4126 122755 -100030 81340 -96158 -167267 142039 256015 603212
12430 603212 -40776 93920 290634 -98045 54079 236939 285970 -218716 294864 319849 319080
12419 319080 5276 -27232 142366 87433 106071 267083 -90352 -4 70187 70693 -124796 71494
12406 214821 -137921 -48888 16007 70585 -405175 127061 107516 264398 -168485 -204356
12396 -204356 50484 -390953 169400 28345 -12286 -263790 -181160 -97317 120063 -7701 308419
$$ packed form
12477E23190c23699A50232B8096P4943a94397R3441j91030j77357a3748D6725
12466F594J39651L3179b03597i5342l43350K05091A75819g6615L0644K0818C0692
12454f2785n2515D65482a63570B3097a53283j66075f7517A36833R3752e9997a4866
12442h3393q3288B605M93J028J18629a00030H1340i6158p1109A42039J13976L47197
12430F03212d0776I3920J96714i8045E4079J82860M9031b18716B94864K4985p69
12419C19080E276b7232A42366n4933J8638J61012i0352dG0187N06a24796G1494
12406B14821a37921d8888A6007N4578d05175A27061j9545J56882a68485l5871
12396b04356E0484c90953A69400B8345a2286k51504Q2630Q3843A20063g701C08419
$$ plain form
12384 153787 -157939 -49867 84536 -222694 185435 178413 -75375 -503816 -10753 9501 106051
12373 106051 -157768 1700 -66083 133736 -37197 -4645 82793 -97489 -168029 343213 -26703
12361 133290 -271129 -151833 -139117 251507 -153888 -158944 55302 121923 -181350 232052
12350 -198537 250785 -36764 -194579 236387 41756 179840 -45466 -335712 74145 147034
12340 147034 66726 -161620 -58981 100091 294199 583147 86590 205789 33404 -204145
12329 -140017 178319 335411 17945 11727 -113722 260901 -28670 -233960 -190197 151397
12318 8247 -239273 107023 3801 173328 -7375 87679 79768 94483 -60967 -38867 -182484 -36769
12305 -190954 2980 3525 102809 231626 -21144 29470 -321786 227243 44901 -47380 15807
$$ packed form
12384A53787a57939d9867H4536b22694A85435p022g5375m28441a0753I501R6550
12373A06051a57768A700f6083A33736c7197d645H2793i7489p0540C43213b6703
12361A33290b71129J19296J2716B51507a53888n056E5302O6621a81350B32052
12350a98537B50785c6764j57815B36387D1756J38084d5466k90246G4145P2889
12340A47034F6726a61620e8981A00091J94108K88948H6590J19199C3404b04145
12329a40017A78319J57092A7945o218a13722B60901b8670k05290M3763A51397
12318H247b39273A07023C801J69527g375H7679p911J4715f0967K2100j43617c6769
12305a90954B980N45R9284J28817b1144B9470c21786B27243D4901d7380A5807
$$ plain form
12293 147235 -93792 129220 160994 160744 187891 182586 84832 -15881 270531 -8652 102139 191586
12281 191586 129020 205391 92988 -57470 365671 85616 103808 -91056 -39426 -69398 254559
12269 -90083 -7044 215696 -126630 47851 -374963 72126 -220422 211566 264984 78832 -7937
12257 -13327 -220630 -171131 13266 -156135 71259 -195151 -85239 -107410 279746 149171 173912
12246 173912 45174 -47397 -110290 130166 70448 316153 288037 310048 -57329 -74969 -194015
12235 -194015 103270 444489 135266 326438 409411 -85586 3504 187261 225324 307292 -46494
12223 87823 19336 436239 346960 407072 157943 336162 -50911 214462 185305 448292 -147280
12211 -30961 419732 -27933 159973 259356 55105 -69249 53871 92742 285922 89202 257096
$$ packed form
12293A47235i3792A29220L1774k50K7147n305H4832a5881B70531h652A02139Q9447
12281A91586o2566P6371I2988e7470C65671H5616J8192i1056c9426k9972B54559
12269i0083g044B15696a26630D7851c74963G2126b20422B11566N3418G8832g937
12257a3327k07303M9499A3266a56135G1259a95151h5239k2171B79746j30575K4741
12246A73912D5174d7397o2893A30166n9718K45705k8116K2011e7329j7640j19046
12235a94015A03270L41219A35266J91172Q2973h5586C504J83757L8063Q1968d6494
12223H7823A9336M16903q9279O0112A57943J78219e0911B14462k9157K62987a47280
12211c0961D19732b7933A59973R9383E5105f9249E3871L8871J93180H9202J67894
$$ plain form
12200 257096 170262 -35322 323886 168658 170050 138345 378189 206950 -313905 243556
12189 3288 147740 -14560 -115510 180592 479096 247739 77280 -28297 -59659 204457 341674
12178 341674 167709 124605 356642 113340 86223 69894 281913 -122374 -145821 -27460
12167 19792 16187 206265 110850 91233 -295478 231625 289421 182257 -78837 -207243 110691
12155 -198354 186216 80442 -297793 -1654 281083 -171570 190601 -224574 292381 191113
12145 191113 64753 51246 116371 -21205 55107 171161 142245 -24923 -16519 103023 -76370
12133 60768 70809 -348068 214726 337873 -187037 -144722 -204660 -129320 220730 88943 -175291
12121 25192 -167283 173199 236624 149028 20006 -149188 209902 280786 82753 50404 292517
$$ packed form
12200B57096q6834c5322C23886j55228J392l1705K39844j71239c13905B43556
12189C288J44452a4560j00950A80592K98504k31357G7280b8297l1362B04457J37217
12178C41674A67709m3104K32037A13340k7117j6329K12019a22374k3447b7460
12167A9792l605J90078r5415j9617b95478B31625N7796j07164g8837j28406A10691
12155a98354A86216H0442b97793a654B81083a71570A90601b24574B92381j01268
12145A91113F4753j3507O5125b1205E5107J16054k8916b4923Q404A03023g6370
12133F0768J0041c48068B14726J23147a87037M2315n9938P5340B20730H8943a75291
12121B5192a67283A73199O3425q7596B0006a49188B09902P0884H2753l2349K42113
$$ plain form
12110 292517 67981 63028 -232604 -70459 -142756 -62195 99771 26016 -144629 -308020 112949
12098 96472 -65669 -32698 -141818 363504 -58482 107292 61492 -99173 204152 106085 -170863
12086 119447 24013 -144468 -186003 -56722 91768 -91141 -2047 -48043 -42801 -25308 -264851
12075 -264851 5308 -43258 61614 -191176 143139 281220 -110388 -8599 36392 23492 326992
12064 326992 180723 -80467 169648 -11089 63182 292125 279648 -25661 262560 547942
12054 547942 832953 547514 461664 6437 41425 -189305 269634 -253287 17194 310274
12044 310274 245039 220962 -47068 68165 201705 321695 -129430 -140950 44840 258958 -266415
12032 -245904 111667 -43494 15850 -57192 -140569 41173 66521 -118568 -55504 -10615 -104033
$$ packed form
12110B92517F7981m953b32604g0459p2297f2195I9771B6016a44629j63391A12949
12098I6472f5669c2698j09120C63504e8482A07292m5800i9173B04152r8067a70863
12086A19447B4013a44468m1535e6722I1768i1141b047m5996N242J7493k39543
12075b64851E308d3258F1614a91176A43139J38081a10388h599C6392j2900L03500
12064C26992j46269h0467A69648a1089F3182K28943j2477b5661B62560K85382
12054E47942K85011k85439q5850F437L4988a89305B69634b53287A7194K93080
12044C10274o5235k4077d7068F8165J33540J19990a29430j1520D4840K14118b66415
12032b45904A11667d3494A5850e7192q3377D1173K5348a18568e5504a0615r3418
$$ plain form
12021 -104033 -5389 58006 514324 125794 68392 -197523 -74083 100965 53329 -85618 74971
12009 -19513 8453 -100723 64879 -138673 -33348 -126504 -41973 157233 57177 -58922 332486
11997 -43906 93651 55765 257924 -140032 414898 193548 48704 -54725 -10703 31593 -27216
11985 125611 -191517 -288511 -184967 26631 -306007 23339 72128 -20328 -83093 -299754 -175455
11974 -175455 -324525 -181309 123903 -275223 -1725 77888 -110056 -35339 -104106 -71673 148170
11962 -56776 219635 -335020 18945 -163237 -5297 97517 -158890 365296 167995 -94797 244997
11950 240157 -66361 -178024 -13510 123734 -75502 148987 18293 59242 -338551 62112 157371
11939 157371 198503 120044 183329 -93809 110408 -11379 -61401 -149877 -226457 216909 -60344
$$ packed form
12021a04033e389E8006M56318A25794n7402a97523g4083A00965m7636h5618G4971
12009a9513H453a00723F4879a38673c3348r3156d1973A57233E7177e8922C32486
11997d3906I3651l7886K02159a40032D14898A93548D8704e4725a0703C1593b7216
11985A25611a91517r6994J03544B6631c06007B3339M8789b0328o2765k16661J24299
11974a75455j49070J43216A23903b75223a725G7888a10056c5339o8767L2433A48170
11962e6776B19635c35020A8945a63237e297I7517a58890C65296A67995i4797B44997
11950B40157f6361j11663a3510A23734g5502A48987A8293M0949c38551F2112R5259
11939A57371M1132p8459O3285i3809A10408a1379n0022q8476p6580B16909f0344
$$ plain form
11927 213397 -193614 -64584 49184 68931 -197410 102607 -433109 116441 -49008 388553
11916 -175870 -22888 252512 -362295 -5938 175631 -176540 -29626 209203 -65031 356421
11905 -51180 302852 -111135 43590 348433 227453 -182706 91230 -9282 -49567 84552 48892
11894 48892 -134107 31182 -95276 -212109 -87369 -212720 -183714 144704 77604 -137422 -105487
11883 -105487 -409491 152923 185508 -40293 -226647 -132061 -165871 -235660 248929 -63599 437568
11871 -100804 -86430 -411638 -1316 -91631 -243644 183495 112860 48192 -172652 -102528 49046
11859 50141 -384934 93339 17197 38021 -68680 -156002 -216991 -129958 -88846 34833 211114
11848 211114 1691 14552 -287439 109877 -135729 -156025 -54106 -40679 -106101 68671 146682
$$ packed form
11927B13397a93614f4584D9184J9747a97410A02607d33109A16441d9008C88553
11916a75870b2888B52512c62295e938A75631a76540b9626B09203f5031C56421
11905e1180C02852a11135D3590L04843j20980a82706I1230i282m0285H4552l5660
11894D8892a34107C1182i5276j16833h7369j25351K9006A44704o7100a37422L1935
11883a05487l04004A52923L2585d0293j86354R4586l3810o9789B48929f3599D37568
11871a00804J4374l25208a316r0315j52013A83495p0635D8192a72652P0124D9046
11859E0141c84934I3339A7197K0824f8680q7322o0989Q7033M1112C4833J76281
11848B11114A691J2861b87439A09877a35729k0296e4106J3427o5422F8671P8011
$$ plain form
11837 146682 -74825 117668 104609 -196498 -283359 78414 -38004 -92794 -86449 -116479 -179420
11826 -179420 -73229 118567 338457 232518 -154935 176294 -16542 31027 -223076 32346
11815 39877 135348 79933 -38144 233419 -16676 224597 -149547 -4011 -315740 -65469 -46222
11804 -46222 -18338 112798 -153698 -118406 116253 -183763 227972 111504 4952 138550
11794 138550 91741 -194069 -144053 -64940 -15158 -181833 -92742 181262 -161281 167004
11783 373944 -13112 -107563 48547 -192454 93568 279291 -119080 87381 -13665 -171570 -66336
11771 199381 254737 71580 -228559 -231248 -269817 88996 -120623 -112180 271093 -4614 -170969
11760 -170969 351298 74759 38759 -112837 230207 91942 -33250 -306735 89131 -121464
$$ packed form
11837A46682g4825A17668j3059a96498q6861G8414c8004n4790O345l0030o2941
11826a79420g3229A18567K19890j05939a54935A76294a6542C1027b23076C2346
11815C9877R5471n5415c8144B33419a6676B24597a49547d011l11729f5469J9247
11804d6222a8338A12798a53698L5292A16253a83763B27972A11504D952J33598
11794A38550m6809a94069N0016f4940a5158j66675Q9091A81262a61281A67004
11783C73944a3112r4451D8547a92454I3568J85723a19080H7381a3665j57905f6336
11771A99381N5356G1580b28559k689l8569H8996a20623Q443B71093d614j66355
11760a70969C51298G4759l6000a12837B30207I1942c3250k73485H9131a21464
$$ plain form
11749 181052 190846 23112 -146421 -314411 100551 -150099 -279790 99770 -114947 -129660
11739 -129660 -192510 -208116 -221702 -36602 34918 191757 138900 -5576 -97403 -204014 16815
11727 74024 -16088 -33392 -372376 -101970 143520 -93777 -110558 106462 163175 -177123 -416260
11716 -416260 -250296 -257005 22591 -113045 -184885 -221968 -295468 -37923 273477 -158021 -95038
11705 -95038 122540 132158 77134 -52442 -28678 99424 -45258 -97321 222255 38862 -47919
11693 13539 272454 31383 24847 -151742 92240 -91548 403874 -2098 181254 -270003 161448
11681 -9380 32916 59540 -228523 -18687 274288 42585 71725 -4362 420141 155422 -18926
11669 -115863 67509 57685 -160862 -274511 -18878 -149344 141098 -254011 342980 -157888
$$ packed form
11749A81052R794B3112a46421j67990A00551a50099j29691I9770a14947j4713
11739a29660o2850j5606j3586c6602C4918J56839n2857e576r1827j06611A6815
11727G4024a6088j7304l38984a01970A43520i3777j6781A06462N6713a77123k39137
11716d16260J65964o709B2591a13045p1840l7083p3500c7923B73477a58021O2983
11705i5038A22540R618n5024e2442K3764I9424d5258n2063B22255C8862d7919
11693A3539K58915C1383o536a51742I2240i1548D03874b098A81254b70003A61448
11681i380C2916K6624b28523a8687B74288D2585K9140d362D20141A55422a8926
11669a15863F7509r824a60862j13649a8878j30466A41098b54011C42980a57888
$$ plain form
11658 -239075 -258637 223089 -77645 -37659 -29088 75081 57524 45066 -137348 -12 155245 -110749
11645 49925 104987 9316 -140409 243421 246711 -75630 -135281 -117648 56251 59045 -97763 -192573
11633 -192573 -215588 52612 -407112 91502 -154149 158629 459607 366790 -35842 -69979 -155817
11622 -155817 -16434 247851 75592 51608 1733 -59743 135219 -161121 -102200 266060 -13346
11610 -91511 24989 40444 98294 129776 54494 197662 56119 172308 -306484 -17603 -57001
11599 -57001 -89421 244070 -179074 -112768 -125894 -17562 48173 -2385 -200015 211350 -377143
11587 -199900 -63636 72902 162339 -74317 66821 -37262 136182 51208 77291 163653 522964
11576 522964 -49299 -282259 -260536 24865 -43632 -71902 -57617 38425 107114 -180742 -5086
$$ packed form
11658b39075j9562B23089g7645c7659Q571G5081j7557j2458a37348a2A55245a10749
11645D9925N5062I316a40409B43421L290g5630n9651J7633E6251K794i7763r4810
11633a92573k3015E2612d07112I1502a54149A58629L00978r2817c5842l4137q5838
11622a55817a6434B47851G5592k3984A733e9743A35219a61121N8921B66060a3346
11610i1511B4989J5455N7850L1482E4494J43168E6119J16189c06484a7603l9398
11599e7001l2420B44070a79074O6306j3126a7562D8173b385j97630B11350c77143
11587a99900f3636G2902Q9437g4317F6821c7262A36182E1208K6083Q6362L59311
11576E22964d9299k32960K1723B4865d3632k8270J4285C8425O8689a80742e086
$$ plain form
11564 89263 131254 8884 186455 20012 22216 -98542 42002 -114016 146823 -208094 200512
11552 7120 35848 -47786 -174474 2734 284480 232427 -2162 46759 81376 -115707 47913 -192047
11539 80196 138118 -78837 80043 -17328 -67491 113901 -369262 -39417 238445 358888 350575
11528 350575 144984 -97781 176793 77589 142117 -26522 -89093 81717 203493 -73417 141398
11516 103056 196896 225268 470450 -55608 18919 28633 -214674 -311283 -5887 116805 -58555
11504 202145 78035 -90376 -4421 50089 96392 318992 186650 109289 -218942 59376 -15704
11492 163423 372444 62184 -160740 -226257 -58493 117813 65955 345626 255438 108638
11481 -82485 147392 300644 394346 26990 98917 177665 -11946 76766 242720 67556 74180
$$ packed form
11564H9263M1991H884J77571B0012K204i8542D2002a14016A46823b08094B00512
11552G120K8728d7786j26688B734K81746n2053b162D6759L4617a15707D7913a92047
11539H0196N7922g8837H0043a7328n0163A13901c69262c9417B38445J20443q313
11528C50575A44984i7781A76793G7589O4528b6522o2571H1717J21776g3417A41398
11516A03056R3840K8372K45182e5608A8919R714b14674r6609e887A16805e8555
11504B02145G8035i0376d421E0089M6303K22600j32342p7361b18942E9376a5704
11492A63423K09021F2184a60740o5517e8493A17813n1858K79671r0188A08638
11481h2485A47392J53252R3702B6990P1927P8748a1946G6766J65954F7556O624
$$ plain form
11470 74180 144394 -142991 44187 135411 -108668 -235652 23619 111936 387463 -289422 -169246
11459 -169246 122344 17176 147867 321605 489072 74690 158083 63055 306370 186676
11449 186676 68979 -106338 -71278 121054 -64090 -108191 56309 71203 53206 74536 222376
11438 222376 -189036 -259901 -55050 260244 -46176 -158152 -307969 159501 -196981 103823
11427 114328 360594 94939 96160 64703 -109994 63674 119569 88278 68286 -170902 264835
11415 38605 -294298 -255234 72603 69138 -80512 -122196 218249 -100574 16991 100640 -102820
11403 -219396 -96960 8661 160061 205769 39120 -119074 -174588 -285153 99502 57996 95833
11392 95833 -69321 -85093 225594 57929 -119381 177525 -111470 80502 25446 -190090 239586
$$ packed form
11470G4180P0214a42991D4187R1224a08668j26984B3619Q8317K75527b89422J20176
11459a69246A22344A7176J30691J73738J67467G4690Q3393F3055K43315j19694
11449A86676F8979a06338L5060A21054f4090m4101E6309J4894j7997K1330J47840
11438B22376a89036p0865e5050B60244d6176j11976j49817A59501a96981A03823
11427A14328K46266I4939J221l1457a09994F3674N5895l1291j9992a70902B64835
11415C8605b94298L9064G2603l465h0512m1684B18249a00574A6991Q3649a02820
11403b19396i6960H661J51400M5708C9120a19074n5514j10565I9502m1506L7837
11392I5833f9321j5772B25594E7929a19381A77525a11470H0502B5446a90090B39586
$$ plain form
11380 44982 147635 -20639 -71780 -214760 -27390 100760 -33439 87655 315478 264864 203677
11369 203677 227101 -79475 -204706 232648 -127437 -187100 85862 208172 47085 90884 124214
11358 124214 -293084 -134563 -6560 -141510 134581 -51723 88333 76542 100121 -12158 -15166
11347 -15166 -55069 14779 107485 717 6088 -16900 -208170 201019 -100251 125253 77778
11336 77778 29120 273051 -84675 12753 133790 -13147 196759 -104472 -234158 -186567 -244358
11325 -244358 -17125 -184299 -244633 -8507 -162961 122057 28419 164374 -112221 61188 -17608
11313 22842 -98245 3564 -42882 -344252 -219237 -114487 159378 13500 -82901 -248505 -265342
11302 -265342 93309 53670 30855 -247943 142429 94449 324895 119756 25266 58453 -46709
$$ packed form
11380D4982J02653b0639n1141j42980b7390A00760c3439H7655K27823n0614o1187
11369B03677K3424g9475j25231B32648a27437n9663H5862J22310D7085M3799L3330
11358A24214b93084a34563f560j34950A34581e1723H8333j1791K3579a2158l008
11347a5166l9903A4779R2706G17N371a6900j91270B01019a00251A25253m7475
11336G7778B9120K43931h4675A2753J21037a3147A96759a04472j29686M7591n7791
11325b44358a7125j67174o0334h507j54454A22057B8419J35955a12221F1188a7608
11313B2842i8245C564d2882l01370J25015J04750A59378A3500h2901j65604j6837
11302b65342I3309l9639k2815b47943A42429m7980K30446A19756B5266L3187d6709
$$ plain form
11290 218193 142543 -222984 -141918 -218128 314427 -79447 90448 -35625 -111367 124744 -92444
11278 218625 -105387 -33347 53180 -67442 64099 251088 26004 -88258 60346 -85009 240546
11266 186064 -147389 206719 -116314 -207042 -389416 -145901 -354669 -151890 -170320 264523
11255 68448 -73963 -483011 95797 59725 -247242 -173128 -38103 -256671 -136102 161815 -185801
11243 -43640 173577 -51056 -467089 8890 95544 -85218 252569 -100214 -294957 -131478 260304
11231 112704 -78918 137103 -206586 -13526 -191851 178718 138114 189309 -301850 -147143
11220 54949 27974 41282 10994 -365887 71309 -11906 143269 -92059 -9282 108814 -114596
11208 -177545 69779 -127433 339446 74091 -1151 153790 -63412 24846 -117162 -42530 50093
$$ packed form
11290B18193p5650b22984Q1066p6210C14427g9447I0448c5625p5742A24744i2444
11278B18625a05387c3347E3180f7442F4099J86989B6004h8258F0346h5009B40546
11266A86064a47389B06719a16314r0728j82374a45901k08768a51890j8430B64523
11255F8448g3963m09048I5797l6072b47242P4114c8103k18568J20569A61815a85801
11243d3640A73577e1056m16033H890Q6654h5218B52569a00214j94743a31478B60304
11231A12704g8918A37103b06586a3526j78325A78718m0604N1195c01850a47143
11220E4949k6975J3308A0994c65887G1309a1906A43269i2059i282A08814a14596
11208a77545F9779a27433C39446G4091a151A53790f3412B4846a17162d2530E0093
$$ plain form
11196 -20943 62849 -231621 83766 -53634 -51062 -220420 49666 -42227 294518 -92099 -83847
11185 -83847 -98139 6114 1064 184734 -196590 -126069 -74400 104441 34556 -126305 140666
11173 -432399 -151574 -166812 -9603 94926 -290159 -32031 316347 75694 -184297 -210981 148818
11161 177656 55201 -510135 -34339 316063 78358 -212083 -174958 -291984 -55982 -140507 -4148
11149 -15976 -39547 10976 186474 -115211 121723 83806 259055 173432 41561 14568 173571
11138 173571 -34187 233330 -208319 -22099 108490 191923 -139136 80148 77711 133586 -15411
11126 -637297 2749 162005 64731 183111 424033 42581 34865 115033 -39409 -10094 26126
11114 84255 183829 312 152182 115946 -275 194800 47031 -26799 278166 111725 40161 114120
$$ packed form
11196b0943F2849b31621H3766e3634K572j69358D9666d2227B94518i2099Q252
11185h3847j4292F114A064J83670a96590P0521N1669A04441C4556a26305A40666
11173d32399a51574j5238i603I4926b90159c2031C16347G5694a84297k6684A48818
11161A77656E5201e10135c4339C16063G8358b12083L7125j17026e5982q4525d148
11149a5976k3571A0976J75498a15211A21723l7917J75249q5623D1561A4568J59003
11138A73571c4187B33330b08319b2099A08490Q3433a39136H0148k437N5875a5411
11126f37297B749J59256F4731J18380K40922D2581p716Q0168c9409a0094B6126
11114H4255R9574C12J51870l6236b75A94800D7031b6799B78166A11725D0161P3959
$$ plain form
11102 114120 -175272 311742 -308011 410640 330978 286091 117549 253235 77947 -149622
11091 -43694 269417 -79179 56718 -134459 -11802 278893 58917 -89130 117009 344568 -33287
11079 243667 172100 224458 80354 320663 174632 494915 299678 54137 117973 499678
11069 499678 306507 283402 40789 246925 290494 415206 44153 376752 618346 223012
11058 607361 765745 448358 689221 403477 775047 525849 615042 402148 646242 696760
11048 696760 692948 828832 537889 577197 732963 714313 523500 821261 689088 712879
11038 712879 563584 554287 650253 322648 873537 756414 392909 591748 147618 520062
11028 520062 571674 705969 758750 650946 703788 377060 553573 276779 450617 546963
$$ packed form
11102A14120a75272C11742c08011D10640p9662m4887A17549J35686G7947a49622
11091d3694B69417g9179E6718a34459a1802B78893E8917h9130A17009K27559c3287
11079B43667p1567N2358H0354K40309j46031L20283j95237E4137O3836L81705
11069D99678j93171k3105D0789K06136M3569J24712D4153L32599K41594B23012
11058F07361J58384l17387K40863k85744L71570k49198Q9193k12894K44094N0518
11048F96760l812J35884k90943L9308J55766j8650j90813K97761j32173K3791
11038G12879j49295r297R5966C22648N50889j17123l63505J98839A47618L72444
11028E20062N1612J34295N2781j07804N2842l26728J76513B76779J73838R6346
$$ plain form
11018 546963 321344 373960 767764 144521 430961 338597 909072 473017 646678 180797
11007 58763 118812 553544 625587 516304 419352 706785 590459 505917 281880 551942
10997 551942 387534 674346 713971 462661 894461 414268 464146 649016 768852 471581
10987 471581 758266 617169 773028 806777 620784 748650 900449 1503527 1082706 1512787
10977 1512787 1270052 1876233 1840514 1899050 2436629 2696145 2527275 2213780 2388686 1749245
10967 1749245 1919616 1903048 1357129 1360732 1461944 1238638 1319101 1300219 1237030 1075271
10957 1075271 1135640 845773 1081361 1147822 642324 418969 625661 474171 586066 298478
10947 298478 262422 405765 131743 361112 10217 283549 356124 80822 -377657 29118
$$ packed form
11018E46963k25619N2616L93804A44521K86440r2364N70475m36055J73661A80797
11007E8763O0049M34732P2043j09283r6952K87433j16326q4542k24037K70062
10997E51942j64408K86812L9625k51310M31800D14268M9878J84870J19836k97271
10987D71581K86685j41097J55859L3749j85993J27866J51799O03078m20821M30081
10977A512787k42735O06181l5719N8536N37579K59516j68870l13495J74906o39441
10967A749245J70371j6568n45919L603J01212k23306Q0463j8882o3189j61759
10957A075271O0369k89867K35588O6461n05498k23355K06692j51490J11895k87588
10947B98478l6056J43343A31743K29369A0217K73332P2575H0822c77657B9118
$$ plain form
10936 -26774 323346 222988 -187571 83546 358512 13056 262932 230561 -194370 -50025
10925 -19034 275 177193 -101908 63422 200386 -156139 416363 -127353 -2923 41414 -145325
10913 -106771 127351 80131 -70091 105591 74879 -223878 -77595 147796 -376774 -308378
10903 -308378 -82706 318636 -170670 54130 128954 -151290 98130 39825 159216 5709 193828
10892 193828 -199220 -272733 168103 293121 277709 66500 107712 297924 151820 -33613
10881 123607 46723 -141139 110073 -161562 -175871 45044 -206045 -102602 74450 -63788
10870 356082 335834 47970 186082 174197 264303 394508 230406 113360 -100721 101422
10859 -36922 -139739 76179 170069 -49838 -167301 -189766 345127 198826 106425 326209 -151039
$$ packed form
10936b6774C23346j00358a87571H3546K74966A3056K49876l2371a94370e0025
10925a9034B75J76918a01908F3422J36964a56139D16363a27353b923D1414a45325
10913a06771A27351m7220g0091A05591l0712b23878g7595A47796c76774O8396
10903c08378h2706C18636a70670E4130P4824a51290I8130C9825J19391E709J88119
10892A93828a99220p3513A68103J25018j5412F6500M1212J90212j46104c3613
10881A23607D6723a41139A10073a61562j4309D5044b06045a02602G4450f3788
10870C56082k0248D7970J38112j1885R0106J30205j64102A13360a00721A01422
10859c6922j02817G6179R3890d9838j17463k2465C45127j46301r2401K19784a51039
$$ plain form
10847 192744 -104950 8875 152531 -43144 160322 91971 66313 -77289 191861 121930 132235
10836 132235 -227181 -154955 167447 78197 -208208 -44936 -42175 189356 233354 174548 89980
10825 89980 69003 -237808 -150985 -59047 57358 -40749 96220 -188426 -213650 90825 -149924
10813 -134964 -106798 -119445 50657 -329043 -432834 -22749 -363814 75980 -9979 115338 -119261
10801 -91609 167402 151413 35557 120325 -6483 -270145 -218852 -4312 -118756 -227056 91868
10789 137979 118330 114797 -65431 -358987 -81701 86004 -242379 -48152 -61625 103941 -138356
10777 47175 -50012 3126 -269209 -78784 150724 21308 58383 131529 -169110 79635 -397541
10765 261178 -243680 -90824 -188295 15847 108502 -232357 230196 48935 -119122 -56814 89212
$$ packed form
10847A92744a04950H875J43656d3144A60322o8351k5658g7289A91861o9931J0305
10836A32235b27181P2226A67447G8197b08208d4936K761A89356M3998n8806q4568
10825H9980k0977b37808Q6823e9047E7358d0749I6220a88426k5224I0825a49924
10813a34964K8166j2647E0657c29043j03791b2749l41065G5980i979A15338a19261
10801i1609A67402j5989C5557Q4768f483k63662N1293d312j14444j08300I1868
10789A37979j9649l533f5431k93556h1701H6004b42379d8152j3473A03941a38356
10777D7175e0012C126b69209g8784A50724B1308L7075P3146a69110G9635c97541
10765B61178b43680i0824r7471A5847R2655b32357B30196D8935a19122e6814H9212
$$ plain form
10753 -16545 62543 -208369 -326169 -7036 -110604 152174 -106712 35664 -37568 -31697 264372
10741 -22160 41182 -98164 -29809 -63680 17308 -2620 487780 32754 -24949 -380408 -1792 139837
10728 357192 -208117 -59179 -512122 104388 336522 -57229 -319031 -443695 -65180 11057
10717 -92583 -239180 -156271 -259828 92051 -130174 70294 178464 198475 -21200 -178680 -168290
10706 -168290 -237498 -21387 324934 -203437 23584 263038 -172392 -3673 -173085 -78628 22532
10694 -291397 -462622 28616 -138156 31221 352639 -175335 93943 229 115537 -95432 53509
10682 -14169 126102 132126 -55206 -265542 225077 -114882 -165018 65496 185553 -131352 -110368
10671 -110368 65635 -319117 271109 -42889 53705 -373906 -63527 242185 262581 170968 -24758
$$ packed form
10753a6545F2543b08369j17800g036j03568A52174a06712C5664c7568N871B64372
10741b2160D1182i8164b9809l3871A7308b620D87780C2754b4949l55459a792A39837
10728C57192b08117e9179m52943A04388K32134e7229k61802j24664f5180A1057
10717i2583j46597Q2909j03557I2051a30174G0294J08170K0011b1200j57480J0390
10706a68290o9208b1387C24934b03437B3584K39454a72392c673j69412g8628B2532
10694b91397j71225B8616a38156C1221L21418a75335I3943B29J15308i5432E3509
10682a4169A26102O024e5206k10336B25077a14882n0136F5496J20057a31352K0984
10671a10368F5635c19117B71109d2889E3705c73906f3527B42185K0396r1613b4758
$$ plain form
10659 153962 178986 -235408 -245873 -40333 262686 494917 -265894 -240343 57699 -135473
10648 -222589 129343 27590 -13347 -190085 -20125 34406 -124133 7049 81891 -73133 -170502
10637 -170502 -217172 -139541 -484178 -18689 -163446 179157 132812 286299 -173240 51200
10626 -204389 408591 -49766 -136889 -439637 -62560 6783 -37706 380 -204625 -162505 -376579
10615 -376579 -48493 -291111 -260446 -145895 -109210 -156217 -141245 155067 4536 -148989 -2895
10603 -285702 -33182 32237 26014 46304 176591 -36076 173333 -80037 106581 -97383 -158806
10592 -158806 -329924 -153427 33467 140408 19029 -152695 -35497 98177 140161 -108383
10581 -517226 -60692 -327681 -226954 -113459 281506 -113023 -27864 -226682 -132820 -186644
$$ packed form
10659A53962K5024b35408j0465d0333B62686K32231b65894K5551E7699a35473
10648b22589A29343B7590a3347j76738b0125C4406a24133G049P4842g3133r7369
10637a70502m6670P7631l44637a8689j44757A79157m6345J53487a73240E1200
10626b04389D08591d9766q7123l02748f2560F783c7706C80b04625M2120k14074
10615c76579d8493k42618L0665J14551L6685m7007J4972A55067D536a48989b895
10603b85702c3182C2237o223K0290J30287c6076A73333h0037A06581i7383o1423
10592a58806j71118a53427C3467J06941A9029a52695c5497I8177M1984a08383
10581e17226f0692k66989J00727a13459B81506a13023b7864j98818R3862n3824
$$ plain form
10571 -186644 163640 67837 -197685 -3921 -67379 -18141 -76734 66772 -282146 -88162 -26863
10559 124623 -102951 -115124 -96063 -237532 221926 -163656 65498 111799 -71356 -166307 -144005
10548 -144005 -181661 52014 -108907 162774 -285837 278222 445643 -163838 -46859 -149551
10538 -149551 -72382 57676 -119360 128405 119729 112610 180808 58875 -293339 -69967 53812
10526 99934 -271460 266669 53271 -111605 -93028 -84212 -428914 -128530 -782 -89943 131416
10514 40510 20305 -8249 -76263 -152172 250750 -358706 -91764 48403 80851 57487 -18793
10502 -209605 -199685 -97983 -357519 -165199 -56903 67889 -388519 -74487 -152635 -93230 -61367
10491 -61367 45787 176933 -92063 7542 -166512 53403 93896 58648 -68530 -290528 -249579
$$ packed form
10571a86644A63640F7837a97685c921o3458a8141n8593F6772b82146h8162b6863
10559A24623a02951j2173J9061j41469B21926a63656F5498M6301g1356r4951K2302
10548a44005l7656E2014a08907A62774b85837B78222J67421a63838d6859j02692
10538a49551g2382E7676a19360A28405q676p119O8198E8875b93339f9967E3812
10526I9934b71460B66669E3271a11605J8577Q816l44702a28530g82q9161A31416
10514D0510k0205h249o8014p5909B50750c58706i1764D8403L2448k3364a8793
10502b09605R920i7983k59536a65199e6903F7889c88519g4487p8148N9405L1863
10491f1367D5787J31146i2063G542a66512E3403M0493l5248f8530k21998M0949
$$ plain form
10480 -249579 53066 166427 -94199 -7483 90860 174185 -142017 137177 14814 -256812 -50636
10468 185640 -76766 118455 -129737 32044 -87107 226750 66004 -264085 -165631 -202686 -312731
10457 -312731 16040 -275762 275200 -241289 -328705 271578 183178 99895 20180 50946 -15030
10445 -91463 99779 -150048 38685 -47278 45160 66179 -170656 -135221 133903 -261004 23112
10433 -227469 -147242 34417 242248 113308 62039 -90233 78340 74927 34761 -44363 -30619
10422 -30619 371456 -233939 211028 -279378 150785 259756 129514 -145696 -16940 -189663
10412 -189663 -80845 -17805 -214421 107835 18709 199672 52670 190265 244664 -258254
10401 219272 -30332 -190695 -10598 -69155 74410 -173467 -16853 255193 -130571 -111498 390489
$$ packed form
10480b49579E3066J13361i4199g483I0860Q3325a42017A37177A4814b56812e0636
10468A85640g6766A18455a29737C2044h7107B26750F6004b64085R8454l7055j10045
10457c12731A6040b75762B75200b41289q7416B71578q8400q3283B0180L0766a5030
10445i1463I9779a50048C8685d7278D5160K1019a70656L5435A33903b61004B3112
10433b27469Q0227C4417K07831A13308n1269i0233G8340l413C4761d4363J3744
10422c0619C71456b33939B11028b79378A50785J08971A29514a45696a6940j72723
10412a89663h0845a7805j96616A07835A8709J80963E2670J37595N4399b58254
10401B19272c0332j60363a0598n8557G4410a73467a6853B55193a30571J9073C90489
$$ plain form
10389 114170 244528 202282 29904 91912 66758 117842 58206 127375 99369 -190809 241053
10377 19850 183663 -241650 79116 31164 440488 197760 308725 89914 357007 64514
10366 383430 561559 662540 15867 206024 243051 208868 217630 322143 54140 605256 62717
10354 56439 67760 270362 292536 -12866 479855 201961 249258 339250 142019 358329 74871
10342 432351 170390 556935 31787 120621 182243 188979 166900 249894 -61274 152754 -248610
10330 209792 220879 -172377 19315 127523 22806 102572 153180 240666 297683 -56254 -194333
10319 -194333 40229 148856 340006 23182 198685 -160365 -53619 29685 -228559 -36166
10308 253292 -60470 -59089 71018 -365743 -106142 -33511 -233505 169929 -142557 19646 -336616
$$ packed form
10389A14170J30358m2246B9904O2008k5154N1084E8206O9169k8006a90809B41053
10377A9850J63813b41650G9116C1164M09324A97760J10965H9914K67093F4514
10366C83430J78129J00981A5867J90157L7027l4183Q762J04513E4140N51116F2717
10354E6439J1321K02602K2174a2866D79855B01961M7297Q9992A42019K16310G4871
10342D32351A70390L86545C1787Q8834O1622O736k2079Q2994f1274A52754b48610
10330B09792J1087a72377A9315J08208B2806P9766N0608Q7486N7017e6254j38079
10319a94333D0229J08627J91150B3182J75503a60365e3619B9685b28559c6166
10308B53292f0470J381G1018c65743a06142c3511j99994A69929a42557A9646c36616
$$ plain form
10296 -350561 78932 189536 7588 -253874 -226482 6454 -122148 -25872 -62777 32640 91238
10285 91238 174621 75817 -290033 -236094 286575 -120732 -197559 -51430 247542 -66360 -60719
10274 -60719 52853 -439660 -15001 -115726 -25306 -205104 -50383 -141657 -292735 -322238 129561
10262 192684 454757 -78859 247098 419738 155708 290006 499367 541591 -47362 -98399
10252 -98399 80103 -10629 34616 -268942 39165 -268301 220546 57746 236253 40427 -74133
10240 264486 -42012 -210932 37537 -65753 111906 -98504 185357 76580 -65050 -433371 143366
10228 -256002 -359911 177068 24443 146798 201010 -86719 -87052 -234601 -116775 186769 -156315
10216 -116274 -62853 -110263 190609 -85585 -191593 -112329 -35006 15455 -296774 -83222 -192053
$$ packed form
10296c50561G8932J10604G588b53874K7392F454a22148b5872l6905C2640N8598
10285I1238Q3383G5817b90033N3939B86575a20732p6827e1430B47542f6360N641
10274f0719E2853d39660a5001j00725b5306j79798e0383r1274j51078k9503A29561
10262A92684K62073g8859B47098J72640A55708J34298K09361M2224d7362n1037
10252i8399H0103a0629C4616b68942C9165b68301B20546E7746J78507D0427g4133
10240B64486d2012j68920C7537f5753A11906i8504A85357G6580f5050l68321A43366
10228b56002j03909A77068B4443J22355N4212h6719l33j47549a16775A86769a56315
10216a16274N3421m7410A90609h5585j06008P9264c5006A5455b96774h3222j08831
$$ plain form
10205 -192053 59628 28718 -2825 70573 113410 -73934 169623 93159 171873 -150446 101026
10193 11472 101719 448 -140090 52483 -45170 142773 92624 -261933 -348196 -59785 -116395
10182 -116395 -214551 42813 -123736 28444 -129725 -126116 120811 105756 -75527 -565401 57594
10170 -192351 -14129 46967 -244956 10408 -435315 -100992 111896 164691 216948 29569 -185689
10158 242853 -460721 -185846 -198121 24623 46159 -10656 166402 -215381 -35608 -368822
10148 -368822 -37006 -93031 -35986 -209365 -78591 81022 -160893 -300380 -8366 83931 -388495
10136 119460 -43294 -34877 -226107 -2156 -38687 -309828 19081 -14124 146974 -84454 -258290
10125 -258290 -254652 77571 -85425 -314723 256912 81076 -296739 -300758 -84945 -357756 -118588
$$ packed form
10205a92053E9628B8718b825G0573M2837g3934A69623p6464P8714a50446A01026
10193A1472R0247D48a40090E2483d5170A42773n0149b61933q6263e9785n6610
10182a16395r8156D2813a23736B8444a29725L609A20811j5055g5527m89874E7594
10170a92351a4129D6967b44956A0408d35315a00992A11896N2795N2257B9569a85689
10158B42853d60721a85846j2275B4623K1536a0656A66402b15381c5608l33214
10148c68822c7006n6025c5986j73379g8591H1022a60893j39487h366H3931c88495
10136A19460d3294Q417j91230b156l6531k71141A9081a4124A46974h4454j73836
10125b58290L638G7571h5425k29298B56912H1076b96739m019h4945k72811a18588
$$ plain form
10113 19305 -221893 -194979 158028 35439 -261079 7537 169313 -82953 2990 -339569 -185752
10102 -185752 -60129 -148934 -13245 -49908 20982 -39159 147447 -119590 -90270 75061 230940
10091 230940 -223807 -226426 -5605 -27909 -21767 -123146 -108207 -464217 113356 -304677 31526
10079 -108934 -63288 -79619 -332927 -125310 71424 -32437 155302 -30648 10469 44155 -240498
10067 -218948 -344004 67510 -402967 20887 -318911 -143406 179426 40653 -59831 -100882
10057 -100882 -122212 -130017 209755 -12356 -49806 -180711 -399940 22145 -267363 -238875 -345888
10046 -345888 -236753 121572 -111646 27323 -1899 -95564 -77959 90002 -172646 -225394 -152149
10035 -152149 15173 -210019 62690 134183 210123 -2 108999 102736 56773 -40740 166142 -321565
$$ packed form
10113A9305b21893K6914A58028C5439b61079G537J61776h2953B990c39569J53817
10102a85752f0129q8805a3245l6663B0982c9159A47447a19590K9320G5061J55879
10091B30940b23807k619e605k2304O142j01379J4939l56010A13356c04677C1526
10079a08934M5646j6331k53308a25310G1424c2437A55302c0648A0469L3686b40498
10067b18948j25056F7510d02967B0887c18911a43406A79426D0653e9831m1051
10057a00882k1330p805B09755a2356l7450j30905k19229B2145b67363K8488j07013
10046c45888J09135A21572a11646B7323a899r3665J7605I0002a72646n2748P3245
10035a52149A5173b10019F2690P1493P5940bA08999o263m5963d0740A66142c21565
$$ plain form
10022 -54001 -318991 -324671 -105206 12287 -24614 153193 147263 -79971 -131760 -181774 -156136
10011 -156136 -286301 -15272 -141127 -123334 -83524 293535 135216 143728 -153702 206550
10000 72928 327869 -308824 -350997 54952 -131751 218286 -98355 239864 -35735 51613 -116864
9988 -131575 -166252 -80245 -125191 244974 117985 -61232 82218 55820 -76376 -323831 -205179
9977 -205179 269984 -122749 180216 -98431 -129658 -61628 -262335 168830 -90946 66603 -95520
9965 12687 -226081 -249795 71124 -330222 -50845 -39829 -142214 -138015 -99104 -340399 39302
9953 73419 96584 -56252 56875 -180996 -88428 -338089 -144765 115755 15908 189276 19842
9941 -31621 90023 163332 -17122 116644 177554 -185423 84759 -64415 -272016 27189 -73402
$$ packed form
10022e4001k64990n680a05206A2287b4614A53193n930g9971n1789n0014K5638
10011a56136j30165a5272j25855J7793L9810B93535A35216Q512a53702B06550
10000G2928K54941c08824m2173E4952a31751B18286i8355B39864c5735E1613a16864
9988a31575l4677h0245m4946B44974A17985f1232H2218k6398g6376k47455J18652
9977b05179B69984a22749A80216i8431l1227f1628k00707A68830i0946F6603i5520
9965A2687b26081k3714G1124c30222e0845J1016j02385M199L8911k41295C9302
9953G3419K3165e6252E6875a80996h8428k49661a44765A15755A5908J73368A9842
9941c1621I0023P3309a7122A16644O0910a85423H4759f4415k07601B7189g3402
$$ plain form
9929 -326230 87680 -256353 244102 -115535 -109574 -185636 -205789 -125574 -37147 -18894 -240181
9918 -240181 -146813 -189077 -208624 23036 411443 68863 83488 -79634 -30973 -153803 -52497
9906 -158406 209866 -276453 -208991 -102567 -103571 43494 -471807 -151940 -125725 -177496 -196210
9895 -196210 119074 -267923 -110983 170096 -252437 278479 4026 29985 19594 -212280
9884 -85069 -136712 -28076 30532 -157808 -39603 112421 176930 -395725 156247 -33951 -129365
9873 -129365 -182032 34696 -148059 -425475 -16924 214322 41320 282046 132526 347537
9863 347537 -159736 -116235 -115628 -33629 -15097 33734 160250 -908 -150262 25212 -42140 -14807
9850 -65400 -38010 -471387 261640 139832 163763 -17830 -299476 -153047 -133095 -119640 109184
$$ packed form
9929c26230H7680b56353B44102a15535N961p6062k0153Q0215c7147J8253k21287
9918b40181R3368m2264j9547B3036L88407F8863J4625g9634c0973j22830e2497
9906a58406B09866b76453O7462a02567j004D3494d71807a51940K6215n1771j8714
9895a96210A19074b67923a10983A70096b52437B78479D026K5959j0391b12280
9884h5069n1643b8076C0532a57808c9603A12421O4509c95725A56247c3951r5414
9873a29365n2667C4696a48059k77416a6924B14322D1320K40726A32526K15011
9863C47537a59736M3501O07c3629a5097C3734J26516i08j49354B5212d2140a4807
9850f5400K7390m33377B61640j21808K3931a7830k81646J46429J9952J3455A09184
$$ plain form
9838 90678 177046 -151699 171612 4150 -87281 3009 168829 -199457 -373531 -299652 -234481
9827 -234481 -197332 -46333 -50597 114732 -90123 -217259 -199133 305456 -71416 305485 -223836
9815 -51208 -83491 -49746 -243312 -161880 -219725 -412619 -189512 126807 8267 -150558 22455
9803 -326565 66379 -397264 -15036 -24065 -113944 -5440 -310858 -4955 78604 -75780 -262272 320323
9790 -264284 -160794 -103989 225724 -311550 -262922 -404589 -98132 -184849 -188199 -37787 278088
9778 -34864 -220499 -114285 260262 -62757 49479 15419 -73812 -4776 223854 81454 109129
9767 109129 -188953 -46466 48710 -68893 155110 49184 34099 -5899 149765 208157 13003
9755 -19007 76610 -229156 122815 305090 -198449 10305 -157386 87364 -19826 118181 2413
$$ packed form
9838I0678Q6368a51699A71612D150h7281C009J65820a99457j74074P3879O5171
9827b34481L7149d6333m264A14732i0123j27136J8126C05456g1416C05485b23836
9815e1208l2283L3745j93566Q1432n7845j92894a89512A26807H267a50558B2455
9803c26565F6379c97264a5036r029q9879e440l05418d955G8604g5780j86492C20323
9790b64284J03490N6805B25724c11550M8628j41667i8132q6717l350c7787B78088
9778c4864j85635J06214B60262f2757D9479A5419g3812d776B23854H1454K7675
9767A09129a88953d6466D8710f8893A55110D9184j5085e899A49765N8392A3003
9755a9007G6610b29156A22815J82275a98449A0305a57386H7364a9826A18181B413
$$ plain form
9743 -56187 155758 -86943 -150505 -4433 -231140 -118837 29637 -159507 232178 79255 60062
9732 60062 -245723 52751 -126119 -260893 -55013 -48527 -341073 -15970 -12679 -75759 4555 -116248
9719 -77912 234680 161857 96834 -59955 -342786 -297586 -30694 -85159 -71685 141701 -137269
9707 -9413 50238 -111454 -118776 246284 157099 189417 -176365 -118844 -50214 -355911 -63152
9695 271339 -42813 77008 -60316 -213369 -83007 -95114 -135399 -77829 -45794 -205129 28367
9683 -46074 -53528 30487 69245 -366798 -348105 -115500 23920 29421 -95463 -49022 14740 -178230
9670 -158651 -387242 88256 133922 -24856 -234604 -64780 120915 -356295 -21571 143479 -133731
9658 -235919 -220707 -56164 24965 170972 293331 -325685 -198577 -90277 -202526 -71902 -2825
$$ packed form
9743e6187A55758h6943o3562d433k26707J12303B9637a59507B32178G9255j9193
9732F0062b45723E2751a26119j34774e5013O486k92546a5970L291o3080D555a16248
9719g7912B34680p2823o5023e9955k82831M5200c0694n4465J3474A41701a37269
9707i413E0238a11454p322B46284q9185L2318a76365N7521e0214l05697f3152
9695B71339d2813G7008f0316j53053h3007j2107m0285N7570L2035j59335B8367
9683d6074p454C0487L8758c66798J8693a15500B3920N501i5463M6441A4740a78230
9670a58651k28591H8256M5666b4856k09748f4780A20915c56295b1571A43479a33731
9658b35919J5212e6164B4965J46007J22359c25685J27108i0277j12249g1902b825
$$ plain form
9646 -20410 127548 132012 46891 -42619 -330029 -113775 77454 154732 -69355 183051 6849
9634 -10685 -318374 -13744 -302639 -197370 -109865 190256 19932 73376 77091 -267937 76832
9622 90108 106938 -61936 57545 240092 22598 -67704 -211857 129274 -129123 -106746 -172408
9611 -172408 -282796 -93448 54762 -36515 212368 -142360 -220611 62025 467073 30429 -249942
9599 205849 255947 -97795 -54033 210136 -206021 -151656 5963 -225618 293634 26190 40502
9588 40502 162035 -363654 -33324 -60473 -120470 94131 -287133 121701 16897 -384508 82456
9576 163290 -103114 -145975 145256 -77853 -176926 -83296 140728 -135648 -272147 -172205 992
9564 209187 -253609 12662 106675 -77507 -58768 312802 -334015 -306293 109007 -294521 210981
$$ packed form
9646b0410A27548M464D6891d2619k87410a13775G7454P7278f9355A83051F849
9634a0685l07689a3744k88895J05269Q7505A90256A9932N3444L715b67937G6832
9622I0108J6830f1936E7545J82547B2598f7704j44153A29274a29123K2377o5662
9611a72408j10388i3448E4762c6515B12368a42360p8251F2025M05048C0429b49942
9599B05849N0098i7795M3762B10136b06021N4365E963b25618B93634B6190J4312
9588D0502J21533c63654c3324k7149n9997I4131b87133A21701A6897c84508H2456
9576A63290a03114m2861A45256g7853r9073h3296A40728a35648j36499R9942I92
9564B09187b53609A2662R4013g7507J8739C12802c34015K7722A09007b94521B10981
$$ plain form
9552 77518 19702 -424053 23394 -29321 38445 -228956 -268124 31467 -97124 -39295 -175348
9541 -175348 138130 -116234 -143587 -419652 -82796 167550 -19739 -332091 -305344 -100920
9530 -156729 -11526 152351 -28707 -231112 -181354 -41535 -344197 116836 -401279 -180878
9519 -120743 -386959 -326406 295362 154786 -40861 -269465 -81735 73846 -40542 -257548 130827
9507 -267349 221814 -476107 273576 -294696 -59320 246560 -178504 -5603 -162316 -286356
9497 -286356 -76666 48308 -108705 -118296 -43814 -351924 175333 144748 98595 -205291 -52730
9485 -40518 182610 -504071 -112876 107324 -371779 -300650 -12183 -297751 -214304 -98129 164581
9473 311319 140185 -77691 -116405 219732 69592 -18762 19878 -104520 55560 -100062 -21630
$$ packed form
9552G7518A9702d24053B3394b9321C8445b28956l9168C1467i7124c9295j36053
9541a75348A38130a16234k7353k76065h2796A67550a9739l12352K6747a00920
9530a56729a1526A52351b8707k02405M9758d1535l02662A16836d01279a80878
9519a20743k66216O0553B95362j40576d0861k28604h1735G3846d0542k17006A30827
9507b67349B21814d76107B73576b94696e9320B46560a78504e603j56713j24040
9497b86356g6666D8308a08705r591d3814l08110A75333l0585m6153b05291e2730
9485d0518A82610e04071a12876A07324c71779P1129a2183k85568Q3447i8129A64581
9473C11319A40185g7691l8714B19732F9592a8762A9878a04520E5560a00062b1630
$$ plain form
9461 18779 250846 -76015 53608 -153077 -142417 -97038 -283607 -48454 35001 143942 187155
9450 187155 -271272 -63910 41098 -269043 -240957 -435026 211377 -230628 -182265 316136
9439 203444 -71313 167130 71844 243481 -29588 11607 -447238 64961 10673 4418 -392676
9427 -177895 -97244 -146370 -248236 -115978 -145505 -464829 -76284 80244 -229183 241193 21189
9415 106609 232279 -56010 -82265 89744 -191860 -24984 250597 161995 -166957 -214459 -25913
9403 -57993 172211 -149886 -157575 -135772 243149 5093 258607 -31034 314337 -95260 -193771
9392 -193771 -108633 17184 -74451 -147309 -15818 -249386 -127030 -129707 8444 -305819 74995
9380 42222 57723 -43716 -29859 -200508 -199506 -305355 -218333 -287931 -298532 304410 -54097
$$ packed form
9461A8779K32067g6015E3608a53077J0660M5379j86569d8454C5001J08941M3213
9450A87155b71272f3910D1098b69043K8086j94069B11377b30628M8363C16136
9439B03444g1313A67130G1844J71637b9588A1607d47238F4961A0673D418c92676
9427a77895Q0651m9126j01866a15978k9527l19324g6284H0244b29183B41193B1189
9415A06609J25670e6010k6255H9744a91860b4984B50597q8602a66957m7502b5913
9403e7993A72211a49886p689K1803B43149E093K53514c1034C14337i5260r8511
9392a93771Q5138A7184g4451p2858a5818k33568J22356k677H444c05819G4995
9380D2222J5501d3716J3857j70649J002j05849Q7022o9598j0601C04410e4097
$$ plain form
9368 4786 -173902 -105453 -21857 313407 -140956 -6184 -27853 -42595 136947 985 -62658 311723
9355 100902 -164045 165985 -114753 -107889 279825 184329 99323 64588 8042 -39468 -25654
9344 -25654 -241553 -187372 68367 -74438 18395 -203286 -242029 -490310 5441 -183820 92199
9332 21584 137366 -33444 28966 -179670 -23130 -299733 -164165 -76434 300334 135496 -254217
9320 -133584 -54458 84590 -285505 -334707 -113418 75170 121939 -119592 204502 147974 16299
9308 49943 -30091 -313667 84923 -259718 41773 -39522 86362 209505 -175103 -113422 259227
9296 -137479 14289 -89231 -331474 -50904 292117 -8762 -18558 117305 178576 203847 14718
9284 -182139 -109323 -443733 12525 222597 -133690 9620 47352 -72764 44267 -86917 74701
$$ packed form
9368D786a73902O8449b1857C13407a40956f184k1669j4742A36947I85f2658C11723
9355A00902a64045A65985a14753O864B79825r5496q5006l4735H042c9468J3814
9344b5654k15899N4181F8367g4438A8395b03286l8743k48281E441a83820I2199
9332B1584J15782c3444B8966a79670b3130k76603J35568g6434C00334A35496b54217
9320a33584e4458H4590b85505m9202a13418G5170M6769a19592B04502n6528A6299
9308D9943c0091k83576H4923b59718D1773c9522H6362J23143a75103O1681B59227
9296a37479A4289h9231k42243e0904B92117h762r796A17305O1271K5271A4718
9284a82139P2816l34410A2525K10072a33690I620L7732g2764D4267h6917G4701
$$ plain form
9272 -98450 184603 45034 48452 -133217 114791 -345112 108954 -40872 4267 157504 -199652
9260 76718 28159 188383 -13849 14628 -82000 -89988 -212207 82564 -78329 -204112 -379086
9249 -379086 70200 -65734 -58165 -15056 70748 -263687 103631 252978 -84151 -81879 218082
9237 -231413 -100215 -316353 -18901 67407 106462 56916 -80277 152135 227838 197787 -3636
9225 248015 -102132 -61028 113405 -202827 -239867 94506 110556 249070 41887 -123289 90831
9213 19049 264430 -191606 -464800 -271743 -111838 -110263 -113686 -66809 15663 -63249 -25403
9201 1012 34548 60051 33441 127939 -2723 -113332 -32078 109912 -14772 -169883 33791 -260638
9188 -132179 -216699 -273036 -150040 -141230 16340 160742 8654 -270039 -144725 -71252 -186927
$$ packed form
9272i8450A84603D5034L418a33217A14791c45112A08954d0872D267J53237a99652
9260G6718B8159J60224a3849A4628h2000p988j22219H2564g8329j25783j74974
9249c79086G0200f5734P569a5056G0748b63687A03631J49347h4151K272B18082
9237b31413a00215k16138a8901F7407L9055m9546h0277A52135P5703l0051c636
9225B48015a02132M1104A13405b02827l7040I4506J6050J38514D1887a23289I0831
9213A9049K45381a91606k73194J93057a11838J575l423M6877A5663f3249b5403
9201A012L3536K5503k6610R4498b723j10609c2078A09912a4772j55111C3791b60638
9188a32179q4520n6337J22996Q810A6340J44402H654b70039J25314g1252j15675
$$ plain form
9177 -186927 -37722 -188352 -348743 -195938 -6050 196703 -209611 8806 -205360 -332109 -110158
9165 192397 -395966 -191908 -159731 -180908 -139360 17191 19190 -183855 36175 -268060 -264674
9154 -264674 -79804 120179 -228985 -216963 -85346 148871 -228341 -231344 -39530 -108301 -58308
9143 -58308 -193035 -72249 -476399 -13562 -35292 -227192 3251 -275189 -117101 -56925 -74794
9132 -74794 326428 -330493 15240 -22153 132508 199349 -48948 -262796 377497 69678 -19803
9120 -171391 -110751 -158259 -84386 -62118 27766 -187979 -60554 59589 -203814 5978 62231
9109 62231 152201 158765 -88202 147164 18350 -257156 70506 -9976 -205793 129210 -336874
9097 -65213 44433 48561 -146098 -15783 -41160 -179521 41927 -220726 97091 35483 -199191
$$ packed form
9177a86927c7722j50630j60391J52805f050A96703b09611H806b05360j26749a10158
9165A92397c95966a91908L2177k1177M1548A7191J999a83855C6175b68060L386
9154b64674g9804A20179b28985J2022h5346A48871b28341l003c9530o8771M9993
9143e8308j34727g2249m04150a3562k1730j91900C251b75189a17101e6925j7869
9132g4794C26428c30493A5240b2153A32508O6841d8948k13848C77497F9678a9803
9120a71391O0640m7508P3873K2268B7766a87979f0554E9589b03814E978N6253
9109F2231Q9970O564h8202A47164A8350b57156G0506i976j95817A29210c36874
9097f5213D4433M128a46098a5783k5377j38361D1927b20726I7091C5483a99191
$$ plain form
9085 -257213 -33450 7152 75442 -72454 -101331 -178098 -174299 -228729 -146705 -1511 106455 110453
9073 110453 -25964 11982 181971 61435 -158789 123578 51767 -36857 -5176 90324 -267925
9061 -171515 -104162 201174 -115003 -35344 19616 -267344 82166 -66611 -620476 138251 150997
9050 150997 108975 -56204 -96288 -185920 -83337 41395 178055 -23934 -167764 403488 16046
9038 -37117 -41685 -190760 102319 24310 -112403 134965 -332521 -126672 -211194 -109187 -156196
9027 -156196 247584 41951 73581 -204146 121591 -407264 103029 -293949 -165949 -105399
9017 -105399 2242 -69332 -56813 67981 -59923 17410 -103889 193599 -55572 -92577 -210624
9006 -210624 155587 -30635 -136338 -433230 -249079 -42786 -60844 3179 -271418 43015 80029
$$ packed form
9085b57213c3450G152O8290g2454k8877p6767L799n4430Q2024a511A06455L998
9073A10453b5964A1982J69989F1435a58789A23578E1767c6857e176I0324b67925
9061a71515O7353B01174a15003c5344A9616b67344H2166f6611n53865A38251J2746
9050A50997m2022e6204m0084q9632h3337D1395J36660b3934j43830D03488A6046
9038c7117m568j49075A02319B4310a12403A34965c32521a26672q4522J02007m7009
9027a56196B47584D1951L1630b04146A21591d07264A03029b93949J28000O0550
9017a05399B242f9332J2519F7981e9923A7410a03889A93599e5572l7005j18047
9006b10624A55587c0635j05703k96892J84151d2786j8058C179b71418D3015L7014
$$ plain form
8995 80029 -284929 -82088 283975 -162222 -230123 -26967 25445 41928 -215856 -230946 114843
8983 66479 51341 -187414 -137142 -271512 176617 -100475 147864 124434 -158868 -241226 -220182
8972 -220182 100257 67818 114364 -17013 15491 -33037 -146058 -94341 -348219 -49012 -30656
8961 -30656 239073 76253 104203 -142473 -89453 127772 26747 -1897 -79576 -264355 162826
8949 -191816 -77502 -70905 463507 -215834 22763 58017 206997 -45238 -28172 -271402 62357
8937 -77428 -298120 192732 150208 448314 236572 -239723 -45242 -195678 222965 -54128
8926 109592 -56220 602135 683346 2924416 7442781 9192482 3082628 611384 583663 144306
8915 266048 593621 178732 128401 140766 -240084 102551 149871 436690 40520 31183 -91125
$$ packed form
8995H0029b84929h2088B83975a62222o7901b6967B5445J6483b15856j5090A14843
8983F6479j5138a87414N0272j34370A76617a00475A47864k3430a58868q2358K1044
8972b20182A00257l2439M6546a7013A5491c3037j13021N1717k53878d9012J8356
8961c0656B39073G6253K7950a42473N3020A27772B6747a897p7679j84779A62826
8949a91816g7502O597D63507b15834B2763L5254J48980d5238J7066k43230F2357
8937g7428k20692A92732m2524K98106k11742b39723d5242j50436B22965e4128
8926A09592e6220F02135Q1211K241070M518365J749701C082628F11384k7721A44306
8915B66048L27573A78732n0331J2365b40084A02551M7320K86819D0520r337i1125
$$ plain form
8903 12191 -27547 58797 -22168 96923 -343697 143189 -108288 -64758 -63028 188215 -5942
8891 -294879 107679 -135612 102709 -64860 -39867 -124131 -97207 93616 -124991 -286681 53034
8879 -117258 -330622 -318347 -43470 -87675 39552 81669 -142777 -68794 -138883 -174539 -62344
8867 163546 -262447 -269269 -30499 -18296 34996 -195045 335715 9439 108680 -105026 111129
$$ packed form
8903A2191b7547E8797b2168I6923c43697A43189a08288M3530J730A88215e942
8891b94879A07679a35612A02709f4860K4993q4264K6924I3616a24991j61690E3034
8879a17258k13364J2275d3470m4205C9552M2117a42777f8794p0089l5656f2344
8867A63546b62447o822c0499J2203C4996a95045C35715I439R9241a05026A11129
$$ [...]
##END NTUPLES=NMR SPECTRUM
##END=
