
##TITLE=AC1292_BRARS11103_6524801_OX77LkaJgg
##JCAMPDX= 6.0         $$ Bruker NMR JCAMP-DX V2.0
##DATA TYPE= NMR SPECTRUM
##DATA CLASS= NTUPLES
##ORIGIN= BRUKER
##OWNER= Administrator
$$ 1.72 TOPSPIN		Version 2.1
$$ 2012-07-14 23:40:26.265 -0500  Administrator@TOPSPIN
$$ Compression mode = diff/dup
##.OBSERVE FREQUENCY= 400.02188249412
##.OBSERVE NUCLEUS= ^1H
##.ACQUISITION MODE= SIMULTANEOUS (DQD)
##.ACQUISITION SCHEME= undefined
##.AVERAGES= 64
##.DIGITISER RES= 22
##SPECTROMETER/DATA SYSTEM= spect
##.PULSE SEQUENCE= noesygpps1d.comp
##.SOLVENT NAME= COFFEE_meoh
##.SHIFT REFERENCE= INTERNAL, COFFEE_meoh, 1, 14.96097
##AUDIT TRAIL= $$ (NUMBER, WHEN, WHO, WHERE, PROCESS, VERSION, WHAT)
$$ ##TITLE= Audit trail, TOPSPIN		Version 2.1
$$ ##JCAMPDX= 5.01
$$ ##ORIGIN= Bruker BioSpin GmbH
$$ ##OWNER= Administrator
$$ $$ C:\Bruker\TOPSPIN/data/COFFEE/nmr/AC1292_BRARS11103_6524801_OX77LkaJgg/12/pdata/1/auditp.txt
$$ ##AUDIT TRAIL=  $$ (NUMBER, WHEN, WHO, WHERE, PROCESS, VERSION, WHAT)
(   1,<2012-07-14 23:40:21.609 -0500>,<Administrator>,<TOPSPIN>,<go>,<TOPSPIN 2.1>,
      <created by zg
	started at 2012-07-14 23:28:51.343 -0500,
	POWCHK enabled, PULCHK disabled,
       configuration hash MD5:
       6B 1B 68 BB D9 2E 58 E2 7F 35 AD 54 07 DF 0E 41
       data hash MD5: 64K
       9F 33 52 3D C2 F9 7D AD B2 EF 9B B0 AC B3 AF 6C>)
(   2,<2012-07-14 23:40:24.406 -0500>,<Administrator>,<TOPSPIN>,<proc1d>,<TOPSPIN 2.1>,
      <Start of raw data processing
       efp LB = 0.3 FT_mod = 6 PKNL = 1 PHC0 = 0 PHC1 = 0 SI = 128K 
       data hash MD5: 128K
       28 4D CC 1B 3E 4E 0D 32 44 41 2D 2F CF 04 64 9F>)
(   3,<2012-07-14 23:40:25.515 -0500>,<Administrator>,<TOPSPIN>,<proc1d>,<TOPSPIN 2.1>,
      <pk PHC0 = -1.027222 PHC1 = 0 
       data hash MD5: 128K
       5A B8 E4 ED C4 26 7D 16 4D 6E F7 7F 67 5E C7 D9>)
(   4,<2012-07-14 23:40:25.750 -0500>,<Administrator>,<TOPSPIN>,<proc1d>,<TOPSPIN 2.1>,
      <abs ABSG = 1 
       data hash MD5: 128K
       5D 09 BE 14 32 6D 67 CF 2B AF A0 80 7C 3A B3 F0>)
(   5,<2012-07-14 23:40:25.828 -0500>,<Administrator>,<TOPSPIN>,<proc1d>,<TOPSPIN 2.1>,
      <abs ABSG = 2 
       data hash MD5: 128K
       9D 1D 7D 7C D6 B4 CA 2F A6 4D 41 B1 DC CF E6 8B>)
(   6,<2012-07-14 23:40:25.937 -0500>,<Administrator>,<TOPSPIN>,<proc1d>,<TOPSPIN 2.1>,
      <abs ABSG = 3 
       data hash MD5: 128K
       9D 34 9C E5 4E 44 23 F9 12 BB F4 EE 3D 52 9D 24>)
(   7,<2012-07-14 23:40:26.125 -0500>,<Administrator>,<TOPSPIN>,<proc1d>,<TOPSPIN 2.1>,
      <abs ABSG = 4 
       data hash MD5: 128K
       83 39 6C CB 8C 83 58 EB 87 78 1C 76 35 6D 22 7B>)
(   8,<2012-07-14 23:40:26.187 -0500>,<Administrator>,<TOPSPIN>,<proc1d>,<TOPSPIN 2.1>,
      <abs ABSG = 5 
       data hash MD5: 128K
       AE 6E 03 EA 2B E6 C9 EC 90 10 63 28 2C F4 A4 D3>)
$$ ##END=
$$ 
$$ $$ hash MD5
$$ $$ C8 27 4B 7C D8 0F 44 F5 9B A4 ED 84 41 28 ED CE
##$RELAX= 
##$RELAX= 
##$RELAX= 
##$RELAX= 
##$RELAX= 
##$RELAX= 
##$RELAX= 
##$RELAX= 
$$ Bruker specific parameters
$$ [...]
##$TP07= 0
##$TPNAME0= <>
##$TPNAME1= <>
##$TPNAME2= <>
##$TPNAME3= <>
##$TPNAME4= <>
##$TPNAME5= <>
##$TPNAME6= <>
##$TPNAME7= <>
##$TPOAL= (0..7)
0.5 0.5 0.5 0.5 0.5 0.5 0.5 0.5
##$TPOFFS= (0..7)
0 0 0 0 0 0 0 0
##$TUNHIN= 0
##$TUNHOUT= 0
##$TUNXOUT= 0
##$USERA1= <user>
##$USERA2= <user>
##$USERA3= <user>
##$USERA4= <user>
##$USERA5= <user>
##$V9= 5
##$VALIST= <valist>
##$VCLIST= <CCCCCCCCCCCCCCC>
##$VD= 0
##$VDLIST= <DDDDDDDDDDDDDDD>
##$VPLIST= <PPPPPPPPPPPPPPP>
##$VTLIST= <TTTTTTTTTTTTTTT>
##$WBST= 2048
##$WBSW= 25
##$XGAIN= (0..3)
0 0 0 0
##$XL= 0
##$YL= 0
##$YMAX_a= 10315803
##$YMIN_a= -7744873
##$ZGOPTNS= <>
##$ZL1= 120
##$ZL2= 120
##$ZL3= 120
##$ZL4= 120
##$ABSF1= 14.96097
##$ABSF2= -5.597212
##$ABSG= 5
##$ABSL= 3
##$ALPHA= 0
##$AQORDER= 0
##$ASSFAC= 0
##$ASSFACI= 0
##$ASSFACX= 0
##$ASSWID= 0
##$AUNMP= <proc_prof1d_extract.lims>
##$AXLEFT= 0
##$AXNAME= <>
##$AXNUC= <1H>
##$AXRIGHT= 0
##$AXTYPE= 0
##$AXUNIT= <>
##$AZFE= 0.1
##$AZFW= 0.1
##$BCFW= 0
##$BC_mod= 0
##$BYTORDP= 0
##$COROFFS= 0
##$CY= 15
##$DATMOD= 1
##$DC= 0
##$DFILT= <>
##$DTYPP= 0
##$F1P= 0
##$F2P= 0
##$FCOR= 0.5
##$FTSIZE= 131072
##$FT_mod= 6
##$GAMMA= 0
##$GB= 0
##$INTBC= 1
##$INTSCL= 1
##$ISEN= 128
##$LB= 0.3
##$LEV0= 0
##$LPBIN= 0
##$MAXI= 10000
##$MC2= 0
##$MEAN= 0
##$ME_mod= 0
##$MI= 0
##$NCOEF= 0
##$NC_proc= -2
##$NLEV= 6
##$NOISF1= 0
##$NOISF2= 0
##$NSP= 0
##$NTH_PI= 0
##$NZP= 0
##$OFFSET= 14.96097
##$PC= 1
##$PHC0= -1.027222
##$PHC1= 0
##$PH_mod= 1
##$PKNL= yes
##$PPARMOD= 0
##$PPDIAG= 0
##$PPIPTYP= 0
##$PPMPNUM= 2147483647
##$PPRESOL= 1
##$PSCAL= 4
##$PSIGN= 0
##$PYNMP= <proc.py>
##$REVERSE= no
##$SF= 400.020009648988
##$SI= 131072
##$SIGF1= 0
##$SIGF2= 0
##$SINO= 400
##$SIOLD= 131072
##$SPECTYP= <>
##$SREGLST= <1H.CDCl3>
##$SSB= 0
##$STSI= 131072
##$STSR= 0
##$SW_p= 8223.68421052631
##$SYMM= 0
##$S_DEV= 0
##$TDeff= 65536
##$TDoff= 0
##$TI= <>
##$TILT= no
##$TM1= 0
##$TM2= 0
##$TOPLEV= 0
##$USERP1= <user>
##$USERP2= <user>
##$USERP3= <user>
##$USERP4= <user>
##$USERP5= <user>
##$WDW= 1
##$XDIM= 131072
##$YMAX_p= 381656039
##$YMIN_p= -11337
##$CURPLOT= <Network HP LaserJet P1505>
##$CURPRIN= <$Network HP LaserJet P1505>
##$DFORMAT= <normdp>
##$LAYOUT= <+/1D_H.xwp>
##$LFORMAT= <normlp>
##$PFORMAT= <normpl>
##$SURQMSG= 1
$$ End of Bruker specific parameters
$$ ---------------------------------
##NTUPLES= NMR SPECTRUM
##VAR_NAME=  FREQUENCY,     SPECTRUM/REAL,   SPECTRUM/IMAG
##SYMBOL=    X,             R,               I
##VAR_TYPE=  INDEPENDENT,   DEPENDENT,       DEPENDENT
##VAR_FORM=  AFFN,          ASDF,            ASDF
##VAR_DIM=   131072,        131072,          131072
##UNITS=     HZ,            ARBITRARY UNITS, ARBITRARY UNITS
##FACTOR=    0.0627417313425164, 1,          1
##FIRST=     8223.62146879497, 3134,         -48966
##LAST=      0,             4070,            -48737
##MIN=       0,             -11337,          0
##MAX=       8223.62146879497, 381656039,    0
$$ Real data points
##PAGE= N=1
##DATA TABLE= (X++(R..R)), XYDATA
$$ [...]
63949E50435K9359L3666L8065M3009M9213N7191O7104P8633R0977J03313J15392
63938A256357J27467J39616J51484J62661J72842J81449J87633J90917J91455
63929B761881J89186J83129J71985J55389J34270J10155Q4354N7604L0068J666
63919C879687k7315n5989q3393j08980j32341j52659j68884j80410j87313j90047
63909B592356j89234j85557j79520j71310j61152j49596j37162j23986j10280
63900A184559r6920q4874p4183o4239n5041m7332m1288l6032l0903k6493k3660
63889F03594k2068k0552j8679j7212j6832j7017j6472j4470j1687r644r255r858
63877D19848r905q706p035n859n006l700j902l58N61J310K429L948N702P602R427
$$ y = [550435, 579794, 613460, 651525, 694534, 743747, 800938, 868042, 946675, 1037652, 1140965, 1256357, 1383824, 1523440, 1674924, 1837585, 2010427, 2191876, 2379509, 2570426, 2761881, 2951067, 3134196, 3306181, 3461570, 3595840, 3705995, 3790349, 3847953, 3878021, 3879687, 3852372, 3796383, 3712990, 3604010, 3471669, 3319010, 3150126, 2969716, 2782403, 2592356, 2403122, 2217565, 2038045, 1866735, 1705583, 1555987, 1418825, 1294839, 1184559, 1087639, 1002765, 928582, 864343, 809302, 761970, 720682, 684650, 653747, 627254, 603594, 581526, 560974, 542295, 525083, 508251, 491234, 474762, 460292, 448605, 438961, 429706, 419848, 409943, 401237, 394202, 388343, 383337, 379637, 377735, 377377, 377938, 379248, 381677, 385625, 391327, 398929, 408356]
63862D08356J0794J1704J2690J4151J5862J7371J8603J9755K0826K1592K1929
63851E93633K1909K1621K1050K0079J8602J6703J4702J2804J0735Q003M575R85
63839G65401k236m993p479j0060j3261j7205k0952k3057k3246k2856k3139k3816
63827E73101k3983k3673k3454k2956k1273j8777j7107j6880j6650j4974j2457
63816C60917j0725j0092r461q243p093o610o442o069n654n589n681n484n058m868
63802B63848m987m982m605m160m021m086l992l680l435l380l216k598j663r76
63788B14067j023j794k805l413l226k406j560j137r80p11m41o44j285j599j108
63773A89935l76k32n65n77q6J87k16p57p29k62Mj04j55J14M39L93j62j012j704
$$ y = [408356, 419150, 430854, 443544, 457695, 473557, 490928, 509531, 529286, 550112, 571704, 593633, 615542, 637163, 658213, 678292, 696894, 713597, 728299, 741103, 751838, 759841, 764416, 765401, 763165, 758172, 750693, 740633, 727372, 710167, 689215, 666158, 642912, 620056, 596917, 573101, 549118, 525445, 501991, 479035, 457762, 438985, 421878, 404998, 388348, 373374, 360917, 350192, 340100, 330639, 322396, 315303, 308693, 302251, 296182, 290528, 284939, 279258, 273774, 268716, 263848, 258861, 253879, 249274, 245114, 241093, 237007, 233015, 229335, 225900, 222520, 219304, 216706, 215043, 214067, 213044, 211250, 208445, 205032, 201806, 199400, 197840, 196703, 195723, 195012, 194571, 193927, 192642, 191043, 189935, 189559, 189327, 188762, 188185, 188099, 188286, 188070, 187313, 186584, 186322, 186326, 186222, 186067, 186181, 186620, 187013, 186851, 185839, 184135]
63754A84135j759j095k27K27K44L34P55J145J041N19P5R0N59J241J835K085J938
63737A93142J661J671K103K619K740K416K139K311K651K505J786J236J514K393
63723B22887L175L602L834L827L377K841L033M015M650L839J880N7p79p87n99
63708B58852p65j622k977l938l603k176r37q67j589j922j184L24J818K682K752
63693B44848K320J907J857K076K258K310K426K782L244L460L225K661K017J367
63679B78758O73J08k4K01J77m75j254j271l51Q36J651K002J944J453Q22P26J397
63662B87373K109J944Q39n22j562k149k348k378k643l328l988m067l706l530l649
63647B58395l471k638j571q85o84o88o00j53Q29K077K939L137L139L488M074M445
$$ y = [184135, 182376, 181281, 181054, 181281, 181525, 181859, 182614, 183759, 184800, 185319, 185394, 185484, 186043, 187284, 189119, 191204, 193142, 194803, 196474, 198577, 201196, 203936, 206352, 208491, 210802, 213453, 215958, 217744, 218980, 220494, 222887, 226062, 229664, 233498, 237325, 240702, 243543, 246576, 250591, 255241, 259080, 260960, 261017, 260238, 259451, 258852, 258087, 256465, 253488, 249550, 245947, 243771, 242834, 241967, 240378, 238456, 237272, 237596, 239414, 242096, 244848, 247168, 249075, 250932, 253008, 255266, 257576, 260002, 262784, 266028, 269488, 272713, 275374, 277391, 278758, 279431, 279539, 279515, 279716, 279893, 279418, 278164, 276893, 276542, 277378, 279029, 281031, 282975, 284428, 285250, 285976, 287373, 289482, 291426, 292265, 291743, 290181, 288032, 285684, 283306, 280663, 277335, 273347, 269280, 265574, 262044, 258395, 254924, 252286, 250715, 249830, 249146, 248458, 247858, 247705, 248534, 250611, 253550, 256687, 259826, 263314, 267388, 271833]
63631B71833M525M593M770M989N319N850O344O536O718P458Q728R863J0528J1174
63617C69228J2245J3485J4469J5318J6373J7510J8483J9718K1939K4891K7255
63606E70914K8191K8409K9040K9921K9667K7354K3427J8862J4065R000L929m58
63594H12321l561n244n805n864o097o841p971r370j1348j4235j7679k0741k2752
63581F74813k3715k3866k3255k1958k0317j8635j6877j4851j2561j0184p840n629
63569D75125l720k144o36J062K897M639O217P579Q454Q613Q344Q229Q476Q861
63555E41996R370J0362J1874J3264J4010J4602J6118J8988K2552K5936K8895L1643
63543G59610L4059L5402L4736L1521K5874J8559J0773L731j789n690q215r494
$$ y = [271833, 276358, 280951, 285721, 290710, 296029, 301879, 308223, 314759, 321477, 328935, 337663, 347526, 358054, 369228, 381473, 394958, 409427, 424745, 441118, 458628, 477111, 496829, 518768, 543659, 570914, 599105, 627514, 656554, 686475, 716142, 743496, 766923, 785785, 799850, 808850, 812779, 812321, 808760, 803516, 797711, 791847, 785750, 778909, 770938, 761568, 750220, 735985, 718306, 697565, 674813, 651098, 627232, 603977, 582019, 561702, 543067, 526190, 511339, 498778, 488594, 480754, 475125, 471405, 469261, 468625, 469687, 472584, 477223, 483440, 491019, 499473, 508086, 516430, 524659, 533135, 541996, 551366, 561728, 573602, 586866, 600876, 615478, 631596, 650584, 673136, 699072, 727967, 759610, 793669, 829071, 863807, 895328, 921202, 939761, 950534, 954265, 952476, 946786, 938571, 929077]
63531I29077r462q354p086o880q369j1114j4140j6932j9835k3407k7464l0940
63519G45094l2772l2839l1900l0682k9264k7373k5009k2554k0351j8458j6714
63508D57178j4947j3102j1315r798q583p524o627o187o249o212n448m265l707
63495C53214m211m963m881l858k645j863j544j444j314r50l80O7J73K35P02J454
63479C27792J972K133K373K908L369L432L299L209K903K046Q87o1q08j824l220
63464C50410m467n080n096m774m148l208k222j571j336j272j173j105j234j550
63450C12174j780j556p08N94K028L396M662N793O705P416Q081Q840R726J0811
63436C76182J2339J4553J7492K0959K4558K7679K9571K9697K8114K5399K2200
$$ y = [929077, 919615, 911261, 904175, 897295, 888926, 877812, 863672, 846740, 826905, 803498, 776034, 745094, 712322, 679483, 647583, 616901, 587637, 560264, 535255, 512701, 492350, 473892, 457178, 442231, 429129, 417814, 408016, 399433, 391909, 385282, 379095, 372846, 366634, 361186, 356921, 353214, 349003, 344040, 339159, 335301, 332656, 330793, 329249, 327805, 326491, 325541, 325161, 325228, 325401, 325636, 326338, 327792, 329764, 331897, 334270, 337178, 340547, 343979, 347278, 350487, 353390, 355436, 356323, 356262, 355454, 353630, 350410, 345943, 340863, 335767, 330993, 326845, 323637, 321415, 319844, 318508, 317236, 316063, 314958, 313724, 312174, 310394, 308838, 308130, 308724, 310752, 314148, 318810, 324603, 331308, 338724, 346805, 355645, 365371, 376182, 388521, 403074, 420566, 441525, 466083, 493762, 523333, 553030, 581144, 606543, 628743]
63425F28743J8829J5339J1917R118P651P855R603J2665J6903K1885K6515K9661
63413H16684L1167L1781L1930L1063K8497K4387J9423J3962Q056K156k918o653
63401A029535r016j0091j0206j0379j1815j4695j8041k1104k4185k7681l0999
63390H41323l3109l3789l3525l2488l0391k7412k4408k2002j9951j7738j5325
63379E51185j3056j1079r273p515n667l430n71K628N373P056P916Q796J0161J1623
63365E54147J2634J3503J5189J7969K0862K2700K3484K4154K5371K7011K8743
63354G85767L0470L2095L3275L3550L2385K9293K4357J8582J3162Q315L499j234
63342A043516m860o751p653q758j0303j1821j3251j5046j7340j9873k2684k6122
$$ y = [628743, 647572, 662911, 674828, 683946, 691597, 699452, 709055, 721720, 738623, 760508, 787023, 816684, 847851, 879632, 911562, 942625, 971122, 995509, 1014932, 1028894, 1036950, 1039106, 1036188, 1029535, 1020519, 1010428, 1000222, 989843, 978028, 963333, 945292, 924188, 900003, 872322, 841323, 808214, 774425, 740900, 708412, 678021, 650609, 626201, 604199, 584248, 566510, 551185, 538129, 527050, 517777, 510262, 504595, 501165, 500594, 503222, 508595, 515651, 523567, 532363, 542524, 554147, 566781, 580284, 595473, 613442, 634304, 657004, 680488, 704642, 730013, 757024, 785767, 816237, 848332, 881607, 915157, 947542, 976835, 1001192, 1019774, 1032936, 1041251, 1044750, 1043516, 1038656, 1031905, 1024252, 1015494, 1005191, 993370, 980119, 965073, 947733, 927860, 905176, 879054]
63330H79054k9961l3125l4618l4423l3218l1523k9355k6551k3142j9427j5736
63319E67975j2172q716n672l819l827n534q104j0778j3278j5454j6980j7445j6623
63306D29573j4628j2021r674q246p696p452p046o411n708n151m921m906m663l961
63292C27089l290l312l877m196l929l493l151k592j773j394j944k779k852k081
63278B86426j290j076j315j695k040k100j616p35J6K69O8l91q89j109q71m53l46
63261B70853o28r58j083j020p27j92K70L10K59Q38J999K697K259J318R08J081
63245B78184J096O46J64PP9K60O10R56Q28J58l34J53J551K947L546L381L061K948
63227C00241K806K291J574J269J654K274K474K187J934K163K775L333L528L410
$$ y = [879054, 849093, 815968, 781350, 746927, 713709, 682186, 652831, 626280, 603138, 583711, 567975, 555803, 547087, 541415, 537596, 533769, 528235, 520131, 509353, 496075, 480621, 463641, 446196, 429573, 414945, 402924, 393250, 385004, 377308, 369856, 362810, 356399, 350691, 345540, 340619, 335713, 331050, 327089, 323799, 320487, 316610, 312414, 308485, 304992, 301841, 299249, 297476, 296082, 294138, 291359, 288507, 286426, 285136, 284060, 282745, 281050, 279010, 276910, 275294, 274559, 274575, 274844, 274912, 274521, 273632, 272523, 271652, 271199, 270853, 270225, 269267, 268184, 267164, 266437, 266245, 266515, 266825, 267084, 267922, 269921, 272618, 274877, 276195, 277103, 278184, 279280, 279926, 280090, 280097, 280176, 280436, 281046, 282002, 282830, 282988, 282654, 282807, 284358, 287305, 290851, 294232, 297293, 300241, 303047, 305338, 306912, 308181, 309835, 312109, 314583, 316770, 318704, 320867, 323642, 326975, 330503, 333913]
63213C33913L291L383L565L518L147K720K535K633K864L006K797K191J774K380
63199C73717L908N042M781L908M122N865P917R186R959J0966J2134J2915J3374
63186D77794J4124J5429J6930J8267J9436K0553K1535K2115K2131K1874K2032
63175F92220K2942K3835K3490K1772J9934J8991J8477J7393J5711J4116J2621
63164I01502J0480P337L560n51n086r953j4748j9330k3780k7676l0168l1069l1112
63151G29406l0835k9981k8311k6283k4356k2306j9833j7351j5476j4120j2712
63140D87842j1032r300p741o523n880n785n725n256m443l420k021l60P63Q50N87
63125D22556Q99J509J549J232J690L136M475N032N406O106O574O299N867N972
$$ y = [333913, 337204, 340587, 344152, 347670, 350817, 353537, 356072, 358705, 361569, 364575, 367372, 369563, 371337, 373717, 377625, 382667, 387448, 391356, 395478, 401343, 409260, 418446, 428405, 439371, 451505, 464420, 477794, 491918, 507347, 524277, 542544, 561980, 582533, 604068, 626183, 648314, 670188, 692220, 715162, 738997, 762487, 784259, 804193, 823184, 841661, 859054, 874765, 888881, 901502, 911982, 919319, 922879, 922328, 917242, 907289, 892541, 873211, 849431, 821755, 791587, 760518, 729406, 698571, 668590, 640279, 613996, 589640, 567334, 547501, 530150, 514674, 500554, 487842, 476810, 467510, 459769, 453246, 447366, 441581, 435856, 430600, 426157, 422737, 420716, 420356, 421119, 421969, 422556, 423455, 424964, 426513, 427745, 429435, 432571, 437046, 442078, 447484, 453590, 460164, 466463, 472330, 478302]
63111D78302O143N597M762M773N657O236N845N183N109N509N750N655N500N410
63097E55431N275N081M933M804M564M298M274M528M635M117K951J559K52j059
63083F05643k503l889m972n888o896p772p974p440o748o367o154n870n592n366
63069E22212m904m090l372l116k879j997o01N03Q90Q04N34J63M8P82K398M143
63053E11518N309N964O554P213P794Q309Q973R848J0684J1155J1174J1050J1230
63040F26775J1781J2244J2251J2043J1951J1661J0674R409Q998R698J0328R753
63028G57566Q259O877N916M889L549K150Q77l10j289j844k145k549k975k905k088
63013G73978p45Q96K759M588O138P754J0169J3491J6939J9934K2851K6290L0023
$$ y = [478302, 484445, 490042, 494804, 499577, 505234, 511470, 517315, 522498, 527607, 533116, 538866, 544521, 550021, 555431, 560706, 565787, 570720, 575524, 580088, 584386, 588660, 593188, 597823, 601940, 604891, 606450, 606702, 605643, 603140, 599251, 594279, 588391, 581495, 573723, 565749, 558309, 551561, 545194, 539040, 533170, 527578, 522212, 517308, 513218, 509846, 506730, 503851, 501854, 501253, 501756, 502646, 503450, 503984, 504147, 504195, 504977, 507375, 511518, 516827, 522791, 529345, 536558, 544352, 552661, 561634, 571482, 582166, 593321, 604495, 615545, 626775, 638556, 650800, 663051, 675094, 687045, 698706, 709380, 718789, 727787, 737485, 747813, 757566, 765825, 772702, 778618, 783507, 787056, 789206, 790083, 789773, 788484, 786640, 784495, 781946, 778971, 776066, 773978, 773233, 774129, 776888, 781476, 787614, 795368, 805537, 819028, 835967, 855901, 878752, 905042, 935065]
63000I35065L3154L5145L6234L7049L8125L9537M0740M1024M0389L9643L9308
62989A355413L8871L7632L5885L4487L3480L1958K9261K5458K0500J3861N523
62978A662329l424j1818j9650k7599l5687m3046m8917n3221n6120n7653n7934
62967A247260n7258n5740n3191m9573m5408m1397l7760l4132l0210k6354k3406
62956G92831k1819k1033k0054j8659j7654j7625j7908j7330j5813j4496j4242
62945E96198j4664j4889j4654j4202j3620j2787j1765j0749r760q800q109p860
62933D54339p702p101o119n401n310n404m988l920k695j889j611j509j241r00
62919C98549q61j192j496j487j344j223p60L77J638J938R24o05j612j721j127
$$ y = [935065, 968219, 1003364, 1039598, 1076647, 1114772, 1154309, 1195049, 1236073, 1276462, 1316105, 1355413, 1394284, 1431916, 1467801, 1502288, 1535768, 1567726, 1596987, 1622445, 1642945, 1656806, 1662329, 1658905, 1647087, 1627437, 1599838, 1564151, 1521105, 1472188, 1418967, 1362847, 1305194, 1247260, 1190002, 1134262, 1081071, 1031498, 986090, 944693, 906933, 872801, 842591, 816237, 792831, 771012, 749979, 729925, 711266, 693612, 675987, 658079, 640749, 624936, 610440, 596198, 581534, 566645, 551991, 537789, 524169, 511382, 499617, 488868, 479108, 470308, 462199, 454339, 446637, 439536, 433417, 428016, 422706, 417302, 412314, 408394, 405699, 403810, 402199, 400690, 399449, 398549, 397688, 396496, 395000, 393513, 392169, 390946, 390186, 390563, 392201, 394139, 395063, 394458, 392846, 391125, 389998]
62904C89998k30M60M81j21p91j076r47m35N69J955L310M444N485O190N826M280
62888D19398K693K237K620K561J489K9j110j835k278k474k635l083l688l927l652
62873D06345l298l145k990k778k842l217l294k729k172k464l406l953l477k360
62859C64220j428j228j751k467k651j981q10L61J353K027J964R91j52m09L35J166
62843C59540J375J183J100J096P74K0q53j401j338p36l7L16L43L52L23q6p87j095
62825C60089o03K04N83M58J90j24o23j071r76l91qk60p94r66n96J29J032J909
62807C58182K194J303n37k029j910l72R66Q04l61r48l81K65o4q98j043l92N4k15
62789C54618n97n61n19r88j607j644j032k12P58K223M127N773O569O597O373O366
$$ y = [389998, 389768, 390228, 390709, 390588, 389797, 388721, 387774, 387339, 387908, 389863, 393173, 397617, 403102, 409292, 415118, 419398, 422091, 424328, 426948, 429509, 430998, 431027, 429917, 428082, 425804, 423330, 420695, 417612, 413924, 409997, 406345, 403047, 399902, 396912, 394134, 391292, 388075, 384781, 382052, 379880, 377416, 374010, 370057, 366580, 364220, 362792, 361564, 359813, 357346, 354695, 352714, 351904, 352265, 353618, 355645, 357609, 358600, 358448, 358039, 358374, 359540, 360915, 362098, 363198, 364294, 365068, 365088, 364235, 362834, 361496, 360760, 360723, 361039, 361382, 361734, 362057, 361971, 361184, 360089, 359486, 359690, 360273, 360731, 360921, 360797, 360174, 359103, 358127, 357736, 357728, 357468, 356674, 355708, 355112, 355241, 356273, 358182, 360376, 361679, 361142, 359113, 357203, 356831, 357797, 358601, 358240, 357292, 356911, 357176, 357112, 356214, 355171, 354779, 354833, 354618, 354021, 353460, 352941, 351953, 350346, 348702, 347670, 347458, 348216, 350439, 354566, 360339, 366908, 373505, 379878, 386244]
62773C86244O758P348P652P351O699O195N879N291M151K681J129n52k314l643
62759D40869m040l696l389l685m448n114n325n273n485o177o860o800n928n028
62745C69621m818n089n114m639m053l586k946j918r22n55p76r60p41m00l01k85
62729C32518P9Q34J560J988K349L004L907M649M956N038N391O314P523Q332Q390
62714C96832Q192Q605R853J1311J2525J3915J6078J8768K1187K3156K5280K7958
62702E93660L0896L3845L7131M1117M5593N0039N4161N7826O0922O3578O6103
62691A134871O8222O8906O7449O4396O0667N6067M9458M0326K9380J7556N145
62680A662443p762k0642l2695m3310n2118n8994o4121o7738o9655o9484o7497
$$ y = [386244, 393002, 400350, 408002, 415353, 422052, 428247, 434126, 439417, 443568, 446249, 447378, 446826, 444512, 440869, 436829, 433133, 429744, 426059, 421611, 416497, 411172, 405899, 400414, 394237, 387377, 380577, 374649, 369621, 364803, 359714, 354600, 349961, 345908, 342322, 339376, 337458, 336536, 335981, 335205, 334245, 333504, 333104, 332803, 332518, 332597, 333431, 334991, 336979, 339328, 342332, 346239, 350888, 355844, 360882, 366273, 372587, 380110, 388442, 396832, 405024, 413629, 423482, 434793, 447318, 461233, 477311, 496079, 517266, 540422, 565702, 593660, 624556, 658401, 695532, 736649, 782242, 832281, 886442, 944268, 1005190, 1068768, 1134871, 1203093, 1271999, 1339448, 1403844, 1464511, 1520578, 1570036, 1610362, 1639742, 1657298, 1662443, 1654681, 1634039, 1601344, 1558034, 1505916, 1446922, 1382801, 1315063, 1245408, 1175924, 1108427]
62669A108427o4768o2089n9209n5517n1093m6632m2591l8886l5273l1695k8292
62658E92382k5380k3190k1455j9491j7029j4623j2906j1711j0502r346q815q925
62646D09009q865p978o462m983m005l656l856m281m480m274l853l350k619j588
62632C44759n82k3m7m78j049j457j522j489j857k704l355l074j994r99p15q80
62616C22534p86j11P35J089P44J77k1J79L44L23M54R38J345J181N87J02j01k58
62598C29455l69p3P40J665K298K655K912L018K903K751K857L255L701L871L514
62583C65153K609J566J018J161J466J229K70j086k448l544m163m300m256m270
62569C50405m196l857l518l512l557l087k205j655j670j626j116o80q80j265j010
$$ y = [1108427, 1043659, 981570, 922361, 866844, 815751, 769119, 726528, 687642, 652369, 620674, 592382, 567002, 543812, 522357, 502866, 485837, 471214, 458308, 446597, 436095, 426749, 417934, 409009, 400144, 392166, 385704, 380721, 376716, 373060, 369204, 364923, 360443, 356169, 352316, 348966, 346347, 344759, 344177, 344154, 344107, 343629, 342580, 341123, 339601, 338112, 336255, 333551, 330196, 327122, 325128, 324129, 323414, 322534, 321748, 321637, 322372, 323461, 324205, 324382, 324361, 324540, 324884, 325207, 325661, 326599, 327944, 329125, 329712, 329814, 329713, 329455, 329086, 329013, 329753, 331418, 333716, 336371, 339283, 342301, 345204, 347955, 350812, 354067, 357768, 361639, 365153, 367762, 369328, 370346, 371507, 372973, 374202, 374472, 373386, 370938, 367394, 363231, 358931, 354675, 350405, 346209, 342352, 338834, 335322, 331765, 328678, 326473, 324818, 323148, 321522, 320406, 319726, 318846, 317581, 316571]
62554C16571j48N98R72J314J565J162J11o50m65J53L54K30N45J470K258K189J415
62537C29644P40Q36J643K463K620K221K077K710L695M299M490M885N756O695P346
62522C82120P996R157J0892J2870J4890J7042J9449K2062K4769K7471L0093L2633
62510F11444L5142L7556L9548M0702M0868M0205L8816L6404L2539K7269K1304
62499A001797J5406R643L485l352j0302j6298k0573k3146k4601k5500k5848k5134
62487H55577k2968j9665j5954j2152q078l815o7K617M623O765R233J1446J2804
62474H20366J3095J2298J0429P677M261K43m221q607j2437j5893j9476k3154k6340
62461G58241k8655l0123l0646l0089k8866k7721k6666k4932k2269j9471j7170
$$ y = [316571, 316423, 317021, 317993, 319307, 320872, 322034, 322145, 321495, 321030, 321183, 321537, 321767, 322312, 323782, 326040, 328229, 329644, 330384, 331220, 332863, 335326, 337946, 340167, 342244, 344954, 348649, 352948, 357438, 362323, 368079, 374774, 382120, 390116, 399273, 410165, 423035, 437925, 454967, 474416, 496478, 521247, 548718, 578811, 611444, 646586, 684142, 723690, 764392, 805260, 845465, 884281, 920685, 953224, 980493, 1001797, 1017203, 1026846, 1030331, 1026979, 1016677, 1000379, 979806, 956660, 932059, 906559, 880711, 855577, 832609, 812944, 796990, 784838, 776760, 772945, 772878, 775495, 780118, 786883, 796116, 807562, 820366, 833461, 845759, 856188, 863865, 868126, 868369, 864148, 855541, 843104, 827211, 807735, 784581, 758241, 729586, 699463, 668817, 638728, 609862, 582141, 555475, 530543, 508274, 488803, 471633]
62450D71633j5020j2656j0651r594q835p225m781k703j764j513j109j90J055K136
62436C98783K561K352K177K504K892K657J902J144K80j128k771l825m252m777
62422D00499n469n550m886m471m852n211m710l811l352l101k291j048k66l06p00
62407C50475r59r31n45R3M93K92j44j83J77M63N39O07O26M88N95J497K882L727
62389C60192L559K974K794L241M058M840N170M952M681M912N507N958O385P376
62375D26599Q866J0032J0537J0980J1778J2469J2679J2995J4132J5812J7198J8087
62363E82164J9031K0571K2949K6190K9961L3651L7132M1004M5524M9736N2535
62352I60448N4206N5787N6987N5977N1680M5259L8683L2401K5296J6609P189j302
$$ y = [471633, 456613, 443957, 433306, 423712, 414877, 407652, 402871, 400168, 398404, 396891, 395782, 395592, 396647, 398783, 401344, 403696, 405873, 408377, 411269, 413926, 415828, 416972, 417252, 416124, 413353, 409528, 405276, 400499, 395030, 389480, 384594, 380123, 375271, 370060, 365350, 361539, 358187, 355086, 352795, 351747, 351481, 351175, 350475, 349516, 348585, 348040, 348133, 348626, 348918, 348774, 348591, 348768, 349231, 349770, 350377, 351003, 351491, 352086, 353583, 356465, 360192, 363751, 366725, 369519, 372760, 376818, 381658, 386828, 391780, 396461, 401373, 406880, 412838, 419223, 426599, 435465, 445497, 456034, 467014, 478792, 491261, 503940, 516935, 531067, 546879, 564077, 582164, 601195, 621766, 644715, 670905, 700866, 734517, 771649, 812653, 858177, 907913, 960448, 1014654, 1070441, 1127428, 1183405, 1235085, 1280344, 1319027, 1351428, 1376724, 1393333, 1400522, 1399220]
62340A399220q026j3646j9492k6136l2733l7879m0949m2427m3003m2784m1582
62329A050563l9561l7177l4606l1641k8242k4872k2149k0307j9145j8452j8300
62318G56111j8768j9552k0008j9790j9234j8991j9294j9727j9662j8805j7373
62307E44907j5875j4682j3647j2181r903p262n285m652n039n427m958l559j883
62294D40554o52qM99J219J929K237K275K548L137L541L438L152L098L171L039
62279D73177K808K854L193L471L612L990M809N725O300O574O876P357Q007Q971
62265E47724J0497J2591J5064J7926K1393K5425K9587L3564L7535M1795M6226
62254H39327N0429N4204N7448N9707O0255N8736N5352N0393M3926L6212K7959
$$ y = [1399220, 1391194, 1377548, 1358056, 1331920, 1299187, 1261308, 1220359, 1177932, 1134929, 1092145, 1050563, 1011002, 973825, 939219, 907578, 879336, 854464, 832315, 812008, 792863, 774411, 756111, 737343, 717791, 697783, 677993, 658759, 639768, 620474, 600747, 581085, 562280, 544907, 529032, 514350, 500703, 488522, 478619, 471357, 466072, 461420, 456381, 450954, 445996, 442437, 440554, 439902, 439894, 440393, 441612, 443541, 445778, 448053, 450601, 453738, 457279, 460717, 463869, 466967, 470138, 473177, 475985, 478839, 482032, 485503, 489115, 493105, 497914, 503639, 509939, 516513, 523389, 530746, 538753, 547724, 558221, 570812, 585876, 603802, 625195, 650620, 680207, 713771, 751306, 793101, 839327, 889756, 943960, 1001408, 1061115, 1121370, 1180106, 1235458, 1285851, 1329777, 1365989, 1393948]
62243A393948J9799J1707L237n734j4814k3417l1041l7380m2622m7486n2428n6761
62231A117008n9020n8414n5586n1807m7776m3526l9070l4692l0641k6934k3555
62220F45987k0609j8197j6265j4630j3075j1463r851q481p516o812o107n382m886
62207E02713m679m413l750k840k130j752j359o71J29O69Q66Q86Q39Q52J287K428
62191D89075L955N192N950O665P529Q113Q164Q262R013J0009J0300R805R377R459
62177F00868R434Q663P496O768O746P121P819R176J1421J4356J7675K1273K5159
62164G53975K9246L3318L7052M0051M1924M2473M1715L9753L6583L2085K6276
62153A154451J9589J2769O285Oo346j2501j7787k2000k5697k9460l3110l5945
$$ y = [1393948, 1413747, 1425454, 1428691, 1422957, 1408143, 1384726, 1353685, 1316305, 1273683, 1226197, 1173769, 1117008, 1057988, 999574, 943988, 892181, 844405, 800879, 761809, 727117, 696476, 669542, 645987, 625378, 607181, 590916, 576286, 563211, 551748, 541897, 533416, 525900, 519088, 512981, 507599, 502713, 498034, 493621, 489871, 487031, 484901, 483149, 481790, 481119, 481248, 481917, 482783, 483669, 484508, 485360, 486647, 489075, 493030, 498222, 504172, 510837, 518366, 526479, 534643, 542905, 551918, 561927, 572227, 582032, 591409, 600868, 610302, 618965, 626461, 633229, 639975, 647096, 654915, 664091, 675512, 689868, 707543, 728816, 753975, 783221, 816539, 853591, 893642, 935566, 978039, 1019754, 1059507, 1096090, 1128175, 1154451, 1174040, 1186809, 1193094, 1193100, 1186754, 1174253, 1156466, 1134466, 1108769, 1079309, 1046199, 1010254]
62141A010254l7482l7706l6716l4512l1246k7480k3984k1138j8591j5674j2294
62130G13431r161o989n676m690l951l804m091m042l201j846k26J910M572P060
62116F79296Q858J0463J2587J4921J6537J7182J7264J6649J4609J1184P631N079
62104H32260L424K065J021N78K24j176m060p566j0447j2260j3407j4226j4361
62091G62069j3208j0779p884n278k934m35K231M682O882R185J1594J3550J4827
62078G84502J6097J8110K0632K2726K3943K4738K5698K6869K7919K8640K9030
62067A048904K9183K9231K9324K9407K9226K8669K8085K7969K8330K8441K7405
62056A364174K4826K0942J6216J1063N890J065l414p959j2820j7612k1769k5373
$$ y = [1010254, 972772, 935066, 898350, 863838, 832592, 805112, 781128, 759990, 741399, 725725, 713431, 704270, 697281, 691605, 686915, 682964, 679160, 675069, 671027, 667826, 665980, 665754, 667664, 672236, 679296, 688154, 698617, 711204, 726125, 742662, 759844, 777108, 793757, 808366, 819550, 827181, 832260, 835684, 837749, 838770, 839348, 839572, 838396, 834336, 826770, 816323, 804063, 790656, 776430, 762069, 748861, 738082, 730198, 724920, 721986, 721551, 723782, 728464, 735346, 744531, 756125, 769675, 784502, 800599, 818709, 839341, 862067, 886010, 910748, 936446, 963315, 991234, 1019874, 1048904, 1078087, 1107318, 1136642, 1166049, 1195275, 1223944, 1252029, 1279998, 1308328, 1336769, 1364174, 1389000, 1409942, 1426158, 1437221, 1443111, 1444176, 1440762, 1432803, 1419983, 1402371, 1380602, 1355229]
62044A355229k9089l3154l6935l9696m1455m2627m3092m2248m0067l7545l5687
62033I33634l4316l2364k9349k6060k3547k1816j9956j7478j4929j3054j1807
62022F88958j0655r444q547q189q177q325q718r333r805r718q992p846o600n619
62008E68990n134m967m633l897k971j957n22J474L362M290M382M559N145N302
61994E73423M277K610J496J174P46m93k218l791n152o543p782q492q823r314j0039
61979E21079j0398r910q780p549o596o080n996o020n713n072m548m280l791k748
61965D33598j594r65r15j075j296j578j696j485j263j347j447j080m18L3L56J022
61949D18850J891K378K609L408M852N955O227O549P843R631J0833J1380J2143
$$ y = [1355229, 1326140, 1292986, 1256051, 1216355, 1174900, 1132273, 1089181, 1046933, 1006866, 969321, 933634, 899318, 866954, 837605, 811545, 787998, 766182, 746226, 728748, 713819, 700765, 688958, 678303, 668859, 660312, 652123, 643946, 635621, 626903, 617570, 607765, 598047, 589055, 581209, 574609, 568990, 563856, 558889, 554256, 550359, 547388, 545431, 544909, 546383, 549745, 554035, 558417, 562976, 568121, 573423, 577700, 580310, 581806, 582980, 583726, 583233, 581015, 577224, 572072, 565529, 557747, 549255, 540432, 531118, 521079, 510681, 500771, 491991, 484442, 477846, 471766, 465770, 459750, 454037, 448965, 444417, 440137, 436346, 433598, 432004, 431039, 430124, 429049, 427753, 426175, 424479, 422994, 421731, 420384, 418937, 417857, 417439, 417472, 417828, 418850, 420741, 423119, 425728, 429136, 433988, 439943, 446170, 452719, 460562, 470193, 481026, 492406, 504549]
61936E04549J3560J5187J6470J7190J7253J6692J5933J5428J4980J3909J1954
61925F73105R624P580N983M568L006J104j141l480n498o850p441p469p280o955
61911F58856o035l926p32K621N218O885P996Q968J0089J1416J2456J2339J0638
61898G36789P734M210L73l328o083p633q854j0692j2755j3855j3727j3373j3595
61885F45211j4020j3825j2765j1235r797q931q912r590j0455j0978j0897j0299
61873E13507r660r529r804r586q222o252m763m023l395k443j334j23J499L499
61859D49371N279O501P593R073J0869J2661J4436J6385J8553K0868K3253K5500
61847F20342K7303K8565K9399K9761K9491K8663K7465K5610K2443J7863J2669
$$ y = [504549, 518109, 533296, 549766, 566956, 584209, 600901, 616834, 632262, 647242, 661151, 673105, 682729, 690309, 696292, 700860, 703866, 704970, 703829, 700349, 694851, 688001, 680560, 673091, 665811, 658856, 652821, 648895, 648163, 650784, 656002, 662887, 670883, 679851, 689940, 701356, 713812, 726151, 736789, 744523, 748733, 749106, 745778, 739695, 732062, 723208, 712516, 699761, 685906, 672179, 658806, 645211, 631191, 617366, 604601, 593366, 583569, 574638, 565726, 556136, 545681, 534703, 523806, 513507, 503847, 494318, 484514, 474928, 466706, 460454, 455691, 451668, 448273, 445830, 444496, 444373, 445872, 449371, 454650, 461151, 468744, 477817, 488686, 501347, 515783, 532168, 550721, 571589, 594842, 620342, 647645, 676210, 705609, 735370, 764861, 793524, 820989, 846599, 869042, 886905, 899574]
61836H99574P793L514l55l976p305j0038j1558j1409r928p929n685k820O62L972
61822H44512O493Q402R946J0733J0258Q525N664J567l505q513j2571j5809j8698
61809H47004k1102k2741k4031k5453k6422k5872k3897k1740k0136j8609j6666
61798F00335j4689j3194j1951j0450q747p329o409n771n218m750m406m136l822
61785D99463l340k678k084j965k499l372m001m030l639l317l286l183k488j259
61771D58322j39L52K89K3j92j50L30J061J534J579J689K317L245L969M359M497
61755D83085M249L573K906K650K551K225J974K285K681K125N71p56j025q73j358
61740E06863k442l196l075k497k147k195k203j647n30M92P26J67m82n14J63J068
$$ y = [899574, 907367, 910881, 910526, 906550, 899245, 889207, 877649, 866240, 856312, 848383, 842698, 839878, 840540, 844512, 851005, 859407, 869353, 880086, 890344, 898869, 904533, 906100, 902595, 894082, 881511, 865702, 847004, 825902, 803161, 779130, 753677, 727255, 701383, 677486, 655746, 635610, 617001, 600335, 585646, 572452, 560501, 550051, 541304, 533975, 527566, 521795, 516577, 511827, 507421, 503285, 499463, 496123, 493445, 491361, 489396, 486897, 483525, 479524, 475494, 471855, 468538, 465252, 462069, 459581, 458322, 458183, 458535, 458824, 458847, 458655, 458505, 458835, 459896, 461430, 463009, 464698, 467015, 470260, 474229, 478588, 483085, 487334, 490907, 493813, 496463, 499014, 501239, 503213, 505498, 508179, 510304, 510875, 510119, 509094, 508221, 506863, 504421, 501225, 498150, 495653, 493506, 491311, 489108, 487461, 486931, 487423, 488149, 488316, 487834, 487320, 487483, 488551]
61724D88551J633J692J670K135L067L770L763L449L491L821L779L083K102J313
61710E27319R69J176J647J587M86r45j452q59k24k68n42m47k54n25j190j738j906
61693E22834j731j342j045j198j628j736j516j861l313n064n901n690n223m899
61679D80687m376l425k392j676j279j027r03j030j455j999k270j996j443j184
61665D54232j306j244o20J48M94M69M28L52J5m25n88m82l95k94J15Q24J525K104
61647D55352K658L086L137K871K615K470K258J945J720J658J651J633J485R41
61633D85480l8r12j153j018j181j721k072j996j866j850j577q87k68j12q0L34
61617D69083R43J067M06o22j360j502j306j326j823k458k775k865l191l834m496
$$ y = [488551, 490184, 491876, 493546, 495681, 498748, 502518, 506281, 509730, 513221, 517042, 520821, 523904, 526006, 527319, 528288, 529464, 531111, 532698, 533184, 532239, 530787, 529928, 529704, 529436, 528894, 528447, 528193, 527668, 526478, 524740, 522834, 521103, 519761, 518716, 517518, 515890, 514154, 512638, 510777, 507464, 502400, 496499, 490809, 485586, 480687, 476311, 472886, 470494, 468818, 467539, 466512, 465609, 464579, 463124, 461125, 458855, 456859, 455416, 454232, 452926, 451682, 451062, 451210, 451704, 452173, 452601, 452953, 452968, 452543, 451955, 451473, 451078, 450784, 450899, 451723, 453248, 455352, 458010, 461096, 464233, 467104, 469719, 472189, 474447, 476392, 478112, 479770, 481421, 483054, 484539, 485480, 485442, 484530, 483377, 482359, 481178, 479457, 477385, 475389, 473523, 471673, 470096, 469209, 468941, 468829, 468749, 469083, 470026, 471093, 471499, 470877, 469517, 468015, 466709, 465383, 463560, 461102, 458327, 455462, 452271, 448437, 443941]
61602D43941n186o208p251p352o260n104m985n418n048l614k296k029k377k346
61588C78467j696j010q58j282j941k484k753k848k899k868k656k388k301k339
61574C48144k138j565j010r41j331j753j862j646j245q05m84l89m80o37q26r67
61558C30065p82o2P91Q73k48j839k666k278j258l20M09J035J345J121O51N13P88
61541C28138R95Q64P74J195J920K224J762J030Q57J488K323K572K018J073K28
61526C49461l44o60q01r90j463k049k147j488o96o50j391k067k028j509j128j128
61510C28922j348j558j545j111k90M80O99L27j96l69q2L49M77J58k42k31K26P07
61492C25373R57J124J308J188M85n00j189j407j310q47J12J076J112R7q02m55
$$ y = [443941, 438755, 432547, 425296, 417944, 411684, 406580, 401595, 396177, 391129, 387515, 385219, 383190, 380813, 378467, 376771, 375761, 374903, 373621, 371680, 369196, 366443, 363595, 360696, 357828, 355172, 352784, 350483, 348144, 346006, 344441, 343431, 342490, 341159, 339406, 337544, 335898, 334653, 333848, 333364, 332975, 332495, 331858, 331032, 330065, 329283, 329221, 330012, 330885, 330637, 328798, 326132, 323854, 322596, 322276, 322685, 323720, 325065, 326186, 326837, 327350, 328138, 329133, 329997, 330771, 331966, 333886, 336110, 337872, 338902, 339759, 341247, 343570, 346142, 348160, 349233, 349461, 349117, 348457, 347656, 346666, 345203, 343154, 341007, 339519, 338823, 338173, 336782, 334715, 332687, 331178, 330050, 328922, 327574, 326016, 324471, 323360, 323070, 323550, 324249, 324576, 324380, 324011, 323929, 324278, 324755, 324913, 324671, 324440, 324666, 325373, 326330, 327454, 328762, 329950, 330435, 329935, 328746, 327339, 326029, 325182, 325294, 326370, 327482, 327579, 326777, 326322]
61476C26322P41J408J046M75L78K55o08j812k278j711q14j53L77Q07P50J47l01
61459C25029q4L21K26r9J62J010J510J100K42l96p65j062j116o37J96Q42J006
61442C27485Q16N18K72K40O24J502K627L442L444K724K040K082K699L064K632
61427C56211J672Q19M24M27O10P83R04J112J430J455P14n58j359r29M37J756K304
61410C68212K055J425Q94P03O78M22k32j119k037k880l387l217k457j725j460
61395C55875j449j283r68p21n29k74o8m5j3K55N71N78L58L39O83J152J517J770
61377C57748J950K028J959J626R59L05L76J366K417K522J771J105R83J043J027
61362C79185J259J905K431K208J271J32p19q94r0J581L462M826N382N207M536
$$ y = [326322, 327063, 328471, 329517, 329992, 330370, 330625, 330017, 328205, 325927, 324216, 323402, 323249, 323626, 324433, 325183, 325330, 325029, 324945, 325266, 325492, 325393, 325555, 326565, 328075, 329175, 329417, 329021, 328256, 327194, 326078, 325441, 325637, 326479, 327485, 328301, 328819, 329091, 329331, 329955, 331457, 334084, 337526, 340970, 343694, 345734, 347816, 350515, 353579, 356211, 357883, 358702, 359126, 359553, 360163, 360946, 361850, 362962, 364392, 365847, 366561, 366003, 364644, 363715, 364152, 365908, 368212, 370267, 371692, 372586, 373289, 373967, 374389, 374157, 373038, 371001, 368121, 364734, 361517, 359060, 357335, 355875, 354426, 353143, 352175, 351454, 350925, 350651, 350583, 350538, 350525, 350780, 351351, 351929, 352287, 352626, 353309, 354461, 355978, 357748, 359698, 361726, 363685, 365311, 366270, 366575, 366951, 368317, 370734, 373256, 375027, 376132, 377115, 378158, 379185, 380444, 382349, 384780, 386988, 388259, 388391, 387672, 386778, 386688, 388269, 391731, 396557, 401939, 407146, 411682]
61347D11682L865L863M804O202P351Q004Q318Q297P713O555N257M351L964L658
61333D93884K815J249m76j551j682j278q87p49q47j021r62m59J73K99k00p51q80
61316D86677p94p85n77J81J130J568J499J691K607L853M825N466O190P274Q529
61301E29334R445R630R286R186R899J0960J1138R609O679L280Q2k742n133o873
61287F03780p785q033q099q304q413p916o808n774n366n199m425k878j267k08
61273E23305M61J188J969K428K413K275K579L708N458P022P505O741N408M313
61259E76773L778L815M506N878P598R192J0425J1288J1690J1447J0458Q721O369
61246F81938L895J999Q55k24j874l686m694m781m825n388o023o088n587m727l307
$$ y = [411682, 415547, 419410, 424214, 430416, 437767, 445771, 454089, 462386, 470099, 476654, 481911, 486262, 490226, 493884, 496699, 497948, 497472, 495921, 494239, 492961, 492074, 491325, 490478, 489457, 488495, 488036, 488209, 488508, 488308, 487557, 486677, 485883, 485098, 484521, 484702, 485832, 487400, 488899, 490590, 493197, 497050, 501875, 507341, 513531, 520805, 529334, 538779, 548409, 557695, 566881, 576780, 587740, 598878, 608487, 615166, 618446, 618528, 615786, 610653, 603780, 595995, 587962, 579863, 571559, 563146, 555230, 548422, 542648, 537282, 532083, 527658, 524780, 523513, 523305, 523766, 524954, 526923, 529351, 531764, 534039, 536618, 540326, 545784, 552806, 560311, 567052, 572460, 576773, 580551, 584366, 588872, 594750, 602348, 611540, 621965, 633253, 644943, 656390, 666848, 675569, 681938, 685833, 687832, 688687, 688463, 686589, 682903, 678209, 673428, 668603, 663215, 657192, 651104, 645517, 640790, 637483]
61231F37483j274N79J222O49j2K98J662L391M655N025M782M728N290N978O042
61216F80498N521M990M493L514K101J176J306J902K150K045J937J589N38q83j782
61201G11095j856j588j255m27J242L272M791N470N816O616Q207J0167J1740J2649
61187G75939J3283J3929J4209J3669J2590J1503J0081P520M107J438N73P67O80
61174H80288J27k03k95r41k375l802m628n313o558q207r501j0125j0364j0445
61160H07658j0317j0167j0562j1668j2700j2610j1314r836r071q779q064o574
61148F85996m813l334k148r99J83J359K544L573L882K996J190o39j866k680l667
61133F81577m957n966n974m929l512k361j378n3J641L146M142N018O276P938R835
$$ y = [637483, 636209, 636788, 638010, 638659, 638647, 638945, 640607, 643998, 648653, 653678, 658460, 663188, 668478, 674456, 680498, 686019, 691009, 695502, 699016, 701117, 702293, 703599, 705501, 707651, 709696, 711633, 713222, 713760, 712877, 711095, 709239, 707651, 706396, 705969, 707211, 710483, 715274, 720744, 726560, 733176, 741383, 751550, 763290, 775939, 789222, 803151, 817360, 831029, 843619, 855122, 865203, 872723, 876830, 878268, 878841, 879608, 880288, 880415, 880212, 879917, 878976, 876601, 872799, 868171, 862858, 856300, 848093, 838592, 828467, 818103, 807658, 797341, 787174, 776612, 764944, 752244, 739634, 728320, 718484, 709413, 700634, 692570, 685996, 681183, 677849, 675701, 674702, 674885, 676244, 678788, 682361, 686243, 689239, 690429, 689790, 687924, 685244, 681577, 676620, 670654, 664680, 659751, 656239, 653878, 652500, 652447, 654088, 657234, 661376, 666394, 672670, 680608, 690443]
61118F90443J1994J4218J5735J6061J5989J6853J8740K0290K0539K0107K0086
61107H81055K0456K0349J9438J8250J7217J6214J5020J3681J2222J0533Q695P015
61095A060145N499L630Q52k834o977j1051j4589j7256j9111k0536k1694k2287
61083I33791k2116k1582k1211k0841j9824j8030j6093j4607j3506j2480j1497
61072G42004j0588r552q233o900n824m697k993q64Q65J733K222L021M038M565
61058G08797M312L888M125N163O426P386Q097Q868R689J0310J0777J1513J2747
61045H12098J4228J5593J6717J7587J8265J9193K1020K3716K6287K7921K9000
61034A041625L0328L1846L2907L3640L4914L7004L9342M1741M4794M8629N2360
$$ y = [690443, 702437, 716655, 732390, 748451, 764440, 781293, 800033, 820323, 840862, 860969, 881055, 901511, 921860, 941298, 959548, 976765, 992979, 1007999, 1021680, 1033902, 1044435, 1053130, 1060145, 1065644, 1069274, 1070126, 1067292, 1060315, 1049264, 1034675, 1017419, 998308, 977772, 956078, 933791, 911675, 890093, 868882, 848041, 828217, 810187, 794094, 779487, 765981, 753501, 742004, 731416, 721864, 713631, 706731, 700907, 696210, 693217, 692353, 693218, 694951, 697173, 700194, 704232, 708797, 713109, 716997, 721122, 726285, 732711, 740097, 748194, 757062, 766751, 777061, 787838, 799351, 812098, 826326, 841919, 858636, 876223, 894488, 913681, 934701, 958417, 984704, 1012625, 1041625, 1071953, 1103799, 1136706, 1170346, 1205260, 1242264, 1281606, 1323347, 1368141, 1416770, 1469130]
61023A469130N5251N7597N9747O1246O1780O2312O4310O8388P4567Q3231R4803
61012B212362J08716J23804J39542J56314J75025J97556K27138K67004L18696
61003C926157L82640M59831N51900O60600P89609R46423J139812J375119J653519
60994A1885610J971261K306995K601566K759312K690616K369422J852948J246508
60986B9684238O54698J64584j48133k34985j20035P7946J92847J01137k21499
60977C0150798p15250j287807j847823k310302k603177k689426k584162k344340
60969A3768511k038481j721456j426915j170835r56982p81966o40073n26082m35370
60960D070351l63461l06451k61476k26355j99112j77869j60757j45896j31932
$$ y = [1469130, 1524381, 1581978, 1641725, 1702971, 1764751, 1827063, 1891373, 1959761, 2034328, 2117559, 2212362, 2321078, 2444882, 2584424, 2740738, 2915763, 3113319, 3340457, 3607461, 3926157, 4308797, 4768628, 5320528, 5981128, 6770737, 7717160, 8856972, 10232091, 11885610, 13856871, 16163866, 18765432, 21524744, 24215360, 26584782, 28437730, 29684238, 30338936, 30503520, 30355387, 30120402, 30000367, 30078313, 30271160, 30372297, 30150798, 29435548, 28147741, 26299918, 23989616, 21386439, 18697013, 16112851, 13768511, 11730030, 10008574, 8581659, 7410824, 6453842, 5671876, 5031803, 4505721, 4070351, 3706890, 3400439, 3138963, 2912608, 2713496, 2535627, 2374870, 2228974, 2097042]
60951B097042j18590j06237r4991q4627p5221o7156o0624n5649n2497n1299n1229
60940A278922n0836m9400m7355m5227m2933m0335l7774l5568l3504l1401k9568
60929H35021k8245k6927k4900k2333k0244j9377j9404j9233j7910j5360j2553
60918F08535j0755j0353j0433r821q325o703n591m959m611m589m803m638l519
60905E19435j696o1Q87J477K127K596K374J596J034J119J460J458J004L69k43
60890E34936p14q90q10q38j264j984k795l731m694n172m929m704n449o950q017
60875D81995q073p762p747p768p355o734o319n900n035l956l279l018k590j736
60861D04723p32K83J501K750L350L035K559K761L437L662L166K730L093M022M780
$$ y = [2097042, 1978452, 1872215, 1777224, 1692597, 1617376, 1550220, 1489596, 1433947, 1381450, 1330151, 1278922, 1228086, 1178686, 1131331, 1086104, 1043171, 1002836, 965062, 929494, 895990, 864589, 835021, 806776, 779849, 754949, 732616, 712372, 692995, 673591, 654358, 636448, 621088, 608535, 597780, 587427, 576994, 567173, 558848, 552145, 546554, 541595, 536984, 532395, 527592, 522954, 519435, 517739, 517678, 518565, 520042, 522169, 524765, 527139, 528735, 529769, 530888, 532348, 533806, 534810, 535179, 534936, 534222, 533332, 532522, 531684, 530420, 528436, 525641, 521910, 517216, 512044, 507115, 502411, 496962, 490012, 481995, 473922, 466160, 458413, 450645, 443290, 436556, 430237, 424337, 419302, 415346, 412067, 409049, 406459, 404723, 403991, 404274, 405775, 408525, 411875, 414910, 417469, 420230, 423667, 427329, 430495, 433225, 436318, 440340, 445120]
60846D45120N125N344N538N421M890M275L831L355K599J701Q90L7j079k257l022
60831D81768l138k685j823r22o20j155j839j815j293j223j779k103j720j314j613
60816D56726k348k951l538m489n591o420p100p846q135p372o099n481n561n118
60802C78677l574j967j454j731j678j093p77j106j404r61j26J51m16j097j156
60787C60288p78o56r08q87j25J047K028K666L064L088K630K159K386L350M369
60772C83721M944N177N248N045M557M222M511N320O052O165N647N025M907N235
60758D55776N173M002K148P96N26P88Q08M52m7n56r00o73K78J451K146K104J414
60741D75686J30j592l211m186m526m704n086n786o735p547p534o456n072m380
$$ y = [445120, 450245, 455589, 461127, 466548, 471438, 475713, 479544, 482899, 485498, 487199, 488089, 488126, 487047, 484790, 481768, 478630, 475945, 474122, 473200, 472580, 471425, 469586, 467771, 466478, 465255, 463476, 461373, 459653, 458339, 456726, 454378, 451427, 447889, 443400, 437809, 431389, 424289, 416443, 408308, 400936, 394837, 389356, 383795, 378677, 375103, 373136, 371682, 369951, 368273, 367180, 366403, 365297, 363893, 362932, 362806, 362957, 362541, 361444, 360288, 359510, 358854, 357946, 357059, 356934, 357981, 360009, 362675, 365739, 368827, 371457, 373616, 376002, 379352, 383721, 388665, 393842, 399090, 404135, 408692, 412914, 417425, 422745, 428797, 434962, 440609, 445634, 450541, 455776, 460949, 464951, 467099, 467895, 468421, 469209, 470017, 470469, 470422, 469866, 468966, 468293, 468571, 470022, 472168, 474272, 475686, 475816, 474224, 471013, 466827, 462301, 457597, 452511, 446725, 439990, 432443, 424909, 418453, 413381, 409001]
60727D09001m295l765k307p96l70r47j365p76N04J546J899J984K515L637M778
60712D11243N312N253N124N304N707O094O393O660O943P353Q098R268J0604J1613
60698E10969J1915J1577J1062J0813J0786J0501R671Q737Q499R168J0078J0460
60686F34236J0312J0282J0751J1365J1546J1201J0668J0057R016P358N517M059
60674G46368K833J116j361m046o367q467j0652j2602j3682j3917j4025j4471j4990
60661F35737j5209j5176j5040j4625j3729j2572j1561j0753r804q501p034n798
60649D95935n042m665m308l621k563j441o00j14J81M05M47O4q61k064k894k782
60633D66077j837q04l21k15K25J338K593L151K795K151J942K201K310J781P75
$$ y = [409001, 404706, 400941, 398634, 397838, 397468, 396521, 395156, 394380, 394884, 396430, 398329, 400313, 402828, 406465, 411243, 416555, 421808, 426932, 432236, 437943, 444037, 450430, 457090, 464033, 471386, 479484, 488752, 499356, 510969, 522884, 534461, 545523, 556336, 567122, 577623, 587294, 596031, 604530, 613698, 623776, 634236, 644548, 654830, 665581, 676946, 688492, 699693, 710361, 720418, 729434, 736792, 742309, 746368, 749201, 750317, 748956, 744910, 738543, 730076, 719424, 706822, 693140, 679223, 665198, 650727, 635737, 620528, 605352, 590312, 575687, 561958, 549386, 537825, 527072, 517268, 508767, 501733, 495935, 490893, 486228, 481920, 478299, 475736, 474295, 473695, 473581, 473762, 474167, 474614, 474678, 473817, 471753, 468859, 466077, 464240, 463436, 463115, 462900, 463125, 464463, 467056, 470207, 473002, 475153, 477095, 479296, 481606, 483387, 484162]
60618D84162j45n88n91n14p78j515k305k509k072j699j956k449k362j665j110
60603D61904j123j311j238j026r28q72q68j279k234l118l242k735k213j829j276
60588D36612n77j27L5L72J064J648J767J782K233L034L604L737L924M767O255
60573D70130P757Q715R305J0288J2159J4600J6933J8913K0798K2768K4689K6397
60561F63452K7681K7884K6027K1751J5850R520L301k944r136j4507j8042j9120
60549G31717j7746j4470j0165n731j715J859N380R338J4014J9278K4678K9757
60537G86194L4277L8212M1575M4190M5460M4391M0185L2963K3756J3742L658n977
60525A142626j4414k0858k4955k6800k6574k4558k1466j8381j6091j4618j3461
$$ y = [484162, 484017, 483429, 482838, 482324, 481546, 480031, 477726, 475217, 473145, 471446, 469490, 467041, 464679, 463014, 461904, 460781, 459470, 458232, 457206, 456278, 455406, 454538, 453259, 451025, 447907, 444665, 441930, 439717, 437888, 436612, 436035, 435908, 435943, 436315, 437379, 439027, 440794, 442576, 444809, 447843, 451447, 455184, 459108, 463875, 470130, 477887, 486602, 495907, 506195, 518354, 532954, 549887, 568800, 589598, 612366, 637055, 663452, 691133, 719017, 745044, 766795, 782645, 792165, 795466, 792522, 783386, 768879, 750837, 731717, 713971, 699501, 689336, 683605, 681890, 683749, 689129, 698467, 712481, 731759, 756437, 786194, 820471, 858683, 900258, 944448, 989908, 1034299, 1074484, 1107447, 1131203, 1144945, 1148603, 1142626, 1128212, 1107354, 1082399, 1055599, 1029025, 1004467, 983001, 964620, 948529, 933911, 920450]
60514I20450j2213j0799r229p350m918j901J393M603P671J0827J4205J7693K1256
60501I51688K5277L0313L6612M3951N1934O0293O8913P7660Q6107R3262R7694
60490A623704R8220R4645Q7833P8962O8738N7325M4906L2182K0132R176j244j2062
60478B202517k3622l5670m8192o1602p5690q8806r8792j04627j06752j05909j02383
60467A350472r6510q9235q1592p3874o5768n7249m8992m1902l6385l2206k8802
60456F97957k5673k2574j9525j6732j4434j2675j1212r741q236o931n957n206
60444E39061m661m471m522m244l246j955j128q94p41m03k29n65j289k103k844
60429E05766l353l461l372l607m322m977n026m582m064l551k858k073j529j327
$$ y = [920450, 908237, 897438, 888209, 880859, 875941, 874040, 875433, 880036, 887707, 898534, 912739, 930432, 951688, 976965, 1007278, 1043890, 1087841, 1139775, 1200068, 1268981, 1346641, 1432748, 1526010, 1623704, 1721924, 1816569, 1904402, 1983364, 2052102, 2109427, 2154333, 2186515, 2206647, 2215823, 2214579, 2202517, 2178895, 2143225, 2095033, 2033431, 1957741, 1868935, 1770143, 1665516, 1558764, 1452855, 1350472, 1253962, 1164727, 1083135, 1009261, 943493, 886244, 837252, 795350, 758965, 726759, 697957, 672284, 649710, 630185, 613453, 599019, 586344, 575132, 565391, 557155, 550224, 544267, 539061, 534400, 529929, 525407, 521163, 517917, 515962, 514834, 513940, 513199, 512796, 512567, 512002, 510713, 508610, 505766, 502413, 498952, 495580, 491973, 487651, 482674, 477648, 473066, 469002, 465451, 462593, 460520, 458991, 457664]
60415D57664j188p97j95K00n0q47j389r57J03O73L48LM84J356J572R80L83L48
60397D58691O29P57N28o9q70j454j482j063m26N24J748K563K377J750J758K321
60381D68282K227J063JJ42J016J446J169Q29R08J425K263L107L419L129K916L173
60365D96515L181K143O46RL90O44J40m21k81K38M56K99L8m18j207j923j987j447
60347D97015q70n52k90J46O83J117J354J426J473J651J990K354K607K678K462
60332E15244J901J226Q21P57P41O79Q39J259J412R22J43l99p70j247j516j076
60316E20936k53J12L9N46K117L927N049N759O922Q723J0786J3167J6363K0386
60302F14579K4555K8196L0906L2217L1650K9186K5024J8776R799j341j2442k1286
$$ y = [457664, 456476, 455679, 455484, 455684, 455634, 454787, 453398, 452441, 452544, 453217, 453565, 453568, 454052, 455408, 456980, 457960, 458343, 458691, 459320, 460077, 460605, 460536, 459666, 458212, 456730, 455667, 455241, 455765, 457513, 460076, 462453, 464203, 465961, 468282, 470509, 471572, 471573, 471715, 472731, 474177, 475346, 476175, 477083, 478508, 480771, 483878, 487297, 490426, 493342, 496515, 499696, 501839, 502485, 502494, 502884, 503528, 503668, 503247, 502966, 503204, 503660, 503959, 503997, 503579, 502372, 500449, 498462, 497015, 496145, 495593, 495303, 495449, 496132, 497249, 498603, 500029, 501502, 503153, 505143, 507497, 510104, 512782, 515244, 517145, 518371, 519192, 519949, 520690, 521369, 522208, 523467, 524879, 525801, 525944, 525545, 524775, 523528, 522012, 520936, 520683, 520795, 520834, 521380, 523497, 527424, 532473, 538232, 545154, 553877, 564663, 577830, 594193, 614579, 639134, 667330, 698236, 730453, 762103, 791289, 816313, 835089, 844888, 843547, 831105, 809819]
60290H09819k7234l0779l2181l1323k8633k5176k1725j8399j5268j2734j0950
60279E55417r397p489n405l929l533l846m085l823l248k736k372j986j522j092
60265E00954o30J54J201J852J543N59k76n11l79l02n64j336k394k934k296j063
60249D93578o46j468k236j607j4R15M54n66j090j032q78p88n50q7M06Q50J441
60232D86682K370L501M415M761M585M260M121M119L946L387K584J857J346Q21
60218E32755K2q21j020k46Q91J482J423J448K006K677K941K949L110L340L268
60203E56225K870K396J862J136M59K98O96J182J349J179Q54O32Q20J438J920J619
60187E76935O29l65r66j311j525j536j497j719k052k001j622j564j939j956j217
$$ y = [809819, 782585, 751806, 719625, 688302, 659669, 634493, 612768, 594369, 579101, 566367, 555417, 546020, 538531, 533126, 529197, 525664, 521818, 517733, 513910, 510662, 507926, 505554, 503568, 502046, 500954, 500324, 500478, 501679, 503531, 505074, 505633, 505357, 504846, 504467, 504165, 503601, 502265, 499871, 496937, 494641, 493578, 492932, 491464, 489228, 487621, 487607, 488522, 488976, 488410, 487320, 486288, 485410, 484622, 484072, 483985, 484391, 485241, 486682, 489052, 492553, 496968, 501729, 506314, 510574, 514695, 518814, 522760, 526147, 528731, 530588, 531934, 532755, 532777, 531956, 530936, 530690, 531581, 533063, 534486, 535934, 537940, 540617, 543558, 546507, 549617, 552957, 556225, 559095, 561491, 563353, 564489, 564948, 565246, 565942, 567124, 568473, 569652, 570506, 571138, 571958, 573396, 575316, 576935, 577564, 577199, 576233, 574922, 573397, 571861, 570364, 568645, 566593, 564592, 562970, 561406, 559467, 557511, 556294]
60172E56294n78r09j610j338R0J520K098K090J964J600Q17O0m3N72J483K349L047
60155E69506L495L682L727L661L357K897K673K775K529J289l50q47N16K632L828
60140F05370L748L467L879M698N108M814M155L603L532M013M452L834J844n22
60126F55995k074k878l882n243n993n538m536l816l269k417j424p15j08Q40J863
60111F16805K300K270K623L587M339M253L867M084M914N586N621N314N137N102
60097F75802M785L850K416R81m2o71j172j635j854j654j119n63l25n54r93j129
60081F76123p16q1L50O49J106J572J552R40M7j064k651m467n625n701n367n438
60065F51229n781n796n523n562o095o727p175p430p345o758o055n905o281o410
$$ y = [556294, 555716, 554807, 553197, 551859, 551949, 553469, 555567, 557657, 559621, 561221, 562038, 562098, 562055, 562627, 564110, 566459, 569506, 573001, 576683, 580410, 584071, 587428, 590325, 592998, 595773, 598302, 599591, 599241, 598394, 598910, 601542, 605370, 609118, 612585, 616464, 621162, 626270, 631084, 635239, 638842, 642374, 646387, 650839, 654673, 656517, 655995, 653921, 651043, 647161, 641918, 635925, 630387, 625851, 622035, 618766, 616349, 614925, 614210, 614102, 614942, 616805, 619105, 621375, 623998, 627585, 631924, 636177, 640044, 644128, 649042, 654628, 660249, 665563, 670700, 675802, 680587, 684437, 686853, 687834, 687792, 687121, 685949, 684314, 682460, 680806, 679687, 679124, 678799, 678245, 677252, 676123, 675407, 675326, 675676, 676325, 677431, 679003, 680555, 681495, 681542, 680478, 677827, 673360, 667735, 662034, 656667, 651229, 645448, 639652, 634129, 628567, 622472, 615745, 608570, 601140, 593795, 587037, 580982, 575077, 568796, 562386]
60051E62386n933n405n313n285m764l972l528l445l126k247j092q1N85Q76R47
60036E20603J164J700K178K102J646J480J844K274K295J882J085j62j578k463
60022E36050k514k295k432k786k943l129l850m827n091m264l076k350k058j683
60008D92752j066n13l26n15q41r53o61j83J52M76J280K510L285K913J832J041
59992E01183Q30O89L23J56O43J602K427K695K394J827J425J472J816K035J947
59977E23464J747J537J071J90o53p48L1R69J295R96P10Q97J318J475J343J415
59961E37057K058L087M066M744N033M748L727K175O32m93j200j736k266k745k971
59946E55916k797k341j986k060k487k844k738k130j477j489k527m024m777m106
$$ y = [562386, 556453, 551048, 545735, 540450, 535686, 531714, 528186, 524741, 521615, 519368, 518276, 518195, 518780, 519656, 520603, 521767, 523467, 525645, 527747, 529393, 530873, 532717, 534991, 537286, 539168, 540253, 540091, 538513, 536050, 533536, 531241, 528809, 526023, 523080, 519951, 516101, 511274, 506183, 501919, 498843, 496493, 494435, 492752, 491686, 491173, 490847, 490332, 489491, 488538, 487877, 487694, 487846, 488322, 489602, 492112, 495397, 498310, 500142, 501183, 502013, 502702, 503025, 503181, 503824, 505426, 507853, 510548, 512942, 514769, 516194, 517666, 519482, 521517, 523464, 525211, 526748, 527819, 528009, 527356, 526608, 526639, 527608, 528903, 529899, 530609, 531506, 532824, 534299, 535642, 537057, 539115, 542202, 546268, 551012, 556045, 560793, 564520, 566695, 567327, 566834, 565634, 563898, 561632, 558887, 555916, 553119, 550778, 548792, 546732, 544245, 541401, 538663, 536533, 535056, 533567, 531040, 527016, 522239, 518133]
59932E18133k573j287o95m03j2L93N96O08N40M29L24L45N16P90J197J750K239
59915E22890K451K552K913L507L898L835L439K819J971J176R07J180J484J540
59901E56562J560J559J108J81l73O8Q84R39R3p20o92K11J558K771L287L036K792
59884E74824L388M653N657N945N885N817N575N028M426L940L417K832K434K185
59870F36006J571L48r93j907k500l135l679l686l219k925l221l720l652k704j410
59855F01174o55p62j210j272p71N6J115K336L219L292L181M332P183J0251J1616
59840F43085J0881R008O752M117J197j287k514k249r76K76L95r85l102m982o596
59825F53020q613j1047j2926j3494j3071j2332j1401j0064q549p427o892o512
$$ y = [518133, 515560, 514273, 513578, 513175, 513163, 513556, 514152, 514760, 515300, 515729, 516053, 516398, 516914, 517704, 518901, 520651, 522890, 525341, 527893, 530806, 534313, 538211, 542046, 545485, 548304, 550275, 551451, 552358, 553538, 555022, 556562, 558122, 559681, 560789, 560970, 560597, 560665, 561549, 562488, 562581, 561861, 561169, 561380, 562938, 565709, 568996, 572032, 574824, 578212, 582865, 588522, 594467, 600352, 606169, 611744, 616772, 621198, 625138, 628555, 631387, 633821, 636006, 637577, 637925, 636932, 635025, 632525, 629390, 625711, 622025, 618806, 615881, 612660, 608940, 605288, 602584, 601174, 600519, 599757, 598547, 597275, 596504, 596560, 597675, 600011, 603230, 606522, 609703, 614035, 621218, 631469, 643085, 653966, 662974, 669726, 673843, 675040, 673753, 671239, 668990, 668014, 668290, 668685, 667700, 664598, 659616, 653020, 644407, 633360, 620434, 606940, 593869, 581537, 570136, 560072, 551523, 544096, 537204, 530692]
59813E30692n786m650l540k999l102l288k953k255j914k112k149j525q29r55j789
59798D90846k424k533k667l131l367k841j943j416j290j041n62l88q45j527j767
59783D63104j383p24k52k71q59j786k525k617k124j603j555j959k347k268j662
59768D39169q04l6M16M88K17k09m44j52O52J528J985K033K230L055M310N242N317
59751D64997M767M291M312M624M701M279L528K754K052J329O04J66K80P89J174
59736E04647J112Q34P86R93R89M06n59j373j749j776j632j374j021o67l89k01
59720D99026j53m12j074j938k550k494j713n81L57Q04R30J107J416J609J544J420
59704D97298J462J568J586J741K377L303L878L858L759M103M727N149N347N576
$$ y = [530692, 524906, 520256, 516716, 513717, 510615, 507327, 504374, 502119, 500205, 498093, 495944, 494419, 493590, 492635, 490846, 488422, 485889, 483222, 480091, 476724, 473883, 471940, 470524, 469234, 468193, 467631, 467243, 466398, 464871, 463104, 461721, 460997, 460745, 460474, 459615, 457829, 455304, 452687, 450563, 448960, 447405, 445446, 443099, 440831, 439169, 438365, 438329, 438745, 439233, 439450, 439241, 438797, 438645, 439297, 440825, 442810, 444843, 447073, 450128, 454438, 459680, 464997, 469764, 474055, 478367, 482991, 487692, 491971, 495499, 498253, 500305, 501634, 502238, 502404, 502684, 503473, 504647, 505759, 506593, 507379, 508372, 509361, 509767, 509208, 507835, 506086, 504310, 502678, 501304, 500283, 499616, 499227, 499026, 498873, 498461, 497387, 495449, 492899, 490405, 488692, 488111, 488468, 489272, 490202, 491309, 492725, 494334, 495878, 497298, 498760, 500328, 501914, 503655, 506032, 509335, 513213, 517071, 520830, 524933, 529660, 534809, 540156, 545732]
59690E45732N619M878L302J678O93J53n32j447k177k453k350j911j142l89k24
59675E49430p22j216j085n84n09j173k003k289k059k021k657l538l765l063k115
59660E20631j616j308m13J083K216K366K103K359L132L667L635L462L480L457
59646E48254L114K584K048J271m4j762l350m403m881n062n315n756n998n482m190
59631E11028k772j823j322r33n27j14L66Q16P77j4j000j299p77j94k72j013j970
59614D98957k782l244l294l110l066l305l509l228k320r97L92J591K546L296L689
59599D81616L335K138P46R8M21J056J338J263J161J143J158J249J402J308O69
59584E00101l55j296j882k218k525k907l308l591l667l650l723l813l653l241
$$ y = [545732, 551351, 556229, 559531, 561209, 561902, 562055, 561523, 560076, 557899, 555446, 553096, 551185, 550043, 549654, 549430, 548708, 547492, 546407, 545823, 545314, 544141, 542138, 539849, 537790, 535769, 533112, 529574, 525809, 522746, 520631, 519015, 517707, 517294, 518377, 520593, 522959, 525062, 527421, 530553, 534220, 537855, 541317, 544797, 548254, 551368, 553952, 556000, 557271, 557227, 555465, 552115, 547712, 542831, 537769, 532454, 526698, 520700, 515218, 511028, 508256, 506433, 505111, 504178, 503651, 503537, 503903, 504719, 505496, 505482, 504482, 503183, 502406, 502212, 501940, 500927, 498957, 496175, 492931, 489637, 486527, 483461, 480156, 476647, 473419, 471099, 470102, 470494, 472085, 474631, 477927, 481616, 484951, 487089, 487835, 487933, 488354, 489410, 490748, 492011, 493172, 494315, 495473, 496722, 498124, 499432, 500101, 499746, 498450, 496568, 494350, 491825, 488918, 485610, 482019, 478352, 474702, 470979, 467166, 463513, 460272]
59570D60272k965l076l270l066k382j478o00L2J64j90n10l32J03J77j66l09J42
59553D42546R08J578K188K914L534L563K922K175K067K827L967M852N432O307
59539D87780P963J0228J2680J5203J7621J9054J8335J5218J0619N498K06m870
59527F15535q724j0440j0115q521o209l515j087L67R18J292J825K122J862J314
59513E76624P43j13j488k949l818m060m151m287m269m185m542n473o293o231n351
59498E20157m385l861l738l765l764l478k623j292j42J16o39j867k797k899k059
59483D82964o19Q44J896K587L291M233N207N804N889N751N742N804N542M787L868
59468E43590L165K559J658N02l86p00p64r70j158p93M21K336M562O613Q049Q790
$$ y = [460272, 457307, 454231, 450961, 447895, 445513, 444035, 443435, 443467, 443631, 443441, 442931, 442599, 442702, 442879, 442713, 442404, 442546, 443454, 445032, 447220, 450134, 453668, 457231, 460153, 462328, 464395, 467222, 471189, 476041, 481473, 487780, 495743, 505971, 518651, 533854, 551475, 570529, 588864, 604082, 614701, 620199, 620405, 615535, 606811, 596371, 586256, 577735, 571526, 568011, 566924, 567291, 568209, 569501, 571326, 573448, 575310, 576624, 577367, 577254, 575766, 572817, 568999, 564939, 560788, 556501, 552232, 548047, 543505, 538032, 531739, 525508, 520157, 515772, 511911, 508173, 504408, 500644, 497166, 494543, 493251, 493109, 493225, 492586, 490719, 487922, 485023, 482964, 482345, 483189, 485085, 487672, 490963, 495196, 500403, 506207, 512096, 517847, 523589, 529393, 534935, 539722, 543590, 546755, 549314, 550972, 551474, 551088, 550388, 549624, 548654, 547496, 546703, 547124, 549460, 554022, 560635, 568684, 577474]
59452E77474R243R876J0757J1672J2525J3291J3792J3770J3074J1509Q770M925
59440G10678P70k801n639q134j0321j1826j2584j2944j2946j2255j0969r801r116
59427E92112q430p229n784m582l541k245o10J291L645O546R504J1934J3948J6096
59413F22655J8547K1123K3840K6538K7982K6342K0972J3151M853k707r016j3467
59401G80813j5301j4191j0494n148L38M112M817K376k259q086j4487k0743k5712
59388F76035k8325k8322k6213k2656j8225j3692j0050p792o425n091l625k589
59376E03030k265k124j518m42P06J693K447K787K587K087J658J460J561K078K775
59361E18520K940K221J371J419K288K988L183L635M966O733Q161R093R764J0210
$$ y = [577474, 586717, 596593, 607350, 619022, 631547, 644838, 658630, 672400, 685474, 696983, 705753, 710678, 711448, 708647, 703008, 694874, 684553, 672727, 660143, 647199, 634253, 621998, 611029, 601228, 592112, 583682, 576453, 570669, 566087, 562546, 560301, 559691, 560982, 564627, 571173, 580677, 592611, 606559, 622655, 641202, 662325, 686165, 712703, 740685, 767027, 787999, 801150, 806003, 803296, 794280, 780813, 765512, 751321, 740827, 735679, 736017, 740129, 744946, 747322, 745063, 736977, 722490, 701747, 676035, 647710, 619388, 593175, 570519, 552294, 538602, 528552, 520760, 514335, 509244, 505619, 503030, 500765, 498641, 497123, 496681, 497387, 499080, 501527, 504314, 506901, 508988, 510646, 512106, 513667, 515745, 518520, 521460, 523681, 525052, 526471, 528759, 531747, 534930, 538565, 543531, 550264, 558425, 567518, 577282, 587492]
59347E87492J0482J1006J2151J3690J5085J6135J6950J7555J7832J7664J6839
59336G52881J5168J3007J1264J0278R118O669L282N59o28j213k700n366q095r744
59322G94480j0171r954r476q648p470o537o573p470q126p491n629l581k378k303
59308F98673k919l531l702l525l291k897j838P1K333M350O143Q116J0498J3321
59294G21802J6545J9593K1067J9617J5201R028K395l906r281j3235j5750j7137
59282G65939j7320j5850j2844r266n976l042k96K006L585M767O100P603Q869R702
59268G43977J0155J0166R657Q980Q676Q734Q447P221N239L095R82j513m737q208
59254H10871j0758j1655j1473j1512j2341j3281j3500j3100j2669j2169j0993
$$ y = [587492, 597974, 608980, 621131, 634821, 649906, 666041, 682991, 700546, 718378, 736042, 752881, 768049, 781056, 792320, 802598, 811716, 818385, 821667, 822226, 821598, 820385, 817685, 812319, 804224, 794480, 784309, 774355, 764879, 756231, 748761, 742224, 735651, 728181, 720055, 712564, 706935, 703354, 700976, 698673, 695754, 692223, 688521, 684996, 681705, 678808, 676970, 677041, 679374, 683724, 689867, 697983, 708481, 721802, 738347, 757940, 779007, 798624, 813825, 822853, 825248, 821342, 812061, 798826, 783076, 765939, 748619, 732769, 719925, 710659, 704683, 701641, 701345, 703351, 706936, 711703, 717803, 725406, 734275, 743977, 754132, 764298, 773955, 782935, 791611, 800345, 808792, 816013, 821252, 824347, 825329, 823816, 819079, 810871, 800113, 788458, 776985, 765473, 753132, 739851, 726351, 713251, 700582, 688413, 677420]
59243F77420r104p363o427n774m330j941K17Q35p3j108r02M71J612J327j15j351
59227F43394j398n67L9l09j424k638l610m553n762p079q059q429q249p634o678
59212E77044n658m929m499l977l190k443j957j421n79R5q1r07j399j024k74J99
59196E45000M31Q01J238J356J224J546K878M861O363O521N633M884N122O039O756
59181F00653O937O906O857O623O340O580P457Q108P664O346N119M474M215M211
59167F88490M721N859P267Q451R072Q890P857O424N257M555L933L102K206J336
59153G67420K68j078k391l564m998o831q263q362p361o484o537p171p533p106
59139F90009n871m261l067k868l367l647l224k324j156L47J852K493K095J823
$$ y = [677420, 668316, 660953, 654526, 648752, 644422, 642481, 642698, 643533, 643460, 642352, 641450, 641921, 643533, 644860, 644745, 643394, 641996, 641429, 641468, 641159, 639735, 637097, 633487, 628934, 623172, 616093, 608034, 599605, 591356, 583722, 577044, 571386, 566457, 561958, 557981, 554791, 552348, 550391, 548970, 548391, 548486, 548405, 547498, 546099, 545075, 544801, 545000, 545431, 546232, 547470, 548826, 550050, 551596, 554474, 559335, 565698, 572219, 577852, 582736, 587858, 593897, 600653, 607590, 614496, 621353, 627976, 634316, 640896, 648353, 656461, 664125, 670471, 675590, 680064, 684279, 688490, 693211, 699070, 706337, 714788, 723860, 732750, 740607, 747031, 752288, 756843, 760776, 763878, 766084, 767420, 767688, 766610, 764219, 760655, 755657, 748826, 740563, 732201, 724840, 718356, 711819, 704648, 697115, 690009, 684138, 679877, 676810, 673942, 670575, 666928, 663704, 661380, 660224, 660571, 662423, 664916, 667011, 668834]
59125F68834K817M595N712N790N908O935Q469R717J0652J1693J2809J3576J3911
59112G81418J4206J4716J5136J4885J3630J1563R237P074N034K860O36j167k288
59099H86940l133m398o263q106r071q922q374q420r217r899r621q572p592p010
59085G78342o465n804n459n766o454p119p761q562r521j0464j1111j0999r926
59072F72931q567p999q301q360p496o406n904n618m844l950l700l747l201k354
59058E92484k356l137l304k417j800k382l142k772j748j444j937k105j490p87
59044E61663n57n57m49k24J92R34J626J619J024P85J401K292K753K913L222L572
59028E82209L580L418L620M205M654M802N136O034P165P995Q551R185R791R757
$$ y = [668834, 671651, 676246, 681958, 687748, 693656, 700591, 709060, 718777, 729429, 741122, 753931, 767507, 781418, 795624, 810340, 825476, 840361, 853991, 865554, 874791, 881865, 886899, 889759, 890395, 889228, 886940, 883807, 879409, 873146, 865040, 855969, 847047, 838673, 830253, 821036, 811137, 801516, 792944, 785352, 778342, 771877, 766073, 760614, 754848, 748394, 741275, 733514, 724952, 715431, 704967, 693856, 682857, 672931, 664364, 656365, 648064, 639704, 632208, 625802, 619898, 614280, 609436, 605486, 601786, 598039, 594838, 592484, 590128, 586991, 583687, 581270, 579470, 577088, 573946, 571174, 569426, 567982, 566045, 563940, 562450, 561663, 561106, 560549, 560100, 559876, 560068, 561002, 562628, 564247, 565271, 566056, 567457, 569749, 572502, 575415, 578637, 582209, 585789, 589207, 592827, 597032, 601686, 606488, 611624, 617658, 624823, 632818, 641369, 650554, 660345, 670102]
59014F70102Q808P468O393N533M286K343O6j887k966k905j968j052j002j591j635
58999F89993m71J179K150K334K557L237L855L820L205K429J676R89N34L55K4j040
58983G16826k833m590n491n463n118m966m827m155k810j213K56J645L118M601
58969F84980O001P428Q873R940J0372J0609J1264J2161J2522J2104J1505J1155
58957H08914J0591R129O716L894J246q38k321l808o159r331j2017j3089j3087
58944G79840j3500j4741j5582j4799j2605j0195q433p449p020o773o198n037l693
58931F53815k869k756k915k954k954l046k948k349j538j225j668k371k732k678
58917F18812k435k067j553j114r35p10K9J095J696J530J364K215M154O285P692
$$ y = [670102, 678910, 686378, 692771, 698304, 702590, 704933, 704999, 703112, 700146, 697241, 695273, 694221, 693219, 691628, 689993, 689522, 690701, 692851, 695185, 697742, 700979, 704834, 708654, 711859, 714288, 715964, 716953, 717487, 717842, 717866, 716826, 713993, 709403, 703912, 698449, 693331, 688365, 683538, 679383, 676573, 675360, 675616, 677261, 680379, 684980, 690981, 698409, 707282, 717222, 727594, 738203, 749467, 761628, 774150, 786254, 797759, 808914, 819505, 828634, 835350, 839244, 840490, 839652, 837331, 833523, 827364, 818033, 806016, 792927, 779840, 766340, 751599, 736017, 721218, 708613, 698418, 689985, 682536, 675516, 668743, 662545, 657508, 653815, 650946, 648190, 645275, 642321, 639367, 636321, 633373, 631024, 629486, 628261, 626593, 624222, 621490, 618812, 616377, 614310, 612757, 611643, 610708, 609998, 610027, 611122, 612818, 614348, 615712, 617927, 622081, 628366, 636058]
58902F36058Q168Q225Q666R960J1696J2802J2585J1468J0455R979R736R472R489
58889G68759J0232J1772J3823J6026J8067J9716K0817K1193K0615J9049J6829
58878I56898J4311J1469Q130M460P74k965o909j0565j3009j4073j4656j5473j6098
58865I02294j5768j4560j3189j1965j0720r588r078r336r884j0226j0300j0283
58853G67397j0338j0674j1383j2163j2463j2026j1014r643q163p082o914p444
58841F48090p802p506o991o836o855o480n707n079m826m569l989l403l353l851
58827E70843m288m190l740l338k842j714o1J046Q34J6O0J322K670L035K575K101
58811E64329K046K486L421M449M676L695K319J608J477J013Pp60q45q94j695l028
$$ y = [636058, 644226, 652451, 661117, 671077, 682773, 695575, 708160, 719628, 730083, 740062, 749798, 759270, 768759, 778991, 790763, 804586, 820612, 838679, 858395, 879212, 900405, 921020, 940069, 956898, 971209, 982678, 990808, 995268, 996042, 993077, 986168, 975603, 962594, 948521, 933865, 918392, 902294, 886526, 871966, 858777, 846812, 836092, 826504, 817426, 808090, 798206, 787980, 777680, 767397, 757059, 746385, 735002, 722839, 710376, 698350, 687336, 677693, 669530, 662448, 655534, 648090, 640288, 632782, 625791, 618955, 612100, 605620, 599913, 594834, 590008, 585439, 581450, 578047, 574694, 570843, 566555, 562365, 558625, 555287, 552445, 550731, 550670, 551716, 552550, 552566, 552626, 553948, 556618, 559653, 562228, 564329, 566375, 568861, 572282, 576731, 581407, 585102, 587421, 589029, 590506, 591519, 591526, 590766, 589921, 589027, 587332, 584304]
58795E84304l902l736k923k330k407k804k833k296j607j080m88L72J202J764K537
58780E63773L981N479N883N101M154L662L165K269J374P71j00j666l265l989m011
58765E86581m166m566m573m002l471l443l598l341k490j293k16K63M7k99k7Q96
58749E52302J751K010J961K205K863L504L785L906M415N565O942P866Q140Q244
58735F15459Q645R238R624R694R556R206Q639Q123P891P679P023N992N115M559
58721G26443L852K683J539J214J849K717L025K802K906L996N552O267N569M310
58707G74724L619L428K696P95j920m800p439r566j1038j2219j3704j5548j7167
58694F91861j8123j8518j8429j7639j6118j4326j2750j1531j0717j0290r776q483
$$ y = [584304, 580402, 576666, 573743, 571413, 569006, 566202, 563369, 561073, 559466, 558386, 557898, 558270, 559472, 561236, 563773, 567754, 573233, 579116, 584217, 588371, 592033, 595198, 597467, 598841, 599612, 599512, 597846, 594581, 590592, 586581, 582415, 577849, 573276, 569274, 565803, 562360, 558762, 555421, 552931, 551638, 551422, 551685, 551732, 551433, 551406, 552302, 554053, 556063, 558024, 560229, 563092, 566596, 570381, 574287, 578702, 584267, 591209, 599075, 607215, 615459, 624104, 633342, 642966, 652660, 662216, 671422, 680061, 688184, 696075, 703754, 710777, 716769, 721884, 726443, 730295, 732978, 734517, 735731, 737580, 740297, 743322, 746124, 749030, 753026, 758578, 764845, 770414, 774724, 778343, 781771, 784467, 785262, 783342, 778542, 771103, 761537, 750499, 738280, 724576, 709028, 691861, 673738, 655220, 636791, 619152, 603034, 588708, 575958, 564427, 553710, 543420, 533644, 525161]
58682E25161o509m862m211m115l988m016m442m602l692k159j237j214j155l84
58668D78575P21J602K392L516N021O655Q144R073Q979P892O418N036L623J958
58654E49605K43j180k292l183l690l690l491l483l547l293k810k688l161l706
58640E09634l689l149k624k375k104j461n38L00R05J408J887K206K324K375K302
58625E07401J720N21o97j170r19o18n77m32J07Q21J570K669M268N815O730P152
58609E34361P481P497O685N251L996L204K427J474P92N74K50o80j829k487k515
58594E66481k208j684j021o05o50o04L25K089L905N377O833Q441R692J0151J0187
58579F16709J0538J1333J1921J1568J0130Q137O261M731L310J946J200J693L268
$$ y = [525161, 518652, 513790, 509579, 505464, 501476, 497460, 493018, 488416, 484724, 482565, 481328, 480114, 478959, 478575, 479296, 480898, 483290, 486806, 491827, 498482, 506626, 515699, 524678, 532570, 538988, 544024, 547647, 549605, 549848, 548668, 546376, 543193, 539503, 535813, 532322, 528839, 525292, 521999, 519189, 516501, 513340, 509634, 505945, 502796, 500172, 497797, 495693, 494232, 493694, 493994, 494899, 496307, 498194, 500400, 502724, 505099, 507401, 509121, 509642, 508945, 507775, 506856, 506238, 505661, 505229, 505336, 506157, 507727, 510396, 514664, 520479, 527209, 534361, 541842, 549339, 556024, 561275, 565271, 568475, 570902, 572376, 573168, 573742, 573992, 573312, 571483, 568996, 566481, 564273, 562589, 561568, 560963, 560313, 559709, 560034, 562123, 566028, 571405, 578238, 586679, 596371, 606522, 616709, 627247, 638580, 650501, 662069, 672199, 680336, 686597, 691328, 694638, 696584, 697784, 699477, 702745]
58566G02745N105O690Q171R809J1541J3230J4843J6226J7063J7264J6978J6155
58554H55820J4542J2203R536O685L479J79k462m137n342o468p334q008r202j1127
58540H48364j2765j3189j2911j3027j3544j3711j3529j3698j4226j4279j3411
58529G00074j1958j0260q479p145o678o410n248l361j985j391m98J077K157J918
58515F41813J249J229J461J183R27J624K783L089K487K209K815L492L392K625
58501F72378J663P71J82J01K71J99j06k85m56j156k249k785k225j094o9Q14J675
58484F67629K225K321K542L474M729N426N528N949P204Q588R017Q330P349O781
58470G47092O412N454L501J078q34j807k433l613n281o216n460l695k566k650
$$ y = [702745, 707850, 714540, 722711, 732520, 744061, 757291, 772134, 788360, 805423, 822687, 839665, 855820, 870362, 882565, 892101, 898786, 902265, 902444, 899982, 895845, 890503, 884035, 876701, 868693, 859491, 848364, 835599, 822410, 809499, 796472, 782928, 769217, 755688, 741990, 727764, 713485, 700074, 688116, 677856, 669377, 662232, 655554, 649144, 643896, 640535, 638550, 637159, 636661, 637738, 639895, 641813, 643062, 644291, 645752, 646935, 647862, 649486, 652269, 655358, 657845, 660054, 662869, 666361, 669753, 672378, 674041, 674812, 674994, 675095, 675366, 675565, 675459, 675174, 674718, 673562, 671313, 668528, 666303, 665209, 665140, 665954, 667629, 669854, 672175, 674717, 678191, 682920, 688346, 693874, 699823, 707027, 715615, 724632, 732962, 740311, 747092, 753504, 758958, 762459, 763537, 762703, 760896, 758463, 754850, 749569, 743353, 737893, 734198, 731632, 728982]
58456G28982k791j780P9J704K827L892M801M873M104L360L088K802K100J230L00
58441G59571j075k686l299k206m50M22K59P4M36J077J834K810L777M299M543N110
58425G74496O046O784P176P769Q847R864J0114R454Q148O403M380K339N91o47
58411H61764j362j881k636l585m054l573k577j914j891k191k468k498k022j018
58397H28094N5P59J188J515J484J027Q80J701K843L094K399J819J871K057K101
58382H52887K424L067L306K853K479K863L702M437N150O021O603O390N668N223
58368I13073N437O213P363Q603R446R619R430R429R847J0558J1299J1734J1609
58355A033660J1019J0331R769R389R324R528R431Q484P153O512O767O990O656
$$ y = [728982, 726191, 724411, 724490, 726194, 729021, 732913, 737714, 742587, 746691, 750051, 753139, 755941, 758041, 759271, 759571, 758496, 755810, 752511, 750305, 749855, 750277, 750536, 750610, 751046, 752123, 753957, 756767, 760544, 764843, 769386, 774496, 780542, 787326, 794502, 802271, 811118, 820982, 831096, 840550, 848698, 855101, 859481, 861820, 862411, 861764, 860402, 858521, 855885, 852300, 848246, 844673, 842096, 840182, 838291, 836100, 833632, 831134, 829112, 828094, 828149, 828908, 830096, 831611, 833095, 834122, 835002, 836703, 839546, 842640, 845039, 846858, 848729, 850786, 852887, 855311, 858378, 861684, 864537, 867016, 869879, 873581, 878018, 883168, 889189, 895792, 902182, 907850, 913073, 918510, 924723, 932086, 940689, 950135, 959754, 969184, 978613, 988460, 999018, 1010317, 1022051, 1033660, 1044679, 1055010, 1064779, 1074168, 1083492, 1093020, 1102451, 1110935, 1118088, 1124600, 1131367, 1138357, 1145013]
58342A145013O548P578R428J1052J1996J2575J3115J3604J3933J3993J3791J3661
58330A286287J4075J5026J5992J6672J7270J7832J7935J7349J6390J5286J3824
58319A463938J2041J0610R973R714R378R332J0096J1305J2100J2250J2193J2280
58307A595210J2649J3603J5357J7444J8994J9674J9977K0580K1701K3004K3918
58296A802111K4160K4160K4641K5686K6603K6952K7153K7759K8687K9661L0849
58285B098422L2399L3791L4385L4389L4645L5542L6738L7873L8949M0071M1238
58274B498442M2528M4049M5705M7275M8763N0466N2755N5767N9220O2496O5182
58263C072648O7594P0401P3700P6875P9511Q1982Q4820Q7972R0932R3390R5419
$$ y = [1145013, 1151561, 1159139, 1168567, 1179619, 1191615, 1204190, 1217305, 1230909, 1244842, 1258835, 1272626, 1286287, 1300362, 1315388, 1331380, 1348052, 1365322, 1383154, 1401089, 1418438, 1434828, 1450114, 1463938, 1475979, 1486589, 1496562, 1506276, 1515654, 1524986, 1535082, 1546387, 1558487, 1570737, 1582930, 1595210, 1607859, 1621462, 1636819, 1654263, 1673257, 1692931, 1712908, 1733488, 1755189, 1778193, 1802111, 1826271, 1850431, 1875072, 1900758, 1927361, 1954313, 1981466, 2009225, 2037912, 2067573, 2098422, 2130821, 2164612, 2198997, 2233386, 2268031, 2303573, 2340311, 2378184, 2417133, 2457204, 2498442, 2540970, 2585019, 2630724, 2677999, 2726762, 2777228, 2829983, 2885750, 2944970, 3007466, 3072648, 3140242, 3210643, 3284343, 3361218, 3440729, 3522711, 3607531, 3695503, 3786435, 3879825, 3975244]
58252C975244R7287R9188J01124J03020J05188J08399J13054J18611J24372J30599
58242E076086J38009J46428J54999J63653J73305J84385J96189K08033K20121
58233F661208K33036K47152K62756K79865K97862L16266L35881L58167L83416
58224I375609M10831M40309M72859N09062N48641N91833O39708O92916P51661
58215A4433429Q17205Q91842R77118J073665J183127J308556J452910J619094
58207B3756946J811829K037667K303391K616911K989890L437077L973255M613374
58199D7540340N374791O275256P329034Q550076R961124J1597170J3499924J5709271
58191A25836986J8249799K1103145K4167338K7209911K9815808L1358422L1079688
$$ y = [3975244, 4072531, 4171719, 4272843, 4375863, 4481051, 4589450, 4702504, 4821115, 4945487, 5076086, 5214095, 5360523, 5515522, 5679175, 5852480, 6036865, 6233054, 6441087, 6661208, 6894244, 7141396, 7404152, 7684017, 7981879, 8298145, 8634026, 8992193, 9375609, 9786440, 10226749, 10699608, 11208670, 11757311, 12349144, 12988852, 13681768, 14433429, 15250634, 16142476, 17119594, 18193259, 19376386, 20684942, 22137852, 23756946, 25568775, 27606442, 29909833, 32526744, 35516634, 38953711, 42926966, 47540340, 52915131, 59190387, 66519421, 75069497, 85030621, 96627791, 110127715, 125836986, 144086785, 165189930, 189357268, 216567179, 246382987, 277741409, 308821097]
58184C08821097K8340867K2943718J5290581O259776l072983j1656535j8598729
58177C48327792k3324726k5750497k6291175k5616709k4331897k2822512k1291214
58170A78899062j9824916j8407754j6945189j5350913j3629249j1871828j0190860
58163G2678353q667340p342044o223128n293553m523833l886434l359226k920910
58155C0461885k551646k238241j973492j750598j561999j402319j267983j154262
58147A6561345j055922r70072q95303q28772p66879p08099o52664o00273n50385
58138I532976n03723m61143m21945l85506l53497l28019l08292k91582k76692
58129F202577k64200k53704k43335k31978k19997k07696j94870j81993j70194
$$ y = [308821097, 337161964, 360105682, 375396263, 381656039, 378583056, 366926521, 348327792, 325003066, 299252569, 272961394, 247344685, 223012788, 200190276, 178899062, 159074146, 140666392, 123721203, 108370290, 94741041, 82869213, 72678353, 64011013, 56668969, 50445841, 45152288, 40628455, 36742021, 33382795, 30461885, 27910239, 25671998, 23698506, 21947908, 20385909, 18983590, 17715607, 16561345, 15505423, 14535351, 13640048, 12811276, 12044397, 11336298, 10683634, 10083361, 9532976, 9029253, 8568110, 8146165, 7760659, 7407162, 7079143, 6770851, 6479269, 6202577, 5938377, 5684673, 5441338, 5209360, 4989363, 4781667, 4586797, 4404804, 4234610]
58120D234610j59830j50278j41175j32769j25119j17973j11368j05442r9830r4104
58110B996722q8599q3906p9942p6275p3007p0417o8153o5672o3183o1240n9699
58099B206629n7961n5897n3865n2005n0211m8400m6310m3550m0454l8151l7017
58088A682808l5779l3129k9576k6690k5096k4333k4061k4211k4303k3924k3680
58077A388026k4464k5900k6671k6388k5954k5978k5905k5031k3477k1824k0437
58066A115997j9405j8661j7877j6744j5393j4265j3597j3396j3671j4155j4147
58055I44686j3228j1998j1437j1681j2167j2754j3737j4740j4598j2788j0300
58044H05258q592q108q251q421q591q910r199r053q471q092q541r534j0075r736
$$ y = [4234610, 4074780, 3924502, 3783327, 3650558, 3525439, 3407466, 3296098, 3190656, 3090826, 2996722, 2908123, 2824217, 2744275, 2668000, 2594993, 2524576, 2456423, 2390751, 2327568, 2266328, 2206629, 2148668, 2092771, 2038906, 1986901, 1936690, 1888290, 1841980, 1798430, 1757976, 1719825, 1682808, 1647029, 1613900, 1584324, 1557634, 1532538, 1508205, 1484144, 1459933, 1435630, 1411706, 1388026, 1363562, 1337662, 1310991, 1284603, 1258649, 1232671, 1206766, 1181735, 1158258, 1136434, 1115997, 1096592, 1077931, 1060054, 1043310, 1027917, 1013652, 1000055, 986659, 972988, 958833, 944686, 931458, 919460, 908023, 896342, 884175, 871421, 857684, 842944, 828346, 815558, 805258, 796666, 788558, 780307, 771886, 763295, 754385, 745186, 736133, 727662, 719570, 711029, 701495, 691420, 681684]
58030F81684r257r537j0447j1102j1020j0442r752r108q618q356q168p810p288
58017E60779o772o313n903n680n788o053o104n724m977m100l393l019k775k317
58003D91861j668j152p63j41P23J303J352J219J131Q88O86J262K655L581L019
57988E05956J611O38K11l49r82j042o48m87n00p2M14k61k226m013m475m031l546
57971D86198l085k500k217k541k912k721k341k527l146l375k854k051j563j680
57957D50685k447l620m571m790m500m468n080n938o314n840m730l545k714k198
57943C89930j638q46pO30J055J416J875K625L881N577P205Q123Q009P076O040
57928D40951N720O325O974O431M502K372J214Q73L01j054k829m548o124p544q627
$$ y = [681684, 672427, 662890, 652443, 641341, 630321, 619879, 610127, 601019, 592401, 584045, 575877, 568067, 560779, 554007, 547694, 541791, 536111, 530323, 524270, 518166, 512442, 507465, 503365, 499972, 496953, 494178, 491861, 490193, 489041, 488278, 488137, 488860, 490163, 491515, 492734, 493865, 494753, 495439, 496701, 499356, 502937, 505956, 507567, 508205, 508416, 508067, 507085, 506043, 505395, 504908, 504408, 504336, 504750, 504489, 502263, 498250, 493775, 489744, 486198, 483113, 480613, 478396, 475855, 472943, 470222, 467881, 465354, 462208, 458833, 455979, 453928, 452365, 450685, 448238, 444618, 440047, 435257, 430757, 426289, 421209, 415271, 408957, 403117, 398387, 394842, 392128, 389930, 388292, 387446, 387439, 388069, 389124, 390540, 392415, 395040, 398921, 404498, 411703, 419826, 427835, 434911, 440951, 446671, 452996, 459970, 466401, 470903, 473275, 474489, 475362, 475663, 474609, 471780, 467232, 461108, 453564, 444937]
57913D44937r382j0102j0842j1160j0731r857q964p919o427m946m489n318o446
57900C38354o816o465o154o165o108n652m952m328l952l878l903l511k365q58
57886B73247K97J012J789K729L246L028K581K429K367K018J619J580J622J073
57872C00637q7j125j523j503j492j515j327q11r3N89J005J007O40J14k44m8R52
57855B95176K553M091M881M696L899L225L337M252N155N156M315L589L662M193
57841C52180M335L613K113L10j159j933k426l368m643n229m668l893l964m605
57827C26663m776m259l751l554l142k143r98l78l77m86j31Q10J847K370K426K738
57811C12859L725M846N216M491K783K53k608m798n647n590n492n495n239m856
$$ y = [444937, 435555, 425453, 414611, 403451, 392720, 382863, 373899, 365980, 359553, 354607, 350118, 344800, 338354, 331538, 325073, 318919, 312754, 306646, 300994, 296042, 291714, 287762, 283884, 279981, 276470, 274105, 273247, 273544, 274556, 276345, 279074, 282320, 285348, 287929, 290358, 292725, 294743, 296362, 297942, 299564, 300637, 300550, 299425, 297902, 296399, 294907, 293392, 292065, 291254, 291161, 291750, 292755, 293762, 294402, 294516, 294272, 294224, 295176, 297729, 301820, 306701, 311397, 315296, 318521, 321858, 326110, 331265, 336421, 340736, 344325, 347987, 352180, 356515, 360128, 362241, 362551, 361392, 359459, 357033, 353665, 349022, 343793, 339125, 335232, 331268, 326663, 321887, 317628, 313877, 310323, 307181, 305038, 304040, 303662, 303285, 302799, 302668, 303478, 305325, 307695, 310121, 312859, 316584, 321430, 326646, 331137, 333920, 334173, 331565, 326767, 321120, 315530, 310038, 304543, 299304, 294448]
57797B94448m873n278n497n214m542l593k566k079k514l204l161k511k243k601
57783B44572k780k341j774j410q32J88J086J404J521J911K340K369K211K482L406
57768B54353M587N417N510N040M632M532M070K469O0k062l476m578n321n052l838
57753B66343k845k823l248l492l714l945l357j465O91J645J245M30k42q35j212
57738B43176j012l72J52L53M05L21ol10j37M75J017J173J068R83J146J660K282
57721B52374K509K216J873J853J944J911K051K614L133L006K388J820J272L99
57707B81363n64r53o59j77L28J237K637L962M718N041N379O011O938P860Q165
57692C31286P274N188K418n20l270n459o767p182o894n984m497k634n35J953M897
$$ y = [294448, 289575, 284297, 278800, 273586, 269044, 265451, 262885, 260806, 258292, 255088, 251927, 249416, 247173, 244572, 241792, 239451, 237677, 236267, 235435, 235623, 236709, 238113, 239634, 241545, 243885, 246254, 248465, 250947, 254353, 258940, 264357, 269867, 274907, 279539, 284071, 288141, 290610, 290670, 288608, 285132, 280554, 275233, 270181, 266343, 263498, 260675, 257427, 253935, 250221, 246276, 242919, 241454, 242145, 243790, 245035, 245465, 245223, 244388, 243176, 242164, 241792, 241944, 242297, 242702, 243023, 243017, 242707, 242570, 243045, 244062, 245235, 246303, 247286, 248432, 250092, 252374, 254883, 257099, 258972, 260825, 262769, 264680, 266731, 269345, 272478, 275484, 277872, 279692, 280964, 281363, 280799, 279846, 279187, 279010, 279338, 280575, 283212, 287174, 291892, 296933, 302312, 308323, 315261, 323121, 331286, 338560, 343748, 346166, 345646, 342376, 336917, 330150, 322968, 316074, 310090, 305593, 302959, 302424, 304377, 309274]
57677C09274P909J0655J3523J7257K2039K7569L3911M1620N0961O1594P2877Q3554
57665G52743R0994R1613Q2854O4646L8997Q862k2216n0167p1347q3804q7666q4531
57653G30978p6789o7035n7284m8332m0082l2498k5999k0882j6820j3263j0186
57642C21808q007o800o001n090m146l452k921k330j851j796j932j690j024m39
57628B74329j21K45O16L76o59j732k158k155k171j995j380r45j510k750l450l016
57612B51524j952q91L5P43R29N35Ok08p2J84L64L43J07k03m83q25j244j451j265
57593B46176j044j298k005k696l040k974k514j883j585j798j973j605j142j329
57579B19290j949k086j546j096j196j399j262j029j054j278j543j885k151j976
$$ y = [309274, 317183, 327838, 341361, 358618, 380657, 408226, 442137, 483757, 534718, 596312, 669189, 752743, 843737, 935350, 1018204, 1082850, 1121847, 1130709, 1108493, 1058326, 986979, 903175, 815509, 730978, 654189, 587154, 529870, 481538, 441456, 408958, 382959, 362077, 345257, 331994, 321808, 313801, 307001, 301000, 295910, 291764, 288312, 285391, 283061, 281210, 279414, 277482, 275792, 274768, 274329, 274208, 274453, 275069, 275445, 274786, 273054, 270896, 268741, 266570, 264575, 263195, 262250, 260740, 257990, 254540, 251524, 249572, 248681, 248716, 249459, 250388, 250923, 250929, 250721, 250649, 250833, 251197, 251540, 251647, 251444, 250961, 250136, 248892, 247441, 246176, 245132, 243834, 241829, 239133, 236093, 233119, 230605, 228722, 227137, 225339, 223366, 221761, 220619, 219290, 217341, 215255, 213709, 212613, 211417, 210018, 208756, 207727, 206673, 205395, 203852, 201967, 199816, 197840]
57565A97840j411j035j128j253r65m07M5K54J61k92q11q21k12M51P28P89Q70Q82
57547A93685Q89J295K093K514K021J154P58Q08P05L62L03P98J521K030K113J739
57531B14788J076N39M86Q79J436J937K161J857J106M20J94K87N04J049J991K655
57515B33365K318J293O72R36J548J968K345K887L156K595J470P29Q59J341J401
57500B58883J004P21P56N89j72j034j185o83l56n85p98m70or5o48r57p32l91l11
57481B53530l28r7L75P34O96L29J8R6M56O46L93p1k73L1P49J577K133K150J712
57462B64856J191Q70P92R12J140J202Q91N29P29J543K257K303J863J320P10J37
57446B83245J14Q37J588J671J535K087L078L265K292J351J504K224K282J505Q39
$$ y = [197840, 196429, 195394, 194266, 193013, 192048, 191641, 191686, 191940, 192101, 191809, 190998, 190177, 189965, 190416, 191144, 191933, 192803, 193685, 194574, 195869, 197962, 200476, 202497, 203651, 204409, 205217, 205922, 206284, 206587, 207385, 208906, 210936, 213049, 214788, 215864, 216403, 216889, 217768, 219204, 221141, 223302, 225159, 226265, 226685, 226879, 227166, 227670, 228719, 230710, 233365, 235683, 236976, 237648, 238584, 240132, 242100, 244445, 247332, 250488, 253083, 254553, 255282, 256141, 257482, 258883, 259887, 260608, 261364, 261953, 261781, 260747, 259562, 258879, 258523, 257938, 257140, 256670, 256664, 256569, 255921, 254964, 254232, 253841, 253530, 253202, 253105, 253480, 254214, 254910, 255239, 255257, 255353, 255809, 256455, 256848, 256777, 256504, 256535, 257284, 258861, 260994, 263144, 264856, 266047, 266917, 267709, 268621, 269761, 270963, 271854, 272383, 273112, 274655, 276912, 279215, 281078, 282398, 283108, 283245, 283359, 284196, 285784, 287455, 288990, 291077, 294155, 297420, 299712, 301063, 302567, 304791, 307073, 308578, 309417]
57431C09417R37J490J992K410K885L229L142K666K072J473R45Q81J638K785L277
57416C41239K752K054K028K268J905J161J130K037K849K831K492K504K658K603
57402C72511K683L186L484K923K081K027K678L012K739K597K970L344L384L532
57388D13151M140M847N276N575N883N902N496N074M900M624L998L571L956M809
57374D81202N135M495L345K361J892J942K262K486K481K503K795L162L244L036
57360E22341K820K729K714K824L207L854M589N207N451N065M232L718M176N311
57346E78238O176O281N975N689N313M623L901L783M502N615O432O599O304O070
57332F55501O288O806O961O204M748L548L442M347N377N783N664N643O041O559
$$ y = [309417, 310354, 311844, 313836, 316246, 319131, 322360, 325502, 328168, 330240, 331713, 332658, 333539, 335177, 337962, 341239, 343991, 346045, 348073, 350341, 352246, 353407, 354537, 356574, 359423, 362254, 364746, 367250, 369908, 372511, 375194, 378380, 381864, 384787, 386868, 388895, 391573, 394585, 397324, 399921, 402891, 406235, 409619, 413151, 417291, 422138, 427414, 432989, 438872, 444774, 450270, 455344, 460244, 464868, 468866, 472437, 476393, 481202, 486337, 490832, 494177, 496538, 498430, 500372, 502634, 505120, 507601, 510104, 512899, 516061, 519305, 522341, 525161, 527890, 530604, 533428, 536635, 540489, 545078, 550285, 555736, 560801, 565033, 568751, 572927, 578238, 584414, 590695, 596670, 602359, 607672, 612295, 616196, 619979, 624481, 630096, 636528, 643127, 649431, 655501, 661789, 668595, 675556, 681760, 686508, 690056, 693498, 697845, 703222, 709005, 714669, 720312, 726353, 732912]
57318G32912O814O791O666O446O155O175O968Q350R428R513Q883Q344Q200Q036
57304H39681P526P026P083P638Q134Q354Q696R451J0145J0011Q982P896P639Q353
57290I56615R497J0427J0779J0509R879R349R229R351R248Q723Q145Q046Q553
57277A078350R300R870J0140J0251J0361J0588J0923J1146J0951J0287R521R004
57265A200692Q729Q605Q881R929J1575J3072J3850J3868J3215J1905J0344R482
57253A334147R935J1172J2111J2328J2213J2111J1926J1646J1578J1839J2052
57242A463058J1899J1601J1560J1778J1957J1940J1769J1434J0971J0656J0820
57231A589443J1412J2002J2264J2281J2389J2816J3448J3802J3315J1899J0201
$$ y = [732912, 739726, 746517, 753183, 759629, 765784, 771959, 778927, 787277, 796705, 806218, 815101, 823445, 831645, 839681, 847207, 854233, 861316, 868954, 877088, 885442, 894138, 903589, 913734, 923745, 932727, 940623, 948262, 956615, 966112, 976539, 987318, 997827, 1007706, 1017055, 1026284, 1035635, 1044883, 1053606, 1061751, 1069797, 1078350, 1087650, 1097520, 1107660, 1117911, 1128272, 1138860, 1149783, 1160929, 1171880, 1182167, 1191688, 1200692, 1209421, 1218026, 1226907, 1236836, 1248411, 1261483, 1275333, 1289201, 1302416, 1314321, 1324665, 1334147, 1344082, 1355254, 1367365, 1379693, 1391906, 1404017, 1415943, 1427589, 1439167, 1451006, 1463058, 1474957, 1486558, 1498118, 1509896, 1521853, 1533793, 1545562, 1556996, 1567967, 1578623, 1589443, 1600855, 1612857, 1625121, 1637402, 1649791, 1662607, 1676055, 1689857, 1703172, 1715071, 1725272]
57220A725272R081Q850R147R587J0105J0607J0674J0095R396R372J0058J0717
57208A842961J0879J0858J0985J0916J0276R542R567J0294J0779J0529J0145J0318
57196A968049J0901J1422J1874J2470J2932J2842J2367J1995J1701J1109J0460
57185B098122J0611J1810J3168J3683J3353J2847J2529J2302J2176J2374J2863
57174B235838J3212J3009J2213J1100J0019R311R206R667J0354J0829J0859J0540
57162B366157J0125R754R339Q783Q240P999Q106Q267Q177P849P531P359P184O750
57148B481620O038N403N248N513N606M995L842K844K457K474K377J951J454J271
57134B533093J466J630J255L34n37q08o17n55q74j268j415j320j023l34Q63K332
$$ y = [1725272, 1734353, 1743203, 1752350, 1761937, 1772042, 1782649, 1793323, 1803418, 1812814, 1822186, 1832244, 1842961, 1853840, 1864698, 1875683, 1886599, 1896875, 1906417, 1915984, 1926278, 1937057, 1947586, 1957731, 1968049, 1978950, 1990372, 2002246, 2014716, 2027648, 2040490, 2052857, 2064852, 2076553, 2087662, 2098122, 2108733, 2120543, 2133711, 2147394, 2160747, 2173594, 2186123, 2198425, 2210601, 2222975, 2235838, 2249050, 2262059, 2274272, 2285372, 2295391, 2304702, 2313908, 2323575, 2333929, 2344758, 2355617, 2366157, 2376282, 2386036, 2395375, 2404158, 2412398, 2420397, 2428503, 2436770, 2444947, 2452796, 2460327, 2467686, 2474870, 2481620, 2487658, 2493061, 2498309, 2503822, 2509428, 2514423, 2518265, 2521109, 2523566, 2526040, 2528417, 2530368, 2531822, 2533093, 2534559, 2536189, 2537444, 2537778, 2537241, 2536433, 2535816, 2535261, 2534387, 2533119, 2531704, 2530384, 2529361, 2529027, 2529890, 2532222]
57118B532222L813N377P230R239J1101J2906J5271J8710K3134K8144L3727M0417
57106B741291M8640N8253O8904Q0945R5508J13668J35791J62034J93077K29745
57096C927856K72006L18815L68995M21596M75127N26967N74061O13847O44082
57087H143352O62000O64183O47360O09519N51416M78511M01529L33291K82545
57078A2773706K49112K24040J94041J46708P4241k4509j43782k73031m00760n17630
57068A2302136o17148o94927p48374p76972p82045p66041p32315o85453o30847
57059E868014n73249n15771m60256m08019l59915l16245k77214k43267k14464
57050B499614j89880j68249j49045j32413j18192j05746r4751q5456p8053p2258
$$ y = [2532222, 2536035, 2541412, 2548642, 2557881, 2568982, 2581888, 2597159, 2615869, 2639003, 2667147, 2700874, 2741291, 2789931, 2848184, 2917088, 2998033, 3093541, 3207209, 3343000, 3505034, 3698111, 3927856, 4199862, 4518677, 4887672, 5309268, 5784395, 6311362, 6885423, 7499270, 8143352, 8805352, 9469535, 10116895, 10726414, 11277830, 11756341, 12157870, 12491161, 12773706, 13022818, 13246858, 13440899, 13587607, 13661848, 13637339, 13493557, 13220526, 12819766, 12302136, 11684988, 10990061, 10241687, 9464715, 8682670, 7916629, 7184314, 6498861, 5868014, 5294765, 4778994, 4318738, 3910719, 3550804, 3234559, 2957345, 2714078, 2499614, 2309734, 2141485, 1992440, 1860027, 1741835, 1636089, 1541338, 1455882, 1377829, 1305571]
57040A305571o7688o4004o0651n7004n3060m9336m5897m2002l7065l1352k5373
57029G72139j9180j2649n827J647J0817K2303L5319M8440O0820P1346P6828P2645
57017A134648N6285K9845j376l2197n9075p9335r0679r2235q5743p4961o3557
57006F41620n3412m4694l7042l0399k4898k0440j6715j3458j0486p658n068l208
56994C74142k652l406m705n478n052l474j395M14J609K444L343M403N331N777
56980C71301N504M349K313k62k783m844o430p667q466q544p773o381m786l235
56966C22296j668Q6K003L826N351O640P908R249J0481J1229J1173J0263Q704O680
56952D14221M149R94k661o355r551j1821j2943j2916j1919j0170p905n515l483
$$ y = [1305571, 1237883, 1173879, 1113228, 1056224, 1003164, 953828, 907931, 865929, 828864, 797512, 772139, 752959, 740310, 734483, 736130, 746947, 769250, 804569, 853009, 913829, 985175, 1062003, 1134648, 1190933, 1220778, 1219402, 1187205, 1128130, 1048795, 958116, 865881, 780138, 705177, 641620, 588208, 543514, 506472, 476073, 451175, 430735, 414020, 400562, 390076, 382418, 377350, 374142, 371490, 368084, 363379, 357901, 352849, 349375, 347980, 348394, 350003, 352447, 355790, 360193, 365524, 371301, 376805, 381154, 383467, 383205, 380422, 375578, 369148, 361481, 353015, 344471, 336698, 330317, 325531, 322296, 320628, 320714, 322717, 326543, 331894, 338534, 346442, 355691, 366172, 377401, 388574, 398837, 407541, 414221, 418370, 419364, 416703, 410348, 400797, 388976, 376033, 363117, 351198, 341028, 333123, 327608, 324125]
56939C24125j899l17J572L444M956O647R400J3013J6073J7402J6869J4623J0516
56926D36424M907q72n625r393j2697j5296j6559j6667j6414j6030j5133j3750
56914C02895j2368j0969r037o731n090m669m719m228l091j850q32n2M72Q30J286
56899B41847J856K150J986J825K240L236M436N611O735P806Q980J0511J2180J3197
56885C24596J3091J2346J1570J0469Q271M950J278k178n314p732q621p794o146
56872C48786m648l329j686L77K632N225Q578J2622J6740K0617K4547K8681L2337
56859D91479L4510L4703L2878K8784K2049J2975K874o701j4733k0663k4048k4803
56847E69304k3470k0723j6688j1240m925J049O071J0865J6526K3101K9637L5523
$$ y = [324125, 322226, 321909, 323481, 326925, 331881, 338528, 347928, 360941, 377014, 394416, 411285, 425908, 436424, 441331, 440459, 434834, 425441, 412744, 397448, 380889, 364222, 347808, 331778, 316645, 302895, 290527, 279558, 270521, 263790, 258700, 254031, 249312, 245084, 241993, 240143, 239311, 239259, 239731, 240561, 241847, 243703, 245853, 247839, 249664, 251904, 255140, 259576, 265187, 271922, 279728, 288708, 299219, 311399, 324596, 337687, 350033, 361603, 372072, 380343, 385293, 386571, 384393, 379079, 371347, 362726, 354932, 348786, 344138, 340809, 339123, 339500, 342132, 347357, 355935, 368557, 385297, 405914, 430461, 459142, 491479, 525989, 560692, 593570, 622354, 644403, 657378, 660252, 653551, 638818, 618155, 594107, 569304, 545834, 525111, 508423, 497183, 492258, 493307, 499378, 510243, 526769, 549870, 579507, 615030]
56835F15030M1148M6914N2003N4515N2810M6395L5586K0960L589j4422l0415m2400
56823H81713m9681n2394n1074m6870m1433l5848k9886k2879j5060p487q18N211
56811E33494J1146J7290K3731L0138L5398L8100L7564L3820K6705J5995K775j0474
56799G95682k1824l1163l8814m3805m4775m2084l7701l3079k8220k2873j7469
56788D33875j2520q007l822j10L255O937J1299J5677J8851J9886J8314J4075P756
56775E25466M63o978j4306k0965k5692k7612k7372k6346k5005k2918k0173j7741
56763B90821j6223j5079j3535j1565r614p936o710o238o332n988m492k649k059
56750A82401l068m204l981k589j372j108j458j818k059k291k385k030j115P1R34
$$ y = [615030, 656178, 703092, 755095, 809610, 862420, 908815, 944401, 965361, 968950, 954528, 924113, 881713, 832032, 779638, 728564, 681694, 640261, 604413, 574527, 551648, 536588, 529101, 528283, 533494, 544640, 561930, 585661, 615799, 651197, 689297, 726861, 760681, 787386, 803381, 806156, 795682, 773858, 742695, 703881, 660076, 615301, 573217, 535516, 502437, 474217, 451344, 433875, 421355, 413348, 409526, 409416, 412671, 419608, 430907, 446584, 465435, 485321, 503635, 517710, 525466, 525929, 518951, 504645, 483680, 457988, 430376, 403004, 376658, 351653, 328735, 308562, 290821, 274598, 259519, 245984, 234419, 224805, 216869, 210159, 203921, 197589, 191601, 187109, 184460, 182401, 179333, 175129, 171148, 168559, 167187, 166079, 164621, 162803, 160744, 158453, 156068, 154038, 152923, 152994, 153928]
56735A53928R71K20o35r13o47m54o73r66r00n39k14J2K59L65K9n98q42k27J032
56716A49208K278K953K781J822O03j60k39j75n33j160j495j437j330j172n19O19
56700A52044J379R72k81j343j591j223p27m19m24o07n39N7P53Q09J30n21n26j35
56682A47808k3m18r75j252j002k69M88O04p4q84j002l07O77J517K059K111J462
56665A50520L80l89l15L96J090J262Q02n8q74j220j000m53J51O87J000Q26O7r18
56647A51954j543j558j324j399j831k000j380k80M68O08P39J330J950J954J495
56632A49183J201J144Q92N14O23J325J924K008K016K291K271J349N6m63Q3R15
56616A67332J326J320J048L59p93j945k508k313j580n87L64R08Q65M92K76L83
$$ y = [153928, 154899, 155119, 154484, 153571, 152924, 152470, 151797, 150831, 149931, 149392, 149178, 149190, 149449, 149814, 149843, 149245, 148403, 148176, 149208, 151486, 154439, 157220, 159042, 159645, 159485, 159246, 159071, 158538, 157378, 155883, 154446, 153116, 151944, 151425, 152044, 153423, 154395, 154114, 152771, 151180, 149957, 149230, 148811, 148387, 147780, 147241, 147298, 148051, 148860, 148990, 148469, 147943, 147808, 147785, 147367, 146392, 145140, 144138, 143869, 144357, 144961, 144887, 144003, 143001, 142694, 143371, 144888, 146947, 149058, 150520, 150900, 150511, 150196, 150592, 151682, 152944, 153746, 153688, 152814, 151594, 150594, 150141, 150292, 150979, 151979, 152805, 152872, 151954, 150411, 148853, 147529, 146130, 144299, 142299, 140919, 140639, 141107, 141715, 142454, 143784, 145734, 147688, 149183, 150384, 151528, 152420, 152934, 153557, 154882, 156806, 158814, 160830, 163121, 165392, 166741, 166797, 166334, 166417, 167332, 168658, 169978, 171026, 171385, 170592, 168647, 166139, 163826, 162246, 161659, 162023, 162931, 163796, 164288, 164564, 164947]
56600A64947N43M45J48p2j89m89j074j479j160l21J20m31j462j884j228q7N79
56583A56906L93k22n98n33l82m60n02K0J077J952K109J801J581J568J560J621
56567A67891K044K808L512L864L891L727L604M040N455P416Q743Q666P556O294
56553B39511N280M400L580K812J841M32j026j724j450r49j018j587k062k240k392
56538B43408k602k573k240k010k129k239j971j663j943k724l214k971k501k487
56524B10141k859k919k261j199l91k24n66r84j245j520k017k494k524k157j927
56509A84854j982j775r82k05k23q29j106p38k98k43k27K48J061J682J751J184
56493A82172J34r24j350j048o57o99q12l65M16O59J49k92m6L73J49n65q69m59
$$ y = [164947, 165490, 165935, 166083, 166011, 165822, 165333, 164259, 162780, 161620, 161299, 161419, 160988, 159526, 157642, 156414, 156327, 156906, 157299, 157077, 156479, 155946, 155564, 155104, 154602, 154622, 155699, 157651, 159760, 161561, 163142, 164710, 166270, 167891, 169935, 172743, 176255, 180119, 184010, 187737, 191341, 195381, 200836, 208252, 216995, 225661, 233217, 239511, 244791, 249191, 252771, 255583, 257424, 257856, 256830, 255106, 253656, 252707, 251689, 250102, 248040, 245800, 243408, 240806, 238233, 235993, 233983, 231854, 229615, 227644, 225981, 224038, 221314, 218100, 215129, 212628, 210141, 207282, 204363, 202102, 200903, 200512, 200288, 199722, 198738, 197493, 195973, 193956, 191462, 188938, 186781, 184854, 182872, 181097, 180115, 179910, 179687, 178858, 177752, 177014, 176716, 176473, 176246, 176494, 177555, 179237, 180988, 182172, 182306, 181382, 180032, 178984, 178327, 177628, 176816, 176451, 176867, 177526, 177675, 177383, 177337, 177710, 177859, 177294, 176425, 175966]
56475A75966mq0l83l30N5L54N02Q29J421J945K141K043J763J400J280J757K617
56458A93276L041K543J617J146J429K042K465K398J749P62P7J77P27Q51K48m08
56442B14140l37L42P58K82q46j845k145j790j194o58j83K26L59K5n74r64r17o96
56424B03983p21j050j318j128n41j22l58r71j072j53J237K056J853J025J88l09
56408B02599l44K2M14L71j00m65l67q1l9k07k15rK2l75q43o66M93K129L219L111
56388B08669K169J397J377J736J716J082L32N2L15P16Q87Q55Q82J061J254J469
56372B25969K037L115M108M049K712J007j0j99j03LL25Q66J164R59O44O40O82
56355B47968K86k90k10O85J455J257M56J1R2N9l02l53L71J349J764J563J335J454
$$ y = [175966, 175962, 175882, 175499, 175169, 175224, 175578, 176080, 176909, 178330, 180275, 182416, 184459, 186222, 187622, 188902, 190659, 193276, 196317, 198860, 200477, 201623, 203052, 205094, 207559, 209957, 211706, 212468, 212545, 212722, 213449, 214300, 214548, 214140, 213803, 214145, 214903, 215185, 214339, 212494, 210349, 208559, 207365, 206707, 206524, 206750, 207109, 207134, 206560, 205596, 204679, 203983, 203262, 202212, 200894, 199766, 199225, 199103, 198745, 197774, 196702, 196549, 197786, 199842, 201695, 202720, 202908, 202599, 202255, 202277, 202691, 203062, 202962, 202497, 202130, 202049, 202010, 201803, 201588, 201579, 201601, 201226, 200383, 199717, 200210, 202339, 205558, 208669, 210838, 212235, 213612, 215348, 217064, 218146, 218478, 218530, 218845, 219561, 220448, 221303, 222185, 223246, 224500, 225969, 228006, 231121, 235229, 239278, 241990, 242997, 242987, 242788, 242685, 242688, 243013, 243879, 245043, 246002, 246646, 247286, 247968, 248254, 247964, 247754, 248439, 249894, 251151, 251607, 251618, 251710, 251769, 251467, 251114, 251485, 252834, 254598, 256161, 257496, 258950]
56337B58950J771K016K060J924J831K171K976L611L388K421J470J039J042J294
56323B87964J747K164K106J568J171J388J865J873J233N42M67J110J949K295J872
56308C11314J061N38O00R88J271J281J112J005J276K153L378M232M098L122K111
56293C39540J799K187K549K181J221N93R95K065K850K967K892L145L645L972L901
56278C76502L469K902K677L309M808O506P650Q003P824P570P709Q416R297R758
56264D66400R860J0345J1592J3120J4452J5843J7633J9416K0664K1794K3758K6698
56252F71575K9923L3194L7097M1988M7327N2476N7497O2684O7883P2778P7414
56241A251836Q1864Q5596Q7777Q8086Q6721Q3711P8659P1316O1986N1161L9017
$$ y = [258950, 260721, 262737, 264797, 266721, 268552, 270723, 273699, 277310, 280698, 283119, 284589, 285628, 286670, 287964, 289711, 291875, 293981, 295549, 296720, 298108, 299973, 301846, 303079, 303621, 304088, 305198, 307147, 309442, 311314, 312375, 312913, 313513, 314501, 315772, 317053, 318165, 319170, 320446, 322599, 325977, 330209, 334307, 337429, 339540, 341339, 343526, 346075, 348256, 349477, 350070, 351065, 353130, 355980, 358947, 361839, 364984, 368629, 372601, 376502, 379971, 382873, 385550, 388859, 393667, 400173, 407823, 415826, 423650, 431220, 438929, 447345, 456642, 466400, 476260, 486605, 498197, 511317, 525769, 541612, 559245, 578661, 599325, 621119, 644877, 671575, 701498, 734692, 771789, 813777, 861104, 913580, 971077, 1033761, 1101644, 1174422, 1251836, 1333700, 1419296, 1507073, 1595159, 1681880, 1765591, 1844250, 1915566, 1977552, 2028713, 2067730]
56230B067730K5472J0738m412j8921l1991m3368n3163o1533o8550p4219p8332
56219A669451q0377p9935p7378p3866p0409o7053o3172n8472n3406m8705m4780
56208I51898m1557l8602l5357l1588k7785k4826k3049k1781k0012j7491j4901
56197F54949j3016j1880j0883r514p883o523n720n143m274l151k409k436k769
56184E69348k610j807r09l20J35O60J051J094J066J376J857J897J334P70Q67J599
56168E77408K342K592K390K146K182K472K771L006L370M003M731N277N660O128
56154F26478O722P230P575Q042Q911J0076J1162J1975J2667J3531J4742J6356
56142G55467J8438K1010K3899K6805K9690L3109L7750M3729N0559N7964O6192
$$ y = [2067730, 2093202, 2103940, 2099528, 2080607, 2048616, 2005248, 1952085, 1890552, 1822002, 1747783, 1669451, 1589074, 1509139, 1431761, 1357895, 1287486, 1220433, 1157261, 1098789, 1045383, 996678, 951898, 910341, 871739, 836382, 804794, 777009, 752183, 729134, 707353, 687341, 669850, 654949, 641933, 630053, 619170, 609656, 601773, 595250, 589530, 584387, 580113, 576962, 574553, 572117, 569348, 566738, 564931, 564022, 563702, 563837, 564497, 565548, 566642, 567708, 569084, 570941, 572838, 574172, 574942, 575809, 577408, 579750, 582342, 584732, 586878, 589060, 591532, 594303, 597309, 600679, 604682, 609413, 614690, 620350, 626478, 633200, 640430, 648005, 656047, 664958, 675034, 686196, 698171, 710838, 724369, 739111, 755467, 773905, 794915, 818814, 845619, 875309, 908418, 946168, 989897, 1040456, 1098420, 1164612]
56131A164612P5154Q3634Q9879R2855R2394Q8437Q1018P1120O0799N1840M4666
56120A996408L8771L3675K8899K3549J6768Q728O66o213j1591j5877j9634k3377
56108B070772k7741l3492m1205n0746o0982p0084p6448p9388p9023p5645o9488
56097A406530o1077n1527m2194l3952k6875k0526j4618r364n204k278k37J338
56085A140016K507L115L332L836N222P312R261J0407J0820J0950J0973J0780J0524
56072A239055J0628J1192J1802J2181J2698J3815J5282J6392J6964J7624J8954
56061A396587K0741K2252K3075K3521K4141K5023K5611K5357K4474K3834K4045
56050A658661K4838K5474K5517K5093K4616K4462K4769K5404K6279K7597K9436
$$ y = [1164612, 1239766, 1323400, 1413279, 1506134, 1598528, 1686965, 1767983, 1839103, 1899902, 1951742, 1996408, 2035179, 2068854, 2097753, 2121302, 2138070, 2146798, 2147464, 2141251, 2129660, 2113783, 2094149, 2070772, 2043031, 2009539, 1968334, 1917588, 1856606, 1786522, 1710074, 1630686, 1551663, 1476018, 1406530, 1345453, 1293926, 1251732, 1217780, 1190905, 1170379, 1155761, 1146397, 1141193, 1138915, 1138678, 1140016, 1142523, 1145638, 1148970, 1152806, 1158028, 1165340, 1174601, 1185008, 1195828, 1206778, 1217751, 1228531, 1239055, 1249683, 1260875, 1272677, 1284858, 1297556, 1311371, 1326653, 1343045, 1360009, 1377633, 1396587, 1417328, 1439580, 1462655, 1486176, 1510317, 1535340, 1560951, 1586308, 1610782, 1634616, 1658661, 1683499, 1708973, 1734490, 1759583, 1784199, 1808661, 1833430, 1858834, 1885113, 1912710, 1942146]
56039A942146L1165L1996L2191L2940L4695L6534L7703L8826M0757M3105M4996
56028B347054M6637M8825N1416N3603N5386N7440N9723O1637O3418O5887O8835
56017B979861P1206P3070P5746P9593Q3298Q6074Q8959R3037R7771J02110J06162
56006C936887J10589J15310J19928J24734J30319J36701J43638J51245J59642
55997E128993J68579J77967J88150J99234K10873K23143K36653K51437K66777
55988G051806K82672L00325L20578L43067L67527L94511M24154M55770M89671
55979A0430081N27792N71394O19644O71876P29790P95929Q71371R56542J053181
55970A7227600J163960J291274J437920J608056J806577K039030K313457K640913
$$ y = [1942146, 1973311, 2005307, 2037498, 2070438, 2105133, 2141667, 2179370, 2218196, 2258953, 2302058, 2347054, 2393691, 2442516, 2493932, 2547535, 2602921, 2660361, 2720084, 2781721, 2845139, 2911026, 2979861, 3051067, 3124137, 3199883, 3279476, 3362774, 3448848, 3537807, 3630844, 3728615, 3830725, 3936887, 4047476, 4162786, 4282714, 4407448, 4537767, 4674468, 4818106, 4969351, 5128993, 5297572, 5475539, 5663689, 5862923, 6073796, 6296939, 6533592, 6785029, 7051806, 7334478, 7634803, 7955381, 8298448, 8665975, 9060486, 9484640, 9940410, 10430081, 10957873, 11529267, 12148911, 12820787, 13550577, 14346506, 15217877, 16174419, 17227600, 18391560, 19682834, 21120754, 22728810, 24535387, 26574417, 28887874, 31528787]
55962C1528787L033475L504068M069047M747494N555829O506243P612959Q897622
55954G5455524J0387718J2114671J4113475J6410471J8992995K1775189K4565219
55947A93815262K7016610K8580578K8550824K6277634K1473311J4399633N802834
55940C45916686l325776j1983139j9300449k4648865k7741018k8675089k7860716
55933B02381634k5854884k3199555k0325065j7521713j4953726j2692564j0752208
55926G7081919r114958p747112o609554n664775m879244m223478l672934l208536
55918C1961328k815046k479445k191420j943743j730559j546004j385291j245562
55910A6624258j124290j017995r23754q40714p68544p05436o49048n98473n53645
$$ y = [31528787, 34562262, 38066330, 42135377, 46882871, 52438700, 58944943, 66557902, 75455524, 85843242, 97957913, 112071388, 128481859, 147474854, 169250043, 193815262, 220831872, 249412450, 277963274, 304240908, 325714219, 340113852, 345916686, 342590910, 330607771, 311307322, 286658457, 258917439, 230242350, 202381634, 176526750, 153327195, 133002130, 115480417, 100526691, 87834127, 77081919, 67966961, 60219849, 53610295, 47945520, 43066276, 38842798, 35169864, 31961328, 29146282, 26666837, 24475417, 22531674, 20801115, 19255111, 17869820, 16624258, 15499968, 14481973, 13558219, 12717505, 11948961, 11243525, 10594477, 9996004, 9442359]
55901I442359n13536m76574m42302m11075l82455l55317l29350l05114k82713
55892E943923k61606k41761k23734k07353j91393j74936j58356j42453j27246
55883D215085j12108r6724q1326o6012n0440l4786k0950j2186j1016j7655l0653
55872C681229m8464o9615r1803j12005j27872j38461j43686j43853j39838j32880
55862B532752j23928j13710j03378r4213q6490p9492p2790o6683o1220n5847n0398
55851A624603m5581m1983l9444l7666l6602l5834l4543l2621l0991l0248k9839
55840A229251k9041k7840k6375k4493k2505k1389k1362k1246k0111j8681j8056
55829I78152j7950j7340j6262j5561j5334j4864j4013j3495j3699j4169j4308
$$ y = [9442359, 8928823, 8452249, 8009947, 7598872, 7216417, 6861100, 6531750, 6226636, 5943923, 5682317, 5440556, 5216822, 5009469, 4818076, 4643140, 4484784, 4342331, 4215085, 4102977, 4006253, 3924927, 3858915, 3808475, 3773689, 3752739, 3740553, 3729537, 3711882, 3681229, 3632765, 3563150, 3471347, 3359342, 3231470, 3093009, 2949323, 2805470, 2665632, 2532752, 2408824, 2295114, 2191736, 2097523, 2011033, 1931541, 1858751, 1792068, 1730848, 1675001, 1624603, 1579022, 1537039, 1497595, 1459929, 1423327, 1387493, 1352950, 1320329, 1289338, 1259090, 1229251, 1200210, 1172370, 1145995, 1121502, 1098997, 1077608, 1056246, 1035000, 1014889, 996208, 978152, 960202, 942862, 926600, 911039, 895705, 880841, 866828, 853333, 839634, 825465, 811157]
55818H11157j3987j3351j2680j2352j2487j2682j2487j1863j0813r106o934n250
55806F77165m698m694m333l725l456l164j871L98K340K857K061P83j69l43Rm9
55790F59111j054k257k564k139k063k567k781k399k420l781o187q868j1643j4523
55776E93865j6880j7726j6767j4650j2308j0215q095n348j972R24J980R54j130
55763D92632l163m732n751o104n965n902o168o356o082n677n704o193o727p166
55749D10942p779q641r301r213q443p710p622p937p823o863n549m571m035l643
55735C11812l325l213l210l087k857k692k588k552k859l612m299m397m213m409
55721B64499m850m780m093l516l400l267k824k437k211j451K29K040K966L085
$$ y = [811157, 797170, 783819, 771139, 758787, 746300, 733618, 721131, 709268, 698455, 689349, 682415, 677165, 672467, 667773, 663440, 659715, 656259, 653095, 651224, 651622, 653962, 656819, 658880, 659663, 659494, 659151, 659160, 659111, 658057, 655800, 653236, 651097, 649034, 646467, 643686, 641287, 638867, 635086, 628899, 620031, 608388, 593865, 576985, 559259, 542492, 527842, 515534, 505319, 497224, 491876, 489904, 490828, 492808, 493762, 492632, 489469, 484737, 478986, 472882, 466917, 461015, 454847, 448491, 442409, 436732, 431028, 424835, 418108, 410942, 403163, 394522, 385221, 376008, 367565, 359855, 352233, 344296, 336473, 329610, 324061, 319490, 315455, 311812, 308487, 305274, 302064, 298977, 296120, 293428, 290840, 288288, 285429, 281817, 277518, 273121, 268908, 264499, 259649, 254869, 250776, 247260, 243860, 240593, 237769, 235332, 233121, 231670, 231899, 233939, 236905, 239990]
55707B39990L176L381L123K131Q32l32j357k381l344m096m545m675m656m847n439
55692B16961o116o275n560m108k416j088n85r29j652k155k064j260J28J655K713
55677A87249K964K495J513J24j415k627l204l250l024k701k563k907l472l423
55663A65759k420j313j111j569j521m91Q12J619J943K055J916J620J717K518L404
55648A74938L514K904K392K337K247J665Q09O1n96j284j812k031k306l065m013
55633A75760m361l899l366l472m006m130l414k260j392j078r16l08Q02J852K366
55618A48178K453K316J642J00j658k378j766r21r22j640k479l385m417m939m254
55603A25930k699j248k58M72O73j87j606k090r91N71J100M37l95n86k45Lk73q26
$$ y = [239990, 243166, 246547, 249670, 251801, 252633, 252301, 250944, 248563, 245219, 241123, 236578, 231903, 227247, 222400, 216961, 210845, 204570, 199010, 194902, 192486, 191398, 190813, 189884, 188232, 186077, 184013, 182753, 182881, 184536, 187249, 190213, 192708, 194221, 194345, 192930, 190303, 187099, 183849, 180825, 178124, 175561, 172654, 169182, 165759, 163339, 162026, 160915, 159346, 157825, 157334, 158146, 159765, 161708, 163763, 165679, 167299, 169016, 171534, 174938, 178452, 181356, 183748, 186085, 188332, 189997, 190806, 190867, 190271, 188987, 187175, 185144, 182838, 179773, 175760, 171399, 167500, 164134, 160662, 156656, 152526, 149112, 146852, 145460, 144382, 143466, 143158, 143960, 145812, 148178, 150631, 152947, 154589, 154689, 153031, 150653, 148887, 147966, 147044, 145404, 142925, 139540, 135123, 130184, 125930, 123231, 121983, 121725, 122197, 122870, 122683, 121077, 118987, 117996, 118567, 119667, 120104, 119709, 119123, 118878, 118881, 118608, 117782]
55585A17782q74M9J410K270K472K647L050L242L132L449M695O356P747Q984J0478
55570A76889J1954J2828J3120J3187J2774J1142Q198M762J564j469m722q041j0692
55557B41494j2065j2301j2180j2339j2568j2188j0966r392p949o672n607n059
55545A22208n014m852m204l567l489l575l074k125j574j664j718j269o47l41l14
55530H4781l36m11o16q48j038j300j661j855j625j091o75p49j350k149k620k400
55514F4057j490k03R90J584J373Q29O88R50Q17m8p66m17N21Q43L67O5M09P31M74
55495G1774O5Q8L42L03l0l54o08q48q61m68Q2M87Q77J426J820J616R95N55M46
55476G7707K24l46q42p61k16K35K91J56R9j5m61j057j208p20k29l93r43j064n58
$$ y = [117782, 116908, 116957, 118367, 120637, 123109, 125756, 128806, 132048, 135180, 138629, 143324, 149680, 157427, 166411, 176889, 188843, 201671, 214791, 227978, 240752, 251894, 260092, 264854, 266418, 264949, 260227, 252186, 241494, 229429, 217128, 204948, 192609, 180041, 167853, 156887, 147495, 139546, 132874, 127267, 122208, 117194, 112342, 108138, 104571, 101082, 97507, 94433, 92308, 90734, 89070, 87352, 86083, 85436, 85095, 84781, 84445, 84034, 83418, 82570, 81532, 80232, 78571, 76716, 75091, 74000, 73325, 72576, 71226, 69077, 66457, 64057, 62567, 62364, 63354, 64938, 66311, 67140, 67828, 68778, 69595, 69547, 68781, 68364, 68885, 69728, 70095, 70160, 70569, 71300, 71774, 71839, 71927, 72269, 72572, 72542, 72188, 71580, 70732, 69871, 69403, 69485, 69972, 70849, 72275, 74095, 75711, 76706, 77261, 77707, 77931, 77585, 76743, 75982, 75766, 76001, 76292, 76448, 76547, 76532, 76071, 75014, 73806, 73086, 72857, 72464, 71521, 70457, 69899]
55457F9899J4L15N13N45o7j182j754j219m69n83j174j110m09k04p62r28L6J172
55439F2633J189K77l05k2N45Q47J047J349J463J083M84J88K88M13K84jk63n90
55421G0909j119j530j052P22L025M315L771K212J175J253J703J714J377J104O98
55406I0277l20j697k497k310j752j553j619j418r10n63o82j108j528j741j679
55391F8900j469j396j528j487r46j83K56L28M85Q74J110R23M96O3l83p14n87p0
55373F4672J74k18o31k93N65J009P28L32L24M08J12m55q23q41p37o61m48Q2P69
55354F4068J099O25n07j519j636q23K67J048J438J531J210L74o19j136r39m40
55338F4041k24m32p33p98o00l59k27j67l6K16M56M86L11J93L26M91K51m08r24
$$ y = [69899, 69913, 70228, 70741, 71286, 71219, 70037, 68283, 67064, 66595, 66012, 64838, 63728, 63319, 63115, 62353, 61425, 61461, 62633, 63822, 64099, 63794, 63772, 64317, 65164, 66211, 67560, 69023, 70106, 70590, 70778, 71066, 71479, 71763, 71762, 71499, 70909, 69790, 68260, 67208, 67930, 70955, 75270, 79041, 81253, 82428, 83681, 85384, 87098, 88475, 89579, 90277, 89957, 88260, 85763, 83453, 81701, 80148, 78529, 77111, 76201, 75638, 74956, 73848, 72320, 70579, 68900, 67431, 66035, 64507, 63020, 62074, 61891, 62147, 62475, 62960, 63834, 64944, 65867, 66363, 66426, 66043, 65329, 64742, 64672, 64846, 64628, 63997, 63704, 64269, 65278, 66006, 66338, 66662, 67070, 67182, 66727, 65904, 65063, 64326, 63665, 63217, 63299, 64068, 65167, 65792, 65285, 63766, 62130, 61307, 61574, 62622, 64060, 65591, 66801, 67175, 66556, 65420, 64481, 64041, 63817, 63385, 62652, 61854, 61254, 60895, 60668, 60501, 60465, 60681, 61137, 61623, 61934, 62127, 62453, 62944, 63195, 62787, 61863]
55319F1863q13l20q3k76m49k53J11K86K29J39J17J52K13J85q6m87o40m24k62n57
55299E8645j042j061m15M36R28Q61M00p4j20L82J003J174Q67O27Q74J446J782
55282F6713J422M18n23n16M97J405J135K8n98k60J39k20r37j196r67o86k78N30
55264F6106J302J214L38k92j04L27K87k7l8K27L66M87J099K032K232J023q17j739
55246G4023j125Q6N30j38j112j472j046l05K31L73K28l4l73q37j299j360p72J11
55228F5709O33O07M42M24L40J3j99O7M64L56k20n05m7P46J183J047N85O3l98p40
55208G0570r20q79n55k5M15N14L89L08K21n3k99l6O34Q85K57o27q56m47j98m49
55188F8849o13n9R75J588J198J65n66m03L15Q02P83O74P25N30k86j252j518r89
$$ y = [61863, 61050, 60730, 60647, 60371, 59922, 59669, 59780, 60066, 60295, 60434, 60551, 60703, 60916, 61101, 61015, 60528, 59888, 59464, 59202, 58645, 57603, 56542, 56127, 56563, 57491, 58352, 58752, 58678, 58558, 58940, 59943, 61117, 61984, 62611, 63485, 64931, 66713, 68135, 68553, 68030, 67514, 68011, 69416, 70551, 70579, 69981, 69721, 69860, 69640, 68703, 67507, 66540, 65854, 65576, 66106, 67408, 68622, 68960, 68668, 68564, 68891, 69178, 69151, 69113, 69340, 69706, 70193, 71292, 73324, 75556, 76579, 75762, 74023, 72898, 72984, 73514, 73376, 72264, 70792, 69746, 69441, 69672, 70045, 70273, 70239, 69866, 69029, 67730, 66370, 65598, 65709, 66342, 66949, 67391, 67815, 68155, 68168, 67969, 68036, 68500, 68856, 68636, 68131, 68084, 68830, 70013, 71060, 71645, 71708, 71310, 70570, 69650, 68771, 68216, 68191, 68606, 69120, 69509, 69817, 70038, 69985, 69686, 69650, 70284, 71169, 71426, 70799, 69943, 69496, 69298, 68849, 68236, 68177, 69152, 70740, 71938, 72103, 71537, 71134, 71449, 72251, 73034, 73708, 74433, 74963, 74677, 73425, 71907, 70918]
55170G0918m05l33o13p98o73j49P70J707K062J706J172R17P39L70J09M19J058
55153G8976J265P29j36r41j720k423k562j838p80k28k77k60J85N24J29p26j196
55136F8721j000o79o38n01J92J085J330P03j28m26o5O85J488J913J564N85k40
55119G4589k93J64L68On83r70j006o93p1O75J266J575J579J187L62n16q07k86
55101G6546N79J145J197R87R12J257J933K321J691J10j376j788j220m85PM82J020
55084H5318J239R01L32j01m74r60j302j108m84M1J17k21p57j182j078l41M59N90
55066H0989O5m01l66n3K76P28J235J264N27m22p98m63K05Q95J338J103K05m92
55048H5835j96N96P39P7m91n62p49j329j519p54K60N82M08N37R45R12K36n22r14
$$ y = [70918, 70513, 70180, 69567, 68769, 68096, 67947, 68717, 70424, 72486, 74192, 75364, 76281, 77020, 77390, 77499, 77918, 78976, 80241, 80970, 80834, 79893, 78173, 75750, 73188, 71350, 70570, 70342, 70065, 69805, 69990, 70514, 70643, 69917, 68721, 67721, 67042, 66404, 65903, 66095, 67180, 68510, 69213, 69085, 68659, 68594, 69279, 70767, 72680, 74244, 74829, 74589, 74296, 74460, 74828, 74834, 74251, 73281, 72275, 71582, 71511, 72186, 73452, 75027, 76606, 77793, 78155, 77639, 76832, 76546, 77125, 78270, 79467, 80454, 81366, 82623, 84556, 86877, 88568, 88678, 87302, 85514, 84294, 83809, 83816, 84298, 85318, 86557, 87458, 87790, 87689, 87215, 86255, 84953, 83845, 83361, 83402, 83519, 83298, 82541, 81359, 80281, 79940, 80399, 80989, 81054, 80653, 80287, 80234, 80510, 81238, 82473, 83737, 84264, 83842, 83044, 82581, 82786, 83681, 85019, 86122, 86327, 85835, 85639, 86235, 86974, 87051, 86560, 85998, 85249, 83920, 82401, 81647, 81907, 82489, 82897, 83434, 84379, 85291, 85527, 85005, 84091]
55029H4091r21n13K59Q07M42n17q91j33R64J344R14K69k61p68j209j260p15J84
55011H2086Q72Q66K22m15l96K28P73P27K34j65r3L78P50M67m74j289j189l06N22
54992H3798Q64R90J080Q09M8o18n93n1L56L22k2m90r05r75n21K54R91J519J730
54973H8586J419N58l95q35n86P2P49J133J081P85O30O54M95J08K3N27J048R57
54955I7009N87O42R49O72k96j056r72m66k00k07j10K35O78R82Q81K67m75p64n35
54936I7821k45j08J55O18Q95Q27Q27J092J148P09M78J298K848L937L969L508L402
54919A23179L963M986O079O931P599Q498R672J0206Q986O080K850M59j270l236
54905A94982n709p976r183r211q592p812o832n438l956l153l352l892l863l099
$$ y = [84091, 83170, 82657, 82916, 83723, 84165, 83648, 82757, 82624, 83588, 84932, 85846, 86115, 85854, 85086, 83877, 82617, 81902, 82086, 82958, 83824, 84046, 83631, 83235, 83463, 84236, 84963, 85197, 85032, 84939, 85317, 86067, 86534, 86060, 84771, 83582, 83276, 83798, 84662, 85652, 86732, 87541, 87589, 86971, 86378, 86327, 86683, 87005, 86983, 86493, 85588, 84613, 84092, 84346, 85337, 86856, 88586, 90005, 90563, 90168, 89333, 88747, 88819, 89568, 90701, 91782, 92567, 93197, 93851, 94346, 94454, 94477, 95004, 96052, 97009, 97596, 98238, 99187, 99859, 99563, 98507, 97535, 97069, 96869, 96662, 96552, 96787, 97465, 98447, 99328, 99595, 99120, 98356, 97821, 97576, 97468, 97623, 98241, 99136, 99963, 100790, 101882, 103030, 103739, 104217, 105515, 108363, 112300, 116269, 119777, 123179, 127142, 132128, 138207, 145138, 152737, 161235, 170907, 181113, 190099, 196179, 199029, 199488, 198218, 194982, 189273, 181297, 172114, 162903, 154311, 146499, 139667, 134229, 130273, 127120, 123768, 119876, 116013, 112914]
54891A12914k139j411r32o04l21J60R32J625J882K044K672L519L810L610L965
54876A31726N273O493O565N904N658O096O620O879O918O368M592J770j011l013
54862A96838m546o174p786q744q623p565o295n708o063o512n945m426l142k765
54848A12544k581j717n62j83o91j074n97K73O21K52l31p85j358k343l373l606
54832I4489k736j506q99j011j076n61K56Q86J205J231Q60K20j77n6K09K47L29
54815I1910P80J176Q91K28J66Q85J439J103L08j53k66n26j006j256r74l52K86
54798I4639P31Q21M37k38o81m07N37J571K080J927J445R51N17J79J20L85O60O25
54780A06299M03L14M17N58P91J228J657J817J926K416L124L389L103L017L764
$$ y = [112914, 110775, 109364, 108432, 107828, 107507, 107667, 108599, 110224, 112106, 114150, 116822, 120341, 124151, 127761, 131726, 136999, 143492, 150057, 155961, 161619, 167715, 174335, 181214, 188132, 194500, 199092, 200862, 199851, 196838, 192292, 186118, 178332, 169588, 160965, 153400, 147105, 141397, 135334, 128822, 122877, 118451, 115309, 112544, 109963, 108246, 107684, 107501, 106810, 105736, 105139, 105412, 106033, 106285, 105954, 105169, 103811, 101468, 98095, 94489, 91753, 90247, 89348, 88337, 87261, 86700, 86956, 87842, 89047, 90278, 91138, 91358, 91181, 91125, 91334, 91581, 91910, 92690, 93866, 94757, 94985, 95151, 96036, 97475, 98578, 98886, 98733, 98467, 97941, 96935, 95679, 94705, 94353, 94639, 95370, 96191, 96628, 96390, 95709, 95302, 95839, 97410, 99490, 101417, 102862, 103813, 104330, 104509, 104629, 105014, 105674, 106299, 106702, 107016, 107433, 107991, 108782, 110010, 111667, 113484, 115410, 117826, 120950, 124339, 127442, 130459, 134223]
54765A34223N126O536P749Q741R423R815J0028R769Q466O198L850J863m10l450
54751B17927o362p930q310q638r221r314q526p330n973m102j890m75o00j550k084
54736A35622j878j388q28m6Q33J341J252Q04L55J33K61P12J326K040K959M062
54720A47560N045N773O534P581Q526Q622P528N494K947K66k175m151n786p302
54706A86462q501q863q234p127o193n552m833l805k820k513l071l851l945l138
54692A14016k049j295q52m66k65m63p62o53k60k38p04r40m52K06J50o68j532j902
54674A00871j720r56L80J652J749L72j263j629o43K85Q0q02j147n66K23M80K81
54657I7647J77M22P62Q29N31Q9j80j58j0N3Q8L08O64P45K90l57n21O7R83J547
$$ y = [134223, 139349, 145885, 153634, 162375, 171798, 181613, 191641, 201410, 209876, 216074, 219924, 221787, 221377, 217927, 211565, 203635, 195325, 186687, 177466, 168152, 159626, 152296, 146323, 142221, 140331, 139856, 139256, 137706, 135622, 133744, 132356, 131528, 131482, 132315, 133656, 134908, 135712, 136067, 136200, 136461, 137173, 138499, 140539, 143498, 147560, 152605, 158378, 164912, 172493, 181019, 189641, 197169, 202663, 205610, 205876, 203701, 199550, 193764, 186462, 177961, 169098, 160864, 153737, 147544, 141992, 137159, 133354, 130534, 128021, 124950, 121099, 117154, 114016, 111967, 110672, 109820, 109354, 109089, 108626, 107864, 107211, 106951, 106713, 106009, 105069, 104617, 104823, 104973, 104305, 102773, 100871, 99151, 98195, 98575, 100227, 101976, 102348, 101085, 99456, 98813, 99098, 99178, 98376, 97229, 96663, 96886, 97366, 97647, 97824, 98246, 99008, 99837, 100368, 100457, 100277, 100119, 100109, 100162, 100250, 100558, 101222, 101967, 102257, 101900, 101379, 101446, 102429, 103976]
54637A03976J410P33j6m27m45l69n07p94q84o57m14m53n58j76Q24J811J995J293
54619A06342M04QP1O2k23l40J77J016J239M38n80o50K65Q99K94r34j435r27l82
54600A05744n30r98j204j263j419j282m59M58M99k41o10O0J229K090K394K127
54584A06595J186j22r32p81k28l6j91l52o59j342j805j100P00K372K891K256R79
54567A09431n19j734k126j723j251j142r03Q6J448K099J581O22K52P37J485J782
54551A10125J483R91O65L50l17j273j906j752r71l9Q13J520J841J567J022Q51
54535A14970J178J387R90L69K63P22J034P41K88M08J062J390P35n29j333j075
54519A22600k77j8o87j474j275j6J205J423Q94N77P91R33N06j50m69n43q95j575
$$ y = [103976, 105386, 106119, 106103, 105676, 105231, 104862, 104355, 103561, 102677, 102020, 101606, 101153, 100595, 100419, 101243, 103054, 105049, 106342, 106746, 106754, 106825, 106887, 106664, 106324, 106501, 107517, 108756, 109194, 108614, 107964, 108229, 109128, 109422, 108488, 107053, 106126, 105744, 105214, 104216, 103012, 101749, 100330, 99048, 98589, 99047, 99546, 99305, 98695, 98755, 99984, 102074, 104468, 106595, 107781, 107659, 106727, 105946, 105718, 105682, 105491, 105139, 104480, 103138, 101333, 100233, 100933, 103305, 106196, 108452, 109431, 108912, 107178, 105052, 103329, 102078, 100936, 100033, 100119, 101567, 103666, 105247, 105869, 106121, 106858, 108343, 110125, 111608, 112599, 113264, 113614, 113297, 112024, 110118, 108366, 107395, 107356, 108169, 109689, 111530, 113097, 114119, 114970, 116148, 117535, 118525, 118894, 119157, 119879, 120913, 121654, 121942, 122350, 123412, 124802, 125537, 125008, 123675, 122600, 122323, 122305, 121618, 120144, 118869, 118853, 120058, 121481, 122375, 122952, 123743, 124676, 125182, 125032, 124563, 124020, 123125, 121550]
54501A21550j995j659p18K89R28J040O20j80j032j524j348n43M08Q70O60L13M78
54484A18157J067J302O96k91p42k61O94J382J504J332J263J322J147N94P6J04
54468A29346N51Q13P28Q32J361J554O06r57j661r67J9Q1n54q40n57m09o19m69
54450A28858M36J314J244M45j13r6J2j53m20o56r97j318j133l74K99K99j55n13
54432A26979o44p16o32j57N60J036J040P57M17J37M0K40O44J000J092Q63M21Q6
54414A33163J41M12L90L6qO16J250J088M37K79P72R72K07j016j715j420l54Q80
54396A36130J603J563J264J365J664J413O24J95M26L96n78j700j818j094o38p72
54380A40043q20m19p2k23o03q12q80r61r16n83n5N05J037J414J380Q88K88m3o5
$$ y = [121550, 119555, 117896, 117178, 117467, 118395, 119435, 120055, 119875, 118843, 117319, 115971, 115428, 115836, 116706, 117366, 117679, 118157, 119224, 120526, 121222, 120931, 120189, 119928, 120622, 122004, 123508, 124840, 126103, 127425, 128572, 129166, 129242, 129346, 129897, 130710, 131438, 132270, 133631, 135185, 135791, 134834, 133173, 132206, 132225, 132306, 131752, 130912, 130355, 129946, 129327, 128858, 129294, 130608, 131852, 132297, 132184, 132088, 132100, 131947, 131527, 130871, 129874, 128556, 127423, 127049, 127348, 127647, 127492, 126979, 126335, 125619, 124987, 124830, 125390, 126426, 127466, 128223, 128640, 128777, 128817, 129057, 129701, 130701, 131793, 132656, 133077, 133163, 133304, 133716, 134106, 134142, 134134, 134750, 136000, 137088, 137525, 137804, 138576, 139548, 139755, 138739, 137024, 135604, 135250, 136130, 137733, 139296, 140560, 141925, 143589, 145002, 145626, 145821, 146247, 146643, 146065, 144365, 142547, 141453, 140815, 140043, 139223, 138804, 138732, 138509, 137906, 137094, 136214, 135253, 134337, 133754, 133699, 134204, 135241, 136655, 138035, 138923, 139211, 139168, 139103]
54361A39103J0j2j65l41l35p3K70N02O93R23Q53Pj442k612k843k306j491n95K45
54342A30391N32j35j293j903j548q44n08m59j72L81O49K93m10j025j464j752j635
54325A19098p79O59J966K459K026J075J48m31o33n92l68N4N15P07O52Q59J587
54308A29002K235J970R47J92L23R94J752K636L576L915L247K149J413R77K98n44
54292A55082j011j160j664k695l503l357k381j329r52j531k585l025k241r95n90
54277A26063j122j345m56Q07J253O96k16j007j535j609j139m56Q4N85J261J820
54261A23684J749J094L89n0l05l49N0Q49J484J366M25q07j523j223k02O20O10
54244A27861O8l08l31l07l53l16l39p83j472j639r95k88l68j046j396r90k47K68
$$ y = [139103, 139113, 139101, 138936, 138595, 138260, 138187, 138457, 138959, 139652, 140575, 141428, 141435, 139993, 137381, 134538, 132232, 130741, 130146, 130391, 130923, 130788, 129495, 127592, 126044, 125200, 124692, 124233, 124061, 124442, 125091, 125384, 124974, 123949, 122485, 120733, 119098, 118319, 118978, 120944, 123403, 125429, 126504, 126652, 126221, 125588, 124996, 124628, 124682, 125197, 125904, 126556, 127415, 129002, 131237, 133207, 134154, 134346, 134669, 135663, 137415, 140051, 143627, 147542, 150789, 152938, 154351, 155328, 155626, 155082, 154071, 152911, 151247, 148552, 145049, 141692, 139311, 137982, 137030, 135499, 132914, 129889, 127648, 126653, 126063, 124941, 123596, 123140, 123947, 125200, 125896, 125680, 124673, 123138, 121529, 120390, 119934, 120018, 120603, 121864, 123684, 125433, 126527, 126916, 126866, 126561, 126212, 126262, 127111, 128595, 129961, 130386, 129579, 128056, 126833, 126631, 127251, 127861, 127929, 127621, 127290, 126983, 126630, 126314, 125975, 125192, 123720, 122081, 121086, 120798, 120430, 119384, 117988, 116998, 116751, 117019]
54226A17019M16K92l1l85n44n52p11j071j202p89j59R5r9k98k11P7M66R43J252
54207A14508R71J75m69n18k98k78l94l61k56j99J56J089K060K234J659J093P29
54190A21901L1j018j521j017k80j95m91l68J72M57K28j35l41m37l91q8L21N35
54172A17363N65O53Q10Q62P90O30J98n10r05m26M65O59j65j109j252o44J24P23
54154A18831J091J063M94l85j129j476j443j122n84L4M40K61n67j478j645r13
54138A11472k8L53M92R01J338J190O52N16Q85J018O14K95M80O79L77j22k91j77
54120A20644o9N0K05J18k58l86N6O06P81Q49J111J131M61l21l73lj81q49r89l92
54100A22191q2o43j216p90L50J148J129O27Q6k42k41k0Q3k5kL78Q03Q90P66P88
$$ y = [117019, 117435, 117727, 117696, 117311, 116767, 116215, 115504, 114433, 113231, 112442, 112283, 112378, 112279, 111981, 111770, 111847, 112313, 113256, 114508, 115479, 115654, 115185, 114667, 114369, 114091, 113697, 113336, 113080, 112881, 113037, 114126, 116186, 118420, 120079, 121172, 121901, 121932, 120914, 119393, 118376, 118096, 117901, 117410, 117042, 117214, 117671, 117899, 117764, 117423, 116986, 116595, 116507, 116828, 117363, 117928, 118581, 119391, 120253, 121043, 121673, 121871, 121361, 120456, 120030, 120495, 121154, 120989, 119880, 118628, 117984, 118108, 118831, 119922, 120985, 121479, 121094, 119965, 118489, 117046, 115924, 115340, 115374, 115814, 116075, 115508, 114030, 112385, 111472, 111444, 111797, 112289, 113190, 114528, 115718, 116370, 116886, 117771, 118789, 119403, 119698, 120178, 120857, 121234, 121112, 120821, 120644, 120575, 120625, 120830, 120948, 120690, 120304, 120360, 120966, 121747, 122596, 123707, 124838, 125299, 124978, 124605, 124602, 124421, 123572, 122583, 122191, 122109, 121466, 120250, 119460, 119810, 120958, 122087, 122714, 122800, 122558, 122317, 122297, 122380, 122355, 122353, 122731, 123534, 124424, 125190, 125978]
54080A25978R62J054J036J010Q70M59Nl5M37J030J359J401J317J148Q12L37RK03
54062A39392R49J675J651P95j70m66L1R40J886K547K495J520J23p44n49L25J097
54045A53497J317J132J047J483K469L624M515N035N392N704N783N458M948M809
54031B06213N351O174O488N946N008M311L901L401K776K429K481K509K210J893
54017B61091J962K225K183J678Q66j94j448k531l077l276l603m061m248m165m272
54002B39130m618m557l718k771k696l547m371m288l314k196j631j666j786j596
53988A96375j291j290j485j370r23p99j430k364k923k996k748k035p25O49J337
53973A75982J254Q60K79o94j674j695m63J092J930K053K138K505K974L463M105
$$ y = [125978, 126940, 127994, 129030, 130040, 130910, 131369, 131374, 131339, 131776, 132806, 134165, 135566, 136883, 138031, 138843, 139180, 139189, 139392, 140341, 142016, 143667, 144462, 144292, 143826, 143857, 144797, 146683, 149230, 151725, 153245, 153368, 152624, 152075, 152400, 153497, 154814, 155946, 156993, 158476, 160945, 164569, 169084, 174119, 179511, 185215, 190998, 196456, 201404, 206213, 211564, 217738, 224226, 230172, 235180, 239491, 243392, 246793, 249569, 251998, 254479, 256988, 259198, 261091, 263053, 265278, 267461, 269139, 270005, 269811, 268363, 265832, 262755, 259479, 255876, 251815, 247567, 243402, 239130, 234512, 229955, 226237, 223466, 220770, 217223, 212852, 208564, 205250, 203054, 201423, 199757, 197971, 196375, 195084, 193794, 192309, 190939, 190016, 189217, 187787, 185423, 182500, 179504, 176756, 174721, 173996, 174645, 175982, 177236, 178096, 178375, 177681, 176007, 174312, 173849, 174941, 176871, 178924, 181062, 183567, 186541, 190004, 194109]
53958A94109M889N586O010O158O226O585P452Q310Q081O272L646J295o17k603
53944B61399m604n810n744m848l855l141k867l104l498l348k406j189k27N81J523
53929B18862K463L125L593M087M483M628M784N284N875O012N690N409N442N714
53915B85451O314P400Q521Q781P970P000O780P196P489P223O405N090L392J731
53901C76743N33j93o73r35r94j226j963k802k919k242j752k327l641m620m732
53886C46257m488m712n638o755p415p517p546p924q360q057o620m573k882k081
53872B61689k008k286k701l185l660m064m405m667m733m497m028l533l147k806
53858B11969k333j652r18m39m17o89q27o11l40m36q02q72m39m6k69q93j258j202
$$ y = [194109, 198998, 204584, 210594, 216752, 222978, 229563, 237015, 245325, 253406, 259678, 263324, 264619, 264002, 261399, 256795, 250985, 245241, 240393, 236538, 233397, 230530, 227426, 223928, 220580, 218174, 216985, 216758, 217339, 218862, 221325, 224450, 228043, 232130, 236613, 241241, 246025, 251309, 257184, 263196, 268886, 274295, 279737, 285451, 291765, 299165, 307686, 316467, 324437, 331437, 338217, 345413, 352902, 360125, 366530, 371620, 375012, 376743, 377276, 377083, 376410, 375475, 374481, 373255, 371292, 368490, 365571, 363329, 361577, 359250, 355609, 350989, 346257, 341769, 337057, 331419, 324664, 317249, 309732, 302186, 294262, 285902, 277845, 271225, 266652, 263770, 261689, 259681, 257395, 254694, 251509, 247849, 243785, 239380, 234713, 229980, 225483, 221455, 217922, 214775, 211969, 209636, 207984, 207066, 206627, 206210, 205521, 204694, 204083, 203743, 203307, 202505, 201633, 201194, 201148, 200879, 199986, 198728, 197526]
53840A97526j160j251j072n38l13r27j893k340k132j793j501j001m30l91r27j190
53824A78667n83L36O75M50L52M96L15l36o91q7J118K054K402K443K303J830J281
53807A93025J441K632L960M195L355K825L673N315O276O015N408N455O118O685
53793B56378O836O874P091P364P413P218P027P150P774Q873J0207J1393J1978
53780C63576J1427R317N748J409k920o917j0530j3369j4776j4575j3433j2164
53768C02793j1006r818q735q156q085p918p120n809m550l744l408l352l301k983
53754B14808k310j580j255j503k047k521k782k781k377j474l83J99j90j186j823
53739A90795j470n67j33n78j201j121m07J20J04J12P20J650K176K074J646J077
$$ y = [197526, 196366, 195115, 194043, 193505, 193192, 192265, 190372, 188032, 185900, 184107, 182606, 181605, 181175, 180784, 179857, 178667, 178084, 178420, 179095, 179545, 179897, 180393, 180708, 180372, 179681, 179594, 180712, 182766, 185168, 187611, 189914, 191744, 193025, 194466, 197098, 201058, 205253, 208608, 211433, 215106, 220421, 226697, 232712, 238120, 243575, 249693, 256378, 263214, 270088, 277179, 284543, 291956, 299174, 306201, 313351, 321125, 329998, 340205, 351598, 363576, 375003, 384320, 390068, 391477, 388557, 381640, 371110, 357741, 342965, 328390, 314957, 302793, 291787, 281969, 273234, 265078, 256993, 249075, 241955, 236146, 231596, 227852, 224444, 221092, 217791, 214808, 212498, 210918, 209663, 208160, 206113, 203592, 200810, 198029, 195652, 194178, 193795, 193994, 193804, 192618, 190795, 189325, 188758, 188625, 188047, 186846, 185725, 185318, 185438, 185542, 185654, 186374, 188024, 190200, 192274, 193920, 194997]
53723A94997L02n15r14p00k17J61M58Q42J203J323J251J234J366J523J605J684
53707B05603J886K246K616K740K483K070J890K076K384K504K300J722Q10p2l87
53692B32871o2L47M60O82J460K300K121P14q62j514j292j043j301j897k422k634
53676B27928k494k095j644j320j090p62k54K27L05j73q39j052n99m4n2m85o21
53659B14936k48m9n81j322j259k46P51P77j40j202j688j469r02m08j10J65M99
53642B07504O61M16j0j12K66P36R14Q95J045J546K251K839K960K451J564Q47O10
53625B27383O38O26P05J211K065K766L017L024L069L131L086L008K975K890K756
53610B62350K845L259L481K928J876J317J708K400K595K351K152J970J406N95
$$ y = [194997, 195299, 194784, 193870, 193170, 192953, 193114, 193572, 194414, 195617, 196940, 198191, 199425, 200791, 202314, 203919, 205603, 207489, 209735, 212351, 215091, 217574, 219644, 221534, 223610, 225994, 228498, 230798, 232520, 233330, 233258, 232871, 232809, 233156, 233616, 234298, 235758, 238058, 240179, 240893, 240031, 238517, 237225, 236182, 234881, 232984, 230562, 227928, 225434, 223339, 221695, 220375, 219285, 218523, 218269, 218496, 218801, 218628, 217789, 216737, 216138, 216094, 216042, 215557, 214936, 214688, 214639, 214058, 212736, 211477, 211231, 211982, 212759, 212619, 211417, 209729, 208260, 207358, 206950, 206840, 207005, 207504, 208165, 208581, 208571, 208459, 208725, 209461, 210375, 211270, 212315, 213861, 216112, 218951, 221911, 224362, 225926, 226773, 227383, 228021, 228647, 229352, 230563, 232628, 235394, 238411, 241435, 244504, 247635, 250721, 253729, 256704, 259594, 262350, 265195, 268454, 271935, 274863, 276739, 278056, 279764, 282164, 284759, 287110, 289262, 291232, 292638, 293233]
53596B93233K04M18O33L86%j30l04j012j936k165j418m56j62o05j201j409j139
53579B82937p40p94j616k784l385l006k200j755j771j807j667j555j516j318r72
53564B56051q21r01o86J33R63J004L68k0L54J000J248J143J177J449J541J195
53548B65198P24O61J186J980K560K731K722K863L163L339L350L600M431N513O135
53533C10156O087N946O362P355Q399R009R142R139R455J0337J1552J2576J3121
53520D28636J3406J3765J4258J4822J5651J6956J8445J9427J9651J9683K0184
53509F14884K1120K1974K2529K2959K3185K2728K1401J9831J8883J8787J9087
53498H47368J9280J9153J8657J7918J7373J7443J7965J8292J8095J7696J7419
$$ y = [293233, 293437, 293855, 294488, 294874, 294874, 294744, 294440, 293428, 291492, 289327, 287909, 287453, 287291, 286686, 285485, 284076, 282937, 282197, 281403, 279787, 277003, 273618, 270612, 268412, 266657, 264886, 263079, 261412, 259857, 258341, 257023, 256051, 255230, 254329, 253643, 253776, 254739, 255743, 256111, 256091, 256445, 257445, 258693, 259836, 261013, 262462, 264003, 265198, 265922, 266583, 267769, 269749, 272309, 275040, 277762, 280625, 283788, 287127, 290477, 294077, 298508, 304021, 310156, 316243, 322189, 328551, 335906, 344305, 353314, 362456, 371595, 381050, 391387, 402939, 415515, 428636, 442042, 455807, 470065, 484887, 500538, 517494, 535939, 555366, 575017, 594700, 614884, 636004, 657978, 680507, 703466, 726651, 749379, 770780, 790611, 809494, 828281, 847368, 866648, 885801, 904458, 922376, 939749, 957192, 975157, 993449, 1011544, 1029240, 1046659]
53487A046659J7091J6486J5841J5472J5238J4813J4324J4132J4142J3857J3051
53476A211106J1864J0245P925N080K433M94r07k243l812n705p775r554j0769j1996
53462A196386j4081j6741j8589j8956j8774j9079j9489j9199j8648j8949k0073
53451I93808k0885k0919k0792k0740k0115j8673j7244j6413j5611j4265j2940
53440G95211j2367j2070j1031r342q011p272o224m304k169o00P03K541M870O679
53426G36614P233O941O883P752R458J1469J3292J4674J5735J6970J8873K1233
53414H87127K3149K4109K4809K6248K8222K9493K9708L0213L2350L5627L8329
53403A209384L9664M0414M1599M3361M5281M7090M8676M9906N0728N1241N1444
$$ y = [1046659, 1063750, 1080236, 1096077, 1111549, 1126787, 1141600, 1155924, 1170056, 1184198, 1198055, 1211106, 1222970, 1233215, 1241140, 1246220, 1248653, 1249147, 1248240, 1245997, 1242185, 1236480, 1228705, 1219151, 1208382, 1196386, 1182305, 1165564, 1146975, 1128019, 1109245, 1090166, 1070677, 1051478, 1032830, 1013881, 993808, 972923, 952004, 931212, 910472, 890357, 871684, 854440, 838027, 822416, 808151, 795211, 782844, 770774, 759743, 750401, 742390, 735118, 728894, 724590, 722421, 721821, 722524, 725065, 729935, 736614, 743847, 750788, 757671, 765423, 774881, 786350, 799642, 814316, 830051, 847021, 865894, 887127, 910276, 934385, 959194, 985442, 1013664, 1043157, 1072865, 1103078, 1135428, 1171055, 1209384, 1249048, 1289462, 1331061, 1374422, 1419703, 1466793, 1515469, 1565375, 1616103, 1667344, 1718788]
53392A718788N1278N0967N1021N1569N2006N1575N0120M8086M5951M3839M1571
53381B256771L8933L5859L2483K8895K4907K0304J5321J0569O366K415j641n711
53369B465471r638j3824j8915k4814l0580l5515l9978m4732m9708n3918n6559
53358B087290n7734n7947n7375n6010n4234n2681n1618n0809m9956m8836m7146
53347A502944m4885m2868m2090m2350m2258m1078l9707l9109l8627l6920l4100
53336A058952l1613l0100k8718k6717k4481k2490k0406j7904j5553j4041j3140
53325H13789j2207j1169j0253r229p743o111m919m072l016j712o27J94J223K668
53311G46816M305O094Q123R937J0760J0720J1005J2426J4491J6334J7863J9407
$$ y = [1718788, 1770066, 1821033, 1872054, 1923623, 1975629, 2027204, 2077324, 2125410, 2171361, 2215200, 2256771, 2295704, 2331563, 2364046, 2392941, 2417848, 2438152, 2453473, 2464042, 2470408, 2472823, 2471182, 2465471, 2455833, 2442009, 2423094, 2398280, 2367700, 2332185, 2292207, 2247475, 2197767, 2143849, 2087290, 2029556, 1971609, 1914234, 1858224, 1803990, 1751309, 1699691, 1648882, 1598926, 1550090, 1502944, 1458059, 1415191, 1373101, 1330751, 1288493, 1247415, 1207708, 1168599, 1129972, 1093052, 1058952, 1027339, 997239, 968521, 941804, 917323, 894833, 874427, 856523, 840970, 826929, 813789, 801582, 790413, 780160, 770931, 763188, 757077, 752158, 748086, 745070, 743358, 742731, 742925, 744148, 746816, 751121, 757215, 765338, 775275, 786035, 796755, 807760, 820186, 834677, 851011, 868874, 888281]
53299H88281K0790K1646K2318K3596K5494K7020K7405K7055K6959K7414K7771
53288A165749K7296K6002K4471K3102K1764K0172J8303J6272J4023J1425Q602
53277A377181N829L145K93k841n980q749j0978j2703j4091j5456j7062j8839k0456
53264A259293k1755k2905k3979k4735k5039k5250k5900k7080k8437k9646l0626
53253I73941l1317l1477l0876k9595k8127k7035k6449k5939k5112k4201k3819
53242F69994k4001k3951k2980k1464k0414k0246k0362j9947j8886j7650j6535
53231D43558j5274j3541j1598j0150r468q971q001o838o396o902p478p340o885
53218C24716p016p725p986p114n676m816m976n576n829n570n169m809m119k757
$$ y = [888281, 909071, 930717, 953035, 976631, 1002125, 1029145, 1056550, 1083605, 1110564, 1137978, 1165749, 1193045, 1219047, 1243518, 1266620, 1288384, 1308556, 1326859, 1343131, 1357154, 1368579, 1377181, 1383010, 1386155, 1386448, 1383607, 1377627, 1368878, 1357900, 1345197, 1331106, 1315650, 1298588, 1279749, 1259293, 1237538, 1214633, 1190654, 1165919, 1140880, 1115630, 1089730, 1062650, 1034213, 1004567, 973941, 942624, 911147, 880271, 850676, 822549, 795514, 769065, 743126, 718014, 693813, 669994, 645993, 622042, 599062, 577598, 557184, 536938, 516576, 496629, 477743, 460093, 443558, 428284, 414743, 403145, 392995, 383527, 374556, 366555, 359717, 353321, 346419, 338941, 331601, 324716, 317700, 309975, 301989, 294875, 289199, 284383, 279407, 273831, 268002, 262432, 257263, 252454, 248335, 245578]
53204B45578j146k56o46j954l375m273m280l301j773n89l46q18j382j652j486
53189B18301p67K74Q69M25o94j611k018k245k411k179j503q86p09p18m60J65R53
53172B04786J600J686R15l33j118r53l53p7j30L8N46Q26L51o63j416j219j47R01
53154B05240R06k81j650j990j121j4K96k61r20j025n97j0N66J110J368R97J85
53137B02799l42j86K32L27J15j14m68j108j549j116q3M95K36q4K30Q13R79O71
53119B01847J85m98j383j902j467l96L67M23K06R7j16o88j282j287o52j04l22
53102A93028j068j398r38m97r85k011k294j493o56o55r48n96K63P01L60k95q28
53085A79690j214j480j549j378r18j19O43N89m49j463j451q29p85j479j865j265
$$ y = [245578, 244432, 244176, 243530, 241576, 238201, 233928, 229648, 226347, 224574, 223985, 223639, 222821, 221439, 219787, 218301, 217534, 217808, 218677, 219102, 218408, 216797, 214779, 212534, 210123, 207944, 206441, 205555, 204846, 204128, 203668, 203833, 204786, 206386, 208072, 208987, 208654, 207536, 206583, 206230, 206153, 206023, 206061, 206607, 207433, 207784, 207121, 205705, 204486, 204339, 205240, 206146, 205865, 204215, 202225, 201104, 201090, 201386, 201125, 200205, 199180, 198583, 198573, 199139, 200249, 201617, 202614, 202799, 202457, 202271, 202503, 202830, 202945, 202831, 202363, 201255, 199706, 198590, 198507, 199002, 199238, 199154, 199384, 200197, 201176, 201847, 202032, 201534, 200151, 198249, 196782, 196386, 196753, 197176, 197382, 197479, 197363, 196675, 195393, 194106, 193454, 193350, 193028, 191960, 190562, 189624, 189127, 188142, 186131, 183837, 182344, 181688, 181033, 180085, 179489, 179752, 180453, 180813, 180518, 179690, 178476, 176996, 175447, 174069, 173151, 173032, 173675, 174264, 173815, 172352, 170901, 170072, 169287, 167808, 165943, 164678]
53069A64678j97N30P02M87N0l02k65j7Qj36J1L86M18O4k0L36L75l48j113j076
53049A64571m69l2J82O67J434J874J507L79j107k300k588k016j395j333j465j099
53033A56810k33N84J112J439J366N24q50j907k023j276r3J077J753J635J021O00
53017A61539O98R36Q13L13j63l02j89j53l97o99o37j53K67J64l56p81p99n16k64
52998A59321k98n45n39P3Q68Q81j84j442j861j383n85K56J077J442Q57l33j150
52981A56455j083m62K66R58J423J411J067Q29O82J54p45j226p56J78P82J000J331
52964A62264J879K124J639O64j43l69j97j58n64j276j987k474k503j838p00J21
52948A56482J52q8J43O42N74j68p93q39o65n64l38r3m28j290j557n51P88J147
$$ y = [164678, 164481, 165011, 165713, 166200, 166250, 165948, 165683, 165666, 165674, 165538, 165549, 165935, 166353, 166417, 166397, 166733, 167108, 166760, 165647, 164571, 164102, 164070, 164252, 164919, 166353, 168227, 169734, 170113, 169006, 166706, 164118, 162102, 160707, 159374, 157909, 156810, 156577, 157161, 158273, 159712, 161078, 161602, 160752, 158845, 156822, 155546, 155453, 156530, 158283, 159918, 160939, 161539, 162237, 163173, 163986, 164299, 164136, 163834, 163645, 163492, 163095, 162396, 161759, 161606, 161873, 162037, 161681, 160900, 160101, 159585, 159321, 159023, 158478, 157939, 158012, 158880, 159761, 159577, 158135, 156274, 154891, 154306, 154562, 155639, 157081, 157938, 157605, 156455, 155372, 154910, 155176, 156134, 157557, 158968, 160035, 160864, 161546, 161700, 160955, 159729, 158973, 159151, 159933, 160933, 162264, 164143, 166267, 167906, 168570, 168427, 168058, 167861, 167703, 167139, 165863, 163876, 161402, 158899, 157061, 156361, 156482, 156634, 156546, 156689, 157331, 157905, 157737, 156944, 156105, 155440, 154876, 154538, 154445, 154017, 152727, 151170, 150619, 151407, 152554]
52930A52554O14K37K76N8o22j113r99o29l60q3J86N6m95p50j42R24J535J300N55
52911A53102j84o15o77n36m49m74m27k40j03j29j22P7K79K41N6o8k12n05o38k02
52891A48174M81M32o95j880j806m30J012J485J043K47n72j102p98M65J783K059
52875A49898J371Q22R97J314J120O70N42P15Q39R64J277J383O68o12j345q49L27
52858A60101J177J311J049P76O31N93N23J80m75j013q83j14N05K06q95j922k252
52841A59498k130k096k143j867j318j053j260j381r55k97P7K60O30J018R21L95
52825A48299M3J60M17N27N66N85M18Q9j31k08m04o23l50M50R56N90n8N5J014J999
52805A54394K469K613K594K081Q46o29j597j927k181k779l330l054j831n43j16
$$ y = [152554, 153168, 153405, 153681, 153739, 153117, 152004, 151005, 150376, 150016, 149933, 150119, 150175, 149680, 148930, 148788, 149712, 151247, 152547, 153102, 152918, 152303, 151626, 151090, 150641, 150167, 149740, 149500, 149397, 149268, 149146, 149223, 149502, 149743, 149799, 149731, 149519, 149014, 148376, 148174, 148655, 149087, 148392, 146512, 144706, 144276, 145288, 146773, 147816, 148063, 147491, 146389, 145591, 146056, 147839, 149898, 151269, 152091, 153088, 154402, 155522, 156192, 156734, 157449, 158288, 159252, 160529, 161912, 162580, 161968, 160623, 159774, 160101, 161278, 162589, 163638, 164414, 165045, 165638, 166161, 166341, 165866, 164853, 163970, 163856, 164361, 164567, 163672, 161750, 159498, 157368, 155272, 153129, 151262, 149944, 148891, 147631, 146250, 145295, 144998, 145075, 145335, 145965, 146983, 147904, 148299, 148342, 148502, 148919, 149446, 150012, 150597, 151015, 151104, 150973, 150765, 150361, 149738, 149388, 149838, 150794, 151384, 151326, 151381, 152395, 154394, 156863, 159476, 162070, 164151, 164997, 164368, 162771, 160844, 158663, 155884, 152554, 149500, 147669, 147126, 147010]
52790A47010m74q35q94j033j331j152k83L69l6q66q37R6P36M93J05K49N67N45
52772A42429M23M74K30o58j429j142j13N19M49L54N53O71O89J111J770J635L91
52755A48356p81q22k79k80p23o46N8N23L58J22K38M84P26J171J596J318L72j52
52737A51639L82J096Q45q9l99M16J597K298K345J867R74L1l59l9M44M79k6q36
52719A62665j734k437k520j792o97l8k24q39j000k29R25J359O16n83j220j127
52703A51125q83q18p32n07m00n18n40k24K22M83N29M35K49J81N27J116J256P02
52685A52203J95N39J439J842J252J34r46j826k323j980p26O55J198Q21K85J51
52669A52913J72j08n39n69j17K39J44N2M81J079J029L24j05K93R77J232J164J268
$$ y = [147010, 146536, 145701, 144807, 143774, 142443, 141291, 141008, 141377, 141341, 140475, 139638, 139734, 140470, 140963, 141068, 141317, 141884, 142429, 142852, 143326, 143556, 142898, 141469, 140327, 140214, 140733, 141182, 141536, 142089, 142760, 143449, 144560, 146330, 147965, 148356, 147575, 146753, 146474, 146194, 145471, 144825, 144883, 145406, 145764, 145886, 146124, 146608, 147334, 148505, 150101, 151419, 151791, 151639, 152021, 153117, 153962, 153873, 153474, 153890, 155487, 157785, 160130, 161997, 162971, 163002, 162643, 162604, 163048, 163527, 163501, 162665, 160931, 158494, 155974, 154182, 153485, 153447, 153223, 152384, 151384, 151155, 152080, 153439, 154055, 153472, 152252, 151125, 150242, 149424, 148692, 148185, 147785, 147267, 146727, 146503, 146725, 147208, 147737, 148172, 148421, 148602, 149129, 150245, 151501, 152203, 152398, 152937, 154376, 156218, 157470, 157604, 156658, 154832, 152509, 150529, 149803, 150458, 151656, 152477, 152762, 152913, 153085, 152977, 152438, 151869, 151752, 151991, 152135, 152187, 152668, 153747, 154776, 155100, 154995, 155288, 156265, 157497, 158661, 159929]
52651A59929J495J433J106R34J012J037Q09K87o80k026l045l016k240j690j602
52636A53743j275m17K15N3k86M8Q37J234J102J059J397J761J842J727J448Q55
52620A65343J8o95j136j475j714j514p41K38R53J248J161P43K05j36k49m17o73
52603A61159n93M7P85J023P96O05O07N38K97J56K58L43J55j63k55j2L12M19K69
52584A66746J31K83O52Q66P63O70R61J482J711J412Q24K31l05p02p67n11k54k15
52566A73978k28n4K16L10J49j13k73j77J67M24J62n87j178j114o27k78j49J04
52548A70732N73R87J168J186R87L74n56j337j635j508j034j43R72J700J626J085
52532A75177P35P78Q42N81P0l74n75o12o65o83l89K77P53L57p29j421r46K48J145
$$ y = [159929, 161424, 162857, 163963, 164897, 165909, 166946, 167755, 168042, 167362, 165336, 162291, 159275, 157035, 155345, 153743, 152468, 152051, 152266, 152319, 152033, 152081, 152918, 154152, 155254, 156313, 157710, 159471, 161313, 163040, 164488, 165343, 165361, 164666, 163530, 162055, 160341, 158827, 158086, 158324, 159277, 160525, 161686, 162429, 162634, 162498, 162249, 161832, 161159, 160566, 160613, 161398, 162421, 163217, 163822, 164429, 164967, 165264, 165420, 165678, 166021, 166176, 166013, 165758, 165746, 166058, 166477, 166746, 166877, 167160, 167812, 168678, 169441, 170111, 171072, 172554, 174265, 175677, 176501, 176732, 176427, 175725, 174958, 174447, 174193, 173978, 173750, 173696, 173912, 174222, 174371, 174258, 173985, 173808, 173975, 174399, 174561, 173974, 172796, 171682, 171055, 170777, 170628, 170732, 171305, 172292, 173460, 174646, 175633, 176007, 175451, 174114, 172479, 170971, 169937, 169794, 170766, 172466, 174092, 175177, 175912, 176690, 177532, 178113, 178183, 177809, 177234, 176622, 175957, 175274, 174885, 175162, 175915, 176272, 175543, 174122, 173176, 173424, 174569]
52513A74569J388J354J327J203J036J195J764K271K250J760J104L47n13j153j205
52498A88697q31o64j040j647j991j945j616r77L3J126J734J589J025N57L69L55
52482A84774M11M87M70L09J70K23L38K75J16K06O41J122J351J290J038P69Q01
52465A94791J304J881J864J167L93oj86k99j05L66M36l22j273j543j296j364j867
52448A93941k081j664j120q86p52n01m31q00j271j348j042p20n76n07l70j48J3
52431A79737j11m83o74l28K48M63L29M20R13J314J320J246J315J156N21r5j26
52414A87165K29L74K20K09O28J429K468L506M180M393M570N095N750O034N820
52399B32070N234M238K756R86q64k827m683n641n135l764k659k160j817j433j265
$$ y = [174569, 175957, 177311, 178638, 179841, 180877, 182072, 183836, 186107, 188357, 190117, 191221, 191568, 191055, 189902, 188697, 187866, 187202, 186162, 184515, 182524, 180579, 178963, 177986, 178019, 179145, 180879, 182468, 183493, 184050, 184419, 184774, 185185, 185672, 186142, 186451, 186621, 186844, 187182, 187457, 187573, 187779, 188420, 189542, 190893, 192183, 193221, 193990, 194791, 196095, 197976, 199840, 201007, 201400, 201394, 201208, 200909, 200804, 201170, 201606, 201284, 200011, 198468, 197172, 195808, 193941, 191860, 190196, 189076, 188190, 187438, 186937, 186506, 185706, 184435, 183087, 182045, 181325, 180749, 180242, 179872, 179724, 179737, 179626, 179143, 178469, 178141, 178389, 178852, 179181, 179601, 180514, 181828, 183148, 184394, 185709, 186865, 187386, 187291, 187165, 187394, 187768, 187988, 188197, 188825, 190254, 192722, 196228, 200408, 204801, 209371, 214466, 220216, 226250, 232070, 237304, 241542, 244298, 245284, 244420, 241593, 236910, 231269, 226134, 222370, 219711, 217551, 215734, 214301, 213036]
52384B13036j212p81J1N04M41L18M86O05L77J12J89N01Q35J238J639J698J460
52367B21457J526K109K468J943J035O61P33L51o97j556j523r19m09q9L13P06O25
52350B28734J9m14N1J213K019J753Q93M79P85J183J244J332J811K322K330K045
52334B47799K198L041M099M793M942M713M493M692N370O099O456O566O809P268
52320C19338P817Q569R635J0518J0371Q959O968N231M039L294K896K764K781K882
52306D06062L036L101K975K862L132L826M622N202N406N014L948K647J766J385
52292D54984R90M06Q9K49K73l87j274j488r13k78j06k31k65k3O01J644K794L504
52274D60569L616L570L820M292M605M596M412M256M251M506N049N676O034N967
$$ y = [213036, 211824, 211043, 211054, 211558, 211999, 212317, 212803, 213408, 213785, 213897, 214086, 214587, 215422, 216660, 218299, 219997, 221457, 222983, 225092, 227560, 229503, 230538, 231199, 231932, 232283, 231586, 230030, 228507, 227588, 227179, 227090, 227403, 228109, 228734, 228753, 228339, 228390, 229603, 231622, 233375, 234268, 234747, 235532, 236715, 237959, 239291, 241102, 243424, 245754, 247799, 249997, 253038, 257137, 261930, 266872, 271585, 276078, 280770, 286140, 292239, 298695, 305261, 312070, 319338, 327155, 335724, 345359, 355877, 366248, 375207, 382175, 387406, 391445, 394739, 397635, 400399, 403180, 406062, 409098, 412199, 415174, 418036, 421168, 424994, 429616, 434818, 440224, 445238, 449186, 451833, 453599, 454984, 455974, 456380, 456469, 456718, 456991, 456604, 455330, 453842, 452929, 452651, 452545, 452314, 452049, 452026, 452627, 454271, 457065, 460569, 464185, 467755, 471575, 475867, 480472, 485068, 489480, 493736, 497987, 502493, 507542, 513218, 519252, 525219]
52260E25219N674N472N437N402N257N133N184N342N438N455N475N419N049M320
52246E99276L515K949K755K931L400L895M074L909L744L767L765L652L904M937
52232F50473O300P017O827O456O568O919O895O431N969N786N828O073O520O876
52218G40938O678N886N047M709M901N345N867O346O578O436O220O398P033P676
52204H26058P922P843P797P944Q102P956P303O203N017M195L951M112M353M463
52190I13219M378M122L799L573L372K809J578q6j443j866j408q60j310l297o204
52175I20376q574r360q792p878p195o493n454m346l704l625l593l010j823o09
52161H45920k9j61m79n21k64J80Q25J409J253J04j164j466r47o65r14q85j47N90
$$ y = [525219, 530893, 536365, 541802, 547204, 552461, 557594, 562778, 568120, 573558, 579013, 584488, 589907, 594956, 599276, 602791, 605740, 608495, 611426, 614826, 618721, 622795, 626704, 630448, 634215, 637980, 641632, 645536, 650473, 656773, 663790, 670617, 677073, 683641, 690560, 697455, 703886, 709855, 715641, 721469, 727542, 734062, 740938, 747616, 753502, 758549, 763258, 768159, 773504, 779371, 785717, 792295, 798731, 804951, 811349, 818382, 826058, 833980, 841823, 849620, 857564, 865666, 873622, 880925, 887128, 892145, 896340, 900291, 904403, 908756, 913219, 917597, 921719, 925518, 929091, 932463, 935272, 936850, 936764, 935321, 933455, 932047, 931187, 929877, 926580, 920376, 911802, 902442, 893650, 885772, 878577, 872084, 866630, 862284, 858580, 854955, 851362, 848352, 846529, 845920, 845891, 845730, 845251, 844730, 844466, 844646, 845471, 846880, 848133, 848237, 847073, 845607, 844660, 843995, 843081, 842196, 842049, 842639]
52143H42639P21P42J270J857J625O03m98j403k290l059l402l444l485l239k194
52128H26443o18O77J542K588M069N546O868Q526J0683J2650J3728J3935J3527
52115I20164J2580J1408J0704J0610J0203Q551N901L234J070o96k066k808k852
52102I86003k405j589m94O22J521K294L103L691L645K992K265J921J959J962J356
52087A008846k29k519m610n698n745n244m585l814k827j519M4J416K086K184K485
52072I80271L278L819L449K782K959M045N033N300N142M787L914K456J101M70
52058A028806K96p2p98j570k150k478k529k414k539l290m618o006o863o986o864
52043I79925p375q841j0438j0971j0227r012p902o670n096l591k555j815j089
$$ y = [842639, 843360, 844102, 845372, 847229, 848854, 849457, 848959, 847556, 845266, 842207, 838805, 835361, 831876, 828637, 826443, 825825, 826502, 828044, 830632, 834701, 840247, 847115, 855641, 866324, 878974, 892702, 906637, 920164, 932744, 944152, 954856, 965466, 975669, 984220, 990121, 993355, 994425, 993729, 991663, 988855, 986003, 983598, 982009, 981515, 982137, 983658, 985952, 989055, 992746, 996391, 999383, 1001648, 1003569, 1005528, 1007490, 1008846, 1008617, 1006098, 1001488, 995790, 990045, 984801, 980216, 976402, 973575, 972056, 972100, 973516, 975602, 977786, 980271, 983549, 987368, 990817, 993599, 996558, 1000603, 1005636, 1010936, 1016078, 1020865, 1024779, 1027235, 1028336, 1028806, 1029102, 1029030, 1028232, 1026662, 1024512, 1022034, 1019505, 1017091, 1014552, 1011262, 1006644, 1000638, 993775, 986789, 979925, 972550, 963709, 953271, 942300, 932073, 923061, 915159, 908489, 903393, 899802, 897247, 895432, 894343]
52030H94343n28j99M17J709L124L750L451K783K070J310P44P03Q86N98k29j004
52014I13928j515k171k993l261k708k290l084m885o596p721q729j0152j1982j4006
52000H31835j6016j7566j8146j7894j7716j8283j9191j9473j8729j7432j6182
$$ y = [894343, 893815, 893616, 894033, 895742, 898866, 902616, 906067, 908850, 910920, 912230, 912974, 913677, 914563, 915161, 914932, 913928, 912413, 910242, 907249, 903988, 901280, 898990, 895906, 891021, 884425, 876704, 867975, 857823, 845841, 831835, 815819, 798253, 780107, 762213, 744497, 726214, 707023, 687550, 668821, 651389, 635207]
$$ [...]
##END NTUPLES=NMR SPECTRUM
##END=
