
##TITLE=AC1293_MEXRH11104_6615905_SgdSj8YBsg
##JCAMPDX= 6.0         $$ Bruker NMR JCAMP-DX V2.0
##DATA TYPE= NMR SPECTRUM
##DATA CLASS= NTUPLES
##ORIGIN= BRUKER
##OWNER= Administrator
$$ 1.72 TOPSPIN		Version 2.1
$$ 2012-08-03 00:02:19.828 -0500  Administrator@TOPSPIN
$$ Compression mode = diff/dup
##.OBSERVE FREQUENCY= 400.02188249412
##.OBSERVE NUCLEUS= ^1H
##.ACQUISITION MODE= SIMULTANEOUS (DQD)
##.ACQUISITION SCHEME= undefined
##.AVERAGES= 8
##.DIGITISER RES= 22
##SPECTROMETER/DATA SYSTEM= spect
##.PULSE SEQUENCE= zg30
##.SOLVENT NAME= COFFEE_meoh
##.SHIFT REFERENCE= INTERNAL, COFFEE_meoh, 1, 14.98509
##AUDIT TRAIL= $$ (NUMBER, WHEN, WHO, WHERE, PROCESS, VERSION, WHAT)
$$ ##TITLE= Audit trail, TOPSPIN		Version 2.1
$$ ##JCAMPDX= 5.01
$$ ##ORIGIN= Bruker BioSpin GmbH
$$ ##OWNER= Administrator
$$ $$ C:\Bruker\TOPSPIN/data/COFFEE/nmr/AC1293_MEXRH11104_6615905_SgdSj8YBsg/10/pdata/1/auditp.txt
$$ ##AUDIT TRAIL=  $$ (NUMBER, WHEN, WHO, WHERE, PROCESS, VERSION, WHAT)
(   1,<2012-08-03 00:02:12.859 -0500>,<Administrator>,<TOPSPIN>,<go>,<TOPSPIN 2.1>,
      <created by zg
	started at 2012-08-03 00:01:06.390 -0500,
	POWCHK enabled, PULCHK disabled,
       configuration hash MD5:
       6B 1B 68 BB D9 2E 58 E2 7F 35 AD 54 07 DF 0E 41
       data hash MD5: 64K
       60 CC C6 8C 64 9E 87 E2 94 22 5C 7D 2A 3C 66 4E>)
(   2,<2012-08-03 00:02:15.531 -0500>,<Administrator>,<TOPSPIN>,<proc1d>,<TOPSPIN 2.1>,
      <Start of raw data processing
       efp LB = 0 FT_mod = 6 PKNL = 1 PHC0 = 0 PHC1 = 0 SI = 32K 
       data hash MD5: 32K
       2F E8 99 DD E2 7D 19 A0 1D 00 63 80 7E EE 25 DE>)
(   3,<2012-08-03 00:02:15.890 -0500>,<Administrator>,<TOPSPIN>,<proc1d>,<TOPSPIN 2.1>,
      <pk PHC0 = 176.6602 PHC1 = 0 
       data hash MD5: 32K
       A7 F8 AD 0F D7 B1 6A 46 C1 13 FA F7 9B 34 DB 93>)
(   4,<2012-08-03 00:02:15.968 -0500>,<Administrator>,<TOPSPIN>,<proc1d>,<TOPSPIN 2.1>,
      <abs ABSG = 1 
       data hash MD5: 32K
       28 00 2E C3 AC C0 7B 1B 24 C0 5D 53 05 F8 8C A7>)
(   5,<2012-08-03 00:02:16.000 -0500>,<Administrator>,<TOPSPIN>,<proc1d>,<TOPSPIN 2.1>,
      <abs ABSG = 2 
       data hash MD5: 32K
       DA CE 0E 50 A8 D8 2F 2B 0B CA D2 DB 44 6A E9 70>)
(   6,<2012-08-03 00:02:16.031 -0500>,<Administrator>,<TOPSPIN>,<proc1d>,<TOPSPIN 2.1>,
      <abs ABSG = 3 
       data hash MD5: 32K
       79 47 89 98 4F 31 50 36 0B 52 28 17 FE 83 64 98>)
(   7,<2012-08-03 00:02:16.062 -0500>,<Administrator>,<TOPSPIN>,<proc1d>,<TOPSPIN 2.1>,
      <abs ABSG = 4 
       data hash MD5: 32K
       0D 75 EC D5 38 79 62 C0 0B 58 89 E6 67 72 D8 93>)
(   8,<2012-08-03 00:02:16.093 -0500>,<Administrator>,<TOPSPIN>,<proc1d>,<TOPSPIN 2.1>,
      <abs ABSG = 5 
       data hash MD5: 32K
       04 29 04 AD 99 DA 01 31 A7 C9 9F E0 71 DD 56 FF>)
$$ ##END=
$$ 
$$ $$ hash MD5
$$ $$ C6 D5 84 BF 1D 53 E2 80 CB 07 B5 F2 9A 31 3A 04
##$RELAX= 
##$RELAX= 
##$RELAX= 
##$RELAX= 
##$RELAX= 
##$RELAX= 
##$RELAX= 
$$ Bruker specific parameters
$$ --------------------------
$$ [...]
150 150 150 150 150 150 150 150
##$TP07= 0
##$TPNAME0= <>
##$TPNAME1= <>
##$TPNAME2= <>
##$TPNAME3= <>
##$TPNAME4= <>
##$TPNAME5= <>
##$TPNAME6= <>
##$TPNAME7= <>
##$TPOAL= (0..7)
0.5 0.5 0.5 0.5 0.5 0.5 0.5 0.5
##$TPOFFS= (0..7)
0 0 0 0 0 0 0 0
##$TUNHIN= 0
##$TUNHOUT= 0
##$TUNXOUT= 0
##$USERA1= <user>
##$USERA2= <user>
##$USERA3= <user>
##$USERA4= <user>
##$USERA5= <user>
##$V9= 5
##$VALIST= <valist>
##$VCLIST= <CCCCCCCCCCCCCCC>
##$VD= 0
##$VDLIST= <DDDDDDDDDDDDDDD>
##$VPLIST= <PPPPPPPPPPPPPPP>
##$VTLIST= <TTTTTTTTTTTTTTT>
##$WBST= 1024
##$WBSW= 4
##$XGAIN= (0..3)
0 0 0 0
##$XL= 0
##$YL= 0
##$YMAX_a= 484077
##$YMIN_a= -630246
##$ZGOPTNS= <>
##$ZL1= 120
##$ZL2= 120
##$ZL3= 120
##$ZL4= 120
##$ABSF1= 14.98509
##$ABSF2= -5.573092
##$ABSG= 5
##$ABSL= 3
##$ALPHA= 0
##$AQORDER= 0
##$ASSFAC= 0
##$ASSFACI= 0
##$ASSFACX= 0
##$ASSWID= 0
##$AUNMP= <proc_prof1d_extract_pilot.lims>
##$AXLEFT= 0
##$AXNAME= <>
##$AXNUC= <1H>
##$AXRIGHT= 0
##$AXTYPE= 0
##$AXUNIT= <>
##$AZFE= 0.1
##$AZFW= 0.1
##$BCFW= 0
##$BC_mod= 0
##$BYTORDP= 0
##$COROFFS= 0
##$CY= 15
##$DATMOD= 1
##$DC= 0
##$DFILT= <>
##$DTYPP= 0
##$F1P= 0
##$F2P= 0
##$FCOR= 0.5
##$FTSIZE= 32768
##$FT_mod= 6
##$GAMMA= 0
##$GB= 0
##$INTBC= 1
##$INTSCL= 1
##$ISEN= 128
##$LB= 0
##$LEV0= 0
##$LPBIN= 0
##$MAXI= 10000
##$MC2= 0
##$MEAN= 0
##$ME_mod= 0
##$MI= 0
##$NCOEF= 0
##$NC_proc= -8
##$NLEV= 6
##$NOISF1= 0
##$NOISF2= 0
##$NSP= 0
##$NTH_PI= 0
##$NZP= 0
##$OFFSET= 14.98509
##$PC= 1
##$PHC0= 176.6602
##$PHC1= 0
##$PH_mod= 1
##$PKNL= yes
##$PPARMOD= 0
##$PPDIAG= 0
##$PPIPTYP= 0
##$PPMPNUM= 2147483647
##$PPRESOL= 1
##$PSCAL= 4
##$PSIGN= 0
##$PYNMP= <proc.py>
##$REVERSE= no
##$SF= 400.02
##$SI= 32768
##$SIGF1= 0
##$SIGF2= 0
##$SINO= 400
##$SIOLD= 32768
##$SPECTYP= <>
##$SREGLST= <1H.CDCl3>
##$SSB= 0
##$STSI= 32768
##$STSR= 0
##$SW_p= 8223.68421052631
##$SYMM= 0
##$S_DEV= 0
##$TDeff= 65536
##$TDoff= 0
##$TI= <>
##$TILT= no
##$TM1= 0
##$TM2= 0
##$TOPLEV= 0
##$USERP1= <user>
##$USERP2= <user>
##$USERP3= <user>
##$USERP4= <user>
##$USERP5= <user>
##$WDW= 1
##$XDIM= 32768
##$YMAX_p= 463498470
##$YMIN_p= -763977
##$CURPLOT= <Network HP LaserJet P1505>
##$CURPRIN= <$Network HP LaserJet P1505>
##$DFORMAT= <normdp>
##$LAYOUT= <+/1D_H.xwp>
##$LFORMAT= <normlp>
##$PFORMAT= <normpl>
##$SURQMSG= 1
$$ End of Bruker specific parameters
$$ ---------------------------------
##NTUPLES= NMR SPECTRUM
##VAR_NAME=  FREQUENCY,     SPECTRUM/REAL,   SPECTRUM/IMAG
##SYMBOL=    X,             R,               I
##VAR_TYPE=  INDEPENDENT,   DEPENDENT,       DEPENDENT
##VAR_FORM=  AFFN,          ASDF,            ASDF
##VAR_DIM=   32768,         32768,           32768
##UNITS=     HZ,            ARBITRARY UNITS, ARBITRARY UNITS
##FACTOR=    0.250966925370066, 1,           1
##FIRST=     8223.43324360094, 125080,       -249893
##LAST=      0,             -31884,          -207454
##MIN=       0,             -763977,         0
##MAX=       8223.43324360094, 463498470,    0
$$ Real data points
##PAGE= N=1
##DATA TABLE= (X++(R..R)), XYDATA
$$ [...]
19467b29498O5468K0115o751B64973b69391B4481b30850B5068J8427c26273R1859
19456b34414F6731J74424J74441I4130g2830j62380Q346C07814b6597H1054j6761
19445F4293a80717A2225h9004A51879a06983A90329Q8062a27873A24982d5289
19434a24414k10396F2699m707g1113B8784b03840A43622M1750a17627M5950A16646
19422a88624A18507g9553B52920j21408c53849J49355G6508a84625B7673J55384
19412A83057J13822i8084p3266C5440c43260a54102E6181c6667H2402h4940k49016
19401c33956E53770a43740B0014b19646n2653A0767N0192K2731a17359o9673A01141
19389H5402O2584F961N6383b49521J04262C4249d4194B7540J31555c08927P4251
$$ plain form
19467 -229498 -164030 -143915 -150666 264973 -269391 24481 -230850 25068 43495 -326273 -234414
19456 -234414 66731 241155 415596 94130 -72830 -235210 -226864 307814 -26597 81054 64293
19445 64293 -180717 12225 -89004 151879 -106983 190329 278391 -127873 124982 -45289
19434 -124414 -334810 62699 57992 -71113 28784 -203840 143622 185372 -117627 -71677 116646
19422 -188624 118507 -79553 252920 131512 -353849 -204494 76508 -184625 27673 183057
19412 183057 296879 -98084 -171350 35440 -343260 -154102 56181 -36667 82402 -84940 -333956
19401 -333956 553770 -143740 20014 -219646 -272299 10767 60959 83690 -117359 -187032 101141
19389 85402 147986 6961 63344 -249521 -145259 34249 -44194 27540 159095 -308927 -234676
19378b34676i045C5180c28778M3772A44446d0148I8692a89251j81298Q6688a27507
19366a15070C3212d0562k1409k6491I8608g1819e211j41015F6450a25723A1402
19354b12550c851A43892h6520m2235f3343k78101O4131m1747B31591c75115J63924
19343b11191g4624j25406e8071m5827L2757A34202F5542Q3926a63738j37703f1978
19331d76005B8120O503P7955C1506f5834p3954e8129r219j09676L5594H3118o159
19319G6959B4585b2793A17306b64180R7362o580M4973H8963f2783p8835j96786
19308c38404B1829a29712B46949n1631c53267D0601f0884o941H9848a66394d5454
19296a29668k29063A12189f94304A87474b98286E3260i7795A29129a07242C0043
$$ plain form
19378 -234676 -9045 35180 -328778 -285006 144446 -40148 98692 -189251 -370549 -283861 -127507
19366 -115070 33212 -40562 -61971 -88462 98608 -71819 -5211 -146226 66450 -125723 11402
19354 -212550 -3851 143892 -86520 -128755 -63343 -341444 -277313 -319060 231591 -375115 -211191
19343 -211191 -74624 -200030 -58071 -103898 -71141 134202 65542 149468 -163738 -301441 -61978
19331 -476005 28120 34623 112578 31506 -65834 -139788 -58129 -67348 -177024 -141430 83118 76959
19319 76959 24585 -22793 117306 -264180 -166818 -173398 -128425 88963 -62783 -141618 -338404
19308 -338404 21829 -129712 246949 195318 -353267 40601 -60884 -67825 89848 -166394 -45454
19296 -129668 -358731 112189 -694304 187474 -298286 53260 -97795 129129 -107242 30043
19285A02217k2141J09804K4219p8407d78545b36113E5993d47119g4609k38393
19275c13002J04591L7166C2581a77161j83937D851a31414j15040O0737D15965
19264a99090M8259F7553j5289J68097Q9851c79170J72735Q6369b1209k72723J22314
19253a71618F6331O8269j566f1090J9464B7433J36707g1977n424B62602a29238
19241A75923E3986c31845D2824R6135a79375J1165j16139I5583b11022A25137
19230c54422F9634h1963F8294L07691i4011A26505K60674F4284d02580a50955
19219F9850e7794j5753A2259P89c7651k865m1034G9852a12886j19070f3954C9106
19206A22973a34543B3912a12750D6676R3383d3083Q152l60594B0039a98581G6094
$$ plain form
19285 102217 80076 189880 214099 135692 -478545 -236113 55993 -447119 -74609 -313002
19275 -313002 -208411 -171245 32581 -177161 -361098 4851 -131414 -246454 -185717 415965
19264 -199090 -150831 67553 52264 220361 310212 -379170 -206435 -120066 -21209 -293932 -171618
19253 -171618 66331 134600 133034 -61090 -41626 27433 164140 -71977 -77401 262602 -129238
19241 175923 53986 -331845 42824 138959 -179375 -168210 -284349 95583 -211022 125137
19230 -354422 69634 -81963 68294 375985 -94011 126505 387179 64284 -402580 -150955
19219 69850 -57794 -73547 12259 13048 -37651 -40516 -81550 79852 -112886 -231956 -63954 39106
19206 122973 -134543 23912 -112750 46676 140059 -43083 -34931 -395525 20039 -198581 76094
19194B6337f8064F0399b53484A05475l1617B6663a05813k0356A52421c02106B50459
19182a20225C51537b56527P8288B86469H668b12796B588b64103A57348p0709a6196
19170B2509f649r4369A04808a05009o149j41931e8089A64726i4234I0073h5540
19158B19023D7381a55559A11792E1090b61787A59193E1203Q6099a48680o8472
19148b17152k26189a82932F3252M6298a74464g5676A22829A3948i4559A5308b06308
19136g6391r5750J3991f9559H213a31125f113j60742O6070A88609P4991B8714
19124E388M9893f9686j39420A47280d77275a65805j66880R0541e894A70698o0266
19113A10432a17070B39810K671e2230l67186b447H5621k9819k5487a59999J1508
$$ plain form
19194 26337 -68064 60399 -253484 105475 73858 26663 -105813 -126169 152421 -302106 250459
19182 -120225 351537 -256527 -178239 286469 8668 -212796 2588 -264103 157348 86639 -16196
19170 22509 -6649 -101018 104808 -105009 -111158 -253089 -58089 164726 -94234 90073 -85540
19158 219023 47381 -155559 111792 51090 -261787 159193 51203 137302 -148680 -217152
19148 -217152 -443341 -182932 63252 109550 -174464 -75676 122829 13948 -94559 15308 -206308
19136 -76391 -172141 -158150 -69559 8213 -131125 -6113 -166855 -100785 188609 263600 28714
19124 5388 55281 -69686 -209106 147280 -477275 -165805 -332685 -242144 -5894 170698 110432
19113 110432 -117070 239810 242481 -52230 -419416 -2447 85621 55802 30315 -159999 -148491
19102a48491M0819A00054b38288j65377g8660N902k77050A28895a58718C3214
19091a34721j14699A23543b449j08755p1548C10331a61670A99201b11009C4223
19080A16708a11383A40346N2172f4433l21108a5526A495J61521G335J98547a13928
19068a35308B19798A7337m526J55248B9227F535K98698e325A70226d2971j11109
19057a54080B60054a31156a8682o3514C20346i0338b4756j54225D2708h0833c9881
19045a8472B7559G507Q6642a22235A11920b15252a04913d4980r4861A74673c6819
19033c22340D2220J47200c14928P3786n3328f1669j58531j1458H3321c98888A77715
19021A168e7637A60547a15617N4869A91805e9045p2872l43571h623j04504B56517
$$ plain form
19102 -148491 -107672 100054 -238288 -403665 -78660 -72758 -349808 128895 -158718 33214
19091 -134721 -249420 123543 -2449 -111204 -182752 310331 -161670 199201 -211009 34223
19080 116708 -111383 140346 192518 -64433 -385541 -15526 1495 163016 7335 205882 -113928
19068 -135308 219798 17337 12811 168059 29227 6535 305233 -5325 170226 -42971 -154080
19057 -154080 260054 -131156 -18682 -82196 320346 -90338 -24756 -178981 42708 -80833 -39881
19045 -18472 27559 7507 94149 -122235 111920 -215252 -104913 -44980 -139841 174673 -36819
19033 -322340 42220 189420 -314928 -241142 -294470 -61669 -220200 -231658 83321 -398888 177715
19021 1168 -57637 160547 -115617 -60748 191805 -59045 -131917 -475488 -8623 -113127 256517
19009f6371H4981c7275k0574k75903d2175E7180a63534O7811k2584j76207A38818
18997a72746B1221e59801a27135B12676c3648B44532a71651H5180c20811i6744
18986h9151L4487p0331C0971J3900r845J93791L1067G0823P102C5630b07857r1229
18974b99086A76997c76005j2785a73080d4144G3736h7293k3447M7183A82136j1727
18963A70409L2701M30286C16042G3252i8342C06568q7471a65357A23728E0216
18952c6001B14333a60855j74713J60012j22588A17807a65238K9063k69155G8775
18941d9052A74837b94690H4319g5356H8205B7217a36533k54337I2220J4129E2382
18929i7330M4127A22860Q8380a64843j71717c9715B37813b47960G5723J86731
$$ plain form
19009 -66371 84981 -37275 -57849 -333752 -42175 57180 -163534 -95723 -118307 -294514 138818
18997 -172746 21221 -559801 -127135 212676 -33648 244532 -171651 85180 -320811 -96744
18986 -89151 -54664 -124995 30971 44871 35026 228817 259884 70823 77925 35630 -207857 -299086
18974 -299086 176997 -376005 -388790 -173080 -44144 73736 -87293 -110740 -63557 182136 170409
18963 170409 203110 633396 316042 73252 -98342 306568 219097 -165357 123728 50216
18952 -36001 214333 -160855 -335568 -175556 -298144 117807 -165238 -136175 -405330 78775
18941 -49052 174837 -294690 84319 -75356 88205 27217 -136533 -390870 92220 106349 52382
18929 -97330 -53203 122860 211240 -164843 -336560 -39715 237813 -247960 75723 262454
18919B62454j029o7742c74482H5675i2812L1379q6686N9412H0688P3405J32108
18908B86201a9525n198j38433g3367j02015C12874b96205H8832K07373J52551
18898D48756J39231L7390m683j87437a52165E32903A56725a11751B78047J3289
18888B91336e0622J8416k17293B43302b80540e8797r6336D6507a75821n6246O9306
18877a62761A60277a14124J0807r5251j28386J50758O8844a9807k86370I1773
18866d437D4232c52088H0438a57458k07921J20186A24475D1828a6284j79503A0327
18854b32343O3741D3263b03742i7724A10315R9283J8519b53973C64986H2535M2713
18843A25248J7623G368a12158b304r4019j67675Q6845d9684n2944A16392Q2502
$$ plain form
18919 262454 261425 193683 -374482 85675 -92812 -61433 -148119 -88707 80688 154093 286201
18908 286201 -19525 -24723 -163156 -73367 -175382 312874 -296205 88832 296205 448756
18898 448756 587987 625377 620694 433257 -152165 532903 156725 -111751 278047 291336
18888 291336 -50622 -32206 -249499 243302 -280540 -58797 -155133 46507 -175821 -232067 -162761
18877 -162761 160277 -114124 -103317 -198568 -326954 -176196 -107352 -19807 -306177 91773
18866 -4437 44232 -352088 80438 -157458 -365379 -245193 124475 41828 -16284 -195787 10327
18854 -232343 -168602 43263 -203742 -97724 110315 209598 228117 -253973 364986 82535 125248
18843 125248 142871 7368 -112158 -2304 -96323 -263998 -177153 -49684 -102628 116392 198894
18832A98894L1014c1258a4550p4090j04896k6669A1108b21160h6764A00755m2222
18821E8533b49501g6857F042a97758P5061C767O264J07381l2138O1210f0223j8506
18809g8729E5032J03470K4333B2093b51601f582D98086b55743E4436d151A07309
18797A1532f6643b4631q5836c0112B5888b1675q5428D1025b14025I8941c5344
18785a75075k18796A14641O1418a91321N5420B40859c3237j6007E5432P1067a1171
18773g3l42421f8430A26800b73585c4990k56692a35871k51590e7718k49053D4424
18761b59620m2440B13500i1861k80386D1368J34340D8241A1673c71390J16787
18751b54603B47228I0036D4136a24737k4903B88352a575p5592C59251a35457B12229
$$ plain form
18832 198894 229908 -31258 -14550 -88640 -193536 -220205 11108 -221160 -86764 100755 58533
18821 58533 -249501 -76857 6042 -197758 -122697 3767 10031 117412 85274 146484 -60223 -78729
18809 -78729 55032 158502 182835 22093 -251601 -6582 498086 -255743 54436 -4151 107309
18797 11532 -66643 -24631 -110467 -30112 25888 -21675 -107103 41025 -214025 98941 -35344
18785 -175075 -393871 114641 176059 -191321 -135901 240859 -33237 -49244 55432 126499 -11171
18773 -73 -342494 -68430 126800 -273585 -34990 -291682 -135871 -387461 -57718 -306771 44424
18761 -259620 -302060 213500 -91861 -372247 41368 175708 48241 11673 -371390 -254603
18751 -254603 247228 90036 44136 -124737 -149640 288352 -1575 -77167 359251 -135457 212229
18739A58105L5030b900A07570f6711A66999I681a23773a9188k51033j67805I481
18727a10502j40510q2422a16373j26811L9017o8734d1545q3157B53153j26090
18717A27063b81918G4654g7716r5937A16593n2367K79453a69450I568P5905i5024
18705G671b25188i4229j03614n3064g3993k73662l9467B14765h7730n3648a3007
18693g4396h580j34611j59568E6216d13751a17284d0877A22781C78K47789A11107
18681A42138b33650F8598J9217H686g9252B43785b24828l10098h6054k0355L3207
18670g3202j773A28298b17715a975j96213A57098R3654b80792A59388i5451d1811
18658f5153B25214F1300c09765C2507c4282k13075a19101A10451h0498I0711K67854
$$ plain form
18739 158105 193135 -2900 107570 -66711 166999 9681 -123773 -19188 -270221 -438026 9481
18727 -110502 -251012 -333434 -116373 -243184 -204167 -272901 -41545 -124702 253153 127063
18717 127063 -281918 74654 -77716 -173653 116593 64226 343679 -169450 9568 85473 -95024
18705 7671 -225188 -94229 -197843 -250907 -73993 -347655 -387122 214765 -87730 -141378 -13007
18693 -74396 -8580 -143191 -302759 56216 -413751 -117284 -40877 122781 378 248167 111107
18681 142138 -233650 68598 87815 8686 -79252 243785 -224828 -534926 -86054 -106409 -73202
18670 -73202 -74975 128298 -217715 -1975 -198188 157098 250752 -280792 159388 -95451 -41811
18658 -65153 225214 61300 -309765 32507 -34282 -247357 -119101 110451 -80498 90711 358565
18647C58565A34422a77295C21444i2416g734j8316m7715j33388k6754A67492e2211
18635H6770N6998P550N8727G2610J22888a36962j58016a11597I9036a3380j41872
18624a55252B5124b40449e6680j86589C2347J04308b66142A98044a79070A57073
18613B63919f3729o4738E0504c17357Q6963j08837P8873A4528i7604M4276I5601
18601E9373O8279J8113a2193E3667a41438B88181f691A62200b9673k37312A05491
18589c76084C7365m825a20690n5453m7625H636a51956k60045a13011D8478L5271
18578H3749c17197C2724e201j91079D1427a97379b4629p2391B93920a33480A39100
18566C47897H794J15553a17880r9583F2294b43206R3310k19418a25919A66755
$$ plain form
18647 358565 134422 -177295 321444 -92416 -7734 -26050 -73765 -207153 -233907 167492 -52211
18635 86770 143768 151318 210045 72610 195498 -136962 -294978 -111597 99036 -13380 -155252
18624 -155252 25124 -240449 -56680 -243269 32347 136655 -266142 198044 -179070 157073
18613 263919 -63729 -128467 50504 -317357 -230394 -339231 -260358 14528 -97604 -53328 95601
18601 59373 127652 145765 -12193 53667 -141438 288181 -6691 162200 -29673 -266985 105491
18589 -376084 37365 32540 -120690 -176143 -223768 8636 -151956 -412001 -113011 48478 83749
18578 83749 -317197 32724 -5201 -196280 41427 -197379 -24629 -97020 293920 -133480 139100
18566 347897 8794 124347 -117880 -217463 62294 -243206 -149896 -369314 -125919 166755
18555h1944a9221A02428b57791A38358b20781m3391p1137C5556G240b55224D10992
18543f0287m3063B63582A7507g7824l9095d9418m51958b04355a6033A884a20243
18531C1490a0737j08515G9982l7810N7714h1577K9958C10890b62029B91689j16010
18520A75679c3368k9938r3072k9821i2349c4823B14204a33959A27213c52902j1814
18509c64716J24335A15529a35266q2445A5892a14950j5127B83764c19569A76572
18498E6928j2330j010e1038j8221C6809a5787l44999J59497K1984d5400A66432
18486A28887J09386a82165B34340a13492a4468B19347b81159J28820B2138J11437
18476A33575a27476A95086a27405c6818A88114a32731j12113m6179G408L9688
$$ plain form
18555 -81944 -19221 102428 -257791 138358 -220781 -264172 -335309 35556 7240 -255224 410992
18543 -60287 -103350 263582 17507 -77824 -116919 -49418 -501376 -204355 -16033 1884 -120243
18531 31490 -10737 -119252 79982 42172 99886 -81577 -51619 310890 -262029 291689 175679
18520 175679 -33368 -63306 -156378 -186199 -92349 -34823 214204 -133959 127213 -352902 -364716
18509 -364716 -240381 115529 -135266 -217711 15892 -114950 -130077 283764 -319569 176572
18498 56928 44598 43588 -51038 -69259 36809 -15787 -360786 -201289 -179305 -45400 166432
18486 128887 238273 -182165 234340 -113492 -14468 219347 -281159 -152339 22138 133575
18476 133575 -127476 195086 -127405 -36818 188114 -132731 -244844 -291023 7408 47096
18466D7096b62214E8715d7329H4828g3068F4708c18198m1942C75433A23526l5935
18455H7591b15289k6082f9198D9417L17167c8832E9801h4890b4720j28362A05005
18443A57127k5746L46880b3466J783j90429I0983b24368B35820f692j97321A9425
18431a36212A031h6652k9564A31986d27821G1722j8133J01506p5384a10883A32867
18419a98269G0985a49116j4865C77951d7918A48522j1311b59134e5860J4420j97034
18408b38474P4076P0868G2599J07171a55734K0020b0998l70617C08754C2771l278
18397B9493P1643c5864J7537D8541o911b34693m4426d8142j2221n0036b7238j87784
18385b15022B8737b70567a24867A1322d0229l04118d8598k63698a44402a2307
$$ plain form
18466 47096 -262214 58715 -47329 84828 -73068 64708 -318198 -360140 375433 123526 87591
18455 87591 -215289 -241371 -69198 49417 366584 -38832 59801 -84890 -24720 -153082 105005
18443 157127 131381 478261 -23466 -21683 -212112 90983 -224368 235820 -6692 -204013 19425
18431 -136212 1031 -86652 -116216 131986 -427821 71722 53589 155095 79711 -110883 132867
18419 -198269 70985 -149116 -163981 377951 -47918 148522 137211 -259134 -55860 -41440 -238474
18408 -238474 -164398 -93530 72599 179770 -155734 -135714 -20998 -391615 308754 32771 29493
18397 29493 101136 -35864 -18327 48541 41630 -234693 -279119 -48142 -60363 -110399 -27238 -215022
18385 -215022 28737 -270567 -124867 11322 -40229 -344347 -48598 -312296 -144402 -12307
18374A59659C7223b97254A5184b03611K208E6981J40060k8043c6581A73683j0783
18363A62900c37235A06479a506k5331C6154M1088K9299L3131b7442D5297b5966
18351A09016a64720j01875a6282k7467A88537h14B9887b91003A67215c02740C4524
18339c19827B4566J07381a50135O7015B0776g4053k97299J62959O6308j5363k02660
18328c60108B02049c7596J7100j41822J9197G2376E627b0063G9232k2142J41390
18317A98480B2358a11455d8961j9369I6931a10380e4461j1966D0675a24864o0690
18306a85554N5154j18847J01565A08949a47406B50982F1610i5265b4055j24792
18296a48847C50722h8314B61165E882K64631a08393a172j92792p2650l5035B16391
$$ plain form
18374 159659 37223 -297254 15184 -203611 -201403 56981 197041 168998 -36581 173683 162900
18363 162900 -337235 106479 -1506 -26837 36154 77242 106541 139672 -27442 45297 -25966
18351 109016 -164720 -266595 -16282 -43749 188537 -814 29887 -291003 167215 -302740 34524
18339 -319827 24566 131947 -150135 -83120 20776 -74053 -371352 -208393 -142085 -157448 -360108
18328 -360108 202049 -37596 -20496 -162318 -143121 72376 5627 -20063 79232 57090 198480
18317 198480 22358 -111455 -48961 -68330 96931 -110380 -54461 -66427 40675 -124864 -185554
18306 -185554 -130400 -249247 -147682 108949 -147406 250982 61610 -95265 -24055 -148847
18296 -148847 350722 -88314 261165 5882 270513 -108393 -1172 -193964 -266614 -301649 216391
18284B42807a84671A18334d6818k63907B03928d8885l3579j3489k37214b5240
18273b4133A28070O883D0133a91586i887A84298O4429n7307d1384A16465b96032
18261c06435C15984b0714j59624g1116o3141r8642E7890J61219d2678k66838P8573
18250b30943O124B44952E6685c31818B59204j9964c05955O8595C970L67175h5618
18238d7737G5423c692o1596b9803A60484B7791c68284B2642a47740A29586a4938
18226b79094J19832l944A04118a05139m1728f0928D6736M8560C1616b69919f9709
18214C12661h2488J9822q1018C5139a39610L0657Q915j15508o7233A09611b05294
18202F2991f943A19708e520j89834A50514b05182I8825C1025b19248a01368J6845
$$ plain form
18284 242807 -184671 118334 -46818 -310725 203928 -48885 -82464 -95953 -333167 -25240
18273 -24133 128070 134953 40133 -191586 -9887 184298 248727 191420 -41384 116465 -296032
18261 -306435 315984 -20714 -180338 -71116 -134257 -232899 57890 219109 -42678 -309516 -230943
18250 -230943 -224819 244952 56685 -331818 259204 239240 -305955 -237360 3970 371145 -85618
18238 -47737 75423 -3692 -65288 -29803 160484 27791 -368284 22642 -147740 129586 -14938
18226 -279094 -159262 -163206 104118 -105139 -146867 -60928 46736 95296 31616 -269919 -69709
18214 312661 -82488 -62666 -143684 35139 -139610 -108953 -100038 -215546 -282779 109611 -205294
18202 62991 -6943 119708 -5520 -195354 150514 -205182 98825 31025 -219248 -101368 -84523
18191h4523J2798G5925D394K09885a39439j01531f3900r625A97698G4219h3459
18179h6167J1406j62405a03054P792A68467p316d9914E3027J63968a5452M530
18168a0922m13836a19752K0101A28135g92k04675H8265a05899F2968J58228k1422
18157A99774e9003k4876D6230J44632c4242B8800K33896e8200q8567A69787b5638
18145B50297F8676K03295a74959e4978E1946p695a05483a9164A51663G2076a50692
18133d78371A09610K02273a04510A84865q5357b12395D0852c23033D5204e9808
18122F2067d24386a07908j44844A1041a86801h7809C65149a99285o7299C000L193
18111F193a40430A00777N6821J52808a51845C9078K28683a14673j70261C6539
$$ plain form
18191 -84523 -71725 75925 4394 214279 -139439 -240970 -63900 -73525 197698 74219 -83459
18179 -86167 -74761 -237166 -103054 -95262 168467 161151 -49914 53027 216995 -15452 -10922
18168 -10922 -424758 -119752 -99651 128135 -792 -205467 88265 -105899 62968 221196 199774
18157 199774 -59003 -83879 46230 190862 -34242 28800 262696 -58200 -146767 169787 -25638
18145 250297 68676 271971 -174959 -54978 51946 44251 -105483 -19164 151663 72076 -150692
18133 -478371 109610 311883 -104510 184865 99508 -212395 40852 -323033 45204 -59808
18122 62067 -424386 -107908 -252752 11041 -186801 -87809 365149 -199285 -266584 3000 6193
18111 6193 -140430 100777 157598 310406 -151845 39078 267761 -114673 -284934 36539
18100C41155a97510K8775A34406k9740b45631B72507P5795b746j39432M3431k1002
18089a19749r5285a52j38106k4820A62378a39295d5913A6619R426J98421D2850
18077E3094b6834j66727e4105B54378b63562c0219A06103d8273F3710a85825j01176
18066b87001D2186J37161a23869A61703b8371j70894A53812a96012A08965c2655
18055a39319f9498B1035b1854A57031k5459R365f0363A52025C5255a7806r334
18044b7140D5780a14315d2809a4372n8820n819A17014D0544f4003C17721g421
18032E6696J41350b02130H1291L427c5218f356I1823m414k4372a55325J0235l4030
18020a79120a308G7672h8344D794b19744B42469c7972A9767J38756C8796b8325
$$ plain form
18100 341155 -197510 -168735 134406 104666 -245631 272507 348302 -2746 -142178 -98747 -119749
18089 -119749 -215034 -152 -138258 -163078 162378 -139295 -45913 16619 26045 224466 42850
18077 53094 -26834 -193561 -54105 254378 -263562 -30219 106103 -48273 63710 -185825 -287001
18066 -287001 42186 179347 -123869 161703 -28371 -199265 153812 -196012 108965 -32655
18055 -139319 -69498 21035 -21854 157031 131572 140937 -60363 152025 35255 -17806 -27140
18044 -27140 45780 -114315 -42809 -14372 -73192 -79011 117014 40544 -64003 317721 -7421
18032 56696 198046 -202130 81291 84718 -35218 -6356 91823 87409 63037 -155325 -145090 -179120
18020 -179120 -1308 77672 -88344 4794 -219744 242469 -37972 19767 158523 38796 -28325
18008A98817P1237R6963j82290I1108b30349O3919p6197C52821a22206G8335e2674
17996h6857A69611F831J81530r3925L16392a33354C6069B806J59402a58323B4462
17984b25065C7597h0671j94592G4822q633O6208F1272C15J69129B7822K9238a70547
17971a36549G2352K51595I1365b45272b9094G9147J80080n0752a97453M4232C03531
17959a01768p7667B30735J0600E7836f15768c6621j67016B60948G0606L11727
17949C82333I033P7730C6661a5647F6967f6765B94399a3725C2556P5391O4880
17938A72827B9195b58912J08396A86724a28878A74349b69646i9338j24768B90485
17927A7724K29122F6846f4506j04526B34834b69306e9996B31016E7734J92240
$$ plain form
18008 198817 270054 367017 184727 91108 -230349 -166430 -242627 352821 -122206 78335 -52674
17996 -86857 169611 6831 188361 94436 410828 -133354 36069 2806 162208 -158323 24462
17984 -225065 37597 -80671 -275263 74822 66189 132397 61272 315 169444 27822 57060 -170547
17971 -136549 72352 323947 91365 -245272 -29094 79147 259227 208475 -197453 -153221 303531
17959 -101768 -179435 230735 241335 57836 -615768 -36621 -203637 260948 70606 382333
17949 382333 9033 86763 36661 -15647 66967 -66765 294399 -13725 32556 107947 172827
17938 172827 29195 -258912 -150516 186724 -128878 174349 -269646 -99338 -224106 290485
17927 17724 246846 66846 -64506 -169032 234834 -269306 -59996 231016 57734 249974
17917B49974B6379L4816M8230m8333A0236J55961a30318A17952J05163I5375K52417
17906C47792c79043K3855a06221A38099i0866F9238P0561b18981A20681J15276
17896B35957j05098b2887M664C88647b23837B30246B0953i5639e239o8950b9348
17884B5146Q0042g8316C0968b76377A9489J0458J40565a48179I2625d34385b2347
17872A78122c98977d3386C150J6665a11821A06999a77841q4704A27731b96452
17861D47872h2769A8870P6584b92259a42725A72557M2697D7782c8387A51870b01238
17849B82690K2465a24554A49054b5776m0525A05609g2317o6075B0414K19154b20505
17837d0876B20166f503j12697B23153F7872J69279b75323B40480b48624j7083
$$ plain form
17917 249974 26379 61195 109425 61092 10236 166197 -130318 117952 223115 95375 347792
17906 347792 -379043 -355188 -106221 138099 -90866 69238 139799 -218981 120681 235957
17896 235957 130859 -22887 -18223 388647 -223837 230246 20953 -95639 -5239 -74189 -29348
17884 25146 105188 -78316 30968 -276377 19489 29947 170512 -148179 92625 -434385 -22347
17872 178122 -398977 -43386 3150 19815 -111821 106999 -177841 -262545 127731 -296452
17861 447872 -82769 18870 95454 -292259 -142725 172557 215254 47782 -38387 151870 -201238
17849 282690 305155 -124554 149054 -25776 -66301 105609 -72317 -138392 20414 239568 -220505
17837 -40876 220166 -6503 -119200 223153 67872 237151 -275323 240480 -248624 -265707
17827b65707a25724A11118N4049p0774a7472C7900L8072c8594A239Q1092a9783
17815d18037H6365a29817M1711D16885a15595A86378A2580b06596M2525L6009
17805a28062i866F3226J53410a37772q5329Q2007L4785B2013N3698b0688A27803
17793c6966A91111J28525c8052q227D57758c5116F1710b37255B04259a88617H0369
17781A16332d2913A1394L02508J7360j30704b00743G8123L3536c02239D0069K3380
17770F3449Q1077P9921F0877O153J4907j5982J19587R77q381a09541d7216H7140
17757A52261m5149K75522c4046r3114c5461B99528r5532o4193j1897b03584m1841
17746b45425e8311j21336A71613p5145a73790A73832D3246J84512q5990J49713
$$ plain form
17827 -265707 -125724 111118 165167 94393 -17472 37900 75972 -38594 1239 82331 -19783
17815 -418037 86365 -129817 -88106 416885 -115595 186378 12580 -206596 -164071 -128062
17805 -128062 -9866 63226 216636 -137772 -223101 -141094 -106309 22013 75711 -20688 127803
17793 -36966 191111 319636 -38052 -46279 457758 -35116 61710 -237255 204259 -188617 80369
17781 116332 -42913 11394 313902 331262 200558 -200743 78123 111659 -302239 40069 63449
17770 63449 144526 224447 60877 67030 81937 65955 185542 186519 178138 -109541 -47216 87140
17757 152261 107112 382634 -34046 -127160 -35461 299528 203996 139803 127906 -203584 -245425
17746 -245425 -58311 -179647 171613 96468 -173790 173832 43246 227758 141768 291481
17736B91481b15637A92637M9557o599j5432Q8872A40260m2832K22868K9076A46765
17724A6701K8458J45510l052b8386A91031f3982G3077J637g1566k914B80160A33425
17711C27099J99381C8409a32132D1945K42968I2565J74652c5170c378j48689a4254
17699A20183K4331K7197M1679a4669j80007e7827D26772d7548A24366Q0091N063
17688B09520m346M8355D4986b41402L0971H3447b04941a1502D20269A86408H0357
17676F3789K10424a26147J3740G7269a6440k31117B18119K7319F5321J90490G4345
17664G8650a79879A79646k224b5679H3831M9P0178a28567A02206m3650K0135g5881
17651I806O9132a38547Q790A32195o0511l2757D786a24214b7982B61008F111K6782
$$ plain form
17736 291481 -215637 192637 242194 235595 220163 309035 140260 97428 320296 349372 146765
17724 16701 45159 190669 187617 -28386 191031 -63982 73077 74714 -71566 -74480 280160 133425
17711 327099 526480 38409 -132132 41945 284913 92565 267217 -35170 -3378 -152067 -14254
17699 120183 144514 171711 213390 -14669 -194676 -57827 426772 -47548 124366 204457 209520
17688 209520 205174 253529 44986 -241402 -210431 83447 -204941 -11502 420269 186408 80357
17676 63789 274213 -126147 -112407 77269 -16440 -247557 218119 245438 65321 255811 74345
17664 78650 -179879 179646 177422 -25679 83831 83880 154058 -128567 102206 58556 78691 -75881
17651 9806 78938 -138547 -129757 132195 71684 38927 4786 -124214 -27982 261008 6111 32893
17639C2893O5106b4813D48390Q3973b79437f4374F4081J88440a56460f1687A78470
17627A23219B1237J9370J85121A5543a6706j38346C84480H4852b1051C53258A26567
17615E4812R2461G0846M35777A74661J14455A19029P1735I0560R1804B0753L1527
17604E2280i4749E1105J07576F5749b52368A89715E7290b9248C10218b63189A76729
17592c2010C68688i199C29282D3842L08071E8429A9260K55974E6862K89657l2129
17581C14390j32777a40831B11807a56332B89251a96363G614M25594j77477m9437
17571B06294O3318b01611d5956F1335J77980l7379L3582N6146G8721O8455o6017
17560H1159J28387f4019k42600C17743I8466K41194k0806N3740a270A14818B9923
$$ plain form
17639 32893 97999 -24813 448390 532363 -279437 -64374 64081 252521 -156460 -61687 178470
17627 123219 21237 40607 225728 15543 -16706 -155052 384480 84852 -21051 353258 126567
17615 54812 147273 70846 506623 174661 289116 119029 190764 90560 182364 20753 52280
17604 52280 -94749 51105 158681 65749 -252368 189715 57290 -29248 310218 -263189 176729
17592 -32010 368688 -9199 329282 43842 351913 58429 19260 275234 56862 346519 314390
17581 314390 181613 -140831 211807 -156332 289251 -196363 7614 433208 255731 206294
17571 206294 269612 -201611 -45956 61335 239315 201936 235518 291664 78721 147176 81159
17560 81159 209546 -64019 -306619 317743 98466 339660 318854 372594 -1270 114818 29923
17548B6558c221C32067k9582J10607c8066D00254D3168M04378a28053B73809J76232
17537D50041F1143J13403M455B742e2439C84958B7273L83505F1318K92757j03292
17526B50783J75497L11788A65577J73578J85549K2613j57433L13633k15655r3684
17516C94178A7208L57948R6216A97271N28106j40215L45279D53529O85455l97792
17506G41192k62362J36801k88557L0581J21436G7256M495M2200K46018A00067
17495D42140k867k11501m5857K46668r4434J8722A22449K53472q9888L8565N3716
17484C78314A39211m677L89152B29288q5563K70589A78660J53715J7926E9009
17473B90982n5701L70582j25685a10786C18765L0342J51195p0210A16241k6228
$$ plain form
17548 26558 -3221 332067 302485 413092 -38066 400254 43168 447546 -128053 273809 450041
17537 450041 61143 174546 179001 2742 -52439 384958 27273 410778 61318 354075 250783
17526 250783 426280 738068 165577 339155 524704 547317 389884 703517 487862 394178
17516 394178 17208 375156 471372 197271 725377 585162 930441 453529 1138984 741192
17506 741192 478830 615631 327074 357655 479091 77256 81751 123951 369969 100067
17495 442140 439273 227772 181915 428583 334149 352871 122449 375921 286033 324598 378314
17484 378314 139211 134534 523686 229288 143725 414314 178660 332375 350301 59009
17473 290982 235281 605863 480178 -110786 318765 349107 500302 430092 116241 90013
17463I0013J48167j04301J14729N0960A4642K47048J2387m3734L09400k25009
17453C14734j04247q3760J58970L98768l36108K99574l11945p3739p5605O8517
17443B55159K58632A20615K68796A07529N21330o9376k57775H2920M72554B37666
17432C76715p6364J39584r7941j51429M3685J46152G6743J15394K04951q1027
17422C16061A57260L83601j76261A61304O0340J78102J75786j13208J05171n6076
17412E11419p8143k06929K15468k09613K81806j63404J34522A11879L8859K7515
17402A78253k7971K2461k9022Q3874I642O1910J49593J39116A18728P1560K10942
17391D01230A83952J80592C7464L53216A76989H6227L28148C1105Q3537a1795
$$ plain form
17463 90013 238180 133879 248608 299568 14642 261690 274077 230343 539743 314734
17453 314734 210487 126727 285697 684465 348357 647931 335986 262247 186642 255159
17443 255159 513791 120615 389411 107529 628859 559483 301708 82920 555474 237666
17432 376715 300351 439935 341994 190565 234250 380402 76743 192137 397088 316061
17422 316061 157260 540861 364600 161304 221644 399746 575532 462324 567495 511419
17412 511419 433276 226347 441815 232202 514008 350604 485126 111879 150738 178253
17402 178253 150282 172743 143721 227595 9642 71552 221145 360261 118728 190288 401230
17391 401230 183952 364544 37464 390680 176989 86227 414375 31105 114642 -11795
17380A77684K93099J3407F2533r797J59282J32251a4682A29777R7088M4170J70556
17369D41591A97270J09365j1606p0203l9582q1833K45668j5752a09972A24147
17358A36348K24039j39617L9541L5503q8866a8063o22A03373K15646O817b5979
17346F03171B59762L77200k6566B38358J8703J65916p8658I8340C5244L44261
17336C79505K6696q8319A15139J66812j38800J13232r8294L24459j16343j53684
17326B12521K05331K04423C00321j01639i1552A61289J93553A17975D7651M8128
17316I5779L43118K3525B04990m3984J12099j9131O2402j21066L2859J77277k7718
17305C77728q8686K47957A51610P0522L09242G7398J27165M6716J07283I2805
$$ plain form
17380 177684 470783 484190 62533 52736 212018 344269 -14682 129777 226865 271035 441591
17369 441591 197270 306635 295029 224826 185244 103411 349079 333327 -109972 124147
17358 136348 360387 220770 260311 295814 206948 -18063 -18685 103373 319019 325836 -25979
17346 603171 259762 636962 610396 238358 257061 422977 344319 98340 35244 379505
17336 379505 406201 317882 115139 281951 143151 256383 158089 482548 366205 212521
17326 212521 417852 622275 300321 198682 -91552 161289 354842 117975 47651 95779
17316 95779 438897 462422 204990 161006 273105 253974 316376 195310 228169 405446 377728
17305 377728 289042 536999 151610 222132 531374 77398 204563 251279 358562 92805
17294C88407A90282J09553K9260K22949j16411N6282A61589J23814Q2318c9017
17283G7324J33894J20109n780q5377K8876j09093L54889B53534r3573J57925K57840
17272E75726A52474l8913R5755E0742K55096J32793A26052K73137J81817j58972
17262D22034O111G8020K96559P3406L9961A93925K45060j60880M0366l1904K51110
17251E37677A74095L70855B18161M1523o0593L78173B62027q8852K06803k2475
17241C57503n6113J82793M1605j94702k9718K28310K5026B74663l4364G4929O04006
17230F78935k98989A53676M49476j20910j9956e9401C86516J46058k58640K56728
17220E30662j20724J07096A74203O9216M4739J68994m7847J41866b4851C89436
$$ plain form
17294 388407 190282 299835 329095 552044 435633 491915 161589 285403 367721 -39017
17283 77324 211218 331327 325547 240170 269046 159953 514842 253534 159961 317886 575726
17272 575726 152474 113561 209316 50742 305838 438631 126052 399189 581006 422034
17262 422034 428145 78020 374579 447985 487946 193925 438985 278105 318471 286567 537677
17251 537677 174095 544950 218161 259684 199091 577264 262027 173175 379978 357503
17241 357503 301390 484183 525788 331086 301368 529678 554704 274663 240299 74929 678935
17230 678935 379946 153676 603152 482242 462286 -59401 386516 532574 273934 530662
17220 530662 409938 517034 174203 243419 288158 457152 409305 551171 -24851 389436
17209F31510A60004K25300L37968p2254q2292k61494J63239q9183Q5803R5867
17199E62958o75k75268J67410J2533j3805j50128J81883k27606M29804l0336k64884
17188C91886j04723J64953J88764C02330K48828j66933K00979B27936J81998J04144
17178E14078L38573m15443j31937K3282K67295O741j2312j48548r9157K40077
17168E82649B02494N24041A71977K51472N55451l38244A73442M38645K6192r8420
17158E39859n3773K84467r416j28810k20003n6319L41517j02441j2919k18050
17148C64112j02127M03129n3651r6037n2681K67679k48615q4094K70725C01142
17137E93175O475j50093O3420B2414O99042k47237K5734P9348B33742K6536K64671
$$ plain form
17209 631510 160004 385304 723272 651018 568726 307232 470471 381288 467091 562958
17199 562958 562283 287015 454425 466958 453153 303025 484908 257302 687106 656770 391886
17188 391886 287163 452116 640880 302330 551158 384225 585204 227936 409934 514078
17178 514078 852651 437208 305271 328553 595848 602589 590277 441729 342572 582649
17168 582649 202494 726535 171977 423449 978900 640656 173442 612087 638279 539859
17158 539859 486086 770553 761137 632327 412324 356005 697522 595081 582162 364112
17148 364112 261985 665114 611463 515426 462745 730424 481809 397715 668440 301142
17137 593175 599650 449557 512977 22414 721456 474219 499953 579301 233742 260278 524949
17126E24949J79773R5914J17658l32654o4063n6527K81278l40519r6409M71965
17116G81365j68009N4723k29358J33593J98833k63378J29124J88139m05243M13039
17106H32828l43664J44066j83337O6143J9515L23983J32676j01016D16616J71410
17096E88026K88377m25266M73159k21874k9270J0465K85311j71709n0969j66423
17086E79827J35111K7675L70179m61329k4161J8919K51275k61347J28103K48340
17076A012592k62176K50028k56701l6964k6165N0774L41091n4798l9446l62115
17066F16120J21937Q4252K23567L4182l32804J78679j77993L55327J76182k98972
17056I80477J08129R4229k77569L8015J1299Q8479l0968J26152o9786j03443k46164
$$ plain form
17126 524949 704722 800636 918294 585640 521577 465050 746328 405809 309400 781365
17116 781365 613356 668079 438721 572314 771147 507769 636893 825032 419789 832828
17106 832828 489164 633230 449893 516036 535551 859534 992210 891194 416616 588026
17096 588026 876403 451137 924296 702422 673152 683617 968928 797219 746250 579827
17086 579827 714938 742613 1112792 651463 627302 646221 897496 636149 764252 1012592
17076 1012592 750416 1000444 743743 706779 680614 731388 1072479 1017681 978235 616120
17066 616120 738057 822309 1045876 1080058 747254 925933 747940 1103267 1279449 980477
17056 980477 1088606 1182835 905266 943281 954580 1043059 1012091 1138243 1068457 965014 718850
17045G18850K12277N3416L07094n42371M20939k08033r8521K11906R5356O9489
17035A240402r3508k42891J67497J37802q743J69528k53922M69138G66589L75169
17025A141758l55761M48089k23181J13556M2518P0370l6586N2886J26427l75252
17015A004824K20465l83835M47436r814k73906J1366j3696P97326p05246K27928
17005A322848l25562L05082J86626l27808Q4010k1975j0537J18383J39970j40995
16995A330042L68083l17571k04554J42311P232j69059K64824k21918K79114j07623
16985A370881J19196m45190L14441J45057K393k8542o6755L01166o210k13554
16975A492883K411M48121m92984J1940J91404k39433J72982j96173M23923j23770
$$ plain form
17045 718850 931127 984543 1291637 749266 1170205 962172 863651 1075557 1170913 1240402
17035 1240402 1146894 904003 1071500 1209302 1200559 1370087 1116165 1585303 766589 1141758
17025 1141758 785997 1234086 1010905 1124461 1166979 1237349 1200763 1253649 1380076 1004824
17015 1004824 1225289 841454 1288890 1279076 1005170 1016536 1002840 1800166 1094920 1322848
17005 1322848 997286 1302368 1488994 1161186 1245196 1223221 1212684 1331067 1471037 1330042
16995 1330042 1698125 1380554 1176000 1318311 1325543 1156484 1421308 1199390 1478504 1370881
16985 1370881 1490077 1044887 1359328 1504385 1506778 1478236 1411481 1712647 1706437 1492883
16975 1492883 1495294 1943415 1450431 1462371 1653775 1414342 1587324 1391151 1815074 1691304
16965A691304J30909r888L7223J58512l13674J50894K43131k03017J22141j68927
16955A838608j03739K86566l61281L09531j94399J78516l53905N04184j30413
16946A973668k33019J98700n0904K35226l04264K34565L53193j66781l84340M98966
16936B355010l24266K18767k17846K23908L99005m43985L09626q3814j76712l5633
16926B224060l177K4611J32873K30124J40989m23738L98264r6637j79760J276
16916B448885K01020P7579k04341k7826l7986J37930J79027O1037M40622m54440
16906B821507J11799q8792K76899j84643j25064j1082N52414J73749q64095O52638
16896C315330k81917K62494l6818R7432m3567n0646K23642P0179j09107o3910
$$ plain form
16965 1691304 1822213 1812325 1849548 2008060 1694386 1845280 2088411 1885394 2007535 1838608
16955 1838608 1734869 2021435 1660154 1969685 1775286 1953802 1599897 2104081 1973668
16946 1973668 1740649 1939349 1888445 2123671 1819407 2053972 2407165 2240384 1856044 2355010
16936 2355010 2030744 2249511 2031665 2255573 2654578 2210593 2520219 2436405 2259693 2224060
16926 2224060 2220883 2245494 2378367 2608491 2749480 2325742 2724006 2627369 2447609 2448885
16916 2448885 2649905 2727484 2523143 2495317 2457331 2595261 2774288 2835325 3275947 2821507
16906 2821507 2933306 2844514 3121413 2936770 2811706 2800624 3353038 3526787 2662692 3315330
16896 3315330 3033413 3295907 3259089 3356521 3312954 3262308 3485950 3556129 3447022 3383112
16886C383112L92389k4998l688j49096K41990m0968L26722k80553K40026k83117
16876C801819J4674L65988M13456k90337k38227K60588n6236J80652K18162k1225
16866D649314k9494K14774k14063J66339J13010L39564J85303m6918Q0543m9483
16856E408889j90421N04044J02088p4355M954R6977J16663k30717L06636O047
16846F050805K21661o2460J28892L58955J78993j49547r7197M93348r986p2444
16836G041020M12364r1665N3752R5567J88772K18041j1488L84812J24580J87674
16826H603429J98096L897M0222N20436j44242J74216k5292P59564p0803J14701
16816A0174224M53931n2704M20390J07256K35958K31336J91800L25781r4157M72867
$$ plain form
16886 3383112 3775501 3750503 3746815 3597719 3839709 3798741 4125463 3844910 4084936 3801819
16876 3801819 3816493 4182481 4595937 4305600 4067373 4327961 4271725 4452377 4670539 4649314
16866 4649314 4619820 4834594 4620531 4786870 4899880 5239444 5424747 5377829 5458372 5408889
16856 5408889 5218468 5722512 5824600 5750245 5755199 5852176 5968839 5738122 6044758 6050805
16846 6050805 6272466 6210006 6338898 6697853 6876846 6727299 6630102 7123450 7113464 7041020
16836 7041020 7453384 7361719 7415471 7511038 7699810 7917851 7906363 8291175 8415755 8603429
16826 8603429 8801525 8805422 8845644 9366080 9221838 9396054 9370762 10130326 10059523 10174224
16816 10174224 10628155 10575451 10995841 11103097 11339055 11570391 11762191 12087972 11993815 12466682
16806A2466682M22843L74825K08681M24179k1031P73042k73110N15448J42480
16797A5034039L92201O25846K80932N68209L81006L30552O68516J33051N29684
16788A8944036L25480P33424K73458P11883L99000J037760L1627J042932K40796
16779B3740396Q92546N79307R01367O44261Q30129P25111R00441Q32554J039025
16770C1085137Q14573J031774R76266P64844J356379J243126J321033R77855J731370
16761D1302357J048256J454344J199627J558787J719315J924547J304399J778179
16753E3289811J970355J916671K145411J868491J960659K304308K362238J654553
16745F9472497K751694K186410K340697K810319K564423K409892K675639K580372
$$ plain form
16806 12466682 12889525 13264350 13473031 13897210 13876179 14649221 14376111 14891559 15034039
16797 15034039 15426240 16052086 16333018 16901227 17282233 17612785 18281301 18414352 18944036
16788 18944036 19269516 20002940 20276398 20988281 21387281 22425041 22456668 23499600 23740396
16779 23740396 24632942 25212249 26113616 26757877 27588006 28313117 29213558 30046112 31085137
16770 31085137 31899710 32931484 33907750 34672594 36028973 37272099 38593132 39570987 41302357
16761 41302357 42350613 43804957 45004584 46563371 48282686 50207233 51511632 53289811
16753 53289811 55260166 57176837 59322248 61190739 63151398 65455706 67817944 69472497
16745 69472497 72224191 74410601 76751298 79561617 82126040 84535932 87211571 89791943
16737H9791943K455552K604378K448338J760291K412997K716522J650606K126002
16729A07966629J746169J572227J323846R97368J185644N90853R1507j38618P5144
16720A15410769o60744n73674j146831r62684k036469j190849j895025j919683
16712A05024810k147106k232340k546362k456640k292421l174251k059963k756962
16704H5358765k645618k429257k667795k251125k867436k261865k474881k185434
16696F5575354k309360k238296k161737k111362j561651k170543j679722j887076
16688D9455607j824199j370887j829171j474767j319361j386959j029896j406479
16680C7813888j346659j049597j229179j136790j187153n68337j239304q01673
$$ plain form
16737 89791943 92247495 94851873 97300211 99060502 101473499 104190021 105840627 107966629
16729 107966629 109712798 111285025 112608871 113606239 114791883 115382736 115474243 115335625 115410769
16720 115410769 114750025 114176351 113029520 112066836 110030367 108839518 106944493 105024810
16712 105024810 102877704 100645364 98099002 95642362 93349941 90175690 88115727 85358765
16704 85358765 82713147 80283890 77616095 75364970 72497534 70235669 67760788 65575354
16696 65575354 63265994 61027698 58865961 56754599 55192948 53022405 51342683 49455607
16688 49455607 47631408 46260521 44431350 42956583 41637222 40250263 39220367 37813888
16680 37813888 36467229 35417632 34188453 33051663 31864510 31296173 30056869 29255196
16672B9255196r90297p90213p47802q76258o87432j083591n47629l75817j020143
16663B2136014m44943n64746m85968m78188p95379m02602n77474k08484r07430
16654A7270800j99320m72124m80495j24586o64934j19159l16244m82426k33445
16645A4178067p32836J23826o38587j90513l20873j66969N00l63414l97143l54589
16635A1137469k24898J01594k4777n66783n98692R316L5198k61490l39841M0225
16625I307321q11265Q5050M2397n02624L71575j55647n29835k8501J40379n65933
16615G352917j57928K49033o77032J18433K0681j42224k01751K41574n05624j3305
16605F284774O419k50329j15571J04616k09958L11328k60180l42471P8795k02313
$$ plain form
16672 29255196 28264899 27474686 26726884 25850626 25163194 24079603 23531974 23156157 22136014
16663 22136014 21691071 21126325 20640357 20162169 19366790 18964188 18386714 18178230 17270800
16654 17270800 17071480 16599356 16118861 15994275 15329341 15210182 14893938 14411512 14178067
16645 14178067 13445231 13569057 12930470 12739957 12419084 12252115 12252615 11889201 11492058 11137469
16635 11137469 10912571 11014165 10989388 10422605 9823913 9833229 9868427 9606937 9267096 9307321
16625 9307321 8496056 8581106 8623503 8120879 8492454 8336807 7806972 7778471 7918850 7352917
16615 7352917 7194989 7444022 6766990 6885423 6906104 6763880 6562129 6803703 6298079 6284774
16605 6284774 6291193 6040864 5925293 6029909 5819951 6131279 5871099 5528628 5607423 5405110
16595E405110q9538k33733J74084o5569Q528l31291K31575K3681n51441K53981
16585D825387j22963l04651K32552k06870j76890L58073k66059k83636L13059
16576D368002l89884L36390k36254l08847L9612j60456L52054k48848n2915J88618
16566C887472j96509k48513j0537Q9269j46138K23957j50058k42666M8304r3165
16556C161416J65356j41487N3745J1487j72249j90517M0855l0983K49423l22289
16546B824757j21670k0793L1889J04805O0078j70344j4087j09178j4904J76257
16536B746810l72345N2810r5908J88778n7882j88336N2137j68572K14796j42700
16526B229588m06607L10072M41206n31785j73073j01288L11157J34075l24960
$$ plain form
16595 5405110 5315572 5081839 5255923 5190354 5198882 4867591 5099166 5122847 4571406 4825387
16585 4825387 4702424 4397773 4630325 4423455 4246565 4604638 4338579 4054943 4368002
16576 4368002 3978118 4314508 4078254 3769407 3809019 3648563 4000617 3751769 3698854 3887472
16566 3887472 3690963 3442450 3431913 3521182 3375044 3599001 3448943 3206277 3254581 3161416
16556 3161416 3326772 3185285 3239030 3250517 3078268 2887751 2928606 2897623 3147046 2824757
16546 2824757 2703087 2682294 2714183 2818988 2879066 2708722 2694635 2585457 2570553 2746810
16536 2746810 2374465 2427275 2331367 2520145 2462263 2273927 2326064 2157492 2372288 2229588
16526 2229588 1822981 2133053 2574259 2042474 1869401 1768113 2079270 2213345 1888385
16517A888385M59251k20144R6325j65245J20557j92853Q1376j15199l9688k2768
16507A889997K81214m23006K29791l81067J00383j5698M0870L00115l70714Q1070
16497A732955o9087N1246k59968Q4637J67047N1675j34291q1904K05736l15842
16487A432204M99350j60281j73399o9183J76709l21750J01276J48104k30411j14867
16477A287752l2092N30968j10809k39340k92912K75981K34173m73447L31195k89594
16467A221875L78535k91856n2833J39370l56762J67865O553p8642L519K10692
16457A348316r2141J3174r4029l49279K53386N02783n08320K6652n9197J76452
16447A217797m45061K76151o2422R4060p24j6965J30604l30153J00167J9097M0150
$$ plain form
16517 1888385 2347636 2127492 2223817 2058572 2179129 1986276 2067652 1952453 1912765 1889997
16507 1889997 2171211 1748205 1977996 1596929 1697312 1681614 1722484 2022599 1651885 1732955
16497 1732955 1663868 1715114 1455146 1539783 1706830 1758505 1624214 1542310 1748046 1432204
16487 1432204 1931554 1771273 1597874 1528691 1705400 1383650 1484926 1633030 1402619 1287752
16477 1287752 1255660 1786628 1675819 1436479 1143567 1419548 1653721 1180274 1511469 1221875
16467 1221875 1600410 1308554 1255721 1395091 1038329 1206194 1212747 1134105 1137624 1348316
16457 1348316 1256175 1269349 1175320 826041 1079427 1582210 1073890 1100542 1041345 1217797
16447 1217797 772736 1048887 986465 1080525 1079801 1062836 1193440 863287 963454 982551 1022701
16436A022701j31529j6480q9262L76234k14749J24465K16570l85614J57126p2113
16426I87349k09892K71797l61181P8607K41008L28202m26234m8340L64709l78018
16416H48007k02515K91726k16012K78239m50517J76510n7756L01483k77225J62597
16406H54537j81323n9958K67909M3106k6596N5254n349m38006K35293R0707K04181
16395A039755j90256L714l2014L9441j10861J02299M6732k54828J48966k31151
16385E61797J4152J52692k67093L45252j30437j11302p6387R3522k1093k02247
16375C58856L52960k79387J95302P3983n623j68325n9163K14358k59559L42378
16365G65780k84058l1939J18358J81049j53206J28625j86779J38499p2534n693
$$ plain form
16436 1022701 891172 874692 785430 1161664 946915 1071380 1287950 902336 1059462 987349
16426 987349 777457 1049254 688073 766680 1007688 1335890 909656 861316 1226025 848007
16416 848007 645492 937218 721206 999445 548928 725438 667682 969165 691940 854537
16406 854537 673214 613256 881165 924271 897675 952929 947580 509574 744867 835574 1039755
16395 1039755 849499 853213 821199 860640 749779 852078 898810 643982 792948 561797
16385 561797 575949 728641 461548 806800 676363 565061 488674 582196 561103 358856
16375 358856 711816 432429 627731 701714 696091 527766 468603 682961 423402 765780
16365 765780 481722 449783 568141 749190 595984 724609 537830 676329 603795 598102
16355E98102k63174l7011M52015B16890N21231l299k20080k526J6993K6712j69897
16344C86024J25244q1151n3693j00131J96224J96915j74469J71772j80613K83173
16334G69295k65162J13305k50219L62173k80750l1150O1158O2868P6422l1049
16324E86891m4117l3581L3467m545A99137L3597M78115r0352B41618M29468k25125
16313D45961o2211K49293l8561l5956j83633K87271B57478K61860q4483p968q6546
16302C40341j53969P0721J02937J58478j99029P8308J89574k84194K63205B66514
16291B04315M59623G5575J92594L80381B57132L432J5824M4018j17989K03390
16281D05807A85125J14534K29665j54258c7649D45759j8400j41017H7556G496
$$ plain form
16355 598102 334928 297917 749932 216890 738121 734822 514742 512216 529209 555921 386024
16344 386024 511268 430117 376424 276293 472517 669432 494963 666735 486122 769295
16334 769295 504133 617438 367219 729392 448642 417492 478650 541518 617940 586891
16324 586891 542774 509193 542660 538115 199137 232734 710849 620497 241618 671086 445961
16313 445961 383750 633043 594482 558526 374893 662164 257478 519338 434855 426887 340341
16302 340341 186372 257093 360030 518508 319479 397787 587361 303167 566372 266514
16291 204315 663938 75575 268169 648550 257132 260564 276388 320406 202417 405807
16281 405807 185125 299659 529324 375066 -37649 445759 427359 286342 87556 7496
16270E24332j98566A45879O5927J26117j08958A06024M99158k67529j03898M8047
16260B81802q2789J39875R5524K734r0938A25989K44454k8311N2344r7116J74668
16249D72028K42900B06265r2857M00259B22377G6459K34311R0543D3757f6852
16238C59870Q47J09921b046F68099I3927L00585r7029L3067j22257L00431q9270
16227D19454A90107K46395J1547B10696L62588I1815L7345m4515K52318j17865
16217B19098P6908l8572A17692J03651H8426K03885A17991J33124n1478N2610
16207B52247j05711J93629q9341M4870J3949O2204j42957Q9138j35441k4435K60659
16196D18811o5053D2447J62648m8853R4406A02559K65358H8558k4788j2488J65007
$$ plain form
16270 524332 325766 145879 211806 337923 228965 106024 605182 337653 233755 281802
16260 281802 199013 338888 434412 437146 346208 125989 370443 342132 394476 297360 472028
16249 472028 714928 206265 113408 513667 222377 76459 310770 401313 43757 -66852
16238 359870 360717 470638 -2046 668099 93927 394512 297483 330550 208293 508724 419454
16227 419454 190107 436502 448049 210696 573284 91815 129160 84645 336963 219098
16217 219098 296006 257434 117692 221343 88426 292311 117991 251115 199637 252247
16207 252247 146536 340165 250824 295694 309643 371847 228890 318028 182587 158152 418811
16196 418811 353758 42447 205095 156242 250648 102559 367917 88558 63770 51282 216289
16185B16289K7427p7645R7269a12566B65453I3513K49073j31269A04933K87346
16175C92279b3116A8570N41527A39286J40675j0098j2473j01459J12884J55798
16165D24613j67860A08844c9423B5813j311K40321J9709A36392j2388R6528O0734
16154B81266A28368k5349K41379A24346a36471E65509I1925E318J62291M0939
16144B08548b0734D75371A19616J51827j05098C8891J72790o3049c5587j2920
16134d8507D64089B27198l5914q8928J96378C9114M21886R2716A81744o5750n7269
16123E8725d4649D0076g5901p7784B45383C1296L73231A69190b17640C32934k8319
16112C04615c6147I9610J12366J55124b19925h4476F3554J57967G9677J06786
$$ plain form
16185 216289 243716 166071 263340 -112566 265453 93513 342586 211317 104933 392279
16175 392279 -23116 18570 560097 139286 279961 269863 257390 155931 268815 424613
16165 424613 256753 108844 -39423 25813 24502 264823 284532 136392 124004 220532 281266
16154 281266 128368 103019 344398 124346 -136471 565509 91925 5318 167609 208548
16144 208548 -20734 475371 119616 271443 166345 38891 211681 148632 -35587 -48507
16134 -48507 464089 227198 191284 102356 298734 39114 461000 553716 181744 115994 58725
16123 58725 -44649 40076 -75901 -153685 245383 31296 404527 169190 -217640 332934 304615
16112 304615 -36147 99610 211976 367100 -219925 -84476 63554 221521 79677 186463
16102A86463P8555I1298J85387J41447b16519D0242N2645A1668n119M58056j41430
16091C23175c34818B28865I729b63811A72680b22972C4575B704O7917J22130d5750
16079c7312J976j9930l45564A41911N3320F4761J65651R517a6813l167n453q553
16067c3986l3635A53747d6948B97976b12827a00817I0834a43296H3293J37324
16057B20617b2454C0794J50538k9614H559i7493E4847a7988E0883K8914E102J53646
16045A58748n0274j6230i2117A38074k7999a14037C22138E8020j6921a12566o9244
16034a81810G3551l5191K96499D359J00705a23369A67033p8558b40399G3520m598
16023F8922a9938h408k29946c7423B11950N6023m6021a72739a2442C49337k584
$$ plain form
16102 186463 265018 91298 276685 418132 -216519 40242 92887 11668 6549 464605 323175
16091 323175 -334818 228865 9729 -263811 172680 -222972 34575 2704 70621 192751 -45750
16079 -37312 -35336 -55266 -400830 141911 195231 64761 230412 239929 -16813 -19980 -25433 -33986
16067 -33986 -67621 153747 -46948 297976 -212827 -100817 90834 -143296 83293 220617
16057 220617 -22454 30794 181332 151718 8559 -97493 54847 -17988 50883 79797 5102 158748
16045 158748 108474 92244 -92117 138074 110075 -114037 322138 58020 41099 -112566 -181810
16034 -181810 73551 38360 334859 4359 105064 -123369 167033 88475 -240399 73520 68922
16023 68922 -19938 -8408 -238354 -37423 211950 267973 221952 -172739 -12442 349337 346753
16012C46753a16508B2739g2689A35718k9102J21428a93716A31902m3438I414a82569
16000A1059a27731j95210D58325a0903A1110J76205b33215J15870B4406J99911
15990B24317G1402K86201A40040b05993A15476K20271a06042A49838a00455H5305
15979C19967J57861J86871P9530K37606j285l64959r1585j04362L3104A14475
15968g3520H9370N1097P0561g4422F3000a2475H2887J75716B6919P4134K2343
15957A23396h0540E4227g9741b1662L765A44240d6409B2443B241b52502a02637
15945D1685L8601a03335B15330q0463J90634r3881I4096a03068l53670a6789m0939
15934e7728A06899j0344a38632j24334A49804a29807e0215p1388D07707N7705
$$ plain form
16012 346753 -116508 22739 -72689 135718 106616 228044 -193716 131902 88464 9414 -182569
16000 11059 -127731 -322941 458325 -10903 11110 187315 -233215 -117345 24406 224317
15990 224317 71402 357603 140040 -205993 115476 335747 -106042 149838 -100455 85305
15979 319967 477828 664699 744229 981835 980550 615591 524006 419644 452748 114475
15968 -73520 89370 140467 211028 -74422 63000 -12475 82887 258603 26919 101053 123396
15957 123396 -80540 54227 -79741 -21662 -17897 144240 -46409 22443 2241 -252502 -102637
15945 41685 80286 -103335 215330 134867 325501 231620 94096 -103068 -456738 -16789 -57728
15934 -57728 106899 96555 -138632 -262966 149804 -129807 -50215 -121603 407707 465412
15924D65412j01211a35670l2628N1800A27698e243k33901a9689a033m7851j2357
15913f1241l35062D61250B2920J01386i8389A54331c55956A67043m3269A9072
15902A32456d9743a579j84710h7464D8531K8676j4825e2896B3362g1366L169j91585
15890b59782B16968f5105j81837A91903i2444B00697K860a56882K8471j94892
15880c23303B60783b13436d0090F2990b70329d8160A13892a53511B49795a10094
15869A42716i6064B53226e9212G5486C4778J06031c38928A11905l5688a67700
15858c8937B2071c22598A23910c51034B65413G4374J4082a90981B32796K4696
15848B57492g6732K7804l3687b0365E6662a21314q7703A59504a88545A9181c247
$$ plain form
15924 465412 364201 -135670 -168298 -116498 127698 -5243 -239144 -19689 -1033 -48884 -61241
15913 -61241 -396303 461250 22920 124306 -98389 154331 -355956 167043 123774 19072
15902 132456 -49743 -1579 -186289 -87464 48531 77207 62382 -52896 23362 -71366 -68197 -259782
15890 -259782 216968 -65105 -246942 191903 -92444 200697 203557 -156882 -128411 -323303
15880 -323303 260783 -213436 -40090 62990 -270329 -48160 113892 -153511 249795 -110094
15869 142716 -96064 253226 -59212 75486 34778 140809 -338928 111905 76217 -167700
15858 -38937 22071 -322598 123910 -351034 265413 74374 88456 -190981 232796 257492
15848 257492 -76732 -48928 -82615 -20365 56662 -121314 -209017 159504 -188545 19181 -3247
15836H9825g0850o4817O0191B67618d06243E6843b00626d0839j94045a139j69262
15825a70401M3592j70411P6121a03681B0831c76677f5060k3057j59691J09860
15815a37948A92912d373F1710h5688D61523C2660a61769k08536a25639B95340
15804c12179D7948h038A05767Q6715K9124k2689Q6016b33362f2574B9129F889
15792A60218P5104b83211C94683a70251E09897A55801a99214A56706a28561b9530
15781h5898b8197A16601j519a5543L839E8365Q537a99126A75686d9414k77336
15770c26750b3804F4894e2845j38082A44268a82072A06262K8067D5328c5731j82536
15759b18267a07910A10235f0763D5000c39294F6888J10864m6841Q026n0054i9636
$$ plain form
15836 89825 -70850 -135667 -75476 267618 -406243 56843 -200626 -40839 -234884 -1139 -170401
15825 -170401 -126809 -297220 -221099 -103681 20831 -376677 -65060 -88117 -247808 -137948
15815 -137948 192912 -4373 61710 -85688 461523 32660 -161769 -370305 -125639 295340
15804 -312179 47948 -8038 105767 192482 221606 198917 284933 -233362 -62574 29129 6889
15792 160218 235322 -283211 394683 -170251 509897 155801 -199214 156706 -128561 -29530
15781 -85898 -28197 116601 115082 -15543 -11704 58365 66902 -199126 175686 -49414 -326750
15770 -326750 -23804 64894 -52845 -190927 144268 -182072 106262 134329 45328 -35731 -218267
15759 -218267 -107910 110235 -60763 45000 -339294 66888 177752 130911 138937 88883 -99636
15747g8356B83831i2890N628D0537M92662c3793A3988c84509F7973a15989I0586
15735A75420K29200a44508O1822n0310A28766B2120N4306a1314l30420J19828
15725b21906g7081L7107k62110d2135j56305B72237b8565j8416m577Q771j19728
15714a62515M8463I8078O2760a41892J9061C1844J97643D7296b6777k5678E8966
15702a89079C04117D321i4676K5817j76766h1924j54395A73141e80655A44861
15691a00986k15660A6794a19204F9226a49811A90145g5960k21603i1043I7680
15680A5496b49207E2722c4098o5202n4453p6241B11437a78257B03874a88278K788
15669a85490j55980g5711A05515D8655M7144a21485d196j41952H0797K5644j1172
$$ plain form
15747 -78356 283831 -92890 -87262 40537 533199 -33793 13988 -384509 67973 -115989 90586
15735 175420 404620 -144508 -82686 -132996 128766 22120 76426 -11314 -341734 -221906
15725 -221906 -77081 -39974 -302084 -42135 -198440 272237 -28565 -46981 -51558 -42787 -162515
15714 -162515 -114052 98078 160838 -141892 -122831 31844 229487 47296 -26777 -52455 58966
15702 -189079 304117 4321 -94676 -68859 -245625 -81924 -236319 173141 -580655 144861
15691 -100986 -316646 16794 -119204 69226 -149811 190145 -75960 -297563 -91043 97680
15680 15496 -249207 52722 -34098 -99300 -153753 -229994 211437 -178257 203874 -188278 -185490
15669 -185490 -341470 -75711 105515 48655 95799 -121485 -4196 -146148 80797 106441 95269
15658I5269g8789E4298h1671C9263Q3576N7969d1220k0008D05533a88673J3240
15647a75433j02034d5838k5551n2537H0765b3106m1986p1444o2460A47083D8408
15635a65888j70633j37864b30348D8171c16445f2759f012j54996r8949J29031
15625a30926e7593j78790A84703C7301J6053a0447k736j67062n2125B93339b03027
15613a53255C56187A2281J91728B4525R9016g7763m468B7915c8787A40354P693
15602A48047N7010d7515J9684n5550L4779B78211C4026P0521b94485A8140K44991
15591B63131I5546c4129j7426A81697E6110J49867k9198C027c8108j39764B50247
15579b36701P7286p1681d3558l8621l055L9885r1429k48242b5411q383l8663A22573
$$ plain form
15658 95269 -78789 54298 -81671 39263 122839 180808 -41220 -61228 405533 -188673 -175433
15647 -175433 -277467 -45838 -71389 -123926 80765 -23106 -65092 -136536 -198996 147083 48408
15635 -165888 -336521 -474385 -230348 48171 -316445 -62759 -6012 -161008 -259957 -130926
15625 -130926 -57593 -236383 184703 37301 53354 -10447 -13183 -180245 -232370 293339 -203027
15613 -153255 356187 12281 204009 24525 123541 -77763 -82231 27915 -38787 140354 148047
15602 148047 205057 -47515 -27831 -83381 -48602 278211 34026 104547 -294485 18140 263131
15591 263131 95546 -34129 -51555 181697 56110 205977 176779 3027 -38108 -177872 250247
15579 -236701 -159415 -231096 -43558 -82179 -85234 -45349 -136778 -385020 -25411 -33794 -72457 122573
15566F4191i6280L2874o1265B14807F8453c6514j05807J2961B5288J93082F0272
15554a64849k1339l971D9284J53647b8349A61100M0364i7622b3961A52517O6329
15543B18846a78004A83979E9118K7626k2895J50581b78299A45352K3749j8646
15533A50455d6549l3168l8930A52496o2347O4345l0194L9025J57585F8852L83813
15522D52665b8546C24176r0955L64720A2755J15625J45695D9300J55373K23700
15512D28373j70737j11870R6485Q7467L2738b71472E2217N4693B7726K96076R1055
15501D14857A27651a51195F5094L0648k0469l5747M29384b88418B01292a33171
15490g9790q688b0682H009b8244I7661K7051J79636A00290i3047A27351F942a17051
$$ plain form
15566 64191 -96280 -63406 -124671 214807 68453 -36514 -142321 -129360 25288 218370 60272
15554 -164849 -186188 -190159 49284 202931 -28349 161100 201464 -97622 -23961 152517 218846
15543 218846 -178004 183979 59118 86744 63849 214430 -278299 145352 169101 150455
15533 150455 -46549 -79717 -118647 152496 90149 154494 124300 163325 320910 68852 452665
15522 452665 -28546 324176 233221 597941 12755 128380 274075 49300 204673 428373
15512 428373 257636 145766 242251 329718 362456 -271472 52217 106910 27726 323802 414857
15501 414857 127651 -151195 65094 95742 75273 39526 468910 -288418 201292 -133171
15490 -79790 -88478 -20682 8009 -28244 97661 124712 304348 100290 -93047 127351 6942 -117051
15477d5571B79415C4819J09249M5363K52955A18936B8129a05290d145A41755c8757
15465a8864j38388A23811B7123a95630c5298D04474f4994A62472a75495B02815
15454a22153B16375H6922J15287a75128b2015j2366A78712F9497K91194p6902
15444B83789q1732L2530L29625r9128J04287j42354A30442K8977k0263D9200J1937
15433F1137J0574K77329H3736J77091A879b45468C30576I6775d4435C08007c12796
15421A66690b9385k1133a9714k65644P635b8817l768D4969O1449a04063a3955
15409i4469A74491q573f6726m2646D8044M7200b31027H5453J49045I0881N9406
15398A50287K9697b02680D8521q220K31867L7384j00487b28837A79258G8812K1277
$$ plain form
15477 -45571 279415 34819 144068 189431 442386 118936 28129 -105290 -4145 141755 -38757
15465 -18864 -157252 123811 27123 -195630 -35298 404474 -64994 162472 -175495 202815
15454 -122153 216375 86922 202209 -175128 -22015 -34381 178712 69497 360691 283789
15444 283789 202057 234587 564212 465084 569371 427017 130442 159419 139156 49200 61137
15433 61137 71711 349040 83736 260827 1879 -245468 330576 96775 -44435 308007 -312796
15421 166690 -29385 -50518 -19714 -285358 -277723 -28817 -32585 44969 106418 -104063 -13955
15409 -94469 174491 165918 -66726 -109372 48044 95244 -231027 85453 234498 90881 150287
15398 150287 179984 -202680 48521 40301 272168 309552 209065 -228837 179258 78812 100089
15387A00089J62635J0684j03724k6046J4530a24169d9500k05394b7168j5847C83130
15375A50916o1314k2053J14577B0507a8911A86012q0929a558l0765B27106C8072
15363d4555B3836K11579f3546B13524R8748j27060k7167D100P7891d3250k80729
15352c23979e6002A15819g4195A94905H7235M04886k36965i0383A54498K87914
15342D42412G3295L44942j42291J170A2729R9192L30775A6376a70087q2498G2531
15330E9545J43111q3427a09697A24891R1874b00378B46629j07704J87593M6374
15320C72892b973C85751A7819R6135h7211G015c9454A80004M4697D1596K77370
15309C18966j846K3463j57651O1965p4495a54984L9350I055L04193a49426C48159
$$ plain form
15387 100089 262724 273408 169684 143638 158168 -124169 -49500 -254894 -27168 -43015 383130
15375 150916 89602 67549 182126 20507 -18911 186012 105083 -1558 -32323 227106 38072
15363 -44555 23836 235415 -63546 213524 312272 185212 158045 4100 81991 -43250 -323979
15352 -323979 -56002 115819 -74195 194905 87235 492121 255156 -90383 154498 442412
15342 442412 73295 418237 275946 277116 12729 111921 442696 16376 -170087 -252585 72531
15330 59545 202656 119229 -109697 124891 216765 -200378 246629 138925 326518 372892
15320 372892 -2973 385751 17819 113954 -87211 7015 -39454 180004 224701 41596 318966
15309 318966 317120 340583 182932 244897 170402 -154984 -115634 9055 313248 -149426 348159
15297A94596C4155M72496a751B23049d2712A80660i3077B10757h2714A5880K03791
15286B19671a18203c4267l1638k18367A66992A5120K96381A6594J94062j3970
15276A96686f926A32096b80617C2535L00012e7963H2466J5814i1826d5801j15392
15265a61193C7897P9055J84571n4316r8189B7013O67913a35889A21632a9078C2344
15253A24205A4010f3963C02834J7292a07285C2645K5826O1568J06159i3846A93559
15241A77471L74930A09516J00749O9505j33152N0373P6237F9441P16248K17860
15231A003549J265576J959922j459989L18522J2110A071698D88574j84518l4105
15222B69951R7060A15825d0152B70933n0887g4145B43998b57695B38991E2743
$$ plain form
15297 194596 34155 506651 -1751 223049 -42712 180660 -93077 210757 -82714 15880 219671
15286 219671 -118203 -34267 -65905 -284272 166992 15120 311501 16594 210656 196686
15276 196686 -6926 132096 -280617 32535 332547 -57963 82466 98280 -91826 -45801 -161193
15265 -161193 37897 116952 301523 247207 149018 27013 694926 -135889 121632 -19078 32344
15253 124205 14010 -63963 302834 320126 -107285 32645 58471 120039 226198 -93846 193559
15241 177471 552401 109516 210265 279770 146618 196991 273228 69441 785689 1003549
15231 1003549 2269125 4229047 2769058 3087580 3099690 1071698 488574 304056 269951
15222 269951 367011 115825 -40152 270933 220046 -74145 243998 -257695 238991 52743
15211B51359f0489A09993M5646K4568q6372j5206N8386o7736a01939q9536q3367
15200b74842J07053G6459J06264P1444G1354P1490F7161a34181c9691B55983A062
15188B2477d7292l3879E1739K00527g1198B62681d6566B51056o6449n8505L2496
15177A58598J6732K0346A5633P8723d8466H1432J35411d14525A5603J24912R6187
15166B36702H4431Q549J54484D668b88084O7406B27308d3844G5396J83254j11557
15155A47093a78267P248A08470a24737a0185B7911K50675A16523O2101a12914
15144B12371F5204a91972A39625a17425B68116l4360E4406J96067A01696O6154
15134A67850n9749J71712N1879J53097A54923C0356L3422L95315j71898J72391
$$ plain form
15211 251359 -60489 109993 155639 180207 93835 78629 137015 69279 -101939 -191475 -274842
15200 -274842 -167789 76459 182723 254167 71354 142844 67161 -134181 -39691 255983 1062
15188 22477 -47292 -81171 51739 252266 -71198 262681 -46566 251056 184607 126102 158598
15177 158598 175330 195676 15633 94356 -48466 81432 216843 -414525 15603 140515 236702
15166 236702 84431 92980 247464 4668 -288084 -220678 227308 -43844 75396 258650 147093
15155 147093 -178267 -171019 108470 -124737 -10185 27911 278586 116523 178624 -112914
15144 212371 65204 -191972 139625 -117425 268116 233756 54406 250473 101696 167850
15134 167850 108101 279813 331692 484789 154923 30356 63778 459093 287195 459586
15124D59586a8344A58496n0005K51138A16335K6579n0858L32697j29158G4553
15113C22268p7271P2001L48564J88624p6256C31575q7326p4477a31338b7132B59939
15101E15192A46084n9578h215I5890L27580b57693a9660A42328E8160O9255J40249
15090B67664B1950P0536f7693B36693E6952J98132Q6156a86397B50546B854K05331
15079B08185A9020J25511J5170j5798K8282L454f4783B18169J29686P5822A89153
15067B15863K4865c01872f0959A0207c063j23342B81239J38150j42692H4882g9969
15055D23250L3532p2623j73001Q1816J2637O5097g4172C08005j32340J92386g3969
15043F7564N71603C1617K06956J56800G7588M82574A06870r329J5010L36827j43706
$$ plain form
15124 459586 -18344 158496 108491 359629 116335 142914 92056 424753 295595 74553
15113 322268 244997 316998 665562 854186 777930 331575 244249 169772 -131338 -27132 259939
15101 515192 146084 86506 -8215 95890 423470 -257693 -19660 142328 58160 127415 267664
15090 267664 21950 92486 -67693 236693 56952 255084 341240 -186397 250546 2854 208185
15079 208185 19020 144531 159701 143903 172185 175639 -64783 218169 347855 423677 189153
15067 215863 240728 -301872 -60959 10207 -3063 -126405 281239 419389 276697 84882 -79969
15055 423250 456782 384159 211158 292974 305611 370708 -74172 308005 175665 368051 -73969
15043 67564 639167 31617 238573 395373 77588 560162 106870 97541 112551 449378 305672
15032C05672j4598L18373j64906Q7863o639J88787B60725P0015N8361j62479K13462
15021D40084A48473G860K45993q6430M28338k96749j02934Q2371J15974J27831
15011E22254p9953O861j78160O2661R976K4165C5125K68721K73691B70666J78960
15000D49626J05442A79779L02506A85870J41187J51041k3899J96616j16330j92781
14990C41704j41737r5485K26715l9120o9449A05707L39317k17723O11329j14004
14980G24626j54873k64417J811J63537j07777L6028O7539l4419j48145K26933
14970E10843k8373p0182j9262k4059l218C5619K01080L96562B59628N595a610
14958B9899L09521Q83O9208j7544A37273J4452J93498r2214P8293J93496g4386
$$ plain form
15032 305672 291074 609447 444541 532404 525765 714552 260725 330740 389101 226622 440084
15021 440084 148473 7860 253853 167423 595761 299012 196078 278449 394423 522254
15011 522254 442301 449162 271002 333663 343639 367804 35125 303846 577537 270666 449626
15000 449626 555068 179779 482285 185870 327057 478098 454199 650815 534485 341704
14990 341704 199967 104482 331197 292077 222628 105707 445024 227301 838630 724626
14980 724626 569753 305336 307147 470684 362907 398935 466474 432055 283910 510843
14970 510843 482470 412288 393026 368967 365749 35619 236699 633261 259628 265223 -1610
14958 29899 339420 340303 409511 391967 137273 151725 345223 253009 331302 524798 -74386
14946E91483j25585B07298L33085j51967O9522J56320k14021M1654j88541A08452
14935I3398M73558j91818o3600Q6810M6489L17180R2481Q5526L55122m10084K52769
14924A137831O3887l50228R8603M0320k69606M16352L07227n10257P26880p6415
14914A584594j24862o21049k8565o5356O1977L1236l34518J92124A92947M63883
14904F56830B47232q482K00676J18095j49761j8847A0784K56319K96529B11539
14893C24240K99038A06014K14762P730N6752k1800K2304J90643o7398B18334K74356
14882D92690B00620M81590J4534k18037p1865N48708D27106J7876K2463m3149
14872D24296b28715E45032k07016J62846Q0752B35041D8552N70461k63907M06357
$$ plain form
14946 591483 465898 207298 540383 388416 457938 614258 400237 441891 253350 108452
14935 93398 566956 375138 311538 398348 444837 762017 854498 940024 1295146 885062 1137831
14924 1137831 1201718 851490 950093 990413 720807 1137159 1444386 934129 1661009 1584594
14914 1584594 1459732 838683 810118 744762 806739 837975 503457 695581 192947 656830
14904 656830 247232 238750 439426 557521 407760 388913 10784 267103 563632 211539
14893 324240 623278 106014 320776 328506 385258 363458 385762 576405 509007 218334 492690
14882 492690 200620 682210 696744 478707 406842 955550 427106 444982 467445 424296
14872 424296 -228715 545032 338016 500862 581614 235041 48552 619013 355106 761463
14862G61463k75599A01712K04747K87958j56795k02871K88259n8463L9917J40577
14852F45041k84167P1000Q4851j14420M6637L7198j99620L34451j41474K62196
14842G41693J30293l51928N82347Q3026k18472J4758m27977K96883k79786N04353
14832A075190k79417l79582Q5688r4949M98895m7431m26937N42023D65637J55866
14822F21503j67416K4129J12548l5663L15780M2117q3468q1522K07792k85148
14812F70652B48641O08904l15456K9304L06145k20258K93569k18340j9722L63501
14802A076288n3510l88137p7741R5242J02325C53894K4289N35868D15041M65338
14792H80379m3622k61042J94474J05543l01862K0430P6437l04956L02664l00408
$$ plain form
14862 761463 485864 101712 306459 594417 437622 234751 523010 464547 504464 645041
14852 645041 360874 431874 516725 402305 448942 486140 286520 620971 479497 741693
14842 741693 871986 520058 1102405 1185431 966959 981717 553740 850623 570837 1075190
14832 1075190 795773 416191 501879 406930 905825 858394 431457 973480 465637 621503
14822 621503 454087 478216 590764 555101 870881 912998 829530 748008 955800 670652
14812 670652 248641 857545 542089 571393 877538 657280 950849 732509 712787 1076288
14802 1076288 1022778 634641 556900 652142 754467 353894 378183 914051 415041 880379
14792 880379 836757 575715 770189 875732 573870 594300 670737 365781 668445 368037
14782C68037J83832J78267Q1762l1319j1168q3069J28845j30529K5470j98786
14772E11342K69989C85642J05318M51842l84674M14181l20944j33072K40658l8404
14762G20547J56526m18581J17141j053L00798j30020k12397B61775K50729L00331
14752H12835k51870j95490K06935K1490L5529L60356k01352k23850K68864p5441
14742G58006o7933L3954l1077k3307J2747J05745L60253k01575j47701L09811
14732A108923k81081q7480J35580K39352J75221K6593K36452l94541L41772n42336
14722I58455k22151J11162J37399k89565J97910k0179j26753j93680L81200j24270
14712H09528j92097J87031J50974n985J0681m3334R99M07354j39412K461R4421
$$ plain form
14782 368037 551869 730136 811898 780579 769411 686342 815187 684658 710128 511342
14772 511342 781331 385642 490960 942802 558128 972309 651365 518293 758951 720547
14762 720547 877073 458492 575633 574580 875378 745358 532961 261775 512504 812835
14752 812835 560965 365475 572410 593900 629429 989785 788433 564583 833447 758006
14742 758006 690073 724027 692950 669643 682390 788135 1148388 946813 799112 1108923
14732 1108923 827842 740362 875942 1115294 1290515 1317108 1553560 1159019 1500791 958455
14722 958455 736304 847466 984865 695300 893210 873031 746278 552598 933798 809528
14712 809528 617431 804462 955436 949451 960132 916798 917797 1325151 1185739 1188200 1282621
14701A282621L95725l93875m0014k14513K14732l11670M21151k03289j55748l2903
14691I62217J24970r8827j58450J99053l49358K50941p5732M1203L33049m93959
14681G35107k76300L29889L62019k69240J86479k4184n5205J76473j41331n6633
14671I67074Q904P9709K03927l10710J42961k1671k36463J75658J55186l46571
14661H18004K0331L10169j13067L84141j99116n0423j48018K59172k44364L95705
14651A432534k37700j6761L835j53949j23625J23756L43694m05680J62233Q0988
14641A209325j59141J40906O1855j45630o2956K29665l3995N5848o301k40726
14631A048850L27069j28048J58114l02532L01074K63875n43918K56221j4721j78729
$$ plain form
14701 1282621 1678346 1284471 1244457 1029944 1244676 933006 1354157 1150868 995120 962217
14691 962217 1087187 988360 829910 1028963 679605 930546 854814 896017 1229066 735107
14681 735107 458807 788696 1150715 881475 1067954 1043770 988565 1165038 1023707 967074
14671 967074 975978 1055687 1259614 948904 1091865 1070194 833731 1009389 1164575 818004
14661 818004 838335 1148504 1035437 1419578 1220462 1170039 1022021 1281193 1036829 1432534
14651 1432534 1194834 1178073 1181908 1027959 904334 1028090 1371784 966104 1128337 1209325
14641 1209325 1050184 1191090 1252945 1107315 1044359 1274024 1240029 1295877 1289576 1048850
14631 1048850 1375919 1247871 1405985 1103453 1404527 1668402 1124484 1380705 1365984 1187255
14621A187255J89668N3516j99708O08796o45618J54929J07850K38973l59212J01050
14611A437499N1063j27526K43813l9594L01454M3740k15015j39180J42849k92132
14601A406971K22161K52117l0208j14377J57576j3350j15805j75835R9749K78249
14591A967248j88499J26161k26732K2211L20991k06461Q3222K3953Q5871n09429
14581A498536O17414j31643P6912P2995P1293l01127q1779K63775j09588J76192
14571B152980k69988M13749k77407K64907K57361l16097J03426K57977j96248
14562B390660j50199K93736K12089Q3839p6749K65942k08169L99629K95523J09440
14552C615741L31651O72230J334228K011562L088327P320521J7754037J1595005
$$ plain form
14621 1187255 1376923 1430439 1230731 1839527 1193909 1348838 1456688 1695661 1336449 1437499
14611 1437499 1488562 1361036 1604849 1565255 1866709 1910449 1695434 1556254 1699103 1406971
14601 1406971 1629132 1881249 1851041 1736664 1894240 1880890 1765085 1589250 1688999 1967248
14591 1967248 1778749 1904910 1678178 1700389 2021380 1814919 1898141 1922094 2007965 1498536
14581 1498536 2115950 1984307 2061219 2134214 2205507 1904380 1822601 2086376 1976788 2152980
14571 2152980 1882992 2296741 2019334 2284241 2541602 2225505 2328931 2586908 2390660
14562 2390660 2240461 2534197 2746286 2830125 2753376 3019318 2811149 3210778 3506301 3615741
14552 3615741 3947392 4619622 5953850 7965412 11053739 18374260 36128297 47723302
14544D7723302A9103364H753438l649218j307864r30669k45050l01610k36389
14536B082638j7306K6250K85255K39705m04002K19127J26717M63215J26887P37233
14526C885719J914830M900069E149212k083120m64475J10728j88831J09962m4731
14517B588745k99107K18054J83308j28076K64028J12706j91360k7889J78191n5119
14507B843481N6243J96696k7128n9940k57571L17227j26717M51032j18856P8300
14497C352767j89702K99987j39247J38055j60808R0690n94577R39335m13330N0358
14487C373528L38060j22293K15663j11883k3226K87815j11151j23922k79775N39031
14477C981847o8534q2513K88349K1836j09355N36868n46524K84859o7292K37302
$$ plain form
14544 47723302 19103364 8753438 5104220 3796356 2865687 2620637 2319027 2082638
14536 2082638 2065332 2091582 2376837 2616542 2212540 2431667 2558384 3021599 3148486 3885719
14526 3885719 5800549 10700618 5149212 3066092 2601617 2712345 2523514 2633476 2588745
14517 2588745 2289638 2507692 2691000 2562924 2826952 2939658 2748298 2720409 2898600 2843481
14507 2843481 2899724 3096420 3069292 3009352 2751781 3069008 2942291 3393323 3274467 3352767
14497 3352767 3163065 3463052 3323805 3461860 3301052 3391742 2797165 3736500 3323170 3373528
14487 3373528 3711588 3589295 3804958 3693075 3669849 3957664 3846513 3722591 3442816 3981847
14477 3981847 3913313 3830800 4119149 4140985 4031630 4568498 4021974 4306833 4239541 4476843
14467D476843K62144j27917K6238m1756n5297M06141K5998k03421K23901J36332
14457E129206j97188l0334j32462K29047Q0744J48436J83695m6278L0354p1257
14447E323963M95905n68360M12418L56977P9813J5235k09604L07585n2263M50577
14437F612246l46211M35570l55617K27911M00405j93884K45677p2209J09300J38401
14427G201589J21047K11047m44546N16757j68770M32480L48468Q8906j9028K94527
14417H582477J6989m35249N44503M38831j62069l42693Q14596J2732J80085m2102
14407I608100K44061K54019L1176L32777k3221K81755j48499J66134L10346L07498
14397A1364146L4738K51576J52754O8914J13044K33665M14872L64842J19246n0215
$$ plain form
14467 4476843 4738987 4611070 4637308 4595552 4540255 4946396 4972394 4768973 4992874 5129206
14457 5129206 4932018 4901684 4769222 4998269 5079013 5227449 5411144 5364866 5395220 5323963
14447 5323963 5819868 5251508 5663926 6020903 6100716 6115951 5906347 6213932 6161669 6612246
14437 6612246 6266035 6701605 6345988 6573899 6974304 6780420 7026097 6953888 7063188 7201589
14427 7201589 7322636 7533683 7089137 7605894 7437124 7869604 8218072 8306978 8287950 8582477
14417 8582477 8599466 8164217 8708720 9147551 8985482 8642789 9457385 9470117 9650202 9608100
14407 9608100 9852161 10106180 10137356 10470133 10446912 10728667 10580168 10746302 11056648 11364146
14397 11364146 11398884 11650460 11803214 11872128 11985172 12218837 12633709 12998551 13117797 13067582
14387A3067582M44991K61593J59882M27545J85097M71027J41346J73455K33904
14378A5566422N12136L53208k29941N05514K98576K33423J05057P56476L59387
14369A8460258N05444N88198M5511N98934L01163O11710K41063J92491O53456
14360B2198228M81895K18705Q76714L25642Q44404J86073P27012O98709P44693
14351B7302075N18515P39585O20624P44895O10137J030179P71420Q97596L27072
14342C3562098J058627R99681J203336J129964J164992R55181J209018J167225
14334D2450122J381748R28981J663036J714378R44381J898927J515077K164244
14326E4660894J398759J828803K053805K284683J785834K093401K658402K324361
$$ plain form
14387 13067582 13512573 13774166 13934048 14361593 14546690 15017717 15159063 15332518 15566422
14378 15566422 16078558 16431766 16201825 16707339 17005915 17239338 17344395 18100871 18460258
14369 18460258 18965702 19553900 19599411 20198345 20499508 21111218 21352281 21544772 22198228
14360 22198228 22680123 22898828 23775542 24101184 24945588 25131661 25858673 26557382 27302075
14351 27302075 27820590 28560175 29180799 29925694 30535831 31566010 32337430 33235026 33562098
14342 33562098 34620725 35620406 36823742 37953706 39118698 40073879 41282897 42450122
14334 42450122 43831870 44760851 46423887 48138265 49082646 50981573 52496650 54660894
14326 54660894 56059653 57888456 59942261 62226944 64012778 66106179 68764581 71088942
14318G1088942K704573K703669K896114K934476L227305L199784L377189L876407
14310I6008459M080645L975402M275422M665155M860909N151156N552942N900418
14302A34470508N815558O597842O977940P231881P788409Q172026Q676311Q913300
14294A94643775R712222J0129201J0642393J1276105J1890376J1982043J2822976
14287B73099091J3499883J3959993J4283904J4686119J4906737J4894399J4864718
14280C74194844J5078705J4283148J4012379J3082746J1427316R550004O569108
14273D58198250K757100J354206N68107O20807j375899o233898q323732j1007000
14265D36557941r618392r332114j0689109j2073845j3465344j4420477j5220425
$$ plain form
14318 71088942 73793515 76497184 79393298 82327774 85555079 88754863 92132052 96008459
14310 96008459 100089104 104064506 108339928 113005083 117865992 123017148 128570090 134470508
14302 134470508 140286066 146883908 153861848 161093729 168882138 177054164 185730475 194643775
14294 194643775 204355997 214485198 225127591 236403696 248294072 260276115 273099091
14287 273099091 286598974 300558967 314842871 329528990 344435727 359330126 374194844
14280 374194844 389273549 403556697 417569076 430651822 442079138 451629142 458198250
14273 458198250 460955350 462309556 462877663 463498470 462122571 455888673 447564941 436557941
14265 436557941 426939549 417607435 406918326 394844481 381379137 366958660 351738235
14258C51738235j5218740j5394694j4780089j5090429j4843933j3809432j3532505
14251B49068413j2565423j1848884j1419098j0985683r983897r227995r436085
14244A73601348p674987p835591p855301p119436p003001o321577n142569j679830
14236A22969056n005411o146221n576610m612479m198428l690585l687502l655334
14228H6396486l575596l128424l160338k372664l053247k491023k608445k224183
14220F3782566j864509k474706j829954k014231j774343j454416j837186r76155
14212D9557066j465959j674324j477226j312714j270280k41315j424061j433982
14204C9257205j382585r54778r71615o40413j017332q93960j270690k89264j213247
$$ plain form
14258 351738235 336519495 321124801 306344712 291254283 276410350 262600918 249068413
14251 249068413 236502990 224654106 213235008 202249325 192265428 183037433 173601348
14244 173601348 165926361 158090770 150235469 143116033 136113032 129791455 124648886 122969056
14236 122969056 117963645 111817424 106240814 101628335 97429907 93739322 90051820 86396486
14228 86396486 82820890 79692466 76532128 74159464 71106217 68615194 66006749 63782566
14220 63782566 61918057 59443351 57613397 55599166 53824823 52370407 50533221 49557066
14212 49557066 48091107 46416783 44939557 43626843 42356563 42115248 40691187 39257205
14204 39257205 37874620 36919842 35948227 35307814 34290482 33396522 32125832 31836568 30623321
14195C0623321m56699p23475p37615p77183q35037n31712o17810q28334m99948
14186B4615508o40185k18409q76217n05942m86266j47345n73563o15583j57312
14177B0394686j74652r74260j44373k19096n53551j78670p64250R2417o47038
14168A6831213m84768K235J472o76486P8664m81872l96678p3252m19644j48857
14158A4232027m17680l04907L2492n27439j31157J84496n04417j53832n17609
14149A1891974q6914J53936l16874j73052k95082J29308k78045k75632m71153
14140A0278466K61647l41726Q9509j78888l4486k49632j14472l46714N2052n10564
14130H905192K73035j08465m48226k2151R167m01448J2533K14352p77394K49460
$$ plain form
14195 30623321 30166622 29443147 28705532 27928349 27093312 26561600 25943790 25115456 24615508
14186 24615508 23975323 23756914 22880697 22374755 21888489 21741144 21167581 20551998 20394686
14177 20394686 20220034 19245774 19101401 18882305 18328754 18150084 17385834 17478251 16831213
14168 16831213 16346445 16348680 16350152 15673666 15752330 15270458 14873780 14800528 14380884 14232027
14158 14232027 13814347 13509440 13541932 13014493 12883336 13067832 12563415 12409583 11891974
14149 11891974 11805060 11958996 11642122 11469070 11173988 11303296 11025251 10749619 10278466
14140 10278466 10540113 10198387 10287896 10109008 10074522 9824890 9710418 9363704 9415756 8905192
14130 8905192 9178227 9069762 8621536 8599385 8608552 8207104 8219637 8433989 7656595 7906055
14120G906055J57222O5436k02433j21486l61514j76173j26590J37571j89576K53446
14110G341958n05619m3304J99120k19997j52316J8000l99192K58677j66665j44379
14100F186283J46364j74452k28649j23287M78448o97812J21550l15483J52308
14091E545270J18169j61906K5295K79802n21521j09279j10141l956J44567j25327
14081E080973k83589J41218N5481k56077o3059j48162Q8846R2894j92755J41238
14071D657008k5987k24881o639j89102j61211j12736P35525n39810j56842J79728
14061D155053l60774M02248k17496j71527J358J53499J61583j27671m82276K99659
14051C813656j72436q3132J37217k56518J45509j03672l13776L32512P6392j78442
$$ plain form
14120 7906055 8063277 8128713 7926280 7804794 7443280 7267107 7140517 7278088 7088512 7341958
14110 7341958 6836339 6793035 6992155 6772158 6619842 6637842 6238650 6497327 6330662 6186283
14100 6186283 6332647 6158195 5929546 5806259 6284707 5586895 5708445 5392962 5545270
14091 5545270 5663439 5501533 5526828 5806630 5285109 5175830 5065689 5061733 5206300 5080973
14081 5080973 4797384 4938602 4994083 4738006 4674947 4526785 4615631 4708525 4515770 4657008
14071 4657008 4631021 4406140 4399501 4210399 4049188 3936452 4671977 4132167 3975325 4155053
14061 4155053 3794279 4196527 3979031 3807504 3808862 3962361 4123944 3996273 3513997 3813656
14051 3813656 3641220 3558088 3695305 3438787 3584296 3480624 3166848 3499360 3575752 3397310
14041C397310Q5576j79756j4092N9074J54443R6735r6501k61340l03949J96054
14031C133554M6221k27654k4973j93456M80012k76770J93038J66079p4147L7290
14021C259194l18030J91673l25896k32535K99719l26335j7582J65786k67605K88580
14011B716969l21171J81456J39657l64585j0938j87651k20567L82763J34871k16174
14001B234630N3334j68763o601J63488P9453p4688m3442j7049k70649M56177j09591
13990B296299L26765J483702K169375M997468J5151353K5227824k5024523j2854506
13982A3773757m432237k934393r26184r86821n74576p4173l94836k36599l31184
13973B882754k78738P9717N5163k42693j08675J37518J03019k57742Q5808J7831
$$ plain form
14041 3397310 3482886 3303130 3289038 3348112 3502555 3599290 3502789 3241449 2937500 3133554
14031 3133554 3179775 2952121 2927148 2733692 3213704 2936934 3129972 3296051 3221904 3259194
14021 3259194 2941164 3132837 2806941 2574406 2874125 2547790 2530208 2695994 2428389 2716969
14011 2716969 2395798 2577254 2716911 2352326 2341388 2153737 1933170 2315933 2450804 2234630
14001 2234630 2287964 2119201 2112600 2276088 2355541 2280853 2237411 2220362 1949713 2405890 2296299
13990 2296299 2623064 4106766 6276141 11273609 26424962 51652786 26628263 13773757
13982 13773757 9341520 6407127 5480943 4494122 3919546 3845373 3450537 3213938 2882754
13973 2882754 2604016 2683733 2738896 2496203 2387528 2525046 2628065 2370323 2456131 2473962
13963B473962J41926l67199q9991M9182L6084k17883k8168N12N45281k21265k73678
13952B048763K53586l60494P8017m4834j63513J59747J7216p4870k28343K09220
13942A894495j66855J07584J41388k49457J17386O8162p5573l02504K87818j58634
13932A663810j09461j094J02546L65978m08983k200o0602J69111Q6314j8612m5285
13921A741522l11650J80257l3231j52628J05046j59429P2438K01096l06360K49453
13911A586514r4201m4620j29553K77593K10163k8570k35944j58493k17373M94729
13901A660245j32178J41564l67431j47781J84786r1762Q7491k8664P2612R3565
13891A472447l0846j43368m42318K61276K76753q9660K64782L4268k587L7164
$$ plain form
13963 2473962 2615888 2248689 2158698 2207880 2243964 2026081 1997913 1998425 2543706 2322441 2048763
13952 2048763 2302349 1941855 2019872 1975038 1811525 1971272 1988488 1913618 1685275 1894495
13942 1894495 1727640 1835224 1976612 1727155 1844541 1912703 1837130 1534626 1822444 1663810
13932 1663810 1554349 1553255 1655801 2021779 1612796 1610596 1549994 1719105 1805419 1786807 1741522
13921 1741522 1429872 1610129 1576898 1424270 1529316 1369887 1442325 1643421 1337061 1586514
13911 1586514 1492313 1447693 1318140 1595733 1805896 1777326 1541382 1382889 1165516 1660245
13901 1660245 1528067 1669631 1302200 1154419 1339205 1247443 1334934 1306270 1378882 1472447
13891 1472447 1441601 1298233 855915 1117191 1393944 1304284 1569066 1603334 1600747 1637911
13881A637911l40767j63778r6182O4808m4819O720K90519k29476P8578K98547
13871A502061k97070J87644m41344J47765J63965k09189j10405J96958l53125
13862G87260K68317o6619n0832K54418Q3740j71438K35203k65919l6414J37068
13852A174784k5001m31492J17328k04503N41447k63632j73487J90833J60392p7445
13842A009224O1166q0360q0354J1795k89212L66495j18359l7949L60070m60340
13832G42176N18187n4757m20225m6153L35357k79693j7703O5484J26795k6027
13822I43441K08765j36682k64682K95608N5070k30515j788k63541L97284p2514
13812I30446K91911k68886O8990m92888K26582R4088j04304K21697K90974l27734
$$ plain form
13881 1637911 1297144 1133366 1037184 1101992 1057173 1063893 1354412 1124936 1203514 1502061
13871 1502061 1204991 1392635 951291 1099056 1263021 1053832 943427 1140385 787260
13862 787260 1055577 988958 938126 1192544 1276284 1104846 1340049 1074130 1037716 1174784
13852 1174784 1149783 718291 835619 631116 1172563 908931 735444 926277 1086669 1009224
13842 1009224 1070390 990030 909676 921471 632259 998754 880395 842446 1202516 742176
13832 742176 1260363 1205606 785381 739228 1074585 794892 777189 842673 969468 943441
13822 943441 1152206 1015524 750842 1046450 1101520 871005 869217 605676 1002960 930446
13812 930446 1222357 953471 1022461 529573 756155 850243 745939 967636 1258610 930876
13802I30876j32025q2200J15929j81144j14638L91037k42725K38990j97332N37285
13792A264053m43041J46430D12625L99034q1629K1472J04356J32338m921n1986
13782I31289k96177M5843k15096N47090l66869L4292m104P7980J2122j28712N65742
13771A203400m37191O6027j71596k25930K5148K9929n8406L24932K13702l41581
13761F28434L3523N10328m76463l07183M57150j33235k81663K59073K14994l92414
13751E12544K89299Q0029k34290B12716M27228n9211L7786J68523R8637k88299
13741E97380Q8448k24476J33040l4133k05787J35125K23226k74191k0552J12121
13731E30201M68477j29365j13822p8885j75556M46230D66912J20573J8710r296
$$ plain form
13802 930876 798851 716651 832580 651436 536798 927835 685110 924100 726768 1264053
13792 1264053 821012 967442 412625 811659 730030 751502 855858 988196 983275 931289
13782 931289 635112 680955 465859 1012949 646080 680372 676268 754248 766370 637658 1203400
13771 1203400 766209 832236 660640 434710 459858 489787 431381 756313 970015 628434
13761 628434 661957 1172285 695822 388639 845789 712554 430891 689964 904958 512544
13751 512544 801843 881872 647582 212716 639944 580733 618519 787042 885679 597380
13741 597380 685828 461352 594392 560259 354472 489597 712823 438632 418080 530201
13731 530201 998678 869313 755491 676606 501050 947280 466912 587485 606195 596899
13721E96899Q5310J94673C48975M75582j99716N33J9184q6220r6335k09153J84061
13710D36911j01415M18768l31990q0911P9919K14489B97287L20028C02711N96644
13700H99355I2899M20717L51287l23228L9719j58738N1578K7473K01862B71823
13689H34350l80673o0342K66775B85220L61729k69122k3134K01251q5693P6803
13679E47054R5223k83042K10200k29825N9718K23439A85131m9657O47083j99584
13669E82973k40487K49204j8723p2351G4292K52121j37934N3574K40340n4685
13659D27708j2530L17330j97352k54509L29244l00021M3265K04683k40217L61114
13649F78715B68614J61425J75202L1453j92244j03962K58952k55530o6958K07512
$$ plain form
13721 596899 682209 876882 348975 824557 624841 625374 644558 558338 462003 252850 436911
13710 436911 335496 754264 422274 341363 421282 635771 297287 617315 302711 899355
13700 899355 92899 513616 864903 541675 581394 422656 474234 501707 703569 271823
13689 834350 453677 393335 660110 285220 646949 377827 354693 555944 470251 547054
13679 547054 642277 359235 569435 339610 399328 622767 185131 135474 782557 582973
13669 582973 342486 591690 572967 500616 74292 326413 188479 242053 482393 427708
13659 427708 415178 732508 535156 280647 609891 309870 353135 557818 317601 678715
13649 678715 268614 430039 605241 636694 444450 340488 599440 343910 276952 484464
13639D84464J10967k2531o6057j57771m4249P1110M04221l65772P7831m0362J70299
13628F22150B22949K85615A17434L46322n7805r4442L22284k91216R8601q9110
13618C52068J3706R9994j72077K64030k16828L13438j45859N5414A60633O92569
13608H53202C18126J85712p6528r2622o9380K93695q2476q4985p7831r1132J81152
13597D03731K7471H8796b2709B52508L88573j01733B52166K00381J81514B52321
13586E06088j40593J25434A40039l0187L70462j2709A93669K58039A11721L04346
13576D16067k7596k2961J59866r6234j09942J40224P509a44597D08965n8370L2187
13565C82782L0902A81728M96958D5311K20073L78829A13816L10034A68039P3562
$$ plain form
13639 484464 595431 572900 506843 349072 304823 375933 780154 414382 492213 451851 622150
13628 622150 222949 508564 117434 463756 405951 311509 633793 342577 441178 352068
13618 352068 365774 465768 293691 557721 340893 654331 508472 563886 160633 853202
13608 853202 318126 503838 427310 334688 265308 559003 476527 391542 313711 222579 403731
13597 403731 431202 88796 -22709 252508 641081 539348 252166 452547 634061 252321
13586 506088 365495 490929 140039 109852 480314 467605 193669 451708 111721 416067
13576 416067 388471 365510 525376 429142 319200 459424 466933 -144597 408965 350595 382782
13565 382782 413684 181728 678686 45311 265384 644213 113816 423850 168039 241601
13555B41601J01454o3087C2429J07193M32265j45070A64999R5596J08813A84202
13544E54971B20626I8523M82629j50221J33825e3812G2564J72668R8969l5341
13534C08860j30182J40812o0732J62134k08874m8543K63528A49639J00263J6367
13524B66269P6800c968A36345P1919L8271J16838j2063l4670A37418J04981J12217
13513C54616J63778B53601K54202k24172r7569O8010J17849A73737K36763A72154
13502D48232C2423L01055j26471f00B99639g1148K2281B44737o0880A776M81774
13491D83550q4507Q489i9518E68527B13997B8877K78535p5934l2814n8592F4055
13479D39529j23732A11727J60823P3226q7672j84N5516D8273K83977J07750A5932
$$ plain form
13555 241601 343055 279968 32429 139622 571887 426817 164999 260595 369408 184202
13544 554971 220626 98523 581152 430931 564756 -53812 72564 245232 344201 308860
13534 308860 178678 319490 258758 420892 212018 163475 427003 149639 249902 266269
13524 266269 343069 -3968 136345 208264 246535 363373 351310 316640 137418 242399 354616
13513 354616 518394 253601 507803 283631 186062 254072 371921 173737 410500 172154
13502 448232 32423 333478 207007 -600 299639 -71148 -48867 244737 183857 1776 483550
13491 483550 399043 407532 -99518 568527 213997 28877 307412 231478 198664 140072 64055
13479 439529 315797 111727 272550 345776 258104 257920 313436 48273 332250 440000 15932
13467B99355M5668M3707A04403K8166K06215J05446k4840A25545l7290K17266
13457C05521j26005p5355O7597K98885m9922j30628e5700C08955g078C4206J32987
13446A67193J83660a4309B46412H7681K08947o7805J83550j2711n265p8981G3828
13434A10366Q9521K64573K387o5420j05238q2878H4360J79422j07794D1331J97013
13423B38344H0782n140K06479A12525R5633G4223L30874J23444A99240R997A5506
13411E15383A30398J61418o9527A08516l3530K2623K37518M0648J66432k27431
13401C14776j38676K03901F117d714A86897L48345A80812p7761h7777A65794p4795
13390I0999J96802J18957A89937a33876e3404B4883K65945A26369D1790J62428
$$ plain form
13467 299355 345023 388730 104403 132569 338784 444230 419390 125545 88255 305521
13457 305521 179516 104161 171758 470643 420721 290093 -55700 308955 -7078 34206 167193
13446 167193 350853 -14309 246412 87681 296628 228823 412373 399662 394397 315416 73828
13434 110366 199887 464460 466847 401427 296189 213311 84360 263782 155988 41331 238344
13423 238344 80782 75642 282121 112525 208158 74223 405097 528541 199240 209237 15506
13411 515383 130398 291816 222289 108516 74986 97609 335127 375775 542207 314776
13401 314776 176100 380001 6117 -4714 186897 535242 180812 103051 -87777 165794 90999
13390 90999 287801 406758 189937 -133876 -53404 24883 290828 126369 41790 204218
13380B04218J28018I365L4424O8237e3283A68257q3877N4876M694K85039j1323
13369D17666j15625j15520C0844K57425a59655B93227P6405l3605m0361j32502
13359A63164j0113O3777P1582D112K42947f7741F0975A7680R9450K16880J46271
13348D80281H1990K39805o5429j14907p872J60635N582Q4151j67171n6537G8205
13336A06798K63044o0900A11776P3900c016F065L4489O5437b0929C74892e891
13324D47325c530i9A36693J88709j28009J40572L4299j63098Q5056m6770k8102
13313B19350M4740e2559D38061j84041D4074O7884e4379I614K24998A9338c306
13301D5614a81364Q4711A34829b33477C65358j43845K48673B07868G2248J06573
$$ plain form
13380 204218 332236 9365 43789 112026 -53283 168257 84380 139256 143950 428989 417666
13369 417666 302041 186521 30844 288269 -159655 293227 369632 336027 295666 163164
13359 163164 153051 216828 288410 4112 247059 -67741 60975 17680 117130 334010 480281
13348 480281 81990 321795 256366 141459 133587 294222 299804 383955 216784 160247 78205
13336 106798 369842 308942 111776 185676 -3016 6065 40554 105991 -20929 374892 -5891
13324 447325 -3530 -99 136693 325402 197393 337965 372264 209166 294222 247452 219350
13313 219350 264090 -52559 438061 254020 44074 111958 -54379 9614 234612 19338 -3306
13301 45614 -181364 -96653 134829 -233477 365358 221513 470186 207868 72248 178821
13291A78821k1615J3702c4501B91021H5731J86231i7511A14744h6721A64573d7285
13279B33061I7723m4021e7640A25587J10753b15333a0680B29975M3167d1933C00045
13267A8201J62323J33199a96630B40467p0702R8829C3826e3285j69322f4540m9019
13256a13559B09380M382C2153K65657A4571J3963b93748B92319P9956A07736K9711
13245A37447c0753I2207k1743a4826D9693a48860A16876e9966A41422J57794A15239
13233E8866b04467B00608A4677d0821D79751A53217J19565A24589K91499b2412
13222a27795E7417K03483J43140j85185a53316B14627G2681M02376k30616p0792
13212A73649K70237H2120J77138j29611j9988L85F403P9476i0455A84167H592
$$ plain form
13291 178821 157206 170908 -34501 291021 85731 271962 -97511 114744 -86721 164573 -47285
13279 233061 97723 53702 -57640 125587 236340 -215333 -10680 229975 273142 -41933 300045
13267 18201 180524 313723 -196630 240467 169765 268594 33826 -53285 -222607 -64540 -113559
13256 -113559 209380 213762 32153 297810 14571 28534 -293748 292319 372275 107736 137447
13245 137447 -30753 92207 70464 -14826 49693 -148860 116876 -59966 141422 299216 115239
13233 58866 -204467 200608 14677 -40821 479751 153217 272782 124589 416088 -22412
13222 -127795 57417 260900 404040 218855 -153316 214627 72681 475057 244441 173649
13212 173649 443886 82120 259258 129647 109659 110044 6403 85879 -90455 184167 8592
13200A15129b22764a05085L1433G6247A0603i6256B35335p9945P2163o9861l8743
13189A18949j043C6679M13467A95609D6709a47178A37496E8708M09819B09703
13178B65648K09338A8236D989J18968E0656c5543B73803d8873m1115E2920b13080
13166A52133k0554k6527K5970c09026B86028g1282B96585A45057e3886H152L03001
13155C11153j45031e6839g519j8615A06423a19722A36078i4686B09480a59818
13144F856d9023j33095q1041J3605A47443l0259N0036a02639k1768M8355A68401
13132b10234g2244A26855c4869A95936a68858A83459b14246A59053n7819K60446
13122C61680d7927C09938O4801d9006r677k75276B36462l5604Q7829J1581A21469
$$ plain form
13200 115129 -222764 -105085 -73652 76247 10603 -96256 235335 155390 227553 157692 118949
13189 118949 117906 36679 450146 195609 46709 -147178 137496 58708 468527 209703
13178 265648 474986 18236 4989 123957 50656 -35543 273803 -48873 -89988 52920 -213080
13166 152133 131579 105052 131022 -309026 286028 -71282 296585 145057 -53886 8152 311153
13155 311153 166122 -56839 -7519 -26134 106423 -119722 136078 -94686 209480 -159818
13144 6856 -49023 -182118 -263159 -249554 147443 117184 167220 -102639 -124407 -76052 168401
13132 -210234 -72244 126855 -34869 195936 -168858 183459 -214246 159053 101234 361680
13122 361680 -47927 309938 374739 -49006 -58683 -333959 236462 200858 288687 300268 121469
13110A75962q4488C3229e6618G8939b00399I1355k8802N4024A0060g9067G9331
13098b17683E6128R3254o1572l1477a72573e7456I3132G859b46810A06959c1202
13086B16185r5457N2367O0099j15317a90572G3391N5623j7059c4520A88905D378
13074A16491A9054Q6143l6056J09309O8008J18972n9395Q0156A8039J46545a95010
13062I0541k3102K11600F4747K14599q402N9723A18342G761O4160J84281a5479
13050B2482b96619A4430b28337B53312b24978I8242b8033m3451A15092C378K63716
13039B67094k9524G0945K7066b4235r1615I222f6939r8991E3495a21878p8442
13028b00320h0208L9305A06259l8058i9161m302K8054A09143R5424a2407C8123
$$ plain form
13110 175962 91474 33229 -56618 78939 -200399 91355 62553 116577 10060 -79067 79331
13098 -217683 56128 149382 87810 56333 -172573 -57456 93132 7859 -246810 106959 -31202
13086 216185 120728 173095 233194 117877 -190572 73391 129014 111955 -34520 188905 4378
13074 116491 19054 105197 69141 178450 246458 365430 306035 386191 18039 164584 -195010
13062 90541 67439 279039 64747 279346 270944 330667 118342 7761 71921 256202 -15479
13050 22482 -296619 14430 -228337 253312 -224978 98242 -28033 -71484 115092 3378 267094
13039 267094 237570 70945 98011 -24235 -115850 9222 -66939 -165930 53495 -121878 -200320
13028 -200320 -80208 -40903 106259 68201 -99161 -103463 -75409 109143 204567 -12407 38123
13016b80453A15245b39146A82635e2718B57002i8331b2289o5059j7616l5529A20155
13004h6496j45647P390i6373H011K17254a11556c8319D62039C6926j1145P9108
12993A04889a08587A95600a06282B04132L4206j12006a07838C7490K3438d6746
12982a94898B779b02773C41198a19541A07172a25443A88592C2996a18648H8989
12971B71146c4360B20659J56386j76763E1577N180f6159A910Q3458N2309b53915
12959f8315k29011A51191O1745J26675j27503n9778b00421g0286A07171J03394
12949B10565K4656C3319J62703J1020q7127P826P5961c29525I6042b13037g6007
12937f0876J6697j76277C78048A13412d1176l02451A16619J82159h7291D44649
$$ plain form
13016 -280453 115245 -239146 182635 -52718 257002 -98331 -22289 -87348 -104964 -140493 120155
13004 -86496 -232143 -224753 -96373 8011 225265 -111556 -38319 462039 36926 25781 104889
12993 104889 -108587 195600 -106282 204132 238338 126332 -107838 37490 60928 -46746
12982 -194898 2779 -202773 341198 -119541 107172 -125443 188592 32996 -118648 88989
12971 271146 -34360 220659 377045 200282 51577 56757 -66159 1910 85368 137677 -253915
12959 -68315 -297326 151191 212936 339611 212108 152330 -200421 -70286 107171 210565
12949 210565 235221 33319 196022 207042 119915 127741 203702 -329525 96042 -213037 -76007
12937 -60876 -44179 -220456 378048 113412 -41176 -343627 116619 298778 -87291 444649
12926B14434b48150R2223B65084I1221K30115A58770k626g3788j20600A37138
12915c62009A0473a04431j17320b9240l4847l30845d7954D13767A36226g2784
12904b04279e2391p2842k12882A69508E2688e6329J5811B22122q0990a64626B79995
12892a76593C4971a70427P9656B15154a53932A54635l8464D7925J2106i9824B58286
12880D360b24929j04820I4348a70703O5067C6802J24992h8680q6682B04646a36942
12868b6296B67733a19048A82349N0469B4534M4309a33312B9601q412b87588D6978
12856A44236B1829b01542j42536a02589A98739J21283D7833a1914k80014g8471
12845A29658J64154h6750C15681c5453j49346A1901N2875j2499C79J78823a12356
$$ plain form
12926 214434 -248150 -155927 265084 91221 321336 158770 156144 -73788 -194388 137138
12915 -362009 10473 -104431 -221751 -29240 -64087 -394932 -47954 413767 136226 -72784
12904 -204279 -52391 -125233 -338115 169508 52688 -56329 -40518 222122 141132 -164626 279995
12892 -176593 34971 -170427 -90771 215154 -153932 154635 116171 47925 60031 -99824 258286
12880 4360 -224929 -329749 94348 -170703 -105636 36802 161794 -88680 -175362 204646 -136942
12868 -26296 267733 -119048 182349 232818 24534 68843 -133312 29601 21189 -287588 46978
12856 144236 21829 -201542 -344078 -102589 198739 320022 47833 -11914 -291928 -78471
12845 129658 293812 -86750 315681 -35453 -184799 11901 64776 52277 379 179202 -112356
12833B23514E8363h2556r8573B27645e0907D6751a75344b3633E6046c262j29233
12822a32495c2465k95925b5016q9783k16461a1734A02966Q1367b29133J11894
12812a17239H3875g0556A0905J65711b58003j13241A63021b90487A80309b36195
12801c3069D9084L58793b47483K9150A4994J75320p2958J3074a02938B62879c6341
12789B9948a53944B9146a72071A5774a45629d3291Q39j0950B5787d13543E096
12777I2432l0349L96794h2848B38025E56a46425A69275b36169G6454e1830o1112
12766a12942A89158c172j42367A96703O4064A2157c82270a72531a0442C00533
12755A91195f6017F561d21861I6249a96666G7760K3129C4411c75912a6615p4047
$$ plain form
12833 223514 58363 -82556 -181129 227645 -50907 46751 -175344 -23633 56046 -3262 -132495
12822 -132495 -32465 -328390 -25016 -114799 -331260 -11734 102966 184333 -229133 -117239
12812 -117239 83875 -70556 10905 176616 -258003 -371244 163021 -290487 180309 -236195
12801 -33069 49084 407877 -247483 -218333 14994 190314 117356 130430 -102938 262879 -36341
12789 29948 -153944 29146 -172071 15774 -145629 -43291 -42452 -53402 25787 -413543 5096
12777 92432 62083 458877 -82848 238025 556 -146425 169275 -236169 76454 -51830 -112942
12766 -112942 189158 -3172 -145539 196703 260767 12157 -382270 -172531 -10442 300533
12755 191195 -66017 6561 -421861 96249 -196666 77760 100889 34411 -375912 -16615 -90662
12744i0662a761k27927B02476B0547K89239a83989F0908J56508O5090c24134C14466
12732A08538b67491L2912A67745a80881k04408a27401A88918c3690B16615b9127
12721b67788A36217G549b7037m9596B44866a81064C37886A05891k5349c15784
12710A14208D2730L0990J2655Q0106A6116g1893A25754b14622A86722a1293A45667
12698A5156c4211j65800d5732D42594A7100Oa55555H1533d5112B42998b80981
12686G1062P432b13329f437A78475K2452C6174a16140m4647A37305f8441C2432
12674B6885J5285R468f949A51689n5592l9773c03211j9516A41857k0152d2677
12662b42109d1271B2389a13889B27590b16337E3102N1991M7406j7647f325j20471
$$ plain form
12744 -90662 -1761 -229688 202476 20547 309786 -183989 60908 217416 282506 -324134 314466
12732 108538 -267491 -234579 167745 -180881 -385289 -127401 188918 -33690 216615 -29127
12721 -267788 136217 7549 -27037 -76633 244866 -181064 337886 105891 80542 -315784
12710 114208 42730 73720 86375 166481 16116 -71893 125754 -214622 186722 -11293 145667
12698 15156 -34211 -200011 -45732 442594 17100 17106 -155555 81533 -45112 242998 -280981
12686 71062 78494 -213329 -6437 178475 200927 36174 -116140 -160787 137305 -68441 32432
12674 26885 42170 51638 -6949 151689 96097 56324 -303211 -322727 141857 121705 -42677
12662 -242109 -41271 22389 -113889 227590 -216337 53102 105093 152499 134852 -6325 -126796
12651a26796N3100B10509G3242J7337b3218A51590h9512a8819n3067G8457C2940
12639A84545N187p2466b53350m3150c4827B23803J9699c4061K606D8769M81975
12628E30744B32539a93618A67893n9782C2301J5082L5059R1339G8624R3714i2095
12616b39717c1477m4228C68962F2242i1779c2443Q770j21197o2857a5238j17634
12605a32872A9018a66206P4745j1196D34198a78116B16749A95e4490B98813P3050
12594C71863h7189A23028C701R3715B5067K6353J60109a04096A15412K44583c56831
12582C3577K42124A01277b46130C78963A59940a9976A02580h4510n6390D3161
12571h6001I75b0015j8383A18227C2558O2940D4315P2824k2073b27957q4750A03956
$$ plain form
12651 -126796 -73696 210509 73242 90579 -23218 151590 -89512 -18819 -71886 78457 32940
12639 184545 189732 117266 -253350 -296500 -34827 223803 243502 -34061 -31455 48769 530744
12628 530744 232539 -193618 167893 108111 32301 47383 82442 173781 78624 172338 -92095
12616 -239717 -31477 -75705 368962 62242 -91779 -32443 -23673 -144870 -207727 -15238 -132872
12605 -132872 19018 -166206 -91461 -102657 434198 -178116 216749 195 -54490 298813 371863
12594 371863 -87189 123028 3701 97416 25067 51420 211529 -104096 115412 359995 -356831
12582 33577 275701 101277 -246130 378963 159940 -19976 102580 -84510 -140900 43161
12571 -86001 975 -20015 -38398 118227 32558 95498 44315 117139 95066 -227957 -312707 103956
12558A10528e3067k89652I11a42626A26177b25072O7025H766A76J35688a16645
12546d4066j8970A83775a5806k9145j71450D3517e1787l9368c9569l0802q9237
12535a59608q3529A50638Q9041G5472O6096b79688h1564I9461d1897E531a05917
12523A66847h0306H1154J59822f6501o8496E2651a03017B35264d883B52274g3875
12511I3486A4272J34705d7680j34565I2665m0643M38810b00623A39561a49398
12500A84666e1225L507J6069j76626P4015j1840j53245B161R9984a75331f1107
12488d0261r6491p4339B93510A01695R1419o5914J2156l4082k0860j0437a44451
12476A18263i7665j90291C28758f6110r0974A43905e3473l7615F68413A1144J19876
$$ plain form
12558 110528 -53067 -342719 911 -142626 126177 -225072 -158047 8766 176 135864 -116645
12546 -44066 -63036 183775 -15806 -44951 -216401 43517 -51787 -91155 -39569 -70371 -159608
12535 -159608 -243137 150638 239679 75472 141568 -279688 -81564 99461 -41897 5531 -105917
12523 166847 -80306 81154 240976 -66501 -134997 52651 -103017 235264 -4883 252274 -73875
12511 93486 14272 148977 -47680 -182245 92665 52022 490832 -200623 139561 -149398
12500 184666 -51225 -47718 -31649 -208275 -134260 -146100 -299345 2161 102145 -175331 -61107
12488 -40261 -136752 -211091 293510 101695 193114 127200 139356 105274 84414 73977 -144451
12476 118263 -97665 -287956 328758 -66110 -157084 143905 -53473 -91088 668413 11144 131020
12465A31020a70474j9959k0586D89M72542a13555A29911A3557O5659L22419b36562
12453B768K44504A15085q449J39395c63834a74437l057g4722C4200J71006M8516
12442B53722A8870K04005B9562J55675f0261A03293C3700f2115E950N5428K90218
12431C51596C9796a72373Q5662C528O9758K2382a5254m6606A19410a05055M8786
12420e6269H6670b33521n8954e4751n103G4893h170A45383p0484C6527e4533k25923
12408b80456M3650C06147d7098A91858d0366H2319l3876b0822A0257h2904k0245
12397a03149A5519d607j56592f0897n1322H5248a47457A28554M9740j5224F032
12385a99345A04894J04498a47566a8776F1741j0545J00632L22050j63407j48872
$$ plain form
12465 131020 -170474 -190433 -211019 489 473031 -113555 129911 13557 79216 401635 -236562
12453 2768 247272 115085 106636 246031 -363834 -174437 -177494 -74722 34200 205206 253722
12442 253722 18870 222875 29562 185237 -60261 103293 33700 -62115 5950 61378 351596
12431 351596 39796 -172373 -86711 3528 73286 95668 -15254 -61860 119410 -105055 -56269
12420 -56269 86670 -233521 -292475 -54751 -59854 74893 -8170 145383 74899 36527 -54533 -280456
12408 -280456 -236806 306147 -47098 191858 -40366 82319 48443 -20822 10257 -82904 -103149
12397 -103149 15519 -4607 -161199 -60897 -112219 85248 -147457 128554 178294 163070 6032
12385 -199345 104894 209392 -147566 -18776 61741 51196 151828 473878 310471 161599
12375A61599m8737N3167j7715K17746A45105M1488J14406g332B3484K82870a21672
12363a2503A10063m4200F770a3959j43185B8864c49353i0497C82197J53796a57793
12351b6649A57602R240a90067A36670o8104a4537C8108N51013A63992f8328G8289
12339A69392J5319H7983C4174g4992A47569N4271L10640B41705A09440P6031p2045
12328A13426J09621K75579I9694K26433G3974N509J27953K56057a6041E9591K31263
12317B90854Q1940j32302j00187a32088F5001b6842G0035J94378D5793J14368
12307A60161J6378E7478K35566a42378A94104q5988P9199c29008C3765Q5586l9805
12296G9546L1917a278E3025L0338J4476D0512K38908j5087j06387l4445J28860
$$ plain form
12375 161599 112862 166029 148314 366060 145105 186593 300999 -7332 23484 306354 -121672
12363 -12503 110063 65863 6770 -13959 -157144 28864 -349353 -90497 382197 535993 -157793
12351 -26649 157602 166842 -190067 136670 68566 -14537 38108 589121 163992 -68328 78289
12339 169392 184711 87983 34174 -74992 147569 201840 512480 241705 109440 185471 113426
12328 113426 223047 498626 99694 326127 73974 79483 207436 463493 -16041 59591 290854
12317 290854 372794 240492 140305 -132088 65001 -26842 70035 264413 45793 160161
12307 160161 176539 57478 293044 -142378 194104 108116 187315 -329008 33765 119351 79546
12296 79546 111463 -1278 53025 83363 97839 40512 279420 264333 157946 123501 252361
12285B52361p4543B1937K72519b57657A28118f1090a3021r9787F5665J58728a8426
12273H4347a3769A58781D9364g4142C819J06978O1941a8048A64562a31150B83501
12261a3036I4481G231N4881b53804l8396J2396e7798k56A23462J09713c4399j26880
12249a61279a5759B379a12834C03372h4629b3668k9905B8655p012b43159B74827
12237B48840n6352a44653j94P1975B53698A06820a3254D80655F3929J69447O5530
12226B98906J747j29484H0700J48958K9274J40805a915A82251n6745J82848j47236
12215A61118M25675a29781A3592L5042a09761G7879J52883L8707b00701A48013
12204A43177D6902M39137A98683H9710J2041j0834b1443H4602k5975K24239H718
$$ plain form
12285 252361 177818 21937 294456 -257657 128118 -61090 -13021 -112808 65665 224393 -18426
12273 84347 -13769 158781 49364 -74142 3819 110797 172738 -18048 164562 -131150 283501
12261 -13036 94481 7231 62112 -253804 -292200 -279804 -57798 -58054 123462 233175 -34399 -161279
12249 -161279 -15759 2379 -112834 303372 -84629 -23668 -53573 28655 21643 -243159 274827
12237 248840 192488 -144653 -144847 -72872 253698 106820 -13254 480655 63929 233376 298906
12226 298906 300653 171169 80700 229658 258932 399737 -1915 182251 125506 308354 161118
12215 161118 586793 -129781 13592 48634 -109761 77879 230762 269469 -200701 148013
12204 143177 46902 486039 198683 89710 101751 90917 -21443 84602 58627 282866 8718
12192B27603P9146K54187F5328J28175k376L49073A63776K40111K87250l04358
12182C86779A27567j4579J87316I5397K26394r4120L50226A26946J38094J8201
12172B83241p1012J83398F8777K18535J9626J07845p3271J38266J57525A18433
12161D22776a46954A37094A3453J93948K23844A3383a02256C80734I106Q7427
12151I6533k1032g3822B0650i4803I2438J3652j0799a7841A47215C5265E533c2965
12138C63727j39213O2197h163j60810C22594e1610C76036A15656m7454N0613a45395
12126A48982K36838A50404F6248J88134C8912K37525K91590k65606d1236C94319
12115B60728P8026J30716F2824K06427K03219m4547k10604q3000P6327K45112
$$ plain form
12192 227603 306749 560936 65328 193503 191127 540200 163776 403887 691137 386779
12182 386779 127567 112988 300304 95397 321791 227671 577897 126946 265040 283241
12172 283241 212229 395627 68777 287312 306938 414783 341512 479778 637303 118433
12161 422776 -146954 137094 13453 207401 431245 13383 -102256 380734 9106 96533
12151 96533 75501 -73822 20650 -94803 92438 106090 95291 -17841 147215 35265 5533 -32965
12138 363727 224514 286711 -8163 -168973 322594 -51610 376036 115656 68202 118815 -145395
12126 148982 385820 150404 66248 254382 38912 276437 568027 302421 -41236 394319
12115 260728 338754 469470 62824 269251 472470 427923 217319 134319 210646 455758
12105D55758a70569M7638A21231J68393D2303K25375J8948J8653A37514K356b09309
12093I6468L05213b06915I8142a62945d9847j69884H6267K14086B6917a2610j05761
12082a18371a7088C49826b8650B5002J99275j08317h0625K5726A98385G7186e562
12070F8311P7118m4269N7463L5006J37609K9309o6193g605A37703K97938A02414
12058h7571K2987C39866a00978L5673C3286a80168m2542F2197N5945J42188A26343
12046e5015C51668A03906K35150a75147G3634J78704A01172h8666B9949a40078
12035c4713k30093E2161C304b7965j46438l279l0271B86845a65712b7883G6724
12023a4703r6223j10563A55542b64889b6532j69574f8270J4209k41034g8488m2079
$$ plain form
12105 455758 -170569 -122931 121231 289624 42303 267678 286626 305279 137514 139870 -209309
12093 96468 401681 -206915 98142 -162945 -49847 -219731 86267 300353 26917 -12610 -118371
12082 -118371 -17088 349826 -28650 25002 224277 115960 -80625 -54899 198385 77186 -5562
12070 68311 145429 101160 158623 193629 331238 360547 294354 -7605 137703 435641 102414
12058 -87571 -64584 339866 -100978 -65305 33286 -180168 -222710 62197 118142 260330 126343
12046 -55015 351668 103906 339056 -175147 73634 252338 101172 -88666 29949 -140078
12035 -34713 -264806 52161 3304 -27965 -174403 -177682 -207953 286845 -165712 -27883 76724
12023 -14703 -110926 -221489 155542 -264889 -26532 -196106 -68270 -54061 -295095 -78488 -120567
12012a20567K7338E8492M9579J58339L5735I6520Q0439c01794d4018n3896j28270
12001b26184a03960L8683j41415C65974E3012c10849d674G9927a28228G4827a39554
11989D9044A4609e0146k6142C02639C1067c07849a3911D87126a6862G3477N0979
11978A24456K20592j43435I7323h4915A51559C0932J19899F9616O5998M9804A6133
11966A8996a74220J5230j42998C54343G9563e4719A31340N6699a6168D10358h6905
11954E3860a15134n720l10676a61320A38294b8997B2949J80532c53623A22733
11943B15641b8604D9745c63704A71872a16149l26132a28448l4676l400I7771a5993
11931i241j49021A44161a41197p6690P5462G256J16565B2777J03246O3748b66713
$$ plain form
12012 -120567 -93229 58492 108071 266410 302145 96520 176959 -301794 -44018 -97914 -226184
12001 -226184 -103960 -65277 -206692 365974 53012 -310849 -4674 79927 -128228 74827 -139554
11989 49044 14609 -50146 -76288 302639 31067 -307849 -13911 487126 -16862 73477 124456
11978 124456 345048 201613 97323 -84915 151559 30932 150831 69616 135614 185418 16133
11966 18996 -174220 -158990 -301988 354343 79563 -54719 131340 188039 -16168 410358 -86905
11954 53860 -115134 -120854 -431530 -161320 138294 -28997 22949 203481 -353623 122733
11943 215641 -28604 49745 -363704 171872 -116149 -442281 -128448 -163124 -166524 97771 -15993
11931 -9241 -158262 144161 -141197 -217887 -142425 7256 123821 22777 126023 189771 -266713
11919A61112Q9532b8210m694r8920k3948M3387B6294g0147j4334k74983E1445
11907a05385j03038B13257G1834k5894b76805G6096L4914b63255A2747J87569
11897B00316A8782c4746A72486d18001A39980a18266k16996C95794b41284A37664
11886h2206j77904E4827K50658a99240G9321a21721n9401Q6743B31538r5514E6899
11874F8632a77558j82485B23558o8331E9727a26048C15925E1144a65065n4232
11864b19297A14520a89162K9865P320j08480f3672j60822I5789c2755C04501F3571
11852c10118c7579l25457b7669k67571Q3562j72704B8941J45058a45364n9076
11842b04440B08268G7179a48206l3723g1152a7846G3368c11875f6891j26845A32882
$$ plain form
11919 161112 250644 -28210 -32904 -131824 -155772 -112385 26294 -70147 -84481 -359464 51445
11907 -105385 -208423 213257 71834 45940 -276805 76096 111010 -263255 12747 200316
11897 200316 18782 -34746 172486 -418001 139980 -118266 -335262 395794 -241284 137664
11886 -82206 -260110 54827 305485 -199240 79321 -121721 -181122 -94379 231538 136024 56899
11874 68632 -177558 -360043 223558 155227 59727 -126048 315925 51144 -165065 -219297
11864 -219297 114520 -189162 -159297 -151977 -260457 -63672 -224494 95789 -32755 304501 63571
11852 -310118 -37579 -363036 -27669 -295240 -211678 -384382 28941 173999 -145364 -204440
11842 -204440 208268 77179 -148206 -181929 -71152 -17846 73368 -311875 -66891 -193736 132882
11830A54114o5896P833m2398b4503k15156P0377I0775b7033B02441n5809B6996
11818c05895d891o7982n684o6210A2699Q3297a20134L3342q1073e1718r9748B59008
11805A05552a82331H3120a43803C0429m487J53535F2017k7388g781k10450n7641
11794b75872P471L1470B16857b81529a30575j6279B15421F079g773j94318j234
11783b03325k9049A01136b81528f9118B83277d7016j97023A14389d4997g833E7869
11771a71496q9236a22105a2254k57321a22032E542b40436Q7385C7764b04563D3193
11759a98094B7065b26229A60172l377Q7788a52935k25286A08587g1841A53904
11748a80177I4520c76627a76383B08417b69335Q7876h1726c4004r4908A17116
$$ plain form
11830 154114 88218 96051 53653 -24503 -239659 -169282 90775 -27033 202441 146632 26996
11818 -305895 -4891 -72873 -78557 -144767 12699 95996 -120134 -86792 -167865 -51718 -151466 259008
11805 105552 -182331 83120 -143803 30429 25942 179477 62017 34629 -7781 -218231 -275872
11794 -275872 -268401 -236931 216857 -281529 -130575 -146854 215421 6079 -7773 -202091 -203325
11783 -203325 -232374 101136 -281528 -69118 283277 -47016 -244039 114389 -44997 -7833 57869
11771 -171496 -260732 -122105 -12254 -269575 -122032 5542 -240436 -153051 37764 -204563 43193
11759 -198094 27065 -226229 160172 156795 244583 -152935 -378221 108587 -71841 153904
11748 -180177 94520 -376627 -176383 208417 -269335 -181459 -81726 -34004 -128912 117116
11737h5182k38804C76b62586C9297P6900D0355e17466a49697H3778a28416L7666
11726i0750B3173I064a86252k6538A01195i6164L9274q049m5504C701k33G11a06915
11712B38856H2507J51010C6865a88247j5736A80239c8232A72685a80555n7498
11702b38053j44964h8241A56792k4357g1115A99346p1011a31954j6389k65814
11692d14157C45174A8366b19693i7746A06138b29135i642H1348a70828Q532j52053
11681c14349a7358l8573k04607a5013C32848o0233R9187c50905l1824e5914A10299
11669E2430A423e5655A27429g4444J9420J7469k4765m9530B47306e5117j12395
11658a67512g8566k22789c2878j37003q6299J20612a658k49199B16677E1642J3530
$$ plain form
11737 -85182 -323986 376 -262586 39297 116197 40355 -517466 -149697 83778 -128416 -90750
11726 -90750 23173 9064 -186252 -212790 101195 -96164 -56890 -64939 -110443 3701 3468 711 -106915
11712 238856 82507 233517 36865 -188247 -203983 180239 -38232 172685 -180555 -238053
11702 -238053 -383017 -88241 156792 132435 -71115 199346 128335 -131954 -148343 -414157
11692 -414157 345174 18366 -219693 -97746 106138 -229135 -9642 81348 -170828 -162296 -314349
11681 -314349 -17358 -55931 -260538 -15013 332848 272615 371802 -350905 -382729 -55914 110299
11669 52430 1423 -55655 127429 -74444 -55024 -37555 -62320 -111850 247306 -55117 -167512
11658 -167512 -78566 -301355 -32878 -169881 -256180 -135568 -1658 -250857 216677 51642 65172
11647F5172b1626k25565C14994a88609A2069J67863a0828B10388a28468j54047
11637b82515D719b37061A39807j33m46C0306K6338O9968c72288A43048b66937
11625a20022N9553P972K5135k54501G6899i1986K2629J9316A87680a16747q3706
11614b00453q0585H5177a1088q3364a0676j5827A04550B6378L5983f2904B01001
11602H5425h3981j02604F1361k2245N6612C9348h7010B5848b11165B4231a75161
11590d1741B60357c26015a7768A31938K46568G8013c1562D2869k1316c08771a12151
11578a27893I0757J18175B3923L3326L3455c9394D6514h3649b5860A86889b93113
11566b01533O8724C1518i7788B38540m017a0638B0504q899g5417n4367d4866a990
$$ plain form
11647 65172 -21626 -247191 314994 -188609 12069 179932 -10828 210388 -128468 -282515
11637 -282515 4719 -237061 139807 139674 139228 30306 56644 126612 -372288 143048 -266937
11625 -120022 -60469 -52497 -27362 -281863 76899 -91986 -69357 -50041 187680 -116747 -200453
11614 -200453 -281038 85177 -11088 -94452 -10676 -26503 104550 26378 62361 -62904 201001
11602 85425 -83981 -186585 61361 39116 95728 39348 -87010 25848 -211165 24231 -175161
11590 -41741 260357 -326015 -17768 131938 378506 78013 -31562 42869 21553 -308771 -112151
11578 -127893 90757 208932 23923 57249 90704 -39394 46514 -83649 -25860 186889 -293113
11566 -201533 -132809 31518 -97788 238540 234523 -10638 20504 11605 -75417 -129784 -44866 -1990
11553B83664b0265D4493Q0037P3684q832b45499i3837j3759j54889J739J30051
11542a30695F7685b4754F6436e1743A12869O9131a27969A87825f7581B37000J0765
11531B47765a42285B7352L5307d214o4289A19367L1047b24125B49007D205K29897
11520B34102g3961p8033F9254b0104B19337g594A78683g5517G78K18599a20163
11508A0285J94050q5448c6241I6190e8866F1792J11907E7356b33083A40112h5490
11496C64649j68029i0159p0039A78679p3499f2507D27010b2684A18784k9447J45588
11485B34925p0008c57427A819a2173A63871a53589B4071L060b11822N4413p7051
11474b34460A54054o6556H851d3254j72556A9934M8707J06297J21943J11159h4659
$$ plain form
11553 283664 -20265 44493 124530 198214 189382 -245499 -93837 -107596 -262485 -260746 -130695
11542 -130695 67685 -24754 66436 -51743 112869 182000 -127969 187825 -67581 237000 247765
11531 247765 -142285 27352 62659 -4214 -68503 119367 150414 -224125 249007 4205 234102
11520 234102 -73961 -151994 69254 -20104 219337 -7594 178683 -75517 778 219377 -120163
11508 10285 204335 118887 -36241 96190 -58866 61792 173699 57356 -233083 140112 -85490
11496 364649 196620 -90159 -160198 178679 105180 -62507 427010 -22684 118784 89337 234925
11485 234925 164917 -357427 1819 -12173 163871 -153589 24071 27131 -211822 -157409 -234460
11474 -234460 154054 87498 8851 -43254 -215810 19934 68641 174938 296881 408040 -84659
11462F4480L39560p9819H6133a22115B72568I116a23838C4550B035J32365E8993
11450A53275A426L40238A42254a84287J3199A63758G6813g206j52379E8009a46622
11438a01148H237c19631G123J64088b00529F8205d13626A28941E8228O4895a60840
11426a58518B40697d8376k14621E6089R0211M1735H387b29176i2188K7234j33842
11415a98796O9076d7443A46151p1256J35042E448J32868c0714A30366i1507O573
11404h4934q9439F5079d57266J257a33154B324J51428D1230J80975D8629K35618
11393B84247E6782A4968O0515a95459j37039c3074j79729A09774a61664n487B06367
11381A51866A3959b8022n2261j69812n7363C09917H6493B1394b78080A9149J55079
$$ plain form
11462 64480 404040 324221 86133 -122115 272568 9116 -123838 34550 2035 134400 58993
11450 153275 1426 341664 142254 -184287 -171088 163758 76813 -7206 -159585 58009 -146622
11438 -101148 8237 -319631 7123 171211 -200529 68205 -413626 128941 58228 123123 -160840
11426 -158518 240697 -48376 -262997 56089 146300 188035 8387 -229176 -92188 -64954 -198796
11415 -198796 -129720 -47443 146151 74895 209937 5448 138316 -30714 130366 -91507 -84934
11404 -84934 -174373 65079 -457266 -456009 -133154 2324 153752 41230 222205 48629 284247
11393 284247 56782 14968 75483 -195459 -332498 -33074 -212803 109774 -161664 -167151 206367
11381 151866 13959 -28022 -80283 -250095 -307458 309917 86493 21394 -278080 19149 174228
11370A74228a9205l3795A69373f18871a32421l3490h0710A35945a75033F2531
11359B30717a58651D6365J16893d4790j04544N9606C23433B4429m631K7163a64899
11347b41382e1359j45338A03934a25597G9816a30863N3891k60520b1185q2830
11337a04015k06073b462n9122A66067l4279N6979q0023l6133c77430J39678B54689
11325c85995C3715M0143k6070J08608a00594d8949F4964a41506l6836C84477H809
11313i8684k1695i88A72578A4123a02041B40316c99706B35165C5527a3912l7359
11302e1271l61226G1675J47692f2662j53042j7500E8340e1341j90801J15017D7398
11290b45770E4345a60869H8557a07706A7042d5817j37511l9421E0956h97j24915
$$ plain form
11370 174228 -19205 -53000 169373 -618871 -132421 -165911 -80710 135945 -175033 62531
11359 230717 -158651 46365 163258 -44790 -149334 -89728 323433 24429 19798 46961 -164899
11347 -241382 -51359 -196697 103934 -125597 79816 -130863 -76972 -337492 -21185 -104015
11337 -104015 -310088 -2462 -61584 166067 131788 188767 108744 72611 -377430 -237752 254689
11325 -385995 33715 73858 47788 156396 -100594 -48949 64964 -141506 -178342 384477 8809
11313 -98684 -120379 -988 172578 14123 -102041 240316 -399706 235165 35527 -13912 -51271
11302 -51271 -412497 71675 219367 -62662 -215704 -233204 58340 -51341 -242142 -127125 47398
11290 -245770 54345 -160869 88557 -107706 17042 -45817 -183328 -222749 50956 -897 -125812
11279a25812l00264A6754L29523D8275a30161j61005j01268a52259q7042A04714
11268A08721C8804J34693a9462G2354g8216A7041a6424A87551b8645o0931K1331
11257f8245B67924d2524B8917J0983d5192E7829d7661n7470B2791L65580a14867
11245H6105l398d5583n4518K0142J2097j05322B00061b58626J06357k83877a79092
11233b43125C24924a10081C1658J59827g4721m7175A02669F674c29526J8295J47276
11222a63955L7284L3936D5503a61739i929j58478a1479j60165h1528g678A90307
11210a32084m0929A73758H5i3826I1892a0740l61951a8915k9794j2897k9991M3774
11198d7823l34042A27152b10244R3488I1161e9229q1328O8652A05871J15845a90936
$$ plain form
11279 -125812 -426076 16754 346277 48275 -130161 -291166 -392434 -152259 -239301 104714
11268 108721 38804 173497 -19462 72354 -78216 17041 -16424 187551 -28645 -89576 -68245
11257 -68245 267924 -42524 28917 39900 -45192 57829 -47661 -105131 22791 388371 -114867
11245 86105 82707 -45583 -100101 -79959 -67862 -173184 200061 -258626 -152269 -436146 -179092
11233 -243125 324924 -110081 31658 191485 -74721 -121896 102669 6674 -329526 -311231 -163955
11222 -163955 -126671 -92735 45503 -161739 -9929 -168407 -11479 -171644 -81528 -7678 190307
11210 -132084 -173013 173758 85 -93826 91892 -10740 -372691 -18915 -48709 -61606 -91597 -47823
11198 -47823 -381865 127152 -210244 -116756 91161 -59229 -140557 -71905 105871 221716 -190936
11186b69521B8423a17089G265J97966b02933j95461A5333b20465d666B17709c97813
11174g156k8620j40627C7752c18510a21732k9348E0166e03339R0431c4567E1305
11162a34320G0469K03220a89056j32236A33317h6005L8842C1169a15351I572L2581
11151D2153b01234B28687c82743A39095l481b07396A28697J721b18232A0054J31013
11140A41067c82313I878b18499g1580C53604A24996D3841j2308K8601b9569B10933
11128a30111p0564l1997G738J78762q8928J86891n4283C5730L9336K43482E8644
11116C26153h6782D4296b5470j66927R2634o785j4499m464A15207b27331J1938
11105b15393h7435C19144A49692L5459j0618J56928A63818j6357i2953F8272J52562
$$ plain form
11186 -269521 28423 -117089 7265 205231 -202933 -398394 15333 -220465 -4666 217709 -397813
11174 -7156 -35776 -176403 37752 -318510 -121732 -151080 50166 -503339 -412908 -34567 51305
11162 -134320 70469 273689 -189056 -321292 133317 -86005 -47163 31169 -115351 9572 42153
11151 42153 -201234 228687 -382743 139095 135614 -207396 128697 130418 -218232 10054 141067
11140 141067 -382313 9878 -218499 -71580 353604 124996 43841 31533 60134 -29569 210933
11128 -130111 -200675 -232672 7738 186500 97572 284463 230180 35730 75066 318548 58644
11116 326153 -86782 44296 -25470 -192397 -99763 -106548 -121047 -125511 115207 -227331 -215393
11105 -215393 -87435 319144 149692 185151 174533 331461 163818 147461 -92953 68272 220834
11094B20834M1966J71960a55679j93517C37955I7168l5541K66928r4536D5815
11083C573J98537n1308J22744N3047J17201B15966K32207C9790j6401b319A57680
11071E723K34899j07337b2455A3087P4026g3218g55A49419J29528j10616O1082
11060B29413j10366Q5392j01030N31060k39280j09707Q191q2973N15225k73586
11050D52339B09867L46939p5019j77299L221L02570k87273L79198C30536K7461
11040C57997M38003l78306K86080j80078k37408L8821P08388A41021N33318j30654
11030E43685R25L52072C11770p383K86206J35214l41216J60160L59776C45521
11019F48640k02388o910J6900A45869L05221j12454j35463K33397k13926K14524
$$ plain form
11094 220834 262800 434760 -155679 -349196 337955 97168 61627 328555 234019 45815
11083 3573 202110 150802 273546 326593 443794 215966 448173 39790 23389 -2319 157680
11071 5723 240622 133285 -22455 13087 87113 -73218 -755 149419 278947 168331 229413
11060 229413 119047 204439 103409 634469 395189 285482 293673 210700 725925 452339
11050 452339 209867 556806 481787 304488 307709 610279 323006 702204 330536 357997
11040 357997 796000 417694 703774 523696 286288 325109 1033497 141021 674339 543685
11030 543685 544610 896682 311770 304387 590593 725807 384591 544751 904527 345521
11019 648640 446252 439342 456242 145869 451090 338636 203173 436570 222644 437168
11009D37168j98855O15004j14389k84064B05224l1927J64086K02373P4880j86218
10999D28418J16678B50602J44940L2949D9763N22653n5663K8674B67241J74306
10989D41547j0892P1060J23964k65723M43058k72040p2248M2450J6534k9500O28209
10978A116419k76242J05847q7331j76445L82654J09065k15201M02979O454Q3698
10968A451897N92268m9878P3345j69769J90031K37653l45669K03487m34814n97747
10958A150804P6961j80337k22849K82493l58807j34736L43488j25480j23118J29937
10948H38356j76971q7946k25996J53546A07784K98466n1498B1682N3838i4693
10937A68183p0130c768C02833j37287a52209B09209b9436B60492B3727e2704I8044
$$ plain form
11009 437168 238313 853317 738928 454864 205224 173297 337383 539756 614636 428418
10999 428418 545096 250602 395542 428491 49763 572416 516753 545427 267241 441547
10989 441547 430655 501715 625679 359956 803014 530974 458726 501176 517710 488210 1116419
10978 1116419 840177 946024 858693 682248 1064902 1173967 958766 1361745 1368199 1451897
10968 1451897 2044165 1994287 2067632 1897863 2087894 2325547 1979878 2183365 1748551 1150804
10958 1150804 1227765 1047428 824579 1107072 748265 613529 957017 831537 708419 838356
10948 838356 661385 573439 347443 500989 107784 406250 354752 21682 75520 -94693
10937 168183 98053 -3768 302833 165546 -152209 209209 -29436 260492 23727 -52704 98044
10925a38410G2735a674G4918l1392a58893A55131a94043E1787N9171a84268q87
10914a85155K7394F0905M6690b78498J27199j52314J29741A70627a94525A06783
10903b4413m5576j08285j51283b4578A35747E7677a79635J9121e968k18904R4588
10892a30284M8341k82541A372M5650K3484j6685h8476j64109A0366J73071F1743
10880A16642J14730f1759A60935i671j60902M4769e1304l33306A30237O9365c20852
10868h6051j2772o3951P2471B24949g3074L0265j72971G3652b35380e3366H5557
10856B96663b78034J05983g2576r512k09959I6317K8561J72186G3560J55545D5841
10844g6761k16577F1670i5433k30118a20237A09740N0132a48911n541f1451l6986
$$ plain form
10925 -138410 72735 -1674 74918 43526 -158893 155131 -194043 51787 110958 -184268 -185155
10914 -185155 -157761 60905 107595 -278498 -151299 -303613 -173872 170627 -194525 106783
10903 -24413 -69989 -178274 -329557 -24578 135747 57677 -179635 -160514 -5968 -224872 -130284
10892 -130284 -81943 -364484 1372 47022 70506 53821 -88476 -252585 10366 183437 61743
10880 116642 231372 -61759 160935 -9671 -170573 -125804 -51304 -384610 130237 199602 -320852
10868 -86051 -98823 -162774 -90303 224949 -73074 -42809 -215780 73652 -235380 -53366 85557
10856 296663 -278034 -172051 -72576 -82088 -292047 96317 124878 297064 73560 229105 45841
10844 -76761 -293338 61670 -95433 -325551 -120237 109740 159872 -148911 -154452 -61451 -98437
10833i8437C03070G746c0260B64661A01065a98909I0219B156O2568a53275F438
10821a54662a6443j31445A93792b52722H1365J656a18628k1825c3120B3971a77185
10809a1159c54l10438C8839a85707p2103C04036a94098g7510r0751j08009N4706
10798b21564c4683n8621j73535A5690J8648d0528k65440G8038a43072a0061j12147
10787a22208N5200B04618d4822j37860I4061c7323A86259E2202a97978j29620
10777c27598B8692e7103j05678E8288a89103C40213i9931b3988B79544G6793f0041
10765a02238K7182m0173A49010D3074b32238C16883C8608M5723L5776L3154d1534
10753A61850b12080C7382a02951B96396d0213J5962k93970A98486a03650C1084
$$ plain form
10833 -98437 303070 7746 -30260 264661 101065 -198909 90219 2156 64724 -153275 6438
10821 -154662 -16443 -147888 193792 -252722 81365 83021 -118628 -140453 -33120 23971 -177185
10809 -11159 -354 -310792 38839 -185707 -257810 304036 -194098 -77510 -168261 -276270 -221564
10798 -221564 -34683 -93304 -266839 15690 34338 -40528 -305968 78038 -143072 -10061 -122208
10787 -122208 -67008 204618 -44822 -182682 94061 -37323 186259 52202 -197978 -327598
10777 -327598 28692 -57103 -162781 58288 -189103 340213 -99931 -23988 279544 76793 -60041
10765 -102238 -75056 -115229 149010 43074 -232238 316883 38608 84331 120107 153261 -41534
10753 161850 -212080 37382 -102951 296396 -40213 -24251 -318221 198486 -103650 31084
10742a52452h987D6287b34100f2994j75185a07849A19276b85726c4144j22228
10732a56372j7053B20645b84819B70988G2937a66466j03714o713J03343k2744
10722a96294j15782r3773A80709b825A44789J76945b03535g3103e355j53649M9603
10711a09401o2521k6594m8173I2406e56596F6614b19714C57505C7400e7361b4111
10699A61826G8895b2491q8181l2206J697q1788p882k7067i5316j84319B6572L12647
10687C39219b31091J03277K39B00982A9438a41271j05352Q6314D3613b20674m6318
10676b66992N6888M7092B7758a39139f2383l38190b3852f629j62218A1175a87520
10664D3868d1236p175A61681o7388h0837R202K393B13057a41164A50387i0739
$$ plain form
10742 -152452 -8987 46287 -234100 -62994 -238179 -107849 119276 -285726 -34144 -156372
10732 -156372 -173425 220645 -284819 270988 72937 -166466 -270180 -276893 -173550 -196294
10722 -196294 -312076 -405849 180709 -2825 144789 321734 -203535 -73103 -5355 -159004 -109401
10711 -109401 -171922 -198516 -246689 92406 -556596 66614 -219714 357505 37400 -57361 -24111
10699 161826 78895 -22491 -110672 -142878 -141181 -222969 -230851 -257918 -95316 -279635 26572 339219
10687 339219 -231091 -127814 -127575 200982 19438 -141271 -246623 -160309 43613 -220674 -266992
10676 -266992 -210104 -163012 27758 -139139 -62383 -400573 -23852 -6629 -168847 11175 -187520
10664 43868 -41236 -48411 161681 94293 -80837 -71635 -69242 213057 -141164 150387 -90739
10652D1602f1908C98309C1872a77905k5564M8144A01255b42276h6923k1329A05450
10640E27335a61900g3786A25184C1741b21358B08845a50344f4030m1488k51106
10630c56624i4541A57404a49305j32165G8813a54038a7080k7432p0901A4492J44864
10619A59356a29916e1298p0066B8750a96889M0506A25272e7969c122l6339I1690
10607a18098j50284i6441A38456R0517b5878B11391f0705k05513L8385a10845
10596g6100k67033G2099i472l22747A16242a83135f6847j8309A71121J04165p102
10585B68184a10764l20286A21498c26919G471a36810C1750L7161G351c11612H562
10573A93490k7136P8269d3108k5962b1703l5215k13677B0993K85652A45254c44
$$ plain form
10652 41602 -61908 398309 31872 -177905 -203469 -155325 101255 -242276 -86923 -108252 105450
10640 527335 -161900 -73786 125184 31741 -221358 208845 -150344 -64030 -105518 -356624
10630 -356624 -94541 157404 -149305 -281470 78813 -154038 -17080 -44512 -115413 14492 159356
10619 159356 -129916 -51298 -121364 28750 -196889 -156383 125272 -57969 -3122 -39461 91690
10607 -118098 -268382 -96441 138456 228973 -25878 211391 -60705 -266218 -227833 -110845
10596 -76100 -343133 72099 -9472 -332219 116242 -183135 -66847 -85156 171121 275286 268184
10585 268184 -110764 -431050 121498 -326919 7471 -136810 31750 68911 7351 -311612 8562
10573 193490 166354 244623 -43108 -69070 -21703 -56918 -270595 20993 306645 145254 -344
10561b75140A30860a51742N189F3265f4336j6135j56372k27229B97508a77075
10550a382l7667B47769A7703L3970c64554C32063b01611k0506e1943o7730A734
10538A06779b46963c1729k44793F714a73796A15525f9176B858i3963k0897r220
10527a24080n1341m757M2506j1152B19474a13964N2885F6391J30158a39817j52954
10516b92771B07012r2238O0682a97906C7891b54372P9226f8729j66245A51608
10505E5586J442a83022b5359r0819h216m25738J23763a2256r4814A9921a5746
10493A45951c14548F7388L41473c0631n303I9122a90175A26553b63239f6979b0243
10481c02643j09969b04237B8274a41847o6135H8122c81618G1200P0629P6881g1592
$$ plain form
10561 -275140 130860 -151742 -146553 63265 -64336 -80471 -236843 -464072 297508 -177075
10550 -1382 -39049 247769 17703 51673 -364554 332063 -201611 -222117 -51943 -119673 1734
10538 106779 -246963 -31729 -276522 6714 -173796 115525 -69176 2858 -93963 -114860 -124080
10527 -124080 -175421 -180178 -137672 -148824 219474 -113964 -61079 66391 196549 -139817 -292771
10516 -292771 207012 114774 175456 -197906 37891 -254372 -175146 -68729 -234974 151608
10505 55586 57028 -183022 -25359 -116178 -8216 -433954 -310191 -12256 -107070 19921 -15746
10493 145951 -314548 67388 408861 -30631 -35934 99122 -190175 126553 -263239 -66979 -20243
10481 -302643 -412612 -204237 28274 -141847 -207982 88122 -381618 71200 141829 218710 -71592
10469g8145m2160A29213n5735d719j88524A5494a18334A02611J38094r7365a69065
10457b2049j26043B48583b58990g8207j23906L3265N1154J9750B38445a51236
10446b54706j66770a22061B87355A00673a6289A30887m6325R3581h6370G2562
10435D4529b81741g8362k56208a5569A23518b69471c5106C72073a1527k10755
10425b22282A19026i0147a6408B0962P6875a44328k41859A37041F7076a35433
10414F0972d2507P027J6763j85761e4419j81414f0411A2376l241a52498f4041
10402a80655k63273h1404C9092L58303d14775G9010a07196l3601k053H1392a03746
10390b06713B72912n1925c19917H1842B9455J38728j6093J61324d1765j73552
$$ plain form
10469 -78145 -120305 129213 73478 -4719 -193243 15494 -118334 102611 240705 143340 -169065
10457 -22049 -148092 248583 -258990 -78207 -202113 -168848 -117694 -97944 238445 -151236
10446 -254706 -421476 -122061 287355 100673 -16289 130887 84562 178143 -86370 72562
10435 44529 -281741 -78362 -334570 -15569 123518 -269471 -35106 372073 -11527 -222282
10425 -222282 119026 -90147 -16408 20962 97837 -144328 -386187 137041 67076 -135433
10414 60972 -42507 -35480 -18717 -204478 -54419 -235833 -60411 12376 9135 -152498 -64041
10402 -180655 -443928 -81404 39092 397395 -414775 79010 -107196 -140797 -142850 81392 -103746
10390 -206713 272912 220987 -319917 81842 29455 168183 152090 313414 -41765 -215317
10380b15317B28131C6358J8529J96031G5876K07293a43134l5542B77849k3265
10370B54584L1161a07124B60994M4940I6886K53186R8264j34439r3731A03198
10359A13931a04758A49379K03562j56518a40386B39614A18178e8054A48224K32509
10349C80733J11292j52926N0978R1306A26625P3638n0616f7310m6316m9378B26252
10337C3258K33022b80802A29933b9078A19925a16516I795J68509a0101l8217C85916
10325a59324B11218G7616L61309F4397a22190A09413K40491a06794C12854A35162
10314C8353i3629A63050p3094J8503B0637d576l58565Q5003d5022k10481D06134
10302b37343f8780A52754i5521K9197n3372I4846d70884b08462Q5285B2749a75239
$$ plain form
10380 -215317 228131 36358 54887 250918 75876 283169 -143134 -178676 277849 254584
10370 254584 285745 -107124 260994 305934 96886 350072 448336 313897 220166 103198
10359 113931 -104758 149379 352941 196423 -140386 239614 118178 -58054 148224 380733
10349 380733 492025 339099 390077 481383 126625 200263 149647 -67310 -113626 -163004 226252
10337 33258 266280 -280802 129933 -29078 119925 -116516 9795 178304 -10101 -48318 385916
10325 -159324 211218 77616 438925 64397 -122190 109413 349904 -106794 312854 135162
10314 38353 -93629 163050 89956 108459 20637 -4576 -363141 -278138 -45022 -255503 406134
10302 -237343 -68780 152754 -95521 -66324 -119696 94846 -470884 -208462 -123177 22749 -175239
10290b02301i5668j30700C4658J22322F3232p682a54815E7856h7723j04444g900
10278G903h9846k8143D842b98602a30281J2619A34571b22215A8614B622c52641
10266c5635J4963B70574J63070A37933a24191j21473F205c24719J46985E8923
10255a08476j29887I3412b25177A15441c954j72821E3473a95407j1265A66714
10244b5285k29893m9120I308N4872f7197K5079A69391i3255j64191B3755P5171
10233I8926J47468d7825k4516A93983K69213k21380e8319q3088b6453k77773A62864
10221A43410g1179j31381p3921g7951l1465k479N196a6524k44471g9527J3547
10210f5980o3501D3814B1528a72215F5712d51685g5106G1024h1114c3621F6957
$$ plain form
10290 -202301 -95668 -226368 34658 156980 63232 55550 -154815 57856 -87723 -192167 -7900
10278 7903 -89846 -117989 4842 -298602 -130281 -117662 134571 -222215 18614 2622 -352641
10266 -35635 -20672 270574 433644 137933 -124191 -245664 6205 -324719 -177734 58923
10255 -108476 -238363 93412 -225177 115441 -3954 -176775 53473 -195407 -206672 166714
10244 -25285 -255178 -304298 9308 64180 -67197 -42118 169391 -93255 -257446 23755 98926
10233 98926 246394 -47825 -72341 193983 463196 241816 -58319 -141407 -26453 -304226 162864
10221 143410 -71179 -202560 -276481 -77951 -109416 -111895 -106699 -16524 -260995 -79527 -65980
10210 -65980 -129481 43814 21528 -172215 65712 -451685 -75106 71024 -81114 -33621 66957
10198b90340J37765J373c4922A90127a98810e3871B58311c97334a15495k55050
10188c70545a34829i407C7620M8971a32634j54629B8182c8535k85984a02796A7177
10176b5068j51825A6195O6447F651O7209D837b72240B07489B5031b07983B2828
10164a55806N3997p699E4084B2078a59671j51911A17090D3530j6949a53909d9085
10152C3171O3265K436a65820h0444j11824k08008B83760a26478A61139p3597g292
10140A26499k2653a41542b7478A90039a55047B20841j04277c29484I9353J89203
10130B88556j472g5445A71999c13045a8p6595A68375l9331a29007A69004A5388
10118H0635j2656J03800d5021a8211e9j39700B5569L86892d045j22411j02183
$$ plain form
10198 -290340 -152575 -151202 -34922 190127 -198810 -53871 258311 -397334 -115495 -370545
10188 -370545 -134829 -9407 37620 86591 -132634 -287263 28182 -38535 -324519 -102796 17177
10176 -25068 -176893 16195 82642 6651 73860 4837 -272240 207489 25031 -207983 22828
10164 -155806 -101809 -109508 54084 22078 -159671 -311582 117090 43530 26581 -153909 -49085
10152 33171 96436 98872 -165820 -80444 -192268 -400276 283760 -126478 161139 87542 -7292
10140 126499 103846 -141542 -27478 190039 -155047 220841 116564 -329484 99353 288556
10130 288556 287084 -75445 171999 -313045 -18 -76613 168375 129044 -129007 169004 15388
10118 80635 67979 171779 -45021 -18211 -59 -139759 25569 412461 -4045 -126456 -228639
10107b28639e6150A17538a29810R016b7183k19493P4212m1339p4054R3780b862
10095i5327n5879j27234o9245a04374D3711A1553J97005M5093b51015M4883R209
10084a96923k969j56035Q0202a32406A64962b33554B22479c19113d7096B8985
10073h2501k46208A9137a52746P6020b7770F8347P7612e9065q0373r3699I4250
10061c81110a5805j76302A4093c42915B14798a29235F5074R6676a46190A06553
10050b67295J30413A23087n9369P1282f3033k93816f8095A07763a53581j29993
10040b83574C85885H9003b9587k0698j07047P431g538C3514b26720E32J52678
10029A53210B4921i2562k43429c9608j59016B47745a8072k30865J01668A03767
$$ plain form
10107 -228639 -56150 117538 -129810 -120794 -27183 -246676 -172464 -213803 -287857 -194077 -2862
10095 -95327 -151206 -278440 -347685 -104374 43711 11553 208558 253651 -251015 -206132 -196923
10084 -196923 -199892 -355927 -275725 -132406 164962 -233554 222479 -319113 -47096 28985
10073 -82501 -328709 19137 -152746 -76726 -27770 68347 145959 -59065 -139438 -233137 94250
10061 -381110 -15805 -192107 14093 -342915 214798 -129235 65074 161750 -146190 106553
10050 -267295 -136882 123087 63718 135000 -63033 -356849 -68095 107763 -153581 -283574
10040 -283574 385885 89003 -29587 -50285 -157332 -149901 -7538 33514 -226720 532 153210
10029 153210 24921 -92562 -335991 -39608 -198624 247745 -18072 -248937 -147269 103767
10018C1384a60650j61260A29899a90453a9934l49723k1298E4536c35960P2073
10008b63887K4277Q2429A95765n4653l7157k626b95520i4173k62053h7331a8090
9996c3144l18884a04219c110A56208b77943f7071M424B05940D2784a52140R649
9985a42491e6604h87l7763H5240J90841Q9518a31202Q436H8155b32486A614O4335
9973F5949b46719d7126D9887J5394a54423l1800C46993j45055b91809B95570G0371
9961a54401N6009L2771r1472m566A35198b5906j41651j27887P1917i7647j81601
9950b79248a32595j04870J01679A65016K8043b26724n715J10567H5641M8847a06390
9938h554p2580E454b2880A66151n4180k4382p433J9909b28048R7013k0170e9590
$$ plain form
10018 31384 -160650 -321910 129899 -190453 -19934 -369657 -390955 54536 -335960 -263887
10008 -263887 -239610 -157181 195765 141112 103955 101329 -295520 -94173 -356226 -87331 -18090
9996 -33144 -352028 -104219 -3110 156208 -277943 -67071 -62647 205940 42784 -152140 -142491
9985 -142491 -56604 -887 -38650 85240 276081 365599 -131202 -122766 88155 -232486 1614 65949
9973 65949 -246719 -47126 49887 65281 -154423 -186223 346993 201938 -291809 295570 70371
9961 -154401 -98392 -65621 -157093 -161659 135198 -25906 -167557 -295444 -223527 -97647 -279248
9950 -279248 -132595 -237465 -135786 165016 193059 -226724 -232439 -121872 85641 134488 -106390
9938 -8554 -81134 5454 -22880 166151 111971 87589 80156 100065 -228048 -131035 -151205 -59590
9925a33731m0279L0958E0423b3688n01383K55142Q7676L928Q6630p470A50547
9913H5770h8596R134k64k0918r9049L5003q1119J22747k55672D7225R9681a51426
9900d0573J4647A15924J03765a86369j67938a5699j92611L273L7399F6024c96743
9888A99142n9899b44j69007f8925I1868K5545a62566g688j70729g1286J5528m32423
9876d88181a63793A49773f1905g56n26038K31196J06462G325g8769c6502A42797
9864h7020A71908A4274J17934M4010b36532K7627D6612a99911R6475n9823A44405
9852c89231G537i8051n6627B26357G9215N4522Q6909a42347E7933a09834M3089
9841f6745D3390b43978i2831A52235i0622j15228o2201G5088b89454i0781H6265
$$ plain form
9925 -133731 -174010 -143052 50423 -23688 -525071 -269929 -182253 -178325 -91695 -99165 150547
9913 85770 -88596 -79462 -79726 -100644 -199693 -164690 -245809 -123062 -378734 47225 146906 -151426
9900 -40573 -25926 115924 219689 -186369 -354307 -15699 -208310 -205037 -167638 66024 -396743
9888 199142 139243 -244 -169251 -68925 91868 117413 -162566 -7688 -178417 -71286 -55758 -488181
9876 -488181 -163793 149773 -61905 -756 -526794 -295598 -189136 7325 -78769 -36502 142797
9864 -87020 171908 14274 132208 176218 -236532 -208905 46612 -199911 -103436 -163259 144405
9852 -389231 7537 -98051 -154678 226357 79215 133737 220646 -142347 57933 -109834 -66745
9841 -66745 43390 -243978 -92831 152235 -90622 -205850 -268051 75088 -289454 -90781 86265
9829f0830K285B19769g3101A66985o3197i6216C29448b94657O8984a04045B9953
9817B943a92802f896C309L01628a67661d899j97487e1916j973k01001A35349f3368
9804fC13943i9320A44910M4984A0141b56786P3952L8490A03356b50069i5030c2021
9791b5400G9324a78559d1002J423B00998b76347n7849A5451g5165K8623I4466
9779b48440i0479B38081d8516a9013q1263d4806o9331L0427j05133g3811O471
9768f7340K9682G759f7287B73650g0774K4261r6847C01843f0354K1628a3283p0031
9756h3314c7218l38025f0028A12741a25269q5696e1058k46999H9227a84562e5429
9744a88789E085a3374l30387J24463B05403i7616B3249a6627E9657a01494K34
$$ plain form
9829 -60830 -58545 219769 -73101 166985 103788 -96216 329448 -294657 -225673 -104045 29953
9817 2943 -192802 -6896 3309 304937 -167661 -4899 -202386 -51916 -53889 -254890 135349 -63368
9804 -6 313943 -99320 144910 189894 10141 -256786 -182834 -144344 103356 -250069 -95030 -32021
9791 -25400 79324 -178559 -41002 -39579 200998 -276347 -334196 15451 -75165 -46542 94466
9779 -248440 -90479 238081 -48516 -19013 -100276 -44806 -114137 -83710 -188843 -73811 -67340
9768 -67340 -37658 7759 -67287 273650 -70774 -46513 -143360 301843 -60354 -38726 -13283 -83314
9756 -83314 -37218 -375243 -60028 112741 -125269 -210965 -51058 -298057 89227 -184562 -55429
9744 -188789 5085 -13374 -343761 -219298 205403 -97616 23249 -16627 59657 -101494 -101260
9733a01260q3840f7216A10977b65335A17951d42449a10705c9691l43098h2634
9722a45183K800f2846F1451a41891j9317k10765A3431d4262F1953A7969a00057
9710D7393J8685J42083a62919f2440B8662b21542E0321b56628C45317A36604h6452
9698i5998A19177C9421a11903R521q9400A04553d85051c5284j96367K659i6123
9686i6107A87650a29048G1155f851n555D7454h751j94910B037b64914J06124B25360
9673D20354h6995A64407c28911J24162A55450f9852l7121j73844A07835k7583
9663H0252a21755j03420l08198K51527F7795b53919H5532C6873a99942L1948Q0821
9652h7173e748j801l93405A23201C5804a44830F6014b20061A90668g3841o3302
$$ plain form
9733 -101260 -185100 -67216 110977 -265335 117951 -442449 -110705 -39691 -382789 -82634
9722 -145183 -142383 -62846 61451 -141891 -161208 -371973 13431 -44262 61953 17969 -100057
9710 47393 66078 208161 -162919 -62440 28662 -221542 50321 -256628 345317 136604 -86452
9698 -95998 119177 39421 -111903 -102382 -191782 104553 -485051 -35284 -231651 -228992 -96123
9686 -96107 187650 -129048 71155 -6851 -12406 47454 -8751 -203661 2037 -264914 -158790 225360
9673 420354 -86995 164407 -328911 -204749 155450 -69852 -106973 -280817 107835 80252
9663 80252 -121755 -225175 -533373 -281846 67795 -253919 85532 36873 -199942 -167994 -87173
9652 -87173 -5748 -7549 -400954 123201 35804 -144830 66014 -220061 190668 -73841 -137143
9641a37143J3609J459a0812q0941a662k33733O1342m3396R6211k3045a6881m8140
9629f5021a6633A9428Q937Q6015b24910n1587d8519n0406J4275c7618k42741A95428
9616G1562b2311A63417c39212B22359b94059A19080O2911g9994q3942r7175H702
9604c89682C7384c23969e5515j89358a10287G0329a95798O1812O4937E0162a68181
9592f1305l08672A78417b47037Q5766C53930A52101i5855q1174B32562B0311L58419
9581C78730b95591G9919l6568N9770b49668D6950b3675P06I8187a64534M2808
9570a21726B51167a96683R7209A59207b86917a08527A94483b8839a1601l5531
9560d7132A26762a35444B65637C514b18185M1904f3433k16009H6904i1870k4869
$$ plain form
9641 -137143 -123534 -122075 -10812 -91753 -1662 -235395 -174053 -217449 -121238 -144283 -16881 -65021
9629 -65021 -16633 19428 28365 114380 -224910 -276497 -48519 -98925 -84650 -37618 -280359 195428
9616 71562 -22311 163417 -339212 222359 -294059 119080 181991 -79994 -163936 -261111 8702
9604 -389682 37384 -323969 -55515 -244873 -110287 70329 -195798 -133986 -69049 50162 -168181
9592 -61305 -369977 178417 -247037 -161271 353930 152101 -95855 -177029 232562 20311 378730
9581 378730 -295591 79919 43351 103121 -249668 46950 -23675 -22969 98187 -164534 -121726
9570 -121726 251167 -196683 -99474 159207 -286917 -108527 194483 -28839 -11601 -47132
9560 -47132 126762 -135444 265637 3514 -218185 -176281 -63433 -279442 86904 -91870 -116739
9549a16739L1055j22585l1652f906C4772b26041f4143j11490B5470K2440Q5758
9538A33668c6807k95603d3655o8627j07184J01878p4507j00551h0815E6047j730
9527E4317P523J84287A6549K2199d6480k38057J35170f7893j8666j96988D3621
9515H278R4556b04861A11698M4135a67903A53743d0072n1751J7818B01494a79182
9503b4697l26501J60536j72703L9225a07283n7460B48493G3434g5620A1709a18699
9491a95476A75855a50055j6106F6373a22140j46890n2581f3441m4978K8019k81856
9480c62256A82575b9521A41826g9020B11207d6691k03409J01119C1766b46041
9469I3057C1230b16049d715A0132P0995f8094g984b411j6633f813m80F5842J20449
$$ plain form
9549 -116739 -85684 -208269 -239921 -6906 34772 -226041 -64143 -175633 25470 47910 133668
9538 133668 -36807 -332410 -43655 -112282 -219466 -117588 -192095 -292646 -80815 56047 54317
9527 54317 61840 246127 16549 38748 -46480 -284537 -149367 -67893 -86559 -283547 43621
9515 8278 102834 -204861 111698 155833 -167903 153743 -40072 -91823 -74005 201494 -179182
9503 -24697 -351198 -190662 -363365 -324140 -107283 -164743 248493 73434 -75620 11709 -118699
9491 -195476 175855 -150055 -166161 66373 -122140 -269030 -321611 -63441 -108419 -80400 -362256
9480 -362256 182575 -29521 141826 -79020 211207 -46691 -250100 -148981 31766 -246041
9469 93057 31230 -216049 -4715 10132 81127 -68094 -7984 -2411 -19044 -6813 -7293 65842 186291
9456A86291c57878O2426g1070A22032g5447A48446b76988c8653o2093A66174d0439
9444A03889B7819a118o3786j17451Q8706n1714r9964H031J03784b59464j19483
9433c78947a16850L8650b914l60369e5932A25790a77785A65593B0349J6570A1588
9421F483a27507L9446I1366k2654b34382I9242b34676A88297C4966g3115j34546
9410b07661h874j76113c9024H9454i3196a0582G792b13750F9630N3544E2559e527
9397I4108K67869A45146i9750G7157A3350a97120C2395d8866j08894l7229o6930
9386b61919o808J26375o7388c6393k03994b7373Q948k75116D3492A8639J59792
9375A78431a24961j49767J3908A721J13902l6084b40358C05625j27171g4245j42421
$$ plain form
9456 186291 -357878 -295452 -71070 122032 -75447 148446 -276988 -38653 -100746 166174 -40439
9444 103889 27819 -1118 -64904 -182355 -93649 -145363 -245327 8031 111815 -259464 -378947
9433 -378947 -116850 -78200 -2914 -363283 -55932 125790 -177785 165593 20349 36919 11588
9421 6483 -127507 -88061 91366 68712 -234382 99242 -234676 188297 34966 -73115 -207661
9410 -207661 -8874 -184987 -39024 89454 -93196 -10582 7792 -213750 69630 123174 52559 -5527
9397 94108 361977 145146 -99750 77157 13350 -197120 32395 -48866 -157760 -194989 -261919
9386 -261919 -268727 -142352 -209740 -36393 -240387 -27373 -18425 -293541 43492 18639 178431
9375 178431 -124961 -274728 -260820 1721 115623 79539 -240358 305625 178454 -74245 -216666
9364b16666j32744e7741b1160A51954e8913I1441c2461k54452e5482A83108A345
9352a06890A79654J50357a72361B98795n0388a41373j45721g9271c2417j93490
9342b25907l2619A57381a2459A91946c37602J38225m8221j94687a2397l9034k46162
9331b97593e2549B854c56232j79978c7224m2762j43032f7662A18832a91187c2020
9319a0401k3954p3230J4438A13669d8567B48770i5536k9945A04901h8371L3774
9308e4597k97423A16575f598C09878b55651B4446e993m98702A72091A3491c56011
9296a4959n7250A44669d67091e2701E650f9387C2929J89504c6199a4984D8604
9284A11114b14767h4879L4536A7938K29385a86345e345B4723J09889a71087d115
$$ plain form
9364 -216666 -349410 -57741 -21160 151954 -58913 91441 -32461 -286913 -55482 183108 1345
9352 -106890 179654 330011 -172361 298795 248407 -141373 -287094 -79271 -32417 -225907
9342 -225907 -258526 157381 -12459 191946 -337602 -199377 -247598 -442285 -12397 -51431 -297593
9331 -297593 -52549 2854 -356232 -536210 -37224 -79986 -223018 -67662 118832 -191187 -32020
9319 -10401 -34355 -107585 -93147 113669 -48567 248770 -95536 -125481 104901 -88371 -54597
9308 -54597 -352020 116575 -6598 309878 -255651 24446 -5993 -504695 172091 13491 -356011
9296 -14959 -72209 144669 -467091 -52701 5650 -69387 32929 222433 -36199 -14984 48604
9284 111114 -214767 -84879 -50343 17938 247323 -186345 -5345 24723 134612 -171087 -4115
9272b8123j04063b2552j21533B42303e253k42341i1853H6844a68871b4801A606
9260C51420j19069m4838o2850L759c56490a40584f0657j06271j8522m497A23646
9248a45650A01741A1366K98740c6949l01535a21813K6289l38329a53068A16326
9237a19268H6833I303R7106a34078k0426N815j57017a00822D8436a04371L7602
9226f6769J3475k1606k31009A29718m8369b20117A05573b06193A83633a18658
9215h3116r8806C2635a62036b9150j80545P1555j17197N3100j36916i6831d0225
9203B3758i5228J1714j57784d795k51007B37283g3147j83901i0402C0705d71112
9191b7246m07467b16229f6511a6501k17078l941b1781H9945K8942h0048E3641
$$ plain form
9272 -28123 -132186 -22552 -144085 242303 -5253 -247594 -91853 86844 -168871 -24801 1606
9260 351420 232351 187513 124663 128422 -356490 -140584 -60657 -166928 -185450 -189947 123646
9248 -145650 101741 11366 310106 -36949 -338484 -121813 -95524 -433853 -153068 116326
9237 -119268 86833 9303 106409 -134078 -154504 -148689 -305706 -100822 48436 -104371 -66769
9226 -66769 -53294 -74900 -305909 129718 81349 -220117 105573 -206193 183633 -118658
9215 -83116 -181922 32635 -162036 -29150 -209695 -138140 -255337 -202237 -339153 -96831 -40225
9203 23758 -95228 -83514 -241298 -4795 -255802 237283 -73147 -257048 -90402 30705 -471112
9191 -27246 -434713 -216229 -66511 -16501 -233579 -237520 -21781 89945 118887 -80048 53641
9179b48447a13957o7885K3288o0695a6226A02382b57788g9687A08296E1789a42663
9167A63669c33613G844a64850N4095i408p2776A47164F117J56851i8297A17128
9155a57173g5387b0837B00813F6607a55976o2882A91678F4981p749b4617q1429
9144a06046l5698r3419K5358A83710a17532I9666b46614A50428i4113j28251A25621
9132C6425K84296c24588J60197e3265j59667A23726B8158d2173p06B9536J73280
9121B02816J10693c47884A85351N8372f9008l87790M7920i9692L4201j72373J3085
9110b24779Q3354K4623B6081g9911l2425M1227E0078a75760j744M2826j67634
9099c02312A22353a69972A30588b08579k01952A87716F2716f6892r9855E3050
$$ plain form
9179 -248447 -113957 -181842 -158554 -219249 -16226 102382 -257788 -79687 108296 51789 -142663
9167 163669 -333613 7844 -164850 -110755 -9408 -82184 147164 6117 162968 -98297 117128
9155 -157173 -75387 -20837 200813 66607 -155976 -218858 191678 64981 57232 -24617 -106046
9144 -106046 -141744 -235163 -209805 183710 -117532 99666 -246614 150428 -94113 -222364 125621
9132 36425 320721 -324588 -164391 -53265 -212932 123726 28158 -42173 -42879 29536 202816
9121 202816 313509 -347884 185351 243723 -69008 -456798 -408878 -99692 -65491 -237864 -224779
9110 -224779 -141425 -116802 26081 -79911 -112336 -71109 50078 -175760 -177504 -134678 -302312
9099 -302312 122353 -169972 130588 -208579 -410531 187716 62716 -66892 -166747 53050
9088A12825B2318b65502h0894A20393a16597C13415b55198P6812a8467j26224
9078a44691L6015C11908A28821A4744n763Q5722L73771b21533K4805I7738B5143
9066h7893o7417A49515a50096A94043a50849B00057E5530b8694D2570j5237a4785
9054a49652F354e8371j13352E6738B1186a93749L0385E1542f4527B4691b22480
9042A47029E6530h9100M1737k77332C40509A55646a05812A43170O2755G0421f5145
9030f5531B25049A12502d99884c6931l74027a02519A26446n4927a3148j52178
9020a65326j96201A89944B2984K8417a7712H5469K29346E8513b16392c917B21206
9008a8013o6852j1803o3318J9611A0317c03897A12354N7446b24067a3586q5046
$$ plain form
9088 112825 22318 -265502 -80894 120393 -116597 313415 -255198 -178386 -18467 -144691
9078 -144691 -108676 311908 128821 14744 8981 94703 468474 -221533 -196728 97738 25143
9066 -87893 -155310 149515 -150096 194043 -150849 200057 55530 -28694 42570 27333 -14785
9054 -149652 6354 -58371 -171723 56738 21186 -193749 -163364 51542 -64527 24691 -222480
9042 147029 56530 -89100 -47363 -324695 340509 155646 -105812 143170 205925 70421 -65145
9030 -65531 225049 112502 -499884 -36931 -410958 -102519 126446 71519 -13148 -165326
9020 -165326 -361527 189944 22984 51401 -17712 85469 314815 58513 -216392 -3917 221206
9008 -18013 -84865 -96668 -159986 -140375 10317 -303897 112354 169800 -224067 -13586 -98632
8997i8632b148j20772M9445H8209B1546J2450b12789G2668J95937j18512p4931
8986G5162b63362B38983b42858O3609a6316D4061R2994b02427j5548n8920G5983
8974h5495A80837b91265C9673J4929a0861l50312a16059r0838f9288j97699Q7461
8963a79526K502F5501J46585b41856P756J14211k20930E3084J51757G1267a97042
8951a24241N1003A4202J32410o7016d58307L8207p8949h0456A45690h1285K0022
8940f1263k6233q7429c5716A62424b46492B60130a66484B55493k4451E2621a2362
8928i0243j5649A86802a76605E5418J41364G5273K85467a82698I91567J379528
8918B371095N886106B364797F72314o716A93227a0267C58796j60621J72320b97470
$$ plain form
8997 -98632 -2148 -122920 -73475 88209 21546 33996 -212789 72668 268605 150093 75162
8986 75162 -263362 238983 -242858 -179249 -16316 44061 137055 -202427 -217975 -276895 75983
8974 -85495 180837 -291265 39673 54602 -10861 -361173 -116059 -206897 -69288 -266987 -179526
8963 -179526 -177024 65501 212086 -241856 -234100 -119889 -340819 53084 204841 71267 -197042
8951 -124241 -73238 14202 146612 79596 -458307 -420100 -499049 -80456 145690 -81285 -61263
8940 -61263 -87496 -174925 -35716 162424 -246492 260130 -166484 255493 231042 52621 -12362
8928 -90243 -105892 186802 -176605 55418 196782 75273 360740 -182698 991567 2371095
8918 2371095 8257201 2364797 672314 665598 193227 -10267 358796 198175 370495 -297470
8907C039J43660D2139K86418j20630i6321j25250a0161q7325d0310I8967i8850
8895A65473a00915M1982D9480C626d61132k3189C64565c3053A65766g4394J7556
8884e6838C04843A4292q85J51202L4988c60550f5248k5578p0808L951j02983a17990
8871a05560H251c64388i8509a0614j63085K1797P0145A06637C8201a67259r6088
8860b63347K6622A43391a79214h2894A51110b2248D7862h6274f182k70865b1047
$$ plain form
8907 3039 146699 42139 328557 207927 -96321 -221571 -10161 -97486 -40310 98967 -98850
8895 165473 -100915 -58933 49480 3626 -461132 -484321 364565 -33053 165766 -74394 -56838
8884 -56838 304843 14292 13407 164609 199597 -360550 -65248 -90826 -161634 -157683 -260666 -117990
8871 -105560 8251 -364388 -98509 -10614 -173699 -151902 -81757 106637 38201 -167259 -263347
8860 -263347 -236725 143391 -179214 -82894 151110 -22248 47862 -86274 -6182 -277047 -21047
$$ [...]
##END NTUPLES=NMR SPECTRUM
##END=
