
##TITLE=AC1293_MEXRH11104_6615905_SgdSj8YBsg
##JCAMPDX= 6.0         $$ Bruker NMR JCAMP-DX V2.0
##DATA TYPE= NMR SPECTRUM
##DATA CLASS= NTUPLES
##ORIGIN= BRUKER
##OWNER= Administrator
$$ 1.72 TOPSPIN		Version 2.1
$$ 2012-08-03 00:15:23.937 -0500  Administrator@TOPSPIN
$$ Compression mode = diff/dup
##.OBSERVE FREQUENCY= 400.02188249412
##.OBSERVE NUCLEUS= ^1H
##.ACQUISITION MODE= SIMULTANEOUS (DQD)
##.ACQUISITION SCHEME= undefined
##.AVERAGES= 64
##.DIGITISER RES= 22
##SPECTROMETER/DATA SYSTEM= spect
##.PULSE SEQUENCE= noesygpps1d.comp
##.SOLVENT NAME= COFFEE_meoh
##.SHIFT REFERENCE= INTERNAL, COFFEE_meoh, 1, 14.96298
##AUDIT TRAIL= $$ (NUMBER, WHEN, WHO, WHERE, PROCESS, VERSION, WHAT)
$$ ##TITLE= Audit trail, TOPSPIN		Version 2.1
$$ ##JCAMPDX= 5.01
$$ ##ORIGIN= Bruker BioSpin GmbH
$$ ##OWNER= Administrator
$$ $$ C:\Bruker\TOPSPIN/data/COFFEE/nmr/AC1293_MEXRH11104_6615905_SgdSj8YBsg/12/pdata/1/auditp.txt
$$ ##AUDIT TRAIL=  $$ (NUMBER, WHEN, WHO, WHERE, PROCESS, VERSION, WHAT)
(   1,<2012-08-03 00:15:19.250 -0500>,<Administrator>,<TOPSPIN>,<go>,<TOPSPIN 2.1>,
      <created by zg
	started at 2012-08-03 00:03:48.890 -0500,
	POWCHK enabled, PULCHK disabled,
       configuration hash MD5:
       6B 1B 68 BB D9 2E 58 E2 7F 35 AD 54 07 DF 0E 41
       data hash MD5: 64K
       A7 72 73 8D AC B4 EB 13 20 78 C0 5A 1B EB D2 49>)
(   2,<2012-08-03 00:15:22.093 -0500>,<Administrator>,<TOPSPIN>,<proc1d>,<TOPSPIN 2.1>,
      <Start of raw data processing
       efp LB = 0.3 FT_mod = 6 PKNL = 1 PHC0 = 0 PHC1 = 0 SI = 128K 
       data hash MD5: 128K
       51 F7 BA BA 35 F5 CE 88 CD 52 3E BA FF 6A 7A 88>)
(   3,<2012-08-03 00:15:23.171 -0500>,<Administrator>,<TOPSPIN>,<proc1d>,<TOPSPIN 2.1>,
      <pk PHC0 = -0.9503174 PHC1 = 0 
       data hash MD5: 128K
       19 3A B3 21 B2 6A 0C F1 B7 12 CE 4C 1C EC 2E 60>)
(   4,<2012-08-03 00:15:23.406 -0500>,<Administrator>,<TOPSPIN>,<proc1d>,<TOPSPIN 2.1>,
      <abs ABSG = 1 
       data hash MD5: 128K
       39 DE 5B 11 6A 24 48 53 A2 99 3C 44 95 9D CA 4A>)
(   5,<2012-08-03 00:15:23.468 -0500>,<Administrator>,<TOPSPIN>,<proc1d>,<TOPSPIN 2.1>,
      <abs ABSG = 2 
       data hash MD5: 128K
       1C 3A 4F 2F 79 7B 2C B0 2B 66 63 12 F8 C9 33 4E>)
(   6,<2012-08-03 00:15:23.609 -0500>,<Administrator>,<TOPSPIN>,<proc1d>,<TOPSPIN 2.1>,
      <abs ABSG = 3 
       data hash MD5: 128K
       B8 8A 80 3E 08 68 11 B4 32 19 16 AA 40 1D 2F 1B>)
(   7,<2012-08-03 00:15:23.781 -0500>,<Administrator>,<TOPSPIN>,<proc1d>,<TOPSPIN 2.1>,
      <abs ABSG = 4 
       data hash MD5: 128K
       D3 D7 89 3B C0 C4 3D F2 D9 95 8F AC 5A E9 F6 C4>)
(   8,<2012-08-03 00:15:23.843 -0500>,<Administrator>,<TOPSPIN>,<proc1d>,<TOPSPIN 2.1>,
      <abs ABSG = 5 
       data hash MD5: 128K
       31 E7 A8 A7 08 D7 E8 1F 10 7C A6 E3 53 4D 9E 74>)
$$ ##END=
$$ 
$$ $$ hash MD5
$$ $$ 98 71 1B 22 8F A8 ED 32 59 78 6B 45 03 8F 34 CF
##$RELAX= 
##$RELAX= 
##$RELAX= 
##$RELAX= 
##$RELAX= 
##$RELAX= 
##$RELAX= 
##$RELAX= 
$$ Bruker specific parameters
$$ [...]
##$TP07= 0
##$TPNAME0= <>
##$TPNAME1= <>
##$TPNAME2= <>
##$TPNAME3= <>
##$TPNAME4= <>
##$TPNAME5= <>
##$TPNAME6= <>
##$TPNAME7= <>
##$TPOAL= (0..7)
0.5 0.5 0.5 0.5 0.5 0.5 0.5 0.5
##$TPOFFS= (0..7)
0 0 0 0 0 0 0 0
##$TUNHIN= 0
##$TUNHOUT= 0
##$TUNXOUT= 0
##$USERA1= <user>
##$USERA2= <user>
##$USERA3= <user>
##$USERA4= <user>
##$USERA5= <user>
##$V9= 5
##$VALIST= <valist>
##$VCLIST= <CCCCCCCCCCCCCCC>
##$VD= 0
##$VDLIST= <DDDDDDDDDDDDDDD>
##$VPLIST= <PPPPPPPPPPPPPPP>
##$VTLIST= <TTTTTTTTTTTTTTT>
##$WBST= 1024
##$WBSW= 4
##$XGAIN= (0..3)
0 0 0 0
##$XL= 0
##$YL= 0
##$YMAX_a= 14766922
##$YMIN_a= -7709481
##$ZGOPTNS= <>
##$ZL1= 120
##$ZL2= 120
##$ZL3= 120
##$ZL4= 120
##$ABSF1= 14.96298
##$ABSF2= -5.595201
##$ABSG= 5
##$ABSL= 3
##$ALPHA= 0
##$AQORDER= 0
##$ASSFAC= 0
##$ASSFACI= 0
##$ASSFACX= 0
##$ASSWID= 0
##$AUNMP= <proc_prof1d_extract.lims>
##$AXLEFT= 0
##$AXNAME= <>
##$AXNUC= <1H>
##$AXRIGHT= 0
##$AXTYPE= 0
##$AXUNIT= <>
##$AZFE= 0.1
##$AZFW= 0.1
##$BCFW= 0
##$BC_mod= 0
##$BYTORDP= 0
##$COROFFS= 0
##$CY= 15
##$DATMOD= 1
##$DC= 0
##$DFILT= <>
##$DTYPP= 0
##$F1P= 0
##$F2P= 0
##$FCOR= 0.5
##$FTSIZE= 131072
##$FT_mod= 6
##$GAMMA= 0
##$GB= 0
##$INTBC= 1
##$INTSCL= 1
##$ISEN= 128
##$LB= 0.3
##$LEV0= 0
##$LPBIN= 0
##$MAXI= 10000
##$MC2= 0
##$MEAN= 0
##$ME_mod= 0
##$MI= 0
##$NCOEF= 0
##$NC_proc= -2
##$NLEV= 6
##$NOISF1= 0
##$NOISF2= 0
##$NSP= 0
##$NTH_PI= 0
##$NZP= 0
##$OFFSET= 14.96298
##$PC= 1
##$PHC0= -0.9503174
##$PHC1= 0
##$PH_mod= 1
##$PKNL= yes
##$PPARMOD= 0
##$PPDIAG= 0
##$PPIPTYP= 0
##$PPMPNUM= 2147483647
##$PPRESOL= 1
##$PSCAL= 4
##$PSIGN= 0
##$PYNMP= <proc.py>
##$REVERSE= no
##$SF= 400.02000884462
##$SI= 131072
##$SIGF1= 0
##$SIGF2= 0
##$SINO= 400
##$SIOLD= 131072
##$SPECTYP= <>
##$SREGLST= <1H.CDCl3>
##$SSB= 0
##$STSI= 131072
##$STSR= 0
##$SW_p= 8223.68421052631
##$SYMM= 0
##$S_DEV= 0
##$TDeff= 65536
##$TDoff= 0
##$TI= <>
##$TILT= no
##$TM1= 0
##$TM2= 0
##$TOPLEV= 0
##$USERP1= <user>
##$USERP2= <user>
##$USERP3= <user>
##$USERP4= <user>
##$USERP5= <user>
##$WDW= 1
##$XDIM= 131072
##$YMAX_p= 428462667
##$YMIN_p= -10737
##$CURPLOT= <Network HP LaserJet P1505>
##$CURPRIN= <$Network HP LaserJet P1505>
##$DFORMAT= <normdp>
##$LAYOUT= <+/1D_H.xwp>
##$LFORMAT= <normlp>
##$PFORMAT= <normpl>
##$SURQMSG= 1
$$ End of Bruker specific parameters
$$ ---------------------------------
##NTUPLES= NMR SPECTRUM
##VAR_NAME=  FREQUENCY,     SPECTRUM/REAL,   SPECTRUM/IMAG
##SYMBOL=    X,             R,               I
##VAR_TYPE=  INDEPENDENT,   DEPENDENT,       DEPENDENT
##VAR_FORM=  AFFN,          ASDF,            ASDF
##VAR_DIM=   131072,        131072,          131072
##UNITS=     HZ,            ARBITRARY UNITS, ARBITRARY UNITS
##FACTOR=    0.0627417313425164, 1,          1
##FIRST=     8223.62146879497, 2409,         -42965
##LAST=      0,             2088,            -43447
##MIN=       0,             -10737,          0
##MAX=       8223.62146879497, 428462667,    0
$$ Real data points
##PAGE= N=1
##DATA TABLE= (X++(R..R)), XYDATA
$$ [...]
60964A553996M2127M6505N2873O1376O8778P4785Q2958R3889J03581J10226J16166
$$ 1553996 1596123 1642628 1695501 1756877 1825655 1900440 1983398 2077287 2180868 2291094 2407260
60953B407260J21744J24621J27042J35734J52116J70939J91101K18306K53377
$$ 2407260 2529004 2653625 2780667 2916401 3068517 3239456 3430557 3648863 3902240
60944C902240K88293L18789L50883L89904M34293M86128N55416O46408P52928
$$ 3902240 4190533 4509322 4860205 5250109 5684402 6170530 6725946 7372354 8125282
60935H125282Q75513J028120J218501J441621J706232K043925K472620K984924
$$ 8125282 9000795 10028915 11247416 12689037 14395269 16439194 18911814 21896738
60927B1896738L605850M402728N322688O004026N888090M673540K678902O74366
$$ 21896738 25502588 29905316 35228004 41232030 47120120 51793660 54472562 55146928
60919E5146928o81946j214876j087667m62037N42524J596339K089567J505481
$$ 55146928 54464982 53250106 52162439 51700402 52242926 53839265 55928832 57434313
60911E7434313j13892k145025l848089m838161n154906n018936m622204m098729
$$ 57434313 57320421 55175396 51327307 46489146 41334240 36315304 31693100 27594371
60903B7594371l556096l061577k625935k236681j895357j609030j368544j158746
$$ 27594371 24038275 20976698 18350763 16114082 14218725 12609695 11241151 10082405
60895A0082405r78979q36029p25729o36512n63514n05931m57160m10116l67051
$$ 10082405 9103426 8267397 7541668 6905156 6341642 5835711 5378551 4968435 4601384
60886D601384l33035l04589k74792k44545k18783j96157j72606j51219j38540
$$ 4601384 4268349 3963760 3688968 3444423 3225640 3029483 2856877 2705658 2567118
60877B567118j33723j30312j26130j22993j19276j11456j01213r3086q6548p7742
$$ 2567118 2433395 2303083 2176953 2053960 1934684 1823228 1722015 1628929 1542381 1464639
60867A464639o7391n9767n5173n0272m4653m0527l7210l2244k6874k4393k4150
$$ 1464639 1397248 1337481 1282308 1232036 1187383 1146856 1109646 1077402 1050528 1026135 1001985
60856A001985k2913k0786k0049j9655j6872j3036j1775j2559j1792r265p833p675
$$ 1001985 979072 958286 938237 918582 901710 888674 876899 864340 852548 843283 835450 827775
60844H27775o554m916n080o127n206l210l616o304q032q502j0285j3124j3939
$$ 827775 821221 816305 811225 805098 799892 796682 793066 786762 778730 770228 759943 746819 732880
60831G32880j2575j2070j3004j2786j0875r599r422q281o127n301n867n212k983
$$ 732880 720305 708235 695231 682445 671570 661971 652549 644268 638141 632840 626973 621761 618778
60818F18778j875k816l570k968k410k454j793l79J36k52L31K058L061L063L890
$$ 618778 616903 614087 610517 607549 605139 602685 600892 600513 600649 600397 600728 602786 605847 608910 612800
60803F12800N979P736Q601R496J0135R335P983Q270R937J0734J0392J0609J1186
$$ 612800 618779 626515 635116 644612 654747 664082 672065 680335 690272 701006 711398 722007 733193
60790G33193J0068P242M870L424J397j118k369k574l723n615o017m970m883o032
$$ 733193 743261 750503 755373 758797 760194 759076 756707 754133 750410 744795 738778 733808 728925 722893
60776G22893o122m781m262m998m706k833j828k726l430k750k342l153l591k818
$$ 722893 716771 711990 707728 702730 698024 695191 693363 690637 687207 684457 682115 678962 675371 672553
60762F72553k480l484m215l594k930l206l309k483j875k156k137j124k72l28k84
$$ 672553 670073 666589 662374 658780 655850 652644 649335 646852 644977 642821 640684 639560 639288 638960 638676
60747F38676O24J750K749M315O413P927Q540Q846Q423O290L370J667Q53j249m518
$$ 638676 639300 641050 643799 648114 654527 662454 670994 679840 688263 694553 697923 699590 700443 699194 694676
60732F94676o290n824n493o608p553p289p315q590r599r100q127p701p153o136
$$ 694676 688386 682562 677069 670461 662908 655619 648304 639714 630115 621015 612888 605187 598034 591898
60718E91898n773o369o443n368m554m810m941m238l872m493m899m406m217n070
$$ 591898 586125 579756 573313 567945 563391 558581 553640 549402 545530 541037 536138 531732 527515 522445
60704E22445n831n733n763o508o897o328n887o147n969m726l589l301k878j726
$$ 522445 516614 510881 505118 498610 491713 485385 479498 473351 467382 462656 459067 455766 452888 451162
60690D51162r63j307j690j202n02j71L66J192J233L41N2J142K371K567K108J526
$$ 451162 450199 448892 447202 446000 445498 445327 445693 446885 448118 448459 448511 449653 452024 454591 456699 458225
60674D58225P20L78J837M618O359O204O008P160Q563Q902Q655Q606Q475Q155Q282
$$ 458225 458945 459323 461160 465778 472137 478341 484349 491509 500072 508974 517629 526235 534710 542865 551147
60659E51147Q568P733O023N408O404P165O765O685P835Q822Q730Q947J0512J2108
$$ 551147 559715 567448 573471 578879 585283 592448 599213 605898 613733 622555 631285 640232 650744 662852
60645F62852J2537J2840J4020J4811J3766J1663R901Q199N738L043R47q79k928
$$ 662852 675389 688229 702249 717060 730826 742489 752390 760589 766327 769370 770317 769438 766510
60632G66510m771o186p864r872j1082j1161j1314j2090j2411j1829j1557j2083
$$ 766510 761739 755553 747689 737817 726735 715574 704260 692170 679759 667930 656373 644290
60620F44290j1988j0538r206r127r172q108o612n493m037j832k09o7j47P55J736
$$ 644290 632302 621764 612558 603431 594259 586151 579539 574046 570009 568177 567968 567901 567754 568509 570245
60605E70245J718J619K669M226N111N670O735P947Q726R650J1295J3081J4552
$$ 570245 571963 573582 576251 580477 585588 591258 597993 605940 614666 624316 635611 648692 663244
60592F63244J6395J8946K1240K2663K3976K5538K6320K5767K4840K3979K1998
$$ 663244 679639 698585 719825 742488 766464 792002 818322 844089 868929 892908 914906
60581I14906J8192J3542Q617K559m530j0537j4257j7109k0279k2496k2503k1402
$$ 914906 933098 946640 955257 957816 953286 942749 928492 911383 891104 868608 846105 824703
60569H24703k0551j9286j6870j4571j3582j2865j1294r974j0175j0786j0212r126
$$ 824703 804152 784866 767996 753425 739843 726978 715684 705710 695535 684749 674537 665411
60557F65411q906q899p644n487l702k313q26K15M19R17K565M194M561M472M981
$$ 665411 656505 647606 639962 634475 630773 628460 627634 627849 628268 629185 631750 635944 640505 644977 649958
60542F49958N151L825K046J498J907K189K685M059N442N952O625Q616J0930J2278
$$ 649958 655109 658934 660980 662478 664385 666574 669259 673318 678760 684712 691337 699953 710883 723161
60528G23161J3690J6762K0670K3607K6011K9705L4850M0329M6256N3546O1731
$$ 723161 736851 753613 774283 797890 823901 853606 888456 928785 975041 1028587 1090318
60517A090318O9740P8165Q8518J00743J13418J25398J35042J38765J33164J18241
$$ 1090318 1160058 1238223 1326741 1427484 1540902 1666300 1801342 1940107 2073271 2191512
60507B191512R6635P0447M1062J1385j4341l3036m3521m5590m0355l1023k1436
$$ 2191512 2288147 2358594 2399656 2411041 2396700 2363664 2320143 2274553 2234198 2203175 2181739
60496B181739j3907r546r420j3575k0050k6842l3908m1414m7257m8678m5505l9578
$$ 2181739 2167832 2158286 2148866 2135291 2115241 2088399 2054491 2013077 1965820 1917142 1871637 1832059
60484A832059l1762k1735j0010K227J4871K8507M2680N6490P0289Q4787R8851
$$ 1832059 1800297 1778562 1768552 1770779 1785650 1814157 1856837 1913327 1983616 2068403 2167254
60473B167254J09945J16352J17505J13025J03192Q9812P5075O0406M7869M1331
$$ 2167254 2277199 2393551 2511056 2624081 2727273 2817085 2892160 2952566 3000435 3041766
60463C041766M4195N6736P7290J04897J39050J78343K21782K70473L26050L88374
$$ 3041766 3085961 3142697 3219987 3324884 3463934 3642277 3864059 4134532 4460582 4848956
60453D848956M56605N31110O11854O95546P75374Q41114Q77249Q64449P88512
$$ 4848956 5305561 5836671 6448525 7144071 7919445 8760559 9637808 10502257 11290769
60444A1290769O48882M56769K27183k3245k72552m94482o67281p81058q37501
$$ 11290769 11939651 12396420 12623603 12600358 12327806 11833324 11166043 10384985 9547484
60435I547484q45625q18085p67744p04704o36070n67495n03057m44115l90462
$$ 9547484 8701859 7883774 7116030 6411326 5775256 5207761 4704704 4260589 3870127
60426C870127l42573l01180k65407k33623k05659j82021j61527j42263j24502
$$ 3870127 3527554 3226374 2960967 2727344 2521685 2339664 2178137 2035874 1911372
60417A911372j10039r8679q8073p7192o7510o0376n5384n1665m8761m5943m2512
$$ 1911372 1801333 1702654 1614581 1537389 1469879 1409503 1354119 1302454 1253693 1207750 1165238
60406A165238l9040l6596l4761l2075k8354k4761k1776j8872j6120j4255j3219
$$ 1165238 1126198 1089602 1054841 1022766 994412 969651 947875 929003 912883 898628 885409
60395H85409j2292j1448j1051j0658r801r321j0236j1826j2750j3264j4343j5421
$$ 885409 873117 861669 850618 839960 830159 820838 810602 798776 786026 772762 758419 742998
60383G42998j5258j4326j4021j4166j3604j2624j2302j2043j0434q018o576o149
$$ 742998 727740 713414 699393 685227 671623 658999 646697 634654 624220 616202 609626 603477
60371F03477n402m431m427m894m208k687k115k393j777m36m33j897k483j227R0
$$ 603477 598075 593644 589217 584323 580115 577428 575313 572920 571143 570707 570274 568377 565894 564667 564757
60356E64757J98o4j54j014k693l524k814k096k522l200l120k751k691k616k315
$$ 564757 564955 564891 564737 563723 561030 557506 554692 552596 550074 546874 543754 541003 538312 535696 533381
60341E33381k062j394N83L244M732M657M549N232N872N993O219O512N909M564
$$ 533381 531319 529925 530508 533752 538484 543141 547690 552922 558794 564787 571006 577518 583427 587991
60327E87991L853L876L151J349N3O4L18K28P48K077K742K082J536K262L487M428
$$ 587991 591844 595720 598871 600220 600273 600337 600655 600883 601631 603708 606450 608532 610068 612330 615817 620245
60311F20245N783P997R772R822Q527O672M016M04l096n481p165q928j0440j0805
$$ 620245 626028 634025 643797 653619 662146 668818 672834 673238 670142 664661 657496 648568 638128 627323
60297F27323r806p831n398l120j453r4J577L513N332P316R797J1975J2851J3027
$$ 627323 617517 609686 604288 601168 599715 599621 601198 604711 610043 617359 627156 639131 651982 665009
60283F65009J3805J4813J4474J2602J0511Q565N865K566J95o66j014j325r26J27
$$ 665009 678814 693627 708101 720703 731214 739779 745644 748210 748405 747739 746725 745400 744474 744601
60269G44601O55M42P72K313M140N418O351P111P525Q068R507J1384J2642J3695
$$ 744601 745256 745698 746470 748783 752923 758341 764692 771803 779328 787396 796903 808287 820929 834624
60255H34624J5935J9253K2255K4835K8220L2378L5935L8850M2614M7474N2006
$$ 834624 850559 869812 892067 916902 945122 977500 1013435 1052285 1094899 1142373 1194379
60244A194379N5944O0628O6094P0434P2851P4694P6481P6504P3535O8647O3225
$$ 1194379 1250323 1310951 1377045 1447479 1520330 1595024 1671505 1748009 1821544 1890191 1953416
60233A953416N7338N0935M4452L7334K8227J7507P423j022q961j6769k2982k7056
$$ 1953416 2010754 2061689 2106141 2143475 2171702 2189209 2196632 2195610 2186649 2169880 2146898 2119842
60221B119842l0382l3353l4130l1836k8304k5083k1089j5018p835r37O068J4007
$$ 2119842 2089460 2056107 2021977 1990141 1961837 1936754 1915665 1900647 1892812 1891875 1897943 1911950
60209A911950K2276L0130L8114M6703N4969O1974O7873P2554P4927P4719P3082
$$ 1911950 1934226 1964356 2002470 2049173 2104142 2166116 2233989 2306543 2381470 2456189 2529271
60198B529271P0235O4559N5389M4671L4405K4244J3136J459r959k1186l2059m1331
$$ 2529271 2599506 2664065 2719454 2764125 2798530 2822774 2835910 2837369 2827410 2806224 2774165 2732834
60186B732834m8306n3678n7571n8665n6592n3169m9684m4809l7006k7222j7477
$$ 2732834 2684528 2630850 2573279 2514614 2458022 2404853 2355169 2310360 2273354 2246132 2228655
60175B228655q218J170J0620J9768K8968L8454M7477N5308O1892O6719O8584O7403
$$ 2228655 2220437 2221607 2232227 2251995 2280963 2319417 2366894 2422202 2484094 2550813 2619397 2686800
60163B686800O4686O1444N7344N2746M9341M7647M5936M2985L9927L7902L5845
$$ 2686800 2751486 2812930 2870274 2923020 2972361 3020008 3065944 3108929 3148856 3186758 3222603
60152C222603L2066K6350J9140J0531J377o344j1654j5286j7197j5477r129K29
$$ 3222603 3254669 3281019 3300159 3310690 3312067 3305723 3294069 3278783 3261586 3246109 3236980 3237209
60140C237209J0935K3539L8821N5634P2464Q9388J06876J24297J41158J57962
$$ 3237209 3248144 3271683 3310504 3366138 3438602 3527990 3634866 3759163 3900321 4058283
60130D058283J74377J88478J99246K07789K14520K17313K14255K06164J94483
$$ 4058283 4232660 4421138 4620384 4828173 5042693 5260006 5474261 5680425 5874908
60121E874908J78748J58188J33973J07846Q0123N0815K0948r027m0162p2494j03344
$$ 5874908 6053656 6211844 6345817 6453663 6533786 6584601 6605549 6596522 6556360 6483866 6380522
60110F380522j30004j52223j70230j82442j87353j85954j80101j70255j56822
$$ 6380522 6250518 6098295 5928065 5745623 5558270 5372316 5192215 5021960 4865138
60101D865138j41819j26942j11600r4933p7971o1750m5206k7244r063P834K4085
$$ 4865138 4723319 4596377 4484777 4389844 4311873 4250123 4204917 4177673 4168610 4176444 4200529
60090D200529M0489N5367O6430P3649P7789P7826P2473O2794N0771L6721K0669
$$ 4200529 4241018 4296385 4362815 4436464 4514253 4592079 4664552 4727346 4778117 4814838 4835507
60079D835507M657r111k1280l3883m6964n9071o9783p9278q6644r1140r3924r6056
$$ 4835507 4840164 4831053 4809773 4775890 4728926 4669855 4600072 4520794 4434150 4343010 4249086 4153030
60067D153030r6116r2285q5392p7377o8042n6209m2698k9226j5449j35J5522K8741
$$ 4153030 4056914 3964629 3879237 3801860 3733818 3677609 3634911 3605685 3590236 3590101 3605623 3634364
60055C634364L8603M6062N1169N3111N2430N0654M8192M4966M2370M2105M3525
$$ 3634364 3672967 3719029 3770198 3823309 3875739 3926393 3974585 4019551 4061921 4104026 4147551
60044D147551M4389M3554M0889L5487K6491J4927K439j0954k5703m0455n3480
$$ 4147551 4191940 4235494 4276383 4311870 4338361 4353288 4355727 4344773 4319070 4278615 4225135
60033D225135o5188p6636q6552r2709r5342r6356r5961r2985q7881q2421p6886
$$ 4225135 4159947 4083311 3996759 3904050 3808708 3712352 3616391 3523406 3435525 3353104 3276218
60022C276218p0366o3454n7833n3390m8348m2007l4958k7053j7677p532K347J2772
$$ 3276218 3205852 3142398 3084565 3031175 2982827 2940820 2905862 2878809 2861132 2853600 2855947 2868719
60010B868719K5002L7987M9711O0667P2825Q5579R5829J02024J05080J05221J01044
$$ 2868719 2893721 2931708 2981419 3042086 3114911 3200490 3296319 3398343 3503423 3608644 3709688
59999C709688R2224Q0469O7149N2254L5979J9205K103j5721l3555m9956o4553
$$ 3709688 3801912 3882381 3949530 4001784 4037763 4056968 4059071 4043350 4009795 3959839 3895286
59988C895286p7577q7895r3763r5255r3902r0167q3590p4956o5948n6768m6439
$$ 3895286 3817709 3729814 3636051 3540796 3446894 3356727 3273137 3198181 3132233 3075465 3029026
59977C029026l5255k4630j4672m203O920J7639K7666L7516M6789N4480O0552O5248
$$ 3029026 2993771 2969141 2954469 2950266 2957186 2974825 3002491 3040007 3086796 3141276 3201828 3267076
59965C267076O7586O6804O4397O2157N9109N3206M5350L8423L2728K5850J7087
$$ 3267076 3334662 3401466 3465863 3528020 3587129 3640335 3685685 3724108 3756836 3782686 3799773
59954C799773Q763K740j404m113m653k749Q81O291J4425K5268L7853N2120O8661
$$ 3799773 3808536 3811276 3809872 3805759 3801106 3798357 3799238 3805529 3819954 3845222 3883075 3935195 4003856
59941D003856Q6852J05555J25334J47496J71228J94319K16340K38075K57955K72131
$$ 4003856 4090708 4196263 4321597 4469093 4640321 4834640 5050980 5289055 5547010 5819141
59931E819141K78264K76272K65262K42786K07826J61809J06507M3918k1496q3665
$$ 5819141 6097405 6373677 6638939 6881725 7089551 7251360 7357867 7401785 7380289 7296624
59921G296624j38825j86085k23958k49702k62966k66919k64519k56257k42540
$$ 7296624 7157799 6971714 6747756 6498054 6235088 5968169 5703650 5447393 5204853
59912E204853k25486k06965j87108j65943j44387j22721j00207p7128n5144l4817
$$ 5204853 4979367 4772402 4585294 4419351 4274964 4152243 4052036 3974908 3919764 3884947
59902C884947j4846N533K5436M4255O2489P9940R5119J07134J16228J21851J22215
$$ 3884947 3870101 3875634 3901070 3945325 4007814 4087754 4182873 4290007 4406235 4528086 4650301
59891D650301J16273J04176Q5609N9884K8236o231m1254p5912j08291j35342j55802
$$ 4650301 4766574 4870750 4956359 5016243 5044479 5038248 4996994 4921082 4812791 4677449 4521647
59880D521647j70899j81560j87203j87833j84861j79153j70492j59614j48402
$$ 4521647 4350748 4169188 3981985 3794152 3609291 3430138 3259646 3100032 2951630
59871B951630j37439j25681j13055j01065r0218p9334o8094n7796m8874m0113
$$ 2951630 2814191 2688510 2575455 2474390 2384172 2304838 2236744 2178948 2130074 2089961
59861B089961l1172k3536j8169j4444j2105j1867j3390j4994j6034j7248j8243
$$ 2089961 2058789 2035253 2017084 2002640 1990535 1978668 1965278 1950284 1934250 1917002 1898759
59850A898759j7295j4378j1552r501o373j218M092P562R202R225O615R68o282
$$ 1898759 1881464 1867086 1855534 1846033 1839660 1838442 1842534 1850096 1859298 1868523 1875138 1876106 1869824
59837A869824j3727k1215k8257l3373l6051l7451l8235l7664l5494l2680k9513
$$ 1869824 1856097 1834882 1806625 1773252 1737201 1699750 1661515 1623851 1588357 1555677 1526164
59826A526164k5240k0139j5693j2180q382m245j093J216M566R288J3555J6855
$$ 1526164 1500924 1480785 1465092 1452912 1444530 1440285 1439192 1440408 1444974 1454262 1467817 1484672
59814A484672K0961K6358L0945L3610L6061L9406M1907M1924M0361L8298L4803
$$ 1484672 1505633 1531991 1562936 1596546 1632607 1672013 1713920 1755844 1796205 1834503 1869306
59803A869306K9003K2144J5739R775M354P92m88r62j381l42K998P191J1089J5828
$$ 1869306 1898309 1920453 1936192 1945967 1950321 1951113 1950625 1949663 1948282 1947940 1950938 1958129 1969218 1985046
59789A985046K2559L0369L8223M6785N6721O7299P8379R1695J08497J27827J48663
$$ 1985046 2007605 2037974 2076197 2122982 2179703 2247002 2325381 2417076 2525573 2653400 2802063
59778B802063J71686J97423K24569K51020K73998K87684K83693K56318K06046
$$ 2802063 2973749 3171172 3395741 3646761 3920759 4208443 4492136 4748454 4954500
59769D954500J37615N7903k2966r2820j43872j76778j96567k06562k08073k02877
$$ 4954500 5092115 5150018 5127052 5034232 4890360 4713582 4517015 4310453 4102380 3899503
59759C899503j92752j78055j59374j39118j19465j00307q1153o3198m7541l3224
$$ 3899503 3706751 3528696 3369322 3230204 3110739 3010432 2929279 2866081 2818540 2785316
59749B785316j9169o273M530J4461K5016L5564M4981N4024O3975P4503Q4846R5586
$$ 2785316 2766147 2759874 2764404 2778865 2803881 2839445 2884426 2938450 3002425 3076928 3161774 3257360
59737C257360J07354J19362J31093J43809J58564J74514J90940K09038K29758
$$ 3257360 3364714 3484076 3615169 3758978 3917542 4092056 4282996 4492034 4721792
59728D721792K51718K73354K95341L18749L42461L64325L83050L96972M03021
$$ 4721792 4973510 5246864 5542205 5860954 6203415 6567740 6950790 7347762 7750783
59719G750783L99254L86931L68171L43555L14313K84915K60721K44347K36285
$$ 7750783 8150037 8536968 8905139 9248694 9563007 9847922 10108643 10352990 10589275
59710A0589275K37367K48071K66701K90585L17827L46121L71393L89732L99125
$$ 10589275 10826642 11074713 11341414 11631999 11949826 12295947 12667340 13057072 13456197
59701A3456197L97555L81479L48638L00777K41479J73251R9120K4994m2671j00431
$$ 13456197 13853752 14235231 14583869 14884646 15126125 15299376 15398496 15423490 15380819 15280388
59691A5280388j46814j79572j96898k00021j91673j72882j43777j06374o3806
$$ 15280388 15133574 14954002 14757104 14557083 14365410 14192528 14048751 13942377 13878571
59682A3878571j7441L2917Q6841J43502K03174K66277L31718L97871M64059N28903
$$ 13878571 13861130 13894047 13980888 14124390 14327564 14593841 14925559 15323430 15787489 16316392
59672A6316392N88147O35841O66517O74509O52943N96015N01862L72276K11876
$$ 16316392 16904539 17540380 18206897 18881406 19534349 20130364 20632226 21004502 21216378
59663B1216378K9915j58878l38339m95705o22211p12127p64225p82594p73260
$$ 21216378 21246293 21087415 20749076 20253371 19631160 18919033 18154808 17372214 16598954
59654A6598954p40897o90428o29259n64851n01934m45099m02383l82393l88003
$$ 16598954 15858057 15167629 14538370 13973519 13471585 13026486 12624103 12241710 11853707
59645A1853707m14924m54949m98123n33826n54315n58009n47638n25986m95459
$$ 11853707 11438783 10983834 10485711 9951885 9397570 8839561 8291923 7765937 7270478
59636G270478m59976m23779l88576l54102l20778k89638k60607k33309k08762
$$ 7270478 6810502 6386723 5998147 5644045 5323267 5033629 4773022 4539713 4330951
59627D330951j88030j70135j53431j37958j24285j11417r8172q5433p4570o4916
$$ 4330951 4142921 3972786 3819355 3681397 3557112 3445695 3347523 3262090 3187520 3122604
59617C122604n5243m6344l9637l4510k9708k6004k4840k5690k7443l0902l6969
$$ 3122604 3067361 3021017 2981380 2946870 2917162 2891158 2866318 2840628 2813185 2782283 2745314
59606B745314m3750m8598n1878n5530n9112o0501n9613n8105n6190n2877m8740
$$ 2745314 2701564 2652966 2601088 2545558 2486446 2425945 2366332 2308227 2252037 2199160 2150420
59595B150420m5271m2135l7987l3353k9697k6377k1671j6178j2086r495o575k908
$$ 2150420 2105149 2063014 2025027 1991674 1961977 1935600 1913929 1897751 1885665 1876170 1869595 1866687
59583A866687K61K779N667Q674J0507J1190J1761J2089J1486J0734J0976J1385
$$ 1866687 1866948 1869727 1875394 1884068 1894575 1905765 1917526 1929615 1941101 1951835 1962811 1974196
59571A974196J0676R939J1151J3795J5911J7655K0736K5126K9486L4131M0327
$$ 1974196 1984872 1994811 2005962 2019757 2035668 2053323 2074059 2099185 2128671 2162802 2203129
59560B203129M7281N3100N8190O4610P2486Q0273Q7983R6988J07072J16900J26909
$$ 2203129 2250410 2303510 2361700 2426310 2498796 2579069 2667052 2764040 2871112 2988012 3114921
59549C114921J38539J50938J61628J70035J77302J83144J86054J86176J84711
$$ 3114921 3253460 3404398 3566026 3736061 3913363 4096507 4282561 4468737 4653448
59540D653448J81107J74095J64846J55724J46513J35431J23173J12300J03349
$$ 4653448 4834555 5008650 5173496 5329220 5475733 5611164 5734337 5846637 5949986
59531E949986R5471Q9976Q8529Q8024Q2394P0502N8135N1292N1197N6303O4737
$$ 5949986 6045457 6135433 6223962 6311986 6394380 6464882 6523017 6574309 6625506 6681809 6746546
59520F746546P3337P7947P6447O8929N4595L1752J336l3086o9554j08453j48441
$$ 6746546 6819883 6897830 6974277 7043206 7097801 7129553 7130889 7097803 7028249 6919796 6771355
59509F771355j85375k16479k42138k62425k75309k79781k77686k71030k60159
$$ 6771355 6585980 6369501 6127363 5864938 5589629 5309848 5032162 4761132 4500973
59500D500973k45688k29520k12674j94634j75750j57816j41482j25642j10051
$$ 4500973 4255285 4025765 3813091 3618457 3442707 3284891 3143409 3017767 2907716
59491B907716r5976q3644p1717n9894m9379m0240l1067k1696j3461o272J670J0715
$$ 2907716 2811740 2728096 2656379 2596485 2547106 2506866 2475799 2454103 2440642 2434370 2436040 2446755
59479B446755J9245K6807L4877M3974N2939O1595P1282Q2233R3295J04545J17086
$$ 2446755 2466000 2492807 2527684 2571658 2624597 2686192 2757474 2839707 2933002 3037547 3154633
59468C154633J30042J41047J49979J58695J66598J70105J67138J58534J44419
$$ 3154633 3284675 3425722 3575701 3734396 3900994 4071099 4238237 4396771 4541190
59459D541190J23214R5298O3768L0319n840m3641p8654j07799j32042j52508j67425
$$ 4541190 4664404 4759702 4823470 4853789 4847949 4804308 4725654 4617855 4485813 4333305 4165880
59448D165880j75163j77313j76403j72969j66800j58849j50130j40671j30750
$$ 4165880 3990717 3813404 3637001 3464032 3297232 3138383 2988253 2847582 2716832
59439B716832j21205j11744j01255r0441q1458p4443o7270n9373n2558m7340m1876
$$ 2716832 2595627 2483883 2382628 2292187 2210729 2136286 2069016 2009643 1957085 1909745 1867869
59428A867869l5588l0377k6984k3458j8628j3906j0367p107l715j168Q41M132
$$ 1867869 1832281 1801904 1774920 1751462 1732834 1718928 1708561 1701454 1697739 1696571 1697412 1701544
59416A701544Q505J1410J2207J3144J5082J6224J6370J8157K2442K6933L1141
$$ 1701544 1710049 1721459 1733666 1746810 1761892 1778116 1794486 1812643 1835085 1862018 1893159
59405A893159L7799M6603N1437M7723L8879L1861K9666L1630L7501M6911N7469
$$ 1893159 1930958 1977561 2028998 2076721 2115600 2147461 2177127 2208757 2246258 2293169 2350638
59394B350638O7728Q0073R6756J14550J27226J32610J34360J37840J46757J62566
$$ 2350638 2418366 2498439 2595195 2709745 2836971 2969581 3103941 3241781 3388538 3551104
59384C551104J84351K09544K36415K64999K94736L23155L48090L68979L84457
$$ 3551104 3735455 3944999 4181414 4446413 4741149 5064304 5412394 5781373 6165830
59375F165830L91228L87337L74382L54678L28715K97495K64752K34190K06360
$$ 6165830 6557058 6944395 7318777 7673455 8002170 8299665 8564417 8798607 9004967
59366I004967J80518J57503J38315J21616J05030Q7409O7989M5117J7941j2164
$$ 9004967 9185485 9342988 9481303 9602919 9707949 9795358 9863347 9908464 9926405 9914241
59356I914241m3550p5906j08262j37353j59791j74229j80147j76920j65857j50918
$$ 9914241 9870691 9794785 9686523 9549170 9389379 9215150 9035003 8858083 8692226 8541308
59346H541308j35673j21488j09807j03299j02800j05774j09881j15522j22929
$$ 8541308 8405635 8284147 8174340 8071041 7968241 7862467 7752586 7637064 7514135
59337G514135j29730j33863j36368j38741j40032j39081j37294j36564j36632
$$ 7514135 7384405 7250542 7114174 6975433 6835401 6696320 6559026 6422462 6285830
59328F285830j36895j38516j42076j45465j46779j47187j48357j49189j47803
$$ 6285830 6148935 6010419 5868343 5722878 5576099 5428912 5280555 5131366 4983563
59319D983563j44679j41030j36035j28565j19826j11596j03511r4592q5645p7556
$$ 4983563 4838884 4697854 4561819 4433254 4313428 4201832 4098321 4003729 3918084 3840528
59309C840528o9094n9105m9074m0845l3563k5591j7684j1543o752j864K970P076
$$ 3840528 3771434 3712329 3663255 3622410 3588847 3563256 3545572 3534029 3527277 3525413 3528383 3535459
59297C535459J1458J7343K3821K9420L4656M0825M7682N4558O2147P0925P9384
$$ 3535459 3546917 3564260 3588081 3617501 3652157 3692982 3740664 3795222 3857369 3928294 4007678
59286D007678Q5995R1363R6360R9937J01009J00602R9789R7348R1881Q4460P6796
$$ 4007678 4093673 4185036 4281396 4381333 4482342 4582944 4682733 4780081 4871962 4956422 5033218
59275E033218O8516N8679M8142L8025K7482J5273J798j2563k9070m8300o8296
$$ 5033218 5101734 5160413 5208555 5246580 5274062 5289335 5291133 5278570 5249500 5201200 5132904
59264E132904q7318j06175j25304j41980j53301j59857j63583j64122j60388j53718
$$ 5132904 5045586 4939411 4814107 4672127 4518826 4358969 4195386 4031264 3870876 3717158
59254C717158j46274j37991j27943j17049j06571r5772q3854p2366o2774n3636
$$ 3717158 3570884 3432893 3304950 3187901 3081330 2985558 2901704 2829338 2766564 2712928
59244B712928m3103l2282k3057j4519m732N834J5907K6553L9405N3500O7201Q1556
$$ 2712928 2669825 2637543 2614486 2599967 2595235 2601069 2616976 2643529 2682934 2736434 2803635 2885191
59232B885191R8423J16906J35146J54045J75777J99863K24090K48029K72397K96151
$$ 2885191 2983614 3100520 3235666 3389711 3565488 3765351 3989441 4237470 4509867 4806018
59222D806018L16879L32187L37593L25562K91251K38454J76493J12318M8609j2699
$$ 4806018 5122897 5455084 5792677 6118239 6409490 6647944 6824437 6936755 6985364 6972665
59212F972665o9589j21784j69221k09159k38102k55819k64265k63841k54356k38533
$$ 6972665 6903076 6781292 6612071 6402912 6164810 5908991 5644726 5380885 5126529 4887996
59202D887996k20565k01730j80966j59084j38815j21058j04542q8804p4488o1190
$$ 4887996 4667431 4465701 4284735 4125651 3986836 3865778 3761236 3672432 3597944 3536754
59192C536754m8043l5835k5783j6990p884R33Q157J4779K2486L0338L6289M0782
$$ 3536754 3488711 3452876 3427093 3410103 3402219 3403152 3411309 3426088 3448574 3478912 3515201 3555983
59180C555983M5467M9543N0912M9819M7862M4418L7646K8158J8176P897l863j6347
$$ 3555983 3601450 3650993 3701905 3751724 3799586 3844004 3881650 3909808 3927984 3935881 3932018 3915671
59168C915671k7592l7566m7268n5796o1726o6120p0569p3592p2855o9648o6982
$$ 3915671 3888079 3850513 3803245 3747449 3685723 3619603 3549034 3475442 3402587 3332939 3265957
59157C265957o4420n9170n1575m4904m0033l4712k8116k1969j6984j1949o604
$$ 3265957 3201537 3142367 3090792 3045888 3005855 2971143 2943027 2921058 2904074 2892125 2885521
59146B885521k035J820N999J0164J3460J6960K2082K7551L1328L4488L9512M5808
$$ 2885521 2883486 2885306 2891305 2901469 2914929 2931889 2953971 2981522 3012850 3047338 3086850 3132658
59134C132658N0926N5166O0718O7104P1924P5491Q0177Q5430Q7977Q6873Q4124
$$ 3132658 3183584 3238750 3299468 3366572 3438496 3513987 3594164 3679594 3767571 3854444 3938568
59123C938568Q0400P4493O6976O0144N4140M7206L9764L4165L0436K6556K2897
$$ 3938568 4018968 4093461 4160437 4220581 4274721 4321927 4361691 4395856 4426292 4452848 4475745
59112D475745K2163K4737K8257L1938L6892M2040M4008M1550L5872K6340J0367
$$ 4475745 4497908 4522645 4550902 4582840 4619732 4661772 4705780 4747330 4783202 4809542 4819909
59101D819909j1829l6656o1958q8231j14465j37152j54457j67546j76931j81409
$$ 4819909 4808080 4771424 4709466 4621235 4506770 4369618 4215161 4047615 3870684 3689275
59091C689275j81361j79268j76085j70649j63217j55815j48606j39693j29122
$$ 3689275 3507914 3328646 3152561 2981912 2818695 2662880 2514274 2374581 2245459
59082B245459j19262j10750j01933r2728q5047p8885p2021o4222n7647n2620m7166
$$ 2245459 2126197 2015447 1913514 1820786 1735739 1656854 1584833 1520611 1462964 1410344 1363178
59071A363178m1307l7420l5631l3235k9565k6915k5645k3075j8663j5636j5658
$$ 1363178 1321871 1284451 1248820 1215585 1186020 1159105 1133460 1110385 1091722 1076086 1060428
59060A060428j6084j4533j2327j1408j1316j1191j1592j2595j2964j2611j2944
$$ 1060428 1044344 1029811 1017484 1006076 994760 983569 971977 959382 946418 933807 920863
59049I20863j3860j3449j1547j0251j0073r049o510m247l009j358J070K745L544
$$ 920863 907003 893554 882007 871756 861683 852634 846124 841877 838868 837510 838580 841325 844869
59036H44869N255P896R237Q932R392J1550J3591J4827J6983K0349K2518K2230
$$ 844869 850124 858020 867257 876189 885581 897131 910722 925549 942532 962881 985399 1007629
59024A007629K0863J8961J5082R344M334J070k294o453r307r674r045q334o350
$$ 1007629 1028492 1047453 1062535 1071879 1076213 1077283 1074989 1068536 1059229 1049555 1040510 1032176 1025826
59011A025826k808N91L298O683J0701J3245J3823J4242J4729J3108Q793L913m65
$$ 1025826 1023018 1023609 1026907 1033590 1044291 1057536 1071359 1085601 1100330 1113438 1122231 1126144 1125679
58998A125679n404j0648j4155j5886j7956k0145j9678j6424j3731j2918j1496
$$ 1125679 1120275 1109627 1095472 1079586 1061630 1041485 1021807 1005383 991652 978734 967238
58987I67238q275n523m351k627O36L185L788M375O110P428P812R218J1991J3576
$$ 967238 958963 953440 949089 946462 947098 950283 954071 958446 964556 971984 979796 989014 1001005 1014581
58973A014581J3196J3584J6200J8895K0182K1601K3883K5076K4383K3808K4073
$$ 1014581 1027777 1041361 1057561 1076456 1096638 1118239 1142122 1167198 1191581 1215389 1239462
58962A239462K3151K0573J8825J8688J7697J5030J3347J3838J4212J3647J4792
$$ 1239462 1262613 1283186 1302011 1320699 1338396 1353426 1366773 1380611 1394823 1408470 1423262
58951A423262J8542K1801K2969K4794K9101L3478L6062L8825M3268M7505N0579
$$ 1423262 1441804 1463605 1486574 1511368 1540469 1573947 1610009 1648834 1692102 1739607 1790186
58940A790186N5051O2270O9528P4944Q0679Q8352R5940J02283J09943J20289J30464
$$ 1790186 1845237 1907507 1977035 2051979 2132658 2221010 2316950 2419233 2529176 2649465 2779929
58929B779929J38731J48245J61825J77385J92379K08474K27915K49324K70922
$$ 2779929 2918660 3066905 3228730 3406115 3598494 3806968 4034883 4284207 4555129
58920D555129K94141L20257L47166L72978L99045M26020M50728M70155M84440
$$ 4555129 4849270 5169527 5516693 5889671 6288716 6714736 7165464 7635619 8120059
58911H120059M92566M89436M70822M37184L89281L24717K42921J49383N0970m8803
$$ 8120059 8612625 9102061 9572883 10010067 10399348 10724065 10966986 11116369 11167339 11118536
58901A1118536j46275k34302l07177l65096m09717m39543m53929m57129m53386
$$ 11118536 10972261 10737959 10430782 10065686 9655969 9216426 8762497 8305368 7851982
58892G851982m41966m21696l96490l71328l46436l20322k94945k72886k52845
$$ 7851982 7410016 6988320 6591830 6220502 5874066 5553744 5258799 4985913 4733068
58883D733068k32900k14971k01129j88889j75155j61633j51370j43000j33553
$$ 4733068 4500168 4285197 4084068 3895179 3720024 3558391 3407021 3264021 3130468
58874C130468j23968j16621j10136j01770r2501q4874p8265p0919o4104n9580
$$ 3130468 3006500 2889879 2779743 2677973 2585472 2500598 2422333 2351414 2287310 2227730
58864B227730n5501m9474m3191l9443l7081l3453k9290k6639k4471k0854j6935
$$ 2227730 2172229 2122755 2079564 2040121 2003040 1969587 1940297 1913658 1889187 1868333 1851398
58853A851398j4457j1905p509l193j170N64M791J0075J3727J6812K1562K6759
$$ 1851398 1836941 1825036 1817527 1814334 1813164 1813728 1818519 1828594 1842321 1859133 1880695 1907454
58841A907454L0507L4603M1208M8088N2236N5416O0980O7986P3683P9147Q7129
$$ 1907454 1937961 1972564 2013772 2061860 2114096 2169512 2230492 2298478 2372161 2451308 2538437
58830B538437R6683J05307J14055J25388J38196J50018J62028J76769J93252K09248
$$ 2538437 2635120 2740427 2854482 2979870 3118066 3268084 3430112 3606881 3800133 4009381
58820D009381K26097K46226K68380K90231L13230L39683L67553L93295M17152
$$ 4009381 4235478 4481704 4750084 5040315 5353545 5693228 6060781 6454076 6871228
58811F871228M40366M59690M70195M70969M62467M40862M00988L42993K70659
$$ 6871228 7311594 7771284 8241479 8712448 9174915 9615777 10016765 10359758 10630417
58802A0630417J85716Q9640j1185j08337j97803k78406l46342l97326m32220m54681
$$ 10630417 10816133 10905773 10894588 10786251 10588448 10310042 9963700 9566374 9134154 8679473
58792H679473m65181m63009m51838m36983m18923l95633l69390l44972l22680
$$ 8679473 8214292 7751283 7299445 6862462 6443539 6047906 5678516 5333544 5010864
58783E010864k99573k76146k55569k37604k19371k01057j84992j70362j54737
$$ 5010864 4711291 4435145 4179576 3941972 3722601 3521544 3336552 3166190 3011453
58774C011453j39487j27870j19114j10231j02054r7432r4954r0693q4877q0629
$$ 3011453 2871966 2744096 2624982 2514751 2412697 2315265 2220311 2129618 2044741 1964112
58764A964112p7507p2482o5996o0805n6087m9000m0822l5153l1295k5849j9617
$$ 1964112 1886605 1814123 1748127 1687322 1631235 1582235 1541413 1506260 1474965 1449116 1429499
58753A429499j6222j5060j2399q479o693o516m242k43J454N71Q60L107M341L899
$$ 1429499 1413277 1398217 1385818 1377339 1370646 1364130 1359888 1359645 1361099 1361670 1362530 1365637 1369978 1373877
58739A373877L926M017J623k402m766n892q940j3215j4997j4479j5424j8188j9657
$$ 1373877 1377803 1381820 1383443 1381041 1376275 1370383 1361443 1348228 1333231 1318752 1303328 1285140 1265483
58726A265483j9846k1960k5888k8151k8394k9617l1944l2495l1360l1414l2234
$$ 1265483 1245637 1223677 1197789 1169638 1141244 1111627 1079683 1047188 1015828 984414 952180
58715I52180l0578k6784k4392k3572k1264j7647j5912j5797j3951j0548q955r065
$$ 952180 921602 894818 870426 846854 825590 807943 792031 776234 762283 751735 742780 733715
58703G33715p658n199n234p169o776l923k697l625l041n92O9j354r43K007L752
$$ 733715 726057 720858 715624 708455 701679 697756 695059 691434 688393 687801 687870 686516 685573 687580 691332
58688F91332L087K668K570l97n955r758j0538j1316j2763j2092r343p874p839
$$ 691332 694419 697087 699657 699260 693305 683547 673009 661693 648930 636838 627495 619621 611782
58675F11782n906k149l00n32Q90M028M599J808k95k37p63k177j306J850L537L337
$$ 611782 605876 603727 603427 602895 603785 607813 612412 614220 613925 613688 612925 610748 609442 611292 614829 618166
58659F18166M474O389M655n81l892l643l943o105o180k911l20j29R03M005O031
$$ 618166 622640 629029 633684 633103 629211 625568 621625 615520 609340 606429 606109 605980 606883 610888 616919
58644F16919O124P532J0815J2464J2092J3654J7684J9872J9203J9892K3299K5567
$$ 616919 623043 630575 641390 653854 665946 679600 697284 717156 736359 756251 779550 805117
58632H05117K5480K6861L0903L3915L4992L8156M4468M9848N3239N8987O8443
$$ 805117 830597 857458 888361 922276 957268 995424 1039892 1089740 1142979 1201966 1270409
58621A270409P7155Q3247R0678J01233J11144J18678J27218J37532J44804J46540
$$ 1270409 1347564 1430811 1521489 1622722 1733866 1852544 1979762 2117294 2262098 2408638
58611B408638J45676J42537J31663J10345Q2831N2664J8561j8522n2119p8126
$$ 2408638 2554314 2696851 2828514 2938859 3021690 3074354 3092915 3074393 3022274 2944148
58601B944148r8854j15773j25686j27684j26404j24564j19486j10478j02048r6135
$$ 2944148 2845294 2729521 2603835 2476151 2349747 2225183 2105697 1995219 1893171 1797036
58591A797036q8799p8409o9355o3769n7391m7798l9001l3659k8380k1117j5581
$$ 1797036 1708237 1629828 1560473 1496704 1439313 1391515 1352514 1318855 1290475 1269358 1253777
58580A253777j3870j2187q360o133p508q349o233n242q302j2014j3564j5488j9052
$$ 1253777 1239907 1227720 1219360 1213227 1205719 1197370 1191137 1185895 1177593 1165579 1152015 1136527 1117475
58567A117475k0339j7606j5271j6043j6441j4463j4132j7798k1601k3061k5436
$$ 1117475 1097136 1079530 1064259 1048216 1031775 1017312 1003180 985382 963781 940720 915284
58556I15284k9929l1708k8621k5783k6358k5929k1428j7364j7408j7782j5042
$$ 915284 885355 853647 825026 799243 772885 746956 725528 708164 690756 672974 657932
58545F57932j2574j3322j3677j0796q506r735j0463p332m041m126m544k494j253
$$ 657932 645358 632036 618359 607563 599057 589322 578859 571527 567486 563360 558816 556322 555069
58532E55069l212m431k189n54k413l565r40R95j451m126k878j055k412l888k201
$$ 555069 551857 547426 545237 544683 542270 538705 537765 538760 537309 533183 530305 529250 526838 522950 520749
58517E20749n16j806k672l10J495j95j350J277L786K912K457N337P185M734K577
$$ 520749 520233 518427 515755 515445 516940 516745 515395 516672 520458 523370 525827 531164 538349 543083 545660
58502E45660M446N877K897l1J561L789K243L38J959L590J798O46L588N831L088
$$ 545660 550106 555983 558880 558849 560410 564199 566442 566780 568739 572329 574127 574773 578361 584192 587280
58487E87280lJ381L057J77l245k236n79l233o506n267k898m489o912n154j978
$$ 587280 587277 588658 591715 591892 588647 586411 585832 582599 576093 570826 567928 563439 556527 551373 549395
58472E49395k078l051j171N47j201k378P64L570J408j155J226M556L286P39K104
$$ 549395 547317 544266 543095 543642 542441 540063 540827 544397 545805 544650 545876 550432 553718 554457 556561
58457E56561M280K613N38K607N058L175Q14K749M998K818N82L373O563M529J910
$$ 556561 560841 563454 563992 566599 571657 574832 575646 578395 583393 586211 586793 590166 596729 601258 603168
58442F03168M952R354Q308N258O802R993Q635N386N747O602K559k884m121m493
$$ 603168 608120 617474 625782 631040 637842 647835 656470 661856 667603 674205 676764 673880 669759 665266
58428F65266q942j2808j0019n344o096q738o322k138k903n280k504K175J987J23
$$ 665266 656324 643516 633497 628153 622057 613319 606997 604859 601956 596676 594172 596347 598334 598457
58414E98457L167P558O289K881M898R524R514P454J0071J4135J2293P352O685
$$ 598457 601624 609182 615471 618352 623250 632774 642288 649742 659813 673948 686241 693593 700278
58401G00278P871M125j576k053j36k985p598o428k130k314m877k955R86M22j510
$$ 700278 708149 712274 710698 708645 708509 705524 697926 691498 689368 687054 682177 679222 680208 680630 679120
58386F79120J796O330M478J82J900O301M703k2R09N194M342L93J436N460M944
$$ 679120 680916 687246 691724 691906 693806 700107 704810 704788 705697 710891 715233 715626 717062 722522 727466
58371G27466K490N563J0689R343M575N322R328Q385N048P171J1304R047M418O981
$$ 727466 729956 735519 746208 755551 760126 765448 774776 783161 788209 795380 806684 815731 820149 827130
58357H27130J3147J2537P699Q796J3775J2841P925Q465J2319J0019L751K893N123
$$ 827130 840277 852814 860513 869309 883084 895925 903850 912315 924634 934653 938404 941297 946420
58344I46420J347n170m238J299Q61l366j311M518M052K61L618J0835J0612N860
$$ 946420 947767 942597 938359 939658 940519 937153 935842 940360 944412 944673 948291 959126 969738 975598
58330I75598Q172J4811J3923Q191J0046J7393J7623J2194J3329J9649J9220J3694
$$ 975598 983770 998581 1012504 1020695 1030741 1048134 1065757 1077951 1091280 1110929 1130149 1143843
58318A143843J5102K1583K0860J4920J6424K3330K2355J4932J4109J8441J5032
$$ 1143843 1158945 1180528 1201388 1216308 1232732 1256062 1278417 1293349 1307458 1325899 1340931
58307A340931O018N374J1562J0395K960L455J1098J1954O857R409J7887J7824
$$ 1340931 1346949 1352323 1363885 1374280 1377240 1380695 1391793 1403747 1410604 1420013 1437900 1455724
58295A455724J1024J2891K2280K3508J7093J8387K6828K7239K0645K2582L1646
$$ 1455724 1466748 1479639 1501919 1525427 1542520 1560907 1587735 1614974 1635619 1658201 1689847
58284A689847L1526K3506K4449L3330L3035K4772K6488L7422L9175L2007L4240
$$ 1689847 1721373 1744879 1769328 1802658 1835693 1860465 1886953 1924375 1963550 1995557 2029797
58273B029797M5414M6653L8202L9104M8741M7118L4679L2599M1773M1592L1413
$$ 2029797 2075211 2121864 2160066 2199170 2247911 2295029 2329708 2362307 2404080 2445672 2477085
58262B477085L2199M4508M6942L9074M2987N8970O3736N6106N9359P4443P7424
$$ 2477085 2509284 2553792 2600734 2639808 2682795 2741765 2805501 2861607 2920966 2995409 3072833
58251C072833O7597P0241Q6742R1215Q1964Q5626J04255J10521J02064J06867
$$ 3072833 3140430 3210671 3297413 3388628 3470592 3556218 3660473 3770994 3873058 3979925
58241C979925J27272J33998J24003J27495J48640J57653J50990J59204J85153
$$ 3979925 4107197 4241195 4365198 4492693 4641333 4798986 4949976 5109180 5294333
58232E294333J96696J91154K02512K33726K49063K45086K59283K95933L16500
$$ 5294333 5491029 5682183 5884695 6118421 6367484 6612570 6871853 7167786 7484286
58223G484286L16828L37397L82888M11713M20561M55080N20413N69776N99160
$$ 7484286 7801114 8138511 8521399 8933112 9353673 9808753 10329166 10898942 11498102
58214A1498102O59470P56196Q36799Q97865R98518J146001J282079J406822J593301
$$ 11498102 12157572 12913768 13750567 14648432 15646950 16792951 18075030 19481852 21075153
58205B1075153J854019K126308K417573K817171L330774L864666M413266N086654
$$ 21075153 22929172 25055480 27473053 30290224 33620998 37485664 41898930 46985584
58197D6985584N913845O822497P862861R223783J0976137J3069990J5636853J8956281
$$ 46985584 52899429 59721926 67584787 76808570 87784707 100854697 116491550 135447831
58189A35447831K3078663K7958039L3965904M1234905M7673115M8463910L9263093
$$ 135447831 158526494 186484533 220450437 261685342 309358457 357822367 397085460
58182C97085460K0550042j839009k0920376l3032158l8473009l9200820l6988211
$$ 397085460 417635502 415796493 394876117 361843959 323370950 284170130 247181919
58175B47181919l3210302k8997139k5002202k1363305j8092812j5295209j2993122
$$ 247181919 213971617 184974478 159972276 138608971 120516159 105220950 92227828
58168I2227828j1051437r378685q006607o921739o006677n195493m524676l993508
$$ 92227828 81176391 71797706 63791099 56869360 50862683 45667190 41142514 37149006
58160C7149006l521610l075981k704951k418227k155335j895002j681470j522619
$$ 37149006 33627396 30551415 27846464 25428237 23272902 21377900 19696430 18173811
58152A8173811j367911j203810j072036r79424q82708p73547o90585o38595n78923
$$ 18173811 16805900 15602090 14530054 13550630 12667922 11894375 11203790 10565195 9986272
58143I986272n06136m54566m25277l82807l25691k87073k66379k30965j81970
$$ 9986272 9480136 9025570 8600293 8217486 7891795 7604722 7338343 7107378 6925408
58134F925408j50026j31539r5638m5822j0078J8561O7805J26797J63123J81821
$$ 6925408 6775382 6643843 6548205 6502383 6492305 6510866 6578671 6705468 6868591 7050412
58124G050412K08244K35837K51285K82788L61027M64071N62097O77055Q35996
$$ 7050412 7258656 7494493 7745778 8028566 8389593 8853664 9415761 10092816 10928812
58115A0928812J015267J198248J430109J746020K118255K548764L118769L867070
$$ 10928812 11944079 13142327 14572436 16318456 18436711 20985475 24104244 27971314
58107B7971314M762766N903607P477509R194090R916611Q386024M516319k93145
$$ 27971314 32734080 38637687 46115196 55309286 65225897 73611921 78128240 77835095
58099G7835095m294610o658535p585990p590300p035752o196073n324692m545150
$$ 77835095 73540485 66881950 59295960 51705660 44669908 38473835 33149143 28603993
58091B8603993l840724l201697k673068k259323j906248j592928j346598j161599
$$ 28603993 24763269 21561572 18888504 16629181 14722933 13130005 11783407 10621808
58083A0621808r91783q27847p03737o23439n52041m80081m31287m06478l79664
$$ 10621808 9630025 8802178 8098441 7475002 6922961 6442880 6011593 5605115 5225451
58074E225451l48332l32013l24187k98205k56766k25761k04886j72765j34786
$$ 5225451 4877119 4545106 4220919 3922714 3665948 3440187 3235301 3062536 2927750
58065B927750j17898j22603j24915j20689j24995j33442j26665j08625j00345
$$ 2927750 2809852 2687249 2562334 2441645 2316650 2183208 2056543 1947918 1847573
58056A847573j00578r0921p3984o8548p2314o6552n2656m8308n2286m7858l6323
$$ 1847573 1746995 1656074 1582090 1513542 1441228 1374676 1322020 1273712 1221426 1173568 1137245
58045A137245l3510l7629l3328k2947k1930k8003k5885j7687j8102k4479k1732
$$ 1137245 1103735 1066106 1032778 1009831 987901 959898 934013 916326 898224 873745 852013
58034H52013j2213j1108j6811j4927p202p783j4954j4744q652j0126j7337j6627
$$ 852013 839800 828692 811881 796954 789752 781969 767015 752271 743619 733493 716156 699529
58022F99529r463r253j4824j3261n847n358j0636r222k350k409q255p631j487
$$ 699529 690066 680813 665989 652728 646881 641523 630887 621665 619315 616906 608651 601020 599533
58009E99533j795p587o960o60l29n507n286o32k306q643q045j764j894q310r513
$$ 599533 597738 590151 583191 582531 582202 576695 571409 570777 568471 559828 551783 550019 548125 539815 530302
57994E30302n017n174r955r329l825l740q642q142k340j339n240m513M51K0n131
$$ 530302 525285 520111 510156 500827 497002 493262 484620 476478 474138 472799 467559 463046 463497 463517 458386
57979D58386m781R83J984k441k987Q25K95m243l588J954K711j723k069K281K393
$$ 458386 453605 454588 456572 454131 451144 451969 452264 448021 444433 446387 449098 447375 445306 447587 449980
57964D49980k377l321M09O95l015k935J019J018k747k423J255k29o247p637m260
$$ 449980 447603 444282 444691 445386 442371 439436 440455 441473 438726 436303 437558 437329 431082 423445 419185
57949D19185n097j0486j1257o339m447p130o615j815l33l019k408J987K428j620
$$ 419185 414088 403602 392345 386006 381559 374429 367814 365999 365666 362647 360239 362226 364654 363034
57935C63034k213J545K062j349r80L810M876Q67n12K392K708n02n5M938O994M731
$$ 363034 360821 362366 364428 363079 362099 365909 370785 371652 371140 373532 376240 375738 375683 380621 387615 392346
57919C92346N166R480J0718P840P825J1485J1238N554J818K292Q49l904n832m036
$$ 392346 397512 406992 417710 425550 433375 444860 456098 461652 463470 465762 466611 462707 456875 452839
57905D52839n045r725j1310q823r129j3192j3812r656q044j0820j0882o075l260
$$ 452839 447794 438069 426759 417936 408807 395615 381803 372147 364103 353283 342401 336326 333066
57892C33066n069n399j766K82j359j590R63J157j525j134K710L185n60j122L245
$$ 333066 327997 322598 320832 321114 319755 318165 319128 320285 318760 317626 320336 323521 322961 321839 325084
57877C25084N260K436J475N009O651L557J678L934M966K210O77K284J722k608
$$ 325084 330344 332780 334255 339264 345915 349472 351150 355084 360050 362260 362937 365221 366943 364335
57863C64335m714k349j251l917n161k972k608n659o193k245l6k213k897P55L181
$$ 364335 359621 357272 356021 352104 346943 343971 341363 335704 329511 327266 327230 325017 322120 322875 326056
57848C26056J485R98M632P289O138O054R542J1470R217P989J0565J1702Q274N268
$$ 326056 327541 328539 333171 340460 346598 352652 362194 373664 382881 390870 401435 413137 421411 426679
57834D26679O093O386L043J69M86j38m132p104o543o728r906j1461r043p532r626
$$ 426679 432772 439158 442201 442370 442856 442718 438586 431482 424939 418211 408305 396844 387801 380269 370643
57819C70643j0517p262m476n251n299j806P07q69k140K97K653J929J821M814O554
$$ 370643 360126 352864 348388 343137 337838 336032 336739 335870 333730 334027 336680 338609 340430 345244 351798
57804C51798M042J436J940J791j869m989m411l886o449q316o360m248n291o434
$$ 351798 355840 357276 359216 361007 359138 354149 349738 345852 339403 331087 324727 320479 315188 308754
57790C08754n080m505o689p188l154P43L95q45P54K381J017k30J721L880L277
$$ 308754 303674 299169 292480 285292 282138 282881 283276 282431 283185 285566 286583 286353 288074 291954 295231
57775B95231K695M612N805L776K123L877N831N069M654P282R778R542R880J3239
$$ 295231 297926 302538 308343 312119 314242 318119 323950 329019 333673 340955 350733 360275 370155 383394
57761C83394J5729J4234J2391J3518J4155J0771O503M992L711k76m076m778n432
$$ 383394 399123 413357 425748 439266 453421 464192 470695 475687 479398 479122 475046 470268 464836
57748D64836q929j1778j0418p951q238q877o562l907m389n691m470k768l456m267
$$ 464836 455907 444129 433711 425760 417522 408645 402083 398176 393787 388096 383626 380858 377402 373135
57734C73135k443m30r93j572O61L049K536J514K966M780M512M579P056Q663O766
$$ 373135 370692 370262 369269 367697 368358 371407 373943 375457 378423 383203 387715 392294 399350 408013 414779
57719D14779M956O670Q760P510N714P310J0157J0617J0377J2198J3769J2261J0362
$$ 414779 419735 426405 435165 442675 448389 455699 465856 476473 486850 499048 512817 525078 535440
57706E35440J1420J3267J3023J3202J6709K0687K1810K2883K7513L3084L5840
$$ 535440 546860 560127 573150 586352 603061 623748 645558 668441 695954 729038 764878
57695G64878L8169M3888N0804N5027N8284O3832O9337P1179P1970P6523Q3964
$$ 764878 803047 846935 897739 952766 1011050 1074882 1144219 1215398 1287368 1363891 1447855
57684A447855R0848R8416J09520J21750J30658J36639J41756J42937J35319J19440
$$ 1447855 1538703 1637119 1746639 1868389 1999047 2135686 2277442 2420379 2555698 2675138
57674B675138R8612P2494M0139O400k1774m2949n8994o8296o7835n9267m6322
$$ 2675138 2773750 2846244 2886383 2892783 2871009 2828060 2769066 2700770 2632935 2573668 2527346
57663B527346k8403k997K7097N3639O7337N9058K2841l5092r4721j37141j58828
$$ 2527346 2498943 2495946 2523043 2576682 2644019 2703077 2725918 2690826 2596105 2458964 2300136
57652B300136j66456j63617j50536j31813j14335r9179q3376o7759n5720m6452
$$ 2300136 2133680 1970063 1819527 1687714 1573379 1474200 1390824 1323065 1267345 1220893
57642A220893l6787k7693k1967j7660j0917l180J547M400R521J6375K1453K5634
$$ 1220893 1184106 1156413 1134446 1116786 1105869 1102689 1104236 1108636 1118157 1134532 1155985 1181619
57630A181619L2562M1374M8279N3909O1976P2113Q0874Q8509R7899J08096J15576
$$ 1181619 1214181 1255555 1303834 1357743 1419719 1491832 1572706 1661215 1759114 1867210 1982786
57619A982786J20504J25076J27005J21402J07896Q9510O6083L5689J323l0666
$$ 1982786 2103290 2228366 2355371 2476773 2584669 2674179 2740262 2775951 2777274 2746608
57609B746608n7922q1720j00808j12345j17775j21147j22509j19226j12456j05968
$$ 2746608 2688686 2606966 2506158 2393813 2276038 2154891 2032382 1913156 1800700 1694732
57599A694732r9804r1565q2590p6236p1460o4784n7276n2754n0353m5949l9861
$$ 1694732 1594928 1503363 1420773 1344537 1273077 1208293 1151017 1098263 1047910 1001961 962100
57588I62100l6073l4660l1998k7842k5266k4212k1864j8762j7792j7903j5646
$$ 962100 926027 891367 859369 831527 806261 782049 760185 741423 723631 705728 690082
57577F90082j2155j1512j2964j2038q822p685r026q809o362n165n574m187r94
$$ 690082 677927 666415 653451 641413 632591 624906 615880 607071 600709 595544 589970 585783 584789
57564E84789L8j581j710J076L545M072M585N517M961L561M165O146O075M316M693
$$ 584789 584827 583246 581536 582612 586157 590229 594814 600331 605292 608853 613018 619164 625239 629555 634248
57549F34248P462R060R108J0983J4937J7399J7826J9621K3432K6124K7273L0016
$$ 634248 641710 650770 659878 670861 685798 703197 721023 740644 764076 790200 817473 847489
57537H47489L4635L7870L9637M3699N0528N6203N9690O4558P2022P8888Q4027
$$ 847489 882124 919994 959631 1003330 1053858 1110061 1169751 1234309 1306331 1385219 1469246
57526A469246R0264R7988J03196J03766J01579R6614Q5249O6447M3829J9834o244
$$ 1469246 1559510 1657498 1760694 1864460 1966039 2062653 2147902 2214349 2258178 2278012 2271768
57515B271768l2752n4583o9692q0976q9808r3647r2008q8639q5502q0413p2871
$$ 2271768 2239016 2184433 2114741 2033765 1943957 1850310 1758302 1669663 1584161 1503748 1430877
57504A430877o6334o2286n7766n1231m5282m1221l6570l0477k5935k4053k1602
$$ 1430877 1364543 1302257 1244491 1193260 1147978 1106757 1070187 1039710 1013775 989722 968120
57493I68120j6973j3097j1703j0110o623l855l570l220p31K026L491N555R487
$$ 968120 951147 938050 926347 916237 909614 905759 902189 898969 898238 900264 903755 909310 918797
57480I18797J3142J5110J7439K1585K5832K9160L3373L9068M3910M7288N2197
$$ 918797 931939 947049 964488 986073 1011905 1041065 1074438 1113506 1157416 1204704 1256901
57469A256901O0055O8096P4310Q0476Q7751R3754R6620R7539R6710R0962P8123
$$ 1256901 1316956 1385052 1459362 1539838 1627589 1721343 1817963 1915502 2012212 2103174 2181297
57458B181297N9841L7925J2226j5575m0671o0277p5993q8850r6526r7919r5971
$$ 2181297 2241138 2279063 2291289 2275714 2235043 2174766 2098773 2009923 1913397 1815478 1719507
57447A719507r3137q8301q0819p3317o7626o2076n5451m9613m5668m1641l6557
$$ 1719507 1626370 1538069 1457250 1383933 1316307 1254231 1198780 1149167 1103499 1061858 1025301
57436A025301l2639l0858k8489k3877j9475j7385j5893j3266j0992j0360r679
$$ 1025301 992662 961804 933315 909438 889963 872578 856685 843419 832427 822067 812388
57425H12388p666n980n742n272l669k852l639l762k098r11j442j468L59J884J648
$$ 812388 804722 798742 793000 787728 784059 781207 777568 773806 771708 770797 769355 767887 768246 770130 771778
57410G71778J531K735L421K843L402N925P403O260N363O844Q367P703O617P006
$$ 771778 773309 776044 779465 782308 785710 791635 799038 805298 810661 817505 825872 833575 840192 847198
57396H47198P383O516O379Q231R773R343Q946J0058J0723R796R610J1211J1531
$$ 847198 854581 861097 867476 875707 885480 894823 903769 913827 924550 934346 943956 955167 966698
57383I66698Q855O493P238Q701Q073P114Q131R276Q279O987P759Q921Q135O784
$$ 966698 975553 982046 989284 997985 1006058 1013172 1021303 1030579 1038858 1045845 1053604 1062525 1070660 1077444
57369A077444O819O739M913L412M349N765N318M665N939P328O575N512O627Q280
$$ 1077444 1084263 1091002 1095915 1099327 1103676 1109441 1114759 1119424 1125363 1132691 1139266 1144778 1151405 1159685
57355A159685P861O728P458R031R228R159J0894J3120J3459J2781J3095J3643
$$ 1159685 1167546 1174274 1181732 1190763 1199991 1209150 1220044 1233164 1246623 1259404 1272499 1286142
57343A286142J3057J2853J4762J7080J7606J7659J9254K0939K0472J9065J8972
$$ 1286142 1299199 1312052 1326814 1343894 1361500 1379159 1398413 1419352 1439824 1458889 1477861
57332A477861J9387J8722J8332J9933K1813K1635K0575K0866K1697K1426K1199
$$ 1477861 1497248 1515970 1534302 1554235 1576048 1597683 1618258 1639124 1660821 1682247 1703446
57321A703446K2537K3963K3857K3864K5627K7140K6365K5374K6610K8222K7599
$$ 1703446 1725983 1749946 1773803 1797667 1823294 1850434 1876799 1902173 1928783 1957005 1984604
57310A984604K6434K7436K9010K8252K6542K6968K8655K8764K7919K8528K9726
$$ 1984604 2011038 2038474 2067484 2095736 2122278 2149246 2177901 2206665 2234584 2263112 2292838
57299B292838K9079K7512K7551K8459K7880K6591K6864K7963K7848K7514K8938
$$ 2292838 2321917 2349429 2376980 2405439 2433319 2459910 2486774 2514737 2542585 2570099 2599037
57288B599037L0620L0066K8751K9811L2504L3885L4123L5247L6407L5472L3712
$$ 2599037 2629657 2659723 2688474 2718285 2750789 2784674 2818797 2854044 2890451 2925923 2959635
57277B959635L3752L4434L2852K9893K8567K8282K6123K2559K0462J9534J7154
$$ 2959635 2993387 3027821 3060673 3090566 3119133 3147415 3173538 3196097 3216559 3236093 3253247
57266C253247J3904J2827J3805J3912J2918J3362J5514J7153J7992J9650K1676
$$ 3253247 3267151 3279978 3293783 3307695 3320613 3333975 3349489 3366642 3384634 3404284 3425960
57255C425960K2290K2540K5055K9084L1447L1981L3440L6404L8910M0733M3398
$$ 3425960 3448250 3470790 3495845 3524929 3556376 3588357 3621797 3658201 3697111 3737844 3781242
57244C781242M6301M7248M6584M6409M6233M3889M0207L8142L7716L6464L4523
$$ 3781242 3827543 3874791 3921375 3967784 4014017 4057906 4098113 4136255 4173971 4210435 4244958
57233D244958L4510L6604L8425L9635M2056M5408M7581M9070N2434N7284O0385
$$ 4244958 4279468 4316072 4354497 4394132 4436188 4481596 4529177 4578247 4630681 4687965 4748350
57222D748350O0854O0859O1040N9737N6997N4915N3684N1494M8505M6821M6417
$$ 4748350 4809204 4870063 4931103 4990840 5047837 5102752 5156436 5207930 5256435 5303256 5349673
57211E349673M5363M4001M4575M6619M7102M5556M4768M5988M7503M8400M9702
$$ 5349673 5395036 5439037 5483612 5530231 5577333 5622889 5667657 5713645 5761148 5809548 5859250
57200E859250N1375N2020N1890N2584N3709N3490N2507N2987N4633N5098N4273
$$ 5859250 5910625 5962645 6014535 6067119 6120828 6174318 6226825 6279812 6334445 6389543 6443816
57189F443816N4116N4637N4237N3613N4844N6932N6860N4906N4202N5110N4929
$$ 6443816 6497932 6552569 6606806 6660419 6715263 6772195 6829055 6883961 6938163 6993273 7048202
57178G048202N3186N2205N2035M9934M5521M1689L9494L6807L2844K9498K7203
$$ 7048202 7101388 7153593 7205628 7255562 7301083 7342772 7382266 7419073 7451917 7481415 7508618
57167G508618K3946J9368J5576J2895R065L561j497n575j0614j6754k1386k3573
$$ 7508618 7532564 7551932 7567508 7580403 7589468 7593029 7591532 7585957 7575343 7558589 7537203 7513630
57155G513630k5339k7579k8758k8744k9929l3268l6934l9908m3249m6852m8857
$$ 7513630 7488291 7460712 7431954 7403210 7373281 7340013 7303079 7263171 7219922 7173070 7124213
57144G124213m9264n0465n3200n5537n6747n8510o1468o4077o5711o7393o8767
$$ 7124213 7074949 7024484 6971284 6915747 6859000 6800490 6739022 6674945 6609234 6541841 6473074
57133F473074o7742o3755n8009n0240l8977k5236j2147p37R835J7611J7851Q659
$$ 6473074 6405332 6341577 6283568 6233328 6194351 6169115 6156968 6156231 6166066 6183677 6201528 6210187
57121F210187p067k5660m4548n9734o6014o1191m7038k5897k8K5869M6461O1415
$$ 6210187 6203120 6177460 6132912 6073178 6007164 5945973 5898935 5873038 5873010 5898879 5945340 6006755
57109F006755P5595R3062J14374J39855J71176K09057K53493L07123L74917M60343
$$ 6006755 6082350 6175412 6289786 6429641 6600817 6809874 7063367 7370490 7745407 8205750
57099H205750N65454O94707Q54606J049471J281574J555438J877912K253517K682663
$$ 8205750 8771204 9465911 10320517 11369988 12651562 14207000 16084912 18338429 21021092
57090B1021092L163165L688974M247093M818010N377153N893448O331018O655880
$$ 21021092 24184257 27873231 32120324 36938334 42315487 48208935 54539953 61195833
57082F1195833O832779O806496O496919N837226M830554L566239K177528P82936
$$ 61195833 68028612 74835108 81332027 87169253 91999807 95566046 97743574 98526510
57074I8526510n44601j775939k904648l916794m770463n408141n793694n934456
$$ 98526510 97981909 96205970 93301322 89384528 84614065 79205924 73412230 67477774
57066F7477774n868979n644435n308388m907225m477912m042396l614951l210433
$$ 67477774 61608795 55964360 50655972 45748747 41270835 37228439 33613488 30403055
57058C0403055k840681k508862k213643j955107j732010j538403j368668j222254
$$ 30403055 27562374 25053512 22839869 20884762 19152752 17614349 16245681 15023427
57050A5023427j099134r94757r03852q24805p56086o92898o31938n75162n24676
$$ 15023427 13924293 12929536 12025684 11200879 10444793 9751895 9119957 8544795 8020119
57041H020119m78226m33944l94801l63659l38173l15180k95813k81554k69450
$$ 8020119 7541893 7107949 6713148 6349489 6011316 5696136 5400323 5118769 4849319
57032D849319k56162k43086k32761k23817k13921k04115j95833j87093j75939
$$ 4849319 4593157 4350071 4117310 3893493 3679572 3475457 3279624 3092531 2916592
57023B916592j64265j54175j44085j32368j21155j12568j04786r5708q6809p9599
$$ 2916592 2752327 2598152 2454067 2321699 2200544 2087976 1983190 1887482 1800673 1721074
57013A721074p2328o3902n7049n3547n0534m5462m0485l7941l5832l2069k8733
$$ 1721074 1648746 1584844 1527795 1474248 1423714 1378252 1337767 1299826 1263994 1231925 1203192
57002A203192k7767k6746k3359j9870j8651j7714j5051j2982j3503j3877j1499
$$ 1203192 1175425 1148679 1125320 1105450 1086799 1069085 1054034 1041052 1027549 1013672 1002173
56991A002173q742q185p522m106K8K553N709J1791J8290K2239K4585K5527K1126
$$ 1002173 993431 985246 977724 973618 973646 976199 981908 993699 1011989 1034228 1058813 1084340 1105466
56978A105466J0023j619p498q477p518l371M813J2739J7464K2962L3036M4772
$$ 1105466 1115489 1113870 1106372 1097895 1090377 1087006 1091819 1104558 1122022 1144984 1178020 1222792
56966A222792N5368O8594Q7585J08443J28516J53320J87472K27560K72475L30282
$$ 1222792 1278160 1346754 1434339 1542782 1671298 1824618 2012090 2239650 2512125 2842407
56956B842407M05275M91729N92594P22467Q61869R20795P92072M59238L1071l43737
$$ 2842407 3247682 3739411 4332005 5054472 5916341 6837136 7629208 8088446 8119517 7775780
56946G775780n82552o89289p04176o62849n92538n15512m43982l79739l22191
$$ 7775780 7193228 6503939 5799763 5136914 4544376 4028864 3584882 3205143 2882952
56937B882952k72180k29149j91036j57352j28411j02452p7093n2976l3743k3546
$$ 2882952 2610772 2381623 2190587 2033235 1904824 1802372 1725279 1672303 1638560 1615014
56927A615014k5526l9726o0541p8968q9381r2225q9840q3334p4504o6515o0539
$$ 1615014 1589488 1549762 1489221 1410253 1320872 1228647 1138807 1055473 980969 914454 853915
56916H53915n4722m8024m1971l7509l3461k9281k6100k4071k1828j9342j7968
$$ 853915 799193 751169 709198 671689 638228 608947 582847 558776 536948 517606 499638
56905D99638j7228j5120j2014j0466j0680j0124q063o376n419l382l80J208J295
$$ 499638 482410 467290 455276 444810 434130 424006 415943 409567 404148 400766 400386 401594 402889
56892D02889K617N968R107J1336J4761K0086K5369K9711L3684L5228L0046J7756
$$ 402889 405506 411474 420581 431917 446678 466764 492133 521844 555528 590756 620802 638558
56880F38558L452q238j6744k2247k3539k0927j7232j4020j0288n932k661m33L088
$$ 638558 642010 633772 617028 594781 571242 550315 533083 519063 508775 502843 500182 499749 502837
56867E02837Q329J3011J6576K1330K8115L5054M2003N1915O5606P8294Q2875P4262
$$ 502837 511166 524177 540753 562083 590198 625252 667255 719170 784776 863070 945945 1020207
56855A020207N1029J7156j7205m1384n2439n4970n3197m7670l9522l2033k6245
$$ 1020207 1071236 1088392 1071187 1029803 977364 922394 869197 821527 782005 749972 723727
56844G23727j9786j1679l932K862J0887K0842L0862M0907N3481O9042Q5595J03244
$$ 723727 703941 692262 688330 691192 702079 722921 753783 794690 848171 917213 1002808 1106052
56832A106052J22394J35405J27449R0866L4882k2267o7150r5062j06481j05222
$$ 1106052 1228446 1363851 1491300 1582166 1617048 1594781 1527631 1432569 1326088 1220866
56822A220866r7345q7243p5602o2657n0512m0351l0698k0684j1952n087K523J2961
$$ 1220866 1123521 1036278 960676 898019 847507 807156 776458 755774 743822 738735 741258 754219
56810G54219K4929L6948N0420O6834Q3667R4582R2087P0632L1435j4494n2312
$$ 754219 779148 816096 866516 933350 1017017 1111599 1203686 1274318 1305753 1291259 1238947
56799A238947p4517q3877q5587q1462p2818o3208n5007m7086l8469l0790k4964
$$ 1238947 1164430 1080553 994966 913504 840686 777478 722471 675385 636916 606126 581162
56788E81162j9218j2502o274r12N713J4251K2508K9903L8534M7166M8813L8047
$$ 581162 561944 549442 543168 542256 547969 562220 584728 614631 653165 700331 749144 787191
56776G87191J7504n635k6223m1676n0162n2007n0332m7405m2670l6182l0583k7420
$$ 787191 804695 799060 772837 731161 680999 628992 578660 531255 488585 452403 421820 394400
56764C94400k4813k1120j7615j5398j3156j0324q898r637j0027q430o749o542
$$ 394400 369587 348467 330852 315454 302298 291974 283076 273439 263412 254982 248233 241691
56752B41691o134m223k707l151l866l207k420k625k418j052n30j864k802j956
$$ 241691 235557 231334 228627 225476 221610 218403 215983 213358 210940 209888 209358 207494 204692 202736
56738B02736j506l066m528l977l086l555l775k246q04j223j844r01R4n10j193
$$ 202736 201230 198164 193636 189659 186573 183018 179243 176997 176193 174970 173126 172225 172319 171809 170616
56723A70616l49M74l84j414r06j76p70j419p87k70j087j645p45j98j245j753p0
$$ 170616 170267 170741 170357 168943 168037 167861 167091 165672 164885 164615 163528 161883 161138 160940 159695 157942 157872
56706A57872J637J224L83J237K349J654L11J69K95n57r79K46J273N06k12R32K110
$$ 157872 159509 160733 161116 162353 164702 166356 166667 166836 167131 166574 165595 165841 167114 167620 167408 168340 170450
56689A70450J132n90q42m45q37q26P92K182J474J15NK02m09l48J311K309J045
$$ 170450 171582 170992 170150 169705 168868 168042 168834 171016 172490 172605 172610 172812 172403 172055 173366 175675 176720
56672A76720k22N47J382J71j194m47P36P8r53k35Q03J71o41K73J278N04j88J265
$$ 176720 176498 177045 178427 178598 177404 176957 177693 177771 176818 176583 177386 177557 176916 177189 178467 178971 178783 180048
56654A80048K849K194J275K755M781M258K359J927K178R42n54j33O80n73k310
$$ 180048 182897 185091 186366 189121 193902 198160 200519 202446 204624 205566 205012 204879 205559 204986 202676
56639B02676j706j5j05r89MJ775J403l28m61P30Q06L5L68J132L54j054r49j91
$$ 202676 200970 200955 200850 199861 199865 201640 203043 202715 202254 202984 203790 203825 204193 205325 205679 204625 203676 203485
56621B03485r05k146j665k69j62p02j9J001N22m36o4M64n91j713r01K41n22j696
$$ 203485 202580 200434 198769 198500 198338 197636 197617 198618 199140 198704 198640 199104 198513 196800 195899 196140 195618 193922
56603A93922j143n38j949l062j066J693J514n4O22K231R98j970k474o12Pr28o91
$$ 193922 192779 192241 190292 187230 186164 187857 189371 189317 189939 192170 193168 191198 188724 188112 188119 187191 186500
56586A86500N60K95r39m80R51N51p81J97K809L442K015J708K881K976J912K009
$$ 186500 187060 187355 186416 185936 186887 187438 186657 186854 189663 193105 195120 196828 199709 202685 204597 206606
56570B06606L078K932K194L229N027M641K830K827M300M190K781L118M974N267
$$ 206606 209684 212616 214810 218039 223066 227707 230537 233364 237664 241854 244635 247753 252727 257994
56556B57994M101M611O998Q325Q034Q329R305R085Q377R589J1823J2062J0763
$$ 257994 262095 266706 273704 282029 290063 298392 307697 316782 325159 334748 346571 358633 369396
56543C69396J0881J2085J1503R570R337J0526J0044P885O756O405M242J098K14
$$ 369396 380277 392362 403865 413435 422772 433298 443342 451227 457983 464388 468630 469728 469942
56530D69942R64l67l763n693n774p022r612j0685j0335j1375j3244j2550r775
$$ 469942 470906 470539 466776 461083 455309 448287 438675 427990 417655 406280 393036 380486 370711
56517C70711q917j0261j0154q197p928r735r923p708o532p412p431n877n493o499
$$ 370711 361794 351533 341379 333182 325254 315519 305596 297888 291356 283944 276513 270636 265143 258644
56503B58644n837l442k924m740n118l079k118l450l922k348j619k710k671n40
$$ 258644 252807 249365 246441 241701 236583 233504 231386 227936 224014 221666 220047 217337 214666 214126
56489B14126N94o10j495p57m84j278p78J280J986O87K13J397J783Q64J062K405
$$ 214126 214720 214110 212615 211858 211374 210096 209318 210598 212584 213271 213484 214881 216664 217528 218590 220995
56473B20995K038O8p3J879K311O10L53K291K784Q33Q9J835K591Q76qJ611K766
$$ 220995 223033 223101 223028 224907 227218 227828 228181 230472 233256 234089 234178 236013 238604 239480 239472 241083 243849
56456B43849J740J085K234K850J942K067M104N333M763M911O428O616N055M931
$$ 243849 245589 246674 248908 251758 253700 255767 259871 265204 269967 274878 281306 287922 292977 297908
56442B97908O895P575N937N143O314O613N354N577P652P885N566M763O820P855
$$ 297908 304803 312378 318315 323458 329772 336385 341739 347316 354968 362853 368419 373182 380002 387857
56428C87857O080M805N544N084K233O40J812K033n96k692k348k653n217o770n708
$$ 387857 393937 398742 404286 409370 411603 412243 414055 416088 415492 412800 410452 407799 402582 395812 390104
56413C90104n404p580q821p296o402q139r307q013p380r019r363o522m311n273
$$ 390104 384700 377120 368299 361003 354601 346462 337155 329142 321762 312743 303380 296858 292547 287274
56399B87274o119m293k720l639m005j560N06n16k042j676j730l896n201l594j975
$$ 287274 281155 276862 274142 270503 266498 264938 265444 264928 262886 261210 259480 255584 250383 246789 244814
56384B44814k484k483k09J386M79Q2J904K671N98p66O75J384q58k401p31O13j047
$$ 244814 242330 239847 239638 241024 241503 241585 243489 246160 246758 245992 246667 248051 247193 244792 244061 244674 243627
56367B43627k314m48J264J03o60J669L625K181O19K110L605K010L21J672L176
$$ 243627 241313 240865 242129 242232 241572 243241 246866 249047 249666 251776 255381 257391 257712 259384 262560
56352B62560J726J52J540L118J845M45J794K987J126o27J047L225K478J407L126
$$ 262560 264286 264438 265978 269096 270941 271386 273180 276167 277293 276666 277713 280938 283416 284823 287949
56337B87949M785L151J188K471M270K985J246K820N416N272M230N477O997N883
$$ 287949 292734 295885 297073 299544 303814 306799 308045 310865 316281 321553 325783 331260 338257 344140
56323C44140M580O296Q633Q166O851P709Q759P428O169P577Q793O917M921N999
$$ 344140 348720 355016 363649 371815 378666 386375 395134 402562 408731 416308 425101 432018 436939 442938
56309D42938P279N477L403M289N214K917O11J964L854K268M0J247L288K070r4
$$ 442938 450217 455694 459097 463386 468600 471517 472128 474092 477946 480214 480254 481501 484789 486859 486765
56294D86765N61J605o31l472k949j530l064n066l797j990l564n684m097j408j887
$$ 486765 487326 488931 488300 484828 481879 480349 477285 472219 468422 466432 462868 457184 453087 451679 449792
56279D49792l113j100J303k44k755j203K098K224J034K928N703M881K912M823
$$ 449792 446679 445579 446882 446638 443883 442680 444778 447002 448036 450964 456667 461548 464460 469283
56265D69283Q700R520Q633J0462J3575J3967J3520J6318K0310K1315K1452K4898
$$ 469283 477983 487503 496136 506598 520173 534140 547660 563978 584288 605603 627055 651953
56253F51953K9375L0613L1072L5230M0517M2123M2478M6600N2229N4236N4473
$$ 651953 681328 711941 743013 778243 818760 860883 903361 949961 1002190 1056426 1110899
56242A110899N7517O0755N8775N3620N0664M8196M1261L1945K5536K0279J1327
$$ 1110899 1168416 1229171 1287946 1341566 1392230 1440426 1481687 1513632 1539168 1559447 1570774
56231A570774J236m004n763r239j2802j1583p952p588q569n319RJ190l77J173
$$ 1570774 1572010 1568006 1562243 1553004 1540202 1528619 1520667 1513079 1504510 1499191 1499200 1500390 1500013 1501186
56217A501186M478L733M7j218j517o179j3334j7097j8923k4373l1565l4389l4339
$$ 1501186 1505664 1509397 1509444 1508226 1506709 1500530 1487196 1470099 1451176 1426803 1395238 1360849 1326510
56204A326510l7364m1832m1500l7794l7157l8814l7159l3453l3107l4049l0218
$$ 1326510 1289146 1247314 1205814 1168020 1130863 1092049 1054890 1021437 988330 954281 924063
56193I24063k3889k1994k2977k0020j4586j3556j5562j3593q820q181j0481q757
$$ 924063 900174 878180 855203 835183 820597 807041 791479 777886 769066 760885 750404 741647
56181G41647m377m598p962o519j099K47k281r72M058N134K080K270N788N301P07
$$ 741647 737270 732672 724710 718191 717092 717339 715058 714086 718144 723278 725358 727628 733416 738717 739424
56166G39424m95K166J498l066m714l024m456q816r263n982n841q477o941k027
$$ 739424 738929 741095 742593 739527 734813 731789 727333 718517 709254 703272 697431 688954 682013 679986
56152F79986j450m850m314K47J158j697q29L673M271J403L100Q928J0245O800
$$ 679986 678536 673686 669372 669619 670777 669080 668251 671924 676195 677598 680698 689626 699871 706671
56138G06671P111J1756J2581R183R716J4494J5362J2214J3345J8543J9079J5412
$$ 706671 713782 725538 738119 747302 757018 771512 786874 799088 812433 830976 850055 865467
56126H65467J7284K4968K8488K6991L0440M0128M6271M7440N3560O6670P7549
$$ 865467 882751 907719 936207 963198 993638 1033766 1080037 1127477 1181037 1247707 1325256
56115A325256Q4810R8466J20788J42145J59568J80508K04039K17169K14400K03186
$$ 1325256 1410066 1508532 1629320 1771465 1931033 2111541 2315580 2532749 2747149 2950335
56105B950335J86751J60517J29269J07961J00486R5918Q9062Q5020Q0299O1398
$$ 2950335 3137086 3297603 3426872 3534833 3635319 3731237 3820299 3905319 3985618 4047016
56095D047016K7900l503k3416l8277n0518n2696m7613n2178p3434j00485j25906
$$ 4047016 4074916 4071413 4047997 4009720 3959202 3906506 3858893 3806715 3733281 3632796 3506890
56084C506890j53993j82034j96042j92883j85453j79077j64421j40233j20101
$$ 3506890 3352897 3170863 2974821 2781938 2596485 2417408 2252987 2112754 1992653
56075A992653j08943r5555p6145o2211n7251m9258l4752k6322k7670k5413j4736
$$ 1992653 1883710 1788155 1712010 1649799 1592548 1543290 1508538 1482216 1454546 1429133 1414397
56064A414397q607j1973j1828k921J902k584l417M698Q685L340K182J0701J5154
$$ 1414397 1405790 1393817 1381989 1379068 1380970 1378386 1374969 1379667 1388352 1391692 1393874 1404575 1419729
56051A419729R825Q647J7408K1728J5438J3210K1595K5703J8598J5343K3269K7323
$$ 1419729 1429554 1438201 1455609 1477337 1492775 1505985 1527580 1553283 1571881 1587224 1610493 1637816
56039A637816K0085J6891K5436L0137K3049K0175L0052L6754L1580L0510M2027
$$ 1637816 1657901 1674792 1700228 1730365 1753414 1773589 1803641 1840395 1871975 1902485 1944512
56028A944512M9185M2573L9110M8645N4413M6690M2654N2183N7748M9648M6545
$$ 1944512 1993697 2036270 2075380 2124025 2178438 2225128 2267782 2319965 2377713 2427361 2473906
56017B473906N8841O7168O0247N7766P1566Q1405P4435P0771Q3629R2867Q5437
$$ 2473906 2532747 2599915 2660162 2717928 2789494 2870899 2945334 3016105 3099734 3192601 3278038
56006C278038Q2403R7415J08858J02698J01193J18548J31140J23781J21157J39859
$$ 3278038 3360441 3457856 3566714 3669412 3770605 3889153 4020293 4144074 4265231 4405090
55996D405090J55062J49869J50289J74206J94604J92416J95323K23127K47024
$$ 4405090 4560152 4710021 4860310 5034516 5229120 5421536 5616859 5839986 6087010
55987F087010K46356K51369K83916L12336L13670L21937L62985M02668M14523
$$ 6087010 6333366 6584735 6868651 7180987 7494657 7816594 8179579 8582247 8996770
55978H996770M35055M93375N52623N83544O26380P13247Q02721Q62800R40968
$$ 8996770 9431825 9925200 10477823 11061367 11687747 12400994 13203715 14066515 15007483
55969A5007483J075475J220304J341232J497461J737835K012459K286375K635292
$$ 15007483 16082958 17303262 18644494 20141955 21879790 23892249 26178624 28813916
55961B8813916L116587L658541M202595M833430N631881O540512P535552Q776029
$$ 28813916 31930503 35589044 39791639 44625069 50256950 56797462 64333014 73109043
55953G3109043J0401853J2371125J4710984J7695172K1514173K6106871L1675560
$$ 73109043 83510896 95882021 110593005 128288177 149802350 175909221 207584781
55946B07584781L8697892M6256887N0434270M5963771L0784650Q740416j2925774
$$ 207584781 246282673 292539560 342973830 388937601 419722251 428462667 415536893
55939D15536893k8676485l7207508m0024819l9061294l5842018l1658724k7455130
$$ 415536893 386860408 349652900 309628081 270566787 234724769 203066045 175610915
55932A75610915k3586245k0068592j6974171j4397951j2261270j0418613q857371
$$ 175610915 152024670 131956078 114981907 100583956 88322686 77904073 69046702
55925F9046702p614506o609733n726693m963640m360253l862792l392161k966347
$$ 69046702 61432196 54822463 49095770 44132130 39771877 35909085 32516924 29550577
55917B9550577k635517k366079k097597j848544j663565j515415j353988j197598
$$ 29550577 26915060 24548981 22451384 20602840 18939275 17423860 16069872 14872274
55909A4872274j087128j000637q96528p93577p29316o83632o18259n49965n13341
$$ 14872274 13785146 12784509 11887981 11094404 10365088 9681456 9063197 8513232 7999891
55900G999891m90524m46207l95252l70151l56354l22795k83593k68775k64571
$$ 7999891 7509367 7063160 6667908 6297757 5941403 5618608 5335015 5066240 4801669
55891D801669k41138k10483k00632j99878j81008j54903j47591j48697j33341
$$ 4801669 4560531 4350048 4149416 3949538 3768530 3613627 3466036 3317339 3183998
55882C183998j11747j07941j11642r9073q0191p8619q4945p5442n7971n5025n9321
$$ 3183998 3072251 2964310 2852668 2753595 2673404 2594785 2509840 2434398 2376427 2321402 2262081
55871B262081m9513l2864l0190l4364k4699p373j850j717J2243L3834M3950M7668
$$ 2262081 2212568 2179704 2149514 2115150 2090451 2083078 2081228 2079511 2091754 2125588 2169538 2217206
55859B217206O1773P7946P4827N5313L7187J8461j3415m9132o8863p6335q8968
$$ 2217206 2278979 2356925 2431752 2487065 2524252 2542713 2529298 2480166 2411303 2334968 2246000
55848B246000j03754j04977r6440r4083r5069q5083o8382o0653n9610n1747m0520
$$ 2246000 2142246 2037269 1940829 1846746 1751677 1666594 1598212 1537559 1477949 1426202 1385682
55837A385682l9381m4302m1195l3344l4173m0045l7335k9303k9278l4037l0383
$$ 1385682 1346301 1301999 1260804 1227460 1193287 1153242 1115907 1086604 1057326 1023289 992906
55826I92906k1340j9818k2881j8221r699j0504j7006j5083o804n319q558l420
$$ 992906 971566 951748 928867 910646 900947 890443 873437 858354 851550 846231 837673 834253
55814H34253Q401J3834J3766K0594L3800M1033M0090L7512K9777Q910j6823l0655
$$ 834253 842654 856488 870254 890848 924648 965681 1005771 1043283 1073060 1081970 1065147 1034492
55802A034492l2612l5581m0409l7415k8807k6472k9766k7698k1024k0490k5130
$$ 1034492 1001880 966299 925890 888475 859668 833196 803430 775732 754708 734218 709088
55791G09088k3860j7007j5154j8066j5602q335o739j0853j0762o333o770j1400
$$ 709088 685228 668221 653067 635001 619399 611064 604325 593472 582710 576377 569607 558207
55779E58207j0544m708l654p050n196J589L426L54K321R562J1491N775P18j616
$$ 558207 547663 542955 539301 532251 527055 528644 532070 532424 534745 544307 555798 561573 562291 560675
55765E60675p125j4348j4972j0195r728j4092j4443r859q079r310o270m08j073
$$ 560675 553550 539202 524230 514035 504307 490215 475772 465913 457834 448524 442254 441846 440773
55752D40773q120j1939j1017j2902j7559j6829j0991q992j1410r828l955k461
$$ 440773 432653 420714 409697 396795 379236 362407 351416 342424 331014 321186 317231 314770
55740C14770n758m952N41J326m044o256k739j581n158n907j670K67k243k545O79
$$ 314770 309012 304060 304601 305927 301883 295627 292888 291307 286149 280242 278572 278839 276596 274051 274730
55725B74730L64m686o855m232l840p396p914l709j850m357m698j191l17l480l939
$$ 274730 275094 270408 263553 259321 255481 248085 240171 236462 234612 230255 225557 224366 224049 220569 216630
55710B16630j49J152j645j877K038L460R75J499O511Q570N278L465N624N436J007
$$ 216630 216481 217633 215988 214111 216149 219609 220584 222083 228594 237164 242442 245907 251531 256967 257974
55695B57974n78L426O199M061K181L055J531l878o731m573l597o668q058m976
$$ 257974 257396 260822 267021 271082 273263 276318 277849 273971 267240 262667 259070 252402 244344 239368
55681B39368l028n196o328l579j747l443m327k614k971o522p519m284k949n879
$$ 239368 236340 231144 224816 221237 219490 216047 211720 209106 206135 199613 192094 187810 184861 178982
55667A78982p057l607j244l330m857k527o45j862j933J200K703K90j117R83J852
$$ 178982 171925 168318 167074 163744 158887 156360 155715 153853 151920 153120 155823 156113 154996 155979 157831
55652A57831q66k149P49K939J173o16J56k75l617n143k642r31k667l449q07Q22
$$ 157831 156965 154816 155565 158504 159677 159061 159217 158942 155325 150182 147540 146609 143942 140493 139686 140508
55636A40508j233k950j976k076m683n092j688Q9k165l086J67K302j9j877L36K160
$$ 140508 139275 136325 134349 132273 127590 122498 120810 120899 118734 115648 115815 118117 118098 116221 116557 118717
55620A18717j2j985q0J955O67n55J212K334P6j548M36J954k68k236l52J710J22
$$ 118717 118705 116720 116640 118595 119262 118707 119919 122253 122329 120781 121217 123171 122903 120667 120315 122025 122147
55603A22147k100j398l22j773l068j740q58k882m428k699q22j509j815N02J982
$$ 122147 120047 118649 118327 116554 113486 111746 110888 108006 103578 100879 100057 98548 96733 97235 99217
55588I9217K01j114Q48K448O10j239J81J969J252Q95L273M840K786P70K214M088
$$ 99217 99418 98304 99152 101600 102210 100971 101152 103121 104373 105268 108541 113381 116167 116937 119151 123239
55572A23239L150K254M529P298P662Q195J1348J4087J3901J4141J7626K0913K0717
$$ 123239 126389 128643 133172 140470 148132 156327 167675 181762 195663 209804 227430 248343 269060
55559B69060J9921K1187K0752J4954P184J954k399q773j4652j6841j7579j9651
$$ 269060 288981 310168 330920 345874 353058 355012 352613 343840 329188 312347 294768 275117
55547B75117k0554j7712j4423j4316j4903j2749j0034r870j0071p802n528o083
$$ 275117 254563 236851 222428 208112 193209 180460 170426 160556 150485 142683 137155 131072
55535A31072o747m398j804k475m080l165j729k783m068k567p20j739l273k092
$$ 131072 124325 119927 118123 115648 111568 108403 106674 103891 99823 97256 96536 94797 91524 89432
55521H9432o01k134m182l012p75j400l304k926j702k853m750m008j911j553j821
$$ 89432 88831 86697 82515 79503 78728 77328 74024 71098 69396 66543 61793 57785 55874 54321 52500
55506E2500k18J682J406P46K088L230J538n48O9J155m89k697k058m50j232k696
$$ 52500 52282 53964 55370 56116 58204 61434 62972 62424 62493 63648 63159 60462 58404 57954 56722 54026
55490E4026j685J4p03j920m16J827J319k49N04J921P00j362p76P16n11k782k115
$$ 54026 52341 52355 51652 49732 49316 51143 52462 52213 52717 54638 55338 53976 53200 53916 53405 50623 48508
55473D8508L54P17n19k49P73j50j685r27O24k34k095j628J5k17j002N82K637J519
$$ 48508 48862 49579 49060 48811 49584 49434 47749 46822 47446 47212 45117 43489 43504 43287 42285 42867 45504 47023
55455D7023j145j197N69M19j031m21J481J317j42L85K026J320j007j393j40m14
$$ 47023 45878 44681 45250 45669 44638 44217 45698 47015 46873 47258 49284 50604 49597 48204 48064 47650
55439D7650j864j579l3K0p20M28K397K128N50P83J961J068p43k9K257K384P81
$$ 47650 45786 44207 44174 44194 43474 43902 46299 48427 48977 49760 51721 52789 52046 52017 54274 56658 57439
55422E7439Q95K362J874j72m35Q62N05j344j646n46q52k155j642M6j27j406l00
$$ 57439 58334 60696 62570 62398 61963 62825 63330 61986 60340 59794 58942 56787 55145 55191 55064 53658 53358
55405E3358K808M237L632L867M954M252K360K623M928N880M969M705M974L206
$$ 53358 56166 60403 64035 67902 72856 77108 79468 82091 87019 92899 97868 102573 107547 110753
55391A10753o6j676j723l179n869o623n328m967n727m871k492j629k487k207m93
$$ 110753 110687 109011 107288 104109 98240 91617 86289 81322 75595 70724 68232 66603 64116 61909 61416
55376F1416J8r41r66M5m6q16NJ441N09j775j586P84J267p64j744o09j02r34p32
$$ 61416 61434 60493 59527 59572 59526 58710 58715 60156 60665 58890 57304 58088 59355 58591 56847 56238 56136 55202 54470
55357E4470N69K07j743k039l01K89r38j072N14R51m46q66M71R85k1j02J156R51
$$ 54470 55039 55246 53503 51464 51163 51452 50514 49442 49956 50907 50461 49595 50066 51051 51030 50928 52084 53035
55339E3035j413l042k500j599j187PJ539J125q36j406l47k90j324p41J358J744
$$ 53035 51622 48580 46080 44481 43294 43301 44840 45965 45129 43723 43376 43086 41762 41021 42379 44123
55323D4123R9k88J201J359o00j428jO80o32j138M38J324k9j167l75N09K15M16
$$ 44123 44222 43934 45135 46494 45894 44466 44465 45145 44513 43375 43813 45137 45108 43941 43566 44075 44290 44706
55305D4706J912K700J843J136J263M71j422j945m41O05Q9j06O95O81l00J43K114
$$ 44706 46618 49318 51161 52297 53560 54031 52609 50664 50223 50828 50917 50811 51506 52187 51887 52030 54144
55288E4144K481K76j516j204q45j776k294j559j352k136j718L47J444O16K09J128
$$ 54144 56625 56901 55385 54181 53336 51560 49266 47707 46355 44219 42501 42848 44292 44908 45117 46245
55272D6245J110n62j307j86J42j459k222n70J024P29M63J708K466J177k56m4N37
$$ 46245 47355 46793 45486 45300 45442 43983 41761 41191 42215 42944 43407 45115 47581 48758 48502 48458 48995
55255D8995K13J43R26Q50o39j300j17P03j59p81Q7O14l71r67N6P38m39j810j731
$$ 48995 49208 49351 50277 51127 50488 49188 49071 49774 49615 48834 48921 49535 49164 48197 48253 48991 48552 46742 45011
55236D5011j237j341j023Q3L77m17j07J927L164K223J044R06K19j710k643j439
$$ 45011 43774 42433 41410 41493 41870 41453 41346 43273 46437 48660 49704 50610 50829 49119 46476 45037
55220D5037l12p60r92K82J264O47J25Q94J279K07n19K38P68J50K58J783K190K29
$$ 45037 44725 43965 42973 43255 44519 45166 45291 46185 47464 47671 47152 47390 48158 48308 48566 50349 52539 52768
55202E2768j332l35J203R51R5L32N84k82p30M40J508J005L76Q99J143J23m63L10
$$ 52768 51436 51101 52304 53255 53350 53682 54266 53984 53254 53694 55202 56207 56583 57482 58625 58748 58285 58595
55184E8595L69j395k551j396j65q89j685m86J021O29l97r8M36l30r55J65J282
$$ 58595 58964 57569 55018 53622 53457 52568 50883 50397 51418 52047 51650 51552 51988 51658 50703 50868 52150
55167E2150J70j869k308j443j042j046o21l27n76j69J208J583J09r85k68K68r24
$$ 52150 52320 50451 48143 46700 45658 44612 43991 43664 43088 42919 44127 45710 45819 44834 44566 44834 43910
55150D3910j872q54J81p22j725o55R45Q92M61J559K651J609N6O65K383K445J197
$$ 43910 42038 41184 41365 40643 38918 38263 39208 40100 40561 42120 44771 46380 46436 47101 49484 51929 53126
55133E3126Q61J296Q74MJ21N78l3q57l24P85Q38M40J026K019K217K259K972L176
$$ 53126 53987 55283 56157 56161 56282 56860 56827 55970 55646 56431 57269 57709 58735 60754 62971 65230 68202 71378
55115G1378J946J024J955K947J731o12j782k143l167m077l467k403k511k724j333
$$ 71378 73324 74348 76303 79250 80981 80369 78587 76444 73277 69200 65733 63330 60819 58095 56762
55100E6762N16P28p1p4K19n35j259k18J467J599P74J073K159K077Q87K50L95M23
$$ 56762 57278 58006 57935 57861 58080 57545 56286 56068 57535 59134 59908 60981 63140 65217 66104 66354 66749 67172
55082F7172N54J312J710R26L04J086J826Q18o77n65N14P94O99J411J879O21j134
$$ 67172 67726 69038 70748 71674 71978 73064 74890 75708 75031 74466 74980 75774 76473 77884 79763 80384 79250
55065G9250j336o61r11j483p54M98M50l89l51J92n0m49J54P55N3o34L91J766J285
$$ 79250 77914 77253 76342 74859 74105 74603 75053 74664 74313 74505 74455 74006 74160 74915 74968 74334 74725 76491 77776
55046G7776j38k39M39n1j042n21Q22O75o71r32J82J093J567K462L143K449J356
$$ 77776 77638 77399 77838 77787 76745 76224 77046 77721 77050 76118 76300 77393 78960 81422 84565 87014 88370
55029H8370J456J881Q94o89r47l88o30r91Q4J565J490Q14J762L570L743K436J735
$$ 88370 89826 91707 92601 91912 90965 90577 89947 88956 89040 90605 92095 92909 94671 98241 101984 104420 106155
55012A06155J577M45r18n50P77O83n24o80j30j090l213m002l233k896l100k183
$$ 106155 107732 108177 107259 106709 107486 108169 107645 106965 106835 105745 102532 98530 95297 92401 89301 87118
54996H7118o01o07k040k479j588j416k325k505j621j259j563j080j1k8q55o21
$$ 87118 86517 85910 83870 81391 79803 78387 76062 73557 71936 70677 69114 68034 68023 67995 67140 66519
54980F6519M56M07n51k47J304J787P69K35P60R01N71J199K361K051O24N79K072
$$ 66519 66975 67382 66831 66584 67888 69675 70444 70679 71439 72340 72911 74110 76471 78522 79146 79725 81797
54963H1797K600J605J380K664L402K804K800M264N471N545N955P274P853P074
$$ 81797 84397 86002 87382 90046 93448 96252 99052 103316 108787 114332 120287 127561 135414 142488
54949A42488O849Q349J0109J0704J0687J0740J0456J0006J0442J1358J0674P654
$$ 142488 149337 157686 167795 178499 189186 199926 210382 220388 230830 242188 252862 260516
54937B60516L856M20l141o892r706j1252j2437j3423j3421j2664j2240j1838j0218
$$ 260516 264372 264792 261651 254759 245053 233801 221364 207941 194520 181856 169616 157778 147560
54924A47560p853o480o032m916l266k838l593l568k348j545j496q11N07Q16J64
$$ 147560 139707 133227 127195 122279 119013 116175 112582 109014 106666 105121 103625 102814 103321 104137 104301
54909A04301O04K524L944M041M263N274O061O645Q428J1061J2272J1607J1110
$$ 104301 104905 107429 111373 115414 119677 124951 131012 137657 146085 157146 169418 181025 192135
54896A92135J1476J0765P917M285P83l280p537r986j0235j0260j0928j0802r433
$$ 192135 203611 214376 222293 226578 227361 224081 216544 206558 196323 186063 175135 164333 154900
54883A54900q516q670q204o422m938m468l425j125O80Q77P11R64M60j153k052
$$ 154900 146384 137714 129510 123088 118150 113682 110257 109132 109812 110689 111400 112364 112824 111671 109619
54868A09619j314o09j247k154k299k481l162l134j911r76j190j327n72l5m73r16
$$ 109619 108305 107696 106449 104295 101996 99515 96353 93219 91308 90332 89142 87815 87243 87208 86735 85819
54852H5819q43j252k370k753j856j005p52L7J439J712N23j25N26N27j151k565
$$ 85819 84976 83724 81354 78601 76745 75740 74988 75025 76464 78176 78699 78574 79100 79627 78476 75911
54836G5911k162j272j393j722j316r96j260q71N45J149L4q37P4J243Q52k33m39
$$ 75911 73749 72477 71084 69362 68046 67050 65790 64919 65464 66613 66647 65810 65884 67127 67979 67746 67307
54819F7307k27n91q69k51M11L21M27J462K203J515M05K34O16P38R88J714K193
$$ 67307 67080 66489 65620 65369 65780 66101 66528 67990 70193 71708 72113 72347 72963 73701 74689 76403 78596
54802G8596K229K894M311M873M038L592M626N690N696O135Q418J1282J2949J3778
$$ 78596 80825 83719 88030 92903 96941 100533 105159 110849 116545 122680 131098 142380 155329 169107
54788A69107J4747J5309J4819J4108J3653J2087Q528M421J217j793n405q318r242
$$ 169107 183854 199163 213982 228090 241743 253830 262358 266779 267996 266203 260798 252480 243238
54775B43238r203r594r784q803p640p499p462o094l983k505j499j93R96J528K249
$$ 243238 234035 224441 214657 205854 198214 190715 183253 177159 173176 170671 169172 168979 169975 171503 173752
54760A73752L884N470O161P131R747J3143J5569J6945J8285J9798K1151K2468
$$ 173752 177636 183106 189267 196398 206145 219288 234857 251802 270087 289885 311036 333504
54748C33504K3460K2900K0295J6813J3313R100L853j043m641q069j2432j6842
$$ 333504 356964 379864 400159 416972 430285 439385 443238 442195 437554 429485 417053 400211
54736D00211k0061k2368k4213k4792k3614k1745k0005j7685j4581j2227j1516
$$ 400211 380150 357782 333569 308777 285163 263418 243413 225728 211147 198920 187404
54725A87404j1064r632q120p479o826n495m697n163n305l856k213j960k187j540
$$ 187404 176340 166708 158588 151109 144283 138788 134091 128928 123623 119767 117554 115594 113407 111867
54711A11867q76j414k262k173j944k608l087k201j132j390k009j349o4L59L70
$$ 111867 110991 109577 107315 105142 103198 100590 97503 95302 94170 92780 90771 89422 89358 89717 90087
54696I0087J097J809J358O20R60J674J462J004J500K071J329J00JN65M71J89P60
$$ 90087 91184 92993 94351 94971 95931 97605 99067 100071 101571 103642 104971 105071 105072 105637 106108 106297 107057
54679A07057J318P08K32J810M472N680N233M970N443N725N835O541P305P025O263
$$ 107057 108375 109083 109315 111125 115597 121277 126510 131480 136923 142648 148483 155024 162329 169354 175617
54664A75617O349O895O596N713N366N197M207L146L485M751N346N437O505Q528
$$ 175617 181966 188861 195457 201170 206536 211733 215940 219086 222571 227322 232668 238105 244610 253138
54650B53138J0124J1037J2366J4679J7826K1904K6539L0198L2170L4103L7422
$$ 253138 263262 274299 286665 301344 319170 341074 367613 397811 429981 464084 501506
54639E01506M0427M0281L6551L0367K1489R267m543j6878k6693l4585l9999m1726
$$ 501506 541933 582214 618765 649132 670621 679888 675345 658467 631774 597189 557190 515464
54627E15464m0522l8372l5728l1980k7943k5081k2852j9591j5518j2241r954p838
$$ 515464 474942 436570 400842 368862 340919 315838 292986 273395 257877 245636 235682 227844
54615B27844o476o807p371n726k302J42O03L93J6j299k995l337k438k282l456
$$ 227844 221368 214561 207190 201464 199162 199304 199907 200300 200316 199017 196022 192685 190247 187965 184509
54600A84509m537m826n041n178m424l359l566m805n162m236l578l712l434k405
$$ 184509 179972 175146 170105 164927 160503 157144 153578 148773 143611 139375 135797 132085 128651 126246
54586A26246j828k086k122j677j751k391k334j322o14p98j144j440k200k900k210
$$ 126246 124418 122332 120210 118533 116782 114391 112057 110735 110121 109323 108179 106739 104539 101639 99429
54571I9429m28N52L5o92o89l62L7P92J284L60j512k419j625j84J083K202K670
$$ 99429 99001 99553 99588 98896 98207 97845 97882 98674 99958 100318 98806 96387 94762 94578 95661 97863 100533
54554A00533J745L10K13J501K418K347K476L308L815L576L583M365N229N870O809
$$ 100533 102278 102588 102801 104302 106720 109067 111543 114851 118666 122242 125825 130190 135419 141289 148098
54539A48098P949Q523Q809R949J1862J3220J3756J4589J6078J7248J7562J7306
$$ 148098 156047 164570 173379 183328 195190 208410 222166 236755 252833 270081 287643 304949
54527C04949J6098J3001Q370L668p16n546j0618j4581j6935j8233j8367j6860
$$ 304949 321047 334048 342418 346086 345370 339824 329206 314625 297690 279457 261090 244230
54515B44230j4798j4043j4375j3758j1666r755q980q425p399o370n394l826k044
$$ 244230 229432 215389 201014 187256 175590 165835 156855 148430 141031 134661 129267 125441 123397
54502A23397j324j597j511q95r32j670j749r61o25j046j047m30l81r21n83Q03
$$ 123397 122073 120476 118965 118070 117138 115468 113719 112758 112133 111087 110040 109610 109229 108308 107725 108528
54486A08528J524R96P56J539J945J035o3j86K57P45J582K530K524J597J081J195
$$ 108528 110052 111048 111804 113343 115288 116323 116260 116074 116331 117076 118658 121188 123712 125309 126390 127585
54470A27585O83n47p75N70J720J374N02J98k0o39r03m18q7l84n36l42q25k088
$$ 127585 128268 127721 126946 127516 129236 130610 131112 131310 131290 130651 129748 129330 129243 128859 128323 127981 127156 125068
54452A25068k600j671o63o55r06p44r07j793k324j840j316j519j699j296j046
$$ 125068 122468 120797 120134 119479 118573 117829 116922 115129 112805 110965 109649 108130 106431 105135 104089
54437A04089j257q84L97J049K9j376j485m89M35R21J046N87k92p58n71l82l22
$$ 104089 102832 101948 102345 103394 103423 102047 100562 100073 100508 101429 102475 103062 102770 102012 101441 101059 100737
54420A00737K08Q89N41o15p78O29J942J980J632J751J672R86P26J458K121K069
$$ 100737 100945 101834 102375 101760 100982 101611 103553 105533 107165 108916 110588 111574 112300 113758 115879 117948
54404A17948K317L497M437M250M012M911O310P063P179P020O312N159M388L940
$$ 117948 120265 123762 128199 132449 136461 141372 147682 154745 161924 168944 175256 180415 184803 188743
54390A88743K589K57j301j248j097k173l609m245m477m782m384l036k220k918
$$ 188743 191332 191589 190288 189040 187943 185770 182161 177916 173439 168657 164273 161237 159017 156099
54376A56099l828l503k643k604l164l375l207k905k120j067r68j996k453j310
$$ 156099 152271 148768 146125 143521 140357 136982 133775 130870 128750 127683 126715 124719 122266 120956
54362A20956J61O77Q98J551J673O08j52P99K302K494J712J528K134K737L320M197
$$ 120956 121117 121794 122692 124243 125916 126524 126372 127171 129473 131967 133679 135207 137341 140078 143398 147595
54346A47595M822M751M674N064N081M309L954M745N214L948J964Q80K70j033k396
$$ 147595 152417 157168 161842 166906 171987 176296 180250 184995 190209 194157 196121 197001 197271 196238 193842
54331A93842k464j696j607k372l132l822m823n686n970o369p299p535o104m364
$$ 193842 191378 189682 188075 185703 182571 178749 173926 168240 162270 155901 148602 141067 134963 130599
54317A30599m150m935m906l901l132k825k284j698j855k510k795k747k796k560
$$ 130599 126449 121514 116608 112707 109575 106750 104466 102768 100913 98403 95608 92861 90065 87505
54303H7505j687j123j792k863l010k521k363k220j299j93Q8P0P31J322N05j044
$$ 87505 85818 84695 82903 80040 77030 74509 72146 69926 68627 68434 68522 68592 69323 70645 71150 70106
54287G0106j416m63K05o5m36n40r15j476j382o12n5l3o3nj03j00L30O69K51m51
$$ 70106 68690 68227 68432 68367 67931 67391 66476 65000 63618 63006 62951 62918 62855 62850 62747 62647 62977 63646 63897 63446
54267F3446n79l61m58m64L85J515J670R27M68O90R91J141J357J308N75j57K12
$$ 63446 62867 62506 62048 61584 61969 63484 65154 66081 66549 67239 68230 69371 70728 72036 72611 72454 72666
54250G2666J394K007J524P36L82M11N99Q16Q31N63L37K97J42r3J84R05R97Lj063
$$ 72666 74060 76067 77591 78327 78709 79120 79719 80535 81366 81929 82266 82563 82705 82612 82796 83701 84698 84701 83638
54231H3638j326j257j234n48R04J493J36j715k143j529j362j519r78j60l22j172
$$ 83638 82312 81055 79821 79273 80177 81670 81806 80091 77948 76419 75057 73538 72560 72400 72078 70906
54215G0906j305n56j5l4p8j52o90j361j522j398j438j192k99K59l79j157o70L70
$$ 70906 69601 69045 69030 68996 68918 68766 68076 66715 65193 63795 62357 61165 60866 61125 60746 59589 58919 59289
54197E9289K48q57j287o52j38l23o80r73j328j271l71N31M05j38R4P08M26m71
$$ 59289 59537 58680 57393 56741 56603 56280 55600 54627 53299 52028 51657 52188 52593 52455 52549 53257 53683 53212
54179E3212n45L59J043J028Q46N03m32j472j709j386j308j199l85M80L74m1O01
$$ 53212 52667 53026 54069 55097 55943 56446 56014 54542 52833 51447 50139 48940 48555 49035 49409 49368 49969
54162D9969J810J922R07K93M61L31m10q64p14m68n7P97J145k2j486j066R21J955
$$ 49969 51779 53701 54608 54901 55362 55693 55283 54419 53705 53237 53180 53977 55122 55100 53614 52548 53469 55424
54144E5424J152K49M18O81J58l88j30N32J038J395J356M65o72p47K48R43O58N
$$ 55424 56576 56825 57243 57924 58082 57694 57564 58096 59134 60529 61885 62350 61678 60931 61179 62122 62780 62785
54126F2785p03j750k629k222p28L38M24N03J107J497J261J011J079J033P93P91
$$ 62785 62082 60332 57703 55481 54753 55091 55515 56018 57125 58622 59883 60894 61973 63006 63799 64590
54110F4590Q20K52n68o91l37n43j058n18J081K095J734J020Q07O89L33K08L98
$$ 64590 65410 65662 65094 64403 64066 63523 62465 61947 63028 65123 66857 67877 68684 69373 69706 69914 70312
54093G0312L26L3K51Q64P98j63j016j172j029q20l89j43o40j221p72L02N54r0
$$ 70312 70638 70671 70922 71786 72584 72421 71405 70233 69204 68384 67995 67852 67212 65991 65219 65521 66075 65985
54075F5985m17k06l53p72m88J81j19j100r34N92J605J256Q53J134J032P0m43K19
$$ 65985 65568 65362 65009 64237 63749 63930 63811 62711 61777 62369 63974 65230 66083 67217 68249 68319 67876 68095
54057F8095Q57N35P0J89K61l6K36J343J910J135K12L08Q44R90J175J891K532K592
$$ 68095 68952 69487 69557 69746 70007 69971 70207 71550 73460 74595 74807 75115 75959 76949 78124 80015 82547 85139
54039H5139K599K754K276J086M60R60J331O68J9N25J563K043K124K328K325J944
$$ 85139 87738 90492 92768 93854 94314 95274 96605 97273 97292 97817 99380 101423 103547 105875 108200 110144
54023A10144K075L263M510M734M301M062M011L945M258M995N225M455L549L325
$$ 110144 112219 115482 119992 124726 129027 133089 137100 141045 145303 150298 155523 159978 163527 166852
54009A66852L304K836K243J935J570R86Q78J521K035J743J168Q19K42q43j729
$$ 166852 170156 172992 175235 177170 178740 179726 180604 182125 184160 185903 187071 187890 188132 187289 185560
53994A85560j945k139k778l218k914k487k653l160l512l695l557k652j338p38
$$ 185560 183615 181476 178698 175480 172566 170079 167426 164266 160754 157059 153502 150850 149512 148774
53980A48774j108j504j542j854k404k108r16l15j008j897k226k732l666l840k902
$$ 148774 147666 146162 144620 142766 140362 138254 137338 137023 136015 134118 131892 129160 125494 121654 118752
53965A18752k422l240l718k427o08j03n49n22m1J26K48P86R87K30l77L09J334
$$ 118752 116330 113090 109372 106945 106337 106234 105685 105163 105122 105248 105496 106282 107269 107499 107122 107431 108765
53948A08765J167L17L19J018J012K32o3N12J136J474K026K822L227L030K578K028
$$ 108765 109932 110249 110568 111586 112598 112830 112767 113279 114415 115889 117915 120737 123964 126994 129572 131600
53932A31600J444J324K108L399M504N254N651N433M678M113M056L921L361K864
$$ 131600 133044 134368 136476 139875 144379 149633 155284 160717 165395 169508 173564 177485 180846 183710
53918A83710K537J576j52j358j246q19j079j265l15J205K127K604L458M502M955
$$ 183710 186247 187823 187671 186313 185067 184248 183169 181904 181589 182794 184921 187525 190983 195485 200440
53903B00440M766M322L652L090L613N341O837P094O989P420P501O230M572L969
$$ 200440 205206 209528 213180 216270 219883 225224 232061 239155 246144 253564 261065 267295 271867 275836
53889B75836L938L133J780R93N45n92k072k578j986j297r02o05r27k513m615n864
$$ 275836 279774 282907 284687 285680 286225 285633 283561 280983 278997 277700 276798 276193 275266 272753 268138 262274
53873B62274o196o458o553n752m461l883m158m382m303m401m543m099l286k969
$$ 262274 256078 249620 243067 237315 232854 228971 224813 220431 216128 211727 207184 203085 199799 196830
53859A96830l273l663m091m752n088m459l480l239l602l631l341l474l873l675
$$ 196830 193557 189894 185803 181051 175963 171504 168024 164785 161183 157552 154211 150737 146864 143189
53845A43189k863k207j854j392j073j535k448k844k620k457k456k121j462q65
$$ 143189 140326 138119 136265 134873 133800 132265 129817 126973 124353 121896 119440 117319 115857 114992
53831A14992j90P27J149L60q73j231q32p83j155j040l73Ml0K06O54N19j42l38
$$ 114992 114802 115529 116678 117038 116165 114934 114102 113319 112164 111124 110751 110755 110725 110931 111585 112104 111962 111624
53813A11624J52M55J20l00l76l40l68l62m91q99j057l65P40J379J545J747J754
$$ 111624 111776 112231 112351 112051 111675 111335 110967 110605 110114 109215 108158 107793 108533 109912 111457 113204 114958
53796A14958J061K58M37J487K361K839L485M075L695K562K149L215M868N893N895
$$ 114958 116019 116277 116714 118201 120562 123401 126886 130961 134656 137218 139367 142582 147450 153343 159238
53781A59238N094M028L478L698L833L080K109K149L043L545L290K973K813K366
$$ 159238 164332 168360 171838 175536 179369 182449 184558 186707 189750 193295 196585 199558 202371 204737
53767B04737J781J731K043J817R81L39M9n15j317j569j265j396k373l521m300
$$ 204737 206518 208249 210292 212109 213090 213429 213478 212963 211646 210077 208812 207416 205043 201522 197222
53752A97222m799m924m392l684l627l981l720k844k426k748k879k436k214k601
$$ 197222 192423 187499 183107 179423 175796 171815 168095 165251 162825 160077 157198 154762 152548 149947
53738A49947k861k544k365k897l556l583l101k527j769o51M33Q49L27q78k016
$$ 149947 147086 144542 142177 139280 135724 132141 129040 126513 124744 124093 124526 125375 125702 124824 122808
53723A22808k181j208o6L38M03J000J862J954J194N13K97Q8j66J04Q99J427J354
$$ 122808 120627 119419 119353 119691 120094 121094 122956 124910 126104 126617 126914 127002 126836 126940 127839 129266 130620
53706A30620J120R10L69m71j044j160j163j120q41n99q09j011l27J044J943J813
$$ 130620 131740 132650 133019 132548 131504 130344 129181 128061 127220 126621 125812 124801 124474 125518 127461 129274
53690A29274J097J65r27j653j308j78P20J137J598K045J819J057O72Q12O76N7
$$ 129274 130371 130536 129609 127956 126648 126470 127190 128327 129925 131970 133789 134846 135518 136330 137006 137063
53674A37063k85L2N21R25J533K196K318K007J966K073J420J9r59r48o61o24m14
$$ 137063 136778 136810 137331 138256 139789 141985 144303 146310 148276 150349 151769 151788 150829 149881 149220 148596 148182
53657A48182K28P54P76N62K34m39j151j137m56l9j88l03k15n12j152j204m43J19
$$ 148182 148410 149164 149940 150502 150736 150297 149146 148009 147553 147514 147326 147023 146808 146296 145144 143940 143497 143616
53639A43616j60o25n25m9L68P22R29P04L03L69P50N62k29n86n2N21L82j41m99
$$ 143616 143456 142831 142306 142257 142625 143347 144276 144980 145283 145652 146402 146964 146735 146149 146097 146618 147000 146859 146360
53620A46360o17m02L72J319J677J531J635J957J685Q87O80J315J707J282Q66J139
$$ 146360 145743 145341 145713 147032 148709 150240 151875 153832 155517 156404 157084 158399 160106 161388 162254 163393
53604A63393J618J846K173K728K904K589K582L167L603L493L394L456L007K092
$$ 163393 165011 166857 169030 171758 174662 177251 179833 183000 186603 190096 193490 196946 199953 202045
53590B02045J804K394K608J928J677K775L929L593K386J972K513K795K219J331
$$ 202045 203849 206243 208851 210779 212456 215231 219160 222753 225139 227111 229624 232419 234638 235969
53576B35969Q00R65J916L087L377K454J339R96J104R91Q57J156J514J327Q33O05
$$ 235969 236769 237734 239650 242737 246114 248568 249907 250903 252007 252998 253855 255011 256525 257852 258685 259290
53560B59290N32J58l96o47n02j86J74L78Q4n83q90m36L05P32Q39Q14O46M90P40
$$ 259290 259822 259980 259584 258937 258435 258249 258423 258801 258885 258302 257412 256976 257281 258013 258852 259666 260312 260802 261542
53541B61542J396J953K146K133J841J059K47K44R60J459J484J694K207K310J906
$$ 261542 262938 264891 267037 269170 271011 272070 272317 272561 273521 274980 276464 278158 280365 282675 284581
53526B84581J839K307K508K358L003M839O572P090O926O877O689O162O143P183
$$ 284581 286420 288727 291235 293593 296596 301435 308007 315097 322023 328900 335589 341751 347894 355077
53512C55077Q338Q613Q525R077J0086J0689J0706J0542J0444J0761J1974J3715
$$ 355077 363415 372028 380553 389630 399716 410405 421111 431653 442097 452858 464832 478547
53500D78547J4687J4461J4255J5118J6499J7562J8585J9909K0732K0354J9608
$$ 478547 493234 507695 521950 537068 553567 571129 589714 609623 630355 650709 670317
53489F70317J9667K0300K0613K0661K0943K1132K0678K0039K0039K0488K0638
$$ 670317 689984 710284 730897 751558 772501 793633 814311 834350 854389 874877 895515
53478H95515K0481K0415K0282J9813J9463J9744K0224K0216J9846J9555J9173
$$ 895515 915996 936411 956693 976506 995969 1015713 1035937 1056153 1075999 1095554 1114727
53467A114727J8482J7951J7879J7502J6004J3822J1947J0542R242Q063P062N806
$$ 1114727 1133209 1151160 1169039 1186541 1202545 1216367 1228314 1238856 1248098 1256161 1263223 1269029
53455A269029M124K717K042J421K01j123k034l247n567q270r994j0583j0875j1334
$$ 1269029 1273153 1275870 1277912 1279333 1279534 1278411 1276377 1273130 1267563 1259293 1249299 1238716 1227841 1216507
53441A216507j2089j3606j6010j8270j9309j9441j9668k0222k0822k1542k2280
$$ 1216507 1204418 1190812 1174802 1156532 1137223 1117782 1098114 1077892 1057070 1035528 1013248
53430A013248k2253k1263k0576k1184k2054k1624k0170j9074j8516j7645j6459
$$ 1013248 990995 969732 949156 927972 905918 884294 864124 845050 826534 808889 792430
53419G92430j5630j4897j3410j1499j0320r927r181p571n557l302o19J914L257
$$ 792430 776800 761903 748493 736994 726674 716747 707566 699995 694438 691136 690517 692431 695688
53406F95688L521L926N120O718Q462J0513J2642J4373J5957J8022K0299K1846
$$ 695688 699209 703135 708255 714973 723435 733948 746590 760963 776920 794942 815241 837087
53394H37087K2551K3228K4252K5240K6089K7197K8663L0241L2035L4291L6565
$$ 837087 859638 882866 907118 932358 958447 985644 1014307 1044548 1076583 1110874 1147439
53383A147439L8201L9510M1385M3876M6098M7448M7950M7720M7126M7156M8419
$$ 1147439 1185640 1225150 1266535 1310411 1356509 1403957 1451907 1499627 1546753 1593909 1642328
53372A642328N0002N0489M9901M9378M9212M8560M7107M5576M4466M3413M1975
$$ 1642328 1692330 1742819 1792720 1842098 1891310 1939870 1986977 2032553 2077019 2120432 2162407
53361B162407M0014L7254L3412K8810K4051J9275J4595J0786Q422O683M248J099
$$ 2162407 2202421 2239675 2273087 2301897 2325948 2345223 2359818 2370604 2379026 2385709 2389957 2391056
53349B391056j960n107r209j3922j7792k0434k3059k6489l0221l3769l7544m1864
$$ 2391056 2389096 2383989 2374780 2360858 2343066 2322632 2299573 2273084 2242863 2209094 2171550 2129686
53337B129686m6201m9936n2932n4987n5755n5466n4870n4251n3339n2175n1086
$$ 2129686 2083485 2033549 1980617 1925630 1869875 1814409 1759539 1705288 1651949 1599774 1548688
53326A548688m9861m8102m6354m5603m5607m5096m3773m2661m2096m0920l8319
$$ 1548688 1498827 1450725 1404371 1358768 1313161 1268065 1224292 1181631 1139535 1098615 1060296
53315A060296l5193l2878l1502l0333k8919k7108k4718k1823j8878j6133j3455
$$ 1060296 1025103 992225 960723 930390 901471 874363 849645 827822 808944 792811 779356
53304G79356j0998r271q222o950m824k272j27J298K211K947L868N168O603P783
$$ 779356 768358 759087 750865 743915 739091 736819 736692 737990 740201 743148 747016 752184 758787 766570
53290G66570Q738R713J0559J0950J1113J1647J2706J4044J5685J7705J9538K0468
$$ 766570 775308 785021 795580 806530 817643 829290 841996 856040 871725 889430 908968 929436
53278I29436K0770K1434K2720K3955K4802K5687K6770K7473K7356K6606K5391
$$ 929436 950206 971640 994360 1018315 1043117 1068804 1095574 1123047 1150403 1177009 1202400
53267A202400K3548K1210J9079J7734J7105J6750J6177J4965J3131J1248R678
$$ 1202400 1225948 1247158 1266237 1283971 1301076 1317826 1334003 1348968 1362099 1373347 1383025
53256A383025Q014N899M011L195L053K430J046n33k281m716p515r594j0765j2113
$$ 1383025 1391039 1396938 1400949 1404144 1407197 1409627 1410673 1410140 1407859 1403143 1395628 1386034 1375269 1363156
53242A363156j4352j6946j9250k1425k3812k6266k8475l0137l0723k9983k8833
$$ 1363156 1348804 1331858 1312608 1291183 1267371 1241105 1212630 1182493 1151770 1121787 1092954
53231A092954k8690k9614l0171k9463k8254k7609k7411k6821k5532k3953k2681
$$ 1092954 1064264 1034650 1004479 975016 946762 919153 891742 864921 839389 815436 792755
53220G92755k2134k2297k2642k2633k2350k2073k1591k0546j9271j8406j7830
$$ 792755 770621 748324 725682 703049 680699 658626 637035 616489 597218 578812 560982
53209E60982j6892j5556j4338j3315j2175j1149j0744j0645j0105r304r101r416
$$ 560982 544090 528534 514196 500881 488706 477557 466813 456168 446063 436759 427658 418242
53197D18242r267q511q092q298q190p276o452o635p523q256q379p808o699n764
$$ 418242 408975 400464 392372 384074 375884 368608 362156 355521 347998 339742 331363 323555 316856 311092
53183C11092n752o349o500n955n446n279m959m482m592n365n779n291m652m620
$$ 311092 305340 298991 292491 286536 281090 275811 270852 266370 261778 256413 250634 245343 240691 236071
53169B36071m872m800m408l913l411l234l679m116l495k042j223j671k451k809
$$ 236071 231199 226399 221991 218078 214667 211433 207754 203638 200143 198101 196878 195207 192756 189947
53155A89947l145l657l523k380j334j443k168k315j637p10n0n6q95j816j596l18
$$ 189947 186802 183145 179622 177242 175908 174465 172297 169982 168345 167635 167585 167529 166634 164818 163222 162904
53139A62904M37j22p34q1J158J547J147J176K032L035L657L913L824L505L555
$$ 162904 163341 163219 162485 162404 163562 165109 166256 167432 169464 172499 176156 180069 183893 187398 190953
53124A90953M442N703O433O418O140N894N460M462K726N29j324k117k083k150
$$ 190953 195395 201098 207531 213949 220089 225983 231443 235905 238631 239160 237836 235719 233636 231486
53110B31486k706l327l733m136m437m125l348k978l218l227k682k547l466m547
$$ 231486 228780 225453 221720 217584 213147 209022 205674 202696 199478 196251 193569 191022 187556 183009
53096A83009m652m015l621l665l679l558l583l776l938l949l566k548j391j171
$$ 183009 178357 174342 170721 167056 163377 159819 156236 152460 148522 144573 141007 138459 137068 135897
53082A35897k085k954k757j842j017l33L48M80m48j850k586k254j325l93J17L0
$$ 135897 133812 130858 128101 126259 125242 124909 125257 125737 125289 123439 120853 118599 117274 116881 116998 117028
53066A17028l29l90j89l20q13r23m51k37q31j586j740j403r19k40M04K86n64r81
$$ 117028 116699 116309 116120 115800 114987 114064 113613 113376 112545 110959 109219 107816 106897 106657 107061 107347 106783 105802
53048A05802l74K24j80r55j021n54l67l68k1L47M6o37q13l79l3j70o45j228j545
$$ 105802 105428 105652 105472 104517 103496 102942 102575 102207 102186 102533 102579 101942 101129 100750 100717 100547 99902 98674 97129
53029I7129j156l36j54r44j485o66Q03J424R39J85m30j047j377r45r6L42K26P9
$$ 97129 95973 95637 95483 94539 93054 92388 93191 94615 95554 95739 95309 94262 92885 91940 91844 92186 92412 92491
53011I2491J19J72J97K06k4m46n09q5N0n43j069q10l93n83o91L08J770K149J392
$$ 92491 92610 92782 92979 93185 93161 92715 92206 92121 92171 91628 90559 89749 89356 88773 88082 88390 90160 92309 93701
52992I3701Q78J109J178O34L17Q61J683J967J725J435J401J806K735L892M809
$$ 93701 94579 95688 96866 97500 97817 98678 100361 102328 104053 105488 106889 108695 111430 115322 120131
52977A20131N383N800O021N917N752N890O099N765M676L042J049r77k336k651
$$ 120131 125514 131314 137335 143252 149004 154894 160993 166758 171434 174476 175525 174548 172212 169561
52963A69561k579l032l929m422m199l754l505l499l779m351m770m565l997l722
$$ 169561 166982 163950 160021 155599 151400 147646 144141 140642 136863 132512 127742 123177 119180 115458
52949A15458l762l547k934k497k632k954k747j761m15N80P70K43p31k069l505
$$ 115458 111696 108149 105215 102718 100086 97132 94385 92624 92209 92789 93559 93802 93071 91002 87497
52934H7497m150l293j606o09p55j114j101j184j500j200l1Q04M33k63j31M90P09
$$ 87497 83347 80054 78448 77839 77084 75970 74869 73685 72185 70985 70954 71758 72191 71928 71797 72287 72996
52917G2996O43P39N47l24r65m59L57P6r95j427j002o87p26n10j61m76j328j735
$$ 72996 73639 74378 74925 74601 73636 73177 73534 73610 72615 71188 70186 69499 68773 68263 68102 67626 66298 64563
52899F4563j498j335j393j079l90M3K57Q54J592J535O96J58L72O93P23P43O82
$$ 64563 63065 61730 60337 59258 58868 58911 59168 60022 61614 63149 63845 64003 64375 65068 65791 66534 67216
52882F7216N3q22r29j76M00L26K85O84R71Q42Q15J049Q52k2o39k60N75R80J003
$$ 67216 67269 66447 65518 65342 65742 66068 66353 67037 68008 68850 69665 70714 71566 71544 70905 70645 71220 72200 73203
52863G3203J223J796K462L008L193K772K011J712K368L632M844N643N865N403
$$ 73203 74426 76222 78684 81692 84885 87657 89668 91380 93748 97380 102224 107867 113732 119135
52849A19135M435L428K721K283J869J222L33l28k48J86j52j511k646k508j751
$$ 119135 123570 126998 129719 132002 133871 135093 135426 135098 134850 135036 134884 133373 130727 128219 126468
52834A26468j511j609j249p45r85j644j613r52p51j229j612j858k771m168m711
$$ 126468 124957 123348 122099 121354 120369 118725 117112 116160 115409 114180 112568 110710 107939 103771 99060
52819I9060l937k920k478k185j628j237j278j311j148j185j363j087m76l74p46
$$ 99060 95123 92203 89725 87540 85912 84675 83397 82086 80938 79753 78390 77303 76827 76453 75707
52804G5707n74K27L62o53j522j213m93l81n37m01n53j485k164j435o7K02q16j672
$$ 75707 75133 75360 75722 75069 73547 72334 71841 71460 70923 70522 69969 68484 66320 64885 64818 65020 64204 62532
52786F2532j480q47o24q33j066j069p15L5R60J653J853J574J101R37J370J966
$$ 62532 61052 60205 59581 58748 57682 56613 55898 55933 56893 58546 60399 61973 63074 64011 65381 67347
52770F7347J952J234N76N12O98O50N22P25J194J489J304O82k7k66J79P31O22l8
$$ 67347 69299 70533 71109 71621 72319 72969 73491 74216 75410 76899 78203 78885 78858 78592 78771 79502 80124 80086
52752H0086m80n35q14j523j976j676j084p96p87q42j057j382j360q09k28l3N4
$$ 80086 79606 79071 78257 76734 74758 73082 71998 71202 70415 69573 68516 67134 65774 64965 64737 64704 64758
52735F4758L89O93N35J08n8J93N45O28K39n34j247j406r33j16P86J470J446O86
$$ 64758 65147 65840 66375 66483 66425 66618 67163 67791 68030 67496 66249 64843 63910 63794 64580 66050 67496 68182
52717F8182J58Q41K340L430L895M552N460N521M392L424L829M945N305M598L617
$$ 68182 68340 69181 71521 74951 78846 83398 88858 94379 98771 102195 106024 110969 116274 120872 124489
52702A24489K875K248J636J172Q01K95m39j299k067k457k396k316k677l211l194
$$ 124489 127364 129612 131248 132420 133221 133516 133077 131778 129711 127254 124858 122542 119865 116654 113460
52687A13460k579k089k091k202k155k240k612k940l059l110k886j960p35l17q87
$$ 113460 110881 108792 106701 104499 102344 100104 97492 94552 91493 88383 85497 83537 82802 82485 81598
52672H1598j299q64m60j072k175k545j949j148o97o24q55j195j205p57l44l24
$$ 81598 80299 79435 78975 77903 75728 73183 71234 70086 69389 68765 67910 66715 65510 64753 64409 64085
52656F4085k85K53R12Q92rj240k149k315j588k45J033J682J588R08o7q33j022
$$ 64085 63800 64053 64965 65857 65848 64608 62459 60144 58556 58311 59344 61026 62614 63522 63455 62622 61600
52639F1600q96r16r01l27N41P46Q1n06l35J60L83M63P01R61J093J277J453J235
$$ 61600 60704 59788 58887 58560 59101 59847 59928 59422 59087 59247 59630 60093 60794 61755 62848 64125 65578 66813
52621F6813P85Q41J434J507N05o64r62p31r44j677k198k125j720j316j084j010
$$ 66813 67598 68439 69873 71380 71885 71221 70259 69528 68584 66907 64709 62584 60864 59548 58464 57454
52605E7454q08k45K43p1r91j424r28k42Q1M70J209J587J080L24M9Oj87j1R92K040
$$ 57454 56646 56401 56644 56573 55582 54158 53230 52988 53069 53539 54748 56335 57415 57739 57788 57794 57607 57596 58588 60628
52585F0628K011J063K76J30K21J31k23p32r48k76J003J610Q64k93o56m00m46q32
$$ 60628 62639 63702 63978 64108 64329 64460 64237 63505 62557 62281 63284 64894 65758 65465 64809 64409 63963 63131
52567F3131q31k94K28L50R1m57r21o24M79J388J312P76O06O12K84J04Q09J817
$$ 63131 62300 62006 62234 62584 62675 62218 61297 60673 61152 62540 63852 64628 65234 65846 66130 66234 67043 68860
52549F8860J838Q80K56N41Q52L73m76q61o54k31K09O73J022J043P53M75N60J020
$$ 68860 70698 71578 71834 72375 73227 73600 73124 72263 71609 71378 71587 72260 73282 74325 75078 75553 76113 77133
52531G7133J435J397R86N14o8r28j679j660r45k74J59Q01J536J470M16n44n61
$$ 77133 78568 79965 80951 81465 81397 80469 78790 77130 76185 75911 76070 76871 78407 79877 80293 79749 79188
52514G9188j23K5N2L90Q14J039J332J736J561M60p74j303j235r17j98O92P72j35
$$ 79188 79065 79090 79142 79532 80346 81385 82717 84453 86014 86474 85700 84397 83162 82245 82047 82739 83511 83376
52496H3376o07L62J687J821J058O22N10k4n69qJ438K352K168J584J095N83K34
$$ 83376 82769 83131 84818 86639 87697 88319 88829 88805 88236 88228 89666 92018 94186 95770 96865 97448 97682
52479I7682N14J174J390Q33k31j555k668k627j196K81M49k55o43q42j602k270
$$ 97682 98196 99370 100760 101593 101362 99807 97139 94512 93316 93597 94046 93791 93148 92306 90704 88434
52463H8434j454N01J736J553J029Q82O41J91K65Q78J015L76p3J63L43N3L1O74
$$ 88434 86980 87481 89217 90770 91799 92681 93322 93513 93778 94656 95671 96047 95974 96137 96480 96533 96564 97238
52445I7238J088N67j83j58M65P95N41J29L4M30J034J115K61r25j578j842k327
$$ 97238 98326 98893 98710 98552 99017 99812 100353 100482 100516 100946 101980 103095 103356 102431 100853 99011 96684
52428I6684k591j538N03J715J268M02L94P81N26j77l77J53Q13J079P70q0j060
$$ 96684 94093 92555 93058 94773 96041 96443 96837 97618 98144 97967 97590 97743 98556 99635 100405 100325 99265
52411I9265j543j368r51m21M99J575J913J266N51M59M52j15p01l76O27J162O87
$$ 99265 97722 96354 95403 94982 95481 97056 98969 100235 100786 101245 101697 101582 100881 100505 101132 102294 102981
52394A02981k69j027j366j314q66j25O50J139J099N14k12m46N9Q69J243P88k42
$$ 102981 102712 101685 100319 99005 98139 98014 98664 99803 100902 101416 101204 100758 100817 101686 102929 103717 103475
52377A03475j094j112l65M01O69P36J017J212P49j06m61o5L39R9m77o12k5Q23
$$ 103475 102381 101269 100904 101305 101974 102710 103727 104939 105688 105582 105121 105056 105395 105494 105017 104405 104380 105203
52359A05203J213Q89L72M02R63J258Q81M26M36N01J10k99q0L96L87K43R18K217
$$ 105203 106416 107305 107677 108079 109042 110300 111181 111607 112043 112544 112654 112355 112275 112671 113058 113301 114219 116436
52341A16436K857K381J753J808K205K237J789J121M83K22N81J211J487J408J494
$$ 116436 119293 121674 123427 125235 127440 129677 131466 132587 133070 133292 133873 135084 136571 137979 139473
52326A39473J823J933J689J426J193O49j67p44q58p28m23Q2M07Q8n96j027j252
$$ 139473 141296 143229 144918 146344 147537 148186 148019 147275 146417 145689 145266 145348 145755 145843 145247 144220 142968
52309A42968j736k239k057j338r96j219j193n23J95M44M48M74L86J62R4K93O44
$$ 142968 141232 138993 136936 135598 134602 133383 132190 131667 131862 132306 132754 133228 133614 133776 133870 134163 134807
52292A34807J210J918K125J459P82J120J967K052J517J637K402K381J320R03K144
$$ 134807 136017 137935 140060 141519 142301 143421 145388 147440 148957 150594 152996 155377 156697 157600 159744
52277A59744L719L903K821J749J332J402J644J651J108M65N05R84Q91K75L68J406
$$ 159744 163463 167366 170187 171936 173268 174670 176314 177965 179073 179538 180043 181027 181918 182193 182561 183967
52261A83967J956J238M10N35Q28K66m62j70P35R89N37L60P19R59P33L15p9l35
$$ 183967 185923 187161 187571 188106 188934 189200 188738 188568 189303 190292 190829 191189 191908 192867 193600 193915 193836 193501
52243A93501o5R60K280L254L702L626K927J981J694K265K705K304J773K031K696
$$ 193501 193436 194396 196676 199930 203632 207258 210185 212166 213860 216125 218830 221134 222907 224938 227634
52228B27634K792K354K229K736L491M149M523M339L649L057K909K781K349K026
$$ 227634 230426 232780 235009 237745 241236 245385 249908 254247 257896 260953 263862 266643 268992 271018
52214B71018K042J716O04l86j15J080J960K170K376K887L271L186K749K183J751
$$ 271018 273060 274776 275380 274994 274879 275959 277919 280089 282465 285352 288623 291809 294558 296741 298492
52199B98492J844K435K764K262J449J280J876K600L001L076K911K742K990L606
$$ 298492 300336 302771 305535 307797 309246 310526 312402 315002 318003 321079 323990 326732 329722 333328
52185C33328L798L055K058J828K416L050L236L028K550J997J748J952K250K342
$$ 333328 337126 340181 342239 344067 346483 349533 352769 355797 358347 360344 362092 364044 366294 368636
52171C68636K401K528K412J995J749J762J399M74j54K3J73m36j029n55M04M79
$$ 368636 371037 373565 375977 377972 379721 381483 382882 383356 383202 383225 383398 382962 381933 381378 381782 382261
52155C82261l21p60m33j54l24l61K2J60n28j663k446k493k003j486j369j496j289
$$ 382261 381940 381180 380747 380593 380269 379908 379930 380090 379562 377899 375453 372960 370957 369471 368102 366606 365317
52138C65317o54l49r11j772k085j889j682j430q95m86p73j461j810j806j971k282
$$ 365317 364663 364314 363403 361631 359546 357657 355975 354545 353650 353164 352391 350930 349120 347314 345343 343061
52122C43061k255j848j410r63m43l56j178k279k542j928j432j509j652j530j514
$$ 343061 340806 338958 337548 336585 336142 335786 334608 332329 329787 327859 326427 324918 323266 321736 320222
52107C20222j792j895j442o96j72j31n92j316j796j735j443j331j236q27l15j43
$$ 320222 318430 316535 315093 314397 314225 314094 313502 312186 310390 308655 307212 305881 304645 303818 303503 303360
52091C03360k26k50l83q78j210n86Q36K001K225J713R92N85J009K208L190L079
$$ 303360 303134 302884 302501 301623 300413 299827 300663 302664 304889 306602 307594 308179 309188 311396 314586 317665
52075C17665K318J972K106J990J691K136L385M139L499K196J506J698K064J998
$$ 317665 319983 321955 324061 326051 327742 329878 333263 337402 340901 343097 344603 346301 348365 350363
52061C50363J484R51R17J540K313K497J971J272Q66P76Q67J083J324J506J729
$$ 350363 351847 352798 353715 355255 357568 360065 362036 363308 364174 364950 365817 366900 368224 369730 371459
52046C71459K084K340K201J707J073L87k35m63k23L3n3j73Q7N37P82Q87J018Q80
$$ 371459 373543 375883 378084 379791 380864 381251 381016 380553 380330 380363 380310 380137 380224 380761 381543 382430 383448 384328
52028C84328K40l83l11K95P44P32K76p56k240l416l789l883m236m285l377k222
$$ 384328 384568 384185 383874 384169 384913 385645 385921 385165 382925 379509 375720 371837 367601 363316 359939 357717
52012C57717k000k435k344j723j632k090j891p54N4j94n37NR29J300J188J165
$$ 357717 355717 353282 350938 349215 347583 345493 343602 342848 342902 342708 342171 342176 343105 344405 345593 346758
51996C46758J194R74P51R29J234J004Q2j012j643j616j322j417k053k574k398
$$ 346758 347952 348926 349677 350606 351840 352844 352926 351914 350271 348655 347333 345916 343863 341289 338891
51981C38891k000k323l404m369m822n292o182p116p542p325o588n595m912m989
$$ 338891 336891 334568 331164 326795 321973 316681 310499 303383 295841 288516 281928 276333 271421 266432
51967B66432n500n801n963o566p493p861p281o244n193m110l235l117l653m001
$$ 266432 260932 255131 249168 242602 235109 227248 219967 213723 208530 204420 201185 198068 194415 190414
51953A90414l812l651l799l662k895k229k478l368m014l989l490k862k435k412
$$ 190414 186602 182951 179152 175490 172595 170366 167888 164520 160506 156517 153027 150165 147730 145318
51939A45318k583k509k208k140k389k502k267k022j912j608j008o06p61j186j454
$$ 145318 142735 140226 138018 135878 133489 130987 128720 126698 124786 123178 122170 121564 120803 119617 118163
51924A18163j500j369j047p59q63j229j319j018p63p56p20n74n32m44J48J056
$$ 118163 116663 115294 114247 113488 112625 111396 110077 109059 108296 107540 106820 106246 105714 105270 105418 106474
51908A06474J452J116P79R35J218J282J360J427Q58m34j442j389q48q03j220j356
$$ 106474 107926 109042 109821 110756 111974 113256 114616 116043 116901 116467 115025 113636 112788 111985 110765 109409
51892A09409r43k62M74J128J338R20K58j94m90q24j005p70k96Q8L22M12K36o4
$$ 109409 108466 108204 108678 109806 111144 112064 112322 112128 111638 110814 109809 109039 108743 108831 109153 109565 109801 109737
51874A09737L8O65J128P61j10o36m88PM92Q27Q81O32L23K42M47Q38J286J524J215
$$ 109737 109775 110440 111568 112329 112219 111583 111095 111102 111594 112421 113302 113934 114257 114499 114946 115784 117070 118594 119809
51855A19809M20l10n07k54P1J87K3k01j6P65J572J604R04L25L97Q04J066J078
$$ 119809 120229 119919 119412 119158 119229 119416 119439 119238 119222 119987 121559 123163 124067 124392 124789 125593 126659 127737
51837A27737Q48L92P3L83J152J628J485J106P09O3p39j059o74j67RR9L20L75J24
$$ 127737 128585 128977 129050 129433 130585 132213 133698 134804 135513 135576 134837 133778 133104 132937 132946 133045 133365 133740 133864
51818A33864l7J04J60PJ82R56J698J803J507J253R69N88N23R50J259R99P56J258
$$ 133864 133827 133931 134091 134098 134280 135236 136934 138737 140244 141497 142466 143054 143577 144527 145786 146785 147541 148799
51800A48799K192K667K400J748J032N28O56J437K116K063J634J493J568J490J553
$$ 148799 150991 153658 156058 157806 158838 159366 160022 161459 163575 165638 167272 168765 170333 171823 173376
51785A73376K302L425L975L630K937K390K063K129L001M622O170O759O352N789
$$ 173376 175678 179103 183078 186708 189645 192035 194098 196227 199228 203850 210020 216779 223131 228920
51771B28920N985O989P948Q135P840P740P600O408L879R82j329l070m502n379
$$ 228920 234905 241894 249842 257977 265817 273557 281157 287565 291444 292426 291097 288027 283525 278146
51757B78146n505n287n059m506l480k662k645k965k844k393k146j948j300m78
$$ 278146 272641 267354 262295 257789 254309 251647 249002 246037 243193 240800 238654 236706 235406 234928
51743B34928k67p20j043p16l5M28L42l37j259j786j594j036n28KN91P00q3j163
$$ 234928 234661 233941 232898 232182 232147 232575 232917 232580 231321 229535 227941 226905 226377 226379 226970 227670 227587 226424
51725B26424j545j138p10p42r88j112j049q18n28m76p90j046p81j48L82P35J115
$$ 226424 224879 223741 223031 222289 221301 220189 219140 218322 217794 217318 216528 215482 214701 214553 214935 215670 216785
51708B16785J378J129L15o66j363j434p59K33P11L10n68j536k665l627l409j761
$$ 216785 218163 219292 219607 218941 217578 216144 215385 215618 216329 216639 216071 214535 211870 208243 204834 203073
51692B03073j18J04m99l39O40J003K20o32q08r56j640k219k023j679k101k917
$$ 203073 202955 203059 202560 202221 202861 203864 204084 203452 202644 201688 200048 197829 195806 194127 192026 189109
51676A89109k987k150j415j368j314l65J158J890R19j223l184m111m165l864l457
$$ 189109 186122 183972 182557 181189 179875 179510 180668 182558 183477 182254 179070 174959 170794 166930 163473
51661A63473l055k868k885k622j672l69M74M91Q5j39M2M22O14L79q0j98M44J734
$$ 163473 160418 157550 154665 152043 150371 150002 150476 150967 151052 150913 150955 151377 151991 152370 152290 152092 152536 154270
51643A54270L188M271M493L579J806l2j308k014k414k563k422k124j833j558j315
$$ 154270 157458 161729 166222 169801 171607 171575 170267 168253 165839 163276 160854 158730 156897 155339 154024
51628A54024j176j071q52p26j084j769k062j726j385j490j562j029k31J84L00
$$ 154024 152848 151777 150925 150199 149115 147346 145284 143558 142173 140683 139121 138092 137861 138045 138345
51613A38345O34J116J228R36P07P42Q16Q84J207J816K324K336J801J011N18P25
$$ 138345 138979 140095 141323 142259 142966 143708 144524 145408 146615 148431 150755 153091 154892 155903 156421 157146
51597A57146J359J657J386J221J717K416K549K149J723J221K31j019j653j303
$$ 157146 158505 160162 161548 162769 164486 166902 169451 171600 173323 174544 174775 173756 172103 170800
51583A70800n72j67j21j6L16N58L59j01j26O51J641J999J875K198L161L866L781
$$ 170800 170228 170061 169940 169924 170240 170798 171157 171056 170930 171581 173222 175221 177096 179294 182455 186321 190102
51566A90102L561L734L591K314N04n06m23n7O5J29K84L05O2l61r15j445j542j018
$$ 190102 193663 197397 200988 203302 203806 203300 202877 202820 202885 203014 203298 203603 203665 203304 202389 200944 199402 198384
51548A98384l09R9K67L36Nq57j551j332m71J05j9o07j314j749j489p34l81p62
$$ 198384 198075 198174 198441 198777 198782 197925 196374 195042 194571 194676 194657 194050 192736 190987 189498 188764 188383 187621
51530A87621r39j53Q64J055P31Q29J066M35q51j419p07N49J665K520K792K117
$$ 187621 186682 186529 187393 188448 189179 190008 191074 191509 190658 189239 188532 189081 190746 193266 196058 198175
51514A98175J091P68J013P04k91p62q1Q97J310J338J259P37k50q53n38Pm5m35
$$ 198175 199266 200034 201047 201751 201460 200698 200617 201514 202824 204162 205421 206158 205908 205055 204517 204524 204479 204044
51496B04044l35M89J590K429K599J947R35L78N10P95Q47R58J480K298L182M062
$$ 204044 203709 204198 205788 208217 210816 212763 213698 214076 214586 215381 216228 217186 218666 220964 224146 228208
51480B28208M670M493L454K142J158O50N83R36J481J926K314K737K746J823M05
$$ 228208 232878 237371 240825 242967 244125 244775 245358 246294 247775 249701 252015 254752 257498 259321 259726
51465B59726m40m54m42r07j418j606j830k365k773k680k477k702l252l737m166
$$ 259726 259286 258832 258390 257483 256065 254459 252629 250264 247491 244811 242334 239632 236380 232643 228477
51450B28477m746n347n595n253m373l314k580k352k218j805j455j623j879j364
$$ 228477 223731 218384 212789 207536 203163 199849 197269 194917 192699 190894 189439 187816 185937 184573
51436A84573j18R25J293J315J137N71K8L77J455J886R76k74o57l50k77p69j603
$$ 184573 184455 185380 186673 187988 189125 189696 189724 190101 191556 193442 194418 194144 193487 193137 192860 192091 190488
51419A90488k656l671l980l235k097j520j649j957k049j850j359p11k09m7j86
$$ 190488 187832 184161 180181 176946 174849 173329 171680 169723 167674 165824 164465 163754 163545 163498 163312
51404A63312o96j642k578k732k022j241r36q22n83n32r55j478j632j469j193p46
$$ 163312 162616 160974 158396 155664 153642 152401 151465 150643 150060 149528 148573 147095 145463 143994 142801 142055
51388A42055l12n83j836l239l666k986j935j108n42j39M5j31p50j611k147j839
$$ 142055 141743 141160 139324 136085 132419 129433 127498 126390 125848 125709 125754 125623 124873 123262 121115 119276
51372A19276r03q8J89J11j42o67j336j627j186j58J099K123K344J646Q72Q43R95
$$ 119276 118373 118285 118474 118585 118443 117776 116440 114813 113627 113469 114568 116691 119035 120681 121553 122396 123391
51355A23391R3j589k218r48P92J279O47J23J56L38N46J033J754K376K726K665
$$ 123391 123484 121895 119677 118729 119521 120800 121447 121570 121726 122064 122610 123643 125397 127773 130499 133164
51339A33164J988R46L00L10K43n30j565k102k180k274k388k251j996j939k035
$$ 133164 135152 136098 136398 136708 136951 136421 134856 132754 130574 128300 125912 123661 121665 119726 117691
51324A17691k133k348k663k664k160j598j332j064n69k54l75l97J01N67M20J19
$$ 117691 115558 113210 110547 107883 105723 104125 102793 101729 101160 100906 100531 100134 100235 100802 101222 101341
51308A01341L37O49K19p13j148r21p00o31j80O45J038O37P1l3K20M85P42R81R75
$$ 101341 101678 102327 102546 101833 100685 99764 99064 98433 98253 98898 99936 100573 100644 100611 100831 101316 102058 103039 104014
51289A04014O83M68N86P98P38M28J59M7q7m68j070j608j818j690j341p89r6L93
$$ 104014 104697 105165 105751 106549 107287 107715 107874 107921 107834 107366 106296 104688 102870 101180 99839 99050 98954 99347
51271I9347L64O4n9j14o03j393j684j217p48q62j093p74j27K06J58J01J36J26
$$ 99347 99711 99775 99716 99602 98999 97606 95922 94705 93957 93095 92002 91228 91101 91307 91465 91566 91702 91828
51253I1828J13N0m13j337j995j655n61M00P72P25M98K30J17K20K88J52K0K9j12
$$ 91828 91941 91991 91578 90241 88246 86591 86030 86430 87202 87927 88425 88655 88772 88992 89280 89432 89452 89481 89369
51234H9369n65q98o61p3L70N79O76N57J87j1K73O22M49j56o71q85q19l00P02J598
$$ 89369 88804 87906 87245 87172 87542 88121 88797 89354 89541 89530 89803 90425 90874 90718 90047 89162 88343 88043 88745 90343
51214I0343J707J157N77J86k00n13m44m4K62K66J41P9J83M80P16L88n71j414j359
$$ 90343 92050 93207 93784 93970 93770 93257 92813 92769 93031 93297 93438 93517 93700 94180 94896 95284 94713 93299 91940
51195I1940n34K57M46P5m57o16o4Q36J200O62j71o32q02r77r57m44L17R12J303
$$ 91940 91406 91663 92109 92184 91727 91111 91047 91883 93083 93745 93574 92942 92140 91163 90206 89762 90079 90991 92294
51176I2294J431R04k30r97o16L34O88K50k68m56m37k20K57O47O08N19R46J565
$$ 92294 93725 94629 94399 93402 92786 93120 93808 94058 93790 93334 92897 92677 92934 93581 94189 94708 95654 97219
51158I7219J496O37j91l57KM96P76M47n83j619j762j004j97N1j08l18m67n24m23
$$ 97219 98715 99352 99161 98804 98806 99302 100078 100525 99942 98323 96561 95557 95360 95411 95303 94985 94518 93994 93571
51139I3571k04P4M94J035J383J353J236J330J402J044L05m29q93r74o54k63l19
$$ 93571 93367 93441 93935 94970 96353 97706 98942 100272 101674 102718 103023 102594 101701 100727 100073 99810 99491
51122I9491p54q88n05k24l57k93L21O95J37o50o18K3L55L39N22P00K53n62q94
$$ 99491 98737 97849 97344 97120 96763 96470 96791 97486 97623 96973 96355 96378 96733 97072 97594 98294 98547 97985 97091
51103I7091p16p08q76n71J81N87L43o1l30n44m66K16J001J024M35J91M63M47j47
$$ 97091 96375 95667 94791 94220 94401 94988 95331 95270 94940 94396 93930 94146 95147 96171 96606 96797 97260 97707 97560
51084I7560o00m82k63l50m47k37J69P51J651K524K626J859R65N00L29K76M41P15
$$ 97560 96960 96478 96215 95865 95418 95181 95350 96101 97752 100276 102902 104761 105726 106226 106555 106831 107272 107987
51066A07987P54N51L60J07m01p82o15m25j031j890j587p2R39M30n28n68l2j34
$$ 107987 108741 109292 109652 109759 109358 108576 107961 107536 106505 104615 103028 102956 103895 104325 103797 103229 103197 103063
51048A03063r56j427r43l2M93L78p7m20l66O5O71J187J326R62M98O07J255J581
$$ 103063 102107 100680 99737 99705 100198 100576 100499 100079 99713 99778 100449 101636 102962 103924 104422 105029 106284 107865
51030A07865J195R15J486K244K146J461J162J151N59m59q23m48l44p23n54N04
$$ 107865 109060 109975 111461 113705 115851 117312 118474 119625 120184 119725 118902 118454 118110 117387 116833 117337
51014A17337J362J251P77N22l8j321k550k867k599k455k245j393j34P22Q37M85
$$ 117337 118699 119950 120727 121249 121211 119890 117340 114473 111874 109419 107174 105781 105647 106369 107206 107691
50998A07691m8n85q71p15j03R20K084K653K031P30p7r4j38o37r00l25N78R70P78
$$ 107691 107643 107058 106187 105472 105369 106289 108373 111026 113057 113787 113710 113616 113478 112841 111941 111616 112194 113164 113942
50979A13942M95M29O22J034J476J776K127K739L202K967K345K194K519K460J782
$$ 113942 114437 114866 115488 116522 117998 119774 121901 124640 127842 130809 133154 135348 137867 140327 142109
50964A42109J258J342J623J849K364L110L369K975K716L010L301L242L419M236
$$ 142109 143367 144709 146332 148181 150545 153655 157024 159999 162715 165725 169026 172268 175687 179923
50950A79923N186N796O280O717O707O416O866Q425J0181J1407J2510J3785J4568
$$ 179923 185109 190905 197185 203902 210609 217025 223891 232316 242497 253904 266414 280199 294767
50937B94767J4564J4744J5800J6825J6674J5624J4521J3256J1374R280P530N662
$$ 294767 309331 324075 339875 356700 373374 388998 403519 416775 428149 437429 444959 450621
50925D50621L117N28j197k479m416p017r358j1078j2489j3586j4172j4508j4769
$$ 450621 453738 454266 453069 450590 446174 439157 429799 418721 406232 392646 378474 363966 349197
50912C49197j4380j3033j1798j1766j2116j1072q593o438n575n127m226l410l501
$$ 349197 334817 321784 309986 298220 286104 275032 266439 260001 254426 249299 245073 241663 238162
50899B38162m192m466l777k297n23R26J570J440J025P94R45J500K276K897L125
$$ 238162 233970 229504 225727 223430 222907 223833 225403 226843 227868 228662 229607 231107 233383 236280 239405
50884B39405K962K322J034m70j195q25l44o81j377j421q70n74p32q11p49j033
$$ 239405 242367 244689 245723 245253 244058 243233 242889 242208 240831 239410 238540 237966 237234 236423 235674 234641
50868B34641j610j729j140n26m87q00r12o25j19L29M62K44o8k06k22k11J3O71
$$ 234641 233031 231302 230162 229636 229149 228349 227437 226812 226693 227022 227484 227728 227660 227454 227232 227021 227034 227705
50850B27705J642K634L441L794L493L011L290M447N361N228M838N364O496O956
$$ 227705 229347 231981 235422 239216 242709 245720 249010 253457 258818 264046 268884 274248 280744 287700
50836B87700O551O499P697R684J1531J2908J4034J5189J6470J7729J8780J9937
$$ 287700 294251 300750 308447 318131 329662 342570 356604 371793 388263 405992 424772 444709
50824D44709K1991K5206K8658L1275L3068L4763L6565L8113L9263L9982L9702
$$ 444709 466700 491906 520564 551839 584907 619670 656235 694348 733611 773593 813295
50813H13295L7737L4284L0182K5727K0603J4896R215L754j852p526j2437j5974
$$ 813295 851032 885316 915498 941225 961828 976724 985939 989693 987841 980315 967878 951904
50801I51904j8424k0393k2079k3305k3730k2912k0636j7343j3909j0844q079n406
$$ 951904 933480 913087 891008 867703 843973 821061 800425 783082 769173 758329 750250 744844
50789G44844k813l45J959M103O358R241J2884J6662J9859K2406K4550K6213K7199
$$ 744844 742031 741686 743645 747748 754106 763347 776231 792893 812752 835158 859708 885921 913120
50776I13120K7596K7210K5029K0227J3589P044J742k619o618j0122j2666j4143
$$ 913120 940716 967926 992955 1013182 1026771 1033815 1035557 1032938 1026320 1016198 1003532 989389
50764I89389j4853j5336j6182j7651j9347k0755k1864k2941k3860k4327k4542
$$ 989389 974536 959200 943018 925367 906020 885265 863401 840460 816600 792273 767731
50753G67731k4895k5133k4573k3169k1601k0201j8529j6260j3830j1814j0144
$$ 767731 742836 717703 693130 669961 648360 628159 609630 593370 579540 567726 557582
50742E57582q261n907l453j533l67N08J724L386N127O910R110J1683J3878J5188
$$ 557582 549321 543414 539961 538428 538061 538569 540293 543679 548806 555716 564826 576509 590387 605575
50728F05575J5982J6791J7570J8144J8574J8487J6902J3596R937P324N435L089
$$ 605575 621557 638348 655918 674062 692636 711123 728025 741621 751558 758882 764317 767406
50716G67406L18j737k708l386m301n022n004m087k187O39L733O295Q316J0286
$$ 767406 767724 765987 763279 759893 755592 750570 745566 741479 739292 739931 743664 749959 758275 768561
50702G68561J2168J3506J4452J5692J7357J8889J9889K0222J9456J7296J4427
$$ 768561 780729 794235 808687 824379 841736 860625 880514 900736 920192 937488 951915
50691I51915J1981J0124Q258O497N673N891O327O810Q320J1506J5718J9996K4094
$$ 951915 963896 974020 982278 988775 994448 1000339 1006666 1013476 1021796 1033302 1049020 1069016 1093110
50678A093110K8009L1302L3351L3821L2568K9689K5704K1145J6036J0455N485
$$ 1093110 1121119 1152421 1185772 1219593 1252161 1281850 1307554 1328699 1344735 1355190 1360675
50667A360675K557J906K699M661Q328J3533J8908K3251K6270K7730K7151K4878
$$ 1360675 1363232 1365138 1367837 1372498 1380826 1394359 1413267 1436518 1462788 1490518 1517669 1542547
50655A542547K2268K0094J7752J4686J1571R393Q207P582P434P666P645O842N532
$$ 1542547 1564815 1584909 1602661 1617347 1628918 1638311 1646518 1654100 1661534 1669200 1676845 1683687 1689219
50642A689219M303L394K877K951L535M278N337P390J0488J3635J6063J8100K0261
$$ 1689219 1693522 1696916 1699793 1702744 1706279 1710557 1715894 1723284 1733772 1747407 1763470 1781570 1801831
50629A801831K2305K3778K4641K4653K2968J9251J4574J0335O740L195m41l855
$$ 1801831 1824136 1847914 1872555 1897208 1920176 1939427 1954001 1964336 1971076 1974271 1973830 1969975
50617A969975p110j0446j3462j5292j5473j4007j0942o503j466L335P661J1485
$$ 1969975 1962865 1952419 1938957 1923665 1908192 1894185 1883243 1876740 1875274 1878609 1886270 1897755
50605A897755J4168J4849J3518J1028P962M083j077p576j5074k3079l1072l8636
$$ 1897755 1911923 1926772 1940290 1951318 1959280 1963363 1962286 1954710 1939636 1916557 1885485 1846849
50593A846849m5564n1621n6374n9497o1173o1812o1450n9755n6729n3012m9319
$$ 1846849 1801285 1749664 1693290 1633793 1572620 1510808 1449358 1389603 1332874 1279862 1230543
50582A230543m5751m1907l7669l3575l0163k7199k3875j9835j5537j1529p818
$$ 1230543 1184792 1142885 1105216 1071641 1041478 1014279 990404 970569 955032 943503 935685
50571I35685m222p43K748O686J1127J5345J8664K1207K3089K3527K1701J8109
$$ 935685 931463 930720 933468 940154 951281 966626 985290 1006497 1029586 1053113 1074814 1092923
50559A092923J4009R738M751p88n642q881j0541j0869r833p627m641p83M253R941
$$ 1092923 1106932 1116670 1121421 1120633 1114991 1106110 1095569 1084700 1074867 1067240 1062599 1061816 1066069 1076010
50545A076010J5228K0024K5215L0969L6233M0268M3404M5773M6739M6321M5902
$$ 1076010 1091238 1111262 1136477 1167446 1203679 1243947 1287351 1333124 1379863 1426184 1472086
50534A472086M6520M7510M7927M8356N0076N3125N6407N9361O2294O5285O7729
$$ 1472086 1518606 1566116 1614043 1662399 1712475 1765600 1822007 1881368 1943662 2008947 2076676
50523B076676O9177O9949P0949P3037P6334P9926Q2656Q4457Q6235Q8118Q8638
$$ 2076676 2145853 2215802 2286751 2359788 2436122 2516048 2598704 2683161 2769396 2857514 2946152
50512B946152Q6287Q1229P4707O7225N8144M6694L2739J6771j79j6807l2293m6680
$$ 2946152 3032439 3113668 3188375 3255600 3313744 3360438 3393177 3409948 3409769 3392962 3360669 3313989
50500C313989o0191p2409q2399q9354r2744r2368q8561q2079p3379o2458m9640
$$ 3313989 3253798 3181389 3098990 3009636 2916892 2824524 2735963 2653884 2580505 2518047 2468407
50489B468407l6033k2850j0708N5Q851J5076J8323J8063J3564M590q089k3120
$$ 2468407 2432374 2409524 2398816 2398871 2407722 2422798 2441121 2459184 2472748 2477338 2469249 2446129
50477B446129l9132n4763o8771q0383q9191r4649r6376r5049r2221q8959q5343
$$ 2446129 2406997 2352234 2283463 2203080 2113889 2019240 1922864 1827815 1735594 1646635 1561292
50466A561292q1321p7187p2985o8378o3447n8709n4195m9413m4506m0233l6612
$$ 1561292 1479971 1402784 1329799 1261421 1197974 1139265 1085070 1035657 991151 950918 914306
50455I14306l2847k8939k5877k3714k1148j7765j4974j3529j1916q832n679m575
$$ 914306 881459 852520 826643 802929 781781 764016 749042 735513 723597 714765 709086 704511
50443G04511m973m447k271j15O97P57J174K215L582M929N917O567P641R766J2435
$$ 704511 699538 695091 692820 692705 693402 694159 695333 697548 701130 706059 711976 718543 726184 735950 748385
50428G48385J4695J6543J8661K1171K3692K6387K9726L3395L6522L8971M1399
$$ 748385 763080 779623 798284 819455 843147 869534 899260 932655 969177 1008148 1049547
50417A049547M4037M6398M8212M9705N0951N1781N2335N2988N3806N4754N6143
$$ 1049547 1093584 1139982 1188194 1237899 1288850 1340631 1392966 1445954 1499760 1554514 1610657
50406A610657N8141O0111O1271O1687O1747O1017N8733N5190N1484M7949M3892
$$ 1610657 1668798 1728909 1790180 1851867 1913614 1974631 2033364 2088554 2140038 2187987 2231879
50395B231879L8941L3584K8263K2729J6481R133L82r790k0835l2044m3023n3317
$$ 2231879 2270820 2304404 2332667 2355396 2371877 2381010 2381392 2371602 2350767 2318723 2275700 2222383
50383B222383o2064o8661p3249p5893p5985p3353o9132o4416n8744n1234m2610
$$ 2222383 2160319 2091658 2018409 1942516 1866531 1793178 1724046 1659630 1600886 1549652 1507042
50372A507042l4549k7458k0507j3619p775l465m69Q27m43m059q800j4284k1040
$$ 1507042 1472493 1445035 1424528 1410909 1403134 1399669 1399200 1400027 1399584 1395525 1386725 1372441 1351401
50359A351401k8518l4785l8747m1239m3225m4375m4079m2678m0813l8661l6450
$$ 1351401 1322883 1288098 1249351 1208112 1164887 1120512 1076433 1033755 992942 954281 917831
50348I17831l4691l3243l1176k8193k5174k2765k0462j7787j5252j3417j1949
$$ 917831 883140 849897 818721 790528 765354 742589 722127 704340 689088 675671 663722
50337F63722j0397q992p841o272l905j589l18K10R71K137L065L447L519L434L155
$$ 663722 653325 644333 636492 630220 626315 624726 624408 624618 625589 627726 630791 634238 637757 641191 644346
50322F44346K842K793L071L567M228M930N425N600N601N517N355N361N827O505
$$ 644346 647188 649981 653052 656619 660847 665777 671202 676802 682403 687920 693275 698636 704463 710968
50308G10968O821O809P114P917Q641Q973R415J0476J2049J3893J5966J7888J8925
$$ 710968 717789 724598 731712 739629 748270 757243 766658 777134 789183 803076 819042 836930 855855
50295H55855J8876J8258J7238J5321J2587J0150Q697P433N360K817P27r76l118
$$ 855855 874731 892989 910227 925548 938135 948285 956982 964415 969775 972592 973319 972343 969225
50282I69225n918q921j1972j5243j8373k0464k1061k0530j9426j8064j6675j5470
$$ 969225 963307 954386 942414 927171 908798 888334 867273 846743 827317 809253 792578 777108
50270G77108j4453j3442j2353j1339j0771j1100j2388j3818j4233j3383j2177
$$ 777108 762655 749213 736860 725521 714750 703650 691262 677444 663211 649828 637651
50259F37651j1458j1103j0662j0214r923r341p931o017m514l842l672l572l355
$$ 637651 626193 615090 604428 594214 584291 574950 567019 561002 556488 552646 548974 545402 542047
50246E42047k942k403k075k198k571k847l014l202l247k912k430k255k401k376
$$ 542047 539105 536702 534627 532429 529858 527011 523997 520795 517548 514636 512206 509951 507550 505174
50232E05174j885j233r26j048j168q50j97K13L2m15o47p56j124j594j611j186
$$ 505174 503289 502056 501130 500082 498914 498064 497867 498080 498112 497697 497050 496294 495170 493576 491965 490779
50216D90779r93j305j518j090l02K45L53Q4n21j120j089l89J09k45r14r50k66
$$ 490779 489786 488481 486963 485873 485571 485816 486169 486253 485732 484612 483523 483134 483243 482998 482084 481134 480868
50199D80868M67Q18P66K09q70j875k014j207o6R89J961K708K814K283J756J794
$$ 480868 481335 482153 482919 483128 482258 480383 478369 477162 477096 478085 480046 482754 485568 487851 489607 491401
50183D91401K265K699K882K940L024L161L287L248K879K253J785J899K448K711
$$ 491401 493666 496365 499247 502187 505211 508372 511659 514907 517786 520039 521824 523723 526171 528882
50169E28882K176J312J129J860K565K418J946K279L464M346M206L605L342L381
$$ 528882 531058 532370 533499 535359 537924 540342 542288 544567 548031 552377 556583 560188 563530 566911
50155E66911L353L468M163N199N837N821N656N744N778N241M250L576L728M265
$$ 566911 570264 573732 577895 583094 588931 594752 600408 606152 611930 617171 621421 624997 628725 632990
50141F32990M328L819L568M181N163N662N541N161M523L472K517K398K799K489
$$ 632990 637318 641137 644705 648886 654049 659711 665252 670413 674936 678408 680925 683323 686122 688611
50127F88611R79q07j859k254k524k685k490k140k060k309k639k903l024k831k275
$$ 688611 689590 688783 686924 684670 682146 679461 676971 674831 672771 670462 667823 664920 661896 659065 656790
50112F56790j592j027o30l67j30L81J321K266K563K257K051K313K754L192L875
$$ 656790 655198 654171 653541 653174 653044 653425 654746 657012 659575 661832 663883 666196 668950 672142 676017
50097F76017M881N851O650P581Q761R894J0914J2116J3488J4688J5900J7833K0541
$$ 676017 680898 686749 693399 700980 709741 719635 730549 742665 756153 770841 786741 804574 825115
50084H25115K3246K5629K8330L1701L5109L8156M1533M5803N0252N3679N5611
$$ 825115 848361 873990 902320 934021 969130 1007286 1048819 1094622 1144874 1198553 1254164
50073A254164N5850N3815M9320M3335L6978L0445K3868J8420J5336J4335J4162
$$ 1254164 1310014 1363829 1413149 1456484 1493462 1523907 1547775 1566195 1581531 1595866 1610028
50062A610028J4191J4350J3890J1532O795J16q199j8052k8653l8531m6534n2188
$$ 1610028 1624219 1638569 1652459 1663991 1670786 1670902 1662703 1644651 1615998 1577467 1530933 1478745
50050A478745n5291n6011n5205n3695n1374m7741m3143l8592l4540l0721k7074
$$ 1478745 1423454 1367443 1312238 1258543 1207169 1159428 1116285 1077693 1043153 1012432 985358
50039I85358k3931k1406j9364j7870j6859j5651j3731j1675j0255q941o629l762
$$ 985358 961427 940021 920657 902787 885928 870277 856546 844871 834616 825675 819046 815284
50027H15284k152k506l458l598l109k764k410j428L8J233J748J703J335R39Q75
$$ 815284 813132 810626 807168 803570 800461 797697 795287 793859 793897 795130 796878 798581 799916 800855 801730
50012H01730J179J371J037L40k97p75j277j873k379k496k096j536j478k114k713
$$ 801730 802909 804280 805317 805657 805360 804585 803308 801435 799056 796560 794464 792928 791450 789336 786623
49997G86623k498j764j540k165k881k908k282j461p76m74p22j188j084J8J702
$$ 786623 784125 782361 780821 778656 775775 772867 770585 769124 768348 767874 767152 765964 764880 764898 766600
49982G66600L201M149M755N457O501P641Q407Q898J0001J2249J4839J6580J7655
$$ 766600 769801 773950 778705 784162 790663 798304 806711 815609 825610 837859 852698 869278 886933
49969H86933J9477K2732K6658L0474L4553L9542M5185N0805N6398O2464O8884
$$ 886933 906410 929142 955800 986274 1020827 1060369 1105554 1156359 1212757 1275221 1344105
49958A344105P4529P7932P8141P5173O9923O3508N6652M9911M4337M1051L9949
$$ 1344105 1418634 1496566 1574707 1649880 1719803 1783311 1839963 1889874 1934211 1975262 2015211
49947B015211L9501L8403L6773L5088L2450K6902J7367M568r924k4827l9093n1548
$$ 2015211 2054712 2093115 2129888 2164976 2197426 2224328 2241695 2246263 2236339 2211512 2172419 2120871
49935B120871o1252o8147p2940p6281p8272p8785p7977p6279p3986p1144o7781
$$ 2120871 2059619 1991472 1918532 1842251 1763979 1685194 1607217 1530938 1456952 1385808 1318027
49924A318027o4049o0007n5618n0998m6499m2290l8150l3911k9869k6469k3719
$$ 1318027 1253978 1193971 1138353 1087355 1040856 998566 960416 926505 896636 870167 846448
49913H46448k1233j8741j6329j4264j2761j1771j0886r663q289p499p612q075
$$ 846448 825215 806474 790145 775881 763120 751349 740463 730800 722511 715012 707400 699325
49901F99325q309q526r150r871j0031r662r363r283q972q249p450o788o089n315
$$ 699325 691016 682490 673340 663469 653438 643776 634413 625130 616158 607909 600459 593671 587582 582267
49887E82267m739m408m013l369k636j975j383r29p27o87p31j024j495j383j8K033
$$ 582267 577528 573120 569107 565738 563102 561127 559744 558815 558088 557401 556670 555646 554151 552768 552750 554783
49871E54783L396L538L155K907K707K470K617L348M141M526M720N093N552N969
$$ 554783 558179 561717 564872 567779 570486 572956 575573 578921 583062 587588 592308 597401 602953 608922
49857F08922O632P766R034J0029J0835J1736J2728J3780J5100J6729J8323J9794
$$ 608922 615554 623320 632354 642383 653218 664954 677682 691462 706562 723291 741614 761408
49845G61408K1804K4978K8959L2897L6647M0849M5854N1095N5667N9045O1060
$$ 761408 783212 808190 837149 870046 906693 947542 993396 1044491 1100158 1159203 1220263
49834A220263O1462N9736N5439M8677M0408L2127K5224K0447J7802J6757J6623
$$ 1220263 1281725 1341461 1396900 1445577 1485985 1518112 1543336 1563783 1581585 1598342 1614965
49823A614965J6895J7164J6602J3905Q156m10j0878k2524l4695m6041n4855o0355
$$ 1614965 1631860 1649024 1665626 1679531 1687687 1687277 1676399 1653875 1619180 1573139 1518284 1457929
49811A457929o2967o3231o1179n7078n1972m6914m2149l7484l3034k9116k5758
$$ 1457929 1394962 1331731 1270552 1213474 1161502 1114588 1072439 1034955 1001921 972805 947047
49800I47047k2818k0253j8011j5830j3564j1410r590q115p055o557o322n646m383
$$ 947047 924229 903976 885965 870135 856571 845161 835571 827456 820401 813844 807522 801876 797493
49787G97493l439l726m993o174o684o742o674o458o009n364m547l597k745k307
$$ 797493 794054 790328 785335 779161 772477 765735 759061 752603 746594 741230 736683 733086 730341 728034
49773G28034k269k221j751r05k28l33j226k094k015r29M10J410K119K709L010
$$ 728034 725765 723544 721793 720888 720660 720327 719101 717007 714992 714063 714473 715883 718002 720711 723721
49758G23721K871K545K336K225K113K165K506K892K996K796K466K088J729J484
$$ 723721 726592 729137 731473 733698 735811 737976 740482 743374 746370 749166 751632 753720 755449 756933
49744G56933J237P20O6j19M78J339J758J652J416J334J494J923K373K316J591
$$ 756933 758170 758890 758956 758837 759315 760654 762412 764064 765480 766814 768308 770231 772604 774920 776511
49729G76511P93N51P19P37M88K63J01k31p46j309k027l064m169m907n291n610
$$ 776511 777304 777855 778574 779311 779799 780062 780163 779932 779186 777877 775850 772786 768617 763710 758419 752809
49713G52809n801n555n087n058n637o181o110n555m977m617m534m723m869m408
$$ 752809 747008 741453 736366 731308 725671 719490 713380 707825 702848 698231 693697 688974 684105 679697
49699F79697l259k222k201l089l808l507k375j293q47r18j128j374j833k487k991
$$ 679697 676438 674216 672015 668926 665118 661611 659236 657943 657096 656178 655050 653676 651843 649356 646365
49684F46365l052k723k193j495o47J9M6o53j576k005j531l54Q22J312J056O62
$$ 646365 643313 640590 638397 636902 636255 636274 636320 635667 634091 632086 630555 630201 631023 632335 633391 634053
49668F34053O88J032J240J231J305J487J346P83N26J331K820L706L332K611K925
$$ 634053 634741 635773 637013 638244 639549 641036 642382 643165 643691 645022 647842 651548 654880 657491 660416
49653F60416M365N527N207L782K646K582L089L195K496J363N42O25J700L286M781
$$ 660416 664781 670308 675515 679297 681943 684525 687614 690809 693305 694668 695210 695835 697535 700821 705602
49638G05602N957O926P691Q074Q068P931P771P395O798O470O866P735Q293Q143
$$ 705602 711559 718485 726176 734250 742318 750249 758020 765415 772213 778683 785549 793284 801577 809720
49624H09720P739P857Q725R775J0229R824Q998Q524Q982J0429J2284J3614J3847
$$ 809720 817459 825316 834041 843816 854045 863869 872867 881391 890373 900802 913086 926700 940547
49611I40547J3246J2490J1829J1034J0181R793J0005J0196R905R493R341R027
$$ 940547 953793 966283 978112 989146 999327 1009120 1019125 1029321 1039226 1048719 1058060 1067087
49599A067087Q145P435P992R612J0916J1230J1229J1698J2579J3548J4611J5678
$$ 1067087 1075232 1082667 1090659 1100271 1111187 1122417 1133646 1145344 1157923 1171471 1186082 1201760
49587A201760J6403J6855J7711J9292K1114K2713K4294K6018K7471K8346K9123
$$ 1201760 1218163 1235018 1252729 1272021 1293135 1315848 1340142 1366160 1393631 1421977 1451100
49576A451100L0372L1913L3330L4809L6806L9108M1007M2243M3178M4230M5584
$$ 1451100 1481472 1513385 1546715 1581524 1618330 1657438 1698445 1740688 1783866 1828096 1873680
49565A873680M7337M9383N1234N2248N2090N0905M9288M8226M8499M9826N0984
$$ 1873680 1921017 1970400 2021634 2073882 2125972 2176877 2226165 2274391 2322890 2372716 2423700
49554B423700N1136N0545M9687M8272M5783M2531L9391L6688L3876L0256K5672
$$ 2423700 2474836 2525381 2575068 2623340 2669123 2711654 2751045 2787733 2821609 2851865 2877537
49543B877537K0585J5776J1627P574K738k670p261j0240j2442j4944j7418j8867
$$ 2877537 2898122 2913898 2925525 2933099 2935837 2933167 2925906 2915666 2903224 2888280 2870862 2851995
49531B851995j9334j9670j9917j9261j7482j5316j3222j0877q133n470l136p27
$$ 2851995 2832661 2812991 2793074 2773813 2756331 2741015 2727793 2716916 2708783 2703313 2700177 2699450
$$ [...]
##END NTUPLES=NMR SPECTRUM
##END=
