
##TITLE=AC1294_INDRS11105_6524845_6EuqhKMaX2
##JCAMPDX= 6.0         $$ Bruker NMR JCAMP-DX V2.0
##DATA TYPE= NMR SPECTRUM
##DATA CLASS= NTUPLES
##ORIGIN= BRUKER
##OWNER= Administrator
$$ 1.72 TOPSPIN		Version 2.1
$$ 2012-07-15 00:03:47.078 -0500  Administrator@TOPSPIN
$$ Compression mode = diff/dup
##.OBSERVE FREQUENCY= 400.02188249412
##.OBSERVE NUCLEUS= ^1H
##.ACQUISITION MODE= SIMULTANEOUS (DQD)
##.ACQUISITION SCHEME= undefined
##.AVERAGES= 8
##.DIGITISER RES= 22
##SPECTROMETER/DATA SYSTEM= spect
##.PULSE SEQUENCE= zg30
##.SOLVENT NAME= COFFEE_meoh
##.SHIFT REFERENCE= INTERNAL, COFFEE_meoh, 1, 14.98509
##AUDIT TRAIL= $$ (NUMBER, WHEN, WHO, WHERE, PROCESS, VERSION, WHAT)
$$ ##TITLE= Audit trail, TOPSPIN		Version 2.1
$$ ##JCAMPDX= 5.01
$$ ##ORIGIN= Bruker BioSpin GmbH
$$ ##OWNER= Administrator
$$ $$ C:\Bruker\TOPSPIN/data/COFFEE/nmr/AC1294_INDRS11105_6524845_6EuqhKMaX2/10/pdata/1/auditp.txt
$$ ##AUDIT TRAIL=  $$ (NUMBER, WHEN, WHO, WHERE, PROCESS, VERSION, WHAT)
(   1,<2012-07-15 00:03:39.984 -0500>,<Administrator>,<TOPSPIN>,<go>,<TOPSPIN 2.1>,
      <created by zg
	started at 2012-07-15 00:02:33.375 -0500,
	POWCHK enabled, PULCHK disabled,
       configuration hash MD5:
       6B 1B 68 BB D9 2E 58 E2 7F 35 AD 54 07 DF 0E 41
       data hash MD5: 64K
       06 91 F2 C8 1A 09 16 8C B3 9C 96 F6 9C 37 2E 5F>)
(   2,<2012-07-15 00:03:42.625 -0500>,<Administrator>,<TOPSPIN>,<proc1d>,<TOPSPIN 2.1>,
      <Start of raw data processing
       efp LB = 0 FT_mod = 6 PKNL = 1 PHC0 = 0 PHC1 = 0 SI = 32K 
       data hash MD5: 32K
       F6 03 F0 FA 40 C8 E2 54 8C 05 00 BD 87 B1 C9 FE>)
(   3,<2012-07-15 00:03:43.062 -0500>,<Administrator>,<TOPSPIN>,<proc1d>,<TOPSPIN 2.1>,
      <pk PHC0 = 177.0337 PHC1 = 0 
       data hash MD5: 32K
       78 8A 1D 8A 1D F4 25 9E 09 AF 67 33 8B 9D E3 4F>)
(   4,<2012-07-15 00:03:43.140 -0500>,<Administrator>,<TOPSPIN>,<proc1d>,<TOPSPIN 2.1>,
      <abs ABSG = 1 
       data hash MD5: 32K
       6C 9F D9 DE 11 89 EE AD B5 F2 7A A1 F7 F2 3B EA>)
(   5,<2012-07-15 00:03:43.171 -0500>,<Administrator>,<TOPSPIN>,<proc1d>,<TOPSPIN 2.1>,
      <abs ABSG = 2 
       data hash MD5: 32K
       63 E3 D5 2A E2 6C E7 5C 83 7D 99 31 B3 89 BB 53>)
(   6,<2012-07-15 00:03:43.203 -0500>,<Administrator>,<TOPSPIN>,<proc1d>,<TOPSPIN 2.1>,
      <abs ABSG = 3 
       data hash MD5: 32K
       F9 29 4E 8F 27 91 16 A0 44 A8 21 34 5E 17 FB 53>)
(   7,<2012-07-15 00:03:43.234 -0500>,<Administrator>,<TOPSPIN>,<proc1d>,<TOPSPIN 2.1>,
      <abs ABSG = 4 
       data hash MD5: 32K
       F4 E0 54 CF F2 CA 3C 3A C4 B1 B6 1A 9A B9 31 B8>)
(   8,<2012-07-15 00:03:43.265 -0500>,<Administrator>,<TOPSPIN>,<proc1d>,<TOPSPIN 2.1>,
      <abs ABSG = 5 
       data hash MD5: 32K
       68 3A 41 D3 A8 4D 72 4E 85 AA EE E9 C4 02 5D 36>)
$$ ##END=
$$ 
$$ $$ hash MD5
$$ $$ 78 90 73 74 57 5C 0E D8 ED CF CE 0A DB D8 77 8F
##$RELAX= 
##$RELAX= 
##$RELAX= 
##$RELAX= 
##$RELAX= 
##$RELAX= 
##$RELAX= 
$$ Bruker specific parameters
$$ --------------------------
$$ [...]
150 150 150 150 150 150 150 150
##$TP07= 0
##$TPNAME0= <>
##$TPNAME1= <>
##$TPNAME2= <>
##$TPNAME3= <>
##$TPNAME4= <>
##$TPNAME5= <>
##$TPNAME6= <>
##$TPNAME7= <>
##$TPOAL= (0..7)
0.5 0.5 0.5 0.5 0.5 0.5 0.5 0.5
##$TPOFFS= (0..7)
0 0 0 0 0 0 0 0
##$TUNHIN= 0
##$TUNHOUT= 0
##$TUNXOUT= 0
##$USERA1= <user>
##$USERA2= <user>
##$USERA3= <user>
##$USERA4= <user>
##$USERA5= <user>
##$V9= 5
##$VALIST= <valist>
##$VCLIST= <CCCCCCCCCCCCCCC>
##$VD= 0
##$VDLIST= <DDDDDDDDDDDDDDD>
##$VPLIST= <PPPPPPPPPPPPPPP>
##$VTLIST= <TTTTTTTTTTTTTTT>
##$WBST= 2048
##$WBSW= 25
##$XGAIN= (0..3)
0 0 0 0
##$XL= 0
##$YL= 0
##$YMAX_a= 480680
##$YMIN_a= -607420
##$ZGOPTNS= <>
##$ZL1= 120
##$ZL2= 120
##$ZL3= 120
##$ZL4= 120
##$ABSF1= 14.98509
##$ABSF2= -5.573092
##$ABSG= 5
##$ABSL= 3
##$ALPHA= 0
##$AQORDER= 0
##$ASSFAC= 0
##$ASSFACI= 0
##$ASSFACX= 0
##$ASSWID= 0
##$AUNMP= <proc_prof1d_extract_pilot.lims>
##$AXLEFT= 0
##$AXNAME= <>
##$AXNUC= <1H>
##$AXRIGHT= 0
##$AXTYPE= 0
##$AXUNIT= <>
##$AZFE= 0.1
##$AZFW= 0.1
##$BCFW= 0
##$BC_mod= 0
##$BYTORDP= 0
##$COROFFS= 0
##$CY= 15
##$DATMOD= 1
##$DC= 0
##$DFILT= <>
##$DTYPP= 0
##$F1P= 0
##$F2P= 0
##$FCOR= 0.5
##$FTSIZE= 32768
##$FT_mod= 6
##$GAMMA= 0
##$GB= 0
##$INTBC= 1
##$INTSCL= 1
##$ISEN= 128
##$LB= 0
##$LEV0= 0
##$LPBIN= 0
##$MAXI= 10000
##$MC2= 0
##$MEAN= 0
##$ME_mod= 0
##$MI= 0
##$NCOEF= 0
##$NC_proc= -8
##$NLEV= 6
##$NOISF1= 0
##$NOISF2= 0
##$NSP= 0
##$NTH_PI= 0
##$NZP= 0
##$OFFSET= 14.98509
##$PC= 1
##$PHC0= 177.0337
##$PHC1= 0
##$PH_mod= 1
##$PKNL= yes
##$PPARMOD= 0
##$PPDIAG= 0
##$PPIPTYP= 0
##$PPMPNUM= 2147483647
##$PPRESOL= 1
##$PSCAL= 4
##$PSIGN= 0
##$PYNMP= <proc.py>
##$REVERSE= no
##$SF= 400.02
##$SI= 32768
##$SIGF1= 0
##$SIGF2= 0
##$SINO= 400
##$SIOLD= 32768
##$SPECTYP= <>
##$SREGLST= <1H.CDCl3>
##$SSB= 0
##$STSI= 32768
##$STSR= 0
##$SW_p= 8223.68421052631
##$SYMM= 0
##$S_DEV= 0
##$TDeff= 65536
##$TDoff= 0
##$TI= <>
##$TILT= no
##$TM1= 0
##$TM2= 0
##$TOPLEV= 0
##$USERP1= <user>
##$USERP2= <user>
##$USERP3= <user>
##$USERP4= <user>
##$USERP5= <user>
##$WDW= 1
##$XDIM= 32768
##$YMAX_p= 471081775
##$YMIN_p= -712173
##$CURPLOT= <Network HP LaserJet P1505>
##$CURPRIN= <$Network HP LaserJet P1505>
##$DFORMAT= <normdp>
##$LAYOUT= <+/1D_H.xwp>
##$LFORMAT= <normlp>
##$PFORMAT= <normpl>
##$SURQMSG= 1
$$ End of Bruker specific parameters
$$ ---------------------------------
##NTUPLES= NMR SPECTRUM
##VAR_NAME=  FREQUENCY,     SPECTRUM/REAL,   SPECTRUM/IMAG
##SYMBOL=    X,             R,               I
##VAR_TYPE=  INDEPENDENT,   DEPENDENT,       DEPENDENT
##VAR_FORM=  AFFN,          ASDF,            ASDF
##VAR_DIM=   32768,         32768,           32768
##UNITS=     HZ,            ARBITRARY UNITS, ARBITRARY UNITS
##FACTOR=    0.250966925370066, 1,           1
##FIRST=     8223.43324360094, -97396,       -197415
##LAST=      0,             -21613,          -61699
##MIN=       0,             -712173,         0
##MAX=       8223.43324360094, 471081775,    0
$$ Real data points
##PAGE= N=1
##DATA TABLE= (X++(R..R)), XYDATA
$$ [...]
19552d8210B33890f7166l1305l0405R717a3105r8564H8697a13148A6431c7429
19540c1338A22026b79138E6955Q143b37072A19068f8398J6499A277b2861A9170
19528d3913j20650K1288M8693k74737H5664a98538I9847c35873D32227d8385G1111
19516e30643K44151G0138l2074b70119a22512j25551M5977c2938o9849a0529j05494
19505a16023H8199b810j88862h7827E3077h3857F9498c14581O2105a07737A57213
19493B04029B3948f8513L947j54846j54500d4026p2358A26617o2755B694J52734
19482A55428c1291A49516A3594M1047b59140J6610C7297f413A80899D9825K30178
19471B80003f72768c13796C8224c59994B98036j16591l259H826K21881h7171G2371
$$ plain form
19552 -48210 233890 -67166 -98471 -128876 -119159 -13105 -111669 88697 -113148 16431 -37429
19540 -31338 122026 -279138 56955 65098 -237072 119068 -68398 -51899 1277 -22861 19170
19528 -43913 -164563 -143275 -94582 -369319 85664 -198538 99847 -335873 432227 -48385 71111
19516 -530643 -286492 70138 38064 -270119 -122512 -248063 -202086 -32938 -102787 -10529 -116023
19505 -116023 88199 -2810 -191672 -87827 53077 -83857 69498 -314581 -252476 -107737 157213
19493 204029 23948 -68513 -64566 -219412 -373912 -44026 -116384 126617 63862 2694 155428
19482 155428 -31291 149516 13594 54641 -259140 -242530 37297 -6413 180899 49825 280003
19471 280003 -672768 -313796 38224 -359994 298036 181445 178186 8826 230707 -87171 72371
19459D6510j1900a60780C1374b44205A62465K3963D9286A2591M8110i1812n8833
19448a50645K2064d8829F8493A3119b21612L055a5871m7535j49048h8312I4402
19436I5521a21642K379D1550c19460J40352g7752J3149C545O3783a82037l2479
19425b14516G4813K05644a14582B2505J13271M344b04726b5793I3920C0782a54238
19413A8499c90970a82865c1119B31957c00879e5193o2141L2549B11231B229J27240
19402A29469B1244a26588j68921C67138A04624n0293J5399a16805L8325B0313
19391B6732K9939a57342K9093E3554r445A2175N3850a12962j24050D2203R2380
19380A34583k3533a16659J1955r486b6656I4109b85098p1220J61331L5667f5090
$$ plain form
19459 46510 34610 -160780 31374 -244205 162465 186428 49286 12591 60701 -91812 -150645
19448 -150645 -128581 -48829 68493 13119 -221612 -218557 -15871 -63406 -212454 -88312 94402
19436 95521 -121642 -119263 41550 -319460 -179108 -77752 -64603 3545 67328 -182037 -214516
19425 -214516 74813 280457 -114582 22505 135776 140120 -204726 -25793 93920 30782 -154238
19413 18499 -390970 -182865 -31119 231957 -300879 -55193 -117334 -84785 211231 2229 129469
19402 129469 21244 -126588 -295509 367138 104624 54331 69730 -116805 -78480 20313
19391 26732 56671 -157342 -128249 53554 44109 12175 66025 -112962 -237012 42203 134583
19380 134583 111050 -116659 -104704 -114190 -26656 94109 -285098 -356318 -194987 -159320 -65090
19368b6342D6218b18826a359B22149a51893d2960j76345j75922J91636a8051o9622
19357h7673E9447J9969e37854g4398k1288H699e3340k64850p1570B12007E7823
19345a32067j08155B44711a57269k613A14114C3303J87273a21769c0461A25211
19334C10670h1331b3235k07220k8396j4894L8905j3208g3557B05255h4777k17708
19323c02485e9215g823j17262M7358N282j8364j35871c8941l52984B1804b62107
19311i3418A10071b42674B464a34688j16478h8942a2243k09427J00996n4876C3959
19299b22657Q9034a8578k15750a02263E533e6789r3013m882H0691A5936c40031
19287c8985A76939c7679j70428n9656A17093b13935a9944j91217A22687a23513
$$ plain form
19368 -26342 46218 -218826 -1359 222149 -151893 -42960 -219305 -395227 -203591 -18051 -87673
19357 -87673 59447 79416 -537854 -74398 -95686 8699 -53340 -318190 -389760 212007 57823
19345 -132067 -240222 244711 -157269 -159882 114114 33303 220576 -121769 -30461 125211
19334 310670 -81331 -23235 -230455 -258851 -273745 -234840 -248048 -73557 205255 -84777 -302485
19323 -302485 -59215 -7823 -125085 -77727 -72445 -90809 -226680 -38941 -391925 21804 -262107
19311 -93418 110071 -242674 2464 -134688 -251166 -88942 -12243 -221670 -120674 -175550 33959
19299 -222657 -133623 -18578 -234328 -102263 5533 -56789 -149802 -154684 80691 15936 -340031
19287 -38985 176939 -37679 -208107 -267763 117093 -213935 -19944 -211161 122687 -123513
19276A96407b3923j80305A71770b43695g7959j93277F6980Q6669a87591A32323
19265b56559O8372i531j28225A56463p1932k5783b70118A185b33382H5278J21886
19254B07164H8674D0577b76244D2162P4184a78134a9820A02528c12139E7284N8287
19243A15571d5657E0451R3846c14479I1015a20155C1701N113a09804f908p2335
19232g9243J1006F73L61311a38396k0432j12757J6140p891A35849c093k0443q2686
19220a06222C540b44558h6732l28395J88976i368D3325J46712c59042J59163A92933
19208G5949L05737E2121A0778J3750a33234B1681K48090c87085a35451O7333k63646
19197c31764a22223D8655f0814K9269A4237e4101j33450k62752i0414B62562a04690
$$ plain form
19276 196407 -23923 -204228 171770 -243695 -77959 -271236 66980 153649 -187591 132323
19265 -256559 -188187 -9531 -137756 156463 84531 58748 -270118 1185 -233382 85278 207164
19254 207164 88674 40577 -276244 42162 116346 -178134 -19820 102528 -312139 57284 115571
19243 115571 -45657 50451 144297 -314479 91015 -120155 31701 36814 -109804 -6908 -79243
19232 -79243 -68237 673 361984 -138396 -158828 -271585 -255445 -263336 135849 -3093 -23536 -106222
19220 -106222 3540 -244558 -86732 -415127 -226151 -9368 43325 190037 -359042 -199879 192933
19208 75949 381686 52121 10778 24528 -133234 21681 269771 -387085 -135451 -68118 -331764
19197 -331764 -122223 48655 -60814 -31545 14237 -54101 -187551 -450303 -90414 262562 -104690
19185f3033j09866d9184B31017i1116C8875K0652a62811A53805F1713a38938N8944
19174g9994b503m8789B56734a12073B43947e7194k24783q6447A0582O5065b11906
19162G144h2407j40372j65606a09096j62110A53636a6307o0608q0170j47033g7920
19150a58920H4159a02687D5943a56875H8942B4578J13283I639b28830g315k21499
19139b28814I8238i5621l05350A16735a30200G9980A0986E73a65622l19457A61701
19127B3343L8266b46431b2420q5949D3582A6193N9129c56657f9325A51250b12085
19115C47644c7584j2109k73789A52919c11709F2177a83538P0714J447J4743l12491
19104d09125a82268O3350j37398M7377P7201c4669p0891j30462P2473A47211i5186
$$ plain form
19185 -63033 -172899 -49184 231017 -91116 38875 59527 -162811 153805 61713 -138938 -79994
19174 -79994 -2503 -51292 256734 -112073 243947 -57194 -281977 -368424 10582 75647 -211906
19162 7144 -82407 -222779 -388385 -109096 -271206 153636 -16307 -76915 -157085 -304118 -77920
19150 -158920 84159 -102687 45943 -156875 88942 24578 137861 9639 -228830 -7315 -228814
19139 -228814 98238 -95621 -400971 116735 -130200 79980 10986 573 -165622 -485079 161701
19127 23343 61609 -246431 -22420 -108369 43582 16193 75322 -356657 -69325 151250 -212085
19115 347644 -37584 -49693 -323482 152919 -311709 62177 -183538 -112824 -111377 -96634 -409125
19104 -409125 -182268 -118918 -256316 -208939 -131738 -34669 -105560 -236022 -163549 147211 -95186
19092I5660J98502b42327c0380o475F9421g175l5508A2611b42019K5466j06945
19081c23498A0730a49288B20374a52976A19463B5392J10888b07649G8490a42061
19070B11691j05021K1560E2613K9335c8701D0667K78858h3524a952A43167F3718
19058A18043a24525N8922j18826A0964a87005B95680a9A6141J81379e3356K4684
19047b8672j6479R080l03506E4682b1424A65262a4179k19346A73643f61830A66595
19035D38276b9620j6435k62268G2777C3727a4748j07182G5928e6812I4617b47122
19023G9959e4580k53109B02628m3735J00548g5592G653J66225f88E1608a90536
19011G1727b4789A97145b05068b6714B87290c0038n2832j3148l31804A00754c16643
$$ plain form
19092 95660 294162 -242327 -30380 -36855 69421 -7175 -42683 12611 -242019 -216553 -323498
19081 -323498 10730 -149288 220374 -152976 119463 25392 136280 -207649 78490 -142061
19070 211691 106670 128230 52613 81948 -38701 40667 319525 -83524 -1952 143167 63718
19058 118043 -124525 -65603 -184429 10964 -187005 295680 -19 16141 197520 -53356 -28672
19047 -28672 -45151 -36071 -339577 54682 -21424 165262 -14179 -233525 173643 -661830 166595
19035 438276 -29620 -46055 -308323 72777 33727 -14748 -121930 75928 -56812 94617 -247122
19023 79959 -54580 -307689 202628 158893 259441 -75592 7653 173878 -688 51608 -190536
19011 71727 -24789 197145 -205068 -26714 287290 -30038 -82870 -96018 -427822 100754 -316643
18999d10909H730d15555d0570l16537h1498j45332A1461c4479n9834A62410a30060
18987A83709p5692d2909C06886G995J08914J65489a71918q1267D701d4047B66568
18975E774K08703b19962C07173D3445c44432J8965B2143a43761F3619a9108A27143
18963a9736A74075b91881A19963a33852j02779A70174a42804O8549j386k43332
18953c18973h7370p1395A78040b7027k30092M0960j56785C8818a16926c0459m7109
18942g7568A91694L4480a1387k79408C6386N979J73938F3157K6761a80867M3945
18931a36922A63097E0221a47796A39042o5902M3499K3662a18631K4683j70275
18921b64223A40481c74296b2467r9261k74491D7338M230B4838N6490J40627i4520
$$ plain form
18999 -410909 8730 -415555 -40570 -357107 -81498 -226830 11461 -34479 -94313 162410 -130060
18987 183709 108017 -42909 306886 7995 116909 282398 -171918 -253185 4701 -44047 266568
18975 5774 214477 -219962 307173 43445 -344432 -325467 22143 -143761 63619 -19108 127143
18963 -19736 174075 -291881 119963 -133852 -236631 170174 -142804 -74255 -75641 -318973
18953 -318973 -87370 -158765 178040 -27027 -257119 -216159 -372944 38818 -116926 -30459 -77568
18942 -77568 191694 226174 -11387 -290795 36386 42365 216303 63157 89918 -180867 -136922
18931 -136922 163097 50221 -147796 139042 73140 116639 140301 -118631 -93948 -264223
18921 -264223 140481 -374296 -22467 -121728 -396219 47338 51568 24838 81328 221955 -94520
18909g943C3622b70350g6246E5851a1551B21755c44068D1552c08166h160H2069
18897f1614A03356a05147N2386j17103h0986o8523A08603b99989C8051a89559
18886A03060A217a06735E3394b3233B56067D2234e08450B15184H4234a47995A56323
18874b14960f8603d373l70022a80662k203b9553j11854A67470d7848q5510d9897
18862d6623p7881c1010G9686h1806A56026K45130F9575M2880f5733o753I5148
18850c28606J39399A02749D4932J57378a50082o64k15057a17965L2118C69281
18839b53003A0964Q8558f4019o4225L6482n2357R980k75009D08099A78975b29886
18827D2237a62679g6127B9777b49094J20283j97383a57359e5245C3411L27566
$$ plain form
18909 -7943 33622 -270350 -76246 55851 -11551 221755 -344068 41552 -308166 -8160 82069
18897 -61614 103356 -105147 -52761 -169864 -80986 -149509 108603 -299989 38051 -189559
18886 103060 1217 -106735 53394 -23233 256067 42234 -508450 215184 84234 -147995 156323
18874 -214960 -68603 -4373 -374395 -180662 -182865 -29553 -141407 167470 -47848 -133358 -49897
18862 -46623 -124504 -31010 79686 -81806 156026 401156 69575 112455 -65733 -72486 95148
18850 -328606 -189207 102749 44932 202310 -150082 -150746 -365803 -117965 -85847 369281
18839 -253003 10964 99522 -64019 -128244 -91762 -144119 -134139 -409148 408099 178975 -229886
18827 42237 -162679 -76127 29777 -249094 -128811 -326194 -157359 -55245 33411 360977
18817C60977A37196j2902J48902a28264a2046B09413M146b80923r3625g1603H801
18805B22802a57195H4055d0830A34220c9759A01470a49925A06132K4185B3833
18794I6490a14648D095a22453F5897J67020g5525i831r9219B64674L3369O2603
18783C60646D4345K9635a86155A56739l6749b35357J13255f0380L092j95179G2090
18771i2898k85442a02282o5751p3234c5355j47649A86063J75494c66023A68481
18760h8594A27392b77810a5851A2876b9690m4078j50109c426l13385I2696L5868
18749A28564c60436A27853D7992b77134j02977j2513l0802H9182M0512i9792j79891
18738b79683Q8932E4201a18306k72101I453J03762B4751J39891a76366o4232k3910
$$ plain form
18817 360977 137196 124294 273196 -128264 -12046 209413 213559 -280923 -374548 -71603 8801
18805 222802 -157195 84055 -40830 134220 -39759 101470 -149925 106132 130317 23833
18794 96490 -114648 4095 -122453 65897 232917 -75525 -9831 -109050 264674 298043 360646
18783 360646 44345 73980 -186155 156739 119990 -235357 -122102 -60380 -57288 -252467 72090
18771 -92898 -378340 -102282 -168033 -241267 -35355 -183004 186063 361557 -366023 168481
18760 -88594 127392 -277810 -15851 12876 -29690 -73768 -223877 -3426 -316811 92696 128564
18749 128564 -360436 127853 47992 -277134 -380111 -392624 -423426 89182 129694 -99792 -279683
18738 -279683 -190751 54201 -118306 -390407 9453 113215 24751 164642 -176366 -240598 -264508
18727b64508B0091K24514j9037A7668a20545H6771b45068i8668B78304b15482
18716b7318B84958a19280m5931n7847e0323o2588F5444a31200q3338B04295d3439
18704B36881j03142c3526k5707A16698b10167a9891p3253K2686j83023C4500J6294
18693E0794b08644j0497B2444c4583J6500p6757r3978C5980c05556g7447k05608
18682b83055a0675A73401c07704a1187M578j08984L3278A60565b07285F4564a34431
18670e2970k48982A29170E9627d287A37160b50535B2502h7084C5771b15086B08956
18658a48627B50900a24442A6099d28349C6906a30011G8909a28296B9675a95785
18647F4644a61217A76223d05218a60610O6717B02615a42500B06770l29B2418J63103
$$ plain form
18727 -264508 20091 244605 225568 17668 -120545 86771 -245068 -98668 278304 -215482
18716 -27318 284958 -119280 -165211 -223058 -50323 -112911 65444 -131200 -214538 204295 -43439
18704 236881 133739 -33526 -59233 116698 -210167 -19891 -93144 -70458 -253481 34500 50794
18693 50794 -208644 -219141 22444 -34583 -18083 -94840 -188818 35980 -305556 -77447 -283055
18682 -283055 -10675 173401 -307704 -11187 -6609 -115593 -82315 160565 -207285 64564 -134431
18670 -52970 -301952 129170 59627 -4287 137160 -250535 22502 -87084 35771 -215086 208956
18658 -148627 250900 -124442 16099 -428349 36906 -130011 78909 -128296 29675 -195785
18647 64644 -161217 176223 -405218 -160610 -93893 202615 -142500 206770 206441 22418 185521
18636A85521i6678B22657p0509b25930G1184M2310d29510g8932C1532b42769C8001
18624b70534O1524A81238a02319n30j29759G5927g1906I5819a57939L245N3974
18613a00720A59863m3376a28591j03554G8308b78825C4410P2054a64969M2952
18603a22017I4693c32119O1134A25327b16839g321H5248g0658C4264a79744m7931
18592b27675E0594O2038c8138j90304i3853l5902A9099J63978b36502Q1739A71581
18580c58901l596b3731l06906a32046l67894b23098a9027j75753A18226c2841
18569g0045E9149A5231K6011a50954C51706b39980A7513a2801q5615A5561L6228
18558E1789b49670A6367b19886j28530J53284R0003d957j22034b5847G227c40803
$$ plain form
18636 185521 -96678 222657 152148 -225930 71184 113494 -429510 -78932 31532 -242769 38001
18624 -270534 -209010 181238 -102319 -102849 -232608 75927 -71906 95819 -157939 -154694 -100720
18613 -100720 159863 116487 -128591 -232145 78308 -278825 34410 106464 -164969 -122017
18603 -122017 94693 -332119 -270985 125327 -216839 -7321 85248 -70658 34264 -179744 -227675
18592 -227675 50594 112632 -38138 -228442 -93853 -129755 19099 183077 -236502 -154763 171581
18580 -358901 -362497 -23731 -330637 -132046 -499940 -223098 -19027 -194780 118226 -32841
18569 -70045 59149 15231 41242 -150954 351706 -239980 17513 -12801 -98416 15561 51789
18558 51789 -249670 16367 -219886 -348416 -195132 -105129 -4957 -126991 -25847 7227 -340803
18546i146A5239g7388B20991B0216a81590O8727J1170M653q5721A59473a91168
18534a62133C0626a16336A62419J94872D634g931K096E7172J84341j16041K726
18523A28198b13722p7320J27907e7514D2340a06857A38544P6473I330M865b97315
18511I9522m0236a08184j07730N9855F58h0604J1816B03948g2549Q189j04972
18500a69332F7095J21398H107a0676l23940g281A35936a82146A65730i169j38053
18489a47222k89828B61877J34579a6097I0627b38265E5935e9888C8066i3308K9563
18478f3745K4159r7165q6655F7603a53845p4118n5956a09658B42497a83911M6362
18467a37549N2928j0169C1850a58912r6841f0984B17727h9041j85123k00135a05832
$$ plain form
18546 -9146 15239 -77388 220991 20216 -181590 -112863 -101693 -97040 -182761 159473 -191168
18534 -162133 30626 -116336 162419 357291 4634 -7931 -5835 57172 241513 125472 128198
18523 128198 -213722 -291042 -163135 -57514 42340 -106857 138544 215017 9330 14195 -297315
18511 99522 59286 -108184 -215914 -156059 658 -80604 -68788 203948 -72549 -64360 -169332
18500 -169332 67095 188493 8107 -10676 -334616 -7281 135936 -182146 165730 -9169 -147222
18489 -147222 -437050 261877 396456 -16097 90627 -238265 55935 -59888 38066 -93308 -63745
18478 -63745 -39586 -136751 -223406 67603 -153845 -227963 -283919 -109658 242497 -183911 -137549
18467 -137549 -84621 -94790 31850 -158912 -255753 -60984 217727 -89041 -274164 -474299 -105832
18455B17763b63359A62753n8601g9419k55372J45487N0972k5139l4021R209j15521
18444c03804n7773A68822D6281a05419A46026B6296N723a53288g0334k20717B73158
18432b80158A04951K07833I7782b22510F5583J4336l2916L4597d2305J1378k06318
18421b37245j58456D2018g8095G354O8975b2033j41051j8574F4498h1019j46004
18410b27023J10436D6471P6951m5153b3650B11175a58235G2362i1170j1483A05554
18398A18094b8037o8949k00993J0282I2980a7651j42856j2534j8353A34620g4509
18386I2703D2137b01003B46000b2238C6721a02098L1812j32608G3888a60764j602
18375a62366n1573A34709b35016f3753C62181f1867j068j59561A17821Q4704a36674
$$ plain form
18455 217763 -263359 162753 104152 -79419 -334791 -189304 -138332 -163471 -197492 -188283 -303804
18444 -303804 -361577 168822 46281 -105419 146026 26296 32019 -153288 -70334 -291051 273158
18432 -280158 104951 312784 97782 -222510 65583 79919 47003 81600 -42305 -30927 -237245
18421 -237245 -395701 42018 -78095 7354 76329 -22033 -163084 -181658 64498 -81019 -227023
18410 -227023 -116587 46471 123422 78269 -23650 211175 -158235 72362 -91170 -102653 105554
18398 118094 -28037 -96986 -297979 -287697 92980 -17651 -160507 -173041 -191394 134620 -74509
18386 92703 42137 -201003 246000 -22238 36721 -102098 -70286 -202894 73888 -160764 -162366
18375 -162366 -213939 134709 -235016 -63753 362181 -61867 -62935 -222496 117821 202525 -136674
18363C386K1179J19895a61045A95173b68090A8574J9429J321C29d6010A32045
18351e637o3751j87672A04241l487P9570i9248M9312n2958A76425b23843a05141
18339i3710l5892N9077l4946B13726H9563a14624B23222b93538g075j21246o5196
18328a93517A20131g3212k33155A86049i8145K8965A54680c2609G474K03275e4407
18316b44953a8618k22748D9198a09481L651M1048B45300b17370a5839B35395M8848
18305B84243f7836k844r6643A96377D622J47433N7854m5253a7170q5078k26715
18294c28963i884r1459A60243a53828k28859i1694I2955d7292A33438h1377E176
18282a59492O0425p265j19409j00052E4272h3576B1543a27426k06184B90685c02026
$$ plain form
18363 3386 24565 144460 -161045 195173 -268090 18574 38003 39324 329 -46010 132045
18351 -5637 -69388 -257060 104241 100754 180324 -99248 -49936 -102894 176425 -223843 -105141
18339 -93710 -129602 -70525 -105471 213726 89563 -114624 223222 -293538 -7075 -128321 -193517
18328 -193517 120131 -73212 -306367 186049 -98145 -69180 154680 -32609 7474 210749 -54407
18316 -244953 -18618 -241366 49198 -109481 -105830 -64782 245300 -217370 -15839 235395 284243
18305 284243 -67836 -70680 -167323 196377 4622 152055 209909 164656 -17170 -102248 -328963
18294 -328963 -9884 -101343 160243 -153828 -382687 -91694 92955 -47292 133438 -81377 5176
18282 -159492 -99067 -106332 -225741 -325793 54272 -83576 21543 -127426 -333610 290685 -302026
18270H7618b39715A03572a73136L8859A82863C1461I636M6837j1102k006K03666
18259B47031m5035d220o8457k13309L3257A26962b79451E6771b81429C9995h3370
18247a18113j11421H3275L9701h4032k3878D8200a62924P3688B09827o2080D2555
18235c63971a22532M5066c1883k417k7396k4761A54233E3446j4847J23605D6007
18223a91312E4942f542G7735d14714a62681E1203c26119A57345n1387e4969n1800
18212a06769J5714n6352g941l6967p3176M755l16681a57352D36499a23191k17736
18201c40927R8477a13570B6996b37886p3031l14485f0251B220g593j87041j6659
18190b11293C45395a64249H1721a70359A39611d67510b5801q03H2396C5771a53054
$$ plain form
18270 87618 -239715 103572 -173136 -134277 182863 31461 9636 56473 45371 43365 247031
18259 247031 201996 -4220 -72677 -285986 -252729 126962 -279451 56771 -281429 39995 -83370
18247 -118113 -229534 83275 122976 -84032 -107910 48200 -162924 -89236 209827 147747 42555
18235 -363971 -122532 -77466 -31883 -34300 -61696 -86457 154233 53446 38599 162204 46007
18223 -191312 54942 -6542 77735 -414714 -162681 51203 -326119 157345 105958 -54969 -106769
18212 -106769 -91055 -147407 -7941 -44908 -118084 -113329 -430010 -157352 436499 -123191 -340927
18201 -340927 -242450 -113570 26996 -237886 -310917 -625402 -60251 2220 -7593 -194634 -211293
18190 -211293 345395 -164249 81721 -170359 139611 -467510 -25801 -26604 82396 35771 -153054
18178d24058a67127A80889D1663K76704a75467A85355C7784a72031F6247e9114
18167a79253a3491A45174a08322j07317A31770o0129J43c80909J45276A05742
18156a83930j31128B72458c56075J8551a04901C9120R175b44210o1799A77869
18145A08798c76945C7500a58822G3515h8521k9584B3975L04255b7912r5753K9112
18134i4553A7625a80118M1044M6401C71878j65879o7632h2496B8267c78763A1608
18122c09157A61601k3151a20036J9327G2067N0820a6757b437C5782a21998b3488
18110F0952e2103j11559E134J60875a55098C7470J71218h1524C35386d1197j08822
18099a50019a5303A62025b96798c2274D5335M6714J38621j4789e2155A5363c9030
$$ plain form
18178 -424058 -167127 180889 41663 318367 -175467 185355 37784 -172031 66247 -59114
18167 -179253 -13491 145174 -108322 -215639 131770 71641 71784 -380909 -235633 105742
18156 -183930 -315058 272458 -356075 -337524 -104901 39120 48295 -244210 -306009 177869
18145 108798 -376945 37500 -158822 73515 -88521 -118105 23975 328230 -27912 -123665 -94553
18134 -94553 17625 -180118 -139074 -92673 371878 205999 138367 -82496 28267 -378763 11608
18122 -309157 161601 138450 -120036 -100709 72067 122887 -16757 -2437 35782 -121998 -23488
18110 60952 -52103 -163662 5134 166009 -155098 37470 208688 -81524 335386 -41197 -150019
18099 -150019 -15303 162025 -296798 -32274 45335 92049 230670 215881 -52155 15363 -39030
18087d4025j0246A09734K0825b25005L2189A65652e6598I6305R1185A2064b4487
18075b93797h4299D3478a37573A30987b08092g8511J0453b4224j25618K3610A04572
18063d15638a28876A58455C4464a69097G8734a01374A39395F6852c3854a3471
18052F6540d4604j26472E5287c48620g3530j06388k3911a4385k7799C7538h4125
18040c7242r3813l3017g9606D2495a12953A88871b50210d1630A21457b24655B21819
18028E6497a29592e7404j93640n6707a07459j08287B27871b42491A30182E8198
18017B46359e7904k18401f9535j1931I6031b66242j04936F7184c39423C377K24528
18006B27905M1074b34434M1565p9463C828K39527j10862g1154A26250R7452q2209
$$ plain form
18087 -44025 -54271 109734 130559 -225005 -192816 165652 -56598 96305 187490 12064 -24487
18075 -293797 -84299 43478 -137573 130987 -208092 -78511 -68058 -24224 -149842 -126232 104572
18063 -415638 -128876 158455 34464 -169097 78734 -101374 139395 66852 -33854 -13471
18052 66540 -44604 -171076 55287 -348620 -73530 -179918 -203829 -14385 -42184 37538 -84125
18040 -37242 -131055 -164072 -79606 42495 -112953 188871 -250210 -41630 121457 -224655 221819
18028 56497 -129592 -57404 -251044 -307751 -107459 -215746 227871 -242491 130182 58198
18017 246359 -57904 -276305 -69535 -81466 96031 -266242 -371178 67184 -339423 3377 227905
18006 227905 268979 -234434 -192869 -272332 3828 243355 132493 -71154 126250 223702 141493
17995A41493J54508j36797k7909K6181A2356a79119B53141H1261a25067I6223
17984A25326J07636h6760A89137c4161A24965a99009m1457M385a12756q6334B94240
17972a89311P958b7398A5095K18663C3714a71821A63154f9391A64608b00991A39377
17960A5268E951R2158a29560l1944j46706i0011c0221B0650D482K99223J39102
17949D42807b05596i2714j10999L8105N8555J0450k28091A52754a38215G0613
17938b94711B23907B8143b06787B51400I8841h3464o6337B27311D7091J32336
17928A79427a6184A09623M575J41622J64725a67671C04876a68745r3632a5707
17917a12249C51673F2529A1663a51333e9607b3282j70351a1265A07904A5146i3859
$$ plain form
17995 141493 296001 159204 131295 157476 12356 -179119 253141 81261 -125067 96223
17984 125326 232962 -86760 189137 -34161 124965 -199009 -240466 -236081 -112756 -199090 294240
17972 -189311 -181353 -27398 15095 233758 33714 -171821 163154 -69391 164608 -200991 139377
17960 15268 5951 98109 -129560 -161504 -308210 -90011 -30221 20650 4482 303705 442807
17949 442807 -205596 -92714 -203713 -165608 -107053 -96603 -324694 152754 -138215 70613
17938 -294711 223907 28143 -206787 251400 98841 -83464 -149801 227311 47091 179427
17928 179427 -16184 109623 114198 255820 420545 -167671 304876 -168745 -262377 -15707
17917 -112249 351673 62529 11663 -151333 -59607 -23282 -193633 -11265 107904 15146 -93859
17905A18591E2212d5322A82487D5785K2616a67124A48476a1476A82871o5557a65873
17893a17093J8754C58626H4429d0432j49543B067L3421g3812B08318c25327h0858
17881D6786J75748L1876H5492h7439j34019F9845e6647j34402C1272D306J8684
17870B2990J00787c72726N6429J48966M5651F9444a9082j34118N4950B15531A03796
17858a22922d0987q0830j7693f4836k21911B8822J81419c03082A17653a0904q0623
17847i1527F5888a74040B01242a11542l0041B40460f1258A59827a8525k89498
17837c08023r4681d2888A16426J77294d81744J99163n506J38939B54344a57730
17826a55376I9453K59478b96505A0644a04729A7484e6171m7647B36134c2577q8852
$$ plain form
17905 118591 52212 -45322 182487 45785 68401 -167124 148476 -11476 182871 117314 -165873
17893 -117093 -98339 358626 84429 -40432 -189975 2067 35488 -73812 208318 -325327 -80858
17881 46786 222534 254410 85492 -87439 -221458 69845 -56647 -191049 31272 4306 22990
17870 22990 123777 -372726 -316297 -167331 -121680 69444 -19082 -153200 -98250 215531 103796
17858 -122922 -40987 -121817 -139510 -64836 -286747 28822 210241 -303082 117653 -10904 -91527
17847 -91527 65888 -174040 201242 -111542 -141583 240460 -61258 159827 -18525 -308023
17837 -308023 -402704 -42888 116426 293720 -481744 -282581 -288087 -149148 254344 -157730
17826 -155376 99453 358931 -296505 10644 -104729 17484 -56171 -103818 236134 -32577 -121429
17815a21429B26225d9104F8671M580Q2228f1965B48765G8516O7703j4119a78452
17803h6510j2203E4804h2531K7208k6358A21904a51911H8565B5186O4319b8849
17791A41300F9780J12247B4908g2228I4539b66393J13664C1687Q1633R6911I3821
17779a66094C5638a64726H5203A5304K86612c9736j32502C48218E7964K3237e51
17767c9145E7480K5990R109A4100b10497G6981a01056d5750A84616a88348e1152
17755c41040A13337J46476E9927a06993A02385b02494j76754O7105F6729a17826
17744B90951b09293h6231O236B40144f7485l7027A3778c0048k47212H2747O1104
17733A43851F0728b04614D4165M9225D1529J48567O4963F3215g5540c7174B78445
$$ plain form
17815 -121429 226225 -49104 68671 73251 155479 -61965 248765 78516 146219 132100 -178452
17803 -86510 -98713 54804 -82531 -55323 -81681 121904 -151911 88565 25186 89505 -28849
17791 141300 69780 182027 24908 -72228 94539 -266393 -152729 31687 113320 210231 93821
17779 -166094 35638 -164726 85203 15304 301916 -39736 -172238 348218 57964 81201 -551
17767 -39145 57480 83470 92579 14100 -210497 76981 -101056 -45750 184616 -188348 -51152
17755 -341040 113337 259813 59927 -106993 102385 -202494 -379248 -312143 66729 -117826
17744 290951 -209293 -86231 -79995 240144 -67485 -104512 13778 -30048 -277260 82747 143851
17733 143851 60728 -204614 44165 93390 41529 190096 255059 63215 -75540 -37174 278445
17721A63308K426b15127O4927b9735A66064q2529a67208H6485l1517R2971b13531
17709C7757J0928K25010A102L6003i8744I8151J34548G8374O7825D0077a89239
17697A25072E0919a02347b1615A50612P1158c6137l09195a24062A22807L2639
17687A55446K2982A5548J00056j9835B4966N5616J7112k3580B20a7586n7926A02239
17674A70286j0589a46082B79101b46812I1532B6283J14637P816C8529a07995A86336
17662a23181c479B75410D0857Q3910g0688j10767C4607c23817B62208A09408a8001
17650B59712A07246f8316B7254J03020a69965c1293A14419J70850i3371M5008
17640d8363A22064K48712b43723H5474Q1265m3836a02336P647B2784N4844a01384
$$ plain form
17721 163308 165734 -215127 -150200 -29735 166064 83535 -167208 86485 54968 147939 -213531
17709 37757 48685 273695 1102 37105 -98744 98151 232699 78374 146199 40077 -189239
17697 125072 50919 -102347 -21615 150612 221770 -36137 -345332 -124062 122807 155446
17687 155446 178428 15548 115604 95769 24966 80582 97694 74114 220 -17586 -75512 102239
17674 170286 159697 -146082 279101 -246812 91532 26283 140920 148736 38529 -107995 186336
17662 -123181 -3479 275410 40857 124767 -70688 -181455 34607 -323817 262208 109408 -18001
17650 259712 107246 -68316 27254 130274 -169965 -31293 114419 285269 -93371 -48363
17640 -48363 122064 370776 -243723 85474 166739 122903 -102336 -94689 22784 77628 -101384
17628f6612A5210J22611d69947A57005M5267P969m3713p2126P3931g8099G1695
17616c20682D949l95i067p2045B0754J75816k00f8962F7947O2651J94230p9198
17604B45630E0931Q3145b070A57366a73971B49044J84462o4966a05104F8443b0025
17592a36037f6055k9060H2237J8879h5574A53477h6011n2827E1316J19056a38169
17580B53120J35357b6850E219L31494B2922c0334m7173B20200B2919f9351B16454
17568c3789D5458M7747b74777A97725a56602c8235E5991b15955d2994A28203M4260
17557A72463R991a98385A85275F2689J47646J63714A33030c84623h3085j27247
17547b10332f0743H8783b29843a6777A15972J77356b31835B15979c2073l6499
$$ plain form
17628 -66612 15210 137821 -469947 157005 202272 210241 166528 94402 168333 -78099 71695
17616 -320682 4949 4554 -9067 -81112 20754 196570 196370 -68962 67947 130598 324828 245630
17604 245630 50931 134076 -2070 157366 -173971 249044 433506 368540 -105104 68443 -20025
17592 -136037 -66055 -95115 82237 101116 -85574 153477 -86011 -138838 51316 170372 -138169
17580 253120 388477 -26850 5219 336713 22922 -30334 -77507 220200 22919 -69351 216454
17568 -33789 45458 93205 -274777 197725 -156602 -38235 55991 -215955 -42994 128203 172463
17557 172463 182454 -198385 185275 62689 210335 374049 133030 -384623 -83085 -210332
17547 -210332 -60743 88783 -229843 -16777 115972 293328 -231835 215979 -32073 -68572
17537f8572I1105C6945J86177C648a34745A13649c24534A9815J88354J2437b51707
17525B92859n9762M7165A01380e882A83814G2819b71563A17233O3473J12690C8901
17513C09229f8855B82059p0860j03214P7185g6421A16983f442B81181D3332j0812
17502C2520L8982J80569n9446R7904a02230d7449A45731J2289P0441A5898M8551
17491F4449J85707g261B6987M9174N5207J04015k9963D6284J04859Q8281b70596
17479B39967L4735A33999D6733K84159c11600b9555A25630b4796C64081C7051
17468A68778L1374n7832Q7109n6729j6769A6174D736J35385J16196H9179C615
17456D20340F9760L25956k8793j37590J8029m9072r0400J90995P9289K9812j65666
$$ plain form
17537 -68572 91105 36945 223122 3648 -134745 113649 -324534 19815 208169 220606 -251707
17525 292859 233097 280262 101380 -5882 183814 72819 -271563 117233 180706 293396 38901
17513 309229 -68855 282059 211199 107985 185170 -76421 116983 -6442 281181 43332 32520
17502 32520 71502 252071 192625 290529 -102230 -47449 145731 158020 228461 15898 64449
17491 64449 250156 -7261 26987 76161 131368 235383 205420 46284 151143 239424 -270596
17479 239967 274702 133999 46733 330892 -311600 -29555 125630 -24796 364081 37051
17468 168778 200152 142320 229429 172700 155931 16174 4736 140121 256317 89179 3615
17456 420340 69760 395716 366923 229333 247362 198290 107890 298885 378174 407986 242320
17445B42320e5631G2841J26782a623C2659K32314O635A10429J3015L66493B43684
17433i994C03482A8390J24633J53646L13380j49896D5898J79248L3944K27411
17423D86501A02025L96676h9469C61570j33916b9138A16109P7716M33865G0336
17412B60743J08659M9366b60917H1414b3557D88811j88335a15128d9754C77790
17401A93750b15754B2113J3370K65087n2167K4639I0039K25522Q1761k0590r1082
17390B85650A22852h9573r7056C4758K29380A08343J45890p6329a7860j4188q1861
17379a13909B52685f8837B69058A04927K9044a77024C22343A25826J38907j27566
17369A37167J38393d5610E8804J02802D5451L5869l8023J00956C879K60976a95182
$$ plain form
17445 242320 -55631 72841 199623 -1623 32659 264973 271608 110429 123444 489937 243684
17433 -9994 303482 18390 143023 296669 610049 460153 45898 225146 259090 486501
17423 486501 102025 498701 -89469 361570 227654 -29138 116109 193825 627690 70336
17412 260743 369402 418768 -260917 81414 -23557 488811 300476 -115128 -49754 377790
17401 193750 -215754 22113 35483 300570 248403 273042 90039 315561 397322 376732 285650
17390 285650 122852 -89573 -186629 34758 264138 108343 254233 177904 -17860 -32048 -113909
17379 -113909 252685 -68837 269058 104927 133971 -177024 322343 125826 264733 137167
17369 137167 275560 -45610 58804 161606 45451 81320 43297 144253 3879 264855 -195182
17357E8224h7502C6830J89053n2256J99536j38440C1264b13842h0210A79843P3323
17346B53166h8294B28376J53699b16327D10172D2696J43335a27492d4036A54133
17335g4272A2995b0928G1336l338K20400e9140B75896A25684Q1819J9391p9768
17324A47126O7427n9586N4961H1341J07591P3979I8968a5207H2944b9915I200
17312d4099C5946h7513C82004d520B15244G155K17629B1887K47210H2868J2694
17301I5562J83541j35938J36881b26095B77752o8593h5258j44083D10280D6747
17290C9937A348P9534a67616D38565H3056d6008B11989G4241K53379K0074A71299
17278B65915r8065c5999C01732C5273M613c04627A19599J77102f0626A93886b494
$$ plain form
17357 58224 -87502 36830 225883 173627 373163 234723 31264 -213842 -80210 179843 253166
17346 253166 -88294 228376 382075 -216327 410172 42696 186031 -127492 -44036 154133
17335 -74272 12995 -20928 71336 67998 288398 -59140 275896 125684 207503 226894 147126
17324 147126 214553 154967 209928 81341 188932 262911 98968 -15207 82944 -29915 9200
17312 -44099 35946 -87513 382004 -4520 215244 7155 224784 21887 269097 82868 95562
17301 95562 279103 143165 280046 -226095 277752 209159 -85258 -229341 410280 46747
17290 39937 1348 80882 -167616 438565 83056 -46008 211989 74241 327620 347694 171299
17278 265915 167850 -35999 301732 35273 39886 -304627 119599 296701 -60626 193886 -2494
17266B83967A13284b01223c7931A43127k9063n5688P4887M65142B70103N7805
17256C27908m993d7861B19886M2682j13403L91558C2507k495J11052J92660j22064
17245B11660q9058j872a21831A58571d6845E3212B6328b5242E21498j54078G0701
17233h8711D89778q0854e1709A73573o4327J35091k2993A1394L40234j72234K91650
17222D71044l5176A62768b28646F8521Q6169L05133b907A77336a0420C59630A24511
17210a81914C54992A69535h091B08567N5271F6271J40947L8489o1802o0177N2518
17199A76246F8797J90720J90144n3938A76647c3564m187C89874Q900c1143D04809
17187E66586I9912E191K21382K31352A98607K81027H9469Q3253J48542D1717J59645
$$ plain form
17266 283967 113284 -201223 -37931 143127 114064 58376 133263 598405 270103 327908
17256 327908 322915 -47861 219886 262568 149165 540723 32507 30012 141064 333724 211660
17245 211660 122602 120730 -121831 158571 -46845 53212 26328 -25242 521498 367420 70701
17233 -88711 489778 408924 -51709 173573 109246 244337 221344 11394 351628 179394 471044
17222 471044 435868 162768 -228646 68521 154690 459823 -2907 177336 -10420 359630 124511
17210 -181914 354992 169535 -8091 208567 263838 66271 207218 245707 183905 123728 176246
17199 176246 68797 259517 449661 395723 176647 -33564 -37751 389874 398774 -31143 404809
17187 566586 99912 5191 226573 457925 198607 479634 89469 172722 321264 41717 201362
17176B01362r1157a4056C43722J17858A3097K14292J96944A43120e4730D40112
17165A57178J7022k5512J47564J90469j06765N2171j99628N3484K56914j13967
17155D28930G5904K25020m5892r2215M60679A77754J63716l0852m0006J77110
17145D47722B18417K5576M1279n361J42296p4375J10725p8556p4891k8462F9740
17133D77740c8278A18988J53815R2782K01269l7377k64380a54069A5265L38296
17123C53561L5571j85478I7980K80123J54511A82090K59182j0591j46065J45016
17113D29632n481A72969K0107H2902c7161D97047B9453Q1890K71713j14446J8433
17102B87043A16658M46698j08523A74238K26066k1163J1345j15671L25190B97822
$$ plain form
17176 201362 110205 -14056 343722 461580 13097 227389 424333 143120 -54730 440112
17165 157178 174200 148688 296252 486721 379956 432127 232499 285983 542897 428930
17155 428930 75904 300924 255032 162817 623496 177754 341470 310618 270612 447722
17145 447722 218417 243993 285272 279911 422207 347832 458557 380001 305110 276648 69740
17133 477740 -38278 118988 272803 365585 566854 529477 265097 -154069 15265 353561
17123 353561 389132 203654 97980 378103 532614 182090 441272 430681 284616 429632
17113 429632 424151 172969 193076 82902 -37161 497047 29453 111343 383056 268610 287043
17102 287043 116658 563356 454833 174238 400304 379141 390486 274815 600005 297822
17091E67479B36202J58943K23738k66318R4990k02896M58361e8282A85149J15493
17081C00642L7360j37057K73282j26800k8237J42948O9808K5712k22300n3614
17071B81744J95717j93715j14097H4166O06155j04645r744a517E44731p412m4259
17060D93060A64328P2509K84949B03957K03566O4339Q456m526J8623J1063j64120
17049C41358O8204K6145j52651j29826L83948J59552A47700J85373j21962K45126
17039D56237H7442K76211M42233p8916l48098q8479K03884K3424j94329J39998
17029D63370O1155K2538o2654N543K5885P4140P7876j75653Q1030K76847D05235
17017D17729J83886k54371K53503B43174N21529C54989K77430n5004j96369J42188
$$ plain form
17091 567479 236202 395145 618883 352565 447555 244659 703020 -58282 185149 300642
17081 300642 338002 200945 474227 347427 319190 462138 531946 557658 335358 281744
17071 281744 477461 283746 169649 84166 690321 585676 575932 -1517 544731 537319 493060
17060 493060 164328 236837 521786 203957 407523 471862 480318 475792 494415 505478 341358
17049 341358 409562 435707 283056 153230 537178 696730 147700 333073 211111 456237
17039 456237 87442 363653 805886 726970 378872 290393 494277 517701 323372 463370
17029 463370 524525 547063 484409 489952 515837 589977 667853 492200 573230 850077 405235
17017 417729 601615 347244 600747 243174 764703 354989 632419 577415 381046 523234
17007E23234K50509C62062J70012J15862J03589k13920K01212k02600J78298J51387
16997H65902j61111J08189l35134J81544j00951M3315J72868l1035N2880K45460
16987A041927n05463K44236l17042K61426R8870C45620K94235L57949D78736L63788
16977H42524j78880o6361J44849J15129k13196Q2346K97808l04786K03759J37617
16967A060809E17074L83128j52394q7860J984K65930m20266L29604M1470L62881
16957A241551l85058O050k5772J77536K55448E43795K33527K44118j29952j16648
16947G74840M74026k38671j14179K65897p2516k78682J04578Q4933q09r8346j76410
16936G24661L63531l15008J45901j50753M2946J72280k05105L20863J00158n1916
$$ plain form
17007 523234 773743 362062 532074 647936 751525 537605 738817 536217 714515 865902
16997 865902 704791 812980 477846 659390 558439 601754 774622 743587 796467 1041927
16987 1041927 536464 780700 463658 725084 823954 345620 639855 997804 478736 842524
16977 842524 663644 597283 742132 857261 644065 726411 1024219 719433 923192 1060809
16967 1060809 517074 900202 747808 659948 661932 927862 507596 837200 878670 1241551
16957 1241551 856493 862543 836771 1014307 1269755 543795 777322 1021440 891488 774840
16947 774840 1248866 1010195 896016 1161913 1089397 810715 915293 1000226 999417 901071 724661
16936 724661 1088192 773184 919085 768332 811278 983558 778453 1099316 1199474 1147558
16926A147558O1660m4829m23007O70281m56803J50884O1187m3562k28602O06547
16916A501314p9698j29543R4402o2473J12023l60401L38732k10695O6905L25752
16906A596318J25772m10758K01282k55156M01291k02031N7924J9926j53170K57943
16896A639341M1115m47626K72853o0994L07903j27620j06537J39175n6776J48466
16886A749300k09880L53901m49685P28633j50465k81694K73327j5746q9961K7725
16876A935455J56836P8901q6714O709k5306p3921L21231l55430m4338K51941L5360
16865B200724j02437L50011k11941Q4756k6941j7549j2995j01753K17543k15230
16855B164188M12395j21164M66475r6824j54818N2619k90528K40987J57840K70394
$$ plain form
16926 1147558 1209218 1164389 741382 1411663 954860 1105744 1166931 1123369 894767 1501314
16916 1501314 1421616 1292073 1386475 1324002 1436025 1075624 1414356 1203661 1270566 1596318
16906 1596318 1722090 1311332 1512614 1257458 1658749 1456718 1514642 1534568 1381398 1639341
16896 1639341 1680456 1232830 1505683 1444689 1752592 1624972 1518435 1657610 1600834 1749300
16886 1749300 1539420 1893321 1443636 2172269 2021804 1740110 2013437 1997691 1907730 1935455
16876 1935455 2092291 2171192 2084478 2091187 2065881 1991960 2313191 1957761 1913423 2165364 2200724
16865 2200724 2098287 2448298 2236357 2321113 2294172 2276623 2263628 2161875 2379418 2164188
16855 2164188 2576583 2455419 2921894 2825070 2670252 2722871 2432343 2673330 2831170 3101564
16845C101564j50698R5278j68975M37477p3820q9607q1412L52066J97908j44755
16835C475026J83037l19917K45734J07251k72029N75568l26405K49127J20068
16826D037460j47603R5214R8715j50858L22435L51592k05411J90892K16449l58855
16816D450030K59263K57746k44991K40296j00619K33866Q5265J1140L10180N1796
16806E553972J73947L05210M4440L42658R7170j95144M00814N2039O5517L16357
16796G156980K86331k11085J18590N06774N27376l05621K30994P01857M5290j47664
16786H909822J75015M22849K09411P61277L0328p5385N60788K35239L55617N1361
16776A1636322Q44547M74697P3133M04076O72926L49320P89716K29759N56788
$$ plain form
16845 3101564 2950866 3046144 2877169 3314646 3240826 3151219 3069807 3421873 3619781 3475026
16835 3475026 3658063 3338146 3583880 3691131 3419102 3994670 3668265 3917392 4037460
16826 4037460 3889857 3985071 4083786 3932928 4255363 4606955 4401544 4592436 4808885 4450030
16816 4450030 4709293 4967039 4722048 4962344 4861725 5095591 5180856 5191996 5502176 5553972
16806 5553972 5727919 6033129 6077569 6420227 6517397 6322253 6723067 6775106 6840623 7156980
16796 7156980 7443311 7232226 7350816 7857590 8384966 8079345 8310339 9012196 9057486 8909822
16786 8909822 9084837 9507686 9717097 10478374 10508702 10433317 10994105 11229344 11584961 11636322
16776 11636322 12480869 12955566 13028699 13432775 14105701 14455021 15244737 15474496 16031284
16767A6031284M81801M47210J178809K55459J012663P30107L55219J157116P01201
16758B2350869Q50311J060884J415965O12144J168234J505319J138258J544485
16750C1646469J223188J806226K115813J988699J599595K247826K260748K843190
16742D7731754K376033L231602K710180L412892L785140L840036M387231M674578
16734G6149446N191567N018307N862965O159851O820399P023059P675334P845160
16726A27746088Q225885Q928952Q842083Q584570Q796125Q388409P936116O594943
16718A94043171N893344M745431K601123J268295l61227j909864l816607m793232
16710A97670434o271798p083797q334233q518310q709514q907337q876208q826491
$$ plain form
16767 16031284 16513085 16960295 18139104 18394563 19407226 20137333 20492552 21649668 22350869
16758 22350869 23201180 24262064 25678029 26290173 27458407 28963726 30101984 31646469
16750 31646469 32869657 34675883 36791696 38780395 40379990 42627816 44888564 47731754
16742 47731754 50107787 53339389 56049569 59462461 63247601 67087637 71474868 76149446
16734 76149446 81341013 86359320 92222285 98382136 105202535 112225594 119900928 127746088
16726 127746088 135971973 144900925 153743008 162327578 171123703 179512112 187448228 194043171
16718 194043171 199936515 204681946 207283069 208551364 208190137 206280273 202463666 197670434
16710 197670434 191398636 184314839 175980606 167462296 158752782 149845445 140969237 132142746
16702A32142746q167808p780035p900409p088817o336464o108682n732469n120883
16694G7907179n174044m573501m017355l632600l663672l392460l037695l228685
16686D7187167k269795k428234k251112k215963k059642j456066j597478j909963
16678C0998914j354937j194071j552198j289573j118196j083289q13720q14568
16670B1778362q72981r97542j182249k84480n73622q90563p01913m32838o22656
16661A5219518l26675r59585j90536n76590k8645n42516n51523n47836k53636
16652A1241976o01260k40662j38508r7731p35351Q715m51681j56646m66280j79999
16642H182573j17830m04294M5471k39381j56293k32702m68583K62164l02614k63190
$$ plain form
16702 132142746 123974938 116194903 108294494 101205677 94869213 88760531 83028062 77907179
16694 77907179 72733135 68159634 64142279 60509679 56846007 53453547 50415852 47187167
16686 47187167 44917372 42489138 40238026 38022063 35962421 34506355 32908877 30998914
16678 30998914 29643977 28449906 26897708 25608135 24489939 23406650 22592930 21778362
16670 21778362 20905381 19907839 18725590 18441110 17867488 16976925 16275012 15842174 15219518
16661 15219518 14892843 13933258 13742722 13166132 13137487 12594971 12043448 11495612 11241976
16652 11241976 10640716 10400054 10261546 10163815 9428464 9437179 8985498 8828852 8362572 8182573
16642 8182573 8064743 7660449 7705920 7466539 7310246 7077544 6608961 6871125 6568511 6305321
16632F305321M9734k51046m41602K82586l93239m5865j57544L4255K3688k79797
16622E126491o9345j29223k31176k77752K44297l42406L60466l86628j85920O8451
16612D177255n69132O98033p71861J39026L9349j42855k20803L13651k83995p6638
16602C302030L9292k96439J41809j87584n5027K13705j78785j75929m11130N60019
16592B951961k27266r4532j20182L06763j71034m52914M88537k93290J09896q1958
16582B415981j28511l99763N52110n9721P6161l23655L4350j94821J59864K9621
16572B161616j79614l67876M94905m92870L97698m7644J3994j25153O6300n13340
16562A408016Q7546K40463j70866l23919N73442k997j77975m9444K64572l55041
$$ plain form
16632 6305321 6355055 6104009 5662407 5944993 5551754 5505889 5348345 5382600 5406288 5126491
16622 5126491 5057146 4927923 4696747 4418995 4663292 4320886 4681352 4294724 4108804 4177255
16612 4177255 3608123 4306156 3534295 3673321 3712670 3569815 3349012 3662663 3378668 3302030
16602 3302030 3341322 3044883 3186692 2999108 2944081 3157786 2979001 2803072 2391942 2951961
16592 2951961 2724695 2630163 2509981 2816744 2645710 2192796 2681333 2388043 2497939 2415981
16582 2415981 2287470 1887707 2439817 2380096 2456257 2132602 2166952 1972131 2131995 2161616
16572 2161616 1982002 1614126 2109031 1616161 2013859 1966215 1980209 1855056 1921356 1408016
16562 1408016 1495562 1736025 1565159 1241240 1814682 1811685 1633710 1584266 1848838 1493797
16552A493797k1009j41497L06137k83091K95244m57002J95882r2705j75915O9373
16542A189214j6335L14304l84290J52979j23016L50679j00449m17535L76430k05696
16532A136285K18965k37984n4463Q9003K5144J59062k1314k72663r1249q138L57377
16521A300025j60821j77255L49184j72928k3093n0123j1535q0470j25233j32459
16511G15292K84654k10608J57155j05976L46431l34606r7165K61402m11010M0380
16501F45949L24138j17311j36836P437K47601M5466j32865r3690O9799j0484J88634
16490A037838l39093L31085q7103m09024L73411J22187j81117M4439D12690Q2007
16480D94697K09411j7923K36222l08486J68496j74408p8301q9875M45048k50605
$$ plain form
16552 1493797 1472788 1331291 1637428 1354337 1649581 1192579 1388461 1295756 1119841 1189214
16542 1189214 1172879 1487183 1102893 1255872 1132856 1483535 1383086 965551 1341981 1136285
16532 1136285 1355250 1117266 1062803 1151806 1176950 1336012 1314698 1042035 950786 942648 1300025
16521 1300025 1139204 961949 1311133 1138205 1115112 1064989 1053454 972984 847751 715292
16511 715292 999946 789338 946493 840517 1186948 852342 755177 1016579 605569 645949
16501 645949 970087 852776 715940 723377 970978 1016444 883579 789889 859688 849204 1037838
16490 1037838 698745 1029830 942727 533703 907114 1029301 848184 892623 412690 494697
16480 494697 704108 686185 922407 613921 782417 608009 529708 439833 884881 634276
16470F34276N08537k75098k46824P3868k69896r3734N39084D28784M2738N1012
16460E22534k02409K17315J26966j33543P8050K12521I0779Q72771D53406L4884
16450D88290K21284j16546P1807j71766q8916K87770q841j79911M2274L34413
16440H79858D05606p4017N4802L64660j16713A57776J48830L00756j39401j40059
16430C27902J86025k24839Q6061J91409K87023D01645A42605K06211J88086O4554
16420F01456j17757J841l656K7015m9907J34437R677B80218L5102o9124K89955
16409E36151B47160Q1763R1585q7275a13222C18171R9429o9970J30353R0862C6183
16397C21199N006J7346K48036B31876Q8322n7091P0342K2667L76623C14757r2490
$$ plain form
16470 634276 1142813 867715 620891 694759 424863 331129 870213 428784 471522 522534
16460 522534 320125 537440 664406 530863 608913 821434 90779 963550 453406 488290
16450 488290 709574 593028 664835 493069 404153 691923 683082 503171 545445 879858
16440 879858 405606 331589 386391 751051 634338 157776 306606 607362 467961 327902
16430 327902 513927 289088 375149 566558 853581 401645 142605 348816 536902 601456
16420 601456 483699 485540 481884 508899 458992 593429 603106 280218 315320 246196 536151
16409 536151 247160 328923 420508 333233 -113222 318171 417600 347630 477983 568845 36183
16397 321199 326205 343551 591587 231876 320198 263107 333449 356116 732739 314757 222267
16386B22267j2494L12038p0984p9986j35486j4996O3736J54697m433J01517q4403
16375D51473h4392C6098K69795h8331A11273L98926k46382P1209j07820Q7718
16365C14924C0218N70933l4054A62260J88996m14A71889D193K56654C4878L25193
16354C60071J2512I0513I24L09297D5044J25564J64094I3554K15372j31913A7972
16342D32277k10782a57506C79687p5560p9363o707p426D2780Q6827J49848a931
16330C18565A08361N7465j5143K36686E7290M09729H9335J04831a86489A00452
16319C56022j46249J96306H4934K23872H5583B858K03353h5632C30150b5860A98379
16307E9495J30974J13271A51196K4226m9592L7933M1747l1281p4545K29022A00048
$$ plain form
16386 222267 209773 521811 450827 370841 235355 220359 284095 438792 434359 535876 451473
16375 451473 -84392 36098 305893 -88331 111273 510199 263817 335026 227206 314924
16365 314924 30218 601151 567097 162260 351256 350842 171889 4193 260847 34878 360071
16354 360071 372583 90513 924 310221 45044 170608 334702 93554 308926 177013 17972
16342 432277 221495 -157506 379687 304127 224764 218057 210631 42780 129607 279455 -1931
16330 318565 108361 165826 150683 387369 57290 467019 89335 194166 -186489 100452
16319 356022 209773 406079 84934 308806 85583 2858 206211 -85632 330150 -25860 198379
16307 59495 190469 303740 151196 175422 125830 163763 205510 174229 99684 328706 100048
16295E49713a48350D68154G3566c2080A08040K72335H8660a6295j34146B73506
16284A21867C6003h6425C21077F9454R1859M8299D504L47407A59596M7179d3510
16272D09470q7532j57874J86868J48439F1325K50715g5569B55011q8915a7263
16261f971H6862a4443k17985d7979K2997B9406K02795a0093A05594K44797A22700
16249C51779p0298n5184a50287K6450B25278g1153C69723m7321F4056L05553E7304
16237d3779j13616A09110b41226B3353c4462C578h155A38421R8196P9632N3567
16226C69816a5541C38965j30834H0676k9815g9647B22198N0435J6471j31620f5062
16214f4641B49643A07555g6498D309L1432C973b80457K5526E8212a4646A51303
$$ plain form
16295 549713 -148350 468154 73566 -32080 108040 380375 88660 -16295 -150441 273506
16284 121867 36003 -86425 321077 69454 161313 209612 4504 351911 159596 206775 -43510
16272 409470 321938 164064 350932 499371 61325 312040 -75569 255011 166096 -17263
16261 -6971 86862 -14443 -232428 -47979 -24982 29406 232201 -10093 105594 350391 122700
16249 351779 281481 226297 -150287 -123837 225278 -71153 369723 322402 64056 369609 57304
16237 -43779 -157395 109110 -241226 23353 -34462 3578 -8155 138421 236617 316249 369816
16226 369816 -15541 338965 208131 80676 50861 -79647 222198 272633 289104 157484 -65062
16214 -64641 249643 107555 -76498 4309 35741 3973 -280457 -254931 58212 -14646 151303
16202A29973A147P9758d00243I785K23681b00816C39312H3590a42946A25787J68234
16191B94021a06400D0179K72344j21167a23012c9911j50216K8071F11816A26397
16180B67085m2962J9654C1253a58927C0431a45850I8498J21842o4211J47091A30903
16168i6257B7342J26925a36836A32093a30745j49453E0584J38174P2179d4380
16157a87756C7760a7712A30865b0467j20090e0837B9756a88827D5543P3424G862
16145F7289K15582J7995o7362e2142g740C12825C8169Q402c14935j81A14796k1069
16133I3727K8245j5048a53353P6559R996C04626h1335o9165B17222q6484J8271
16122A49009a58866A22152k6858J6669K00767a08068J4562e495j15509L0048C93307
$$ plain form
16202 129973 1147 80905 -400243 9785 233466 -200816 339312 83590 -142946 125787 294021
16191 294021 -106400 40179 312523 191356 -123012 -39911 -190127 -162056 611816 126397
16180 267085 224123 243777 31253 -158927 30431 -145850 98498 220340 156129 303220 130903
16168 -96257 27342 154267 -136836 132093 -130745 -280198 50584 188758 260937 -44380
16157 -187756 37760 -17712 130865 -20467 -140557 -50837 29756 -188827 45543 118967 7862
16145 67289 282871 300866 233504 -52142 -7740 312825 38169 46571 -314935 -315116 114796 93727
16133 93727 121972 106924 -153353 -76794 -66798 304626 -81335 -150500 217222 130738 149009
16122 149009 -158866 122152 95294 111963 312730 -108068 -93506 -5495 -121004 -90956 393307
16110A19939b2063C0127h2266a3610A1749R9655B4798c20542E9137J41751M1737
16099B42625k2457b66220j6886C70907A7964a62678b5093D4303J16043E8469H329
16087h1684A93565p0774n5060K57832B3773d32944a32779A04266a58282j75069
16077c33351B8431b29505A03289f911B46528p6745c25171D2658J39164a54740
16066b9217p6210c3697j23042D4358a09701D5303L39493a5322B43913c68762J44682
16055b24080c00A2495f5933O121D36790B03458J22937e435A48021A6702a03744
16043g9135m75156h4531m8280e1891C9720j2438h6434D3153A2743b1970D1339
16031A81789I744a3346j74253A00491c5623j7080A32529C3549f4642b428p6002
$$ plain form
16110 119939 -22063 30127 -82266 -13610 11749 111404 24798 -320542 59137 200888 242625
16099 242625 220168 -266220 -283106 370907 17964 -162678 -25093 44303 160346 58469 8329
16087 -81684 193565 122791 67731 325563 23773 -432944 -132779 104266 -158282 -333351
16077 -333351 28431 -229505 103289 -6911 246528 169783 -325171 42658 181822 -154740
16066 -29217 -105427 -33697 -156739 44358 -109701 45303 384796 -15322 243913 -368762 -224080
16055 -224080 -300 12495 -65933 -59812 436790 203458 326395 -5435 148021 16702 -103744
16043 -79135 -554291 -84531 -132811 -51891 39720 27282 -86434 43153 12743 -21970 41339
16031 181789 9744 -13346 -187599 100491 -35623 -52703 132529 33549 -64642 -2428 -78430
16020g8430r3169a5984k64467g3255A56716i941A60366c0204p7145q2850e2000
16008C3962a87724j0704p8945l6150F49b49351i6394c4905C1991H934b53913g9857
15995A30789g3654j5997l8177N2121a8533j64334L5879O5291A66360C2523J05571
15984A38094h5926A28829c6343A8183O22365A00992K82234j39990E9204L9239
15974I8443h5832A50348c502l66531I0115a29385A13639a46631G4196a79347k6649
15963b05996k2472b4791k2023k11546A97020L4496E6612K1310B0440P9894D7750
15951a11914P632A67262m7638b7837j74962a4226A49122F9969K84388b97842A27497
15939a17754j59880a9868A97870B8119P746a41860B68206h1834L6299j2061E3024
$$ plain form
16020 -78430 -171599 -15984 -280451 -73255 156716 -9941 160366 -30204 -107349 -190199 -52000
16008 33962 -187724 -198428 -277373 -313523 649 -249351 -96394 -34905 31991 8934 -253913 -79857
15995 130789 -73654 -89651 -127828 -75707 -18533 -182867 -146988 -81697 166360 32523 138094
15984 138094 -85926 128829 -36343 18183 640548 100992 383226 243236 59204 98443
15974 98443 -85832 150348 -3502 -370033 90115 -129385 113639 -146631 74196 -179347 -205996
15963 -205996 -228468 -24791 -46814 -258360 197020 231516 56612 77922 20440 100334 47750
15951 -111914 -104282 167262 119624 -27837 -202799 -14226 149122 69969 354357 -297842 127497
15939 -117754 -277634 -19868 197870 28119 35865 -141860 268206 -81834 -45535 -57596 53024
15927b0125B4411a8108A17266M2194i8243j49398a14364A16957a94248B1432b64068
15915a98280C54739A00656e429j34411j630C241J95862j8196f9038H2499J19744
15904B02243b21607C39054f8303k40925A65917J5622J1144A6505b10846a6276
15893a47671c1124o1291E2009P5248a13150j32675g6978A48911K6138J32570b54078
15881E5951b14466c9301B55226D6367a794r7838m0943K4107j21920K3987d6455
15869I523g6738j48591A18811j560A312b04355Q2758C5043a08985j95166A90503
15857A76445i3963j19047K2200e5048j53053g7217c689B12032n9263D534L90314
15846C94848c8705l2352K7410A8820R0490b21423A10880D6702b12789d7189k18809
$$ plain form
15927 -20125 24411 -18108 117266 159460 -98243 -247641 -114364 116957 -194248 21432 -264068
15915 -198280 354739 100656 -5429 -139840 -141470 3241 199103 180907 -69038 82499 202243
15904 202243 -221607 339054 -68303 -309228 165917 181539 192683 16505 -210846 -16276
15893 -147671 -31124 -92415 52009 127257 -113150 -245825 -76978 148911 175049 307619 -254078
15881 55951 -214466 -39301 255226 46367 -1794 -99632 -140575 -116468 -238388 -214401 -46455
15869 9523 -76738 -225329 118811 117251 1312 -204355 -121597 35043 -108985 -304151 190503
15857 176445 -93963 -213010 -190810 -55048 -208101 -77217 -3689 212032 152769 4534 394848
15846 394848 -38705 -71057 -43647 18820 109310 -221423 110880 46702 -212789 -47189 -265998
15835b65998A13434D3941j024l568a33783k3972E19504B1324b81555j84483a96754
15823h3669B918g8317j52564D3468J95232e2311K0261e382o0987J6253j42010
15812a92126G0642M3229b53631N0843N0603l4967a3938e229j88404q2290G8183
15800F3369f697D1718R6627a39336j04087B24811J03345a22411p765C0305h7929
15788G1415k6849a11979d3519j48784B7787c17295J09847A89113H3698E984c5625
15776b20921J6927D6076K24588b46251a09011l492C50917D596c57309I2680Q9642
15765A82322f4937a4680A27142J81956E8000d23733a54321k35031E1133b44639
15754c64166a77157g3752L4132r6420k79555A99150p4786J62240a36958A22190
$$ plain form
15835 -265998 113434 43941 42917 39349 -133783 -157755 519504 21324 -281555 -466038 -196754
15823 -83669 2918 -78317 -230881 43468 238700 -52311 -32050 -5382 -66369 -50116 -192126
15812 -192126 70642 113871 -253631 -202788 -152185 -187152 -13938 -5229 -193633 -275923 78183
15800 63369 -6697 41718 138345 -139336 -243423 224811 328156 -122411 -130176 30305 -87929
15788 71415 44566 -111979 -43519 -192303 27787 -317295 -207448 189113 83698 5984 -35625
15776 -220921 -203994 46076 270664 -246251 -109011 -112503 350917 4596 -357309 92680 182322
15765 182322 -64937 -14680 127142 309098 58000 -423733 -154321 -389352 51133 -244639
15754 -364166 -177157 -73752 -39620 -136040 -415595 199150 124364 286604 -136958 122190
15743c98087f3849C6650a84766I9771K7206f9382k27234g1154o3412A02863A2559
15731h4079K8376k37776a792B6699c7334j17749I3236J14057b1782l44779a15048
15719a47725Q272p032m4773q7801c0748e609B6521c579A0950a45782n0018n0507
15707b46307A17913C653K81353a35315A59652f7358k3958m1441n8282A02408j0121
15696I2287a72522K9667k47268L7034A01668i3095L1328o046l52713c8633B46921
15684a25142O1165A97903B503i0075A18249c22088h3233b7684o1802k35141J47001
15673a77626A86716a05238j73329A77021e7501A1205P997b00133A97017E9520
15662I2369a18877L3020r5151F7643f7931O979m3557A26479c25893A0302R7174
$$ plain form
15743 -398087 -63849 36650 -184766 99771 126977 -69382 -296616 -71154 -134566 102863 12559
15731 -84079 -55703 -293479 -1792 26699 -37334 -155083 93236 207293 -21782 -366561 -115048
15719 -147725 -139453 -146485 -191258 -279059 -30748 -5609 26521 -3579 10950 -145782 -195800 -246307
15707 -246307 117913 3653 285006 -135315 159652 -67358 -91316 -132757 -191039 102408 92287
15696 92287 -172522 -142855 -390123 -353089 101668 -93095 -61767 -67813 -420526 -38633 246921
15684 -125142 -63977 197903 2503 -90075 118249 -322088 -83233 -27684 -89486 -324627 -177626
15673 -177626 186716 -105238 -278567 177021 -57501 11205 19202 -200133 197017 59520
15662 92369 -118877 -85857 -181008 67643 -67931 -60952 -104509 126479 -325893 10302 107476
15651A07476d2571j99016n7784C7745a93698K0977f099C5559Q1871a23300K6152
15640i7148A8809J26015I134P077b55631B1723a04997r8426f2149k00739c8106
15628i4730A57489b43820B23876A08500K2563F2883a6342k01590c4185G6286c34808
15616B86136a36755B35430Q56j18099g7247A56781n2318k5545j3466d51446b6462
15604b21677A14169d7754A17253B9625J66518l5597f8171p4078D8730Q2082F518
15592I5175l0813F099e3286A72573l981a07093C6223b5972A52980i5088A73989
15580A06973f0762j22851A55070F9042J0205A7572b5974k65949a18672e5206C35975
15568A74653b69191k2714c4127l05099A98069i3774E78136f9530b6636j1485e653
$$ plain form
15651 107476 -42571 -241587 -299371 37745 -193698 -172721 -6099 35559 117430 -123300 -97148
15640 -97148 18809 144824 9134 16211 -255631 21723 -104997 -203423 -62149 -262888 -38106
15628 -94730 157489 -243820 223876 108500 131063 62883 -16342 -217932 -34185 76286 -334808
15616 286136 -136755 235430 236286 118187 -77247 156781 104463 78918 65452 -451446 -26462
15604 -221677 114169 -47754 117253 29625 196143 160546 -68171 -142249 48730 130812 6518
15592 95175 64362 6099 -53286 172573 168592 -107093 36223 -25972 152980 -95088 173989
15580 106973 -60762 -183613 155070 69042 79247 17572 -25974 -291923 -118672 -55206 335975
15568 174653 -269191 -291905 -34127 -339226 198069 -93774 578136 -69530 -26636 -38121 -5653
15556A32656a15190A28805C4494P9260J06823q339a23652A93561b9693k02746
15546b32439k40406e9074B25926b3026m4437A50490O6833j2720C6070K22302J8966
15535B77338h7667E9682N795P0120b45640H4538Q3708a29030H7319C213b63864
15523b80032a26015A21280d03256H9381k3688K30212E7695f9110k36978a15244
15512H2950a70994B44907j16617C8210L02583a29991p3396a4426A15674j3169
15502A02505A9805a67860C6144b40556B3075a9126A06841k4878a03138F8954k4139
15491D4815a81218O1468F8700h6522A12297a03137j8912j65603B32825J40904
15481C73729A07262R6178K8510F2167O4571a55802A2351J7753r905L9106Q76J16388
$$ plain form
15556 132656 -115190 128805 34494 113754 220577 212238 -123652 193561 -29693 -232439
15546 -232439 -472845 -59074 225926 -23026 -67463 150490 217323 204603 36070 258372 277338
15535 277338 -87667 59682 65477 135597 -245640 84538 168246 -129030 87319 3213 -263864
15523 -280032 -126015 121280 -403256 89381 65693 295905 57695 -69110 -306088 -115244
15512 82950 -170994 244907 128290 38210 340793 -129991 -203387 -14426 115674 102505
15502 102505 19805 -167860 36144 -240556 23075 -19126 106841 81963 -103138 68954 44815
15491 44815 -181218 -119750 68700 -86522 112297 -103137 -122049 -287652 232825 373729
15481 373729 107262 203440 231950 62167 126738 -155802 12351 30104 20199 59305 60181 176569
15469A76569c47507a34856D2719a82154q8759i4488r017B9479O8380k4725K73706
15458C46840I1430f4780j17730A36224a91210P0306a2670A36857c8801j43929
15448a82730A99840b81179b4261D8450g3865F5990j8107J11732c55404I2h8183
15436C7510b09539o3064A73685a69153L7496A53931F4634A1769a29175j495F0205
15424F6323c64294J28181C61473b36234C75549c14155e3378D5810a65172A5526
15413A4072J99038G8103b37101A0677a00378A50489i6553I4244b10214e1393j97250
15402b48643L1086A05120E1317K41949I1580b844p0631B02947q7795D398M2167
15391D6565b9936D7900P1030c10113E8838J53175a98101E5294K36550H3490R9927
$$ plain form
15469 176569 -347507 -134856 42719 -182154 -270913 -94488 -103505 29479 97859 73134 346840
15458 346840 91430 -64780 -182510 136224 -191210 -120904 -12670 136857 -38801 -182730
15448 -182730 199840 -281179 -24261 48450 -73865 65990 47883 159615 -355404 92 -88183
15436 37510 -209539 -272603 173685 -169153 -131657 153931 64634 11769 -129175 -130670 60205
15424 66323 -364294 -236113 361473 -236234 375549 -314155 -53378 45810 -165172 15526
15413 14072 213110 78103 -237101 10677 -100378 150489 -96553 94244 -210214 -51393 -248643
15402 -248643 -217557 105120 51317 293266 91580 -2844 -73475 202947 115152 4398 46565
15391 46565 -29936 47900 118930 -310113 58838 212013 -198101 55294 291844 83490 183417
15380A83417l9142J90939A16904E767a19897A85325e9729m8441K4367I102b60804
15368A80779b62075a14547A38359P2324a28393K8706p6325j08133a37353G3708
15357I1241L18529E337c37918P0321f4229I8125j040j5364a56624A44401h8746
15345A50145b15396A73824a34107C96999j70510a8486A19841f5755B2910J59708
15335A82618m7324A8909j03K68921E3759K31802b67896Q7564b1593B86297F4254
15323d1958H9909a2063A21380a18055I7318h6408n4194A46169c23855B43113a01935
15311B17567e6552D3945K85212A12330B5675f0347r3961B75630q8267c7698A26692
15299d0815B53011b5141k35336A9883b6273j46286D03558E5791b32666B09519
$$ plain form
15380 183417 144275 335214 116904 5767 -119897 185325 -59729 -108170 -83803 9102 -260804
15368 180779 -262075 -114547 138359 210683 -128393 -99687 -176012 -284145 -137353 73708
15357 91241 409770 5337 -337918 -267597 -64229 98125 97085 81721 -156624 144401 -88746
15345 150145 -215396 173824 -134107 396999 226489 -18486 119841 -65755 22910 182618
15335 182618 135294 18909 18806 287727 53759 285561 -267896 -180332 -21593 286297 64254
15323 -41958 89909 -12063 121380 -118055 97318 -86408 -140602 146169 -323855 243113 -101935
15311 217567 -56552 43945 329157 112330 25675 -60347 -154308 275630 187363 -37698 126692
15299 -40815 253011 -25141 -260477 19883 -26273 -172559 403558 55791 -232666 209519
15288A60535d43585D55897A30145c2990f204l6051k5608B53421o5970q3090M10936
15277E15297h4578J9507A58714J02292a80323B63708q9473B8294P4930K78781
15267C82005F9265J62604P7414p5792b7852B82012A0638d9202A21017a83874j12997
15256b96871h5908A96474p8764J19285p7817a39290G4586J19201M7345L33054
15246E74186O73945P53485R25561q32472L11160r00377B27591A06283O7005a06279
15235e6626A11425d720H9827K69772A02557J92725i2086B14706h0379C41217b48059
15223a17260A52613R1535h8310D0824b50998B14127a17581p5062e1523A5629K75236
15212B90865g3844r801H6342D2939a02431D37472F6405H361D22b34311C72760
$$ plain form
15288 160535 -443585 455897 130145 -32990 -6204 -42255 -67863 253421 187451 104361 515297
15277 515297 -84578 -65071 158714 261006 -180323 263708 174235 28294 103224 382005
15267 382005 69265 231869 309283 233491 -27852 282012 10638 -49202 121017 -183874 -296871
15256 -296871 -85908 196474 117710 236995 159178 -139290 74586 193787 241132 574186
15246 574186 1248131 2001616 2927177 2094705 2405865 1505488 227591 106283 173288 -106279
15235 -56626 111425 -4720 89827 359599 102557 295282 -92086 214706 -80379 341217 -248059
15223 -117260 152613 244148 -88310 40824 -250998 214127 -117581 -192643 -51523 15629 290865
15212 290865 -73844 -83645 86342 42939 -102431 437472 66405 8361 422 -234311 372760
15200B02958l3267b34456A57446c0224C41453a4359k9412n4629D41132j19878
15190C21254A58898a6489j84063B44429M3176j39040k35o6619J99749f9095G8671
15178H5488J64989a08714B63515b7431D50057j50853b28395G0910R0322k6525
15168A34707b72895J17222A74321a6271A76460K0578M9980A1878M25866D4682
15157A23744m8213c9188D41927G4021A2293c3009F3133L3958a05196B14237j05082
15146A09155k8959C5845a10941C30260B5223A0218O8333d0607p2173D60871g7168
15134c5713C26867B4987L54214j23412K3164M6610E8331J26250Q0208b20250B21933
15122a5630C36564A8886J31521N810a93101A86619p3355M33044A85931a64519
$$ plain form
15200 202958 169691 -234456 157446 -30224 341453 -14359 -43771 -98400 441132 321254
15190 321254 158898 -16489 -200552 244429 287605 148565 148330 81711 281460 -69095 78671
15178 85488 250477 -108714 263515 -27431 450057 299204 -228395 70910 161232 134707
15168 134707 -272895 -155673 174321 -16271 176460 197038 247018 11878 437744 44682
15157 123744 75531 -39188 441927 74021 12293 -33009 63133 97091 -105196 214237 109155
15146 109155 80196 35845 -110941 330260 25223 10218 78551 -40607 -112780 460871 -77168
15134 -35713 326867 24987 379201 255789 278953 325563 58331 184581 264789 -220250 221933
15122 -15630 336564 18886 150407 156217 -193101 186619 113264 546308 185931 -164519
15111E67373i9244B3242b15455B75371b47533F8496J73352Q0686A42345J01909
15101B44254b3676D75603A13752Q9871n1405b0282j00381f805B95544A413O9657
15090G1070A0634K09082J25496b2714C43762n9062E7469K6702a8578B5261e8090
15078c1813E71220k84604A2587K30643j15551R6131D5352R0020N69630A53943
15067C1602K64466b7203A00533k8557a37575B83895j37131J79482f6585I2986
15056A7723O6860a8167f057B53247j09460D2537K89317A39491L07316j84332A8067
15044A52936I66K29028j8099H0271j1152c8390C62827H2220J61623J85881A47795
15032A95144F2564Q4486K5697b8409j00793d5624j2863D13117j74231m6077G6102
$$ plain form
15111 567373 -99244 23242 -215455 275371 -247533 68496 241848 322534 142345 244254
15101 244254 -23676 475603 113752 203623 152218 -20282 -120663 -6805 295544 1413 71070
15090 71070 10634 219716 345212 -22714 343762 284700 57469 84171 -18578 25261 -58090
15078 -31813 571220 286616 12587 243230 127679 223810 45352 135372 705002 153943
15067 31602 296068 -27203 100533 71976 -137575 283895 146764 326246 -66585 92986
15056 17723 84583 -18167 -6057 253247 143787 42537 331854 139491 446807 262475 18067
15044 152936 966 229994 211895 80271 69119 -38390 362827 82220 243843 429724 147795
15032 195144 62564 147050 172747 -28409 -129202 -45624 -58487 413117 238886 192809 76102
15020i5464C55347j12683G1293J87190L28849I5202J24236G6664k8070K6445l177
15009G1862K96993o0175h368n5172a018j44995C76727j18363N1114k3391O5432
14998C51519F1642O6737O7698N2668J3096c18596B24951L07003A04558L27609
14988D32167j42930M8470K5150N2963A14312C9606J28195K96261A94859o7924
14978A26935K14874E7915K03735A861L77121A33963N7885O974R3541A44873l7631
14967A07242K20081q7579m5971N5927N4351J29262l0623A74770K4778J37468g5708
14955A44676K12930o3579A13445Q7891m7200m0410L85891A74088J76461j59373
14945A91176H4234K60056A11296L46463k3705A02952k5403P7071l6787N0899b9917
$$ plain form
15020 -95464 355347 242664 71293 258483 587332 95202 219438 76664 48594 75039 71862
15009 71862 368855 308680 -8368 -63540 -1018 -146013 376727 258364 309478 286087 351519
14998 351519 61642 128379 196077 248745 261841 -318596 224951 531954 104558 432167
14988 432167 289237 337707 362857 415820 114312 39606 167801 464062 194859 126935
14978 126935 341809 57915 261650 1861 378982 133963 191848 198822 292363 144873 107242
14967 107242 327323 239744 193773 249700 304051 433313 402690 174770 199548 337016 -75708
14955 144676 357606 294027 113445 201336 154136 113726 499617 174088 350549 191176
14945 191176 84234 344290 111296 457759 434054 102952 77549 154620 117833 168732 -29917
14933B4193L55750A73056J73597J90738j77211j10175j0483m331j6003K09871
14923D29059A38565N8176L38771q0788j2217J84349j32886k20548K04902j04851
14913C73473k0374J9879j61834K09193Q6417j67713K77970j99395r3552L05996
14903F30060k01755K0872k02666K15416l0044n1408j84842J41732A54276J35248
14893B89524L3726A43595K7249n5579L30224m1945j33948m8455K69331j05372
14883C85100A24656K42684J12108j73215J18456j16769J26888A19668K19324R3121
14873D32113j10427j7958N9566J63812k54122J07769A33748J74646m0187D6261
14862A90022j1649K40567K1184L61340C02342K53339j13484j12536J09402j41763
$$ plain form
14933 24193 379943 173056 346653 537391 360180 250005 239522 235191 219188 429059
14923 429059 138565 196741 535512 454724 442507 626856 493970 273422 478324 373473
14913 373473 353099 372978 211144 420337 506754 339041 617011 417616 324064 630060
14903 630060 428305 449177 246511 461927 431883 380475 195633 337365 154276 289524
14893 289524 323250 143595 170844 115265 445489 403544 269596 221141 490472 385100
14883 385100 124656 367340 479448 306233 424689 307920 434808 119668 338992 432113
14873 432113 321686 303728 363294 527106 272984 380753 133748 308394 268207 46261
14862 190022 178373 418940 440124 801464 302342 555681 442197 329661 439063 297300
14852B97300m1084J27186M21428B94468J86570L1003r8509J1011K5747o0415j76869
14841B13006J43506j39492K8716K50212J04224N6533B58111L09581r2736K75494
14831G50450l08448O9279O3801B41924j0335L13821A34628J89610j7470K06972
14821E13740P0849k49861J87160k23296A13075M61412k86005N9754K0604J14147
14811D82987P8986j51331J02739k01980L02350j86251R5705j20658K0317N6735
14801D79599N9486A94812O35304C96873K32736j18072j19557J46641J41340L1954
14791G11915m0062j67823J96186k89990K31281P950P7957B89941J77165L8194
14781E05300J77762k34218L1562J33828j09933n6249J04696B41908k526O4576
$$ plain form
14852 297300 256216 383402 804830 294468 481038 512041 413532 424543 450290 389875 213006
14841 213006 356512 217020 245736 495948 600172 656705 258111 567692 474956 750450
14831 750450 442002 511281 575082 241924 231589 545410 134628 324238 306768 513740
14821 513740 584589 334728 521888 298592 113075 574487 288482 348236 368840 482987
14811 482987 561973 410642 513381 311401 613751 427500 523205 402547 422864 479599
14801 479599 539085 194812 830116 396873 629609 511537 391980 538621 679961 711915
14791 711915 671853 504030 700216 410226 641507 649457 727414 289941 467106 505300
14781 505300 683062 448844 480406 614234 504301 448052 552748 241908 239382 303958
14771C03958K52173j0642k06659K24643k79415n033M21781n6457j46878J02116
14761E99587M3825k15839J68040m9277M0676K45314l07090k41167L15112j26100
14751D73081J3209J30769Q1206K55359l31957q3869Q6454L52202q3189j63271
14741G29994J81064k43177m0344C09827M91743k24667K4749k0326M49974k25716
14731H05584k92362M53286A92741O30695l8798k90549L51359r6367k25134J91308
14721G15255M13616E35105J68930K93942k10445j5732k29833j29232K99509q990
14711G03254j16162K66873J17555k62761j14170J17424J68646L2610j8690D46393
14700I09647M4849J62712l32968K93515n7269E07373M86793o0360J22927l03445
$$ plain form
14771 303958 556131 545489 338830 563473 284058 279025 700806 644349 497471 599587
14761 599587 643412 427573 595613 546336 587012 832326 525236 284069 599181 473081
14751 473081 486290 617059 698265 953624 621667 537798 624252 976454 893265 729994
14741 729994 911058 667881 627537 309827 801570 576903 601652 581326 1031300 805584
14731 805584 513222 966508 192741 823436 784638 494089 845448 749081 523947 715255
14721 715255 1128871 535105 704035 997977 787532 771800 541967 412735 712244 703254
14711 703254 587092 853965 971520 708759 594589 712013 880659 913269 894579 446393
14700 909647 954496 1117208 784240 1077755 1020486 507373 994166 933806 1056733 753288
14690G53288J39625J46476o7175l03879J85209K68374n17420N40571L3216l37232
14680H41053J79610k21387R300L79977j00886k28982k13580J9519L05711k12958
14670G57377K21583l32917J90335M01524l40435m36778M66477J38189q6665j38486
14660H40204N9724K22092L5231J0427l94929J10679L80344l63481J31401J2129
14650A043821J81065J64719p5463r2004J55564m16332J93078j43654J14478J60481
14640A285753l22586m0243K80405r7586J49184J30104r9710j75627M00482m15862
14630A094314P0687K30039k36128K51876N537k02671M29747j60521m07397M67107
14620A542590N4049n11540N00306n117j55854k09171K38945l80899L36658K44231
$$ plain form
14690 753288 892913 1039389 972214 668335 853544 1121918 604498 1145069 1178285 841053
14680 841053 1020663 799276 808576 1188553 1087667 858685 645105 664624 970335 757377
14670 757377 978960 646043 836378 1237902 897467 460689 927166 1065355 978690 840204
14660 840204 899928 1122020 1157251 1167678 772749 883428 1263772 900291 1031692 1043821
14650 1043821 1224886 1389605 1314142 1222138 1377702 961370 1154448 1010794 1125272 1285753
14640 1285753 963167 922924 1203329 1105743 1254927 1385031 1285321 1109694 1510176 1094314
14630 1094314 1165001 1395040 1158912 1410788 1416325 1213654 1643401 1482880 1075483 1542590
14620 1542590 1596639 1085099 1585405 1580288 1424434 1215263 1454208 1073309 1409967 1654198
14610A654198j5628m48196L12907j00400L60300m48351J59185O5735j2101R853
14600A537502J27814l71740L19959J78751j5927n7615J83119l31646M9544k90096
14590A329665L55443r8873J58095j0393J39306j70931N8856L20753j86917j37014
14580A757990M7405K53952l9186R1102m05077K30839j47231j6237L58784j55604
14570A976737N4520n8043l63648O55814N5374n5731J64868M6926q1146J25296
14560B520967J1641L63141j46869J77424l27560O47261p9571M53061K9774R55833
14550D605102J330726K071134M933397R430655J2343446P651922B0691434H147832
14541E476958L93550J720256l032868j845001m71149j75455k69830M56336N1423
$$ plain form
14610 1654198 1638570 1190374 1503281 1402881 1763181 1314830 1474015 1539750 1527649 1537502
14600 1537502 1665316 1293576 1613535 1792286 1776359 1718744 1901863 1570217 1619761 1329665
14590 1329665 1685108 1586235 1744330 1733937 1873243 1702312 1761168 2081921 1895004 1757990
14580 1757990 1805395 2059347 2020161 2111263 1706186 1937025 1789794 1773557 2132341 1976737
14570 1976737 2031257 1973214 1609566 2265380 2320754 2265023 2429891 2476817 2395671 2520967
14560 2520967 2532608 2895749 2748880 2926304 2598744 3246005 3166434 3619495 3649269 4605102
14550 4605102 5935828 8006962 12940359 22371014 34714460 42366382 20691434 8147832
14541 5476958 5870508 7590764 4557896 2712895 2241746 2066291 1796461 2252797 2304220
14532B304220n26333J94960k1537M86984l79816N7818N6442j4188k26999M55750
14522B387301J39404q3471k01757K28831O3342l24756K00529k07328M75360l5426
14512B642029O0902j54780l5357j13534J74241K6931J78754P5678j74886N17821
14502C197799k06156L2301n51714M01322j4104j57164R2786P40856k97807j48907
14492C089212L0707K67828j49888J12284L9447J03245k9574m94918L35676L37493
14482C641512m45614N50195j74525J14563j71007L64025j82068R1877K74837m24419
14472C639376M13630J14502K60478k37790j56035K82596m0013L0285j06309J12564
14462D313284K95763K44369m93161K28843J4427K04508p5081J6665L2807J54344
$$ plain form
14532 2304220 1777887 1972847 1951310 2438294 2058478 2116296 2172738 2158550 1931551 2387301
14522 2387301 2526705 2443234 2241477 2470308 2533650 2208894 2409423 2202095 2677455 2642029
14512 2642029 2702931 2548151 2512794 2399260 2573501 2600432 2779186 2854864 2679978 3197799
14502 3197799 2991643 3023944 2472230 2873552 2859448 2702284 2795070 3535926 3238119 3089212
14492 3089212 3119919 3387747 3237859 3350143 3389590 3492835 3463261 2968343 3304019 3641512
14482 3641512 3195898 3746093 3571568 3686131 3515124 3879149 3697081 3788958 4063795 3639376
14472 3639376 4053006 4167508 4427986 4190196 4034161 4316757 4276744 4307029 4200720 4313284
14462 4313284 4609047 4853416 4360255 4589098 4603525 4808033 4732952 4749617 4782424 4936768
14452D936768k95423N19451l6298p1848J44854j41309K45560M85955k53312p0524
14442E463874J56495N5551O9620P7165J92932j87152L49093l20781N08773Q18
14432F366388K635L06429k53580j30999N59695J4914j61173R2415M50610n6653
14422G190681n1355N16119M4561l9344J34662l8556R7430K71502K17034j78937
14412H163797Q9169P5374J82699J45181L04167k96312M48389K04231J14123K6610
14402I457428K46509K80694k5015K03374M9970J45108K33414K43649K60149O0509
14392A1155789J17044Q0391K09908M82695j3020K62070K09102P0551J39215L71472
14382A3085217L20893O81741j09609K2707L97364N52595K85417L62069J67193
$$ plain form
14452 4936768 4641345 5160796 5124498 5052650 5197504 5056195 5301755 5787710 5534398 5463874
14442 5463874 5620369 5675920 5745540 5822705 6015637 5828485 6177578 5856797 6365570 6366388
14432 6366388 6369023 6675452 6421872 6290873 6850568 6865482 6704309 6796724 7247334 7190681
14422 7190681 7139326 7655445 7700006 7660662 7795324 7756768 7854198 8125700 8342734 8163797
14412 8163797 8252966 8328340 8511039 8656220 8960387 8664075 9112464 9316695 9430818 9457428
14402 9457428 9703937 9984631 9959616 10162990 10212960 10358068 10591482 10835131 11095280 11155789
14392 11155789 11272833 11353224 11563132 12045827 12032807 12294877 12503979 12574530 12713745 13085217
14382 13085217 13406110 14087851 13978242 14000949 14398313 14950908 15236325 15598394 15765587
14373A5765587R591O42182N96049l16007L92221Q78472J15108J95790L93690M31205
14363A9103888L51054N38922P10100r6625O88150O61707K16526P55391M87243
14354B3416356M11871N72475R66391M70430M68543M80849P46467J033049M65883
14345B9032314O26872R60786P66580J172525N65865N77713J059572J261934O66986
14336C6691147J333737J205747R60243J475643R36985J129361J457130J943759
14328D7133752J062471J371355J756631K106693J729936J928566K094565J782326
14320F0966295K268862K279412K535908K459193K721946K676387L258334L388146
14312H2554483K910742L706313L721279M361320M072060M555041M999509M773313
$$ plain form
14373 15765587 15775178 16417360 17013409 16697402 17089623 17968095 18083203 18278993 18672683 19103888
14363 19103888 19454942 19993864 20703964 20607339 21295489 21957196 22173722 22929113 23416356
14354 23416356 23828227 24400702 25367093 25837523 26306066 26786915 27533382 28566431 29032314
14345 29032314 29659186 30619972 31386552 32559077 33124942 33702655 34762227 36024161 36691147
14336 36691147 38024884 39230631 40190874 41666517 42603502 43732863 45189993 47133752
14328 47133752 48196223 49567578 51324209 53430902 55160838 57089404 59183969 60966295
14320 60966295 63235157 65514569 68050477 70509670 73231616 75908003 79166337 82554483
14312 82554483 85465225 89171538 92892817 97254137 101326197 105881238 110880747 115654060
14304A15654060N277602N711056O005676O420922O749190P216062P779757Q375628
14296A69189953Q564969R745751R822969J0658888J0686129J2080700J2544158
14289B43293517J3085467J3645954J4275726J4750286J5513569J6102914J5893325
14282C46560758J6294857J6592976J6023897J5794752J4828321J3628078J2279699
14275D52003338J0040412P316657J721368q88950l446200j432385J935934k006503
14267D65243671p469253j0029173j1302631j2459419j3660628j4220550j5171219
14260C80930798j6212246j6768629j6862440j6077850j5756103j5217243j4806837
14253B69229450j4009218j3490365j1489712j0504583j1670136j1039393j0188629
$$ plain form
14304 115654060 120931662 126642718 132648394 139069316 145818506 153034568 160814325 169189953
14296 169189953 177754922 187500673 197323642 207982530 218668659 230749359 243293517
14289 243293517 256378984 270024938 284300664 299050950 314564519 330667433 346560758
14282 346560758 362855615 379448591 395472488 411267240 426095561 439723639 452003338
14275 452003338 462043750 469360407 471081775 470192825 466746625 465314240 467250174 465243671
14267 465243671 457774418 447745245 436442614 423983195 410322567 396102017 380930798
14260 380930798 364718552 347949923 331087483 315009633 299253530 284036287 269229450
14253 269229450 255220232 241729867 230240155 219735572 208065436 197026043 186837414
14246A86837414r261676q608268q046654p992547p379630p023150o536533n981847
14238A26007109n251391n347974n200699m932255m420385m089882l993622l253314
14230H9517587l743261l820000k972617l391467k911571k481826k630511k362664
14222F5203670k513310j778100j734480k329166j990472j940778j757050j487978
14214D9672336j420608j197727j724189j392164j219189j400105r46957r67098
14206C9404299j154934r30970j692596m74262j061897o28976q76324p56853j185738
14197C0641749p84539j023580m35886n38516o44200j033493k82040r75442m18448
14188B4505605n79374o05758n54189p30121l53966m05613p18386n53611J00781
$$ plain form
14246 186837414 177575738 168967470 160920816 152928269 145548639 138525489 131988956 126007109
14238 126007109 120755718 115407744 110207045 105274790 100854405 96764523 92770901 89517587
14230 89517587 85774326 81954326 78981709 75590242 72678671 70196845 67566334 65203670
14222 65203670 62690360 60912260 59177780 56848614 54858142 52917364 51160314 49672336
14214 49672336 48251728 47054001 45329812 43937648 42718459 41318354 40371397 39404299
14206 39404299 38249365 37318395 35625799 35151537 34089640 33460664 32584340 31827487 30641749
14197 30641749 29857210 28833630 28397744 27859228 27215028 26181535 25899495 24924053 24505605
14188 24505605 23926231 23320473 22766284 22036163 21682197 21276584 20558198 20004587 20105368
14179B0105368n52039m13082l72877l23338k59506p93328m7377m77573m66270
14170A6399978j41641m8598o38088j52664l75703l78007r7141n45887j27650j65824
14160A3728775m07810j84148K33508m95266l35685r1746l09733l01067j20192
14151A1716636k25741M9520n69805j42383K9839M8103o51406O3841k38280R2215
14141A0172539j14966k39435l08543J21191J202l42820L3255l07265l2513j99314
14131H783331j14668k95751k70527K23814k44294k40731M07308j83462o83090
14122G381930J290O2081l36956J95220k06686k09112m740k18789K45972m07242
14112F502968p3023j00230K05504k4831J47492l19689K6601n59567J39513p9113
$$ plain form
14179 20105368 19553329 19140247 18767370 18444032 18184526 17391198 17343821 16866248 16399978
14170 16399978 16258337 16209739 15571651 15418987 15043284 14665277 14568136 14022249 13894599 13728775
14160 13728775 13320965 13136817 13370325 12875059 12539374 12447628 12137895 11836828 11716636
14151 11716636 11490895 11540415 10970610 10828227 10858066 10906169 10254763 10318604 10080324 10172539
14141 10172539 10057573 9818138 9509595 9630786 9631988 9289168 9322423 9015158 8982645 8783331
14131 8783331 8668663 8372912 8102385 8326199 8081905 7841174 8248482 8065020 7381930
14122 7381930 7383220 7445301 7108345 7303565 7096879 6887767 6883027 6664238 6910210 6502968
14112 6502968 6429945 6329715 6535219 6510388 6657880 6338191 6364792 5805225 5944738 5865625
14102E865625K21133p23664K10138J32889k2049l44961M22773k16312j5661k13790
14092E316121m68055K03401K16475k81955n19612L35634P3582M34251m24079j90944
14082D694819j10685j17202O031J38576n17960O30803l43547l318K09118m00883
14072D185752J52239j73545J47683k38252K11625n59368L6349J43908k8589j35528
14062C742274J19175n3777k2199k47583O6894P5707Q571K5432j74554k23024J26899
14051C443815j66210j58784N93679j87853m32184l5204K2714M7439O3972n8228
14041C133156j62774N8757J56710j35752j14040J6017l7158j65219K49706k44724
14031B754679P665J47029M744j47004J30961P5746k29525o5709k79188K38747
$$ plain form
14102 5865625 6086758 5363094 5573232 5706121 5684072 5339111 5761884 5545572 5529911 5316121
14092 5316121 4848066 5051467 5267942 4985987 4466375 4802009 4875591 5309842 4885763 4694819
14082 4694819 4584134 4466932 4472963 4611539 4093579 4724382 4380835 4377517 4586635 4185752
14072 4185752 4337991 4164446 4312129 4073877 4285502 3726134 3762483 3906391 3877802 3742274
14062 3742274 3861449 3807672 3785473 3537890 3604784 3680491 3689062 3714494 3539940 3316916 3443815
14051 3443815 3277605 3118821 3712500 3524647 3092463 3057259 3079973 3127412 3191384 3133156
14041 3133156 2970382 3029139 3185849 3050097 2936057 2952074 2914916 2749697 2999403 2754679
14031 2754679 2762344 2909373 2914117 2767113 2898074 2973820 2744295 2678586 2399398 2638145
14021B638145l69000J44399P0972K39071j30090R1500n59805m0603J51071k93318
14011A942342K75456J33269o1849o7923J35287l61030J33682L0951l3407j04892
14001B021886k01032r1947L9719K43182j51591K11103k8325l38282J13367J14039
13991A932119M73628K96471J312216L464632Q669330J3257623J3399206j6450426
13983B6354799A2240415m751828j577728j349800l79967o45487m38382n9672j53292
13974B884259k97046L1824j31980j53140J52531k08713J18274K98610m68814M1939
13964B267744k6677J1883l57921J12594J85066m6925J6948l88169P7250m4877
13954A806916J24344j21356K9702j70289J62476J73528j34107j32726K44338m60995
$$ plain form
14021 2638145 2269145 2413544 2484516 2723587 2593497 2684997 2125192 2084589 2235660 1942342
14011 1942342 2217798 2351067 2289218 2221295 2356582 1995552 2129234 2160185 2126778 2021886
14001 2021886 1820854 1728907 1768626 2011808 1860217 2071320 2042995 1704713 1818080 1932119
13991 1932119 2405747 2702218 4014434 7479066 16148396 29406019 42805225 26354799
13983 26354799 12240415 7488587 5910859 4561059 4181092 3535605 3097223 3037551 2884259
13974 2884259 2587213 2619037 2487057 2333917 2486448 2277735 2396009 2694619 2225805 2267744
13964 2267744 2241067 2252950 1895029 2007623 2192689 2145764 2162712 1774543 1851793 1806916
13954 1806916 1931260 1809904 1839606 1669317 1831793 2005321 1871214 1738488 1982826 1521831
13944A521831p5529L21716K45987k01808j82432J69750k20686Q4525J58281o9794
13934A751841p0304q1577r4037K63796j82184j33901R0357K51543k04636l67263
13924A223635K18130J49836J1770l27550L47054j85878j4382j20224K19074r6361
13914A425104p7028n5298J20564M2309j63970m1796Q2154k71142M71879l08145
13904A224631L72482j90524J1371m44192K79279o7050L9910J91855k31665j09605
13894A076492K84180j28507q0525q3418J82354j44376J11597k34805J85388j6254
13884A152126j45124O7809P9024j11671L14104j49655j8758J23336k50324R0073
13874A150940l52928M39946l50022K56582k13578J43619j63004J65007n3265J67742
$$ plain form
13944 1521831 1446302 1768018 2014005 1812197 1629765 1799515 1578829 1663354 1821635 1751841
13934 1751841 1681537 1599960 1505923 1769719 1587535 1453634 1543991 1795534 1590898 1223635
13924 1223635 1441765 1591601 1603371 1275821 1622875 1436997 1422615 1302391 1521465 1425104
13914 1425104 1348076 1292778 1413342 1455651 1291681 1249885 1332039 1060897 1532776 1224631
13904 1224631 1597113 1406589 1417960 973768 1253047 1185997 1225907 1417762 1186097 1076492
13894 1076492 1360672 1232165 1151640 1068222 1250576 1106200 1217797 982992 1168380 1152126
13884 1152126 1007002 1074811 1153835 1042164 1356268 1206613 1187855 1311191 1060867 1150940
13874 1150940 798012 1237958 887936 1144518 930940 1074559 911555 1076562 1023297 1191039
13864A191039j64616K3117n8156K78089j26046O4622j76173J01972j81525k86973
13854F65350L08656l3283R2501J14880l03498R4525j04693j68551J52359K57526
13844A075772k35029K13856l17191K00475k43229J4249J25935J85763j67747J52483
13834A005337j57223J90474k76546N2588J62981k37613J63309j56769M22436j76424
13824I92550k78639K9969Q6947J64255k97097k43567O51638l55833K82729j74616
13814H58336l6715J84617j40569K09224j32599p266k88800L79875k62394k74847
13804D88862L49389L4164k90553J1454J58262J58041j63104K85033m34138J84528
13794G81938r0295j5973K60097j02372m6989n1434k2872k78835K79375K50246
$$ plain form
13864 1191039 1026423 1049540 991384 1269473 1143427 1208049 1031876 1133848 952323 665350
13854 665350 974006 940723 1033224 1148104 844606 939131 834438 665887 818246 1075772
13844 1075772 840743 1054599 737408 937883 694654 708903 834838 1020601 852854 1005337
13834 1005337 848114 1038588 762042 814630 977611 739998 903307 746538 1168974 992550
13824 992550 713911 743880 830827 995082 697985 454418 1106056 750223 1032952 858336
13814 858336 821621 1006238 865669 1074893 942294 935028 646228 1026103 763709 488862
13804 488862 838251 872415 581862 593316 751578 909619 746515 1031548 597410 781938
13794 781938 691643 675670 935767 833395 786406 734972 712100 433265 712640 962886
13784I62886C39950M204J85381K09284J54228C47037L40742O1295K8085J1263
13774G88422k52636J42526n4404L13829k15759m2317J06292p7375Q6427k52110
13764E42895M10643D02161P708O25879l08237q5050J64992l1813C33748K15368
13754E49116j79848J07166J71190j49047K79891j08975Q1365j93611j77670L15968
13744F95545l10286J78637J70770j17488k9518J48792k9680l11408K22316A43219
13733D23872J60888j97750K68121N2184M8598N2721p3816A24743M39353j72853
13723C91243R5184j86899M8086K39595J37134C60112J64682J31498A58808N20861
13713F79669l32949J04019N5198Q1953R4969l36688J34325J17279l8361K06008
$$ plain form
13784 962886 339950 344154 529535 738819 893047 347037 687779 749074 777159 788422
13774 788422 535786 678312 623908 937737 721978 679661 785953 708578 795005 542895
13764 542895 953538 402161 409869 1035748 727511 642461 807453 775640 333748 549116
13754 549116 369268 476434 647624 498577 778468 669493 750858 557247 379577 695545
13744 695545 385259 563896 734666 617178 587660 736452 706772 395364 617680 143219
13733 423872 584760 387010 655131 707315 755913 808634 734818 124743 564096 391243
13723 391243 486427 299528 347614 587209 724343 360112 524794 656292 158808 679669
13713 679669 346720 450739 505937 587890 682859 346171 480496 597775 559414 765422
13703G65422k89543r9849L07959r1921B83687J03392K68574A39823L12089L06469
13693G58381k40148K46743B38357J37352j08025k8852K90702p1700k2076N9213
13683D94971P9543k37434J60374B17340L38149p2985P7832P9781k26710k4534
13673C88873K41231K1576j1509j27389j04055j71644M24952B5366K55334J25356
13663D06056k4788N02172C55561o7075j01489K36909L77669l97679K0372A62854
13652B14653R0406Q6749Q4126j71863K12710k31169r473Q1924A34021p286K10236
13641C36971L47892k19569n7645j78803p8567K56899R705j80160K22933A25919
13630G33652B78343L69405j34222A29477M4728K88984R2747n6385B48949L43961
$$ plain form
13703 765422 475879 376030 683989 592068 283687 387079 655653 139823 451912 758381
13693 758381 518233 764976 238357 375709 267684 238832 529534 457834 435758 494971
13683 494971 574514 337080 497454 217340 555489 482504 560336 640117 413407 388873
13673 388873 630104 651680 640171 512782 408727 237083 662035 25366 280700 406056
13663 406056 381268 883440 355561 288486 186997 423906 801575 403896 424268 162854
13652 214653 305059 391808 475934 304071 516781 285612 276139 358063 134021 126735 336971
13641 336971 684863 465294 407649 228846 150279 407178 416883 236723 459656 125919
13630 733652 278343 647748 513526 129477 174205 463189 555936 499551 248949 592910
13620E92910A92745M15788n2191j75453n0683A02858K84284L35722A97383L39345
13610E36728A99534K80133A30891r630J53964J84471j9983J54655j91623j26227
13600B76518J49560K3457A60153K28958L3601A81531M34619k21525j66592J72478
13590D00511n3179H5260K25228J49959I5159K81856P8629A48357K22043q1226
13580B89174J18972f8403C15796k6707O6022K8810A87793F0781Q8145R5091K37878
13569D81895A76418N02447B81605J02201P7223j10635L6405R6809B02626F0045
13558D49138d7793C78723k5891J00808G3444K99646K3936L651O5137A56203O6366
13547B22569J82830k4781j16837L6214J49483j95991J40500A36264j3206J75466
$$ plain form
13620 592910 192745 608533 556342 380889 330206 102858 387142 722864 197383 536728
13610 536728 199534 479667 130891 121261 275225 459696 439713 594368 402745 276518
13600 276518 426078 449535 160153 389111 422712 181531 616150 394625 228033 400511
13590 400511 347332 85260 310488 460447 95159 377015 455644 148357 370400 289174
13580 289174 408146 -68403 315796 289089 355111 383921 187793 60781 148926 244017 481895
13569 481895 176418 678865 281605 383806 461029 350394 386799 483608 202626 60045
13558 449138 -47793 378723 352832 453640 73444 373090 397026 400677 465814 156203 222569
13547 222569 405399 380618 263781 299995 449478 253487 393987 136264 123058 298524
13537B98524m3702M4562A35181B1688M7162a04620E31564k20414B2737J45565
13527A68302L8242H118M05416j07002j33396J08459K9527J8661l4207l0951e0198
13515A14471K14685j37260J00165J22718P065p6258p2284A31471L22037n0044
13505D03464k01548L28854q0336j52600K3024n7994a07247D01540A37815N2443
13495A90258Q1504O389m0926k8975I1602J6989b22637B96137h0224B45277A16668
13483A74049M44691B79492K68157L6712q1145j04916A12904H823K62241a32356
13472C14297M4666a7002B72061A8058P7366J5260j6931R9068C3391J16776J02080
13461B52247M2610l7424m1343D8289e1170D44865j69468I3497L438J01781P2206
$$ plain form
13537 298524 254822 299384 135181 21688 68850 -104620 531564 311150 22737 168302
13527 168302 206544 8118 413534 306532 173136 281595 311122 329783 295576 264625 -50198
13515 114471 329156 191896 292061 414779 421844 345586 273302 131471 453508 403464
13505 403464 201916 530770 450434 297834 320858 262864 -107247 401540 137815 190258
13495 190258 271762 278151 237225 208250 91602 108591 -222637 296137 -80224 245277 116668
13483 174049 618740 279492 547649 584361 503216 398300 112904 8823 271064 -132356
13472 314297 358963 -17002 272061 18058 95424 110684 93753 192821 33391 150167 252247
13461 252247 294857 257433 216090 48289 -51170 444865 275397 93497 96935 198716 270922
13450B70922O7741e8213A80041L86515j12934d9419C13715E8640L48353C107N30691
13439E33798b23827B25306L35984a64027g7882A69750J53496j7775m8056C9924
13428F6557R9953J65721K03886A78733j3510B3243L83391A35722J65769o6443
13418B35048e7996A67348C8877a68213B09541G7538O2493d8989B71454j33693
13408A37761g6776B71460l2103a83347C24318r3331I9247M00563A03481J38652
13398B42133K7752E1580q022P8164f0226A55796F8724L05400A59008L2101I4701
13386D2089r340i7578B66935C9122m558J22370P2588q1189k5001J39745J94117
13375D57194A96858i4211H13457A39349K38879a44996B51462a88494A75032Q6541
$$ plain form
13450 270922 338663 -58213 180041 566556 453622 -49419 313715 58640 406993 3107 533798
13439 533798 -223827 225306 561290 -164027 -77882 169750 323246 305471 257415 39924
13428 66557 166510 332231 536117 178733 165223 23243 406634 135722 301491 235048
13418 235048 -57996 167348 38877 -168213 209541 77538 140031 -48989 271454 137761
13408 137761 -76776 271460 239357 -183347 324318 230987 99247 499810 103481 242133
13398 242133 269885 51580 43558 121722 -60226 155796 68724 374124 159008 191109 94701
13386 42089 32749 -97578 266935 39122 34564 156934 229522 148333 123332 263077 457194
13375 457194 196858 -94211 813457 139349 378228 -144996 251462 -188494 175032 261573
13365B61573a35063d7956C75468g2374D34998a21480B40923j9962k3801N3613
13355B50773j9675K99588n2376H9742J62149m8029K77384j28636j71388P6222
13345B57444q4202k8302b4280m1743D11894l4064j18621L39077A26468j285R5737
13334B20920q2984E7026J6545J47125j9223M3934L7717A16753J10457p3050K4067
13323A78227N4145A0528J53589n9951O5334l3713a00932D57812j64148A29929
13312b6597E00242B19012j01303C2577P6103e4937A65919L7594R7101q9710a89768
13300A48564q432K73221A08412P8202b3521A14095J73595a9165A59184O6330A9885
13288B509M21338A74935K32588o4680H9238J17457L8286h9053k2283b7751A35891
$$ plain form
13365 261573 -135063 -47956 375468 -72374 434998 -121480 240923 220961 197160 250773
13355 250773 231098 530686 478310 89742 251891 203862 481246 352610 181222 257444
13345 257444 173242 144940 -24280 -66023 411894 377830 259209 598286 126468 125183 220920
13334 220920 137936 57026 73571 220696 201473 245407 283124 116753 227210 154160 178227
13323 178227 232372 10528 164117 104166 169500 135787 -100932 457812 293664 129929
13312 -26597 500242 219012 117709 32577 108680 -54937 165919 203513 300614 210904 -189768
13300 148564 140132 413353 108412 186614 -23521 114095 287690 -19165 159184 225514 19885
13288 2509 423847 174935 407523 342843 89238 206695 244981 -89053 -111336 -27751 135891
13276B61768i9068A05176J6366d5154D04204j83438G8063J53026J7733E7165a36213
13264D20847k03942J20272A33333a72935H8160d2766A8245K2548R0122O8155d05210
13252B15040G8677m357L32494b9409j33819B26291A02922Q4741b36178E5130K4711
13241G9841j9390c7175B77106A453K18909F6117K0040K86088k859A32401e0935
13229A62191d8081B53399A07845M6361H816K3745J41603h1493C38540E76J73144
13218A73720m1015c1895A22930a33418B07225K6251A14930j8769f1441n2124N0520
13207f3045B07753p1776J47643c22344A6806a08041F1350d3092a4472I3666a47038
13195B0635K52149A22141J01421d2670k27014C22654a47264H530J05461o356j5933
$$ plain form
13276 261768 -99068 105176 121542 -45154 404204 220766 78063 231089 248822 57165 -136213
13264 420847 216905 337177 133333 -172935 88160 -42766 18245 40793 130915 199070 -405210
13252 215040 78677 74320 406814 -29409 -163228 226291 102922 187663 -236178 55130 79841
13241 79841 60451 -37175 277106 1453 220362 66117 86157 372245 369386 132401 -50935
13229 162191 -48081 253399 107845 154206 8816 32561 174164 -81493 338540 576 173720
13218 173720 132705 -31895 122930 -133418 207225 233476 114930 96161 -61441 -113565 -63045
13207 -63045 207753 135977 283620 -322344 16806 -108041 61350 -43092 -14472 93666 -147038
13195 20635 272784 122141 223562 -42670 -269684 322654 -147264 8530 113991 107635 91702
13184I1702f0948C3415g0953j7460j3323C8316K00113k1751M0623a86909B32625
13172A6051J57618A3359K01597g8039C56359j20884G1755g2968A56026c5414B83369
13160B53370M5367k1468m7085o2421K14431E249K6554K97393j60821K0101Q616
13149A97092k1037c5847A05456N6918A7459J21649A1886a81473B02013f8981j64882
13138b33863B79627p7721b55980a1495l00009I5442a00703F8818i5340B30337
13127b82388i9818C07075a61685d0239B36042a26497G6001l4199M4442a17300
13116f7193A19519J9361E8923J17006a00121K5542A70157D4010L15293j20056
13106B39247E1729a36978C30387A23557d59603b9400A81147o6443k2728D2060
$$ plain form
13184 91702 -60948 33415 -70953 -88413 -101736 38316 238429 216678 257301 -186909 232625
13172 16051 173669 13359 214956 -78039 356359 235475 71755 -72968 156026 -35414 283369
13160 253370 298737 277269 230184 167763 382194 5249 31803 329196 168375 188476 197092
13149 197092 176055 -35847 105456 162374 17459 139108 11886 -181473 202013 -68981 -233863
13138 -233863 279627 201906 -255980 -11495 -311504 95442 -100703 68818 -95340 230337
13127 -282388 -99818 307075 -161685 -40239 236042 -126497 76001 41802 86244 -117300
13116 -67193 119519 138880 58923 175929 -100121 -74579 170157 44010 359303 239247
13106 239247 51729 -136978 330387 123557 -459603 -29400 181147 114704 91976 42060
13095a7211B47456n7460L880q7591J87666j20716O3607B8174i4760D00885G8214
13083A62658p3371Q1195p6857P9958n1738K6946J46254j33401c42876A82538j1565
13072A70973b15793c3068l0792j05855G1234a33221C143e2488q0706G1788J90676
13061B62464A29250a19529B41620J7282R8897A08051a3633B27382b04474B22759
13050A24537J09654J10142j63253i9561I4016d2211C31790A5582a44971I7018
13039C37205m5517A913O8724J73187b00280A89517b43376J04181A57679b34321
13028f4037C33122j30633J63366a26769B94534i6396j54381A990J98435a52939
13017b72847B60242A1132P3065N5234A8232e9359j53027A5972J63938b65953A38526
$$ plain form
13095 -17211 247456 189996 193876 106285 293951 173235 236842 28174 -94760 400885 78214
13083 162658 89287 170482 93625 173583 121845 148791 295045 161644 -342876 182538 170973
13072 170973 -215793 -33068 -63860 -169715 71234 -133221 3143 -52488 -133194 71788 262464
13061 262464 129250 -119529 241620 258902 357799 108051 -13633 227382 -204474 222759
13050 124537 234191 344333 181080 -99561 94016 -42211 331790 15582 -144971 97018
13039 337205 291688 1913 70637 243824 -200280 189517 -243376 -139195 157679 -234321
13028 -64037 333122 202489 365855 -126769 294534 -96396 -250777 1990 200425 -152939
13017 -272847 260242 11132 84197 139431 18232 -59359 -212386 15972 179910 -265953 138526
13005a81863j15738C9330e1481n18189c1428j20123K3677C21470D6604M98398
12995E45002a8785A38199J66347o3143o5111j9778O9844N819A13922K12870j51192
12984A75600P8121b37202B31644j9790p9717n1886b12145R0976A4479M1988i4580
12972b68067A86559R2445O2176a73622F70899D6067J87540a34357A14906m5105
12962F9801B0942c39406M0108J09546A14044D5417i4655D7683N3108j7821O1078
12951A44048o5745J66571a8906A18578m2086J61210A8268L46790A4202M2517A4783
12939a2500D2047J75019e769C1510c5143C0873P3209d0959A84894n2502b120B7217
12926b42956A98659a52632D4740G702K09944b17815B95790j45105b3670C7133
$$ plain form
13005 -181863 -297601 39330 -51481 -569670 -31428 -151551 -127874 321470 46604 545002
12995 545002 -18785 138199 304546 241403 176292 156514 226358 232177 113922 326792 175600
12984 175600 253721 -237202 231644 211854 132137 80251 -212145 -121169 14479 56467 -94580
12972 -268067 186559 279004 341180 -173622 670899 46067 233607 -134357 114906 69801
12962 69801 20942 -339406 -299298 -189752 114044 45417 -94655 47683 100791 82970 144048
12951 144048 78303 244874 -18906 118578 76492 237702 18268 365058 14202 56719 14783
12939 -12500 42047 217066 -5769 31510 -35143 30873 104082 -40959 184894 132392 -2120 27217
12926 -242956 198659 -152632 44740 7702 217646 -217815 295790 150685 -23670 37133
12915A43852M7753a21406L1989C20331F2121b85517I8469J2652d7950k19434A73867
12903E5490a14308A4550J30411e4504B84854k8370m9208a72573P907B20454k170
12892B18284F2464L6509a94096B50914E614a2787G6919c0320F5146C1790J5079
12881D6869J20639p8224i4618A85169i4993F8475J51990a46992H9960L1162L6388
12870A57510m4060d027j31418O910A97793k0917b49996J08522B0321J6313a76075
12858C86998A60359a84473A87795K29472c23370J22921i4905H9215j5265K61271
12848C35221a55937B8207b19351k4311a2144j15418d0565A42966b56930J14066
12838a42864B2008J42639f730B41864D4903b2802k71473Q9169A9065J09943b49546
$$ plain form
12915 143852 191605 -121406 -89417 320331 62121 -285517 98469 111121 -47950 -267384 173867
12903 55490 -114308 14550 144961 -54504 284854 256484 207276 -172573 -164666 220454 218284
12892 218284 62464 98973 -194096 250914 5614 -12787 76919 -30320 65146 31790 46869
12881 46869 167508 89284 -94618 185169 -94993 68475 220465 -146992 89960 121122 157510
12870 157510 113450 -4027 -135445 -128535 197793 176876 -249996 -141474 20321 36634 -176075
12858 386998 160359 -184473 187795 417267 -323370 -200449 -94905 89215 73950 335221
12848 335221 -155937 28207 -219351 -243662 -12144 -127562 -40565 142966 -256930 -142864
12838 -142864 22008 164647 -6730 241864 44903 -22802 -294275 -205106 19065 129008 -249546
12826I8320a8475C86732c4836n789m3845C9147R9504H980e5809A91724b34965
12814b37371g5169j9902n355B61431C5429C185a56943A20449a97755E6523f5195
12802b68975k8283B41558a96635I4188a560A14277i3578F9556b61496J05795G9973
12790D6413K50579b0922B51407B4611J650a63141c6654A03839b31938A16303J73719
12779B90022r3434p6454a28835q9140o4498C01128a33808l7485q0444B29158f8434
12767a35237E1229a81775j6d0226A16663b07325D4260L8768a69108j4492I2051
12755F9989J26631c25764a4460B16529i6840k31578A68420p9424C3045a59614
12744b19247E7504R7781a5140B7075i6729B16605i8469L2801F9994a4434B7134
$$ plain form
12826 98320 -18475 386732 -34836 -40625 -84470 39147 138651 8980 -55809 191724 -234965
12814 -237371 -75169 -95071 -100426 261431 35429 3185 -156943 120449 -197755 56523 -65195
12802 -268975 -297258 241558 -196635 94188 -1560 114277 -93578 69556 -261496 -155701 79973
12790 46413 296992 -20922 251407 24611 26261 -163141 -36654 103839 -231938 116303 290022
12779 290022 196588 120134 -128835 -217975 -282473 301128 -133808 -171293 -251737 229158 -68434
12767 -135237 51229 -181775 -181791 -40226 116663 -207325 44260 83028 -169108 -183600 92051
12755 69989 196620 -325764 -14460 216529 -96840 -328418 168420 88996 33045 -159614
12744 -219247 57504 155285 -15140 27075 -96729 216605 -98469 -65668 69994 -14434 27134
12732F0288B01c0689B62982a06327A49802a02693b4106k3575B09236a20746A02610
12720A89654F3414a6663A52841l6064b4862A06629B6358b20073G676a00859k00733
12709c01592a27648F3013a9597j56992B89038A39568m9364h816C6275Q0743b62748
12697e1872j50234i2726n5058e6351A69135K50856b2878A62962E5915K50454A4466
12685A28814d2774a9680A69662B1755a06368A84872J03769C327J76944e1280q856
12674f0136M445D89021I8322j9676c34066I6972R5119J43376D8464J12252d98164
12662f8910A60331k2827J58390j31665a17448d2349B60147G4827J84020h9647
12651a11772b3783A88795f9891o578A27380K67901I1571l2909g088I7741a86704
$$ plain form
12732 60288 201 -30689 262982 -106327 149802 -102693 -24106 -47681 209236 -120746 102610
12720 189654 63414 -16663 152841 116777 -24862 106629 26358 -220073 7676 -100859 -301592
12709 -301592 -127648 63013 -19597 -176589 289038 139568 90204 -8816 36275 117018 -262748
12697 -51872 -202106 -92726 -147784 -56351 169135 419991 -22878 162962 55915 306369 14466
12685 128814 -42774 -19680 169662 21755 -106368 184872 288641 3327 180271 -51280 -60136
12674 -60136 -55691 489021 98322 78646 -334066 96972 192091 335467 48464 160716 -498164
12662 -68910 160331 137504 295894 164229 -117448 -42349 260147 74827 258847 -89647
12651 -111772 -23783 188795 -69891 -76469 127380 395281 91571 58662 -7088 97741 -186704
12639a09506j7568L3419k619C59487j46055a22027o8124A13656E1114P2192D2716
12627I5873J99885d9922A44677Q6178B7621L01789G1800a7021B12973A4167B786
12615A56349L0615G4496J2825Q610f4929B59a9039A45848b13595A36782l257K695
12603A36220b5180C24956E0153d6189B61587q8293K67044B19061A07135b23957
12592a32914k92845C4797d0652B69556K9096k8409I8570J77222J36833D4318N4509
12581I8827J7725g1863p7687c1326k16289B37515j03252c3268j43672h2299C52252
12569f5092B8232a80507B63374A09198a99842O5964e4349b3184B52753a86215
12558B30397K1582A09562D7035L87436j74627d23505a23148L2338j4580A56441
$$ plain form
12639 -109506 -127074 -93655 -96274 359487 213432 -122027 -190151 113656 51114 123306 42716
12627 95873 295758 -49922 144677 230855 27621 329410 71800 -17021 212973 14167 2786
12615 156349 186964 74496 87321 95931 -64929 259 -19039 145848 -213595 136782 133525 136220
12603 136220 -25180 324956 50153 -46189 261587 173294 440338 219061 107135 -223957
12592 -132914 -425759 34797 -40652 269556 298652 270243 98570 275792 412625 44318 98827
12581 98827 116552 -71863 -149550 -31326 -247615 237515 134263 -33268 -176940 -82299 352252
12569 -65092 28232 -180507 263374 109198 -199842 -133878 -54349 -23184 252753 -186215
12558 230397 251979 109562 47035 434471 259844 -423505 -123148 -90810 -105390 156441
12547b09464M1709B03483a13873f159n5155j01527c6895o3358B80609F4716J32265
12536A96981g9587B78584a50943L7598B46236a54365E3716a24873A6778R5318
12526A12096a3333E7333c33119d12A03681g1599A85680d28189a9332j78019P1768
12515a25583J5871B81819A20317i5490A12905J0770m1061J92202G2721a44411
12504A47682k8947g8149j36479B49404o3528A8033c93753a38173F0144B6136f8346
12492c27107J25216B93520I6819c8034i896q1917B16342b13218h7807A9081P2010
12481I1091R288d5475A83617I0644a90220O7843k3730d9486l8584B70869j13983
12470A56886a32510B7588Q8982B1287L28555e417j51939M7723A42091j0787j8482
$$ plain form
12547 -209464 -167755 203483 -113873 -6159 -61314 -162841 -36895 -100253 280609 64716 196981
12536 196981 -79587 278584 -150943 -113345 246236 -154365 53716 -124873 16778 112096
12526 112096 -13333 57333 -333119 -412 103681 -71599 185680 -428189 -19332 -197351 -125583
12515 -125583 -109712 281819 120317 -95490 112905 123675 82614 274816 72721 -144411
12504 147682 118735 -78149 -214628 249404 185876 18033 -393753 -138173 60144 26136 -68346
12492 -327107 -201891 293520 96819 -38034 -9896 -91813 216342 -213218 -87807 19081 91091
12481 91091 100379 -45475 183617 90644 -190220 -122377 -146107 -49486 -88070 270869 156886
12470 156886 -132510 27588 116570 21287 349842 -5417 -157356 -109633 142091 131304 112822
12459A12822M7494o8046j9500J4045N4373J81297A30937K7672e4811j31423A38636
12447b83124G1865a45581c6843M92j03084j12754l4043F9832a22456c124C10390
12435F9060b28236J08555L2043I4696O3936E4397P0607a21595A73476b89440A19773
12423C68412h6121A75458a10709k90374a43219j69643b4788n5923k57985a30950
12412E3339a15982j47506a3760A796P0222A4732K11057E1500b70744H0477b08200
12400b63689o2795E1132j5460f3342g430l6493l7023k25822A69457p4015J2554
12389A07996N5882a89367j42480H7325c76380D6990k1251a8744B40385b2017j13182
12378a35199O1535l17202Q5578b6992C63823A2353d6725G5183i2082C4510b90893
$$ plain form
12459 112822 160316 92270 72770 86815 141188 322485 130937 158609 -54811 -186234 138636
12447 -283124 71865 -145581 -36843 -36351 -139435 -252189 -286232 69832 -122456 -3124 310390
12435 69060 -228236 -119681 -87638 94696 158632 54397 125004 -121595 173476 -289440 119773
12423 368412 -86121 175458 -110709 -401083 -143219 -312862 -24788 -80711 -338696 -130950
12412 53339 -115982 -263488 -13760 1796 72018 14732 225789 51500 -270744 80477 -208200
12400 -263689 -326484 51132 35672 -63342 -7430 -43923 -80946 -306768 169457 95442 107996
12389 107996 163878 -189367 -331847 87325 -376380 46990 25739 -18744 240385 -22017 -135199
12378 -135199 -73664 -390866 -305288 -26992 363823 12353 -46725 75183 -92082 34510 -290893
12366A6956a18874A21589f9608J7942A31630c9135A54675b39141C47355a56772
12355g7821C7283a27442A2365f2704p7501C51b24889a8403G4395d6722D5329b98445
12342A28908N5718e5464k17512F5826a5638l25544a39537n831N3294B33361c5881
12330d39893D097N6624b7864j26654a0979C32438a51579H8958P5286a24855A35732
12318f918A91583F430e2110k7078o1958C5698J04856a49926B90904j04034H7882
12306c377j32468a9033D02497A36403b43517B34277n5196b43228I5592d7919B7067
12294A20751l4132a04222C8333a62285O3941j9526A5453O5693d935B9036a90875
12282E9854Q0384b7689j02309N8763G9447K01927c6878l3635q1306B36021J18540
$$ plain form
12366 16956 -118874 121589 -69608 -51666 131630 -39135 154675 -239141 347355 -156772
12355 -77821 37283 -127442 12365 -62704 -140205 351 -224889 -18403 74395 -46722 45329 -298445
12342 128908 184626 -55464 -272976 65826 -15638 -341182 -139537 -145368 -92074 233361 -35881
12330 -439893 4097 60721 -27864 -154518 -10979 332438 -151579 88958 164244 -124855 135732
12318 -6918 191583 6430 -52110 -79188 -141146 35698 140554 -149926 290904 186870 87882
12306 -3377 -135845 -19033 402497 136403 -243517 234277 179081 -243228 95592 -47919 27067
12294 120751 86619 -104222 38333 -162285 -98344 -117870 15453 81146 -4935 29036 -190875
12282 59854 140238 -27689 -129998 -71235 79447 281374 -36878 -70513 -151819 236021 354561
12271C54561G8457e4082F8579c23453D52993a0414I4150P7730J4654n0248o7750
12260F8536d9412j8461D8354b18565E302b01994C36312j17686F0008K26312j05797
12249A80523D8442j4502a13319A22349c9453a5042A43820c4051A03364J0818J93331
12238C07513j01662g8582G3465M6877h9432B42618F6862a10785C15781e2358A57110
12226A62947C9757A2808J77680J06501F2373Q2649N5011b48885b0305A30518i453
12214F08570c0853A36724M8875l8196J24311g0614F2735B9409b45578A49497G2494
12202B27003h5235A35242E2760j048J37594a16012b1000B41246r6880E7323K32179
12191B89502r7675M5532A1893b8183A39577O8528l1535C8004J66636O6853j17122
$$ plain form
12271 354561 78457 -54082 68579 -323453 452993 -10414 94150 171880 186534 136286 68536
12260 68536 -49412 -67873 48354 -218565 5302 -201994 336312 218626 60008 286320 180523
12249 180523 48442 33940 -113319 122349 -39453 -15042 143820 -34051 103364 114182 307513
12238 307513 205851 -78582 73465 120342 -89432 242618 66862 -110785 315781 -52358 157110
12226 162947 39757 12808 190488 296989 62373 145022 200033 -248885 -20305 130518 -9453
12214 608570 -30853 136724 185599 147403 271714 -70614 62735 29409 -245578 149497 72494
12202 227003 -85235 135242 52760 51712 189306 -116012 -21000 241246 144366 57323 289502
12191 289502 191827 237359 11893 -28183 139577 208105 176570 38004 204640 271493 154371
12180A54371m5273L00335q1775f0703B72798j07112K41038A2360a7646p9779A61730
12168I2419b303C79953j77552j3340b58541B02834J39457b21468j1187B87266
12157a86661D7727J75251q8875c27758c788A99866a8672q1724m0846F340L59665
12146C66005F7662J25395a76530A43236m6104C8854a12118d3980p5105F8897k1095
12135D7802a95732k5887A69701C644a59844M0060b4092C5042c7389B07140f07
12123a73405A4110a15171O079j41922A89682c43219B66615G8942b1330C01998
12112a18373j86207B7329O4010L9032R5587b01892n641D4097P3293c08947i3615
12100A57128a96854B08455h066A01423R1261N7031K2460L643C0128J55274n1934
$$ plain form
12180 154371 109098 409433 327658 -60703 272798 165686 406724 12360 -17646 -97425 161730
12168 92419 -2303 379953 202401 189061 -258541 202834 342291 -221468 -232655 287266
12157 -186661 47727 222978 134103 -327758 -3788 199866 -18672 -100396 -141242 6340 366005
12146 366005 67662 193057 -176530 143236 97132 38854 -112118 -43980 -119085 68897 47802
12135 47802 -195732 -221619 169701 3644 -159844 -119784 -24092 35042 -37389 207140 -607
12123 -173405 14110 -115171 -109092 -251014 189682 -343219 266615 78942 -21330 301998
12112 -118373 -304580 27329 91339 130371 225958 -201892 -207533 44097 117390 -308947 -93615
12100 157128 -196854 208455 -8066 101423 192684 249715 272175 275818 30128 185402 133468
12089A33468a70576J8186H5899d6918F0745O5401a90084E5249d0777B45789a50606
12077b20914M1782P2068A32600b794j18002p4647F3483K44746a6188C01047J28772
12066D29819A36383D7645J9166K28899b16334B06087c50232i1180A24550K00506
12056C25056P2893L98887O20311m96667D09493A09387a04170B55473P1445j30716
12046A96202b55727a23077o8892k8350B7921L10669b37330H4092d8971k14376
12036b63347b7794B71557I6334c9553I5741M3403P6538r476b52484d2747F6899
12024a21782M0069C39342a11311q3286I1244c19982A53308a83943A39864d6030
12013B89233c17079e1056B72702h0904B65623a03899A7857h5951b4985n1987A82360
$$ plain form
12089 133468 -170576 -152390 85899 -46918 60745 126146 -190084 55249 -40777 245789 -150606
12077 -220914 -179132 -107064 132600 -2794 -120796 -195443 63483 308229 -16188 301047 429819
12066 429819 136383 47645 66811 295710 -216334 206087 -350232 -91180 124550 325056
12056 325056 397949 796836 1417147 920480 409493 109387 -104170 255473 326918 196202
12046 196202 -255727 -123077 -191969 -220319 27921 338590 -237330 84092 -48971 -263347
12036 -263347 -27794 271557 96334 -39553 95741 139144 215682 206206 -252484 -42747 66899
12024 -121782 -81713 339342 -111311 -194597 91244 -319982 153308 -183943 139864 -46030
12013 289233 -317079 -51056 272702 -80904 265623 -103899 17857 -85951 -24985 -76972 182360
12001c9648k5783E052b05322D39052d28983O2152o158J84400f7821K5983A15691
11989h4266B4891L39700j36445J47343i1657A31794l2227e1871H501Q2103N6607
11978A47211c06487E0421i6734A57318q070J27640a16529d1519l00980A01431
11967D2565d16132e2533d119A099a63145A33841O1821b5693G0657b08399d6371
11955c01066C4665c87480D13752e7326I7456h6587k74196C33977A47701a29869
11944H9130a35914A63810L9383c24416p722a61802A14581f9990J5138j91950J01362
11933a45440B32529e9647A38896c51917B6919f285j34228j53146a0792k3716j0469
11922d4977B7449K44891b16099A13601a91481n1825f9624n0166C12019b5839D2989
$$ plain form
12001 -39648 -65431 5052 -205322 439052 -428983 -366831 -372989 -188589 -67821 -41838 115691
11989 -84266 24891 364591 228146 375489 -91657 131794 99567 -51871 8501 90604 147211
11978 147211 -306487 50421 -96734 157318 149248 276888 -116529 -41519 -342499 101431
11967 42565 -416132 -52533 -4119 1099 -163145 133841 195662 -25693 70657 -208399 -46371
11955 -301066 34665 -387480 413752 -57326 97456 -86587 -360783 333977 147701 -129869
11944 89130 -135914 163810 203193 -324416 -332138 -161802 114581 -69990 -54852 -246802 -145440
11933 -145440 232529 -59647 138896 -351917 26919 -6285 -140513 -293659 -10792 -34508 -44977
11922 -44977 27449 272340 -216099 113601 -191481 -243306 -69624 -119790 312019 -25839 42989
11910e8027b5571j31946B07711B8351c40463A2816a95728k39763C36066j0214
11900C25852q0544H4120a62286M556D7896a86698C5862M9132k305f8412j40053
11889b08465B2053K86972d8644b3056H0984J73082A8445a96250l277A39796l5809
11878A03987a92123l5285O4498L8136M567k7397M9455C6021M6098N68g8417j19569
11866a97986j07895H0730N1093l516B1719J30351A3445a25431A69332F5812O1161
11855A26973a35194j2320A64975b3837j43615A06139a49417B20978h6040m0058
11845a26098o8250f2998C5991b12124Q5981B79396a58624j54707F3874b17363
11834A03145a65257N2078N259L4791j36244A72277L07176a36375l7677m1598F5895
$$ plain form
11910 -58027 -25571 -157517 207711 28351 -340463 12816 -195728 -435491 336066 325852
11900 325852 245308 84120 -162286 -157730 47896 -186698 35862 84994 82689 -68412 -208465
11889 -208465 22053 309025 -48644 -23056 80984 254066 18445 -196250 -199527 139796 103987
11878 103987 -192123 -227408 -162910 -124774 -120207 -147604 -98149 36021 82119 82687 -78417 -197986
11866 -197986 -305881 80730 131823 128307 21719 152070 13445 -125431 169332 65812 126973
11855 126973 -135194 -147514 164975 -23837 -167452 106139 -149417 220978 -86040 -126098
11845 -126098 -194348 -62998 35991 -212124 -126143 279396 -158624 -313331 63874 -217363
11834 103145 -165257 -113179 -107920 -73129 -209373 172277 479453 -136375 -174052 -215650 65895
11822d80056J21605A3034J8456M8588h2365B63357g4831A85616b24176D7103c71802
11810a71521A7640R8069R2940a69328l36565A07832b68596J6551N2791a2559k62180
11799b74739A3271N9617A9090a93420D0929e0957A94781I603L2621R3672J13887
11788B49783C0833b18285a5198m9589A10312C6281b46747b1081E5281b28398F557
11776h4955j99655a13046A88502a61343j5924f1443j84678B0611h394m26211a91582
11764b02496D5023J09924K4320C1871e923j33887f470B2135g6216k43427I4a24690
11751A20123b00304b1812q1381q728I7650A2421d90670C65928c30792B1083b12552
11739B85730b23132J05175A64917h2922A86172N6318a61799A55333f5408a2319
$$ plain form
11822 -480056 -358451 13034 31490 80078 -82365 263357 -74831 185616 -224176 47103 -371802
11810 -171521 17640 115709 208649 -169328 -505893 107832 -268596 -252045 -199254 -12559 -274739
11799 -274739 13271 72888 19090 -193420 40929 -50957 194781 9603 42224 135896 249783
11788 249783 30833 -218285 -15198 -64787 110312 36281 -246747 -21081 55281 -228398 6557
11776 -84955 -284610 -113046 188502 -161343 -177267 -61443 -246121 20611 -8394 -434605 -191582
11764 -202496 45023 154947 179267 31871 -5923 -139810 -6470 22135 -76216 -319643 94 -124690
11751 120123 -200304 -21812 -103193 -111921 97650 12421 -490670 365928 -330792 21083 -212552
11739 285730 -223132 -117957 164917 -82922 186172 242490 -161799 155333 -65408 -12319
11728a15777A5935J476J72686D5714A9728b98821h8206b9455m8371j67223C00204
11716d61665c5303D2094O3866h2797A15747D1463O7960J4510n6792c4238k0417
11705e4655m0696k84129o965a19602B6374J04689J03863a65365b7746a1893m01529
11694d13422F0694M7010i3413l3673F2386a39684m1703A898K0550i2065A9034
11682c6735k07028E9011k9486P7860b20086A5452b80751a04646A07387l0338J31403
11671B08452D2038K23395b48996C70072b9722E1210i4893o6689G6991a33563B5284
11659A47964J2755E819i4821j71661B9391A1441c01778h2747j91298G3239J8371
11648I1610M13791a10980k15381J51290I6241a37296A00763b35614c7497r5475
$$ plain form
11728 -115777 15935 17411 190097 45714 19728 -298821 -88206 -29455 -77826 -245049 300204
11716 -461665 -35303 42094 105960 -82797 115747 41463 109423 123933 67141 -34238 -54655
11705 -54655 -95351 -379480 -386445 -119602 26374 131063 234926 -165365 -27746 -11893 -413422
11694 -413422 60694 107704 -93413 -127086 62386 -139684 -181387 1898 22448 -92065 19034
11682 -36735 -243763 59011 29525 107385 -220086 15452 -280751 -104646 107387 77049 208452
11671 208452 42038 265433 -248996 370072 -29722 51210 -94893 -161582 76991 -133563 25284
11659 147964 160719 5819 -94821 -266482 29391 11441 -301778 -82747 -274045 73239 91610
11648 91610 505401 -110980 -326361 -175071 96241 -137296 100763 -235614 -37497 -132972
11638a32972k83636A75257h6533A0686b4513k30531A72668b26478C70635f844
11627A8838N2063d23133I4880A7836b11381J01420B92569K3684E2607b12886c6588
11615g7809H2752L41590i9652o6080f2742A55841c686A02355n0352a69621j41181
11604c10802m475j19813K06296a0472C6180i2411p8121A2674a09989H0125c2122
11592B29593b94066B5231c35255B5292A0009K0626c0849A12432h4625k18917H4899
11580C01759a1770A58111a9460b117j02386K6273B2934b5349A24944K8507b08057
11568A39327J30744n189A27382b34431F1635K11827q6100d6724A06546j1216a01400
11556i9494C036e48948a39682f6906j52668J03969L9179F7116h0180A76747m7861
$$ plain form
11638 -132972 -416608 175257 -86533 10686 -24513 -255044 172668 -226478 370635 -6844
11627 18838 70901 -423133 94880 17836 -211381 -109961 292569 316253 52607 -212886 -36588
11615 -77809 82752 424342 -99652 -165732 -62742 155841 -3686 102355 52003 -169621 -310802
11604 -310802 -315277 -435090 -228794 -10472 36180 -92411 -170532 12674 -109989 80125 -32122
11592 229593 -294066 25231 -335255 25292 10009 30635 -30849 112432 -84625 -303542 84899
11580 301759 -11770 158111 -19460 -2117 -104503 -78230 22934 -25349 124944 153451 -208057
11568 139327 270071 264882 127382 -234431 61635 273462 187362 -46724 106546 95330 -101400
11556 -99494 3036 -548948 -139682 -66906 -219574 -115605 -76426 67116 -80180 176747 128886
11545A28886a43069A13616f424A53313J99691a16035A42222a03599K1584B03312
11534G0890Q3332f4332j16036A25299J17442d1842k2607B68691b1162o914k0734
11523d8810b0369B70264d1085A26910D8209J42867C2329K61047j6748Q27h8057
11511C1452a02714b227A6567i4612B79278a82883Q2037B8124j0386J71130a4197
11499b3915F2429J3490O4092J31233R7893m8889h7647A42983a32750F2684K27634
11488B90318a04387I3977l5224b04181A0091L49925b05662G9833L03583d6360
11477A18869B490Q8924a22894L9418A40105g1745B83074m1796a48001B31188C4859
11465f769j33140E803g5338D0527a99276B04577J2701b56246A84696E4259J21247
$$ plain form
11545 128886 -143069 113616 -6424 153313 353004 -116035 142222 -103599 -82015 203312
11534 70890 154222 -64332 -180368 125299 242741 -41842 -64449 268691 -21162 -28076 -48810
11523 -48810 -20369 270264 -41085 126910 48209 191076 32329 293376 276628 277455 -88057
11511 31452 -102714 -2227 16567 -94612 279278 -182883 -100846 28124 17738 188868 -14197
11499 -23915 62429 75919 140011 271244 369137 320248 -87647 142983 -132750 62684 290318
11488 290318 -104387 93977 58753 -204181 10091 360016 -205662 79833 383416 -46360
11477 118869 2490 91414 -122894 -83476 140105 -71745 283074 241278 -148001 231188 34859
11465 -6769 -139909 5803 -75338 40527 -199276 204577 217278 -256246 184696 54259 175506
11454A75506a75968A82401K02146A49453J31065i8054j12425k9899M9882m3241
11444b33737H3683f6979A93155e904A75044G4009a20875A38275d21313a08571
11433b96828e8069a5041l513q4620C7001R159c29334B92482b38962A43861a90365
11421B14029H4041J34586q0055a71575g7105j01854B81792b10492I1791b3351
11410b29909e676l16076A41078J04884j17564a06790N2816B56011K4060A27239
11399a02956K1647j6623B42016b54662B12188B0715R8018b410n93G6665b1639
11387A63285J51145a0847C43968a46028E3714a91099M4923A68575c07884d6522
11376b31744i3466G6886g8977l2351p6966B02205A2106a80477C9619a07365o0507
$$ plain form
11454 175506 -175968 182401 384547 149453 280518 -98054 -210479 -240378 -190496 -233737
11444 -233737 83683 -66979 193155 -5904 175044 74009 -120875 138275 -421313 -108571
11433 -296828 -58069 -15041 -18554 -103174 37001 46160 -329334 292482 -238962 143861 -190365
11421 214029 84041 218627 138572 -171575 -77105 -178959 281792 -210492 91791 -23351
11410 -229909 -5676 -321752 141078 245962 128398 -106790 -53974 256011 280071 127239
11399 -102956 -81309 -97932 242016 -254662 212188 20715 118733 -2410 -3003 76665 -21639
11387 163285 314430 -10847 343968 -146028 53714 -191099 -146176 168575 -307884 -46522
11376 -231744 -93466 76886 -78977 -111328 -188294 202205 12106 -180477 39619 -107365 -167872
11365a67872O1468M902j34726f3945a5366C8702b38921A89628m1010L26181A83889
11353a98629l5402i7250r7439f7848j57900h2242n4824m4542L6021e2757m6593
11342i9350G3343d06621h4458G1825a83894e4167q9239k01197I6296b01659A57650
11330e7874r7458q586m1958k1759o0231I6439d64921a59431C57134C5832b78995
11318a51601A49404Q9710q9760J7853e7121r1002g0431j96231b4244k49121c3448
11306a2768j64008A48758b11947G6444a49922c3171B41314d227l25999a9201B42189
11294A39253c36919a33477D32794H279L09946b30261B23206e2356A46225B4143
11283B34640b39259B51450a27710A48359N5998f4539a3681q5396K3907H3802M8874
$$ plain form
11365 -167872 -106404 -101502 -236228 -63945 -15366 38702 -238921 189628 148618 474799 183889
11353 -198629 -234031 -97250 -194689 -67848 -225748 -82242 -137066 -181608 -145587 -52757 -99350
11342 -99350 73343 -406621 -84458 71825 -183894 -54167 -143406 -344603 96296 -201659 157650
11330 -57874 -155332 -163918 -205876 -227635 -287866 96439 -464921 -159431 357134 35832 -278995
11318 -151601 149404 239114 149354 167207 -57121 -148123 -70431 -266662 -24244 -273365 -33448
11306 -12768 -176776 148758 -211947 76444 -149922 -33171 241314 -4227 -330226 -19201 242189
11294 139253 -336919 -133477 432794 8279 318225 -230261 223206 -52356 146225 24143
11283 234640 -239259 251450 -127710 148359 204357 -64539 -13681 -99077 -75170 83802 132676
11272A32676d3723m23872f8659q0747d5089A03386j4471m0010a47472I4483a8919
11260g5232F409b25232e7561j73640B87936C1374P3405b05084N3610d3063A28310
11248A73937a43273B28461a21804l72712D67252d3531B51724o3519a7815r4343
11238a12158j39159c1268j64452A19351J76D179a55050p5096e7490I884J79978
11227A89862m5692h9260b9214k787q3917B39503J39652A1348K21904h2757H6640
11215a37060c983F1028j8463b09986M7994B13650a32697B7761J5051b93238a01942
11203h6400j4854c3908B15460h5594j51629O7744C87409A32661L94g6111e704
11191b15995h6404l70916a27419a4696j18211N0825A10281Q6468a2386o79368
$$ plain form
11272 132676 -43723 -467595 -68659 -149406 -45089 103386 88915 48905 -147472 94483 -18919
11260 -75232 6409 -225232 -57561 -231201 287936 31374 104779 -205084 -151474 -43063 128310
11248 173937 -143273 228461 -121804 -494516 467252 -43531 251724 188205 -17815 -112158
11238 -112158 -251317 -31268 -195720 119351 119527 4179 -155050 -230146 -57490 9884 189862
11227 189862 144170 -89260 -29214 -32001 -115918 239503 379155 11348 233252 -82757 86640
11215 -137060 -3983 61028 42565 -209986 -161992 213650 -132697 27761 42812 -293238 -101942
11203 -86400 -101254 -33908 215460 -85594 -237223 -169479 387409 132661 133055 -76111 -5704
11191 -215995 -86404 -457320 -127419 -14696 -132907 -82082 110281 196749 -12386 -691754
11181f91754B9208J35076e2683j80392l4588A59011b39475A22727J38957O0856
11171C22540A7774a28752C61856b5054P624A02985i8682j38750B97290d19725
11160a30030c7522A0505a09238C36927H6522a32324I54L0845h024E4195J44220
11149A98415c84322C9697L5369l7007b43276D4158b23825l1865i2393j66446A52481
11137C1212d06974A755h4727A67855p7119B7770L6880A351g016E7316G194M00419
11125D07613e1016o6573A64896J258p9895Q3252C779R9007K3647b09699R0176
11114a19523a1082A25056D8718J4902C0856J41465h0630C7417L9125M0408a17939
11102C34737j12502A485K6148d0152a3103H5521d3700A20555K00094A22522J62102
$$ plain form
11181 -691754 29208 164284 -52683 -233075 -267663 159011 -239475 122727 261684 322540
11171 322540 17774 -128752 361856 -25054 -17430 102985 -98682 -237432 297290 -419725
11160 -130030 -37522 10505 -109238 336927 86522 -132324 954 31799 -8024 54195 198415
11149 198415 -384322 39697 75066 38059 -243276 44158 -223825 -255690 -92393 -258839 152481
11137 31212 -406974 1755 -84727 167855 90736 27770 64650 1351 -7016 57316 7194 407613
11125 407613 -51016 -117589 164896 166154 86259 169511 3779 102786 126433 -209699 -119523
11114 -119523 -11082 125056 48718 63620 30856 172321 -80630 37417 76542 116950 -117939
11102 334737 222235 1485 27633 -40152 -13103 85521 -43700 120555 320649 122522 284624
11091B84624l9113a34184m7212D43796p3143q7812J96904B0063K74234I1227k5446
11080F5781d02401A08636Q2528a40533G996J60720j9579l8855J10010r3695K67557
11069C94154r1399J39576A48583K15131A20776P2240N00768C26556M27106A66872
11058A95143L06083o7531J00528r5270J09478q0812L24416l38565j16600J73323
11048E10193r3463j7861N8937j56771L30778J84129k99202J29185j81029J56587
11038F21483R9027j79100k02872K03129B47586L12466j33147j40214K68114A28803
11027C88800J72270J35499j64915j58242L83435A86685O9631J44714A75459K10280
11017C85739J20657J59652J9170j04588R834J1232j99659M09660C89518A80161
$$ plain form
11091 284624 245511 -134184 -181396 443796 370653 282841 479745 20063 294297 91227 65781
11080 65781 -402401 108636 191164 -140533 7996 168716 149137 110282 220292 126597 394154
11069 394154 302755 442331 148583 363714 120776 193016 693784 326556 753662 166872
11058 195143 501226 433695 534223 438953 548431 467619 792035 453470 336870 510193
11048 510193 416730 398869 457806 301035 631813 815942 516740 645925 464896 621483
11038 621483 720510 541410 338538 541667 247586 560052 426905 286691 554805 128803
11027 388800 561070 696569 531654 373412 756847 186685 256316 401030 175459 385739
11017 385739 506396 666048 685218 580630 590464 601696 402037 811697 389518 180161
11006E55038p4290j08773Q7251B08989K59384K90314l57712J32635H1174N32094
10996F13268k81673Q7213J13436j65076K81951P9844M06j36162k81426j12966
10986A98815O87533k31607o9892L61764l29844M23930l74315N20495j44447J13413
10976A155845M62183J91250O8152J81554k0797J46497O2646j85651k04743j60077
10966A696859l69757K5673j17987l55354P2384P8672j35824L0500k10129m4841
10956F70196N04588n50922j13333L22575l22202j51822b2305B56217q6962A0504
10945A72701G1808J24683J19929d8783A28762d1203B01006j5819a6633n6171B91469
10933b66279A3852E855L67743j51059E6595j2806R8339M26212A05403C0540c13792
$$ plain form
11006 555038 480748 371975 459226 208989 468373 758687 400975 533610 81174 613268
10996 613268 331595 418808 532244 367168 649119 728963 729369 593207 311781 198815
10986 198815 886348 654741 584849 946613 616769 1040699 666384 1186879 1042432 1155845
10976 1155845 1618028 1809278 1877430 2058984 2038187 2184684 2247330 2061679 1856936 1696859
10966 1696859 1327102 1352775 1234788 879434 951818 1030490 894666 925166 715037 670196
10956 670196 1174784 623862 510529 833104 510902 359080 -22305 256217 169255 10504
10945 172701 71808 196491 316420 -48783 128762 -41203 201006 185187 -16633 -72804 291469
10933 -266279 13852 5855 373598 222539 56595 43789 142128 568340 105403 30540 -313792
10921f6866B08022B9875R8902f7419j20351e0553B0423a27125k08823B63133a54741
10909b49516H4919J28016g8584D1656r126b45273A28670F597J57406e0029B14420
10897C21341A23817C2914M1754a67696M2569j82068C9383P2471C9121j3589O1206
10886H6738a38706N7572j20701k1691e8240C60895a75442O3203e1160B9347c0988
10874g1502l43077a32102r9693P6536G8877a91251h3003E2627b25887D5903J59357
10863B05260g3208o482C25579c86477D3581e1987q1949C830J17777o313K0422
10852A35716a03352I1207b00249L3933o8226N7111A59313f1456D0521L8959f1716
10840A25503D4749i647n6101j86300C9143b43714g8071c085p7385B26240A1610
$$ plain form
10921 -66866 208022 29875 128777 -67419 -187770 -50553 20423 -127125 -335948 263133 -154741
10909 -249516 84919 212935 -78584 41656 32530 -245273 128670 6597 164003 -50029 214420
10897 321341 123817 32914 74668 -167696 -125127 -307195 39383 111854 39121 25532 86738
10886 86738 -138706 -81134 -201835 -223526 -58240 360895 -175442 -112239 -51160 29347 -30988
10874 -71502 -414579 -132102 -231795 -155259 78877 -191251 -83003 52627 -225887 45903 205260
10863 205260 -73208 -79690 325579 -386477 43581 -51987 -133936 3830 121607 115294 135716
10852 135716 -103352 91207 -200249 -166316 -234542 -177431 159313 -61456 40521 79480 -61716
10840 125503 44749 -9647 -65748 -252048 39143 -243714 -78071 -3085 -80470 226240 11610
10828a7273k14780G8149G983b89060a12881j22232A50118b0651A58852b21231
10817a10606e1627j42478A8812r92J23381a73547r094E748a93078A63308a43860
10805i751A02792b08672Q5754m3322G468N6994L2229i7205A7171c10659O0377
10794b50282C31043o9842A14898g018p7831J2831e193j08709A23904A1646a23998
10782c42547c2071B3034b95332c7981C5756N327J7185f3679p2416k4624B43322
10770A23067M3124C241K55118D1248a1291k67741D1704j7309K98516b23630a0080
10758c04445N3146c5952k86588E0825J2697m542J45863A9514b53150L5750j23035
10747c40435E0661R4786a58440A17398A7768G60L24487H6416Q1302g741j65153
$$ plain form
10828 -17273 -232053 78149 7983 -289060 -112881 -235113 150118 -20651 158852 -221231
10817 -110606 -51627 -194105 18812 17820 141201 -173547 -182641 5748 -193078 163308 -143860
10805 -9751 102792 -208672 -122918 -166240 7468 64462 96691 -97205 17171 -310659 -250282
10794 -250282 331043 261201 114898 -7018 -84849 -72018 -5193 -113902 123904 11646 -123998
10782 -342547 -32071 23034 -295332 -37981 35756 41083 58268 -63679 -136095 -160719 243322
10770 123067 166191 3241 258359 41248 -11291 -279032 41704 24395 322911 -223630 -10080
10758 -304445 -251299 -35952 -322540 50825 63522 58980 204843 19514 -253150 -217400 -340435
10747 -340435 50661 145447 -158440 117398 17768 760 325247 86416 167718 -7741 -172894
10736a72894h3309A76568j6047I990a85218I8088a03564A66223a65180D0539c0780
10724d1182I665L1724a11455d099l36798F5506k3982J24059k5617f7627A10470
10712f6732G5438b27291N3635a6610l4791k652k80014C2429K71552j42346c69821
10700b61898F7448d1966l3256k75592G7930K6783a34262B38205e32944a56522
10689h0983E589c2929j86450H6991a20244a12l57577I0296M6121K5012a96086
10677c43285A61637b77722E6944h7083j95472a2778B31730B6715a30119F5539
10666b71132M0487c429o8065F7258a47511A05859J68125c29060H8621i5634k53937
10655c49571g2705N543I810K23044C4506c06497a34461L6363j74392A39722O0181
$$ plain form
10736 -172894 -83309 176568 160521 9990 -185218 98088 -103564 166223 -165180 40539 -30780
10724 -41182 9665 41389 -111455 -4099 -340897 65506 41524 165583 139966 -67627 110470
10712 -66732 75438 -227291 -173656 -16610 -51401 -54053 -334067 32429 303981 161635 -369821
10700 -261898 67448 -41966 -75222 -350814 77930 104713 -134262 238205 -532944 -156522
10689 -80983 5589 -32929 -219379 86991 -120244 -112 -357689 90296 136417 161429 -196086
10677 -343285 161637 -277722 56944 -87083 -282555 -12778 231730 26715 -130119 65539
10666 -271132 -230645 -3429 -71494 67258 -147511 105859 273984 -329060 88621 -95634 -349571
10655 -349571 -72705 -67162 9810 232854 34506 -306497 -134461 -98098 -272490 139722 199903
10644A99903a07681p151k7483A62263b01227b3808m55663J59489H6198b15526
10633B2850J71703C2486J0489J79758D5063b41043F6749n602i6614M2559H8699
10621b80537h1667A09608B2482a06535I5070A0773e8265m8812a162I1675J01139
10610A92814J28879d3361l82423A07244m6503e10703A41351a78178j21109j3088
10600c12375i4566j6423c1159k11563F4833a54984B6536b60226M2823n3083P7208
10589a93278P7907M7345m9185I7268b01294H6550N4328d0639G1946l0905d02463
10577b76884J10071p7926h9320E0463d14109b7937A26596N770d40635E3945g8294
10565A13271R7551E3335b32271I9901P2192a02481p3114O1278a3172m04124a47598
$$ plain form
10644 199903 -107681 -114832 -142315 162263 -201227 -23808 -479471 -319982 86198 -215526
10633 22850 194553 32486 42975 222733 45063 -241043 66749 61147 -96614 -54055 88699
10621 -280537 -81667 109608 22482 -106535 95070 10773 -58265 -107077 -1162 91675 192814
10610 192814 321693 -43361 -425784 107244 60741 -510703 141351 -178178 -299287 -312375
10600 -312375 -94566 -110989 -31159 -242722 64833 -154984 26536 -260226 -217403 -270486 -193278
10589 -193278 -115371 -68026 -117211 97268 -201294 86550 140878 -40639 71946 41041 -402463
10577 -276884 -166813 -244739 -89320 50463 -414109 -27937 126596 132366 -440635 53945 -78294
10565 113271 210822 53335 -232271 99901 172093 -102481 -175595 -114317 -13172 -417296 -147598
10553b38230d3402j30111g513k59561A95574K8423h9653A7431a8063l85739a69210
10541d6817A44827N195a09832C20061C5371a61571e1379I3432O7179m3896C2452
10529b30597G4768N2823a8079j68891h0262I272b8603A40597a26734k6394q5178
10518b38306a05100A62549B0302f271D8316L3529B748a88633A46161f7410q3275
10507a50685L7257n1100g9644j05469E11576b79966R206Q6836e6613J5566I0964
10495H954J30937J52145a16738m6214A0866K49294b15823C86739d6623l8009A66155
10483a54641C924K3293h6892B28975b72559a27443l3326d5249C13531c9319A05477
10471A68107L1017a40677d3510B9882g0479E23029A34951a8345p4936j910A10982
$$ plain form
10553 -238230 -43402 -173513 -7513 -267074 195574 223997 -89653 17431 -18063 -403802 -169210
10541 -46817 144827 150022 -109832 320061 35371 -161571 -51379 93432 160611 116715 32452
10529 -230597 74768 127591 -18079 -186970 -80262 9272 -28603 140597 -126734 -153128 -238306
10518 -238306 -105100 162549 20302 -6271 48316 81845 2748 -188633 146161 -67410 -150685
10507 -150685 -113428 -164528 -79644 -185113 511576 -279966 -270760 -183924 -56613 -41047 90964
10495 8954 139891 292036 -116738 -162952 10866 260160 -215823 386739 -46623 -84632 166155
10483 -154641 3924 27217 -86892 228975 -272559 -127443 -160769 -45249 313531 -39319 105477
10471 168107 199124 -140677 -43510 29882 -70479 523029 134951 -18345 -93281 -95191 110982
10459a00756B778L48416j02940a768A71559J57218f02517I1021d2660C154d0535
10447b21671m5770J27922E3223P3007b1956j22623k4178O9482G0525R3124a62399
10435a3829A13980c828m2475k41112c5857A16936b7749A05023A9218f2677B14632
10423a52880b3384n3926d427n6186Q644j2596l1902k27086E1688A7535R4120K39719
10411C51374A22080a60550g4340j7687j02129o0059Q9173f6324a9249r4577p3018
10400a86844O3223A21644b06463q0603B50997h7757k0183n3247f2682C32332b7316
10388B332R7938K75785b29222E6177K08679A11255b12760g3518o5664B2996L01210
10377C24206q0957K4505m8992a04522F9521J75614J26020q1438M1426R9521j99365
$$ plain form
10459 -100756 2778 351194 248254 -1768 171559 328777 -602517 91021 -42660 3154 -40535
10447 -221671 -267441 -139519 53223 126230 -21956 -144579 -168757 -99275 70525 163649 -162399
10435 -13829 113980 -3828 -46303 -287415 -35857 116936 -27749 105023 19218 -62677 214632
10423 -152880 -23384 -77310 -4427 -60613 -51969 -64565 -96467 -323553 51688 17535 111655 351374
10411 351374 122080 -160550 -74340 -92027 -194156 -254215 -165042 -66324 -19249 -113826 -186844
10400 -186844 -123621 121644 -206463 -287066 250997 -87757 -107940 -161187 -62682 332332 -27316
10388 2332 100270 376055 -229222 56177 264856 111255 -212760 -73518 -139182 22996 324206
10377 324206 243249 267754 218762 -104522 69521 245135 371155 289717 331143 430664 231299
10366B31299J39227E2620K91908R3421A89475J99394J9413C4299d5699j15992
10356a61691A57472E1569a38440J0857C24114r6587J45292n393A16362B869J7806
10345B0675K56402j03084a7658D8280J79140I6523J1645D0923L90967a45954F4752
10333A56199b88291D70789r2800m7097a988A36731J23057g1297I3159R9963m1660
10322A51462J07066B6753K68025o2421b7260B08778D4625c3460G2347J73760e5275
10310A69234l3604a0200j36924E6677h4022H953J25064k4741N8346J20441f5212
10298A65901K69260C6517a1763A8549K0307K57743a57826P7102A7528a07852h596
10286D3673F084K62248b3607k97626J14731R3087I863a92761L6814J2950A2306
$$ plain form
10366 231299 370526 52620 344528 437949 189475 388869 408282 34299 -45699 -161691
10356 -161691 157472 51569 -138440 -127583 324114 227527 372819 367426 116362 2869 20675
10345 20675 277077 173993 -17658 48280 227420 96523 108168 40923 431890 -145954 64752
10333 156199 -288291 470789 377989 330892 -1988 136731 259788 -71297 93159 193122 151462
10322 151462 258528 26753 294778 232357 -27260 208778 44625 -33460 72347 246107 -55275
10310 169234 135630 -10200 -147124 56677 -84022 8953 134017 109276 167622 288063 -65212
10298 165901 435161 36517 -11763 18549 38856 296599 -157826 -80724 17528 -107852 -8596
10286 43673 6084 268332 -23607 -321233 -206502 -113415 9863 -192761 -155947 -142997 12306
10274h4867C65892c7678B29683a55870H5756b0259r505A07315a85016B6302c16023
10262f0232f339E8382K09920a92292I3944a13967H5663P7420G5842a22480B77643
10250a32506D0441K54467b99959A56822a79854A88149B5937J58891h3523A20721
10239c12529J08538H9968a48199j47796a34082A20266K60354j71956a70509j18371
10229b88880a43233J0687c6084M271A05063E2184L538J36983b94635B0848a7330
10217I2150h121j04369l53018E1545a61392l7932A60998J17075q6188k8004b32613
10205a40619F5769a55567r5221B79241a31390C816a94938j68563J52742A15484
10194B47980j15297a47115n2548f7712A73663d99535H3876e9815p0175F0941J25240
$$ plain form
10274 -84867 365892 -37678 229683 -155870 85756 -20259 -29764 107315 -185016 26302 -316023
10262 -60232 -6339 58382 268302 -192292 93944 -113967 85663 163083 75842 -122480 277643
10250 -132506 40441 294908 -299959 156822 -179854 188149 25937 184828 -83523 120721
10239 -312529 -203991 89968 -148199 -295995 -134082 120266 380620 208664 -170509 -288880
10229 -288880 -143233 -132546 -36084 -31813 105063 52184 55722 192705 -294635 20848 -17330
10217 92150 -8121 -112490 -465508 51545 -161392 -199324 160998 278073 191885 163881 -232613
10205 -140619 65769 -155567 -250788 279241 -131390 3816 -194938 -363501 -210759 115484
10194 247980 132683 -147115 -199663 -67712 173663 -499535 83876 -59815 -129990 60941 186181
10183A86181q3035h8544a05A30481e6630a6841k21319C16456a1122E09a00087
10171f7838A06147b75835a3998j13303k36205d7556K2488C1219L64747j94577
10161B01389b49515a0861k25356i8401C3113a72272A2340L9371O478n437h3521
10149A27595B5638b41253O2735h437m4047j27878h7259k69337A6261e3675G7341
10137b96277C90793j37286f9961k99429R9475o2870j76513a36444D5558k2077
10127B3481B205b31051O7238H2761Q1346J18481A25709a35036L6781p6123g4288
10115a65977D7255P2592N4768a44798A30690e2249B17760G3426c12273l5025g6012
10103c42372D4123L7890J64210b06090h9443C79390b82205i0624F5232a81582
$$ plain form
10183 186181 103146 -88544 -105 130481 -56630 -16841 -238160 316456 -11122 509 -100087
10171 -67838 106147 -275835 -13998 -127301 -363506 -47556 -25068 31219 395966 201389
10161 201389 -249515 -10861 -236217 -98401 33113 -172272 12340 51711 58189 52752 -83521
10149 127595 25638 -241253 -178518 -8437 -52484 -180362 -87259 -356596 16261 -53675 77341
10137 -296277 390793 253507 -69961 -369390 -269915 -332785 -509298 -136444 45558 23481
10127 23481 2205 -231051 -163813 82761 164107 282588 125709 -135036 -98255 -174378 -74288
10115 -165977 47255 119847 174615 -144798 130690 -52249 217760 73426 -312273 -347298 -76012
10103 -342372 44123 82013 246223 -206090 -89443 379390 -282205 -90624 65232 -181582
10092a00346J130F2295N5883J71275H5047c39950C5982b98415F7960j4877b31240
10080a70878K3334j93754G9677L6218a77324e3021k41825c515k09773G2165a75997
10068A52595p3372d01123P1149A22850J34566c07372a13051j65761D01617a24212
10057c38199J26628i6418G0356a65666A06051b31065L6174d3102m016k76235a59128
10045A70618d04220B62108b08715Q0985k34381A64158f4268K328A99327b7896
10034i4215j0343j3816B7019L4857J48616D8459a21733H4345B2805a29374C560
10022A12358b48104A17206c05144f2570C0383L56151a67960L4774A1474J28110
10012A39584d32978B8528c30972L0825A81071h8807l06474F1174D70b54021f8876
$$ plain form
10092 -100346 -99216 62295 118178 289453 85047 -339950 35982 -298415 67960 53083 -231240
10080 -170878 -147544 -341298 79677 115895 -177324 -53021 -294846 -3515 -213288 72165 -175997
10068 152595 79223 -401123 -329974 122850 257416 -307372 -113051 -278812 401617 -124212
10057 -338199 -211571 -96418 70356 -165666 106051 -231065 -194891 -43102 -47118 -323353 -159128
10045 170618 -404220 262108 -208715 -127730 -362111 164158 -64268 -61940 199327 -27896
10034 -94215 -104558 -118374 27019 61876 210492 48459 -121733 84345 22805 -129374 3560
10022 112358 -248104 117206 -305144 -62570 30383 386534 -167960 -133186 11474 139584
10012 139584 -432978 28528 -330972 -300147 181071 -88807 -395281 61174 470 -254021 -68876
10000a05821c9737j57069g3914m9717l399p9293E6731b28771l17746D7480f6854
9988I4077b83231L3311M5802m4763D88681a29630A31268D6733J43110D3146b8600
9976b57865A83232b67187a26179q0602D4089a33774c9105G6605i0770q3584A37759
9964a6442A11129E0736J01222i4796j5943l35010B59841I339O9512b35173B5455
9952b30120B12458D282c08233J18756C2750D603L42658c15547a15460H8290b49106
9940A4388e3269J4503m6302G3626a1630A81361I219b20327L3442a922j705l8332
9928d1959C4646f8141A86846e57179F5248R3089c44082E4829h8063p2832P5301
9917h5594B9197b24689g4261L5945a4812A59498g6088C20606a51751C3223P5490
$$ plain form
10000 -105821 -39737 -196806 -73914 -123631 -127030 -206323 56731 -228771 -546517 47480 -66854
9988 94077 -283231 -249920 -204118 -248881 488681 -129630 131268 46733 189843 43146 -28600
9976 -257865 183232 -267187 -126179 -206781 44089 -133774 -39105 76605 -90770 -174354 137759
9964 -16442 111129 50736 151958 -94796 -110739 -445749 259841 9339 78851 -235173 25455
9952 -230120 212458 4282 -308233 -189477 32750 4603 347261 -315547 -115460 88290 -249106
9940 14388 -53269 -38766 -85068 73626 -11630 181361 9219 -220327 -186885 -1922 -3627 -41959
9928 -41959 34646 -68141 186846 -557179 65248 158337 -344082 54829 -88063 -160895 -85594
9917 -85594 29197 -224689 -74261 -38316 -14812 159498 -76088 320606 -151751 33223 108713
9906A08713p150c16615A15205b63485f2497l62501A24368d47224a79147g9045
9895I1438f22378a21076l22031J02936a39562f0186a893A17018N734a81527q8286
9884b69813h3783c3805D7440c03770R9962B00513J55680I0883h2154j43310N3967
9873a71497F0571a83660k3235O2508J6538M7266k61528J32071A18842J07385g5812
9861b8049r1951B0500J99284f8075f808I6843a14682a7555p5242K9403m01926
9850d65320a75537A20393h100A03523b02577B93026c01255A08279k7956a40434
9839B11034a66609B18563k8476c14772Q7642h288j90762n5394B76998a2909k2348
9828c5257j39907A40100F2053a20444j45926H782a66362C3311a83325c0038j06074
$$ plain form
9906 108713 101563 -316615 115205 -263485 -62497 -424998 124368 -447224 -179147 -79045
9895 91438 -622378 -121076 -443107 -340171 -139562 -60186 -1893 117018 122752 -181527 -269813
9884 -269813 -83783 -33805 47440 -303770 -203808 200513 356193 90883 -82154 -225464 -171497
9873 -171497 60571 -183660 -206895 -144387 -127849 -80583 -342111 -210040 118842 226227 -75812
9861 -28049 -120000 20500 219784 -68075 -6808 96843 -114682 -17555 -92797 -63394 -465320
9850 -465320 -175537 120393 -8100 103523 -202577 293026 -301255 108279 80323 -140434
9839 211034 -166609 218563 190087 -314772 -227130 -8288 -199050 -254444 276998 -12909 -35257
9828 -35257 -175164 140100 62053 -120444 -266370 8782 -166362 33311 -183325 -30038 -136112
9817a36112c8881A75576F3205N1488b68841Q8724P8146j20054b2121j7038j74580
9806b13739B631e9946A50806b56569a24196j01862J06347A57555e7595o6615N2051
9795g2159k42679A12741c22464j51117A31335m0581J15405h164j09401j00356
9785b17921B41697b95133N1643k3255D6283A5659h071j61667g8861L1755A9230
9773F3822O7290i3035j06716R036C06319e3731j20534m0022B15915G4193E815
9761a51207k592o4778Q7306j91856a55379G0722f0806A6260d8831o8201A53648
9749e7436A97656A573K3378J60898a86853e1847j11066d0025A03633d65065a15212
9737a74282N5404A52216d6204p9728F6797b29435i4822j49852a066D8768a74836
$$ plain form
9817 -136112 -38881 175576 63205 114693 -268841 -180117 -101971 -222025 -22121 -39159 -213739
9806 -213739 2631 -59946 150806 -256569 -124196 -226058 -119711 157555 -57595 -124210 -72159
9795 -72159 -314838 112741 -322464 -473581 131335 90754 206159 -8164 -117565 -217921
9785 -217921 241697 -295133 -243490 -266745 46283 15659 -8071 -169738 -78861 -47106 19230
9773 63822 131112 -93035 -199751 -190715 306319 -53731 -174265 -214287 215915 74193 5815
9761 -151207 -153799 -218577 -131271 -323127 -155379 70722 -60806 16260 -48831 -117032 153648
9749 -57436 197656 1573 24951 185849 -186853 -51847 -162913 -40025 103633 -465065 -115212
9737 -174282 -118878 152216 -46204 -125932 66797 -229435 -94822 -244674 -1066 48768 -174836
9725a01045q5850j8148i2024F19879c40470A55020c29748O7946a08744l7101n2150
9714a97995m811A1344C167b70082A32124g9067j26841B57803a54465a0615B5416
9702I1608b6957k89897A48526D9580a34727n6995k1855B7637b57655O133I0379
9690b7140G1620h2892E7445g1326A27570n6401a79608A17227b2037q9860j10175
9679b22072a09635A75398a97291I6973C2926a94858N3684k3454L4646B20128a33001
9667a69752g5639B09953a02101c4752l3478A29120a23080L5359j18054d6983j16949
9656a63932H4031c1294D483N16230b51960A98679m093b7152B81935a62613G1235
9644e7551j53662A86351p4485B440N7993A1129a75306P1919J0399j90706P2579
$$ plain form
9725 -101045 -186895 -205043 -92024 619879 -340470 155020 -329748 -261802 -108744 -145845 -197995
9714 -197995 -202806 11344 3167 -270082 132124 -79067 -205908 257803 -154465 -10615 25416
9702 91608 -26957 -316854 148526 49580 -134727 -191722 -213577 27637 -257655 -251522 90379
9690 -27140 71620 -82892 57445 -71326 127570 71169 -179608 117227 -22037 -111897 -222072
9679 -222072 -109635 175398 -197291 96973 32926 -194858 -141174 -164628 -129982 220128 -133001
9667 -169752 -75639 209953 -102101 -34752 -68230 129120 -123080 -87721 -205775 -46983 -163932
9656 -163932 84031 -31294 4483 520713 -251960 198679 194586 -27152 281935 -162613 71235
9644 -57551 -211213 186351 111866 2440 60433 11129 -175306 -103387 -92988 -283694 -211115
9633b11115k12485K02655g8348k77273H1269d7774h46D1027f7446A53347a54308
9621f6419G673a5314A5415L89333B3290b27546R3244b0550m3635B0110a14965
9609h1937A65854L8727a23987b5184k50356B96982e6330j05655J7732k60185J51959
9598b52479a0593D3068h4948H8546b25028j78210a82015P886D7693N1545k3843
9587G5395c73525O1845a1411H5576b76578B9504d14450B09517p5629c45497J42074
9576b03423Q9483M1050k49104J27854j43097a6337H5173f7597q6533o9530A50296
9564B69386D5552a19910D11869A2133g2612h112o8720a7432k67534B68106E7845
9552a97072c5355m5270j03220a6399j9929I1814a21172A12872a40088B36125c61344
$$ plain form
9633 -211115 -423600 -220945 -78348 -355621 81269 -47774 -846 41027 -67446 153347 -154308
9621 -66419 7673 -15314 15415 404748 23290 -227546 -134302 -20550 -64185 20110 -114965
9609 -81937 165854 204581 -123987 -25184 -275540 296982 -56330 -161985 -144253 -404438 -252479
9598 -252479 -10593 43068 -84948 88546 -225028 -403238 -182015 -174129 47693 99238 75395
9587 75395 -373525 -311680 -11411 85576 -276578 29504 -414450 209517 133888 -345497 -203423
9576 -203423 -113940 -72890 -321994 -194140 -337237 -16337 85173 -67597 -154130 -223660 150296
9564 269386 45552 -119910 411869 12133 -72612 -8112 -76832 -17432 -284966 268106 57845
9552 -197072 -35355 -80625 -183845 -16399 -36328 91814 -121172 112872 -140088 236125 -361344
9540d28379a23948B11465a09562j18806F6669L1818b13777L4017j83225a57441
9529e32773b33839P1530c0557j77151A19727f490q1579E1656c7702j56368k49593
9518d43663C4338b44084F319f979E5586a73141O3674A51788b1644d492B2897J24248
9506A47145f9049k85393a02028C3513b41768A93445b1421G0635k495b68391B05140
9494b560j35899l10087D4857h5770A8723a36444A32296k9760N1335p2603b40647
9482a23202I2461O8971b29950F0543c07109O9484C40965D1062J63763b03034j6341
9471b19375h9626A44459b58304A61266R2510P3000d4846l26109o3171a55069A46977
9459d147p3510A15787a16321g815m4840k57188j24623a52640I049c11848g3601
$$ plain form
9540 -428379 -123948 211465 -109562 -228368 66669 98487 -213777 -179760 -362985 -157441
9529 -532773 -233839 -162309 -30557 -207708 119727 -6490 -88069 51656 -37702 -194070 -443663
9518 -443663 34338 -244084 6319 -6979 55586 -173141 -109467 151788 -21644 -4492 22897 147145
9506 147145 -69049 -354442 -102028 33513 -241768 193445 -21421 70635 68140 -268391 205140
9494 -2560 -138459 -448546 44857 -85770 18723 -136444 132296 102536 153871 81268 -240647
9482 -123202 92461 161432 -229950 60543 -307109 -237625 340965 41062 204825 -203034 -219375
9471 -219375 -89626 144459 -258304 161266 253776 326776 -44846 -370955 -434126 -155069 146977
9459 -4147 -77657 115787 -116321 -7815 -52655 -309843 -434466 -152640 9049 -311848 -73601
9447a98913b6574r3050j1181D4164j0758g1281A56220p5352b71156h3964k93868
9436c77832D5357i6894l27864R6361A2146M9374Q5531d832B42208h1572I8697
9424A57080B0578c1008r04p3945k20071a49784c7173j3120E739a04365l6325E4830
9411F1435c9579j61876k57531K14306N275A46181d3988H9668b06762B38123c41494
9399b12122k5063A77285i6699n5946B13940o0752c87270B0791b82581J06855A5243
9387a55063k81327A2002b70896D4733J29555b11995l0117A2228K54496A09020
9376b60103B22267b94002h951E9599d8804B06879a79806G0372K3427i3840G1612
9364E8115c075C7639b94225J25932o1810l33399a82723k32601a13652M1853B30761
$$ plain form
9447 -198913 -26574 -119624 -130805 44164 33406 -71281 156220 80868 -271156 -83964 -377832
9436 -377832 45357 -96894 -424758 -328397 12146 61520 147051 -4832 242208 -81572 98697
9424 157080 20578 -31008 -31912 -105857 -325928 -149784 -37173 -50293 5739 -104365 -140690 54830
9411 61435 -39579 -201455 -458986 -244680 -239405 146181 -43988 89668 -206762 238123 -341494
9399 -212122 -237185 177285 -96699 -152645 213940 153188 -387270 20791 -282581 -175726 15243
9387 -155063 -436390 12002 -270896 44733 174288 -211995 -242112 12228 266724 109020
9376 -260103 222267 -294002 -8951 59599 -48804 206879 -179806 70372 93799 -93840 71612
9364 58115 -3075 37639 -294225 -168293 -230103 -563502 -182723 -415324 -113652 -71799 230761
9352f8868G9357K50328n4002a33446o2370E1621b6043A63384a09986r0485C04503
9340a59217r5199C70226I0366a41071A5150a26904G2376J08083d5638K2712q5353
9329a08279n5273Q0746F484L99743b60015A07287a17213A3175a76592A60871b73390
9317D17406j69676b63605O7147d5927r6786j45107c2751j80366I9405D5298M5754
9306I1052c5137A83659B7113J22828a83956f811l02657D4323c32295J50007B46949
9294a93186j03392C5952O5522m4297L04765b8542F0648i3448n9599F786f9494
9282D5154O5292e5661A39052J59595a57095j77328O2016C9042M8825h9214n8278
9271a47492B154J53035G0797f3799A28957o1372K99095a43854c5146J2166A58649
$$ plain form
9352 -68868 79357 329685 275683 -133446 -195816 51621 -26043 163384 -109986 -200471 304503
9340 -159217 -254416 370226 90366 -141071 15150 -126904 72376 180459 -45638 -22926 -108279
9329 -108279 -163552 -82806 6484 406227 -260015 107287 -117213 13175 -176592 160871 -273390
9317 417406 247730 -263605 -196458 -45927 -142713 -287820 -32751 -213117 99405 45298 91052
9306 91052 -35137 183659 27113 149941 -183956 -6811 -309468 44323 -332295 -182288 246949
9294 -193186 -296578 35952 101474 57177 361942 -28542 60648 -93448 -153047 6786 -69494
9282 45154 110446 -55661 139052 298647 -157095 -334423 -272407 39042 87867 -89214 -147492
9271 -147492 2154 155189 70797 -63799 128957 67585 366680 -143854 -35146 -22980 158649
9259I4418e20151F3214k4563c02417b1675p2356o6733e3088H3187b66651J10002
9248a56649l2445Q6052C3485K19235b82488E2442P0429c50725a48449D5036d85720
9236a9680j65255R1614I0599b89060a34554A72419f17446H9109e41666A52533
9225c7952m41197a33182K7772n1249A15017c45531j04416a71543c2973j54832
9215a87805A78258a55701A92583a80095j15946F8973J17236b72274k8663B85730
9204g2605k85511a0382B4667f8061G5969J8504l9979b33687r8431d9374l7640
9193h7014m1197l6664B09219A5248a16807D2063a42423p2650j5752m630j21205
9182c56660A31703a70273q6390d9325n4044H8810M9631f6021A1262b20167A6495
$$ plain form
9259 94418 -520151 63214 38651 -302417 -21675 -94031 -160764 -53088 83187 -266651 -156649
9248 -156649 -189094 -103042 33485 252720 -282488 52442 122871 -350725 -148449 45036 -485720
9236 -19680 -184935 -93321 90599 -289060 -134554 172419 -617446 89109 -541666 152533
9225 -37952 -479149 -133182 -105410 -156659 115017 -345531 -449947 -171543 -32973 -187805
9215 -187805 178258 -155701 192583 -180095 -296041 68973 186209 -272274 -300937 285730
9204 -72605 -358116 -10382 24667 -68061 75969 94473 54494 -233687 -332118 -49374 -87014
9193 -87014 -128211 -164875 209219 15248 -116807 42063 -142423 -215073 -230825 -235455 -356660
9182 -356660 131703 -170273 -256663 -49325 -103369 88810 138441 -66021 11262 -220167 16495
9170B64441a16004k9065b7674A37405h4493A54633a65470g4189A75599q7061h8437
9158d7042B59792a67896l1002a7877l09162i4548L1298j35124A40785l5586e166
9146A21642d19140J85564E819a16507A13110a98565B7954L37c35559J30699H1216
9134B75263g152j10857d6764A11897d6670A01514a19473E8671J26005b35581F3274
9122e44051K14016E7590i8433k30994A56896a7355M509m8368J1362r8739j34991
9111b83582e5917j54206j01030A23307h0650c4248C542A381c44354B98747b40672
9099i362n40478D6530m093j4777g1351j24687c8001m87758A6709d2412B7999b41214
9086d12113A05370e1479A96928q6251a2040k82604A12979a63176L1067d6834a8144
$$ plain form
9170 264441 -116004 -145069 -27674 137405 -84493 154633 -165470 -74189 175599 88538 -88437
9158 -47042 259792 -167896 -198898 -17877 -327039 -94548 -63250 -198374 140785 105199 -5166
9146 121642 -419140 -233576 5819 -116507 113110 -198565 27954 28291 -335559 -204860 81216
9134 275263 -7152 -118009 -46764 111897 -46670 101514 -119473 58671 184676 -235581 63274
9122 -544051 -330035 57590 -98433 -329427 156896 -17355 -12846 -61214 -49852 -148591 -283582
9111 -283582 -55917 -210123 -311153 123307 -80650 -34248 3542 1381 -344354 298747 -240672
9099 -9362 -549840 46530 42437 27660 -71351 -196038 -38001 -525759 16709 -42412 27999 -241214
9086 -412113 105370 -51479 196928 110677 -12040 -294644 112979 -163176 -132109 -46834 -18144
9074H3456h2490p7903m1058j19449e5666N311F9778b80553I8422A6875a99491
9062f5151B589N3454k3150A4766J4686b21365H1527e5538B55924H8758b7021j59293
9050a86314C730a01837j25084f7760j25538B09526a97717d6842C03162a15099
9039A3963a69453H4148a92663p6784A02376j4037m447B8613b2623n0216j28197
9028b01036E1030b1423m9377k23530A1947J51270C5851b9048B50877h8188E6571
9016C5830a27017A32249e4011r340k5621e167q0543j13332n1932f4153h740A61024
9003A81099c574n55095b36922R5922B20522c76841B6450L4617a08245k6325a9496
8991B76911H923b43366P9473I1863l3928a18115I4563b37051i3841A78985B6724
$$ plain form
9074 83456 -82490 -160393 -201451 -320900 -55666 -50355 69778 -280553 98422 16875 -199491
9062 -65151 2589 56043 32893 14766 29452 -221365 81527 -55538 255924 88758 -27021 -186314
9050 -186314 3730 -101837 -226921 -67760 -193298 209526 -197717 -46842 303162 -115099
9039 13963 -169453 84148 -192663 -269447 102376 88339 83892 28613 -22623 -72839 -201036
9028 -201036 51030 -21423 -70800 -294330 11947 163217 35851 -29048 250877 -88188 56571
9016 35830 -127017 132249 -54011 -63351 -88972 -5167 -85710 -199042 -250974 -64153 -8740 161024
9003 181099 -3574 -558669 -236922 -141000 220522 -376841 26450 61067 -108245 -134570 -19496
8991 276911 8923 -243366 -163893 91863 57935 -118115 94563 -237051 -93841 178985 26724
8979a06485j30399B5975h4416B96331g9692K091j28375d6836B87325g894C50963
8967b39731a0516A16083b99201B953g0267j5900B0975e8042k14000G1539c53856
8955a22075C3168N2968f0241B67168b72734J29605D2456J79166J11307e6309B62641
8943b19436K1333Q3670p768O0713j86910l85702A11790a61237e9977A53556a70734
8931b76462D12507C737N7196j3712L65492e2718E09449M50099K071850L096290
8921F127688M833388B245901G81425B83095e1357A92499k5039H3622b21721k693
8911b24414I8956K41414F7582K56142J67691a92521D1649b2344n8181l81102A48086
8899H3321l7635A2103J0242R394M6373a908j26136k12985P4210R7991e9524C4870
$$ plain form
8979 -106485 -236884 25975 -84416 296331 -79692 -77601 -205976 -46836 287325 -7894 350963
8967 -239731 -10516 116083 -299201 2953 -70267 -86167 20975 -58042 -272042 71539 -353856
8955 -122075 33168 86136 -60241 267168 -272734 -143129 42456 221622 332929 -56309 262641
8943 -219436 -198103 -114433 -122201 -61488 -248398 -634100 111790 -161237 -59977 153556 -170734
8931 -276462 412507 3737 60933 47221 412713 -52718 509449 959548 3031398 6127688
8921 6127688 10961076 2245901 781425 283095 -51357 192499 167460 83622 -221721 -224414
8911 -224414 98956 340370 67582 323724 491415 -192521 41649 -22344 -80525 -461627 148086
8899 83321 45686 12103 22345 31739 78112 -1908 -128044 -341029 -266819 -168828 -59524 34870
8886A6644a1282B1183J04491d7804m6285j08888I1250a23758r2502R7396o1590
8875a80454c7606d617j39046o8728A82866b34337Q7359F1253A7873i8516a7428
8863a8002A90053a8557k06391A62629b1593l3674m0311j18111a1810H6611a40457
8851A02577b07684k10598D63677g8658l22501d0327B84123A30658J02688H758
$$ plain form
8886 16644 -11282 21183 125674 -47804 -94089 -202977 91250 -123758 -216260 -118864 -180454
8875 -180454 -37606 -4617 -143663 -212391 182866 -234337 -146978 61253 17873 -98516 -17428
8863 -18002 190053 -18557 -224948 162629 -21593 -55267 -95578 -213689 -11810 86611 -140457
8851 102577 -207684 -418282 463677 -78658 -401159 -40327 284123 130658 233346 8758
$$ [...]
##END NTUPLES=NMR SPECTRUM
##END=
