
##TITLE=AC1294_INDRS11105_6524845_6EuqhKMaX2
##JCAMPDX= 6.0         $$ Bruker NMR JCAMP-DX V2.0
##DATA TYPE= NMR SPECTRUM
##DATA CLASS= NTUPLES
##ORIGIN= BRUKER
##OWNER= Administrator
$$ 1.72 TOPSPIN		Version 2.1
$$ 2012-07-15 00:16:51.046 -0500  Administrator@TOPSPIN
$$ Compression mode = diff/dup
##.OBSERVE FREQUENCY= 400.02188249412
##.OBSERVE NUCLEUS= ^1H
##.ACQUISITION MODE= SIMULTANEOUS (DQD)
##.ACQUISITION SCHEME= undefined
##.AVERAGES= 64
##.DIGITISER RES= 22
##SPECTROMETER/DATA SYSTEM= spect
##.PULSE SEQUENCE= noesygpps1d.comp
##.SOLVENT NAME= COFFEE_meoh
##.SHIFT REFERENCE= INTERNAL, COFFEE_meoh, 1, 14.9612
##AUDIT TRAIL= $$ (NUMBER, WHEN, WHO, WHERE, PROCESS, VERSION, WHAT)
$$ ##TITLE= Audit trail, TOPSPIN		Version 2.1
$$ ##JCAMPDX= 5.01
$$ ##ORIGIN= Bruker BioSpin GmbH
$$ ##OWNER= Administrator
$$ $$ C:\Bruker\TOPSPIN/data/COFFEE/nmr/AC1294_INDRS11105_6524845_6EuqhKMaX2/12/pdata/1/auditp.txt
$$ ##AUDIT TRAIL=  $$ (NUMBER, WHEN, WHO, WHERE, PROCESS, VERSION, WHAT)
(   1,<2012-07-15 00:16:46.421 -0500>,<Administrator>,<TOPSPIN>,<go>,<TOPSPIN 2.1>,
      <created by zg
	started at 2012-07-15 00:05:16.203 -0500,
	POWCHK enabled, PULCHK disabled,
       configuration hash MD5:
       6B 1B 68 BB D9 2E 58 E2 7F 35 AD 54 07 DF 0E 41
       data hash MD5: 64K
       AC A8 3C 82 8A 0B 61 91 B5 15 C0 C2 6B C2 FB D2>)
(   2,<2012-07-15 00:16:49.187 -0500>,<Administrator>,<TOPSPIN>,<proc1d>,<TOPSPIN 2.1>,
      <Start of raw data processing
       efp LB = 0.3 FT_mod = 6 PKNL = 1 PHC0 = 0 PHC1 = 0 SI = 128K 
       data hash MD5: 128K
       E8 62 A6 07 4E 4A E7 F0 60 5E ED CA 12 5E 01 96>)
(   3,<2012-07-15 00:16:50.312 -0500>,<Administrator>,<TOPSPIN>,<proc1d>,<TOPSPIN 2.1>,
      <pk PHC0 = -0.6262207 PHC1 = 0 
       data hash MD5: 128K
       91 C7 D2 15 9E 90 13 68 06 C8 20 60 F6 A4 5B C2>)
(   4,<2012-07-15 00:16:50.546 -0500>,<Administrator>,<TOPSPIN>,<proc1d>,<TOPSPIN 2.1>,
      <abs ABSG = 1 
       data hash MD5: 128K
       00 4A 1B A0 18 24 20 6B 91 A3 F0 4C 34 B2 47 8D>)
(   5,<2012-07-15 00:16:50.609 -0500>,<Administrator>,<TOPSPIN>,<proc1d>,<TOPSPIN 2.1>,
      <abs ABSG = 2 
       data hash MD5: 128K
       8D 57 D8 96 81 A9 21 BA CA 6A 14 0B 37 5B 7A DB>)
(   6,<2012-07-15 00:16:50.671 -0500>,<Administrator>,<TOPSPIN>,<proc1d>,<TOPSPIN 2.1>,
      <abs ABSG = 3 
       data hash MD5: 128K
       A3 CD 69 5C F3 F0 A1 0F D5 C2 FE BD 47 2F 8E 70>)
(   7,<2012-07-15 00:16:50.906 -0500>,<Administrator>,<TOPSPIN>,<proc1d>,<TOPSPIN 2.1>,
      <abs ABSG = 4 
       data hash MD5: 128K
       BE 0F 31 6A 36 7B CD D9 01 4E 21 26 F7 B6 C2 81>)
(   8,<2012-07-15 00:16:50.968 -0500>,<Administrator>,<TOPSPIN>,<proc1d>,<TOPSPIN 2.1>,
      <abs ABSG = 5 
       data hash MD5: 128K
       D7 96 9E BD 45 83 A7 AE 96 51 EF 91 D0 D9 6C 82>)
$$ ##END=
$$ 
$$ $$ hash MD5
$$ $$ 61 A2 70 6E 4C 49 2C F0 33 CC D6 2F 54 A8 33 88
##$RELAX= 
##$RELAX= 
##$RELAX= 
##$RELAX= 
##$RELAX= 
##$RELAX= 
##$RELAX= 
##$RELAX= 
$$ Bruker specific parameters
$$ [...]
150 150 150 150 150 150 150 150
##$TP07= 0
##$TPNAME0= <>
##$TPNAME1= <>
##$TPNAME2= <>
##$TPNAME3= <>
##$TPNAME4= <>
##$TPNAME5= <>
##$TPNAME6= <>
##$TPNAME7= <>
##$TPOAL= (0..7)
0.5 0.5 0.5 0.5 0.5 0.5 0.5 0.5
##$TPOFFS= (0..7)
0 0 0 0 0 0 0 0
##$TUNHIN= 0
##$TUNHOUT= 0
##$TUNXOUT= 0
##$USERA1= <user>
##$USERA2= <user>
##$USERA3= <user>
##$USERA4= <user>
##$USERA5= <user>
##$V9= 5
##$VALIST= <valist>
##$VCLIST= <CCCCCCCCCCCCCCC>
##$VD= 0
##$VDLIST= <DDDDDDDDDDDDDDD>
##$VPLIST= <PPPPPPPPPPPPPPP>
##$VTLIST= <TTTTTTTTTTTTTTT>
##$WBST= 2048
##$WBSW= 25
##$XGAIN= (0..3)
0 0 0 0
##$XL= 0
##$YL= 0
##$YMAX_a= 9896190
##$YMIN_a= -7126370
##$ZGOPTNS= <>
##$ZL1= 120
##$ZL2= 120
##$ZL3= 120
##$ZL4= 120
##$ABSF1= 14.9612
##$ABSF2= -5.596982
##$ABSG= 5
##$ABSL= 3
##$ALPHA= 0
##$AQORDER= 0
##$ASSFAC= 0
##$ASSFACI= 0
##$ASSFACX= 0
##$ASSWID= 0
##$AUNMP= <proc_prof1d_extract.lims>
##$AXLEFT= 0
##$AXNAME= <>
##$AXNUC= <1H>
##$AXRIGHT= 0
##$AXTYPE= 0
##$AXUNIT= <>
##$AZFE= 0.1
##$AZFW= 0.1
##$BCFW= 0
##$BC_mod= 0
##$BYTORDP= 0
##$COROFFS= 0
##$CY= 15
##$DATMOD= 1
##$DC= 0
##$DFILT= <>
##$DTYPP= 0
##$F1P= 0
##$F2P= 0
##$FCOR= 0.5
##$FTSIZE= 131072
##$FT_mod= 6
##$GAMMA= 0
##$GB= 0
##$INTBC= 1
##$INTSCL= 1
##$ISEN= 128
##$LB= 0.3
##$LEV0= 0
##$LPBIN= 0
##$MAXI= 10000
##$MC2= 0
##$MEAN= 0
##$ME_mod= 0
##$MI= 0
##$NCOEF= 0
##$NC_proc= -2
##$NLEV= 6
##$NOISF1= 0
##$NOISF2= 0
##$NSP= 0
##$NTH_PI= 0
##$NZP= 0
##$OFFSET= 14.9612
##$PC= 1
##$PHC0= -0.6262207
##$PHC1= 0
##$PH_mod= 1
##$PKNL= yes
##$PPARMOD= 0
##$PPDIAG= 0
##$PPIPTYP= 0
##$PPMPNUM= 2147483647
##$PPRESOL= 1
##$PSCAL= 4
##$PSIGN= 0
##$PYNMP= <proc.py>
##$REVERSE= no
##$SF= 400.020009555856
##$SI= 131072
##$SIGF1= 0
##$SIGF2= 0
##$SINO= 400
##$SIOLD= 131072
##$SPECTYP= <>
##$SREGLST= <1H.CDCl3>
##$SSB= 0
##$STSI= 131072
##$STSR= 0
##$SW_p= 8223.68421052631
##$SYMM= 0
##$S_DEV= 0
##$TDeff= 65536
##$TDoff= 0
##$TI= <>
##$TILT= no
##$TM1= 0
##$TM2= 0
##$TOPLEV= 0
##$USERP1= <user>
##$USERP2= <user>
##$USERP3= <user>
##$USERP4= <user>
##$USERP5= <user>
##$WDW= 1
##$XDIM= 131072
##$YMAX_p= 321019080
##$YMIN_p= -14623
##$CURPLOT= <Network HP LaserJet P1505>
##$CURPRIN= <$Network HP LaserJet P1505>
##$DFORMAT= <normdp>
##$LAYOUT= <+/1D_H.xwp>
##$LFORMAT= <normlp>
##$PFORMAT= <normpl>
##$SURQMSG= 1
$$ End of Bruker specific parameters
$$ ---------------------------------
##NTUPLES= NMR SPECTRUM
##VAR_NAME=  FREQUENCY,     SPECTRUM/REAL,   SPECTRUM/IMAG
##SYMBOL=    X,             R,               I
##VAR_TYPE=  INDEPENDENT,   DEPENDENT,       DEPENDENT
##VAR_FORM=  AFFN,          ASDF,            ASDF
##VAR_DIM=   131072,        131072,          131072
##UNITS=     HZ,            ARBITRARY UNITS, ARBITRARY UNITS
##FACTOR=    0.0627417313425164, 1,          1
##FIRST=     8223.62146879497, 1989,         -46073
##LAST=      0,             3399,            -46151
##MIN=       0,             -14623,          0
##MAX=       8223.62146879497, 321019080,    0
$$ Real data points
##PAGE= N=1
##DATA TABLE= (X++(R..R)), XYDATA
$$ [...]
61684E44915j568k667m473n832o218n946n223m089l164l271m202m739m128k739
61670D86656j267j09L31k60j374j955j730j534j925k336k105j624j672k129k059
61655D64908r42P58K144K657K399J982J978K403K826K966K953K951K984L103L372
61640D99442L544L235K501J878J652J587J447J282R79J83r94j834k043k312l274
61625E07273m389m608l816k857k296j917j449j103j168j509j694j470j064j038
61611D76895j738k741l180k829k422k635l187l490l665m146m613m288l247k470
61597D32244k459k653k512k315k398k347j619n50k4l33r50j326j432j522j693
61582D08111j805j711j543j685k308l001l194l030l242m034m538l915k502j423
$$ plain form
61684 544915 543347 540680 536207 530375 524157 518211 512988 508899 505735 502464 498262 493523 489395 486656
61670 486656 485389 485280 485611 485351 483977 482022 480292 478758 476833 474497 472392 470768 469096 466967 464908
61655 464908 463966 464724 466868 469525 471924 473906 475884 478287 481113 484079 487032 489983 492967 496070 499442
61640 499442 502986 506221 508722 510600 512252 513839 515286 516568 517547 517730 516736 514902 512859 510547 507273
61625 507273 502884 498276 494460 491603 489307 487390 485941 484838 483670 482161 480467 478997 477933 476895
61611 476895 475157 472416 469236 466407 463985 461350 458163 454673 451008 446862 442249 437961 434714 432244
61597 432244 429785 427132 424620 422305 419907 417560 415941 415391 415367 415034 414084 412758 411326 409804 408111
61582 408111 406306 404595 403052 401367 399059 396058 392864 389834 386592 382558 378020 374105 371603 370180
61568C70180j238j571j885k025k011j818j534j369j391j421j307j076q34p16q80
61553C49104j293j604j477j032o75n40m74m72p37j139j187o78j5L76N93R10J129
61536C40789Q35J36l05j23K99M62M79Q27J427J521O71n22j097r65r18j390j885
61519C40241j882j659j700j777j363p05n99j136j476j099n34m59o94o24j84J75
61503C24525K11P2j15l57n45m72j02L78P71R57Q57N52K94K06J05j75m73n20l33
61484C25836p4K85P94J119P55k64j198j325p05m0J46L7J82O97J010O09j95n92
61466C27077l37J1jj39j8K77M19L23J3n85j239j270l77P74J276J030M73k45j080
61447C26382j470r12M3L61L4pM90P82O73J056K277L176K711J600J252J677J755
$$ plain form
61568 370180 368942 367371 365486 363461 361450 359632 358098 356729 355338 353917 352610 351534 350700 349984 349104
61553 349104 347811 346207 344730 343698 343023 342483 342009 341537 340800 339661 338474 337796 337781 338157 338750 339660 340789
61536 340789 341624 341760 341455 341332 341631 342093 342572 343399 344826 346347 347018 346496 345399 344434 343516 342126 340241
61519 340241 338359 336700 335000 333223 331860 331155 330556 329420 327944 326845 326311 325852 325158 324534 324350 324525
61503 324525 324736 324808 324693 324336 323791 323319 323217 323595 324366 325323 326180 326732 327026 327232 327337 327162 326689 326169 325836
61484 325836 325762 326047 326841 327960 328715 328451 327253 325928 325223 325183 325329 325366 325548 326245 327255 327864 327669 327077
61466 327077 326740 326751 326750 326611 326593 326870 327289 327612 327625 327040 325801 324531 324154 324928 326204 327234 327707 327462 326382
61447 326382 324912 324000 324043 324404 324438 324431 324921 325703 326376 327432 329709 332885 335596 337196 338448 340125 341880
61430C41880J212J014J686K393K093Q67l14o50l5J078J969K092J568J094J221
61415C59168J880K628L079L004K336J323M93J34q4o74j545j910j233j08J86r50
61399C67727k758m015m313m115l744k959j633l49J62j11m65l25K31O75O23J96
61383C44827o3K37Q46J145R42O87P38Q41O24L10M72J194J923K115J738J092M97
61366C60165J77J75K66J17l11o44m14N10J754K672K814K275J597J310J586K286
61350C76335L103L693M001M447N540P161Q481Q866Q541Q218Q302Q668Q975Q916
61336D73247Q359P470O532N574M397L045J857Q65l18j780l009l705m272m965n150
61321D88147m225k760j852j558j047j62K34l09j052j129o12J6Q02K085L696M978
$$ plain form
61430 341880 343092 344106 345792 348185 350278 351145 350831 350181 350146 351224 353193 355285 356853 357947 359168
61415 359168 361048 363676 366755 369759 372095 373418 373911 374045 373961 373287 371742 369832 368599 368491 368677 367727
61399 367727 364969 360954 356641 352526 348782 345823 344190 343841 344003 343892 343427 343102 343333 344008 344631 344827
61383 344827 344764 345001 345847 346992 347934 348621 349359 350200 350824 351134 351606 352800 354723 356838 358576 359668 360165
61366 360165 360342 360517 360783 360900 360589 359945 359531 360041 361795 364467 367281 369556 371153 372463 374049 376335
61350 376335 379438 383131 387132 391579 397119 404280 412761 421627 430168 438386 446688 455356 464331 473247
61336 473247 481606 489076 495608 501182 505579 508624 510481 511346 511028 509248 506239 502534 498262 493297 488147
61321 488147 483922 481162 479310 477752 476705 476543 476777 476468 475416 474287 473675 473691 474493 476578 480274 485252
61305D85252N512N459N261N235N341N308N030M830N045N490N659N416M990M351
61291E58179L208J746O56P5q61k929n646p720q404q023p327o799o447n953n016
61276D98739l725k509j607q36M1R44J752K610L677M771N604O203O789P386P784
61261E37623P950Q134Q556R128R536R572R356R179R087Q800Q190P669P753Q321
61247F58854Q689Q413P566O234M286J760r71l622o052p831q410q021p684p823
61233F45388p540n995l901k714k608k306r66P39J717J876K021K733L845M764M936
61218F41989M220L025K146K162K948L735L785L051K172J673J237J31j591k819
61204F67864k623j431m16m5J93P12J226J407J545K162L309M560N537O228O886
$$ plain form
61305 485252 490764 496223 501484 506719 512060 517368 522398 527228 532273 537763 543422 548838 553828 558179
61291 558179 561387 563133 563789 563864 563003 560074 554428 546708 538304 530281 522954 516155 509708 503755 498739
61276 498739 495014 492505 490898 490062 490103 491047 492799 495409 499086 503857 509461 515664 522453 529839 537623
61261 537623 545573 553707 562263 571391 580927 590499 599855 609034 618121 626921 635111 642780 650533 658854
61247 658854 667543 675956 683522 689756 694042 695802 694831 691209 685157 677326 668916 660895 653211 645388
61233 645388 637848 631853 627952 625238 622630 620324 619358 620097 621814 623690 625711 628444 632289 637053 641989
61218 641989 646209 649234 651380 653542 656490 660225 664010 667061 669233 670906 672143 672274 670683 667864
61204 667864 665241 663810 663394 663349 663542 664254 665480 666887 668432 670594 673903 678463 684000 690228 697114
61189F97114P781Q965J0240J1419J2645J4164J5742J6638J6346J5145J3748J2487
61177H52434J1111R283P009M669K725J454O86j15j351k749l578l618l693m877
61163H69390p183r419j0608j1091j1853j2999j3565j2856j1448j0509j0496j0869
61151G36494j0842j0121r006q026p427o861n721l888j976o61N6P03J625K633L281
61136F80263L227K490J426M31n08j722l230m511n131n238n071m355k718m85J579
61121F56447L301N236P620R828J1234J2119J3299J5053J6838J8005J8537J9042
61109H06559K0105K1673K3001K3335K2676K1740K1090K0511J9362J7440J5193
61098A032685J3184J1558J0079Q470O570M308J727j025l845o801r920j2959j5638
$$ plain form
61189 697114 704895 713860 724100 735519 748164 762328 778070 794708 811054 826199 839947 852434
61177 852434 863545 872828 879837 884506 887231 888685 889371 889256 887905 885156 881578 877960 874267 869390
61163 869390 862207 852788 842180 831089 819236 806237 792672 779816 768368 757859 747363 736494
61151 736494 725652 715531 706525 698499 691072 684211 678490 674602 672626 671965 672021 672724 674349 676982 680263
61136 680263 683490 685980 687406 687837 687329 685607 682377 677866 672735 667497 662426 658071 655353 654868 656447
61121 656447 659748 664984 672604 682432 693666 705785 719084 734137 750975 768980 787517 806559
61109 806559 826664 848337 871338 894673 917349 939089 960179 980690 1000052 1017492 1032685
61098 1032685 1045869 1057427 1067506 1075976 1082546 1086854 1088581 1087556 1083711 1076910 1066990 1054031 1038393
61085A038393j8046k0403k2413k3400k3362k3335k4089k4872k4190k1707j8608
61074G93968j6052j4131j2486j1136j0172r271q078o694n375m091k751j505m93
61061F91733M06J211J660J748J966K644L484M156M871N818O573O712O658P180
61047G46820Q411R961J1718J3656J5175J5571J5211J5401J6923J9275K1452K2917
61035I32491K3728K4264K5009K6178K7459K8434K9173L0084L1243L2432L3658
61024A244153L5181L6982L8740M0233M1504M2794M4597M7506N1473N5692N9629
61013A738484O3828O9020P4966Q0923Q6924R3763J02194J13110J28148J49082
61003B700442J76755K11333K52952L01067L53935M10192M71007N40037O22612
$$ plain form
61085 1038393 1020347 999944 977531 954131 930769 907434 883345 858473 834283 812576 793968
61074 793968 777916 763785 751299 740163 729991 720720 712642 705948 700573 696482 693731 692226 691733
61061 691733 692139 693350 695010 696758 698724 701368 704852 709008 713879 719697 726270 732982 739640 746820
61047 746820 755231 765192 776910 790566 805741 821312 836523 851924 868847 888122 909574 932491
61035 932491 956219 980483 1005492 1031670 1059129 1087563 1116736 1146820 1178063 1210495 1244153
61024 1244153 1279334 1316316 1355056 1395289 1436793 1479587 1524184 1571690 1623163 1678855 1738484
61013 1738484 1802312 1871332 1946298 2027221 2114145 2207908 2310102 2423212 2551360 2700442
61003 2700442 2877197 3088530 3341482 3642549 3996484 4406676 4877683 5417720 6040332
60994F040332P25830Q56623J016147J197582J393123J600256J813050K007037
60986A6649980K144584K205677K210923K206743K227827K274327K311199K269021
60978C4500281K049107J566667Q31329p341p20648j136034j228498j096482q76864
60969C3881517o98406o86907r48292j495169k190424k798166l121377l107282
60961A8835494k838371k445098k031336j654914j339675j087922q89209p30607
60953E818362o03553n02596m22009l56613l03935k62875k31276k06235j85696
60944B743574j68355j52978j38967j26650j16064j06311r6800q8130q0914p4844
60934A593561o9713o6281o5024o4912o4349o2611n9683n5554n0618m5902m1952
$$ plain form
60994 6040332 6766162 7622785 8638932 9836514 11229637 12829893 14642943 16649980
60986 16649980 18794564 21000241 23211164 25417907 27645734 29920061 32231260 34500281
60978 34500281 36549388 38116055 38947384 38940043 38219395 37083361 35854863 34758381 33881517
60969 33881517 33183111 32496204 31547912 30052743 27862319 25064153 21942776 18835494
60961 18835494 15997123 13552025 11520689 9865775 8526100 7438178 6548969 5818362
60953 5818362 5214809 4712213 4290204 3933591 3629656 3366781 3135505 2929270 2743574
60944 2743574 2575219 2422241 2283274 2156624 2040560 1934249 1837449 1749319 1668405 1593561
60934 1593561 1523848 1457567 1392543 1327631 1263282 1200671 1140988 1085434 1034816 988914 946962
60923I46962l8139l3969l0235k7846k6269k4319k1922j9886j8299j6443j4149
60912F75486j2125j0850j0046r317q513p406n725l741k220j606j534j320o89q
60898F00386Q4n70j262j116k66J70n17j808k833l396l728l807l619l530l844m366
60882E65978m860n439o056o248o020o184p089p780p447o894p337q297q218o898
60868D71211n698n370n202m615m119m119m066l470k759k450k270j801j205o55
60854D23412K05J509K554K731K564K997M069N042N532N746N802N584N212N014
60840D77973M970M711M129L622L603L970M064L131J060j261k597k651k291k349
60826E00084k627k552k236k217k506k602k257j615q02j00k75j854m053n397n569
$$ plain form
60923 946962 908823 874854 844619 816773 790504 766185 744263 724377 706078 689635 675486
60912 675486 663361 652511 642465 633148 624635 617229 611504 607763 605543 603937 602403 601083 600394 600386
60898 600386 600470 599900 598638 597522 597256 597426 596909 595101 592268 588872 585144 581337 577718 574188 570344 565978
60882 565978 561118 555679 549623 543375 537355 531171 524082 516302 508855 501961 494624 486327 478109 471211
60868 471211 465513 460143 454941 450326 446207 442088 438022 434552 431793 429343 427073 425272 424067 423412
60854 423412 423617 425126 427680 430411 432975 435972 440041 445083 450615 456361 462163 467747 472959 477973
60840 477973 482943 487654 491783 495405 499008 502978 507042 510173 511233 509972 507375 504724 502433 500084
60826 500084 497457 494905 492669 490452 487946 485344 483087 481472 480670 480570 480295 478441 474388 468991 463422
60811D63422n680o456p165o973o373o355o751o565n656n039n351n979n949n115
60797C78015l996l016k222j525q80l29n9k82r44j730k316k468j953q10L67Q71
60781C56723P16N85Q01J010J080J589K868M162M506M094M000M671N488N799N612
60766D03704N272N089N415O386P401P523O700N951O006O329N943M760L509K746
60752D82734K444K401K463K437K169J675R78Qj083j751j620j129j179k148l536
60737D84863m541m791m572m536n176o349p369p686p347o717n980n154m358l804
60723D06483l582l632l735l482k523j160k39j59k99J38J000J510J480J528K170
60708C95498L258M406N418O196O634O854P174P707Q246Q612Q849Q987Q902Q442
$$ plain form
60811 463422 457742 451286 444121 437148 430775 424420 417669 411104 405448 400409 395058 389079 383130 378015
60797 378015 374019 371003 368781 367256 366376 366047 365988 365706 364762 363032 360716 358248 356295 355485 355852 356723
60781 356723 357439 358024 358825 359835 360915 362504 365372 369534 374040 378134 382134 386805 392293 398092 403704
60766 403704 408976 414065 419480 425866 433267 440790 447490 453441 459447 465776 471719 476479 479988 482734
60752 482734 485178 487579 490042 492479 494648 496323 497301 497309 496226 494475 492855 491726 490547 488399 484863
60737 484863 480322 475531 470959 466423 461247 454898 447529 439843 432496 425779 419799 414645 410287 406483
60723 406483 402901 399269 395534 392052 389529 388369 388130 387971 387672 387810 388810 390320 391800 393328 395498
60708 395498 398756 403162 408580 414776 421410 428264 435438 443145 451391 460003 468852 477839 486741 495183
60694D95183P523O198M872M297M867N982O600O463O270O641P414Q171Q869R711
60680E89061J0720J1831J3070J4450J5910J7497J9243K0718K1239K0760K0143
60669G74642K0078K0114J9280J7393J5084J2673R679N731J374k518n864r388j3465
60656H64813j7429k0372k2212k3481k4241k3946k2510k0721j9208j7650j5688
60645F37355j3976j3337j3261j2395j0477q715p958p605o789n683n002m870m920
60632E22367m952m881m391l335k101j097k24O92J360J473J294J187R58L17l66
60617E08301n18k68j89l78n85j056k268l891m900m893m449m082l652l091k863
60602D71218l248l795l927l635l224k871k753l078l590l622l004k439k429k387
$$ plain form
60694 495183 502706 508904 513776 518073 522940 528922 535522 541985 548255 554896 562310 570481 579350 589061
60680 589061 599781 611612 624682 639132 655042 672539 691782 712500 733739 754499 774642
60669 774642 794720 814834 834114 851507 866591 879264 888943 894674 896048 893530 887666 878278 864813
60656 864813 847384 827012 804800 781319 757078 733132 710622 689901 670693 653043 637355
60645 637355 623379 610042 596781 584386 573909 565194 557236 549631 542842 537159 532157 527287 522367
60632 522367 517415 512534 508143 504808 502707 501610 501386 502078 503438 504911 506205 507392 508350 508667 508301
60617 508301 507783 507515 507326 506948 506363 505307 503039 499148 494248 489355 484906 480824 477172 474081 471218
60602 471218 467970 464175 460248 456613 453389 450518 447765 444687 441097 437475 434471 432032 429603 427216
60588D27216j533k61K31m52j396j575r24p8M08L92J12J53J086K848M600N491N499
60571D41817N344N689O559P598Q710J0184J2122J3936J4812J4703J4527J5113
60559E71114J6242J7025J7005J6381J5285J3408J0582P239L985R16k211n337p915
60546F73719r342r294p743m986j680J507M413P392J0737J4256J7575K0469K2815
60533G39838K4377K4970K4679K3628K1666J8537J4386R775N149N02m368r364j3870
60520H79905j6937j7793j6485j3970j1338r068p140n699m945m541l730k287q02
60507G65170K71J302K897N143P830J1007J4723J8633K2422K6415L1162L6648M2370
60494I85993M8060N3668N8916O3561O7936P2423P6360P8260P7307P3868O8389
$$ plain form
60588 427216 425683 425422 425653 425201 423805 422230 421306 421228 421636 422028 422140 422293 423379 426227 430827 436318 441817
60571 441817 447161 452850 459409 467007 475717 485901 498023 511959 526771 541474 556001 571114
60559 571114 587356 604381 621386 637767 653052 666460 677042 684281 688266 689182 686971 681634 673719
60546 673719 664377 655083 647340 642354 640674 642181 646594 653986 664723 678979 696554 717023 739838
60533 739838 764215 789185 813864 837492 859158 877695 892081 901856 907005 907507 903139 893775 879905
60520 879905 862968 845175 828690 814720 803382 794314 787174 781475 776530 771989 768259 765972 765170
60507 765170 765441 766743 769640 774783 782613 793620 808343 826976 849398 875813 906975 943623 985993
60494 985993 1034053 1087721 1146637 1210198 1278134 1350557 1426917 1505177 1582484 1656352 1724741
60483A724741O0633N0385L8110K4304Q857q248k6082m3321n9270p3634q5484r3417
60471A517574r6883r6727r4145q9555q2802p4171o4810n6100m8727m2468l6861
60460G34325l1908k7965k5019k2504j9870j7131j4661j2788j1634j1046j0438
60449E29361r180p374n938n531n717n570m772l722k823k208j948j983j979j724
60435D68892j565j934k533k555j756p28j54k22q38j800k633k845k567k472k845
60420D41445l174k924k283j835j814j988j971j456m01P77J499J654J644J622J231
60405D32026L60l64l13K81P47R71J353J973K358K150J509Q12K81n2k72m98o67
60388D42655m90J24Q33J312J699K178K396J839O95k74o84p14l88N50J842K633
$$ plain form
60483 1724741 1785374 1835759 1873869 1898173 1907030 1898782 1872700 1829379 1770109 1696475 1610991 1517574
60471 1517574 1420691 1323964 1229819 1140264 1057462 983291 918481 862381 813654 771186 734325
60460 734325 702417 674452 649433 626929 607059 589928 575267 562479 550845 539799 529361
60449 529361 520181 512807 506869 501338 495621 490051 485279 481557 478734 476526 474578 472595 470616 468892
60435 468892 467327 465393 462860 460305 458549 457821 457667 457445 456607 454807 452174 449329 446762 444290 441445
60420 441445 438271 435347 433064 431229 429415 427427 425456 424000 423599 424376 425875 427529 429173 430795 432026
60405 432026 432386 432022 431709 431990 432737 433708 435061 437034 439392 441542 443051 443863 444144 444092 443820 443322 442655
60388 442655 442165 442289 443122 444434 446133 448311 450707 452546 453241 452967 452283 451569 451181 451731 453573 456206
60372D56206K510K050J838J644J132P97J343K449L025K630J831J200P16L31L79
60357D80081J005J724J973J769J448J088O30K64J93J51l36j214j837j700r37M5
60341D84347J042J987K667K835K576K309K300K382K192J668J184J144J458J568
60327E11659J007j16j219j742j437l66J108K274K394J389J11l45L84J758L077
60312E19936M106M978N813O697P778R085J0338J1294J2156J3306J4637J5535J5702
60299F51361J5573J5606J5547J4877J3753J2871J2262J0772P198J669m425r804
60287G57260j4242j8169k1623k3938k4393k3005k0504j7614j4517j1149p835n308
60275E54963m083l966m310m571m567m383m154l923l588l062k516k313k575k938
$$ plain form
60372 456206 458716 460766 462604 464248 465380 466177 467520 469969 472994 475624 477455 478655 479371 479702 480081
60357 480081 481086 482810 484783 486552 488000 489088 489718 489982 490175 490326 489990 488776 486939 485239 484302 484347
60341 484347 485389 487376 490043 492878 495454 497763 500063 502445 504637 506305 507489 508633 510091 511659
60327 511659 512666 512550 511331 509589 508152 507786 508894 511168 513562 514951 515062 514717 515101 516859 519936
60312 519936 524042 529020 534833 541530 549308 558393 568731 580025 592181 605487 620124 635659 651361
60299 651361 666934 682540 698087 712964 726717 739588 751850 762622 769820 771489 767064 757260
60287 757260 743018 724849 703226 679288 654895 631890 611386 593772 579255 568106 560271 554963
60275 554963 550880 546914 542604 538033 533466 529083 524929 521006 517418 514356 511840 509527 506952 504014
60261E04014k840k106j174p63j214k026k238j448l80o8n58r12o01k08m08q26n47
60244D85697N25J570J958J784J310N36m10j026r51m47r5j85n59p92m76M67J578
60227D90484K160J986J546J567K307L385M080L914L117K469K423K601K416J974
60213E26429J825K033K206K330K795L467L654L255L057L425L625L096K505K717
60199E66419L340L416L023L031L488L434K408J134M25K52J77M3j22l19n00o61
60183E88988j148k279l635m316m045l394k902k605k591l127l882l870k758j499
60169E46937j056j106p52NM20K61J01L25O28O00K56j32k99k6P57J787K675L230
60151E54611L416L093K217J215P73J149J897K351K218J777J630K182L186L948
$$ plain form
60261 504014 501174 499068 497894 497131 495917 493891 491653 490205 489825 489757 489199 488287 487686 487478 487070 486244 485697
60244 485697 486222 487792 489750 491534 492844 493380 492970 491944 490993 490546 490451 490266 489707 488915 488439 488906 490484
60227 490484 492644 494630 496176 497743 500050 503435 507515 511429 514546 517015 519438 522039 524455 526429
60213 526429 528254 530287 532493 534823 537618 541085 544739 547994 551051 554476 558101 561197 563702 566419
60199 566419 569759 573175 576198 579229 582717 586151 588559 589693 590118 590370 590547 590590 590468 590149 589649 588988
60183 588988 587840 585561 581926 577610 573565 570171 567269 564664 562073 558946 555064 551194 548436 546937
60169 546937 545881 544775 544023 544028 544448 544709 544810 545135 545763 546363 546619 546487 546188 546162 546919 548706 551381 554611
60151 554611 558027 561120 563337 564552 565325 566474 568371 570722 572940 574717 576347 578529 581715 585663
60137E85663M143M174M506M897M736M025L496L707M393M839M621L822K696J410
60123F41128N6j107j695j596j252j174j292j123o16k49j10L89J558K820L631M327
60107F43695N303O010N727M959M797N084M552K892J373R26Q21K6j128j634j531
60092F81872j786k781l865m387m417m365m388m355l990l073j754n77Q0M73J034
60077F43721J625J677J025N5q62j686k364k761l085l901n360o688o931o092n197
60062F03176n108n643n958n552m641l683k965k688l029l812m428m482m270m265
60048E42652m292l800k872k244k228k180j426j38J007J643J821J664J431J572
60034E32610K259L083L515L476L144K545J711R31L84j51q31j332j453j657k341
$$ plain form
60137 585663 589806 593980 598486 603383 608119 612144 615640 619347 623740 628579 633200 637022 639718 641128
60123 641128 641184 640077 638382 636786 635534 634360 633068 631945 631329 631080 630970 631359 632917 635737 639368 643695
60107 643695 648998 655008 660735 665694 670491 675575 680127 683019 684392 685318 686139 686165 685037 683403 681872
60092 681872 680086 677305 673440 669053 664636 660271 655883 651528 647538 644465 642711 642134 642214 642687 643721
60077 643721 645346 647023 648048 648103 647241 645555 643191 640430 637345 633444 628084 621396 614465 608373 603176
60062 603176 598068 592425 586467 580915 576274 572591 569626 566938 563909 560097 555669 551187 546917 542652
60048 542652 538360 534560 531688 529444 527216 525036 523610 523472 524479 526122 527943 529607 531038 532610
60034 532610 534869 537952 541467 544943 548087 550632 552343 553274 553658 553507 552676 551344 549891 548234 545893
60019E45893k991k957k752l530n236o437o232n257m400l516k128n78L07K45m58
60004D99973j445k221k042o80R60J711J488J085R21P53N04N37R55J362J578J953
59988E07392K701L413L563L151K560K114J975K139K294K032J472J273J738K271
59974E40088K059J066j33j179k085k687k563j671o18n8r1l68n78n98l74J35Q76
59957E31221J647K112J997J421J004J314K131K570K122J286R00J017R00Jj357
59942E50286k427k840k810k709k610k308j735j286j553k512l303l123k227j603
59928E17240j647j705j117j22O23J018J466K053K456K557K635K862K987K779K380
59913E36465K088J990K006K074K177K323K509K600K298J563R15Q52J034N97n44
$$ plain form
60019 545893 542902 539945 537193 533663 528427 521990 515758 510501 506101 502585 500457 499879 500186 500431 499973
60004 499973 498528 496307 494265 493585 494545 496256 497744 498829 499750 500503 501007 501544 502499 503861 505439 507392
59988 507392 510093 513506 517069 520220 522780 524894 526869 529008 531302 533334 534806 536079 537817 540088
59974 540088 542147 543213 543080 541901 539816 537129 534566 532895 532277 532219 532128 531760 531182 530584 530210 530345 531221
59957 531221 532868 534980 536977 538398 539402 540716 542847 545417 547539 548825 549725 550742 551642 551643 550286
59942 550286 547859 545019 542209 539500 536890 534582 532847 531561 530008 527496 524193 521070 518843 517240
59928 517240 515593 513888 512771 512649 513272 514290 515756 517809 520265 522822 525457 528319 531306 534085 536465
59913 536465 538553 540543 542549 544623 546800 549123 551632 554232 556530 558093 559008 559860 560894 561491 560947
59898E60947j377j130l14J17J22L30P83Q75N81Q37K278M199N295N136M498M365
59882E87542M951N701O036N953N796N575M842L474K154J582J524J286R47J151
59868F38514J711J391l62k401l317l180l072l457l966m407m928n281m972m139
59854E98134l456l057k415j472r39j192j658j714j434r79q0J344K683L436M055
59839E91256N247O900Q317R216R775J0027R868R488R221R092Q926Q515P266M343
59825G07457j1l899n571n431n172n362n351n405p022j0628j4460j6683j7332j7269
59811E87861j6402j4194j1136q418o552n345m787m874m893m130l099k882l405
59798D97744l498k807k334k737l182k651j479q05r33j126q43m95p93j748k560
$$ plain form
59898 560947 559570 558440 558126 558243 558365 558695 559478 560353 560934 561771 564049 568248 573543 578679 583177 587542
59882 587542 592493 598194 604230 610183 615979 621554 626396 629870 632024 633606 635130 636416 637363 638514
59868 638514 640225 641616 641254 638853 635536 632356 629284 625827 621861 617454 612526 607245 602273 598134
59854 598134 594678 591621 589206 587734 586795 585603 583945 582231 580797 579818 579738 581082 583765 587201 591256
59839 591256 596503 603403 611720 620936 630711 640738 650606 660094 669315 678407 687333 695848 703114 707457
59825 707457 707446 703547 697976 692545 687373 682011 676660 671255 664233 653605 639145 622462 605130 587861
59811 587861 571459 557265 546129 537711 531159 525814 521027 516153 511260 507130 504031 501149 497744
59798 497744 494246 491439 489105 486368 483186 480535 479056 478251 477318 476192 475349 474854 474061 472313 469753
59783D69753k491j713j090j098j331j246r47q50r47j037j290j774j800p46N43
59768D51936M41j049j905o78J519K561K011J220J303K124L028L541L405K805K578
59753D74840L397M695N165M442L511L284L564L766L868M094M201L815L147K759
59739E28548K661K257J177k03j205j497j210p38n08p58j317j733j769j631j585
59724E20489j467r39j53K19k47j197k017k502k711k430j396J2R15R91Q64J176
59708E09607J739J932J577R87M86K86O29J557K670L511M032M335M275L839L702
59693E45164M568N991O671O094N247N241N896O092N107L067N66j661k894k934
59679E92215k364j885j549j039n13n52j249k001k319k333k319k207j886j572j532
$$ plain form
59783 469753 467262 465549 464459 463361 462030 460784 459837 458987 458040 457003 455713 453939 452139 451393 451936
59768 451936 452377 451328 449423 448745 450264 452825 454836 456056 457359 459483 462511 466052 469457 472262 474840
59753 474840 478237 482932 488097 492539 496050 499334 502898 506664 510532 514626 518827 522642 525789 528548
59739 528548 531209 533466 534643 534440 533235 531738 530528 529790 529282 528524 527207 525474 523705 522074 520489
59724 520489 519022 518083 517930 518149 517902 516705 514688 512186 509475 507045 505649 505661 506576 507567 508431 509607
59708 509607 511346 513278 514855 515842 516328 516614 517243 518800 521470 524981 529013 533348 537623 541462 545164
59693 545164 549732 555723 562394 568488 573735 578976 584872 590964 596071 599138 599704 598043 595149 592215
59679 592215 589851 587966 586417 585378 584865 584313 583064 581063 578744 576411 574092 571885 569999 568427 566895
59664E66895j691j860k081k424k613k231j195J85J495K351K522K312K549L642
59650E67856M780M713L338J847J183J068Q36M81K66j12j133k522l491l826m045
59635E71239m511n029n396n690n814n475m774m256m011l376j966n07Ml96p42m30
59619E18870K02M82J07p00j397j420p36m7j52j005j785j910j654j664k145k688
59603E02358k730j985o26Q05J669J542M37j119k308k539j945j194o70j64N32J068
59587D93131J027O13L36J50m19j299j749j453j128j605k696l508l611l416l408
59572D70965l532l451l087k652k244j707r07m9M86O01O23Q26R31M07p25j670j638
59555D53177o95L57Q67Q72P75P79Q46J044J599K511L364L809M047M535N262N792
$$ plain form
59664 566895 565204 563344 561263 558839 556226 553995 552800 552985 554480 556831 559353 561665 564214 567856
59650 567856 572636 577349 580687 582534 583717 584785 585621 586102 586368 586256 585123 582601 579110 575284 571239
59635 571239 566728 561699 556303 550613 544799 539324 534550 530294 526283 522907 520941 520434 520438 520042 519300 518870
59619 518870 519072 519554 519661 518961 517564 516144 515408 515361 515209 514204 512419 510509 508855 507191 505046 502358
59603 502358 499628 497643 497017 497822 499491 501033 501470 500351 498043 495504 493559 492365 491695 491531 492063 493131
59587 493131 494158 494771 495107 495257 494838 493539 491790 490337 489209 487604 484908 481400 477789 474373 470965
59572 470965 467433 463982 460895 458243 455999 454292 453385 453336 453822 454423 455046 455872 456803 457210 456485 454815 453177
59555 453177 452482 452839 453706 454578 455353 456132 456978 458022 459621 462132 465496 469305 473352 477887 483149 488941
59539D88941O039O526P614Q859R531R486R164Q985R142R778J0745J1137R706N995
59525F11648R45l717o565p209o308m965l793k569q65J185L032M293M770M224K717
59510E96823J009j82j202k980n449p372p898p487o925o338n692n424n814o280
59496E28789o128n484m824m041k827j588r94q20j66J113K177K521K628L001L319
59481E16676L118K690K753L481M423N148N593N806N794N710N907O551P202O994
59467E87846N456L168J333O06N40L18k87q80j029n04Q07K732M662O066P111Q387
59451F26332J0089J1880J3449J4646J5136J4553J3137J1724J0857J0343R719Q651
59439G70516O684L290j427o469j0818j4260j6945j8586j8665j7252j5182j3291
$$ plain form
59539 488941 494980 501506 509120 517979 527510 536996 546160 555145 564287 574065 584810 595947 605653 611648
59525 611648 612593 608876 602311 595102 588794 583829 580036 577467 576602 577787 580819 585112 589882 594106 596823
59510 596823 597832 597650 596448 593468 588019 580647 572749 565262 558337 551999 546307 540883 535069 528789
59496 528789 522661 517177 512353 508312 505485 503897 502903 502083 501917 503030 505207 507728 510356 513357 516676
59481 516676 519794 522484 525237 528718 533141 538289 543882 549688 555482 561192 567099 573650 580852 587846
59467 587846 593302 596470 597803 598409 598949 599267 598980 598100 597071 596567 597374 600106 604768 610834 617945 626332
59451 626332 636421 648301 661750 676396 691532 706085 719222 730946 741803 752146 761865 770516
59439 770516 777200 780490 779063 772594 761776 747516 730571 711985 693320 676068 660886 647595
59427F47595j1833j0577r200p598n983m674l679k561q05J711M713P801J0737J3555
59413F29202J6404J9025K0565K0308J8619J6653J5102J3826J2717J1906J0685
59402H05012P301R54o530j2110j4444j4512j3695j2497j1144j0048r142p898o754
59389F94493p510j1365j7012k1650k3579k3058k1053j8206j5031j2121r703p535
59377E06670n541m108l447l108k484j532o25Q9Q00J602K247K429K158J781J700
59362D98631K019K464K702K778L086L824M645M979M651M115M107N158P235R640
59348E60034J1357J1850J1584J1558J2267J3264J3906J4181J4627J5539J6571
59337G06738J7096J6724J5464J3663J1832J0279Q767O721L987J132j204l097n114
$$ plain form
59427 647595 635762 625185 615985 608387 602404 597730 594051 591490 590685 592396 597109 604910 615647 629202
59413 629202 645606 664631 685196 705504 724123 740776 755878 769704 782421 794327 805012
59402 805012 812313 813267 806737 794627 780183 765671 751976 739479 728335 718287 709145 701247 694493
59389 694493 686983 675618 658606 636956 613377 590319 569266 551060 536029 523908 514205 506670
59377 506670 501129 497021 493574 490466 487982 486450 485825 485914 486714 488316 490563 492992 495150 496931 498631
59362 498631 500650 503114 505816 508594 511680 515504 520149 525128 529779 533894 538001 543159 550394 560034
59348 560034 571391 583241 594825 606383 618650 631914 645820 660001 674628 690167 706738
59337 706738 723834 740558 756022 769685 781517 791796 800563 807284 811271 812403 811199 808102 802988
59324H02988p394r397j0578j0972j0956j0770j0460j0051r550q918q232p666p136
59311F80908o242m840l498k944l149l307k726j460r7P30O98M4m78k43O11J485
59295F55492K212L078L999M430M400M933O841R569J1897J3352J4267J4787J4706
59282G63963J4168J3679J3304J2636J1607J0476Q734N007j166q035j2851j4149
59270H17373j2422q961m890j086J828L758N028N908O416O572O368N564L917J669
59256H37042n69k495m354o379q426j0204j1603j2608j3234j3608j3835j3671j2730
59243G13326j1141r657q789q233p421o301n155l959k566j322q81j242j471p49
59229F44439O63J750J812R37l76j648k528k876k933l213l981m928n584n964o540
$$ plain form
59324 802988 795594 786197 775619 764647 753691 742921 732461 722410 712860 703942 695710 688044 680908
59311 680908 674666 669826 666328 663384 660235 656928 654202 652742 652645 653375 654073 654117 653639 653396 654007 655492
59295 655492 657704 660782 664781 669211 673611 678544 685385 694954 706851 720203 734470 749257 763963
59282 763963 778131 791810 805114 817750 829357 839833 848567 853574 852408 844373 831522 817373
59270 817373 804951 795990 791100 790014 791842 795600 800628 806536 812952 819524 825892 831456 835373 837042
59256 837042 836473 833978 829624 823245 814819 804615 793012 780404 767170 753562 739727 726056 713326
59243 713326 702185 692528 683739 675506 668085 661784 656629 652670 650104 648782 647901 646659 645188 644439
59229 644439 645102 646852 648664 649601 649225 647577 645049 642173 639240 636027 632046 627118 621534 615570 609030
59214F09030p472q181p993p047o239o184o559o580n870m668l395k292j477j039
59200E34034r79j133j205r05j85O40J082R87P75J056K041L364M387M625M071L294
59184E55949L077L727M740N347N288M928M707M780N093N486N734N758N804O099
59170F26517O398O301N976O019O501O763O524O532P515Q972R699R333Q581Q051
59156G29682P545O716N684M669L535K069M43j045k420l922n545o948p783p983
59142G24697p805p667p854q275q620q701q479p857o749n380m167l224k350j495
59128F36074q38l26L56J182J793K378L815O372Q852R855R546R359J0169J1513
59114G10100J2538J2896J2681J2175J1824J1836J1725J0882R618Q853Q707Q246
$$ plain form
59214 609030 601558 593377 585384 578337 572098 565914 559355 552775 546905 542237 538842 536550 535073 534034
59200 534034 533055 531922 530717 529812 529627 530267 531349 532336 533111 534167 536208 539572 543959 548584 552655 555949
59184 555949 559026 562753 567493 572840 578128 583056 587763 592543 597636 603122 608856 614614 620418 626517
59170 626517 632915 639216 645192 651211 657712 664475 670999 677531 685046 694018 703717 713050 721631 729682
59156 729682 737227 743943 749627 754296 757831 759900 760343 759298 756878 752956 747411 740463 732680 724697
59142 724697 716892 709225 701371 693096 684476 675775 667296 659439 652690 647310 643143 639919 637569 636074
59128 636074 635236 634910 635266 636448 638241 640619 644434 650806 659658 669513 679059 688418 698587 710100
59114 710100 722638 735534 748215 760390 772214 784050 795775 806657 816275 825128 833835 842081
59102H42081O955N571M841M305L068J229l68j429k327l121l413l265l505m710
59088H45912o366p409p339o559n860n767o306p178q097q948r677j0241j0776j1542
59074G33847j2502j3145j2981j2101j1025j0148r525r022q387p330n906m687m182
59061F12906m187m127l882l825l996l842l001j874j113q84r85j423k299l219l318
59046E70931k216o61J12k93j023j028k18O78J172J475J869K203K244K118K100
59031E79463K218K430K827L391L823M037M515N629O918P626P819Q264R227J0101
59017F58288J0329R960R199Q068O811N942N452M574K823Q23m93j099j689k542
59003G16446l188l155k408j048P93K635L714L768L463L713M625N398N258M294
$$ plain form
59102 842081 849036 854607 859448 863753 866821 868050 867682 866253 863926 860805 857392 854127 850622 845912
59088 845912 839546 832137 824798 818239 812379 806612 800306 793128 785031 776083 766406 756165 745389 733847
59074 733847 721345 708200 695219 683118 672093 661945 652420 643398 635011 627681 621775 617088 612906
59061 612906 608719 604592 600710 596885 592889 589047 586046 584172 583059 582175 581190 579767 577468 574249 570931
59046 570931 568715 568054 568166 567873 566850 565822 565604 566282 567454 568929 570798 573001 575245 577363 579463
59031 579463 581681 584111 586938 590329 594152 598189 602704 608333 615251 622877 630696 638960 648187 658288
59017 658288 668617 678577 687776 695844 702655 708597 714049 718623 721446 722269 721776 720677 718988 716446
59003 716446 713258 710103 707695 706647 707440 710075 713789 717557 721020 724733 729358 734756 740014 744308
58989G44308L203K364J413j38k065l543m031l833l740m328n610p035p773p350
58975G01842o157n004m103k881j025Q62K136L201M996P518R594J0308R992R597
58961G40876R530R504R243Q756Q019O808N049L101J435kj870m649p858j0381j1652
58946G65909j2202j2776j3305j3191j2391j1550j0980j0219q864p302o122n213
58934F41794m124l015k551k798k942k447j867k090l109m067m330l957l162j976
58920E99359o39J34k10j340k271k313j526l71Q05J864K746L434L991M521N096
58905F13280N725O396P156Q144R445J0900J2148J3005J3644J4288J4861J5177
58893G44169J5418J6036J7135J8172J8562J8319J7951J7803J7792J7795J7953
$$ plain form
58989 744308 747511 749875 751288 751150 749085 745542 741511 737678 733938 729610 724000 716965 709192 701842
58975 701842 695685 690681 686578 683697 682672 683534 685670 688871 693867 701385 710979 721287 731279 740876
58961 740876 750406 759910 769153 777909 785928 792736 797785 800886 802321 802319 800449 795800 787942 777561 765909
58946 765909 753707 740931 727626 714435 702044 690494 679514 669295 660431 653129 647007 641794
58934 641794 637670 634655 632104 629306 626364 623917 622050 619960 616851 612784 608454 604497 601335 599359
58920 599359 598720 598854 598644 597304 595033 592720 591194 590823 591628 593492 596238 599672 603663 608184 613280
58905 613280 619005 625401 632557 640701 650146 661046 673194 686199 699843 714131 728992 744169
58893 744169 759587 775623 792758 810930 829492 847811 865762 883565 901357 919152 937105
58882I37105J8415J8909J8875J8010J6468J4407J1568P715L318o36l724o580r957
58869A043893j3539j6180j7318j7650j8260j9345k0111j9798j8519j7038j5926
58858H50209j5119j4315j3576j3236j3322j3397j3205j3033j3170j3277j2816
58847G01743j1926j1321j1293j1308j0811r837q704p527o439n855n981o290o012
58834E88439n110m301m060m077l892l605l643m018m238l947l316k675k067j372
58820E38118p21n19r67j714k041j338M47K618M064M130L264K564K634L108L346
58805E56993L144K624J859J001M27K86J79k56o53m31K03L96j31o61n22K3K17j85
58787E64513o92o02M04J959L200L576L567M232N874P554Q201P785P105O682O364
$$ plain form
58882 937105 955520 974429 993304 1011314 1027782 1042189 1053757 1061472 1064790 1064154 1060430 1053850 1043893
58869 1043893 1030354 1014174 996856 979206 960946 941601 921490 901692 883173 866135 850209
58858 850209 835090 820775 807199 793963 780641 767244 754039 741006 727836 714559 701743
58847 701743 689817 678496 667203 655895 645084 635247 626543 619016 612577 606722 600741 594451 588439
58834 588439 583329 579028 574968 570891 566999 563394 559751 555733 551495 547548 544232 541557 539490 538118
58820 538118 537397 536878 535911 534197 532156 530818 531265 533883 537947 542077 545341 547905 550539 553647 556993
58805 556993 560137 562761 564620 565621 566048 566334 566513 566257 565604 565173 565376 565772 565641 564980 564458 564481 564698 564513
58787 564513 563821 563219 563623 565582 568782 572358 575925 580157 586031 593585 601786 609571 616676 623358 629722
58772F29722N785M767L244J187j267l789n993p557q277q258p961p872p983p767
58758E77981o787n256l816k847k197j610j085n68L49J871L322L751L316L275M261
58743E73960N350N410M658M074L973M098M682O135P806Q372P646O846O792O840
58729F56642O147N033M441M695N428O245O923P353P662Q101Q571Q696Q450Q189
58715G52576P964P584P418Q154R394R590P980N663L995K802J052j488m279p041
58701H11364r678j1678j2724j3613j5426j7907j9717k0217k0040j9811j9280j8000
58689F13273j6135j4289j2929j2140j1582j0700r293p816o803o165n395m229k767
58676D93030j268k12j24q22j252o04P37J989L099M379N588O405P316Q877J0342
$$ plain form
58772 629722 635507 640274 643518 644705 643438 639649 633656 626099 617822 609564 601603 593731 585748 577981
58758 577981 571194 565938 562122 559275 557078 555468 554383 553815 554164 556035 559357 563108 566424 569699 573960
58743 573960 579310 584720 589378 593452 597425 601523 606205 612340 620146 628518 636164 643010 649802 656642
58729 656642 662789 667822 672263 676958 682386 688631 695554 702907 710569 718670 727241 735937 744387 752576
58715 752576 760540 768124 775542 783696 793090 802680 810660 816323 820318 823120 824172 822684 818405 811364
58701 811364 801686 790008 777284 763671 748245 730338 710621 690404 670364 650553 631273 613273
58689 613273 597138 582849 569920 557780 546198 535498 526205 518389 511586 505421 500026 495797 493030
58676 493030 491762 491550 491426 490604 489352 488748 489485 491474 494573 498952 504540 510945 518261 527138 537480
58661E37480J0362Q967P644P202O841N667L959K356P11j449l948o098p419p790
58647E64485p264o213n370n293n887o534o578n725m321l205k850k795k344j630
58633D98476j345j458j119N4J315J813J648J497J681J961J994J654J105P13O66
58618E10655P14N55L96P45J679K785L808M868O063P223Q105Q415P828O358M647
58603E74844L313K214Q90n18j537k267l126l873l827l072k441k156j505j51J180
58588E57968J743J702J675J972K680L843N257O541P613Q651R529R943J0037J0141
58574F39295J0030R331Q532Q473Q822Q435P435P401R017J1044J2431J3889J6206
58561G70341J8339J8732J7654J6700J6416J5951J4747J3217J1651R661O984M017
$$ plain form
58661 537480 547842 556809 564453 571655 578496 584163 588122 590478 591189 589740 585792 579694 572275 564485
58647 564485 557221 551008 545638 540345 534458 527924 521346 515621 511300 508095 505245 502450 500106 498476
58633 498476 497131 495673 494554 494608 495923 497736 499384 500881 502562 504523 506517 508171 509276 509989 510655
58618 510655 511369 511924 512320 513065 514744 517529 521337 526205 532268 539491 547596 556011 563839 570197 574844
58603 574844 578157 580371 581261 580743 579206 576939 573813 569940 566113 563041 560600 558444 556939 556788 557968
58588 557968 559711 561413 563088 565060 567740 571583 576840 583381 590994 599645 609174 619117 629154 639295
58574 639295 649325 658656 667188 675661 684483 692918 700353 707754 716771 727815 740246 754135 770341
58561 770341 788680 807412 825066 841766 858182 874133 888880 902097 913748 923409 930393 934410
58549I34410J207j514m439p539j0301j2017j2413j2146j2294j3128j3820j3655
58537H22351j3005j2698j2942j3437j4012j4581j4794j4357j3446j2409j1290
58526F75380j0023q684p265n609l959k999k923k989k476j563p72j84K59L15p9
58511F26429l62q5M52Q54J318J999K381K090J739K005K437K174J368P84L91m59
58495F45515j602k057j498o82k79k14l11o22r18p09p5K68R9J48J086K657M245
58478F45051N778P469Q994R567Q879P573O599O198N835N059M082L241K208L42
58464G26875k266m747o445p306p292o258m637l307k409j167O54K147K756L285
58450F89883M464N444N045L783L200L502L325J841k51j982l253m294m952m992
$$ plain form
58549 934410 935617 934103 929664 922125 911824 899807 887394 875248 862954 849826 836006 822351
58537 822351 809346 796648 783706 770269 756257 741676 726882 712525 699079 686670 675380
58526 675380 665357 656673 649408 643799 639840 636841 633918 630929 628453 626890 626118 625934 626193 626508 626429
58511 626429 626067 625982 626434 627288 628606 630605 632986 635076 636815 638820 641257 643431 644799 645583 645974 645515
58495 645515 643913 641856 640358 639676 639397 639183 638872 638250 637332 636623 636548 636816 636915 637063 638149 640806 645051
58478 645051 650829 658298 667292 676859 685738 693311 699910 706108 711943 717002 721084 724325 726533 726875
58464 726875 724609 719862 713417 706111 698819 692561 687924 684617 682208 681041 681695 683842 686598 689883
58450 689883 694347 699791 704836 708619 711819 715321 718646 720487 720236 718254 715001 710707 705755 700763
58436G00763m533l833l018k222j533p22N62K161L406L912M016M315M899N277N066
58421G18516M675N019O292P375P103N890N194N345N074L519J469lr93j980k674
58406G69821k723k704l269m041m464m995o177p159o661m943l396k493j556l73
58392G14867M52P81J233J978K428K338K139K018J690J204J021J166J193J098J329
58377G36935J866K211K371K890L805M519M853N262N841O132O103O379P201Q050
58363H04418Q634R355J0383J1092J0940J0331J0095J0492J1069J1212J0611R458
58351I28090Q249P202O034M547L152K367K180K384L123M449N734O340O562P175
58337I97588Q231R130R672J0189J0772J1134J1190J1107J0952J0833J1139J1961
$$ plain form
58436 700763 696230 692397 689379 687157 685624 684902 685464 687625 691031 694943 698959 703274 708173 713450 718516
58421 718516 723191 728210 734502 741877 748980 754870 760064 765409 770483 774002 775471 775468 774475 772495 769821
58406 769821 767098 764394 761125 757084 752620 747625 741448 734289 727628 722685 719289 716796 715240 714867
58392 714867 715319 716100 717333 719311 721739 724077 726216 728234 729924 731128 732149 733315 734508 735606 736935
58377 736935 738801 741012 743383 746273 750078 754597 759450 764712 770553 776685 782788 789167 796368 804418
58363 804418 813052 822407 832790 843882 854822 865153 875248 885740 896809 908021 918632 928090
58351 928090 936339 943541 949575 954122 957274 959641 961821 964205 967328 971777 977511 983851 990413 997588
58337 997588 1005819 1014949 1024621 1034810 1045582 1056716 1067906 1079013 1089965 1100798 1111937 1123898
58325A123898J2622J2434J1589J0645R651Q509P676P576P749P462O793O296O083
58312A238983O090O658P857Q829Q843Q484Q789R790J0961J2413J4436J6402J7356
58299A375891J7291J6800J6122J5530J5796J7091J8242J8378J8339J9145K0234
58288A568859K0783K1479K3049K4294K3850K2889K3550K5528K6724K6767K7159
58277A834931K8293K9081K9445L0600L2642L4317L5266L6362L7793L9009M0462
58266B208201M3058M6069M7940M9103N1405N4820N7412N8653O0041O2207O4098
58255B803007O5397O7086O9218P0638P1401P2972P5639P8180Q0418Q3635Q8089
58244C625680R2589R6836J01851J07891J14263J21196J29429J38190J46229J54475
$$ plain form
58325 1123898 1136520 1148954 1160543 1171188 1180839 1189348 1197024 1204600 1212349 1219811 1226604 1232900 1238983
58312 1238983 1245073 1251731 1259588 1268417 1277260 1285744 1294533 1304323 1315284 1327697 1342133 1358535 1375891
58299 1375891 1393182 1409982 1426104 1441634 1457430 1474521 1492763 1511141 1529480 1548625 1568859
58288 1568859 1589642 1611121 1634170 1658464 1682314 1705203 1728753 1754281 1781005 1807772 1834931
58277 1834931 1863224 1892305 1921750 1952350 1984992 2019309 2054575 2090937 2128730 2167739 2208201
58266 2208201 2251259 2297328 2345268 2394371 2445776 2500596 2558008 2616661 2676702 2738909 2803007
58255 2803007 2868404 2935490 3004708 3075346 3146747 3219719 3295358 3373538 3453956 3537591 3625680
58244 3625680 3718269 3815105 3916956 4024847 4139110 4260306 4389735 4527925 4674154 4828629
58234D828629J64805J76705J88271J99922K13598K28850K43747K59286K78629
58225F782442L01945L26362L51193L78973M11051M46665M86669N33632N87798
58216A0606730O47434P13610P90280Q79645R82423J102822J248339J425084J639172
58207B0035539J902543K230287K630269L100151L634813M231749M891342N621957
58199D8278650O449373P416205Q565927R921289J1469157J3162538J4941121J6738252
58191A36942512J8433635J9790470K0498921K0362316J9457861J8074543J6472358
58184B70032616J4695070J2539634R586807N280966p76851q340751j6264823k2891623
58176B63861045k6892344k7885416k6402408k3396198j9759536j6102124j2752104
$$ plain form
58234 4828629 4993434 5170139 5358410 5558332 5771930 6000780 6244527 6503813 6782442
58225 6782442 7084387 7410749 7761942 8140915 8551966 8998631 9485300 10018932 10606730
58216 10606730 11254164 11967774 12758054 13637699 14620122 15722944 16971283 18396367 20035539
58207 20035539 21938082 24168369 26798638 29898789 33533602 37765351 42656693 48278650
58199 48278650 54728023 62144228 70710155 80631444 92100601 105263139 120204260 136942512
58191 136942512 155376147 175166617 195665538 216027854 235485715 253560258 270032616
58184 270032616 284727686 297267320 306854127 312135093 311358242 303017491 286752668 263861045
58176 263861045 236968701 209083285 182680877 159284679 139525143 123423019 110670915
58169A10670915r863749p521116n755692m500699l597650k892364k312902j857592
58161G2369151j574858j595981k107564l166519m518892n679316o246764o143540
58153D1335717n569162m790093l996851l289257k704994k239080j866893j568803
58145A5310584j333332j146341r92150q63043p57152o69613n94331n30878m81220
58136G942524m42274m08558l79054l55084l34461l13591k92465k72448k52118
58127D892471k30057k08615j90441j74327j58604j45189j35947j28487j20245
58118C400559j13647j12375j14904j16223j14105j09702j03816r6483q8871q2224
58108B348209p6063o9883o4848o1586n8364n3998n0312m9077m8768m7094m4649
$$ plain form
58169 110670915 100807166 93286050 87530358 83029659 79432009 76539645 74226743 72369151
58161 72369151 70794293 69198312 67090748 63924229 59405337 53726021 47479257 41335717
58153 41335717 35766555 30976462 26979611 23690354 20985360 18746280 16879387 15310584
58145 15310584 13977252 12830911 11838761 10975718 10218566 9548953 8954622 8423744 7942524
58136 7942524 7500250 7091692 6712638 6357554 6023093 5709502 5417037 5144589 4892471
58127 4892471 4662414 4453799 4263358 4089031 3930427 3785238 3649291 3520804 3400559
58118 3400559 3286912 3174537 3059633 2943410 2829305 2719603 2615787 2519304 2430433 2348209
58108 2348209 2272146 2202263 2137415 2075829 2017465 1963467 1913155 1864078 1815310 1768216 1723567
58097A723567m3240m2468m0812l8471l6527l4717l2467l0596k9805k8982k7140
58086A338342k5300k4520k3794k2057k0380j9959j9752j8501j7314j7790j9043
58075A109932j9180j8365j7977j7994j7553j6992j7103j7309j6718j5951j5894
58064I18896j5726j4269j2286j1332j1238j0754r838r271q847p958p290p929r301
58051G82857r859r372q885q824q683q243p679o893n901n347n574n920n913o180
58037F79584p093p690p224o694p274q350q626q308q421q841q695q152q129q647
58023E67440q922q684q186p406o436o005o396o577n592m152l562l773l803l417
58009D84529l035k640k070j809k242k674k277j382p19j24P71J357R36P3j82J72
$$ plain form
58097 1723567 1680327 1637859 1597047 1558576 1522049 1487332 1454865 1424269 1394464 1365482 1338342
58086 1338342 1313042 1288522 1264728 1242671 1222291 1202332 1182580 1164079 1146765 1128975 1109932
58075 1109932 1090752 1072387 1054410 1036416 1018863 1001871 984768 967459 950741 934790 918896
58064 918896 903170 888901 876615 865283 854045 843291 833453 824182 815335 807377 800087 792158 782857
58051 782857 772998 763626 754741 745917 737234 728991 721312 714419 708518 703171 697597 691677 685764 679584
58037 679584 672491 664801 657577 650883 643609 635259 626633 618325 609904 601063 592368 584216 576087 567440
58023 567440 558518 549834 541648 534242 527806 521801 515405 508828 503236 499084 495522 491749 487946 484529
58009 484529 481494 478854 476784 474975 472733 470059 467782 466400 465681 465557 466328 467685 468621 468694 468512 468684
57993D68684O22J311K345K758J787M80M04J352J883J620J352J265Q08J08p0K59
57977D86968L59R3o0j47n85j095j083q72j301k255k924l224l712m204l902k818
57961D59238j854j498j590k190l451m709m975m327l651l179k511j927k311l629
57947D17436m713m797m160l170j822m07M94R31J633K836L939M407M281L740K971
57932D23599K551L103M452N750O472O679O447N827N182M818M420L630K875K803
57918D88608L145L035K238J089m85k737n079o501p038p663q700r442r516r512
57904D31442r894j0271j0083r332q401p693p566p964q179p617o688o232o254o081
57890C19187n529m910m055k498o82K44J11K2O66J376J370J003J120J838K637L160
$$ plain form
57993 468684 469306 470617 472962 475720 477507 477987 478391 479743 481626 483246 484598 485863 486671 486779 486709 486968
57977 486968 487327 487420 487360 487213 486628 485533 484450 483578 482277 480022 477098 473874 470162 465958 462056 459238
57961 459238 457384 455886 454296 452106 448655 443946 438971 434644 430993 427814 425303 423376 421065 417436
57947 417436 412723 407926 403766 400596 398774 398367 398861 399792 401425 404261 408200 412607 416888 420628 423599
57932 423599 426150 429253 433705 439455 445927 452606 459053 464880 470062 474880 479300 482930 485805 488608
57918 488608 491753 494788 497026 498115 497630 494893 489814 483313 476275 468612 459912 450470 440954 431442
57904 431442 421548 411277 401194 391862 383461 375768 368202 360238 352059 344442 337754 331522 325268 319187
57890 319187 313658 308748 304693 302195 301513 301757 301868 301890 302556 303932 305302 306305 307425 309263 311900 315060
57874C15060L400L408L158K567J518J94p33o47J61P16M90j43n77o46n72n84p37
57857C26033q15n35K7M85Q39J646L087M432M950M831M560M055L208K669L080L988
57841C66540M520M679M890M807L871K672K271K330J482l52j686j810j934l237
57827C89043n116o188o107n487m808m140l566l196l008k943k879k445j345M8J017
57812C38880J393J610J858J936J897K096K415K276J556P84J95n80j714k762l353
57797C48487l697m131m754n600o597p265p109o438o041o041n793n039m250l707
57783B72025l109k390k053k304k555k175j230k58K26m2o88o25Q53K862L804L543
57767B65884L618N032O896P738P191N832M238K844K028J698J317P53M63M69l9
$$ plain form
57874 315060 318460 321868 325026 327593 329111 329305 328572 327925 328086 328802 329292 329149 328572 327926 327354 326770 326033
57857 326033 325218 324683 324710 325195 326034 327680 330767 335199 340149 344980 349540 353595 356803 359472 362552 366540
57841 366540 371060 375739 380629 385436 389307 391979 394250 396580 398062 397710 396024 394214 392280 389043
57827 389043 383927 377739 371632 366145 361337 357197 353631 350435 347427 344484 341605 339160 337815 337863 338880
57812 338880 340273 341883 343741 345677 347574 349670 352085 354361 355917 356701 356896 356316 354602 351840 348487
57797 348487 344790 340659 335905 330305 323708 316443 309334 302896 296855 290814 285021 279982 275732 272025
57783 272025 268916 266526 264473 262169 259614 257439 256209 255951 256177 256135 255447 254822 255675 258537 262341 265884
57767 265884 269502 274534 281430 289168 296359 302191 306429 309273 311301 312999 314316 315069 315532 316001 315962
57752C15962j489l077l766l644l562l911m356m494m181l471k582j848j380j029
57738B73172p43o20n72m08l42q38j794k398k080j086m7N51M22l26r93q16J15J023
57720B62220J492J727J875J812J620J437R00l66j677j837p94K81P12R18J103P44
57704B72167j98q54q26p39q62m74O24J334R99P03J599L010L440K778K105J936
57688B86742J825J340M19q79k107k316j188K35Q45J061K203M693P856J1132J4538
57673C26399J8147K2002K6343L1060L5205L7839L9003L9183L8207L5632L1874
57662F80894K7867K3592J7721Q727m116k0171l6898n0248n6936n6712n1920m5103
57650D36697l7700l0597k4564j9797j5871j2434r525p208n502m570m384m323l679
$$ plain form
57752 315962 314473 311396 307630 303986 300424 296513 292157 287663 283482 280011 277429 275581 274201 273172
57738 273172 272429 271809 271237 270829 270487 269649 267855 265457 263377 262291 262244 262795 263217 262891 261898 261082 261197 262220
57720 262220 263712 265439 267314 269126 270746 272183 273083 272717 271040 269203 268409 268690 269402 270320 271423 272167
57704 272167 271969 271115 270289 269550 268688 268214 268838 270172 271171 271874 273473 276483 279923 282701 284806 286742
57688 286742 288567 289907 290326 289447 287340 285024 283836 284071 284916 285977 288180 292873 300729 311861 326399
57673 326399 344546 366548 392891 423951 459156 496995 535998 575181 613388 649020 680894
57662 680894 708761 732353 750074 758801 754685 734514 697616 647368 590432 533720 481800 436697
57650 436697 398997 368400 343836 324039 308168 295734 286209 279001 273499 268929 264545 260222 256543
57637B56543k507j298j38J111K023J937J008R0m23q02j106r84m86j89l08m96o64
57620B53311j158j912k232j817j229r76q78p08p53j158j359q46j6L95M02N28P48
57603B40342M52m29j050p82j95l55j352k152k079j757k165l098l411k695j921
57588B17353k043k659k680j888j179j359k276l136l259k543j519r45j125j622
57574A89120j855j703j444j291j381j871k655l136k767j708o46q0m2l47p04p52
57558A66738m29j15j19j84J25P19J115J135J002Q76P12N60N30N26L57J43J47K57
57540A74095J05k86m40j21K77L34K44N58J391K185K344J866J209O20Nn44n61O1
57522A83342O14L66m26j009j318j806k212j668k59P04M59j45q2L55K94k23n34
$$ plain form
57637 256543 254036 252738 252600 253711 255734 257671 258679 258769 258346 257544 256438 255454 254968 254779 254471 253975 253311
57620 253311 252153 250241 248009 246192 244963 243987 243109 242401 241648 240490 239131 238285 238269 238664 239066 239594 240342
57603 240342 240794 240365 239315 238533 238338 237983 236631 234479 232400 230643 228478 225380 221969 219274 217353
57588 217353 215310 212651 209971 208083 206904 205545 203269 200133 196874 194331 192812 191867 190742 189120
57574 189120 187265 185562 184118 182827 181446 179575 176920 173784 171017 169309 168663 168583 168541 168194 167490 166738
57558 166738 166309 166194 166075 165891 166016 166735 167850 168985 169987 170863 171575 172135 172665 173191 173548 173691 173838 174095
57540 174095 174200 173914 173474 173353 173630 173964 174208 174766 176157 178342 180686 182552 183761 184381 184386 183842 183281 183342
57522 183342 183956 184322 183896 182887 181569 179763 177551 175883 175624 176328 176787 176642 176560 176915 177209 176986 176452
57505A76452n44o44q15p36n72p35j142j447j733k223k507j980r02k58n36j306
57489A58372j952k201j998j394o51o1K50J82k70o52l42M08N11l84j279j445j593
57472A45501k343k696j533K40Q06J84o5M17L89n18j029m38K36P0l37j86J76K44
57454A39118M36J150J680J241L04j14J40M95O92P98P32N25N92J010J038J44r61
57437A49020j100j89Q18J269J353J404J375J044L45n33j200j351j127r31p91l47
57421A49059L79Q23P39O00P14O73J87k29r5J46j33o30o82n13q46j489j462n61
57403A46680K76L89K43M01N62K37k48k23K94O99P72Q43J032J059Q94J006J584
57386A56500K057J844J237J003J341J814K204K665L097L016K351J618J025J05
$$ plain form
57505 176452 175908 175264 174449 173713 173141 172406 171264 169817 168084 165861 163354 161374 160472 160214 159678 158372
57489 158372 156420 154219 152221 150827 150176 150115 150365 150547 150277 149625 149283 149691 150202 149818 148539 147094 145501
57472 145501 143158 140462 138929 139169 139975 140159 140094 140511 140900 140382 139353 138915 139151 139221 138884 138698 138874 139118
57454 139118 139554 140704 142384 143625 143929 143815 143955 144450 145142 145940 146672 147197 147789 148799 149837 149981 149020
57437 149020 147920 147731 148549 149818 151171 152575 153950 154994 155339 154806 153606 152255 151128 150197 149406 149059
57421 149059 149438 150261 151000 151600 152314 152987 153174 152945 152850 152996 152863 152233 151551 151038 150192 148703 147241 146680
57403 146680 146956 147345 147588 147989 148551 148788 148540 148317 148611 149310 150082 150925 151957 153016 153910 154916 156500
57386 156500 158557 160401 161638 162641 163982 165796 168000 170665 173762 176778 179129 180747 181772 181877
57372A81877j230k061j579l57L67K44j82o98j569k578k971k565k055j946j910
57357A60787j490p73r4L98O06M34Q3k0K00M52O53J009J406J374Q70M52M08L20
57339A67075k04q83j185r35k83N49J182J278R50O63N52M04K63M29P22N15k26o93
57321A70173l58L78J026J654K244K206J281K79J22O43J032J079J193J510J739
57306A86201J737J581J159K72p79j270q09K14R56Q48J43k85J03P53O81j00n26
57289A90879P0J089J603J433Q67M1q18j146p86m29o17q33l31N16O65Jm21J74J323
57270A93280J981J666Q06K03K61O08O33M27P35J787K721K576J464K38n47q24n79
57253B07436Q5O80P36L69K7j9L95J432K710L183K343J157R50J630J955J394P10
$$ plain form
57372 181877 180647 178586 177007 176650 177017 177261 177079 176381 174812 172234 169263 166698 164643 162697 160787
57357 160787 159297 158524 158430 158828 159434 159868 159951 159931 160131 160583 161236 162245 163651 165025 165895 166347 166755 167075
57339 167075 166871 165988 164803 163868 163585 164134 165316 166594 167544 168207 168759 169163 169426 169855 170577 171092 170866 170173
57321 170173 169815 170193 171219 172873 175117 177323 178604 178883 179005 179648 180680 181759 182952 184462 186201
57306 186201 187938 189519 190678 190950 190171 188901 188092 188306 189262 190110 190253 189968 190071 190824 191505 191405 190879
57289 190879 190949 192038 193641 195074 195941 195982 195164 194018 193232 192803 192186 191353 191022 191538 192203 192204 191783 191957 193280
57270 193280 195261 196927 197733 197936 198197 198805 199438 199865 200600 202387 205108 207684 209148 209386 208839 208015 207436
57253 207436 207521 208201 208937 209306 209333 209314 209709 211141 213851 217034 219377 220534 221484 223114 225069 226463 227173
57236B27173O30R24J087J134J331J677K004K249K417K551K793L118L076K281J142
57221B55587N41P49J227J539J860K435L061L468L716L956M129M143M070L974L851
57206B98306L830M153M709M986M680M098L717L572L386L134L226M041N472O892
57192C58202P643P566P114O862O992P283P500P646P847Q169Q539Q795Q883R068
57178D68109R752J1002J2383J3412J4041J4576J5303J6341J7713J9290K0743K1708
57166F54373K1954K1472K0543J9750J9553J9749J9698J9188J8711J8709J9048
57155H72748J9429J9859K0358K0610K0418K0118K0150K0499K0930K1396K1827
57144A098342K1880K1467K1145K1429K2021K2349K2549K3214K4397K5614K6723
$$ plain form
57236 227173 227803 228727 229814 230948 232279 233956 235960 238209 240626 243177 245970 249088 252164 254445 255587
57221 255587 256128 256877 258104 259643 261503 263938 266999 270467 274183 278139 282268 286411 290481 294455 298306
57206 298306 302136 306289 310998 315984 320664 324762 328479 332051 335437 338571 341797 345838 351310 358202
57192 358202 365845 373411 380525 387387 394379 401662 409162 416808 424655 432824 441363 450158 459041 468109
57178 468109 477861 488863 501246 514658 528699 543275 558578 574919 592632 611922 632665 654373
57166 654373 676327 697799 718342 738092 757645 777394 797092 816280 834991 853700 872748
57155 872748 892177 912036 932394 953004 973422 993540 1013690 1034189 1055119 1076515 1098342
57144 1098342 1120222 1141689 1162834 1184263 1206284 1228633 1251182 1274396 1298793 1324407 1351130
57133A351130K7986K9277L0043L0324L1037L2893L5478L7898M0009M2547M6046
57122A734668N0033N3486N6096N8831O3049O9167P6547Q4670R3902J05007J18362
57111B563818J33856J51059J69273J88100K08423K32442K62333K99330L44434
57102D553068L99121M64650N41251O28702P27137Q36636R56805J087796J230758
57093A1425924J385428J546955J706125J852816J978589K076606K141057K167959
57085B6281459K157422K117525K068267K039184K054228K109756K163713K149134
57077D3140688K004285J697388J231124O31540o3361q06542j540926k203950k740117
57068D1350129l114300l317387l362749l278148l097517k854431k578031k291716
$$ plain form
57133 1351130 1379116 1408393 1438436 1468760 1499797 1532690 1568168 1606066 1646075 1688622 1734668
57122 1734668 1784701 1838187 1894283 1953114 2016163 2085330 2161877 2246547 2340449 2445456 2563818
57111 2563818 2697674 2848733 3018006 3206106 3414529 3646971 3909304 4208634 4553068
57102 4553068 4952189 5416839 5958090 6586792 7313929 8150565 9107370 10195166 11425924
57093 11425924 12811352 14358307 16064432 17917248 19895837 21972443 24113500 26281459
57085 26281459 28438881 30556406 32624673 34663857 36718085 38827841 40991554 43140688
57077 43140688 45144973 46842361 48073485 48705025 48641664 47835122 46294196 44090246 41350129
57068 41350129 38235829 34918442 31555693 28277545 25180028 22325597 19747566 17455850
57060A7455850k013213j754324j520882j314384j134521r80319q49776p40027
57052G148404o48387n72560n09872m57287m12437l73833l40003l09397k81403
57043C243225k56285k33702k12341j91543j72202j55237j40084j25602j11733
57034A644496r9275q8528p9117p0841o3716n7288n0741m3687l6354k9087k2186
57023A003676j6003j0515m750K825J3112K5759L9826N4736P0374Q6143J00144
57012A365327J09803J13909J13802J12034J09816J06065R8032Q1463N0555J007
57002B261813o4128j31819j84616k10746k09890j90577j63187j34914j09087q6949
56992G75900o9148n5784m5939l8026l0936k4562j9238j5052j1893r669q207p301
$$ plain form
57060 17455850 15442637 13688313 12167431 10853047 9718526 8738207 7888431 7148404
57052 7148404 6500017 5927457 5417585 4960298 4547861 4174028 3834025 3524628 3243225
57043 3243225 2986940 2753238 2540897 2349354 2177152 2021915 1881831 1756229 1644496
57034 1644496 1545221 1456693 1377576 1306735 1243019 1185731 1134990 1091303 1054949 1025862 1003676
57023 1003676 987673 977158 972408 975233 988345 1014104 1053930 1108666 1179040 1265183 1365327
57012 1365327 1475130 1589039 1702841 1814875 1924691 2030756 2128788 2210251 2260806 2261813
57002 2261813 2197685 2065866 1881250 1670504 1460614 1270037 1106850 971936 862849 775900
56992 775900 706752 650968 605029 567003 536067 511505 492267 477215 465322 455653 447446 440145
56980D40145p097p957r713j1625j3372j5399j7781j9413j9143j7317j5263j3534
56968B72531j1452q425m841j486J306L649N698P513R002R854R759Q835P702O984
56954C16629O798O608N485K620k024p488j2290j5259j5982j4773j2356r520o841
56941B41607m552k506k05K884O634J0085J2326J3451J4150J4580J4295J3281J2145
56928C48175J1079R412O531K479k671r093j6080k1571k3822k3223k1600k0023
56916B39593j8215j5804j3134j0742q814p360o354n587m823m138l718l331k537
56903A35036j388m59p5N1L50R61J832K911M097N220O288P537R203J1166J2896
56888A95626J3768J3686J3238J2953J2513J1243R314P596O143L800n5m249p124
$$ plain form
56980 440145 433048 425091 415378 403753 390381 374982 357201 337788 318645 301328 286065 272531
56968 272531 261079 252654 247813 246327 247633 251282 256980 264493 273495 283349 293108 301943 309645 316629
56954 316629 323427 330035 335520 338140 336116 328628 316338 301079 285097 270324 257968 248448 241607
56941 241607 237055 234549 234344 237228 243862 253947 266273 279724 293874 308454 322749 336030 348175
56928 348175 359254 368666 375197 377676 375005 365912 349832 328261 304439 281216 259616 239593
56916 239593 221378 205574 192440 181698 172884 165524 159170 153583 148760 144622 140904 137573 135036
56903 135036 133648 133189 133114 133165 133515 134476 136308 139219 143316 148536 154824 162361 171564 182730 195626
56888 195626 209394 223080 236318 249271 261784 273027 282341 289937 296080 299880 299825 295576 288452
56875B88452q353q535p687n396k126J056L984P480J1805J6192K0089K3739K7144
56862C67844K9513L0266K9750K8485K6557K4220K2069J9786J5566P906k334j2443
56850E87185k0189k4827k6295k4630k0340j4512p969q42O795J4376K1320K7713
56838E17785L3981L9922M4484M6654M6405M4633M2182L9098L4719K8281J9289
56827I37433P414p389k4272m0901n3943o0673o0529n5181m7056l7798k8000j8025
56815E11080q517o7P244J3645J9188K3683K6943K8835K9167K7838K5092K1474
56803G25605J7344J2332N298m885j8005l1778m2859m8954m9994m7315m2250l5726
56791D38813k8611k1584j4753p975j554L876Q082J1276J3339J3750J2557J0886
$$ plain form
56875 288452 280099 271564 263877 258481 256355 257411 261395 268875 280680 296872 316961 340700 367844
56862 367844 397357 427623 457373 485858 512415 536635 558704 578490 594056 601962 599628 587185
56850 587185 566996 542169 515874 491244 470904 456392 448423 447581 454376 468752 490072 517785
56838 517785 551766 591688 636172 682826 729231 773864 816046 855144 889863 918144 937433
56827 937433 944847 937458 913186 872285 818342 757669 697140 641959 594903 557105 529105 511080
56815 511080 502563 502496 509740 523385 542573 566256 593199 622034 651201 679039 704131 725605
56803 725605 742949 755281 760579 755694 737689 705911 663052 614098 564104 516789 474539 438813
56791 438813 410202 388618 373865 365890 364336 368212 376294 387570 400909 414659 427216 438102
56779D38102R880R386Q157N221O00n237j2027j9451k6481l1504l3380l2329k9645
56766B81292k6543k3378k0021j6632j3757j1735j0309r013p713o592n754n077
56754A24768m467l997l683l317k746k141j728j360p19l3n3j062k238k551j991
56739I2682j452j464j602j250m60K14L60K3m57p65q70r84j163j107n63K50Q97
56722H2289J183J019K24r37j382l08J503K436K101J598J629J544P74m3j82o1l70
56705I3017p28l20O17J074Q04M90M81K91m25j212j345o38M62J286J425J002M48
56688I6729j2l72m10J49Q79Q48n9p94o08j7L02O03J175J274K20j122j367o44k29
56669I6545m53n07j55o6l24j64N09P42K10j39L41R61R43N91M66L88J59K79J077
$$ plain form
56779 438102 447982 457368 465525 470746 471346 466109 454082 434631 408150 376646 343266 310937 281292
56766 281292 254749 231371 211350 194718 180961 169226 158917 149904 142191 135599 129845 124768
56754 124768 120301 116304 112621 109304 106558 104417 102689 101329 100610 100577 100524 99462 97224 94673 92682
56739 92682 91230 89766 88164 86914 86454 86668 87028 87051 86594 85829 84959 83975 82812 81705 81142 81392 82289
56722 82289 83472 84491 84715 83778 82396 82088 83591 86027 88128 89726 91355 92899 93673 93630 93448 93387 93017
56705 93017 92289 91969 92586 93660 94464 94954 95435 95726 95301 94089 92744 92106 92568 93854 95279 96281 96729
56688 96729 96717 96345 95935 96084 96963 97811 97752 96958 96350 96333 96635 97238 98413 99687 99907 98785 97418 96774 96545
56669 96545 96092 95585 95430 95364 95040 94876 95385 96127 96337 96198 96539 97500 98443 99034 99500 99888 100047 100326 101403
56650A01403J826J765J298J242J420J104M11J18K94J87m27q46o38l15m04m97J07
56633A08048J249K043K047J749J763K037K159K134K378K930L243K918K257J795
56619A38750J558J199O39J46r5q1K41Q78J503J625J061P3q48j215q20r2K18OQ
56600A44754N42P06l34j771j991q57Q4j84q57p30P7M85l4r97j666j732j413j136
56582A32946j035p83j16O12Q23N42L42M96Q73J499K547L665M079L573K796K440
56566A55299K624L172L834M236M335M833O356Q134Q578P369N926N491N775N972
56552B31934N912N537M302K062k11j561k265l031l574l078j695n69m09r23j530
56537B30901j952k124k118k221k641l176l479l518l444l254k950k800k979l217
$$ plain form
56650 101403 103229 104994 106292 107534 108954 110058 110469 110587 110881 111068 110641 109795 109157 108842 108438 107941 108048
56633 108048 109297 111340 113387 115136 116899 118936 121095 123229 125607 128537 131780 134698 136955 138750
56619 138750 140308 141507 142146 142292 142197 142116 142357 143235 144738 146363 147424 147497 146649 145434 144614 144522 144740 144746 144754
56600 144754 145296 146002 145668 143897 141906 141049 141133 140949 140092 139362 139439 139924 139890 138893 137227 135495 134082 132946
56582 132946 131911 131128 131012 131624 132447 132989 133331 133827 134700 136199 138746 142411 146490 150063 152859 155299
56566 155299 157923 161095 164929 169165 173500 178333 184689 192823 201401 208770 214696 220187 225962 231934
56552 231934 237846 243383 247685 249747 249536 247975 245710 242679 239105 236027 234332 233763 233354 232431 230901
56537 230901 228949 226825 224707 222486 219845 216669 213190 209672 206228 202974 200024 197224 194245 191028
56523A91028l130k697k093j379p23n27r31j435j550j459j569j684j267m09R0l17
56507A69948j258j919j920j602j538j745j617p95J46L68L8J82J186K175K181J269
56491A65099J26p77j200r43k22K94K59M9Kj08m25n22j54J76P1J5N05J042Q83L44
56471A64514L59J041J700K022K239K210J393j04j299j391n48N70J473J913J806
56456A77898J322P97M92N97J244K180K648K176J329J157J889K680K713K112J642
56441B02876J802K296K326J375j93j461j900j705j241o59j87k04p17j243j567
56426A99598j944k286j899o53L86L02k62o5Q93J480J117L45k22m82m01R9O22N12
56408A97140k03p03m31K47O55N77K03k48n85n98j30P10J430J375L65q02j025k60
$$ plain form
56523 191028 187898 185201 183108 181729 181006 180479 179548 178113 176563 175104 173535 171851 170584 170175 170265 169948
56507 169948 168690 166771 164851 163249 161711 159966 158349 157554 157700 158068 158106 158288 159474 161649 163830 165099
56491 165099 165225 164448 163248 162305 162083 162377 162636 162685 162687 162579 162154 161632 161478 161654 161725 161740 162245 163287 164170 164514
56471 164514 164873 165914 167614 169636 171875 174085 175478 175374 174075 172684 172136 172706 174179 176092 177898
56456 177898 179220 180017 180509 181106 182350 184530 187178 189354 190683 191840 193729 196409 199122 201234 202876
56441 202876 204678 206974 209300 210675 210482 209021 207121 205416 204175 203516 203329 203125 202408 201165 199598
56426 199598 197654 195368 193469 192816 193202 193504 193242 193177 194070 195550 196667 197012 196790 196308 195907 196006 196628 197140
56408 197140 196937 196234 195803 196050 196705 197282 197485 197237 196652 196054 195924 196634 198064 199439 199804 199002 197977 197717
56390A97717L89K15j68O5P10J120J355J827K243J979J247R57J470K253K687K555
56374B18621J845Q34K29N02J205J553J422J193R23N24L50P14J060O08l87r14o41
56357B29641j07L29O95P68K47l68j65Q08J600J777J775J775J349N25N9K78N97
56340B41583N50M60O97J059J258J353J382J284J370K046K924L089K454J997K359
56325B65865L130L755M209M432M085L321K842K747K323J438J036J572J991J216
56311C03962k35j046q45j71O34J443J708R86n7j81Q62K057K464K134J634J256
56295C16605J004R61J337K175L086L388K730J524M95j10n28p43l76N93J574K169
56279C35884K658L336L910L963L653L480L651M052M581N163N636N920O133O399
$$ plain form
56390 197717 198106 198321 198153 198218 198928 200048 201403 203230 205473 207452 208699 209656 211126 213379 216066 218621
56374 218621 220466 221300 221529 222031 223236 224789 226211 227404 228327 228851 229201 229915 230975 231583 231196 230282 229641
56357 229641 229534 229863 230558 231326 231573 231205 231040 231848 233448 235225 237000 238775 240124 240649 240708 240986 241583
56340 241583 242133 242593 243290 244349 245607 246960 248342 249626 250996 253042 255966 259055 261509 263506 265865
56325 265865 268995 272750 276959 281391 285476 288797 291639 294386 296709 298147 299183 300755 302746 303962
56311 303962 303727 302681 301836 301665 302299 303742 305450 306436 306379 306198 307060 309117 311581 313715 315349 316605
56295 316605 317609 318570 319907 322082 325168 328556 331286 332810 333305 333195 332667 331924 331548 332141 333715 335884
56279 335884 338542 341878 345788 349751 353404 356884 360535 364587 369168 374331 379967 385887 392020 398419
56265C98419O734P225Q011Q944R587R756R759J0043J0893J2497J4892J7687K0212
56252E44659K2162K3758K5418K7585L0760L4966L9211M2243M4098M6117M9166
56241I30143N2488N4807N5840N6152N6068N5355N3759N1247M7734M2984L6801
56230A493378K9232K0645J1633K666o051j4287k1620k7963l3878l9742m4838m8038
56218A321137m9241m9402m9141m8241m6529m4361m2028l9525l7099l5161l3492
56207H46917l1368k8728k6292k4363k2436k0351j8703j7716j6727j5394j4346
56196F10493j3963j3473j2084j0184q538p085n429l874l023k763k529k119j575
56183E23854o85N81J542J538Q26J07n00j222j772j570p04J18N09O88Q89J032R81
$$ plain form
56265 398419 405153 412378 420389 429333 438920 448676 458435 468478 479371 491868 506760 524447 544659
56252 544659 566821 590579 615997 643582 674342 709308 748519 790762 834860 880977 930143
56241 930143 982631 1037438 1093278 1149430 1205498 1260853 1314612 1365859 1413593 1456577 1493378
56230 1493378 1522610 1543255 1554888 1557554 1551503 1537216 1515596 1487633 1453755 1414013 1369175 1321137
56218 1321137 1271896 1222494 1173353 1125112 1078583 1034222 992194 952669 915570 880409 846917
56207 846917 815549 786821 760529 736166 713730 693379 674676 656960 640233 624839 610493
56196 610493 596530 583057 570973 560789 552251 545166 539737 535863 532840 530077 527548 525429 523854
56183 523854 523169 523750 525292 526830 527656 527763 527263 526041 524269 522699 521995 522113 522622 523310 524199 525231 526212
56166E26212P89O52Q63J630K765L805M600N365O021O073N540N328O140P452Q254
56151E91489Q397Q537R054R737J0517J1760J3688J5838J7482J8434J9290K0822
56139G55045K3199K6021K9123L2906L7560M2555M7429N2643N8934O6177P3625
56128A245217Q0956Q8134R4572R9601J03461J06693J08632J07804J03690R6724
56118B235484Q6733P3199N7435M2668L1188K2827J6664J2354Q764L156o497j9207
56106B564768l2167m3374n2141n8223o2020o5151o9524p5923q3868r2218r9136
56095A831023j02414j00800r4787q5716p4790o3235n2327m2608l3846k6274k0686
56084A133540j6919j3514r620n968l283j105J005K519L230M043N469O693P215
$$ plain form
56166 526212 527001 527653 528516 530146 532911 536716 541316 546681 552702 558775 564315 569643 575783 583235 591489
56151 591489 599886 608423 617477 627214 637731 649491 663179 679017 696499 714933 734223 755045
56139 755045 778244 804265 833388 866294 903854 946409 993838 1046481 1105415 1171592 1245217
56128 1245217 1326173 1414307 1508879 1608480 1711941 1818634 1927266 2035070 2138760 2235484
56118 2235484 2322217 2395416 2452851 2495519 2526707 2549534 2566198 2578552 2587316 2590472 2583975 2564768
56106 2564768 2532601 2489227 2437086 2378863 2316843 2251692 2182168 2106245 2022377 1930159 1831023
56095 1831023 1728609 1627809 1533022 1447306 1372516 1309281 1256954 1214346 1180500 1154226 1133540
56084 1133540 1116621 1103107 1093487 1087519 1084236 1083131 1084136 1086655 1089885 1093928 1099397 1106090 1113305
56071A113305P960R572J1055J1435J1325J1501J1392J0620J0517J2203J4415J5244
56059A250544J5067J5710J7499J9089J9714J9804J9693J9337J8977J8884J8765
56048A453083J8488J8614J9330J9835J9752J9928K0778K1309K1090K1513K3547
56037A677267K5893K7162K8205L0205L2162L2705L2862L4464L7044L8949M0378
56026B037296M2580M5006M6133M6477M7950N0738N3377N5451N7748O0157O1899
56015B604812O3448O5846O8692P1021P3507P7320Q1604Q4717Q7308R1442R7156
56004C466873J02638J07316J12239J17758J23441J29708J37179J45054J52539
55995D594745J60904J71588J83345J94207K05020K18011K33030K48498K64951
$$ plain form
56071 1113305 1121265 1130837 1141892 1153327 1164652 1176153 1187545 1198165 1208682 1220885 1235300 1250544
56059 1250544 1265611 1281321 1298820 1317909 1337623 1357427 1377120 1396457 1415434 1434318 1453083
56048 1453083 1471571 1490185 1509515 1529350 1549102 1569030 1589808 1611117 1632207 1653720 1677267
56037 1677267 1703160 1730322 1758527 1788732 1820894 1853599 1886461 1920925 1957969 1996918 2037296
56026 2037296 2079876 2124882 2171015 2217492 2265442 2316180 2369557 2425008 2482756 2542913 2604812
56015 2604812 2668260 2734106 2802798 2873819 2947326 3024646 3106250 3190967 3278275 3369717 3466873
56004 3466873 3569511 3676827 3789066 3906824 4030265 4159973 4297152 4442206 4594745
55995 4594745 4755649 4927237 5110582 5304789 5509809 5727820 5960850 6209348 6474299
55986F474299K84138L05757L28641L53968L83702M17097M52669M92288N39146
55977A0031705N93051O52207P18389P95746Q85886R89267J110364J256429J432768
55968A8465812J645318J906732K233145K633834L108232L651958M261299M935149
55960D2841479N681949O527898P514765Q686220J0069236J1655555J3396082J5220815
55952A21593999J7056597J8790441K0202617K0992815K0953550K0136902J8811380
55945B58538301J7234401J5463580J3316085J0383272O083441o7883p944246j6465192
55937B96541759k3904249k8750063l0441872k9434478k6706395k3220571j9661245
55930A14422886j6411345j3621587j1300475r398624p855575o607663n591798
$$ plain form
55986 6474299 6758437 7064194 7392835 7746803 8130505 8547602 9000271 9492559 10031705
55977 10031705 10624756 11276963 11995352 12791098 13676984 14666251 15776615 17033044 18465812
55968 18465812 20111130 22017862 24251007 26884841 29993073 33645031 37906330 42841479
55960 42841479 48523428 55051326 62566091 71252311 81321547 92977102 106373184 121593999
55952 121593999 138650596 157441037 177643654 198636469 219590019 239726921 258538301
55945 258538301 275772702 291236282 304552367 314935639 321019080 320951197 313006951 296541759
55937 296541759 272637510 243887447 213445575 184011097 157304702 134084131 114422886
55930 114422886 98011541 84389954 73089479 63690855 55835280 49227617 43635819
55923D3635819m758686m075436l513597l044890k649646k318071k040113j802346
55915A9433034j595999j419080j268323j136522j019256r16880q28116p48279
55907A0500579o75465o12060n58249n09821m64217m23392l88695l57902l29252
55898F181526l04010k82875k63677k44556k26172k09295j93111j77153j62145
55889D118532j47985j33490j18792j05363r3147q0385o6627n3236m0562k7461
55879C251484j4128k590O202J3197J8739K1798K2231K1168J8402J1680p22j8532
55867C348929m0686o5659r0328j10958j25972j36073j41743j42912j40904j37807
55857B215887j33434j25534j13740j00802q9211p8928o9394o1279n5090n0047
$$ plain form
55923 43635819 38877133 34801697 31288100 28243210 25593564 23275493 21235380 19433034
55915 19433034 17837035 16417955 15149632 14013110 12993854 12076974 11248858 10500579
55907 10500579 9825114 9213054 8654805 8144984 7680767 7257375 6868680 6510778 6181526
55898 6181526 5877516 5594641 5330964 5086408 4860236 4650941 4457830 4280677 4118532
55889 4118532 3970547 3837057 3718265 3612902 3519755 3439370 3372743 3319507 3278945 3251484
55879 3251484 3237356 3234766 3240968 3254165 3272904 3294702 3316933 3338101 3356503 3368183 3367461 3348929
55867 3348929 3308243 3242584 3152256 3041298 2915326 2779253 2637510 2494598 2353694 2215887
55857 2215887 2082453 1956919 1843179 1742377 1653166 1574238 1504844 1443565 1388475 1338428
55847A338428m5580m2209m0005l7800l4953l2277l0350k8438k5974k3630k2001
55836I75211k0643j9239j8328j8048j7451j6002j4499j3696j3152j2227j1248
55825H00678j0788j0725j0662j0554j0465j0377j0490j0973j1375j1203j0938
55814F82128j1257j1476j0278p967o249n555m504k497q34m36k44R17K402L026
55800F27176L054L551M578N297N274M665L607K247J015J51n79j310j830k222l083
55785F51591m583o118p299q512j0002j1179j1432j0987j0411r967r875j0537j1871
55772E28818j2994j3067j2068j0438q537o678n086l523j575M83J701J486L3k346
55758D56209n371q206r735r818r394r095q687q083p774p837p578o800o333o735
$$ plain form
55847 1338428 1292848 1250639 1210634 1172834 1137881 1105604 1075254 1046816 1020842 997212 975211
55836 975211 954568 935329 917001 898953 881502 865500 851001 837305 824153 811926 800678
55825 800678 789890 779165 768503 757949 747484 737107 726617 715644 704269 693066 682128
55814 682128 670871 659395 649117 641150 634901 629346 624842 622345 621511 621075 620831 621748 624150 627176
55800 627176 630230 633781 638359 643656 648930 653595 657202 659449 660464 660615 660036 658726 656896 654674 651591
55785 651591 647008 640890 633591 625079 615077 603898 592466 581479 571068 561101 551226 540689 528818
55772 528818 515824 502757 490689 480251 471714 465036 459950 456427 454852 455335 457036 458522 458555 456209
55758 456209 450838 442632 432897 423079 413685 404590 395903 387820 380046 372209 364631 357831 351498 344763
55744C44763p326p299o841o459n987n107m158l645l483l371l368l463l173k257
55730B78826j340j162j610k015k035j791j613k036l420n137n776m672k763j465
55716B41991j190j436j642j458p48J51O44P65J220K236L070L104K661K165J397
55701B52930K09q35j383k096l589n207n871n660n557n955o302o088n341m274l097
55686A91884k114j463r40m78l88o73o35J31Q83O63k79q64p35n61r13j605k159
55669A79754k272j861j168p56q94j121r24n33m68n50j80N93J106J171J375K122
55653A75394L040L579L676L612L614L708L743L455K821K275K148K042J180n08
55639B13779k147k953l086l296l954m719n028m724m131l658l446l445l601l757
$$ plain form
55744 344763 337437 330138 323297 316838 310851 305744 301586 297941 294458 291087 287719 284256 281083 278826
55730 278826 277486 276324 274714 272699 270664 268873 267260 265224 261804 256667 250891 246219 243456 241991
55716 241991 240801 239365 237723 236265 235517 235668 236312 237077 238297 240533 243603 246707 249368 251533 252930
55701 252930 253139 252304 250921 248825 245236 240029 234158 228498 222941 216986 210684 204596 199255 194981 191884
55686 191884 189770 188307 187367 186889 186501 185828 185193 185324 186207 186870 186591 185727 184992 184431 183518 181913 179754
55669 179754 177482 175621 174453 173697 172803 171682 170758 170225 169757 169207 169027 169620 170726 171897 173272 175394
55653 175394 178434 182013 185689 189301 192915 196623 200366 203821 206642 208917 211065 213107 214287 213779
55639 213779 211632 208679 205593 202297 198343 193624 188596 183872 179741 176083 172637 169192 165591 161834
55625A61834l582k976k422k423k624k138q51L13O77O38Q01R59O00j46p69j206
55609A46685j690k054j890j310q92r39j298j784k278k482k078j194l50R0J36j7
55593A26655j44j19m5j19j81J57P86J017O11K75O53J316J459J115R56J248J745
55576A37385K321K997L581L994M691N932P034P176O724O700P139P063O110N022
55562B13869M262L328J785K1j561l235n199o957p986q450q665q523q003p582p449
55547A49655o937n535m035l686m470n124m797l801k732j726q92o45j094j612j529
55532A01040r59m95k93l0L61M42m0o92r61q54p93q98q21l69P5Rm99r16r43p80
55512I1584o96o00k94N0O2k07k01L50R37R06M36L03P00R69O85L22L69N58N71Q17
$$ plain form
55625 161834 158252 155276 152854 150431 147807 145669 144818 145131 145808 146446 147247 148206 148806 148660 147891 146685
55609 146685 144995 142941 141051 139741 138849 137910 136612 134828 132550 130068 127990 126796 126446 126536 126672 126655
55593 126655 126511 126392 126347 126228 126047 126204 126990 128007 128618 128893 129546 130862 132321 133436 134392 135640 137385
55576 137385 139706 142703 146284 150278 154969 160901 167935 175111 181835 188535 195674 202737 208847 213869
55562 213869 218131 221459 223244 223265 221704 218469 213270 206313 198327 189877 181212 172689 164686 157104 149655
55547 149655 142718 137183 133148 129462 124992 119868 115071 111270 108538 106812 105920 105275 104181 102569 101040
55532 101040 100081 99586 99293 99263 99624 100066 100026 99334 98373 97519 96726 95828 95007 94638 94713 94722 94223 93307 92364 91584
55512 91584 90888 90288 89994 90044 90106 89899 89698 90048 90985 91891 92327 92630 93330 94299 94984 95306 95675 96233 96804 97621
55492I7621J516J581p5k398k919j070Q68Q56k77n15K67N69p8n25o4N39L94l41
55474I5949j160k014k773k706j308P31K055K004J036lo01p23n77l83k21o2J40
55457H9384M28Q17J130J037M46l21q86j200j269q85j3P70Q44M20K22L61K44l50
55439I1179q22o87k89j44j28J45N17M97R3j32J22M90N47L69K73J95j88p66q79
55420I0392j53Q34J197Q78O26Q84J284J418J391J291P26m28j361j210l11K13j
55403I7670k70q3J72Km46p39q31r71j218j419j395j028l13N38J166J326R84K74
55385I3419m27o49l07O4n1m61o18m33k20JM36Q67P44P2m85n68n26o52o36j77L85
55364H9778N04J81p2J34O47Q67K92p49j178m10P06Q60M2n13k40K1m31r89p78r1
$$ plain form
55492 97621 99137 100718 100643 98245 95326 94256 95124 95980 95703 95188 95455 96024 95946 95421 95357 95896 96290 95949
55474 95949 94789 92775 90002 87296 85988 86719 88774 90778 91814 91811 91210 90487 89910 89527 89306 89244 89384
55457 89384 89812 90629 91759 92796 93242 92921 92035 90835 89566 88681 88668 89438 90282 90702 90924 91285 91529 91179
55439 91179 90357 89670 89381 89237 89109 89254 89771 90268 90361 90229 90351 90841 91388 91757 92030 92225 92037 91271 90392
55420 90392 90239 91073 92270 93148 93774 94658 95942 97360 98751 100042 100768 100340 98979 97769 97458 97671 97670
55403 97670 97400 97317 97489 97491 97045 96306 95475 94504 93286 91867 90472 89444 89131 89669 90835 92161 93145 93419
55385 93419 92992 92343 92036 92100 92049 91588 90970 90537 90317 90318 90754 91621 92365 92437 91952 91384 90858 90206 89570 89393 89778
55364 89778 90282 90463 90391 90525 91172 92039 92331 91582 90404 89994 90700 91560 91602 91089 90849 90870 90439 89450 88672 88581
55344H8581J25k73n48k63K54N42N39M22L60L79L02q1o03q08n99m69p61j085q77
55325H5137k00L59M22P6m03p44p79n67l28j03K25N40N67M15M91P43O80L51M78
55306H7360J181J470P05k56k65L67M23l42r86q75l38J43M45M36o0p49r94o16j4
55287H7035M84Q60J036Q84O67P77J113J270J294J469J577J056qr60j530j913j897
55270I3214j027K40P22J99j79L03Q86P69M62O95R99N44k67l29M09R21P11K53q6
55251I9439m95r53j008n52o0J95M28O21K66p52j692j829j349q83o18k89K09O58
55233I1336Q10N72L8m19l49K42P77P45K95j1J75P65J398J633J232M83K2R6K74
55214A00114J17k07l38l71o04q38n52K89J121J507J483J168N83p1m39m63m28m19
$$ plain form
55344 88581 88706 88433 87885 87622 87876 88418 88957 89379 89739 90118 90420 90339 89736 88928 88329 87860 87099 86014 85137
55325 85137 84937 85296 85718 85794 85391 84647 83868 83301 82973 82870 83095 83635 84202 84617 85108 85851 86531 86882 87360
55306 87360 88541 90011 90716 90460 90195 90562 90985 90643 89657 88782 88444 88587 89032 89468 89408 88659 87665 87049 87035
55287 87035 87519 88379 89415 90299 90966 91743 92856 94126 95420 96889 98466 99522 99514 98554 97024 95111 93214
55270 93214 92187 92427 93149 93348 93169 93472 94358 95127 95589 96284 97283 97827 97560 97231 97640 98561 99272 99525 99439
55251 99439 98944 97991 96983 96431 96371 96566 96994 97615 97881 97129 95437 93608 92259 91376 90758 90469 90678 91336
55233 91336 92146 92718 92756 92337 91988 92230 93007 93752 94047 94036 94211 94976 96374 98007 99239 99722 99744 99840 100114
55214 100114 100231 100024 99686 99315 98711 97873 97321 97610 98731 100238 101721 102889 103472 103401 102962 102499 102071 101652
55196A01652j98K53N17L58N8o8j13k09k09q6k09p28j071o37K96Q61P15K40j43
55177A01279l08j83K44O13M45j78o78p39n44k72Q4K95ko27q15j73Q01J457J740
55158A02439J823J512O08m54r22o44k01j63n04p64n33J22O20L57n59j257j067
55141A00413l10J80J03j50k15j90k24j98j3Q6k28q36j199r27k61J93J32j42j57
55122I6057J67N31P12P07N52K40o9j26R4L09K64n1n26r84j092n66L63J009R38
55103I8529M83M24J193K411L026K172J90j368j284n3Q53R11Q99J304J522J072
55087A12284N30N48P79N89K51L60O80N04j53o64q77j082j127n78K53M25l00j105
55069A11317j258q87l88J13M86M05j51o88p36k60N37J377J791J413N11k19n07
$$ plain form
55196 101652 101454 101707 102224 102582 102640 102572 102459 102250 102041 101955 101746 101018 99947 99310 99606 100467 101182 101422 101279
55177 101279 100971 100788 101032 101645 102090 101912 101234 100495 99951 99679 99763 100058 100056 99429 98614 98441 99242 100699 102439
55158 102439 104262 105774 106382 105928 105006 104362 104161 103998 103494 102730 102197 102319 102939 103296 102737 101480 100413
55141 100413 100103 100283 100386 100236 100021 99831 99607 99409 99396 99482 99254 98418 97219 96292 96031 96224 96356 96214 96057
55122 96057 96224 96755 97467 98174 98726 98966 98897 98771 98865 99174 99438 99387 98861 97877 96785 96219 96582 97591 98529
55103 98529 99012 99436 100629 103040 106066 108238 108428 107060 105776 105723 106576 107487 108386 109690 111212 112284
55087 112284 112814 113362 114141 114730 114981 115341 116021 116525 116372 115708 114831 113749 112622 112044 112297 112722 112422 111317
55069 111317 110059 109172 108784 108897 109383 109788 109637 108949 108213 107953 108490 109867 111658 113071 113582 113363 112856
55052A12856o53q59r77r86j115j333j336j087q43o03j75K12J65KM42J312J590
55035A06612J002M51M18K05n70r46j90O61J98j110j548o51L25L92o8l26k66l8
55017A04551L49O72N07m7l22o6J37k10p30p19p2P46J308J518J463J317J190R85
54999A12577N26k4k00J69O08M56l94j286j388n22N05O75m0o08k77L82L57l25p02
54980A10489l12K79M47K31j39n82p82k07R91J771J431N57J21J55O3j23K80J353
54962A16023K189J993J072L38K06L35K67l5k37p5L54O57N08n6o56q89o08l2M23
54943A21777M91L52L90O79Q61O84L88L42M64L51m1k49J17Q41J373J505J532J766
54925A33623K036J896J316J012J777L480M991N317M584L770L589L944M343M504
$$ plain form
55052 112856 112203 111344 110367 109381 108266 106933 105597 104510 103667 103064 102889 103101 103266 103268 103710 105022 106612
55035 106612 107614 108065 108483 108688 108118 107172 106982 107643 107841 106731 105183 104532 104857 105249 105181 104855 104589 104551
55017 104551 104900 105572 106079 106032 105710 105644 105781 105571 104841 104122 104050 104796 106104 107622 109085 110402 111592 112577
54999 112577 113103 113079 112879 113048 113656 114112 113718 112432 111044 110522 111027 111702 111662 111054 110777 111159 111516 111191 110489
54980 110489 110177 110456 110903 111134 110995 110413 109631 109424 110415 112186 113617 114174 114295 114450 114513 114390 114670 116023
54962 116023 118212 120205 121277 121615 121821 122156 122423 122388 122151 122076 122430 123087 123595 123539 122883 121994 121386 121354 121777
54943 121777 122268 122620 123010 123689 124550 125234 125622 125964 126428 126779 126738 126489 126606 127447 128820 130325 131857 133623
54925 133623 135659 137555 138871 139883 141660 145140 150131 155448 160032 163802 167391 171335 175678 180182
54911A80182M446M214L687K613Q31j417l475m779n375n719n994n887n179m244
54897A53904l706l764m051m078l615k641j330j27M22J69l22k18P06J737J974J366
54881A36426Q02J101K076K852K965K825L094L888M800N456N761N733N325M559
54867A87663L644K877K300J566K20j718l570m622m892m984n209n230m764m172
54853A59109l938l865l331k270j409j393k040k589k504j927j473j636k191k407
54839A26136j902j163q85j064j214j172j064o13N73J948K191R28n34q01j01K97
54823A21560j24p66r74o47O7Q37J026K90o84p96k0N33J98l54k49L27N39J70k47
54804A20686k73l6J60K13K02K18L01L77L29J99K03L90M48M0o94j186j020l26M33
$$ plain form
54911 180182 184628 188842 192529 195142 195973 194556 191081 186302 180927 175208 169214 163327 158148 153904
54897 153904 150198 146434 142383 138305 134690 132049 130719 130592 131014 131183 130861 130643 131349 133086 135060 136426
54881 136426 137228 138329 140405 143257 146222 149047 152141 156029 160829 166285 172046 177779 183104 187663
54867 187663 191307 194184 196484 198050 198270 196552 192982 188360 183468 178484 173275 168045 163281 159109
54853 159109 155171 151306 147975 145705 144296 142903 140863 138274 135770 133843 132370 130734 128543 126136
54839 126136 124234 123071 122186 121122 119908 118736 117672 117059 117632 119580 121771 122699 122165 121364 121263 121560
54823 121560 121436 120670 119696 119049 119116 119953 120979 121269 120585 119789 119769 120302 120500 120146 119897 120224 120763 120933 120686
54804 120686 120413 120377 120537 120750 120952 121170 121471 121848 122177 122376 122579 122969 123417 123457 122763 121577 120557 120231 120664
54785A20664R51J248J396J240P01K00L56J121J682J554J300J667K370K485J838
54770A40773J196J097J312J663K482L863N152N704N678N585N546N416N254N117
54756A95838M776M105L386K737J636l72k795m640n561n968o173o095n774n517
54742A69583n367m992m225l341k652k171j773j384r21l35K45N76N63K83p8j82
54726A43829L50J456K449K692K335K013K064K458L216M253M920M507L256K229
54712A82027K033K241K215J791R10o39k674m356n016m898m667m546m395m208l980
54697A51838l397k315j330j256j970k435j965j014n02p38j212j233n45M64J032
54682A33422O52l83j225j336r86p36o66m46RL26K37l9j10P8L16M64M48J05o17
$$ plain form
54785 120664 121615 122863 124259 125499 126200 126400 126756 127877 129559 131113 132413 134080 136450 138935 140773
54770 140773 141969 143066 144378 146041 148523 152386 157538 163242 168920 174505 180051 185467 190721 195838
54756 195838 200614 204719 208105 210842 212478 212106 209311 204671 199110 193142 186969 180874 175100 169583
54742 169583 164216 159224 154999 151658 149006 146835 145062 143678 142757 142422 142667 143243 143806 144089 144011 143829
54726 143829 144179 145635 148084 150776 153111 155124 157188 159646 162862 167115 172035 176542 179798 182027
54712 182027 184060 186301 188516 190307 191217 190578 187904 183548 178532 173634 168967 164421 160026 155818 151838
54697 151838 148441 146126 144796 143540 141570 139135 137170 136156 135654 134916 133704 132471 131926 132390 133422
54682 133422 134074 133691 132466 131130 130144 129408 128742 128296 128305 128631 128868 128829 128719 128797 129113 129577 130025 130130 129513
54663A29513j323j468r91l80m5J0j28m84r63j304j419j462j315o07M99J145Q71
54646A20149L40L76P39O52J46n4J87K61m6j95R1L62L15L77R62J747K085J700O93
54627A30887n93j493j422p19m19q06r70l20K89k03j302j545n32O58J054Q19N12
54610A23895K34j37l90j97L62P77N66k72j123j224m45M90Q84Q70J028J374J357
54593A28049P51Nm06m15j15M16Q30N96l56j357j706j365p68k58M9O4k30n85o11
54574A22588j68L94M96q3q30q83lJ021J264P82M27O60J103J297J324J386J280
54557A32055P36p0p11r97r74o91k95j30l75p03o35j68K99N34O84R18J178J253
54539A31908R45J63p86j210o08O79J782K242K318K354K278J912J374Q63K78n51
$$ plain form
54663 129513 128190 126722 125731 125351 125306 125316 125188 124704 123741 122437 121018 119556 118241 117634 118133 119278 120149
54646 120149 120489 120865 121604 122256 122402 122348 122535 122796 122750 122555 122646 123008 123323 123700 124662 126409 128494 130194 130887
54627 130887 130294 128801 127379 126660 126241 125435 124465 124145 124434 124231 122929 121384 120852 121510 122564 123383 123895
54610 123895 124129 123992 123602 123405 123767 124544 125110 124838 123715 122491 122046 122536 123420 124290 125318 126692 128049
54593 128049 128800 128805 128399 127984 127869 128285 129115 129711 129355 127998 126292 124927 124159 123901 123950 124014 123784 123199 122588
54574 122588 122420 122814 123310 123227 122397 121514 121511 122532 123796 124578 125005 125665 126768 128065 129389 130775 132055
54557 132055 132791 132721 132010 131013 130039 129348 129053 128923 128548 127845 127210 127042 127341 127875 128559 129477 130655 131908
54539 131908 132853 133016 132230 131020 130412 131091 132873 135115 137433 139787 142065 143977 145351 146214 146492 145941
54523A45941j374j639j172m83k33n26q27n45K75R64R01K07l74l55l7q4o66j318
54505A38655j573j391r49k93N12J103J041L47l89o04l23k0N8J49M93P16P5j528
54487A36079l020l071j512M46J529J575J277J121J020Q43P55R34J253J417J258
54472A41904Q00K28j23L7N82R69P92K36j57j14J28J69p8k74mP21J364J421J051
54453A49652Q98J251J623J347L77o85j256j213p99l74k61n48r61j087q22m83l77
54436A46282m39m05k70k84m45l30K81Q26M90n76j207o78L28P14M96N06Q60Q09
54418A46958J74j33M22R89N88l57o08J29R92J272J074P00K30j89l47l80n65p18
54400A50231l71L68Q35Q10P48Q72Q03M58M57J147J891J910J318O55J8p10j161
$$ plain form
54523 145941 144567 142928 141756 141273 141040 140514 139687 139142 139417 140381 141282 141489 141115 140760 140723 140639 139973 138655
54505 138655 137082 135691 134742 134449 134961 136064 137105 137452 137063 136459 136136 136116 136174 136323 136816 137532 137607 136079
54487 136079 133059 129988 128476 128922 130451 132026 133303 134424 135444 136287 137042 137976 139229 140646 141904
54472 141904 142704 142932 142809 142846 143428 144397 145189 145425 145268 145154 145282 145451 145373 145099 145095 145816 147180 148601 149652
54453 149652 150550 151801 153424 154771 155148 154463 153207 151994 151195 150821 150560 150012 149051 147964 147142 146659 146282
54436 146282 145843 145438 145168 144884 144439 144109 144390 145216 145706 145130 143923 143245 143573 144287 144783 145289 146149 146958
54418 146958 147132 146999 147421 148410 148998 148641 148033 148162 149154 150426 151500 152200 152430 152241 151894 151514 150949 150231
54400 150231 149860 150228 151063 151873 152621 153493 154296 154754 155211 156358 158249 160159 161477 162132 162150 161440 160279
54383A60279q95k98k03o94r94o09O9M14K12m22j300k070k293j828r28M2P19P09
54365A49910o3r50j122n80j22j63j78L66J165J515J249O98J24l58n47l96k79n37
54347A49732q50o61j42j69j114k161k185j063K25P02L59o8p2P3j92q73j350j172
54329A39019n41Q3N89J075J438J473J246R69O33J69j58k4K78P1o86j178q13l9
54311A43604L33J72k2Q4L84O79Q37O98K76j9K98J207K240L033L429L205K198Q46
54293A63482Q1K70O36J41j157k165k117j498j252j492j445o94J56L18r4l76l36
54276A52458m47q67j037n55J71N48O36Q04R37N81k95j164j522j232m45M26Q22
54259A49819N39L6k11l65p58j051n94M69J211J096N15O3m5K26P94J157P18l15
$$ plain form
54383 160279 159384 159086 158883 158189 157195 156586 156655 157069 157281 156859 155559 153489 151196 149368 148440 148482 149201 149910
54365 149910 149847 148897 147775 147195 147073 146910 146732 147098 148263 149778 151027 151725 151849 151491 150944 150548 150269 149732
54347 149732 148882 148221 148079 147910 146796 144635 142450 141387 141612 142314 142673 142605 142533 142606 142414 141541 140191 139019
54329 139019 138478 138561 139150 140225 141663 143136 144382 145351 145984 146153 145995 145971 146249 146320 145634 144456 143643 143604
54311 143604 143937 144109 144087 144171 144555 145234 146071 146769 147045 147026 147324 148531 150771 153804 157233 160438 162636 163482
54293 163482 163563 163833 164469 164610 163453 161288 159171 157673 156421 154929 153484 152790 152946 153264 153170 152794 152458
54276 152458 152011 151144 150107 149552 149723 150271 150907 151711 152648 153229 152934 151770 150248 149016 148571 148997 149819
54259 149819 150358 150394 150183 149818 149060 148009 147415 147884 149095 150191 150706 150769 150724 150950 151744 152901 153619 153304
54241A53304j048j123j074j236j140m62J93J55k79m19k78l58p07r56j041j198
54225A42333j350j127m27M54J159J426J155O53M61N74K78p12j544j304l34K90
54209A41985K61J11P7j44n50o98m79k64j84KK46K11KJ32O44R68Q97R10J254J424
54189A46805Q99n5p21o74jQ54J309J095N98L08R4m42j093j244r27p09n58R4R99
54170A46631J014j13j050p20J41K09m98r26o14J4N74R87R88L78m20p17m69j73
54152A45236n2N0J72K43M21P95R82O14K7j96j24j92k22L15J127J159N2j240j645
54133A47522j143m35LJ10r8n59j035j188q45j25N59P91O04M81O85Q44O13M17Q71
54114A48072J646J645M71r58j437p39M00J059P81j28p67m18O23J353J222O13J31
$$ plain form
54241 153304 152256 151133 150059 148823 147683 147221 147414 147569 147290 146871 146593 146235 145528 144572 143531 142333
54225 142333 140983 139856 139429 139883 141042 142468 143623 144276 144737 145311 145589 144877 143333 142029 141695 141985
54209 141985 142246 142357 142434 142290 141740 141042 140563 140299 140115 140117 140363 140574 140576 140708 141352 142320 143217 144127 145381 146805
54189 146805 147704 147649 146928 146254 146253 147107 148416 149511 150109 150417 150511 150069 148976 147732 146805 146096 145538 145632 146631
54170 146631 147645 147532 146482 145762 145903 146112 145614 144688 144074 144088 144662 145649 146637 147015 146595 145878 145409 145236
54152 145236 145184 145234 145406 145649 146070 146865 147847 148461 148488 148292 148168 147976 147754 148069 149196 150355 150407 149167 147522
54133 147522 146379 145944 145947 146057 145959 145400 144365 143177 142332 142207 142766 143557 144161 144642 145327 146171 146784 147201 148072
54114 148072 149718 151363 151834 150876 149439 148700 149100 150159 150940 150812 150045 149627 150250 151603 152825 153438 153569
54097A53569l9J23P33J625K164J875J051L56K8j92m96p23o29j88L77P82R01Q37
54079A62154O91L90j03n34n99l77k15j91o5K36M68M71L41J24k14m78k87L56R62
54060A63130J203J202J034M62m67j028n76N78J466J546J119P64P35Q68R48J029
54044A74013J370J940K186J684R54J000J994L021L375L435L828M418M738M899
54030B12855N275N646N477M894M572M728M975N141N521O093O282N707M679L662
54016B85507K710J726Q29J87j62j67J84N04J91p82j714k113k279k649l061l182
54000B75729l192l426l674l571l422l853m690m976m241l066k176j668j381j353
53986B31040j493j391r90r34j698k716l005k379j430n81J36N01J72o06j084r79
$$ plain form
54097 153569 153530 153653 154386 156011 158175 160050 161101 161457 161485 161293 160797 160074 159445 159257 159634 160416 161317 162154
54079 162154 162845 163235 163132 162598 161999 161622 161407 161216 161151 161387 161855 162326 162667 162791 162577 162099 161812 162168 163130
54060 163130 164333 165535 166569 167031 166564 165536 164960 165538 167004 168550 169669 170433 171168 172036 172984 174013
54044 174013 175383 177323 179509 181193 182147 183147 185141 188162 191537 194972 198800 203218 207956 212855
54030 212855 218130 223776 229253 234147 238719 243447 248422 253563 259084 265177 271459 277166 281845 285507
54016 285507 288217 289943 290772 290959 290797 290630 290814 291318 291509 290727 289013 286900 284621 281972 278911 275729
54000 275729 272537 269111 265437 261866 258444 254591 249901 244925 240684 237618 235442 233774 232393 231040
53986 231040 229547 228156 227166 226232 224534 221818 218813 216434 215004 214423 214559 215060 215232 214626 213542 212563
53970B12563p20n81k78K77N88L91K08O12J390K040K610L371M094M403M563N139
53954B40670O032O612O750O923P287P418P123O794O675O351N342L673J645n42
53940C18753k654m347n435n919n695m707l488k757k368j390L32J641J681J245
53926B84892J560K396K557J877J422J675J796J166N55J033K366L364L477L331
53912C13467L749M819O016O836P156P210P319P544P606P189O330N401M723M267
53898C99632L727K819J500Jj281j978j973j493j031j048j719k848l985m677m770
53883C80876m591m711n364o104o297n878n432n434n758n967n778n113m063l055
53869C07331k683l005l305l011k612l051m295n166m770l586k786k892l477l880
$$ plain form
53970 212563 211843 211262 210984 211261 211849 212240 212448 213060 214450 216490 219100 222471 226565 230968 235531 240670
53954 240670 246702 253314 260064 266987 274274 281692 288815 295609 302284 308635 313977 317650 319295 318753
53940 318753 316099 311752 306317 300398 294703 289996 286508 283751 281383 279993 280325 281966 283647 284892
53926 284892 286452 288848 291405 293282 294704 296379 298175 299341 299896 300929 303295 306659 310136 313467
53912 313467 317216 322035 328051 334887 342043 349253 356572 364116 371722 378911 385241 390642 395365 399632
53898 399632 403359 406178 407678 407679 406398 404420 402447 400954 399923 398875 397156 394308 390323 385646 380876
53883 380876 376285 371574 366210 360106 353809 347931 342499 337065 331307 325340 319562 314449 310386 307331
53869 307331 304648 301643 298338 295327 292715 289664 285369 280203 275433 271847 269061 266169 262692 258812
53855B58812l807l252k361j469r67r50j097j115j137j494k077k330k029j735k101
53840B30891k850k963j989p07k15p06j502j996k110j980j663j229p94m22j66p4
53824B09525lM00J140J505P76o82j617j308l41K67K31k8j90k92l56j91L18R79
53806B10133J481J709J881K307K947L303K953K201J913K560L751M780N350N577
53792B52846N552N313N052N006N169N334N373N265N012M706M565M655M663M302
53778C22813L796L647L921M129L821L016J984R65K25mJ29L7p58k186l925n886
53762C35724q102j0269j1733j2042j1322j0087q784p524o145m576l146k412k486
53749B37096k730k440j756j530k147k889k750j660n62l02p61j119p76Q4P31N85
$$ plain form
53855 258812 255005 251753 249392 247923 246956 246006 244909 243794 242657 241163 239086 236756 234727 232992 230891
53840 230891 228041 225078 223089 222382 222167 221461 219959 217963 215853 213873 212210 210981 210187 209765 209599 209525
53824 209525 209522 209922 211062 212567 213343 212661 211044 209736 209395 209662 209893 209865 209675 209383 209027 208836 209154 210133
53806 210133 211614 213323 215204 217511 220458 223761 226714 228915 230828 233388 237139 241919 247269 252846
53792 252846 258398 263711 268763 273769 278938 284272 289645 294910 299922 304628 309193 313848 318511 322813
53778 322813 326609 330256 334177 338306 342127 345143 347127 348092 348317 348313 348442 348479 347721 345535 341610 335724
53762 335724 327622 317353 305620 293578 282256 272169 263385 255861 249716 245140 241994 239582 237096
53749 237096 234366 231926 230170 228640 226493 223604 220854 219194 218632 218330 217569 216450 215674 215758 216489 217074
53733B17074j92p90n14N14J468J707J335Q40M14j33q10j208r94m41j24j89j54
53716B17803L97J256J858J944J726J505J422J539J849K106J935J358J025J619
53702B39342L001M179M258L301K207J735J817J899J774J747J888J620M84r64j703
53687B66585j597j504j881k160j914j755k299k858k292q71q2n53j281j220o28
53672B43690k63j61M8K35n7p92j529k043k277j974j001R3M74J2o45r49r53r13
53654B30995r36j039j186j145p05n6L41L56K99M33O47P24O16M14K39K10L45M55
53636B31007M02L05L30L47K19K36Q32J865K633K716K329J826J282P08L16L24Q05
53619B48482J752K962L806L638K592J638J594K422L560M444M580L675K104Q34
$$ plain form
53733 217074 216882 216092 215578 216092 217560 219267 220602 221442 221856 221723 220913 219705 218711 218270 218146 217957 217803
53716 217803 218200 219456 221314 223258 224984 226489 227911 229450 231299 233405 235340 236698 237723 239342
53702 239342 242343 246522 250780 254081 256288 258023 259840 261739 263513 265260 267148 268768 269252 268288 266585
53687 266585 264988 263484 261603 259443 257529 255774 253475 250617 248325 247454 247372 246819 245538 244318 243690
53672 243690 243427 243266 243314 243549 243492 242700 241171 239128 236851 234877 233876 233969 234443 234455 233810 232861 231908 230995
53654 230995 230059 229020 227834 226689 225984 225928 226269 226625 226924 227357 228004 228728 229344 229758 229997 230207 230552 231007
53636 231007 231409 231714 232044 232391 232610 232846 233678 235543 238176 240892 243221 245047 246329 247037 247353 247677 248482
53619 248482 250234 253196 257002 260640 263232 264870 266464 268886 272446 276890 281470 285145 287249 288083
53605B88083M97Q22J269J689K086K204J872J379J009N65r1m86j57M64N76J47k03
53588C01725l38p35j451j834j466p49k96l42q97j801k477k327j639j414j912k255
53572B79792j883j505j817k124j310L19J362J234O59K50k07p99q88l9J190J890
53556B76124J751J043K14j61L81J528K304K236J929K052K419K603K780L217L476
53541C03896L126K737L154M013M148L440L054L680M726N618O754Q444R879J0044
53527C76713R184Q461Q572R358J0417J1430J2121J2528J3110J4109J5026J5270
53515E16299J5023J4935J5321J6170J7586J9404K0766K0978K0664K1062K2209
53504G20417K2808K2126K0942K0282K0135J9989J9782J9576J8944J7581J6189
$$ plain form
53605 288083 288580 289402 290671 292360 294446 296650 298522 299901 300910 301475 301384 300898 300741 301205 301781 301928 301725
53588 301725 301387 300652 299201 297367 295901 295152 294856 294514 293617 291816 289339 287012 285373 283959 282047 279792
53572 279792 277909 276404 274587 272463 271153 271472 272834 274068 274727 274977 274770 273971 273083 273044 274234 276124
53556 276124 277875 278918 279132 278971 279352 280880 283184 285420 287349 289401 291820 294423 297203 300420 303896
53541 303896 307022 309759 312913 316926 321074 324514 327568 331248 335974 341592 348346 356790 366669 376713
53527 376713 385897 394358 402930 412288 422705 434135 446256 458784 471894 486003 501029 516299
53515 516299 531322 546257 561578 577748 595334 614738 635504 656482 677146 698208 720417
53504 720417 743225 765351 786293 806575 826710 846699 866481 886057 905001 922582 938771
53493I38771J5817J6448J6898J6232J4685J3191J2425J2479J2979J3321J3051
53482A096297J2209J1301J0789J0612J0196Q981P020N086L928L335K241o6l066
53469A178863n618p203q212r188j0304j1570j3069j4706j6077j6922j7529j8409
53457A030056j9589k0469k0515j9873j9214j9026j9224j9348j9003j8103j6918
53446H18774j5925j5451j5330j5060j4364j3423j2461j1368r984q487p128n753
53434F74040m027k074m24P59J967L648N601P282Q482R424J0323J1155J1878J2766
53420G50800J4269J6441J8586J9885K0449K1348K3189K5171K6106K6073K6315
53409I88632K7582K9479L1443L3445L5462L7122L8378L9806M1685M3366M4264
$$ plain form
53493 938771 954588 971036 987934 1004166 1018851 1032042 1044467 1056946 1069925 1083246 1096297
53482 1096297 1108506 1119807 1130596 1141208 1151404 1160385 1167405 1172491 1176419 1179754 1181995 1181929 1178863
53469 1178863 1173245 1166042 1157830 1148642 1138338 1126768 1113699 1098993 1082916 1065994 1048465 1030056
53457 1030056 1010467 989998 969483 949610 930396 911370 892146 872798 853795 835692 818774
53446 818774 802849 787398 772068 757008 742644 729221 716760 705392 695408 686921 679793 674040
53434 674040 670013 667939 667515 668274 670241 673889 679490 686772 695254 704678 715001 726156 738034 750800
53420 750800 765069 781510 800096 819981 840430 861778 884967 910138 936244 962317 988632
53409 988632 1016214 1045693 1077136 1110581 1146043 1183165 1221543 1261349 1303034 1346400 1390664
53398A390664M4850M5941M7441M8545M8962M9061M8996M8458M7348M6026M4762
53387A911054M3485M2149M0888L9672L8152L5952L2865K8917K4550K0564J7375
53376B275623J4414J0775O352J772k665p282j2146j6726k0731k4698k9215l4090
53364B161383l8684m2695m6094m8693n0357n1452n2515n3526n4027n3881n3425
53353A616034n2747n1467m9515m7608m6407m5521m4010m1866m0159l9409l8606
53342A118719l6593l3912l2217l1910l1472k9578k6864k4791k3584k2294k0525
53331H04979j8822j7469j5980j4171j2631j1662j0548q598o247m392l035j520
53319F79904J58J243J474J595K289L333M216N101O519Q476J0440J2077J3436J4441
$$ plain form
53398 1390664 1435514 1481455 1528896 1577441 1626403 1675464 1724460 1772918 1820266 1866292 1911054
53387 1911054 1954539 1996688 2037576 2077248 2115400 2151352 2184217 2213134 2237684 2258248 2275623
53376 2275623 2290037 2300812 2307164 2308936 2306271 2298989 2286843 2270117 2249386 2224688 2195473 2161383
53364 2161383 2122699 2080004 2033910 1985217 1934860 1883408 1830893 1777367 1723340 1669459 1616034
53353 1616034 1563287 1511820 1462305 1414697 1368290 1322769 1278759 1236893 1196734 1157325 1118719
53342 1118719 1082126 1048214 1015997 984087 952615 923037 896173 871382 847798 825504 804979
53331 804979 786157 768688 752708 738537 725906 714244 703696 695098 688851 684459 681424 679904
53319 679904 680062 681305 682779 684374 686663 689996 694212 699313 705832 714308 724748 736825 750261 764702
53305G64702J4893J5107J5912J7577J9253J9992K0075K0688K2365K4350K5649
53294I80563K6138K6343K6520K6372K5621K4474K3494K3039K2822K2131K0525
53283A248042J8218J5611J2680R252N747L019J298k41k509n492q457j0807j2522
53270A273839j3996j5712j7814j9770k0855k1097k1331k2122k3120k3825k4381
53259A049816k5207k6260k7269k8233k9115k9447k8935k8114k7727k7692k7370
53248G44447k6606k5777k5008k4140k3326k2818k2328k1335k0085j9351j9148
53237D94525j8566j7100j5352j4120j3496j3122j2683j1839j0321q462p078o541
53225C45845o400o089n537m878m193l752l846m142l926l191k748k981l262l111
$$ plain form
53305 764702 779595 794702 810614 828191 847444 867436 887511 908199 930564 954914 980563
53294 980563 1006701 1033044 1059564 1085936 1111557 1136031 1159525 1182564 1205386 1227517 1248042
53283 1248042 1266260 1281871 1294551 1303803 1309550 1312569 1313867 1313626 1311117 1305625 1297168 1286361 1273839
53270 1273839 1259843 1244131 1226317 1206547 1185692 1164595 1143264 1121142 1098022 1074197 1049816
53259 1049816 1024609 998349 971080 942847 913732 884285 855350 827236 799509 771817 744447
53248 744447 717841 692064 667056 642916 619590 596772 574444 553109 533024 513673 494525
53237 494525 475959 458859 443507 429387 415891 402769 390086 378247 367926 359464 352386 345845
53225 345845 339445 333356 327819 322941 318748 314996 311150 307008 303082 299891 297143 294162 290900 287789
53211B87789l010l463m040m108l882l881l864l239k119j202q26q94j413k254k633
53196B46961j831m01L02j86r89j252j082q89o21j66Q8k94j060j496j228m96K57
53179B35617P03O13j24j249k084j957q69L98R77P24K22RM4r6o86j565k207k117
53161B26353j414q25p89p41O1J212J497P04MJ55L81k43j259j661j495j448j393
53144B19099o89L51P01L18K86R57J269M80n80o96Q1P97R34O48J14m72n66K05J214
53125B24451J265L3j455k029j659j293j548k008j875j022r4L99O17Q80J027P69
53109B16458L74L60O54N74j80j157j849k223k340k011j235n55n20r83j358j297
53093B02712r09m66k50m62r19j026m14M85Q63N20N4K7K60J53m90j207j438j171
$$ plain form
53211 287789 284779 281316 277276 273168 269286 265405 261541 258302 256183 254981 254155 253261 251848 249594 246961
53196 246961 245130 244729 245031 244845 243856 242604 241522 240633 240012 239846 239934 239640 238580 237084 235856 235360 235617
53179 235617 236320 236933 236809 235560 233476 231519 230650 231048 232025 232749 232971 232980 233024 232928 232242 230677 228470 226353
53161 226353 224939 224114 223325 222584 222645 223857 225354 226058 226062 226217 226598 226355 225096 223435 221940 220492 219099
53144 219099 218410 218761 219462 219780 220066 221023 222292 222772 222192 221496 221577 222374 223308 223956 224070 223598 223032 223237 224451
53125 224451 225716 225749 224294 222265 220606 219313 217765 215757 213882 212860 212766 213165 213782 214662 215689 216458
53109 216458 216832 217192 217846 218420 218240 217083 215234 213011 210671 208660 207425 206870 206350 205367 204009 202712
53093 202712 201803 201337 201087 200625 199706 198680 198266 198751 199614 200134 200188 200215 200475 200628 200138 198931 197493 196322
53075A96322q90r55j241j466j587j647j434p26J61N30J18n84r73r77q69p32m57
53058A82593n7K83M02K79jk36k76k79n36r00o91M21J726K093J276J64k98q6J76
53039A86053J07j16j95j27j02k16m04o21q53r77q23m34j27n7L1M01P94O67j9o47
53019A82335p29m85m19n57m33K14J025J369J016L66kO5K20J60j3o1k4l5mJ21o9
52998A84060r35j923k015j241q82j660k461j781J11J444J315O67O54J012P67r7
52982A77035n00K23J398J822J170K81R3O03J054J031R08J065J101L80q07j314
52966A85543n14Q92J764J709J111L76k97o83o69n67p80j173j214p93m04m15n96
52949A83290n60k64R0L06J36o34j657k026j204K70J389J695J311L41j057k240
$$ plain form
53075 196322 195432 194477 193236 191770 190183 188536 187102 186376 186537 187067 187185 186601 185628 184651 183782 183050 182593
53058 182593 182536 182819 183221 183500 183499 183263 182987 182708 182172 181272 180581 181002 182728 184821 186097 186261 185963 185877 186053
53039 186053 186160 186044 185849 185722 185620 185404 185000 184379 183526 182549 181726 181292 181165 181108 181139 181540 182334 183001 182982 182335
53019 182335 181606 181121 180702 180145 179712 179926 180951 182320 183336 183702 183700 183765 183985 184145 184132 184071 184047 184012 184008 184129 184060
52998 184060 183125 181202 179187 177946 177064 175404 172943 171162 171273 172717 174032 174699 175353 176365 177132 177035
52982 177035 176535 176758 178156 179978 181148 181429 181522 182125 183179 184210 185118 186183 187284 187664 186857 185543
52966 185543 185029 185921 187685 189394 190505 190881 190584 189901 189232 188665 187885 186712 185498 184705 184301 183886 183290
52949 183290 182730 182466 182556 182862 182998 182364 180707 178681 177477 177747 179136 180831 182142 182483 181426 179186
52933A79186k520k055j686j722j602r69l53l36o40o23k10K31N90J007J338J256
52917A70892Q49N15L34L7l76m82p7M69O91M78k8o66j179j211p08q5J89Q8p5r2
52897A69563p3k02n08q17q50m02M24J162J250N59m19r87r37o60m92k03N37J435
52879A68380J816J596J398J563J601J009R2m66m74j63L95J136J606J330N55K0
52863A81394J4K29M04N90P66Q43J032J585K080J743O54n0M14J424J747R84j83
52846A95670q77q07l31j16n60j386j946j924j583j271j145j352j979k674k791
52831A74928k203j454r05k55P36J578J657J159P84P49O47K40j44r7L04N33J83
52814A78440n31q48k08J033J932K028J733J594J611J581J646K019K443K408J799
$$ plain form
52933 179186 176666 174611 172925 171203 169601 168632 168279 167943 167303 166680 166470 166701 167291 168298 169636 170892
52917 170892 171741 172256 172590 172627 172251 171769 171692 172161 172852 173330 173302 172636 171457 170246 169538 169453 169642 169730 169655 169563
52897 169563 169490 169288 168780 167963 167113 166711 167135 168297 169547 170106 169687 168700 167763 167103 166611 166408 166945 168380
52879 168380 170196 171792 173190 174753 176354 177363 177455 176989 176515 176352 176747 177883 179489 180819 181374 181394
52863 181394 181408 181637 182041 182631 183397 184240 185272 186857 188937 190680 191334 191284 191698 193122 194869 195853 195670
52846 195670 194793 193986 193655 193539 192979 191593 189647 187723 186140 184869 183724 182372 180393 177719 174928
52831 174928 172725 171271 170366 170111 170847 172425 174082 175241 176025 176774 177421 177661 177517 177420 177724 178257 178440
52814 178440 177909 177061 176853 177886 179818 181846 183579 185173 186784 188365 190011 192030 194473 196881 198680
52799A98680R95M26J81m4p25k053l454l976l355k408k085k397k617k241j374m65
52783A73088K6j79q90j507j562j093l86K66M38k43j413k017j501n73k06l87m24
52766A61437q7L69R45J821K625K670J900R77L68j9l06m38m94o18o05k22J26j32
52748A70317n97j98J088J844J094k55o60M5P31P48O22R78J629K032K084K049J950
52731A85501J478N22n80j383j714j541p56N05J517J551Q67N21Q54R09r6j382j585
52714A85188p52l02j046k269k976l032k727k034r55M7N43O66O94N23Jn71q03p40
52696A69455n84k48L26O46K11n94p36K17J527K061J392K8j119j475j175q16p35
52679A68381o22MJ094K060K430K240J773J169M03m38r96q78j25O19O82J27l13
$$ plain form
52799 198680 199675 200101 200282 200238 199513 197460 194006 190030 186675 184267 182182 179785 177168 174927 173553 173088
52783 173088 173114 172935 172045 170538 168976 167883 167497 167763 168201 167958 166545 164528 163027 162454 162248 161861 161437
52766 161437 161350 161719 162664 164485 167110 169780 171680 172657 173025 173006 172700 172262 171768 171150 170545 170323 170449 170317
52748 170317 169720 169522 170610 172454 173548 173293 172633 172678 173409 174157 174779 175757 177386 179418 181502 183551 185501
52731 185501 186979 187501 186921 185538 183824 182283 181527 182032 183549 185100 185967 186488 187342 188251 188155 186773 185188
52714 185188 184436 184134 183088 180819 177843 174811 172084 170050 169095 169142 169685 170351 171045 171568 171569 170998 170195 169455
52696 169455 168871 168623 168949 169595 169806 169212 168476 168693 170220 172281 173673 173701 172582 171107 169932 169116 168381
52679 168381 167759 167763 168857 170917 173347 175587 177360 178529 178932 178494 177498 176620 176495 177114 177796 177923 177610
52662A77610j32L85P03Q21J054J276R56kq96r93l09O13J461K319L112L427L025
52645A94430K260J644J230P57K72J18K70J33o44j615k116k146k161k239j974j142
52629A87077l4R56J598J699J134J96m69n16k07O8L21P74J334J538R66l30j781
52612A94324k684k747k253j613r34j93L47L26j50n51n29j90K02M68M69K34J01
52595A84627L65Q23J107J295J651J849J223o1r16p22j41l9k58j6Q52J685J871
52578A95195J370N71q7l75m39m86l60K63J170J640J383Q44L83k54j160j733j511
52561A96414r60p28o10m6P52J046P20L21J00j97o62j103j509j903j869r92J94
52544A88968N61j38r18r05l05K42N47P67R48J114J399J707J651J048J93n62j080
$$ plain form
52662 177610 177478 177863 178566 179387 180441 181717 182673 182671 181775 180782 180473 181086 182547 184866 187978 191405 194430
52645 194430 196690 198334 199564 200321 200593 200711 200981 201114 200470 198855 196739 194593 192432 190193 188219 187077
52629 187077 187043 187999 189597 191296 192430 192626 192157 191641 191434 191502 191823 192597 193931 195469 196435 196105 194324
52612 194324 191640 188893 186640 185027 184093 183900 184247 184573 184423 183872 183343 183153 183355 183823 184292 184526 184627
52595 184627 184992 185815 186922 188217 189868 191717 192940 192879 191963 191241 191100 191061 190803 190787 191639 193324 195195
52578 195195 196565 197136 197049 196674 196235 195749 195389 195652 196822 198462 199845 200689 201072 200818 199658 197925 196414
52561 196414 195454 194726 194116 194070 194822 195868 196588 196909 197009 196812 196150 195047 193538 191635 189766 188774 188968
52544 188968 189529 189391 188473 187568 187263 187505 188052 188819 189767 190881 192280 193987 195638 196686 196879 196317 195237
52527A95237j137m53O57J180N33n97r75k53P89J269J036N82M54Q32J467J974K256
52510B04851K494K712K636K154J676J721K289K814K740J947P64k36n97l34J6q4
52494B27563o60j317j730j919k021k010j746j293j075j423j990j898p74O12J149
52479B09468P35L26N82J094J160Q04O10Q36J257J693K206K686K693J970Q88K00
52463B29208L35J048J708J896J627J086M40j9J11P77J092Q2j999l714l998l302
52447B26378k847l146l753m057l760k772j311j10J09m62q55n68j49k73p07o96
52431B01021l8P07R84P37K21k44l19R9N85N48Qm10l51j46p1K04R35J576J452R01
52411B08399Q70J429J597R19K77O96J956L067L564L717L768L728L724L864L909
$$ plain form
52527 195237 194100 193647 194304 195484 196017 195420 194445 194192 194981 196250 197286 197868 198322 199154 200621 202595 204851
52510 204851 207345 210057 212693 214847 216523 218244 220533 223347 226087 228034 228798 228562 227965 227631 227647 227563
52494 227563 226903 225586 223856 221937 219916 217906 216160 214867 213792 212369 210379 208481 207707 208319 209468
52479 209468 210203 210529 211111 212205 213365 214169 214779 215615 216872 218565 220771 223457 226150 228120 229008 229208
52463 229208 229543 230591 232299 234195 235822 236908 237348 237329 237440 238217 239309 239391 237392 233678 229680 226378
52447 226378 223531 220385 216632 212575 208815 206043 204732 204622 204731 204269 203414 202846 202697 202424 201717 201021
52431 201021 200983 201690 202674 203411 203632 203388 203069 203168 203753 204301 204309 203899 203548 203402 203331 203535 204470 206046 207498 208399
52411 208399 209269 210698 212295 213214 213491 214187 216143 219210 222774 226491 230259 233987 237711 241575 245484
52396B45484L606L231L083K717J492j88j140j132j311k480l853m239l675l060
52382B38535k629j846o29L12M63J32j31j34J23O75J371J860K002J945J655Q93
52366B44597p3k95P11K054K329J293N6m06k90l45q00j319j620j645j324o49M1
52349B42315K58j2k29L2N40P89O98P01J092J551J517J004P45J299K226K568K152
52332B59246J878K441L352L743L727M153N175N946N822N106M386L847L543L655
52318C16020L973L789K860J957J803K006J721J022P31J173J908K527K939K885
52304C47314K107J133J116K492M344N348M999L750K385J488J199J291J537J887
52290C82390K033J335k23j428j130O3M67k94q49k93M57K04p26j219j070q39n38
$$ plain form
52396 245484 249090 252321 255404 258121 259613 259425 258285 257153 255842 253362 249509 245270 241595 238535
52382 238535 235906 234060 233431 233743 234206 234338 234207 234073 234196 234871 236242 238102 240104 242049 243704 244597
52366 244597 244524 244229 244940 246994 249323 250616 250672 250266 249976 249631 248831 247512 245892 244247 242923 242274 242315
52349 242315 242573 242561 242332 242364 242904 243693 244391 245092 246184 247735 249252 250256 251001 252300 254526 257094 259246
52332 259246 261124 263565 266917 270660 274387 278540 283715 289661 295483 300589 304975 308822 312365 316020
52318 316020 319993 323782 326642 328599 330402 332408 334129 335151 335882 337055 338963 341490 344429 347314
52304 347314 349421 350554 351670 354162 358506 363854 368853 372603 374988 376476 377675 378966 380503 382390
52290 382390 384423 385758 385535 384107 382977 383040 383507 383213 382364 382071 382528 382732 382006 380787 379717 378878 378340
52273C78340L48J699K610K589K086J804J952K325K715L106L629M330M839M630
52259D17002L802L173L303L775L963M036M552N364N623M850L488K403K193K820
52245D70347L543L471K580J824J821J889J094k12q40m82P7M17J075K377L669M165
52229D96815L864L317K947K962L353L700L563L226L467M336M931M712M325M534
52215E50052N062N180M873M614M398L884L322L406M167M754M559L954L696L989
52201F09910M412M490M113L553L204L208L287L134K879K949L417L824L727L219
52187F59326K760K635K736K778K552K037J443J114J173J214N31j110l020m169
52173F72000m305m180m560n270n582n181m421l749l301l025k745k071q01N13R67
$$ plain form
52273 378340 378688 380387 382997 385586 387672 389476 391428 393753 396468 399574 403203 407533 412372 417002
52259 417002 420804 423977 427280 431055 435018 439054 443606 448970 454593 459443 462931 465334 467527 470347
52245 470347 473890 477361 479941 481765 483586 485475 486569 486357 485517 485035 485112 485529 486604 488981 492650 496815
52229 496815 500679 503996 506943 509905 513258 516958 520521 523747 527214 531550 536481 541193 545518 550052
52215 550052 555114 560294 565167 569781 574179 578063 581385 584791 588958 593712 598271 602225 605921 609910
52201 609910 614322 618812 622925 626478 629682 632890 636177 639311 642190 645139 648556 652380 656107 659326
52187 659326 662086 664721 667457 670235 672787 674824 676267 677381 678554 679768 680299 679189 676169 672000
52173 672000 667695 663515 658955 653685 648103 642922 638501 634752 631451 628426 625681 623610 622809 623322 624289
52158F24289N08J84Q45K022K628K343J775J466J338J149Q67N25Q8l46m88j41O12
52141F39664J521K263K521K245J817J620J444P59m27j359j470j066p92p16l07
52126F47717P74K339M027N633O982P840Q128Q132Q327Q962R851J0496J0464R704
52112G49376Q496P083N497L798K275J130M6j398k971l885l925l849m253m535l649
52097G49236j677J70J146J716K474L161L323L261L567M041L863K753J251j46j515
52082G76624l002m374n307n745n771n386m629l637k529j418n63k12j88o0K57M37
52066G34497L73M65J038J839K319K113J107m93j952k355j614p31o49j161j384
52051G33412j045o45o42j065j792k613l053k764k185k216l111m116m377l782k755
$$ plain form
52158 624289 624797 624981 625826 627848 630476 632819 634594 636060 637398 638547 639414 639939 640027 639681 639193 639052 639664
52141 639664 641185 643448 645969 648214 650031 651651 653095 653854 653427 652068 650598 649532 648740 648024 647717
52126 647717 648491 650830 654857 660490 667472 675312 683440 691572 699899 708861 718712 729208 739672 749376
52112 749376 757872 764955 770452 774250 776525 777655 777701 776303 773332 769447 765522 761673 757420 752885 749236
52097 749236 747559 747729 748875 750591 753065 756226 759549 762810 766377 770418 774281 777034 778285 778139 776624
52082 776624 773622 769248 763941 758196 752425 747039 742410 738773 736244 734826 734263 734051 733863 733803 734060 734497
52066 734497 734870 735335 736373 738212 740531 742644 743751 743258 741306 738951 737337 736606 735957 734796 733412
52051 733412 732367 731722 731080 730015 728223 725610 722557 719793 717608 715392 712281 708165 703788 700006 697251
52036F97251j739j097j068j414j485r43j15O45J541K830M022M364L979L868M534
52021G15173N261N180M571M450N133N896O159O260O679P024O483N064L721L145
52007G90199L002K636J911J012j95j959m029n792p120q573j0588j2815j4498j5343
51993G17848j5740j6173j6636j6705j6080j4945j3690j2425j0978r398q140p652
51981E59286p938q616r231r346q769p855p307p352p400o901o189n977o300o485
51967D53620o003m790k926o96J208K315L178M704O654P760P567P116P364P903
51953D94974P898P382O741N699L862J753K24p89j884k858k853j788m74O97K142
51938E20726M029N886P532R318J1078J1873J1335J0332R651Q826P065M595K199
$$ plain form
52036 697251 695512 694415 693347 691933 690448 689505 689390 690035 691576 694406 698428 702792 706771 710639 715173
52021 715173 720434 725614 730185 734635 739768 745664 751823 758083 764762 771786 778269 783333 787054 790199
52007 790199 793201 795837 797748 798760 798565 796606 792577 786785 779665 771092 760504 747689 733191 717848
51993 717848 702108 685935 669299 652594 636514 621569 607879 595454 584476 575078 566938 559286
51981 559286 551348 542732 533501 524155 515386 507531 500224 492872 485472 478571 472382 466405 460105 453620
51967 453620 447617 442827 439901 439205 440413 442728 445906 450610 457264 465024 472591 479707 487071 494974
51953 494974 502872 510254 516995 522694 526556 528309 528533 527744 525860 523002 520149 518361 517887 518584 520726
51938 520726 524755 530641 538173 547491 558569 570442 581777 592109 601760 610586 617651 622246 624445
51925F24445Nk403n057p685j0311j2952j5008j5836j5815j5880j6170j6036j5296
51912D76001j4472j3692j2394j0402q365o704m992k886q89M02J200J978K671L087
51898D10543L636M781O039O408N689M661L906L181K093P56n52j884l492n344o997
51883D33424p873p652o513m973l363j585M51K391L859N073O555Q225R394R700
51869D47113R547R463R435R177Q606P762O526M756K522M9k398m362n286n015m066
51854D93829l146k488j804o79J109L416N673P218P852P898P584O767N427L896
51840E42552K131p11n226j0464j4467j6187j6291j5950j5507j4553j2750j0130
51828D12447p020m074k137j535j613j331l64O43Q90K63o34j111r93o54n24n65
$$ plain form
51925 624445 624450 622047 616990 609305 598994 586042 571034 555198 539383 523503 507333 491297 476001
51912 476001 461529 447837 435443 425041 416676 409972 404980 402094 401205 401607 402807 404785 407456 410543
51898 410543 414179 418960 424999 431407 437096 441757 445663 448844 450937 451693 451141 449257 445765 440421 433424
51883 433424 425551 417899 411386 406413 403050 401465 401916 404307 408166 413239 419794 428019 437413 447113
51869 447113 456660 466123 475558 484735 493341 501103 507629 512385 514907 514956 512558 508196 502910 497895 493829
51854 493829 490683 488195 486391 485712 486821 490237 495910 503128 510980 518878 526462 533229 538656 542552
51840 542552 544683 543972 538746 528282 513815 497628 481337 465387 449880 435327 422577 412447
51828 412447 405427 401353 399216 397681 396068 394737 394373 395016 395906 396169 395535 394424 393431 392777 392253 391688
51812C91688l65L27J301K111K436K175J471P94O70J113J556J541J202P90J0j595
51796D07225l743n408n872n359m509l654k845k184j742j361r40p55j138j891k358
51781C63466k142j456o99j6N76Q88O99P9o49j264j716j847j276K24K302M150N153
51764C66472N350N278N429N907O511P000P225P089O556N620M290K571N68j502
51750D34364l488n363p015q025q060p431o879o602n900m183k041p00m74l19Q59
51735C68743K942M984O375P208P751Q080Q280Q512Q821R072R204R174Q701P332
51721D75179N031K482N93j89l5O25J359J755J421P1k276n105p422q243p373n598
51705D52275m040l288l220l415l553l496l278l059k952k788k141p26J178K701
$$ plain form
51812 391688 391323 391650 392951 395062 397498 399673 401144 401938 402608 403721 405277 406818 408020 408810 408820 407225
51796 407225 403482 398074 392202 386843 382334 378680 375835 373651 371909 370548 369608 368853 367715 365824 363466
51781 363466 361324 359868 359169 359153 359729 360617 361316 361395 360746 359482 357766 355919 354643 354867 357169 361319 366472
51764 366472 371822 377100 382529 388436 394947 401947 409172 416261 422817 428437 432727 435298 435866 434364
51750 434364 430876 425513 418498 410473 402413 394982 388103 381501 375601 371418 369377 368677 368203 367884 368743
51735 368743 371685 376669 383044 390252 398003 406083 414363 422875 431696 440768 449972 459146 467847 475179
51721 475179 480210 482692 483285 483096 483061 483686 485045 486800 488221 488292 486016 480911 473489 465246 457873 452275
51705 452275 448235 444947 441727 438312 434759 431263 427985 424926 421974 419186 417045 416319 417497 420198
51691D20198K923J652l05j809k365k296j946j178Q5J235J478Q07j43j129k503
51676D14704m105m789l637j277P84J965L029M693O628Q097Q964R532R780R385
51662D63753Q414P456O932O670O289N721N158M582L544J399k177o702j0933j3612
51648D86494j4324j3630j2241j0350p886n176k992j917j877k323k751l057l617
51635D04353n010p406j0078j1707j1466r713p561n870m775m023l401k784k022
51622C18537j100l42k23q25j583j765j229n34k50l52m64m84o29q37o74l6M97L24
51604C08031l32p46o44l94k60m9L86P73Q96J068J804L107M435N257N440N266N254
51587C39292N817O789P472P414P000O891O983O427M800K840J744K005L204M710
$$ plain form
51691 420198 423121 424773 424468 422659 420294 417998 416052 414874 414959 416194 417672 418479 418336 417207 414704
51676 414704 410599 405810 402173 400896 401680 403645 406674 411367 417995 426092 435056 444588 454368 463753
51662 463753 472167 479623 486555 493225 499514 505235 510393 514975 518519 519918 517741 511039 500106 486494
51648 486494 472170 458540 446299 435949 428063 422887 419895 417978 416101 413778 411027 407970 404353
51635 404353 399343 391937 381859 370152 358686 348973 341412 335542 330767 326744 323343 320559 318537
51622 318537 317437 317095 316872 316047 314464 312699 311470 310936 310686 310334 309870 309386 308757 307920 307246 307210 307707 308031
51604 308031 307699 306953 306309 305915 305655 305606 305992 306765 307661 308729 310533 313640 318075 323332 328772 334038 339292
51587 339292 345109 351898 359370 366784 373784 380675 387658 394085 398885 401725 403469 405474 408678 413388
51573D13388O302Q062R967J1830J3643J5786J8602K1714K4130K5270K5682K6381
51561F20757K7630K8881K9742L0360L0746L0435K9243K7811K6910K6462K5802
51550I34779K4512K2476J9332J4593Q259Q15p416j6303k5189l2831l8381m2046
51538H62600m4447m5636m5130m2765l9128l5168l1500k8075k4453k0554j6999
51527D88745j4473j2762j0959q722o832o153o438o679o313n549m695l819l052
51514C92299k666k638k583k388k488l232m243m764m489l728k876k102j591j678
51500C50833k371l008k805j878j293j794k759k900j926r10q10j232j134l27M53
51485C26139P38Q22J008J055P37L22Q9k00q43j516j637j255r58r80r40n90k74
$$ plain form
51573 413388 419690 427752 437719 449549 463192 478978 497580 519294 543424 568694 594376 620757
51561 620757 648387 677268 707010 737370 768116 798551 827794 855605 882515 908977 934779
51550 934779 959291 981767 1001099 1015692 1023951 1024766 1017350 1001047 975858 943027 904646 862600
51538 862600 818153 772517 727387 684622 645494 610326 578826 550751 526298 505744 488745
51527 488745 474272 461510 450551 441829 434997 428844 422406 415727 409414 403865 399170 395351 392299
51514 392299 389633 386995 384412 382024 379536 376304 372061 367297 362808 359080 356204 354102 352511 350833
51500 350833 348462 345454 342649 340771 339478 337684 334925 332025 330099 329189 328379 327147 326013 325686 326139
51485 326139 326877 327699 328707 329762 330499 330821 330910 330710 329867 328351 326714 325459 324501 323521 322581 321991 321717
51468C21717l28n33n15l61l91m52o9P33J261R92K36k99l23j00R7K70N45J006J650
51449C25136K300K627K572K654L494M929O050O271O007O075O727P615Q382Q881
51435C99720R042R013R265J0028J0569R608O682K822l55j953k217j984j999k576
51421D55665l630n027o819q938j0811j1614j1009r333p087m666k591j400r85n71
51407C71184K83J100J329J281J609K244K565K450K322K225J675O79J37Q46K540
51392C94469M302N599O509P313Q129Q893R482J0084J1417J4144J7868K1232K3379
51379E42820K4929K7128L0427L4328L8239M1801M4560M6037M6153M5065M2510
51368I63997L7984L1653K4486J7182R405M68r520j9529k8475l5889m1901m6851
$$ plain form
51468 321717 321389 320856 320341 319980 319589 319137 319068 319801 321062 322054 322290 321991 321668 321568 321665 321935 322480 323486 325136
51449 325136 327436 330063 332635 335289 338783 343712 349762 356033 362040 368115 374842 382457 390839 399720
51435 399720 408762 417775 427040 437068 447637 457245 463927 466749 466394 464441 462224 460240 458241 455665
51421 455665 452035 447008 440189 431251 420440 408826 397817 388484 381397 376731 374140 372740 371755 371184
51407 371184 371467 372567 373896 375177 376786 379030 381595 384045 386367 388592 390267 390946 391083 391929 394469
51392 394469 398771 404370 410879 418192 426321 435214 444696 454780 466197 480341 498209 519441 542820
51379 542820 567749 594877 625304 659632 697871 739672 784232 830269 876422 921487 963997
51368 963997 1001981 1033634 1058120 1075302 1084707 1085175 1075655 1056126 1027651 991762 949861 903010
51356I03010n0759n3064n3051n0743m7179m3473l9796l5606l0764k5952k1889
51345D50734j8541j5378j2202r469p794p336p669q106q073p299n905m421l523
51332C35018l423l573l211k285j465j202j126p46l62p18j871k957l228k872k523
51317C03456k357j971j024L41J631K370K400J962J432R88O32N02Q06J339J520
51302C14027J168R11J320J986K019J385J013J431J970J674N35o54j338j603j748
51287C24096j978k414l018l401l143k316j479j016q44p40o41m55M5Q58J535J653
51271C06742J377J292J686K273K609K538K196J821J683J959K529K956K882K405
51257C36948J903J578J296R60P11O31M80Jn82p90o52q29j728k866l470l459l282
$$ plain form
51356 903010 852251 799187 746136 695393 648214 604741 564945 529339 498575 472623 450734
51345 450734 432193 416815 404613 395144 387350 380014 372345 364239 356166 348867 342962 338541 335018
51332 335018 331595 328022 324811 322526 321061 319859 318733 317987 317625 316907 315036 312079 308851 305979 303456
51317 303456 301099 299128 298104 298445 300076 302446 304846 306808 308240 309228 309860 310362 311168 312507 314027
51302 314027 315195 316106 317426 319412 321431 322816 323829 325260 327230 328904 329439 328785 327447 325844 324096
51287 324096 322118 319704 316686 313285 310142 307826 306347 305331 304487 303747 303106 302651 302696 303554 305089 306742
51271 306742 308119 309411 311097 313370 315979 318517 320713 322534 324217 326176 328705 331661 334543 336948
51257 336948 338851 340429 341725 342685 343396 344027 344507 344508 343926 343136 342484 341655 339927 337061 333591 330132 326850
51240C26850l036k406j595j525k650m078m457l559k360j724j542j277p97l79k09
51225B95256j47J12P62J606K052J650P08J33M48J258J880K176K415K487J902O67
51209C15365k73P8J578L021L400K872K387K594L338M035M206L708K802K095K115
51194C53321K677K920K274J189N73O36P59M83J37K66Q01J129P88k08j519k679
51178C63547l209k859j902j025q25j376k221k758k720k332j970j749j477j010
51164C36114m56NK87L64K48P5J4P9J87M81J176K033K338J711O31j79o51j261k169
51145C41027k978l318l288l188l083k829k359j814j396j148q90m95k01l75q61
51130C12804q95M9J543K648K936K658K151J584J221J384K018K660L057L434L989
$$ plain form
51240 326850 323814 321408 319813 318288 315638 311560 307103 303544 301184 299460 297918 296641 295844 295465 295256
51225 295256 295109 295221 295983 297589 299641 301291 301999 302132 302580 303838 305718 307894 310309 312796 314698 315365
51209 315365 315092 315170 316748 319769 323169 326041 328428 331022 334360 338395 342601 346309 349111 351206 353321
51194 353321 355998 358918 361192 362381 362954 363590 364349 364832 364969 365235 366036 367165 367953 367745 366226 363547
51178 363547 360338 357479 355577 354552 353727 352351 350130 347372 344652 342320 340350 338601 337124 336114
51164 336114 335658 335663 335950 336314 336562 336637 336651 336730 336917 337398 338574 340607 342945 344656 345287 345108 344457 343196 341027
51145 341027 338049 334731 331443 328255 325172 322343 319984 318170 316774 315626 314736 314241 314040 313665 312804
51130 312804 311909 311958 313501 316149 319085 321743 323894 325478 326699 328083 330101 332761 335818 339252 343241
51115C43241M401M149L172K018J344J360J752K138K548L280M166M425L560K195
51101C83749J414J406J324N97k27k86M44J137J090L18o79j496k160k926l831m524
51085C75350m645m220l482k584j740j389j660j950j605r15o61p82l25J080K620
51070C53092L475L764L874L659K987K378K347K626K746K977L853N084N858N999
51056D04719O049O268O380O336O532P058P384P047O164N098M025L087K627L042
51042D81816M418O310P738P766O500N302N472O685P280O089L572J102l21o45n18
51027E48566p63j810l501n499p743j0155j2092j2669j1688r811p864o321n326
51014D53324m658l689k019j55R53J175J312J932K721L251L581L750L407K505J789
$$ plain form
51115 343241 347642 351791 354963 356981 358325 359685 361437 363575 366123 369403 373569 377994 381554 383749
51101 383749 385163 386569 387893 388490 388263 387977 388421 389558 390648 390966 390287 388791 386631 383705 379874 375350
51085 375350 370705 366485 363003 360419 358679 357290 355630 353680 352075 351160 350499 349717 349392 350472 353092
51070 353092 356567 360331 364205 367864 370851 373229 375576 378202 380948 383925 387778 392862 398720 404719
51056 404719 410768 417036 423416 429752 436284 443342 450726 457773 463937 469035 473060 476147 478774 481816
51042 481816 486234 492544 500282 508048 514548 519850 525322 532007 539287 545376 548948 550050 549729 549084 548566
51027 548566 547803 545993 542492 536993 529250 519095 507003 494334 482646 472835 464971 458650 453324
51014 453324 448666 444977 442958 442803 443756 444931 446243 448175 450896 454147 457728 461478 464885 467390 469179
50999D69179J944K623K928K599K163K049K115K024J668J189Q25P76J012J335J764
50984D96193K659M228O092P573Q342Q555Q533Q551Q813R401J0140J0706J0779
50971F00565J0146Q859P225N443L210K9l929p596r915j0750j0727j0396r793q706
50957E63665p094n314l886k955j940m7K840O049Q809J0792J2015J2744J3645J5392
50943F24715J7894K0291K1956K3036K3846K4331K4490K4668K4988K4981K4314
50932H79510K3245K1768J8871J3604O662N6m705p464q755r222r736j1123j3342
50919H99369j5482j6833j7539j8079j8622j9146j9662j9995j9662j8383j6567
50908F99399j4996j4055j3447j2618j1418j0312r810r723r207p781o040n021n066
$$ plain form
50999 469179 471123 473746 476674 479273 481436 483485 485600 487624 489292 490481 491306 492082 493094 494429 496193
50984 496193 498852 503080 509172 516745 525087 533642 542175 550726 559539 568940 579080 589786 600565
50971 600565 610711 619570 626795 632238 635448 635477 631548 623952 614037 603287 592560 582164 572371 563665
50957 563665 556571 551257 547371 544416 542476 542429 545269 551318 560127 570919 582934 595678 609323 624715
50943 624715 642609 662900 684856 707892 731738 756069 780559 805227 830215 855196 879510
50932 879510 902755 924523 943394 956998 963660 963716 959011 951547 942792 933570 923834 912711 899369
50919 899369 883887 867054 849515 831436 812814 793668 774006 754011 734349 715966 699399
50908 699399 684403 670348 656901 644283 632865 622553 612743 603020 593813 586032 579992 574971 569905
50895E69905n627o036o041n628m833l842k941k274j823j602j619j750j912k202
50881E21775k633k856k548j943j515j287q91k72K44N23P37R01Q21O12P31J264
50865E13663J701J610J211J026J309J925K514K706K528K634L672N308O423O407
50851E54637N804N489N720O317P151Q071Q704Q869Q894R206R877J0882J2393J4352
50837F76366J6102J7054J7476J8152J9345K0629K1709K2794K4107K5534K7012
50826I06280K8862L1370L4201L6570L8015L8824L9641M0782M1961M2595M2244
50815A321345M0783L8351L5232L1627K7336K1844J4975P412K26o088j1860j7501
50803A503682k2903k7622l1401l4220l6138l7249l7596l6967l5006l1687k7643
$$ plain form
50895 569905 564278 558242 552201 546573 541740 537898 534957 532683 530860 529258 527639 525889 523977 521775
50881 521775 519142 516286 513738 511795 510280 508993 508102 507830 508074 508597 509334 510235 511056 511668 512399 513663
50865 513663 515364 516974 518185 519211 520520 522445 524959 527665 530193 532827 536499 541807 548230 554637
50851 554637 560441 565930 571650 577967 585118 593189 601893 610762 619656 628862 638739 649621 662014 676366
50837 676366 692468 709522 726998 745150 764495 785124 806833 829627 853734 879268 906280
50826 906280 935142 966512 1000713 1037283 1075298 1114122 1153763 1194545 1236506 1279101 1321345
50815 1321345 1362128 1400479 1435711 1467338 1494674 1516518 1531493 1538905 1539131 1533043 1521183 1503682
50803 1503682 1480779 1453157 1421756 1387536 1351398 1314149 1276553 1239586 1204580 1172893 1145250
50792A145250k3735k0384j7480j4832j2505j0584q810o640l891j154P03J512J902
50779A029352K346K564K192J493Q50J5j342k643k989k713l282n451q345j0785
50765A001262j2618j4279j5860j7294j8742k0119k0746k0278j9438j9131j9179
50754H03578j8727j7575j6214j4826j3082j0999r097p622o228m612k895j258L30
50741F80773J849L146M231N371O773Q463J0335J2077J3182J3505J3610J4050J4451
50728H01816J4013J2784J1721J1391J1405J1285J1054J0676R654P922O412O055
50716I26188O526O767O486O406O999P791Q133Q154Q489R358J0367J1248J2329
50703A035241J4036J6176J8054J9338K0404K1631K2717K3080K2717K2122K1433
$$ plain form
50792 1145250 1121515 1101131 1083651 1068819 1056314 1045730 1036920 1030280 1026389 1025235 1025938 1027450 1029352
50779 1029352 1031698 1034262 1036454 1037947 1038797 1038812 1037470 1034827 1031838 1029125 1025843 1020392 1012047 1001262
50765 1001262 988644 974365 958505 941211 922469 902350 881604 861326 841888 822757 803578
50754 803578 784851 767276 751062 736236 723154 712155 703058 695436 689208 684596 681701 680443 680773
50741 680773 682622 685768 689999 695370 702143 710606 720941 733018 746200 759705 773315 787365 801816
50728 801816 815829 828613 840334 851725 863130 874415 885469 896145 905799 913721 920133 926188
50716 926188 932714 939481 945967 952373 959372 967163 975296 983450 991939 1001297 1011664 1022912 1035241
50703 1035241 1049277 1065453 1083507 1102845 1123249 1144880 1167597 1190677 1213394 1235516 1256949
50692A256949K0215J8149J5524J2830J0306Q060O216M602K776P70n51m26O98J601
50678A357719J736J655J899K174J979J549J640K550L938N520P460R881J2472J4881
50664A427053J7227J9798K2354K4116K4535K3796K2524K1269K0346J9862J9690
50653A662570J9647J9803K0443K1576K2796K3852K5065K6766K8587K9834L0526
50642A931465L1583L3760L6784L9775M2212M4148M5576M6054M5204M3366M1386
50631B381313L9547L7037L2906K7450K2056J7533J3185P926J776m329r779j4459
50619B552162j7918j9441j9366j9517k1703k6022l0951l4628l5643l3182k7394
50608B266397j9809j2832q391p039q207j1058j5034j9980k6013l3156m0987m8677
$$ plain form
50692 1256949 1277164 1295313 1310837 1323667 1333973 1342033 1348249 1352851 1355627 1356397 1355846 1355420 1356118 1357719
50678 1357719 1359455 1361110 1363009 1365183 1367162 1368711 1370351 1372901 1376839 1382359 1389819 1399700 1412172 1427053
50664 1427053 1444280 1464078 1486432 1510548 1535083 1558879 1581403 1602672 1623018 1642880 1662570
50653 1662570 1682217 1702020 1722463 1744039 1766835 1790687 1815752 1842518 1871105 1900939 1931465
50642 1931465 1963048 1996808 2033592 2073367 2115579 2159727 2205303 2251357 2296561 2339927 2381313
50631 2381313 2420860 2457897 2490803 2518253 2540309 2557842 2571027 2578953 2580729 2576400 2566621 2552162
50619 2552162 2534244 2514803 2495437 2475920 2454217 2428195 2397244 2362616 2326973 2293791 2266397
50608 2266397 2246588 2233756 2225365 2218326 2210119 2199061 2184027 2164047 2138034 2104878 2063891 2015214
50596B015214n5496o1203o5767o8831o9771o8425o5535o2152n8650n4672m9975
50585A334737m4918l9991l5262l0647k6293k2290j8268j3815r213n181j864J361
50573A088356M902Q283J0761J2282J3444J4672J5789J6384J6376J6079J5730J5095
50561A248153J3705J1575R437P995P242O830O992Q473J1491J5215J8635K1564
50549A387307K4585K8208L2339L6382L9665M1828M3047M3856M4791M6190M8096
50538A816294N0147N1775N3028N5057N9171O5320P2115P8521Q4907R2066R9806
50527B578207J07098J13271J18531J23360J27888J31658J33786J33483J30735
50518C698017J26165J20038J11797J00944Q7920P3458N7377L8812J7673m726k6621
$$ plain form
50596 2015214 1959718 1898515 1832748 1763917 1694146 1625721 1560186 1498034 1439384 1384712 1334737
50585 1334737 1289819 1249828 1214566 1183919 1157626 1135336 1117068 1103253 1094040 1088859 1086995 1088356
50573 1088356 1093258 1101541 1112302 1124584 1138028 1152700 1168489 1184873 1201249 1217328 1233058 1248153
50561 1248153 1261858 1273433 1282870 1290865 1298107 1304937 1311929 1320402 1331893 1347108 1365743 1387307
50549 1387307 1411892 1440100 1472439 1508821 1548486 1590314 1633361 1677217 1722008 1768198 1816294
50538 1816294 1866441 1918216 1971244 2026301 2085472 2150792 2222907 2301428 2386335 2478401 2578207
50527 2578207 2685305 2798576 2917107 3040467 3168355 3300013 3433799 3567282 3698017
50518 3698017 3824182 3944220 4056017 4156961 4244881 4318339 4375716 4414528 4432201 4427475 4400854
50507D400854m6872o5022q0842r4099j04486j11534j14729j13771j08666r9650
50497C461183q7316p2705n6961m0895k5168j0750J273J0390J6628J9729J8817
50486C234225J3218L216j0238k6304m4314o3271q1696r8093j11446j21242j27204
50475B566851j29169j27280j22298j15466j07927j00240r2573q5135p8183p1721
50465A536859o5531n9505n3709m8196m3058l8645l5259l2585k9824k6520k2994
50454A081033j9795j7065j4596j2174r678p171n050l765l111k199m36J759L564
50441I91316M701N451O040O594P423Q720J0085J0933J1332J1858J2629J3182J3448
50428A113712J4107J5638J7595J9324K0895K2762K4885K6832K8598L0726L3583
$$ plain form
50507 4400854 4353982 4288960 4208118 4114019 4009533 3897999 3783270 3669499 3560833 3461183
50497 3461183 3373867 3301162 3244201 3203306 3178138 3167388 3168661 3179051 3195679 3215408 3234225
50486 3234225 3247443 3250659 3240421 3214117 3169803 3106532 3024836 2926743 2815297 2694055 2566851
50475 2566851 2437682 2310402 2188104 2072638 1964711 1864471 1771898 1686763 1608580 1536859
50465 1536859 1471328 1411823 1358114 1309918 1266860 1228215 1192956 1160371 1130547 1104027 1081033
50454 1081033 1061238 1044173 1029577 1017403 1007725 1000554 995504 991739 988628 986429 985993 987752 991316
50441 991316 996017 1001468 1007508 1014102 1021525 1030245 1040330 1051263 1062595 1074453 1087082 1100264 1113712
50428 1113712 1127819 1143457 1161052 1180376 1201271 1224033 1248918 1275750 1304348 1335074 1368657
50417A368657L7016M0687M4365M7854N1114N4502N8413O2623O6390O9355P1870
50406A972846P4216P5976P6475P5521P3333O9995O5375N9416N2205M3920L4933
50395B674211K5712J6195N651o399j9313l1904m3670n4772o4880p2816p7573p9030
50383B271412p7462p3045o6213n7936m9085l9891l0491k1601j4111q256l773o20
50371A828928R39P87j137n192j1629j9785k8372l6659m4711n2285n8297o1815
50359A510772o3065o2870o1543n8962n5457n1813m8374m4765m0761l6814l3426
50348I52922l0403k7214k3834k0749j8193j5879j3587j1561j0038q768p362n951
50336G59383n010m599m322l985l873m093m181l739l056k713k791k972l174l477
$$ plain form
50417 1368657 1405673 1446360 1490725 1538579 1589693 1644195 1702608 1765231 1831621 1900976 1972846
50406 1972846 2047062 2123038 2199513 2275034 2348367 2418362 2483737 2543153 2595358 2639278 2674211
50395 2674211 2699923 2716118 2721769 2715370 2696057 2664153 2620483 2565711 2500831 2428015 2350442 2271412
50383 2271412 2193950 2120905 2054692 1996756 1947671 1907780 1877289 1855688 1841577 1833321 1829548 1828928
50371 1828928 1829867 1830654 1829517 1824325 1812696 1792911 1764539 1727880 1683169 1630884 1572587 1510772
50359 1510772 1447707 1384837 1323294 1264332 1208875 1157062 1108688 1063923 1023162 986348 952922
50348 952922 922519 895305 871471 850722 832529 816650 803063 791502 781464 772696 765334 759383
50336 759383 754373 749774 745452 741467 737594 733501 729320 725581 722525 719812 717021 714049 710875 707398
50322G07398l550k816j365p5M39M96P26J233J763K307L064L992M848N493N822
50307G29775N621N040M970O251Q427R944R910R069Q666Q869Q889Q364P801P682
50293H39278P775P613P170O729O404O174O103O202O261O243O659Q030R922J1132
50279I41695J1077J0514J0539J1308J2269J3202J4132J4100J1019L543p009j7088
50267A029301k3448k5257k4099k2263k0924j9600j7231j3811j0758r394r320q900
50255H24296p313n445m431m099l489k409j537j147p11LL65m4n46k53O14J051O71
50238G95576J4m39p73j109j276j266j444j976k523k764k800k851k972l348m341
50223G65708n789o769o606n816n487n902o392o351n850n209m622m200m003l869
$$ plain form
50322 707398 703848 701032 699667 699592 700031 700527 701253 702486 704249 706556 709620 713612 718460 723953 729775
50307 729775 735396 740436 745406 751657 760084 770028 779938 789007 797673 806542 815431 823795 831596 839278
50293 839278 847053 854666 861836 868565 874969 881143 887246 893448 899709 905952 912611 920641 930563 941695
50279 941695 952772 963286 973825 985133 997402 1010604 1024736 1038836 1049855 1053398 1046389 1029301
50267 1029301 1005853 980596 956497 934234 913310 893710 876479 862668 851910 842516 833196 824296
50255 824296 816983 811538 807107 803008 799519 797110 795573 794426 793715 793718 794083 794039 793493 793240 793854 794905 795576
50238 795576 795590 795151 794378 793269 791993 790727 789283 787307 784784 782020 779220 776369 773397 770049 765708
50223 765708 759919 753150 746544 740728 735241 729339 722947 716596 710746 705537 700915 696715 692712 688843
50209F88843l650l558l863m266m100l230k225j502q71j68K67K24K54J059K537
50194F65751L953M970N890O944P885Q479Q944R662J0653J1602J2271J2666J2818
50181G82488J2587J1796J0495R020P673O479N350M440M003L856L301J891l3j884
50167H61462l636n658p806r322r823r837j0000j0073r239p197m603k402j073m07
50153G70386K25J380K986M336M856M715M318L459J590j067l571n561p668j0198
50139G70186j2223j2780j2303j1887j1607j0646q917p330o342n421m170k948j983
50126F61629q50N60J503J509J246J446J679J099j86j412k275k798k595j488m19
50111F58648n03j247j098K40J378J436J288J974L082L618L591L750M305M806M995
$$ plain form
50209 688843 685193 681635 677772 673506 669406 666176 663951 662449 661578 661410 661677 661901 662155 663214 665751
50194 665751 669704 674674 680564 687508 695393 703872 712816 722478 733131 744733 757004 769670 782488
50181 782488 795075 806871 817366 826386 834059 840538 845888 850328 854331 858187 861488 863379 863346 861462
50167 861462 857826 852168 844362 835040 825217 815380 805380 795307 786068 778871 774268 771866 770793 770386
50153 770386 770611 771991 774977 779313 784169 788884 793202 796661 798251 797184 793613 788052 780384 770186
50139 770186 757963 745183 732880 720993 709386 698740 689823 682493 676151 670730 666560 663612 661629
50126 661629 660779 661339 662842 664351 665597 667043 668722 669821 669635 668223 665948 663150 660555 659067 658648
50111 658648 658145 656898 655800 656040 657418 658854 660142 662116 665198 668816 672407 676157 680462 685268 690263
50096F90263M923M465L470K336J826K235L083L641L574L212L265M147N477O564
50082G42481P356Q379R644J0427J0510J0821J2205J4190J5760J6828J8062J9578
50070H96241K0781K1390K1774K2203K2594K2962K3397K3544K2845K1417J9934
50059A139082J8433J6152J2897R786P937O908N187J984k085o042r639j3271j7178
50046A170151k1053k4331k6644k7927k8162k7281k5417k3105k0934j9004j6932
50035I09361j4376j1432q530o121m430l283k181p83O75J618J711J098J66o15p88
50020H62090l06J94r9j266k615l545m094m531m921n355o131p349q561r259r550
50005G94702j0054j1151j2542j3532j3556j2550j0957r389q132o959n438l359
$$ plain form
50096 690263 695186 699651 703121 705457 707283 709518 712601 716242 719816 723028 726293 730440 735917 742481
50082 742481 749837 758216 767860 778287 788797 799618 811823 826013 841773 858601 876663 896241
50070 896241 917022 938412 960186 982389 1004983 1027945 1051342 1074886 1097731 1119148 1139082
50059 1139082 1157515 1173667 1186564 1196350 1204287 1211195 1216382 1218366 1216281 1210239 1200600 1187329 1170151
50046 1170151 1149098 1124767 1098123 1070196 1042034 1014753 989336 966231 945297 926293 909361
50035 909361 894985 883553 875023 868902 864472 861189 859008 858225 858900 860518 862229 863327 863493 862878 862090
50020 862090 861784 861978 861879 860613 857998 854453 850359 845828 840907 835552 829421 822072 813511 804252 794702
50005 794702 784648 773497 760955 747423 733867 721317 710360 700971 692839 685880 680442 677083
49993F77083r22J383L104M178M976N783O352O150N038L379J514n03k531m143n021
49978G05820n319n409n509n781o470p611q717r059q382p159o151n719n463m571
49964F14500k660k23J897L364M388N108N491N938P280R753J2513J4610J6081J7595
49950G15635J9398K1154K2633K3906K4963K5649K5994K6106K5684K4117K1224
49939I76463J7635J4223J1323Q448M761j8n011q827j1133j3253j6710k1460k6109
49926I30332k9642l2135l3848l4566l4070l2551l0155k6769k2595j8373j4644
49915F20984j1298q262n994m743l825k426p47L94Q29J132J607K060K618L904O019
49900F02252Q134R439J0039J0462J0762J0648J0221R987J0188J0560J0668J0140
$$ plain form
49993 677083 676161 677544 680648 684826 689802 695585 701937 708087 713125 716504 718018 717515 714984 710841 705820
49978 705820 700501 695092 689583 683802 677332 669721 661004 651945 643563 636404 630253 624534 619071 614500
49964 614500 611840 611617 613514 616878 621266 626374 631865 637803 645083 654836 667349 681959 698040 715635
49950 715635 735033 756187 778820 802726 827689 853338 879332 905438 931122 955239 976463
49939 976463 994098 1008321 1019644 1028092 1032853 1032835 1027824 1018997 1007864 994611 977901 956441 930332
49926 930332 900690 868555 834707 800141 766071 733520 703365 676596 654001 635628 620984
49915 620984 609686 601424 595430 590687 586862 584436 583689 584083 584912 586044 587651 589711 592329 596233 602252
49900 602252 610386 619825 629864 640326 651088 661736 671957 681944 692132 702692 713360 723500
49888G23500Q603N836K146j671m856p137q600r397r749j0089j0910j2343j3910
49875F51423j4821j4705j3960j3360j3196j2968j1974j0075p803n798m356l413
49863E24994k751k111j236J8J595L223M569N508O287P291Q538R580J0094J0377
49849E85976J0960J1758J2121J1762J1256J1240J1436J0864Q909N855K455o47
49837F93945l014m412m963n158n482o088o868p699q522r315j0058j0508j0083
49824F01775q342n745l617k795k576j515P68L146M475M925N417O292P159P875
49810F17242Q866J0286J1450J1554J0632R461Q597P863O754N004K815O95r14k047
49796G08258l255m992o965q361q786q688q752r201r846j0512j1067j1267j0934
$$ plain form
49888 723500 732103 737939 740085 738414 733558 726421 717821 708424 698675 688586 677676 665333 651423
49875 651423 636602 621897 607937 594577 581381 568413 556439 546364 538561 532763 528407 524994
49863 524994 522243 520132 518896 518914 520509 523732 528301 533809 540096 547387 555925 565505 575599 585976
49849 585976 596936 608694 620815 632577 643833 655073 666509 677373 686282 692137 694592 693945
49837 693945 690931 686519 681556 676398 670916 664828 657960 650261 641739 632424 622366 611858 601775
49824 601775 593433 587688 584071 581276 578700 577185 577953 581099 585574 590499 595916 602208 609367 617242
49810 617242 626108 636394 647844 659398 670030 679491 688088 695951 702705 707709 710524 711219 710305 708258
49796 708258 705003 700011 693046 684685 675899 667211 658459 649258 639412 628900 617833 606566 595632
49783E95632j0208r262p920n981l841k288j535j028l50K11L97O54J470K445K805
49768E61201K742L324M900O427O854O598O894Q079R237R436Q670P434O058M712
49754F52566L562K512J115q68k997m537n254n543n940o771q158r839j1032j0935
49740E87881r594p969o913o337n559m271k785j519n78J01N25O89P39R62J571K505
49724E49448L426M060M517N134N980O753P317P946Q785R441R567R579J0127J0911
$$ plain form
49783 595632 585424 576162 568242 562261 558420 556132 554597 553569 553219 553430 553827 554481 555951 558396 561201
49768 561201 563943 567267 572167 578594 585448 592046 598940 607019 616256 625692 634362 641796 647854 652566
49754 652566 656128 658640 659755 658887 655890 651353 646099 640556 634616 627845 619687 609848 598816 587881
49740 587881 578287 570318 563405 557068 551509 547238 544453 542934 542356 542457 542982 543671 544410 545372 546943 549448
49724 549448 552874 556934 561451 566585 572565 579318 586635 594581 603366 612807 622374 631953 642080 652991
$$ [...]
##END NTUPLES=NMR SPECTRUM
##END=
