
##TITLE=AC1294_INDRS11105_6613898_HpT6ehVIQI
##JCAMPDX= 6.0         $$ Bruker NMR JCAMP-DX V2.0
##DATA TYPE= NMR SPECTRUM
##DATA CLASS= NTUPLES
##ORIGIN= BRUKER
##OWNER= Administrator
$$ 1.72 TOPSPIN		Version 2.1
$$ 2012-08-02 14:10:20.390 -0500  Administrator@TOPSPIN
$$ Compression mode = diff/dup
##.OBSERVE FREQUENCY= 400.02188249412
##.OBSERVE NUCLEUS= ^1H
##.ACQUISITION MODE= SIMULTANEOUS (DQD)
##.ACQUISITION SCHEME= undefined
##.AVERAGES= 8
##.DIGITISER RES= 22
##SPECTROMETER/DATA SYSTEM= spect
##.PULSE SEQUENCE= zg30
##.SOLVENT NAME= COFFEE_meoh
##.SHIFT REFERENCE= INTERNAL, COFFEE_meoh, 1, 14.98509
##AUDIT TRAIL= $$ (NUMBER, WHEN, WHO, WHERE, PROCESS, VERSION, WHAT)
$$ ##TITLE= Audit trail, TOPSPIN		Version 2.1
$$ ##JCAMPDX= 5.01
$$ ##ORIGIN= Bruker BioSpin GmbH
$$ ##OWNER= Administrator
$$ $$ C:\Bruker\TOPSPIN/data/COFFEE/nmr/AC1294_INDRS11105_6613898_HpT6ehVIQI/10/pdata/1/auditp.txt
$$ ##AUDIT TRAIL=  $$ (NUMBER, WHEN, WHO, WHERE, PROCESS, VERSION, WHAT)
(   1,<2012-08-02 14:10:12.906 -0500>,<Administrator>,<TOPSPIN>,<go>,<TOPSPIN 2.1>,
      <created by zg
	started at 2012-08-02 14:09:06.093 -0500,
	POWCHK enabled, PULCHK disabled,
       configuration hash MD5:
       6B 1B 68 BB D9 2E 58 E2 7F 35 AD 54 07 DF 0E 41
       data hash MD5: 64K
       BD 57 20 7D 78 F7 68 15 45 FB 57 93 97 01 FC 90>)
(   2,<2012-08-02 14:10:15.578 -0500>,<Administrator>,<TOPSPIN>,<proc1d>,<TOPSPIN 2.1>,
      <Start of raw data processing
       efp LB = 0 FT_mod = 6 PKNL = 1 PHC0 = 0 PHC1 = 0 SI = 32K 
       data hash MD5: 32K
       2E AC 8C 0D EF 30 21 C1 6C B8 4D B8 5A 03 B2 51>)
(   3,<2012-08-02 14:10:16.046 -0500>,<Administrator>,<TOPSPIN>,<proc1d>,<TOPSPIN 2.1>,
      <pk PHC0 = 178.3685 PHC1 = 0 
       data hash MD5: 32K
       8B 3B 45 00 38 B1 5D 44 7E 99 0F 46 DC 39 F0 26>)
(   4,<2012-08-02 14:10:16.156 -0500>,<Administrator>,<TOPSPIN>,<proc1d>,<TOPSPIN 2.1>,
      <abs ABSG = 1 
       data hash MD5: 32K
       93 34 16 70 A5 6D DF 9B AF 34 91 44 42 2E 9F CD>)
(   5,<2012-08-02 14:10:16.187 -0500>,<Administrator>,<TOPSPIN>,<proc1d>,<TOPSPIN 2.1>,
      <abs ABSG = 2 
       data hash MD5: 32K
       BC 62 31 59 27 93 57 54 D5 41 E2 8A 58 29 EF 64>)
(   6,<2012-08-02 14:10:16.265 -0500>,<Administrator>,<TOPSPIN>,<proc1d>,<TOPSPIN 2.1>,
      <abs ABSG = 3 
       data hash MD5: 32K
       91 83 50 79 E9 47 E1 92 FF 1B 10 B6 53 B4 14 F7>)
(   7,<2012-08-02 14:10:16.296 -0500>,<Administrator>,<TOPSPIN>,<proc1d>,<TOPSPIN 2.1>,
      <abs ABSG = 4 
       data hash MD5: 32K
       90 5A 13 A8 4B 3B B7 2A 66 A4 8B 26 AD 80 AB 7D>)
(   8,<2012-08-02 14:10:16.328 -0500>,<Administrator>,<TOPSPIN>,<proc1d>,<TOPSPIN 2.1>,
      <abs ABSG = 5 
       data hash MD5: 32K
       08 97 4A 61 2B A8 C0 53 9B D8 D5 E4 50 02 39 44>)
$$ ##END=
$$ 
$$ $$ hash MD5
$$ $$ F4 FC 26 C6 D8 64 27 C0 AD 87 EC 21 1A 0D D2 A2
##$RELAX= 
##$RELAX= 
##$RELAX= 
##$RELAX= 
##$RELAX= 
##$RELAX= 
##$RELAX= 
$$ Bruker specific parameters
$$ --------------------------
$$ [...]
##$TP= (0..7)
150 150 150 150 150 150 150 150
##$TP07= 0
##$TPNAME0= <>
##$TPNAME1= <>
##$TPNAME2= <>
##$TPNAME3= <>
##$TPNAME4= <>
##$TPNAME5= <>
##$TPNAME6= <>
##$TPNAME7= <>
##$TPOAL= (0..7)
0.5 0.5 0.5 0.5 0.5 0.5 0.5 0.5
##$TPOFFS= (0..7)
0 0 0 0 0 0 0 0
##$TUNHIN= 0
##$TUNHOUT= 0
##$TUNXOUT= 0
##$USERA1= <user>
##$USERA2= <user>
##$USERA3= <user>
##$USERA4= <user>
##$USERA5= <user>
##$V9= 5
##$VALIST= <valist>
##$VCLIST= <CCCCCCCCCCCCCCC>
##$VD= 0
##$VDLIST= <DDDDDDDDDDDDDDD>
##$VPLIST= <PPPPPPPPPPPPPPP>
##$VTLIST= <TTTTTTTTTTTTTTT>
##$WBST= 1024
##$WBSW= 4
##$XGAIN= (0..3)
0 0 0 0
##$XL= 0
##$YL= 0
##$YMAX_a= 478041
##$YMIN_a= -624711
##$ZGOPTNS= <>
##$ZL1= 120
##$ZL2= 120
##$ZL3= 120
##$ZL4= 120
##$ABSF1= 14.98509
##$ABSF2= -5.573092
##$ABSG= 5
##$ABSL= 3
##$ALPHA= 0
##$AQORDER= 0
##$ASSFAC= 0
##$ASSFACI= 0
##$ASSFACX= 0
##$ASSWID= 0
##$AUNMP= <proc_prof1d_extract_pilot.lims>
##$AXLEFT= 0
##$AXNAME= <>
##$AXNUC= <1H>
##$AXRIGHT= 0
##$AXTYPE= 0
##$AXUNIT= <>
##$AZFE= 0.1
##$AZFW= 0.1
##$BCFW= 0
##$BC_mod= 0
##$BYTORDP= 0
##$COROFFS= 0
##$CY= 15
##$DATMOD= 1
##$DC= 0
##$DFILT= <>
##$DTYPP= 0
##$F1P= 0
##$F2P= 0
##$FCOR= 0.5
##$FTSIZE= 32768
##$FT_mod= 6
##$GAMMA= 0
##$GB= 0
##$INTBC= 1
##$INTSCL= 1
##$ISEN= 128
##$LB= 0
##$LEV0= 0
##$LPBIN= 0
##$MAXI= 10000
##$MC2= 0
##$MEAN= 0
##$ME_mod= 0
##$MI= 0
##$NCOEF= 0
##$NC_proc= -8
##$NLEV= 6
##$NOISF1= 0
##$NOISF2= 0
##$NSP= 0
##$NTH_PI= 0
##$NZP= 0
##$OFFSET= 14.98509
##$PC= 1
##$PHC0= 178.3685
##$PHC1= 0
##$PH_mod= 1
##$PKNL= yes
##$PPARMOD= 0
##$PPDIAG= 0
##$PPIPTYP= 0
##$PPMPNUM= 2147483647
##$PPRESOL= 1
##$PSCAL= 4
##$PSIGN= 0
##$PYNMP= <proc.py>
##$REVERSE= no
##$SF= 400.02
##$SI= 32768
##$SIGF1= 0
##$SIGF2= 0
##$SINO= 400
##$SIOLD= 32768
##$SPECTYP= <>
##$SREGLST= <1H.CDCl3>
##$SSB= 0
##$STSI= 32768
##$STSR= 0
##$SW_p= 8223.68421052631
##$SYMM= 0
##$S_DEV= 0
##$TDeff= 65536
##$TDoff= 0
##$TI= <>
##$TILT= no
##$TM1= 0
##$TM2= 0
##$TOPLEV= 0
##$USERP1= <user>
##$USERP2= <user>
##$USERP3= <user>
##$USERP4= <user>
##$USERP5= <user>
##$WDW= 1
##$XDIM= 32768
##$YMAX_p= 462029377
##$YMIN_p= -714471
##$CURPLOT= <Network HP LaserJet P1505>
##$CURPRIN= <$Network HP LaserJet P1505>
##$DFORMAT= <normdp>
##$LAYOUT= <+/1D_H.xwp>
##$LFORMAT= <normlp>
##$PFORMAT= <normpl>
##$SURQMSG= 1
$$ End of Bruker specific parameters
$$ ---------------------------------
##NTUPLES= NMR SPECTRUM
##VAR_NAME=  FREQUENCY,     SPECTRUM/REAL,   SPECTRUM/IMAG
##SYMBOL=    X,             R,               I
##VAR_TYPE=  INDEPENDENT,   DEPENDENT,       DEPENDENT
##VAR_FORM=  AFFN,          ASDF,            ASDF
##VAR_DIM=   32768,         32768,           32768
##UNITS=     HZ,            ARBITRARY UNITS, ARBITRARY UNITS
##FACTOR=    0.250966925370066, 1,           1
##FIRST=     8223.43324360094, -345440,      -7589
##LAST=      0,             -49353,          -133792
##MIN=       0,             -714471,         0
##MAX=       8223.43324360094, 462029377,    0
$$ Real data points
##PAGE= N=1
##DATA TABLE= (X++(R..R)), XYDATA
$$ [...]
$$ plain form
19481 9541 7061 -266746 232633 -89228 -140524 -21936 -234250 340732 -76112 29147 314511
19470 314511 -272686 152370 120082 -20932 -95940 -230690 240561 -80625 -342124 -79404
19459 81588 -18546 1047 65160 182632 -133638 -108302 -135390 -62411 -14412 1749 -26420 -58209
19447 -58209 -183541 -464407 -74108 45438 -113904 -120961 -120662 -45833 190454 -423788 -360108
19436 -360108 156485 -43014 -54210 -196873 66508 -177940 252768 124552 -108512 -42376
19425 15859 -228870 -435404 88630 -25282 -98160 135334 664 -332500 -187938 -99168 163310
19413 -63888 -381295 -11976 -377247 -163901 54531 -136011 -205135 -6894 -253741 210236 -334472
19401 -320751 -328148 10017 -181970 56935 38874 -99303 25037 -185627 -213477 -114495 -212503
$$ packed form
19481I541k480b66746B32633h9228n1296b1936k12314C40732g6112B9147K85364
19470C14511b72686A52370l2288b0932p5008j34750B40561h0625k61499g9404
19459H1588a8546A047O4113J17472a33638K5336k7088f2411a4412A749b6420l1789
19447e8209j25332k80866g4108D5438a13904p057K99d5833A90454d23788O3680
19436c60108A56485d3014j1196j42663F6508a77940B52768A24552a08512d2376
19425A5859b28870k06534H8630b5282p2878A35334F64c32500J44562Q8770A63310
19413f3888l17407a1976l65271a63901E4531a36011o9124f894k46847B10236c34472
19401c20751p397A0017a81970E6935j8061i9303B5037a85627k7850R8982r8008
$$ plain form
19390 -212503 98815 -152877 39490 259723 58250 -102037 168644 -161648 -204568 -186154
19380 -186154 -271903 -61987 38711 -1593 -311783 -117827 -83998 -4934 -81389 -390861 192380
19368 -302884 -128683 122937 29377 -69929 -227670 -75192 87295 -220075 -29245 126593
19357 71072 -88045 57467 -301588 65198 -217636 68444 -124240 34921 -106604 -314349 -378938
19346 -378938 98924 -377158 103584 -134270 -47302 212944 96553 -106719 88943 -262749
19335 80882 -249703 -147652 -29473 49863 -223786 -15363 -3315 -225263 -262819 47155 -303736
19323 70097 2642 112339 -333831 62901 33714 -106208 -386863 -174660 -149479 -153034 71192
19311 303263 -45821 -142147 76335 -144364 41212 66369 -11721 -60191 18752 -158262 -527340
$$ packed form
19390b12503I8815a52877C9490K20233E8250a02037A68644a61648m2920J8414
19380a86154q5749f1987C8711a593l10190a17827L3829d934p6455l09472A92380
19368c02884a28683A22937B9377f9929j57741g5192H7295b20075b9245A26593
19357G1072h8045E7467c01588F5198b17636F8444a24240C4921a06604k07745o4589
19346c78938I8924c77158A03584a34270d7302B12944I6553a06719H8943b62749
19335H0882b49703J02051b9473D9863b23786a5363c315k21948l7556D7155c03736
19323G0097B642J09697c33831F2901k9187a06208k80655a74660K5181l555G1192
19311C03263d5821r6326G6335a44364D1212K5157a1721m8470A8752a58262l69078
$$ plain form
19300 -527340 -183988 -114752 149429 96925 -205762 -219421 -212542 146195 298964 100381
19289 -124213 -73535 -335977 -156443 -374443 -173892 -162375 -74291 -422951 -117296 118416
19278 -349543 48208 -129251 -10112 -265249 -416959 27104 -14108 -22047 -23194 -93034 54664
19266 -61465 -406623 -270183 -40737 -108405 -140283 252610 -23062 63286 -17689 -131990 230564
19254 -135543 -1836 -38429 -119975 38385 -7384 2768 -355064 259980 -174031 -101350 179943
19242 123285 -244789 223652 -352423 -59184 -103249 -70441 -283650 35212 246841 424354
19232 424354 -220441 -133518 55481 -16674 -186948 -71182 -336673 -242905 -293288 -192441 -164810
19221 -164810 -131947 177678 119852 -170091 164917 -74172 -61636 -56208 -187520 -76291 -161263
$$ packed form
19300e27340a83988O9236A49429n2504b05762j3659O879A46195J52769A00381
19289a24213N0678k62442a56443k18000a73892J1517g4291l48660a17296A18416
19278c49543D8208a29251a0112k55137j51710B7104a4108p939j147o9840E4664
19266f1465l45158J36440d0737o7668l1878B52610b3062F3286a7689j14301B30564
19254a35543a836l6593q1546C8385g384B768c55064B59980a74031P2681A79943
19242A23285b44789B23652c52423e9184m4065L2808k13209C5212K11629J77513
19232D24354b20441Q6923E5481a6674j70274g1182k65491R3768n0383J00847K7631
19221a64810L2863A77678n7826a70091A64917g4172J2536N428j31312g6291q4972
$$ plain form
19210 -161263 468868 -221137 259138 -226509 86881 -251824 -175484 -193668 -43166 -197201
19200 -197201 262843 -51940 -164881 -253684 -92415 254370 298023 116204 62646 -171734
19189 -73981 -260663 -49829 -120802 143322 235246 -82004 149661 -108332 270327 -34258 -166150
19178 -166150 -57510 138385 57142 -294194 72105 -61778 -154734 -197388 -7263 -173596 155890
19166 169039 84270 47005 -146338 124755 -126032 665 111638 14210 -175107 43268 119786
19155 119786 -3116 -216763 -3512 -69053 -400645 177547 -185094 -214152 191423 -295216 -245445
19144 -245445 32337 -111765 21650 -274790 -236214 186726 346026 -42382 318056 165559
19134 165559 212360 -402688 -117894 -106637 52448 62618 -138539 -142632 -325093 -107562 -173405
$$ packed form
19210a61263D68868b21137B59138b26509H6881b51824P6340j8184d3166j54035
19200a97201B62843e1940j12941q8803i2415B54370M3653A16204n3558a71734
19189g3981j86682d9829p0973A43322R1924h2004A49661a08332B70327c4258j31892
19178a66150e7510A38385E7142b94194G2105f1778r2956m2654g263j66333A55890
19166A69039H4270l7265a46338A24755a26032F65J10973A4210a75107D3268P6518
19155A19786c116k13647c512o5541l31592A77547a85094k9058A91423b95216M9771
19144b45445C2337a11765B1650b74790L8576A86726J59300d2382C18056j52497
19134A65559M6801d02688a17894J1257E2448J0170a38539m093j82461a07562o5843
$$ plain form
19123 -173405 -156565 95467 219625 111799 -109728 -202930 -179108 -385461 -198729 -14052
19112 -60914 -263886 -73304 228260 91059 -32339 -412090 -145229 -59860 -204115 55724 11070
19100 163816 224430 99168 63442 -191591 -247108 96864 -124918 -132696 114310 -55249 -262844
19089 -262844 266163 -68928 -17479 -54023 -34750 76504 16807 -154932 190782 -257159 88159
19077 122174 -8294 -10442 -23663 134151 -214710 -50681 -99755 10518 72106 -292676 22582
19065 361023 273013 103973 -32764 237812 -94105 46294 -315966 94322 -82846 62061 -181017
19053 27378 -86031 -28542 -147444 -273085 111842 -186462 76142 -432196 -368381 353543
19042 -119684 19351 4323 209226 406441 -226141 103097 -265150 -102408 -173988 -308878
$$ packed form
19123a73405J6840I5467J24158j07826a09728r3202K3822k06353J86732a4052
19112f0914k02972g3304B28260I1059c2339l79751a45229e9860j44255E5724A1070
19100A63816O0614I9168l5726a91591n5517I6864a24918p778A14310e5249k07595
19089b62844B66163f8928a7479l6544J9273G6504A6807a54932A90782b57159H8159
19077A22174h294k148j3221A34151b14710e0681m9074A0518O1588b92676B2582
19065C61023q8010A03973c2764B37812i4105D6294c15966I4322h2846F2061a81017
19053B7378h6031b8542j18902j25641A11842a86462G6142d32196O3815C53543
19042a19684A9351D323K04903J97215b26141A03097b65150a02408p1580j34890
$$ plain form
19032 -308878 40060 -35899 65449 -33406 59864 -195035 -104421 -130902 -70584 183008 85027
19020 -91559 19793 -258833 -288973 -108661 -187506 -32372 -511436 64101 -230443 -92450 -287869
19009 -287869 -142083 -148771 409153 2775 -141702 7853 -129959 -230819 -124723 156039 -160420
18997 -156117 166221 -62644 -187852 -26269 69475 -232489 -65949 -84157 -83230 -217980 20250
18985 -18774 42510 -125533 -55279 -95406 -71467 -193821 -175890 336032 -111635 64734 -132679
18973 -174624 -233978 46411 162167 -165122 -376526 -132730 50499 16519 58816 160030
18963 160030 302282 480800 483835 294372 220753 -226289 5841 254366 92579 -110844 -163764
18952 -163764 -32884 -99490 114578 -153456 -40968 -297290 118291 118129 -18971 199673 105233
$$ packed form
19032c08878D0060c5899F5449c3406E9864a95035R0614k6481O0318A83008H5027
19020i1559A9793b58833l0140a08661p8845c2372m79064F4101b30443i2450j95419
19009b87869a42083o688D09153B775a41702G853a29959j00860J06096A56039a60420
18997a56117A66221f2644j25208b6269F9475b32489f5949j8208R27j34750B0250
18985a8774D2510a25533e5279m0127K3939j22354J7931C36032a11635F4734a32679
18973a74624n9354D6411J15756a65122k11404a32730E0499A6519M2297J01214
18963A60030J42252J78518L035j89463p3619b26289E841K48525I2579a10844n2920
18952a63764c2884o6606A14578a53456d0968k56322A18291j62a8971A99673r4440
$$ plain form
18941 105233 -167524 -226921 -20127 16333 66641 -108090 -194813 -115648 -25591 -181016 -291310
18930 -291310 271325 -10356 180747 323699 117819 -111495 42686 185609 -265584 234839
18919 173342 232219 170240 -81162 -99900 31678 -67400 -25445 109360 249959 59869 175764
18908 175764 -53335 -121721 143045 82967 156641 85277 262167 249918 250140 513435 840817
18897 840817 411289 197357 328490 247476 249394 -380072 -189318 -132206 -122651 -45568 -69913
18886 -69913 -362807 63331 -248801 -4561 -53761 39718 227500 78861 147382 -77095 65177
18874 -372070 -54991 -141034 -249299 29378 -71364 -129602 71077 -51206 170525 8939 -311351
18862 35197 93080 -326610 -163265 -55734 -160991 -229480 -130292 37701 -46754 164458 -97274
$$ packed form
18941A05233a67524n9397b0127A6333N0308a08090q6723P9165b5591j55425j10294
18930b91310B71325a0356A80747J42952A17819a11495D2686J42923b65584B34839
18919A73342N8877o1979h1162j8738C1678f7400b5445A09360J40599E9869J15895
18908A75764e3335o8386A43045o0078P3674p1364J76890j2249K22K63295L27382
18897H40817D11289A97357J31133q1014J918c80072a89318N7112R555d5568k4345
18886f9913k92894F3331b48801d561m9200C9718J87782G8861O8521g7095F5177
18874c72070e4991q6043j08265B9378g1364n8238G1077e1206A70525H939c11351
18862C5197N7883c26610a63265e5734j05257o8489R9188C7701d6754A64458i7274
$$ plain form
18850 15984 -9597 -8929 281309 7933 -243420 -186836 43392 -80402 -239922 -160695 3834 299145
18838 299145 -174697 -122877 5378 129112 -386098 -168379 207373 28557 240392 -85150
18827 -444932 -3544 170196 55065 -515444 53820 -48242 -78098 -381689 -44192 -524504 -113621
18815 -193276 67212 253675 -131262 -37164 -163245 126871 -182585 -53139 156178 85816
18805 85816 280780 -199063 -238528 -240989 -265750 87777 20932 17488 -211536 -356568 149983
18793 -5657 267914 17585 136238 -123783 -254258 -333945 -326261 -169672 -86211 -192715 81525
18781 70160 -3832 240267 -16370 123218 -196796 167081 -235427 77259 -242400 -87127 -377539
18770 -377539 -281894 -31989 -126250 -63122 -18661 -119141 208656 -104933 -77417 -141217 43592
$$ packed form
18850A5984i597O68B81309G933b43420N6584D3392h0402j59520P9227C834K95311
18838B99145a74697N1820E378J23734c86098a68379B07373B8557K11835h5150
18827d44932c544A70196E5065e15444E3820d8242k9856l03591d4192m80312a13621
18815a93276F7212J86463a31262c7164j26081A26871a82585e3139A56178p0362
18805H5816J94964a99063l9465k461k4761H7777B0932l444b11536j45032A49983
18793e657B67914A7585J18653a23783j30475p9687P684J56589Q3461j06504H1525
18781G0160c832B40267a6370A23218a96796A67081b35427G7259b42400h7127k90412
18770c77539R5645c1989r4261f3122a8661j00480B08656a04933K7516o3800D3592
$$ plain form
18758 -162846 -154610 -94764 69969 -197079 -238535 20933 62367 137369 -68251 321440 -177732
18746 92395 93837 256420 -288078 61057 110977 -319933 193947 302586 -132484 318680
18735 9007 -23293 -88235 -133165 55279 -440043 175780 74035 20978 235801 -151057 -56989
18723 2441 -133466 39870 -20509 -247625 -87371 -300057 -65466 48763 -321709 -269832 -75797
18711 -213311 -29502 -317900 -3130 92549 45129 224683 -234936 -152922 115140 71522 162052
18700 162052 -93170 94889 79731 -13420 210608 -77752 241776 186590 142882 74399 -199265
18688 -280461 -123746 -38215 -269189 182835 188225 -164094 61704 -69637 55904 -436534 23521
18676 -578913 -214259 -144296 40524 30474 -197080 131683 143164 -401783 57526 -90495 -218526
$$ packed form
18758a62846Q236N9846F9969a97079m1456B0933M1434P5002f8251C21440a77732
18746I2395J442J62583b88078F1057M9920c19933A93947J08639a32484C18680
18735I007b3293o4942m4930E5279d40043A75780G4035B0978K14823a51057e6989
18723B441a33466C9870b0509k27116h7371k12686f5466D8763c21709N1877g5797
18711b13311b9502k88398c130I2549D5129J79554b34936Q2014A15140m3618R0530
18700A62052i3170I4889j5158a3420B10608g7752B41776n5186m3708o8483a99265
18688b80461a23746c8215k30974A82835N390a64094F1704f9637E5904d36534B3521
18676e78913b14259O9963D0524j0050a97080A31683J1481d01783E7526i0495j28031
$$ plain form
18665 -218526 121678 198023 -89917 18744 -20488 -41804 -148399 41250 65970 34813 -192364
18653 -167477 -318308 -45209 -97640 -8998 -133484 17789 53006 252030 18899 111896 -72786
18641 -272245 95551 234512 -20292 14936 -199258 -142347 -41256 -184109 -47578 -177165 92876
18629 -52475 165840 -2240 -128361 -91096 91543 89019 -136812 -481637 -162680 100565 -150534
18617 -327396 -13890 -124226 20702 -201526 64491 -181327 41892 -67002 -220994 249738
18606 -253528 -126618 -243212 87558 153971 -25612 97889 -87124 46978 -91145 -427097 -77343
18594 -110374 -16780 -27571 203595 -200637 -210019 -34303 30795 -14959 347979 -33206 99958
18582 229031 85352 48215 -365993 38128 260902 54507 -84538 -407070 -196738 -87046 -301504
$$ packed form
18665b18526A21678P6345h9917A8744b0488k1316j06595D1250K4720l1157a92364
18653a67477j50831d5209n2431h998j24486A7789L5217J99024A8899R2997g2786
18641b72245I5551J38961b0292A4936a99258N6911d1256j42853d7578j29587I2876
18629e2475A65840b240j26121L7265I1543k524a36812l44825a62680A00565a50534
18617c27396a3890j10336B0702b01526F4491a81327D1892f7002j53992B49738
18606b53528a26618j16594H7558O6413b5612I7889h7124D6978i1145l35952g7343
18594a10374a6780j0791B03595b00637r382c4303C0795a4959C47979c3206I9958
18582B29031H5352l7137c65993C8128K22774E4507h4538l22532a96738h7046k14458
$$ plain form
18571 -301504 187127 47836 -319116 109150 -159974 36876 61576 -151105 -40804 84530
18560 108677 90044 -100367 -380353 206934 126356 -209311 368922 -83364 -210526 278779
18549 -82018 -404663 -62854 -339524 -23758 1861 -63697 -125991 -149966 -11179 -225636 142327
18537 101764 -194064 -276132 119671 -491729 168523 36299 93538 119610 -230092 13011
18526 -64182 -138787 -463330 -178337 -167578 142806 156398 235562 -329558 95174 2638 157870
18515 157870 -325183 -49129 62915 88163 157575 286368 -156329 62714 -105225 -188762 -90452
18503 197190 50342 -294621 -52129 -312144 193018 -20778 240735 -149444 -162572 -242414
18493 -242414 -35897 -533 155533 -151572 -178752 415190 -110029 -294625 -219257 59019 -299727
$$ packed form
18571c01504A87127D7836c19116A09150a59974C6876K4700a51105d0804H4530
18560A08677j8633a00367k79986B06934q0578b09311C68922h3364j27162B78779
18549h2018l22645f2854k76670b3758A861f3697o2294k3975a1179k14457A42327
18537A01764a94064q2068A19671d91729A68523C6299N7239K6072b30092A3011
18526f4182p4605l24543a78337J0759A42806J3592P9164c29558I5174B638J55232
18515A57870c25183d9129F2915K5248O9412J28793a56329F2714a05225q3537i0452
18503A97190E0342b94621e2129k60015A93018b0778B40735a49444j3128p9842
18493b42414c5897e33A55533a51572k7180D15190a10029j84596P5368E9019b99727
$$ plain form
18481 -8508 -105782 -27103 65433 -67086 -219445 29245 -221694 180436 130097 2226 81523
18470 81523 229206 33613 -237125 15922 -103279 151676 77346 -69541 -109219 204147 -508069
18458 -73733 26155 167998 -215944 -225659 178966 -263412 88475 -269039 9215 -12530 -15802
18447 -15802 -121631 28714 29226 -84691 162167 76264 72017 -139989 -100377 244069 -184623
18435 192829 55292 333803 -43043 -212932 -97823 -308894 6725 -46060 4500 19170 -335366
18423 99698 -41527 2230 49553 -548651 -186902 193407 -62118 -24867 72098 49953 45318
18412 45318 212456 -39540 33033 -38890 92231 -73773 123512 -28964 -127784 -81808 111466
18400 -269695 -84029 -297890 116245 96675 -127197 -187368 85692 -164469 128720 104814
$$ packed form
18481h508r7274b7103F5433f7086j52359B9245b21694A80436n0339B226P9297
18470H1523J47683C3613b37125A5922a03279A51676p4330f9541l9678B04147e08069
18458g3733B6155J41843b15944r715A78966b63412H8475b69039I215a2530l272
18447a5802j05829B8714N12h4691A62167G6264m247a39989L9612B44069a84623
18435A92829E5292K78511d3043j69889i7823k11071F725d6060D500J4670c35366
18423I9698d1527B230M7323e48651a86902A93407f2118b4867G2098k2145m635
18412D5318J67138c9540C3033c8890I2231g3773A23512b8964r8820M5976A11466
18400b69695h4029k13861A16245j9570a27197o0171H5692a64469A28720k3906
$$ plain form
18390 104814 68190 -310337 -88993 164316 -195535 -248681 -21217 -290982 219001 68671
18379 -290840 -63901 -201900 18648 -302475 -330688 16434 -106237 -72147 2478 -37093 -79709
18368 -79709 -104079 141833 263426 -243239 183580 84740 -38462 79723 -169134 -331675
18358 -331675 -317789 44791 -291726 145054 96551 43848 15943 12133 48501 221718 191334
18347 191334 50591 13041 138189 320123 -18058 -7856 260370 17225 -31508 235225 9843
18335 -43285 -571117 87054 -233125 -18250 181714 183177 -247718 -89483 -279062 251328 -206359
18323 -50100 -91461 -184905 -107024 15922 -243159 13927 -52369 -208476 39828 -274682 -92591
18311 -290120 -79623 175482 -40757 -284150 153045 -259587 267479 -30701 70152 -249540
$$ packed form
18390A04814l6624c10337h8993A64316a95535n3146b1217k69765B19001F8671
18379b90840f3901j37999A8648c02475k8213A6434a06237L4090B478c7093m2616
18368g9709k4370A41833J21593b43239A83580H4740c8462G9723a69134j62541
18358c31675J3886D4791b91726A45054m8503D3848A5943l810L6368J73217l0384
18347A91334E0591A3041J25148J81934a8058g856B60370A7225c1508B35225I843
18335d3285n27832H7054b33125a8250A81714J463b47718h9483j89579B51328b06359
18323e0100m1361r3444P7881A5922b43159A3927e2369j56107C9828b74682i2591
18311b90120g9623A75482d0757k43393A53045b59587B67479c0701G0152b49540
$$ plain form
18300 -189013 -45649 -20221 41928 -34431 88316 93311 232293 68332 -80656 106501 19236
18288 -185654 -15240 11895 -150262 41196 11321 69957 -398013 -227348 139008 18557 -42392
18276 -354250 -18480 -58778 62381 -176348 -120151 -202426 -7695 293526 -86559 -163079 -35956
18264 -272393 -113055 -173280 -99419 450683 1697 -196086 8819 55955 -56196 31040 156826
18253 156826 122563 199217 -9258 -352571 134947 295912 -36765 -203717 145486 -110578
18242 127289 -187783 113743 -188846 485764 230075 -267649 106883 174610 70508 34244
18231 199883 -83908 -92564 -288284 -406632 -128038 -224497 128877 -84391 -102647 -42742 -89526
18220 -89526 168860 -229031 -367557 91760 -165085 -23680 -249366 -100906 -15669 -33454
$$ packed form
18300a89013d5649b0221D1928c4431H8316M995J38982F8332h0656A06501A9236
18288a85654a5240A1895a50262D1196A1321N8636c98013J70665A39008A8557d2392
18276c54250a8480m0298F2381a76348N6197q2275g695B93526h6559p6520c5956
18264b72393a13055o0225P3861D50683A697a96086H819M7136e6196C1040J25786
18253A56826l4263P6654i258l43313A34947J60965c6765j66952A45486a10578
18242A27289a87783A13743a88846D85764B30075b67649A06883O7727G0508C4244
18231A99883h3908q656j95720j18348a28038r6459A28877h4391j8256d2742m6784
18220h9526A68860b29031j38526I1760a65085b3680k25686a00906a5669j7785
$$ plain form
18210 -33454 -69859 261436 -98038 -140899 25028 96582 -247221 83755 105066 -128389 164526
18198 -188495 258647 287537 -149586 124660 122827 -251960 -54521 -260509 -370203 -104432
18187 57026 -175968 -221654 -27004 2811 45876 109412 132601 171270 203527 38697 -136780
18175 -3 78194 -236109 173020 -73872 -74250 -135841 15495 161858 67291 196316 -365498 -381356
18163 -381356 -83399 156923 194371 -269667 -353043 243853 -207285 -144715 243878 -219397
18152 302174 -29491 278137 -330326 110040 -49814 -33447 -294468 -170474 -378694 -26356
18141 31030 157877 32937 -83899 -71737 -179752 62708 163114 -323533 150421 288118
18131 288118 377264 120138 178774 -324962 223996 55736 67958 -62986 -22256 -180352 -434197
$$ packed form
18210c3454l6405B61436i8038m2861B5028P1554b47221H3755K1311a28389A64526
18198a88495B58647K8890a49586A24660j833b51960e4521k05988j09694a04432
18187E7026a75968m5686b7004B811M3065O3536K3189L8669L2257C8697a36780
18175cG8194b36109A73020g3872l78o1591A5495J46363F7291J29025c65498j5858
18163c81356h3399A56923L7448b69667q3376B43853b07285O2570B43878b19397
18152C02174b9491B78137c30326A10040d9814J6367k61021J23994k08220b6356
18141C1030J26847C2937h3899J2162j08015F2708J00406c23533A50421J37697
18131B88118Q9146A20138N8636c24962B23996E5736J2222f2986b2256j58096k53845
$$ plain form
18120 -434197 115110 139048 123581 -74047 65528 350185 -304228 -217817 23880 -24653 -110038
18109 -110038 186763 214311 173946 83422 38909 -234428 267113 291129 -308538 53663 -351672
18097 20244 57734 -180435 261247 65409 10017 226971 -369109 -379445 -48544 96509 -76671
18085 26068 56451 155460 -221107 82785 -142037 -91729 93132 -305163 17908 185128 -261965
18073 -86856 343526 -84846 -29823 74626 152035 257836 41546 -14849 111393 -67784 46332
18061 -80732 300239 -42491 240154 -176476 15978 -184693 432644 419544 115081 61366
18051 61366 -221819 86842 228741 -142881 -106428 18793 117573 -367543 -44740 -59962 185878
18039 82215 -54078 233860 135888 28384 -142695 -62728 202473 -11690 -243207 20916 -277366
$$ packed form
18120d34197A15110K3938j5467g4047F5528K84657c04228Q6411B3880b4653q5385
18109a10038A86763K7548m0365H3422C8909b34428B67113K4016c08538E3663c51672
18097B0244L7490a80435B61247F5409A0017K16954c69109j0336d8544I6509g6671
18085B6068L0383R9009b21107H2785a42037N0308I3132c05163A7908J67220b61965
18073h6856C43526h4846b9823G4626P7409J05801D1546a4849A11393f7784D6332
18061h0732C00239d2491B40154a76476A5978a84693D32644j3100A15081n3715
18051F1366b21819H6842J41899a42881L6453A8793R8780c67543d4740j5222A85878
18039H2215e4078B33860r7972B8384a42695f2728B02473a1690k31517B0916b77366
$$ plain form
18027 -62898 -80080 -228494 226201 1476 100437 107290 140687 4503 -60941 -61244 -42397 87346
18014 201004 -108235 -98715 -191671 81784 32916 178289 229177 15577 45899 229962 219502
18003 219502 113677 -47829 -125408 47764 -243516 -93628 -127021 -80244 6028 135260 -53574
17991 96676 13598 -66017 206515 147100 186049 63733 287034 69147 -84114 186247 -65442
17979 -143371 81397 -33260 148139 236047 -24592 175956 125609 -39896 83989 146616 -41891
17967 -23388 40258 -77057 -239049 10368 -24167 103064 102724 315920 -8051 9381 -162699 35647
17954 376393 62670 200509 127778 156220 292829 57565 -213771 -186988 98843 289961 -152097
17942 -81627 16977 276739 -241420 185931 -21793 -237542 106320 176185 -221294 2154 -244745
$$ packed form
18027f2898j7182j48414B26201A476R8961O853L3397D503f0941l03J8847H7346
18014B01004a08235R520r2956H1784C2916J45373N0888A5577L0322J84063j0460
18003B19502j05825d7829p7579D7764b43516i3628l3393M6777F028J29232e3574
17991I6676A3598f6017B06515n9415L8949F3733K23301F9147h4114A86247f5442
17979a43371H1397c3260A48139Q7908b4592A75956n0347c9896H3989O2627d1891
17967b3388D0258g7057j61992A0368b4167A03064l40K13196h051I381a62699C5647
17954C76393F2670J37839p2731K8442J36609E7565b13771K6783I8843J91118a52097
17942h1627A6977K59762b41420A85931b1793k15749A06320O9865b21294B154b44745
$$ plain form
17930 -197726 162760 213450 -144245 99359 -18819 12753 136521 282962 145458 -145889
17919 -90231 78769 4451 203374 -11263 63406 107639 217226 135734 254942 -221622 -102853
17907 311074 -148309 -204697 -1094 211020 173779 -80076 3293 190785 -349267 -142307 436799
17895 153451 -146881 -358968 -98147 -218231 -210810 -242225 -18868 47764 37426 59029 159632
17884 159632 3965 269848 -37451 -78062 92147 209057 504168 -81102 -278648 -20327 -34785
17873 -34785 145478 -332416 -146494 14704 18431 -158272 -240488 390084 97873 -109870 -126275
17862 -126275 -188686 388677 93971 296781 235166 -23794 492833 -255575 82485 158661 308551
17851 308551 -116251 -193004 -66718 292202 111866 113775 -111254 139260 -53487 -186790
$$ packed form
17930a97726A62760N0690a44245I9359a8819A2753J23768J46441j37504a45889
17919i0231G8769D451J98923a1263F3406M4233J09587q1492J19208b21622a02853
17907C11074a48309n6388a094B11020l7241h0076C293J87492c49267a42307D36799
17895A53451a46881k12087i8147j20084P421l1415a8868D7764j0338K1603J00603
17884A59632C965K65883c7451m0611I2147J16910K95111h1102j97546b0327j4458
17873c4785A45478c32416a46494A4704L727a58272q2216C90084I7873a09870j6405
17862a26275o2411C88677I3971K02810o1615b3794D92833b55575H2485P6176J49890
17851C08551a16251p6753f6718B92202A11866J909a11254A39260e3487j33303
$$ plain form
17841 -186790 179763 161624 -16588 51389 239623 301535 -265186 128232 -262466 -225868
17831 -225868 260277 253925 159929 26928 -173884 117193 117525 247258 274903 33223 -87792
17819 -230644 -245892 -224815 176284 -86812 160896 -58472 11454 95879 291485 -11553 -22886
17808 -22886 70649 155376 -125729 41481 -785 316655 122352 13415 114717 276845 -124063
17796 298842 251970 241408 -31713 143113 -87286 214073 178873 97929 519259 38587 256047
17785 256047 101700 65116 185624 -244997 -154344 153716 -158764 -156523 302448 8388 7677
17774 7677 -147048 117362 -117893 -75190 134937 193886 265051 397856 418755 -368740 -92172
17762 -7909 -61792 134475 192024 89138 -130710 -124192 -60698 -153399 51930 -66213 4511 151041
$$ packed form
17841a86790A79763j8139a6588E1389J88234O1912b65186A28232b62466L6598
17831b25868B60277o352r3996B6928a73884A17193L32J29733K7645C3223h7792
17819b30644j5248K1077A76284h6812A60896e8472A1454Q4425J95606a1553j1333
17808b2886G0649Q4727a25729D1481g85C16655A22352A3415J01302J62128a24063
17796B98842m6872j0562c1713A43113h7286B14073l5200q0944M21330C8587K17460
17785B56047A01700l6584J20508b44997R0653A53716a58764K241C02448H388p11
17774G677a47048A17362a17893M2703A34937N8949P1165J32805K0899c68740i2172
17762g909n3883A34475N7549H9138a30710O518f0698r2701E1930f6213D511J46530
$$ plain form
17750 151041 -96242 60548 151702 -86750 83633 156765 36006 172232 426628 -15592 323920
17738 -52115 304585 -141752 -316178 286429 107395 380893 -6473 5534 -5272 354312 -60142
17726 -89158 132369 165780 132943 221283 88950 166593 207552 88621 148097 -123137 166509
17714 -112617 -20109 63642 -195002 58123 86690 304203 -55161 121494 -31326 55125 -130108
17702 267756 -100652 136951 259433 56306 -146712 90086 100312 86217 -211813 55179
17691 42007 272413 222456 32691 168055 169433 193989 14015 -96632 16440 -20374 338 -55778
17678 129560 -109636 325082 -224884 50717 -64832 -64011 -7134 330292 -94429 -74160 -107273
17667 -107273 35431 295590 227960 129360 -28675 272853 59624 191408 120663 188990 408861
$$ packed form
17750A51041i6242F0548R1154h6750H3633P3132C6006J36226K54396a5592C23920
17738e2115C04585a41752j74426B86429A07395K73498f473E534e272C54312f0142
17726h9158A32369L3411l2837Q8340H8950P7643M0959H8621N9476a23137A66509
17714a12617b0109F3642a95002E8123K8567K17513e5161A21494c1326E5125a30108
17702B67756a00652A36951J22482E6306a46712I0086J0226j4095b11813E5179
17691D2007K30406m9957C2691J35364J378K4556A4015i6632A6440b0374C38e5778
17678A29560a09636C25082b24884E0717f4832Q21g134C30292i4429K0269l3113
17667a07273C5431K60159o7630r8600b8675B72853E9624J31784p0745O8327K19871
$$ plain form
17656 408861 23919 287934 -112772 -79554 -52981 -66688 93883 376058 6322 17502 17592 63984
17644 63984 -88511 286772 87971 159575 -199417 70842 101706 -182102 173543 170422 -61848
17632 236670 10236 67077 120358 185394 -2147 219261 50578 -41382 50785 241253 622461
17621 622461 189229 30006 330133 207073 381456 306131 266083 51696 19925 52963 -328020
17609 15822 76461 42477 212269 121360 213558 -123006 341224 16871 340874 -270218 294076
17597 125320 126464 -2127 17511 323285 255267 -47320 112012 -8049 128514 177918 82200
17585 271752 -42444 229483 356629 96396 273702 254790 21034 650 133623 134706 -75439
17573 449391 -82098 451297 -149736 197965 -91952 151970 15942 50556 -7017 -64456 224906
$$ packed form
17656D08861B3919K64015a12772L3218K6573j3707I3883K82175F322J1180R0M6392
17644F3984h8511B86772H7971P1604a99417G0842L0864a82102A73543l121f1848
17632B36670A0236N6841N3281O5036b147B19261E0578d1382E0785J90468L81208
17621F22461A89229C0006L00127j23060J74383p5325m0048E1696A9925L3038c28020
17609A5822O0639l3984J69792r0909R2198a23006C41224A6871L24003b70218B94076
17597A25320J144b127A7511L05774o8018d7320A12012h049A28514M9404H2200
17585B71752d2444B29483J27146I6396J77306j8912B1034F50J32973J083g5439
17573D49391h2098D51297a49736A97965i1952A51970A5942L4614g017n7439B24906
$$ plain form
17561 93403 315680 76127 7429 56806 131781 152376 137612 -117220 -129995 524839 -17223
17549 68523 266236 213476 -83330 153116 130984 307617 -19208 369853 269072 -53907 266404
17537 -118410 201174 -61697 171039 384335 -22786 266679 137955 367506 142140 141422
17527 141422 988774 743135 1191911 1025527 1317018 401252 490258 287379 387992 224912
17517 224912 395438 370896 416857 465783 530979 351880 994642 670016 870424 668080
17507 668080 464167 466680 393080 455772 137871 533167 340619 231675 469029 383704
17497 383704 443936 206557 -20343 404905 360222 575487 311868 353098 331799 316754 354066
17486 354066 302962 103646 673671 341352 193228 488567 -71273 418652 348655 432469
$$ packed form
17561I3403K22277G6127G429M9377P4975K0595j4764a17220j2775E24839a7223
17549F8523J97713n2760h3330A53116k2132J76633a9208C69853j00781e3907B66404
17537a18410B01174f1697A71039K13296b2786B66679j28724K29551A42140p18
17527A41422Q47352k45639M48776j66384K91491D01252Q9006k02879J00613j63080
17517B24912J70526k4542M5961M8926O5196j79099O42762l24626K00408k02344
17507F68080k03913K513p3600O2692A37871L95296j92548j08944K37354q5325
17497C83704O0232B06557b0343D04905m4683K15265k63619M1230k1299j5045L7312
17486C54066n1104A03646N70025l32319j48124K95339g1273D18652o9997Q3814
$$ plain form
17476 432469 384727 125305 63636 483409 477186 75861 368996 80075 208285 104029 373183
17465 373183 203700 213240 546292 119445 -10593 345038 67641 95592 377169 195835
17455 195835 317793 367886 336143 544257 284479 399810 308140 414479 483470 449223
17445 449223 629583 178964 535486 516635 259293 609857 571861 208546 132000 445013
17435 445013 638504 175509 93002 -14037 306897 640802 323727 446280 315103 538093
17425 538093 250205 217490 -9004 363739 203527 469194 290846 254890 234250 131226
17415 131226 193049 261451 318874 335477 535373 299917 25415 3573 342901 680954 113883
17403 97781 129640 260095 426939 433382 346238 138736 363257 296292 87147 43748 205608
$$ packed form
17476D32469m7742A25305o1669M19773o223G5861K93135H0075J28210A04029K69154
17465C73183j69483R540L33052A19445a0593C45038F7641K7951K81577j81334
17455A95835J21958N0093l1743K08114k59778J15331r1670J06339O8991l4247
17445D49223J80360A78964L56522j8851k57342L50564l7996B08546p6546L13013
17435D45013J93491A75509q2507a4037C06897L33905l17075J22553j31177K22990
17425E38093B50205l2715i004C63739j60212K65667j78348l5956k0640j03024
17415A31226O1823O8402N7423J6603J99896k35456B5415C573L39328L38053A13883
17403I7781L1859J30455J66844O443q7144A38736K24521o6965H7147m3399J61860
$$ plain form
17392 205608 246168 196206 319091 274665 363238 267380 -7687 30579 275613 124500 335864
17381 335864 235504 212148 282111 232255 328956 518407 222625 -120054 170288 436275
17371 436275 43937 3710 263904 273374 435029 281995 319803 680598 249166 552357 112446
17359 183958 469412 -172236 222985 360777 229527 401136 -6087 309323 315741 262319
17349 262319 223815 244841 263926 71285 313035 245076 515817 430948 111155 205716 486532
17338 486532 433414 540394 25113 520354 442736 322675 467679 33692 261939 47820
17327 463630 240893 492239 452049 216886 394261 33095 481523 264125 95209 -132928
17316 301572 389900 144814 234338 379903 243137 226099 380237 428915 474498 416690 -65374
$$ packed form
17392B05608M0560m9962J22885m4426Q8573r5858g687C0579K45034A24500K11364
17381C35864j00360k3356O9963m9856R6701J89451B22625a20054A70288K65987
17371D36275D3937C710K60194R470J61655j53034L7808L60795B49166L03191A12446
17359A83958K85454a72236B22985J37792j31250J71609f087C09323O418n3422
17349B62319l8504K1026J9085G1285K41750o7959K70741q4869A11155R4561K80816
17338D86532n3118J06980B5113M95241p7618j20061J45004C3692K28247D7820
17327D63630k22737K51346m0190B16886J77375C3095M48428k17398I5209a32928
17316C01572Q8328A44814Q9524J45565j36766j7038J54138M8678M5583n7808f5374
$$ plain form
17304 319908 194533 136351 656127 182888 331561 190250 434598 446586 255553 364131
17294 364131 173886 410074 446604 -67330 522621 676380 465658 727983 299118 335069
17284 335069 238389 250317 210439 445074 223023 421207 341862 377270 420656 528234 583026
17273 583026 274306 333960 300647 447388 139552 462821 335223 578627 458248 222916
17262 335427 273230 378994 669933 605090 280918 227432 291667 285028 237763 399798 368855
17251 368855 233027 303212 162106 385938 384749 230560 418041 -70893 544580 274880
17241 274880 393907 344433 285382 272809 720022 733436 512546 280172 355788 341001 566548
17230 566548 203645 553208 521343 871618 -96278 446249 96171 563178 411726 253355
$$ packed form
17304C19908j25375n8182N19776A82888J48673j41311K44348J1988j91033J08578
17294C64131A73886K36188L6530f7330E22621J53759k10722K62325B99118L5951
17284C35069r6680J1928l9878K34635k22051J98184p9345L5408M3386J07578N4792
17273E83026B74306N9654l3313J46741A39552L23269j27598K43404j20379B22916
17262C35427o2197J05764K90939o4843B80918n3486O4235o639m7265J62035l0943
17251C68855j35828P0185j41106K23832j189j54189J87481g0893E44580k69700
17241B74880J19027m9474n9051j2573M47213J3414k20890k32374P5616j4787K25547
17230E66548B03645L49563l1865L50275i6278D46249I6171M67007j51452j58371
$$ plain form
17220 253355 491620 268133 471043 515623 416165 513254 425111 407581 230463 495159
17210 495159 611018 723963 425512 729346 874587 660727 478485 559990 348734 726047
17200 726047 497842 342078 365493 582983 456697 151869 861780 412522 437807 189781
17189 493785 420988 461633 426728 363993 586695 548339 813386 271383 697879 563687
17179 563687 377362 511541 579307 354228 452051 329371 726613 968717 357754 469810
17169 469810 397337 515012 246594 573675 614626 470361 575058 169652 811789 664086
17159 664086 599542 396015 649236 628094 545816 482937 561856 470127 807572 641806 618411
17148 618411 639268 682070 597987 460640 533375 1021491 340583 493019 719088 610840
$$ packed form
17220B53355K38265k23487K02910M4580r9458R7089q8143j7530j77118K64696
17210D95159J15859J12945k98451L03834J45241k13860j82242Q1505k11256L77313
17200G26047k28205j55764K3415K17490j26286A51869P09911D12522K5285A89781
17189D93785p2797M0645l4905o2735K22702l8356K65047B71383M26496j34192
17179E63687j86325J34179O7766k25079R7823j22680L97242K42104C57754J12056
17169D69810p2473J17675B46594L27081M0951j44265J04697A69652O42137j47703
17159F64086o4544k03527K53221k1142q2278o2879P8919r1729L37445j65766k3395
17148F18411K0857M2802q4083j37347P2735M88116C40583J52436K26069j08248
$$ plain form
17138 610840 650621 614492 786109 717497 539504 521408 706162 838287 525495 598400
17128 598400 635493 484209 582633 839544 380490 479926 530695 409325 813519 910644
17118 910644 740844 659826 434833 705857 769197 1124854 988603 846463 547686 600677
17108 600677 719787 1054079 811970 769740 537520 500766 773987 954777 588941 477853
17098 477853 912212 778867 888330 737296 807248 1031629 585481 986174 1274411 913597
17088 913597 849021 652213 721864 899168 805443 993266 808545 744407 505972 716813
17078 716813 940361 961265 725596 892463 739140 560174 963188 889068 991762 1289311
17068 1289311 728804 1071072 1190006 735219 791112 1347204 847347 732298 1058140 1090722
$$ packed form
17138F10840L9781l6129J71617o8612j77993j8096J84754J32125l12792P2905
17128E98400L7093j51284R8424K56911C80490R9436N0769j21370M04194R7125
17118I10644j69800q1018k24993K71024O3340L55657j36251j42140k98777N2991
17108F00677J19110L34292k42109m2230k32220l6754K73221J80790l65836j11088
17098D77853M34359j33345J09463j51034O9952K24381m46148M00693K88237l60814
17088I13597o4576j96808O9651J77304r3725J87823j84721o4138k38435K10841
17078G16813K23548K0904k35669J66867j53323j78966M03014p4120J02694K97549
17068A289311n60507L42268J18934m54787N5893N56092m99857j15049L25842L2582
$$ plain form
17058 1090722 1000938 891049 1034749 1216136 1036839 1026473 1365973 1089059 951108 804954
17048 804954 1218420 686489 1061128 905841 1233610 1055213 1272317 1215178 1082824 1170582
17038 1170582 1274030 1145341 1309761 1202935 897971 792409 1189917 1105862 975450 1236681
17028 1236681 1383114 1103651 1373449 1430097 1430916 1021399 1366937 1212003 971781 1127379
17018 1127379 1306804 1416856 1350085 1189475 1567604 1125560 1355494 1433024 927352 1222624
17008 1222624 1268068 1193708 1366312 1236881 1560883 1219386 1103048 1423920 1457145 1317762
16998 1317762 1262095 1618010 1171858 1713390 1669082 1189233 1768078 1416231 1549723 1306510
16988 1306510 1456803 1778329 1715612 1503084 1812174 1471596 1912193 1868602 1487030 1980904
$$ packed form
17058A090722q9784j09889J43700J81387j79297j0366L39500k76914j37951j46154
17048H04954M13466n31931L74639j55287L27769j78397K17104n7139j32354Q7758
17038A170582J03448j28689J64420j06826l04964j05562L97508q4055j30412K61231
17028A236681J46433k79463K69798N6648Q19m09517L45538j54934k40222J55598
17018A127379J79425J10052o6771j60610L78129m42044K29934P7530n05672K95272
17008A222624M5444p4360J72604j29431L24002l41497j16338L20872L3225j39383
16998A317762n5667L55915m46152N41532m4308m79849N78845l51847J33492k43213
16988A306510J50293L21526o2717k12528L09090l40578M40597m3591l81572M93874
$$ plain form
16978 1980904 1864960 1677275 1725076 1748458 1778898 1527887 1762719 1838236 1907912 2046595
16968 2046595 1619162 1834360 1709686 2018234 1653645 1847462 1879791 1973451 1871834 2046684
16958 2046684 1559496 1894353 1777968 2495652 2197487 2239761 2075017 2455055 1983876 1927575
16948 1927575 2212891 2012063 1778743 2251575 1968446 2431240 2399652 2377584 2429652 2222537
16938 2222537 2328301 2568682 2254825 2440616 2135786 2736993 2469226 2184899 2772725
16929 2772725 2355041 2950883 2894307 2454873 2970397 2899081 2760220 2879267 2704884 2362405
16919 2362405 2740041 2750802 2876156 3204502 2992023 2800876 3157471 3072479 3175215 3033828
16909 3033828 3297885 3348597 3136023 2974808 3469710 3205209 3278600 3260052 3414915 3358443
$$ packed form
16978A980904j15944j87685M7801K3382L0440k51011K34832P5517O9676J38683
16968B046595m27433K15198j24674L08548l64589J93817L2329R3660j01617J74850
16958B046684m87188L34857j16385P17684k98165M2274j64744L80038m71179n6301
16948A927575K85316k00828k33320M72832k83129M62794l1588k2068N2068k07115
16938B222537J05764K40381l13857J85791l04830O01207k67767k84327N87826
16929B772725m17684N95842n6576m39434N15524p1316j38861J19047j74383l42479
16919B362405L77636J0761J25354L28346k12479j91147L56595q4992J02736j41387
16909C033828K64057N0712k12574j61215M94902k64501P3391j8548J54863n6472
$$ plain form
16899 3358443 3366670 3697321 3579234 3705676 3389382 3416066 3796813 3543965 4141495 3880564
16889 3880564 3612467 4192181 3844122 4218414 4281313 4327273 3901141 4401381 4258516 4266610
16879 4266610 4335108 4576786 4311757 4241850 4569904 4399115 4959238 4754211 4999270 5080388
16869 5080388 5039647 4821286 4937496 5144981 5055793 5332730 5282169 5352891 5512202 5561237
16859 5561237 5333930 5831320 5948820 5675828 6195496 5941815 6291509 6158029 6243389 6364642
16849 6364642 6688233 6728343 6806907 6882934 6630871 7252239 6935161 6932666 7204380 7342796
16839 7342796 7376462 7951229 7763781 8170106 7830559 8180952 8155830 8174516 8632546 8666064
16829 8666064 9145429 8940897 9392078 9193751 9673011 9934909 9470748 10048097 10120276 10305186
$$ packed form
16899C358443Q227L30651j18087J26442l16294K6684L80747k52848N97530k60931
16889C880564k68097N79714l48059L74292O2899M5960m26132N00240j42865Q094
16879D266610O8498K41678k65029o9907L28054j70789N60123k05027K45059Q1118
16869E080388m0741k18361J16210K07485q9188K76937n0561P0722J59311M9035
16859E561237k27307M97390J17500k72992N19668k53681L49694j33480Q5360J21253
16849F364642L23591M0110P8564P6027k52063O21368l17078k495K71714J38416
16839G342796L3666N74767j87448M06325l39547L50393k5122J8686M58030L3518
16829H666064M79365k04532M51181j98327M79260K61898m64161N77349P2179J84910
$$ plain form
16819 10305186 10946623 11051947 11268413 11251557 11681736 11351709 11875030 12069356 12505159
16810 12505159 12766834 13091196 12975180 13545499 14076359 14259482 14361707 14594392 15111430
16801 15111430 15303234 15814326 15642339 16165870 16784013 17307612 17469572 17920926 18558997
16792 18558997 18658037 19408626 19933853 20341074 20770507 20858832 21845381 22461978 23113848 23511268
16782 23511268 23671605 24726445 25646861 26068519 27104635 27434656 28479506 29021317 29958416
16773 29958416 30861945 31942466 32579329 33718925 34624584 35582810 36691758 37941252 39240511
16764 39240511 40054458 41522572 42202871 43866718 45319176 46764185 48204835 49671104
16756 49671104 51499145 52910706 54762891 56342470 58424177 60083780 61855231 63596942
$$ packed form
16819A0305186O41437J05324K16466j6856M30179l30027N23321J94326M35803
16810A2505159K61675L24362j16016N70319N30860J83123J02225K32685N17038
16801A5111430J91804N11092j71987N23531O18143N23599J61960M51354O38071
16792A8558997R9040P50589N25227M07221M29433Q8325R86549O16597O51870L97420
16782B3511268J60337J054840R20416M21658J036116L30021J044850N41811R37099
16773B9958416R03529J080521O36863J139596R05659R58226J108948J249494J299259
16764C9240511Q13947J468114O80299J663847J452458J445009J440650J466269
16756D9671104J828041J411561J852185J579579K081707J659603J771451J741711
$$ plain form
16748 63596942 65761143 67395236 69699831 71878223 73977106 75884758 78135757 80444544
16740 80444544 82342030 84526027 86479503 88771987 90269408 92429767 94408479 96212788
16732 96212788 97904363 99137514 100434657 101629294 102482991 103526003 104252134 104523214
16724 104523214 104886072 104928099 104786001 104495997 103620962 102832495 102125436 100901943 99248090
16715 99248090 98061075 96333519 94698873 92964040 91001037 88876611 87111486 85007719
16707 85007719 82591276 80382625 78081822 76634924 74020449 72152852 69708126 67784804
16699 67784804 65799389 63601896 61752443 59628739 57963729 55945469 54391229 52662702
16691 52662702 51080006 49432391 47575440 46294272 44974672 43590008 42068224 40760176
$$ packed form
16748F3596942K164201J634093K304595K178392K098883J907652K250999K308787
16740H0444544J897486K183997J953476K292484J497421K160359J978712J804309
16732I6212788J691575J233151J297143J194637Q53697J043012P26131K71080
16724A04523214L62858M2027j42098k90004q75035p88467p07059j223493j653853
16715I9248090j187015j727556j634646j734833j963003k124426j765125k103767
16707H5007719k416443k208651k300803j446898k614475j867597k444726j923322
16699F7784804j985415k197493j849453k123704j665010k018260j554240j728527
16691E2662702j582696j647615j856951j281168j319600j384664j521784j308048
$$ plain form
16683 40760176 39567491 38373719 37125316 35883214 35099718 33680101 32735522 31779176
16675 31779176 30917571 30252830 29283364 28245617 27315934 26448175 26273351 25378903 24645174
16666 24645174 24154555 23198321 22514125 22075189 21525677 20641930 20501600 20070413 18846280
16657 18846280 18856415 18563401 17969069 17349862 17042523 16543415 16345947 15920950 15543974
16648 15543974 14826735 14865578 14636025 14102292 13589353 13455908 13413236 12807424 12767317 12081894
16638 12081894 12065213 11725958 11445935 11223801 11258360 10702673 10688194 10018732 10463803 9921085
16628 9921085 9672293 9571018 9217236 9448976 9383020 8926027 8636075 8558800 8483714 8422834
16618 8422834 8180383 7652722 8082619 8225697 7688201 7427280 7132759 7306976 7048972
$$ packed form
16683D0760176j192685j193772j248403j242102p83496j419617r44579r56346
16675C1779176q61605o64741r69466j037747r29683q67759j74824q94448p33729
16666B4645174m90619r56234o84196m38936n49512q83747j40330m31187j224133
16657A8846280J0135k93014n94332o19207l07339m99108j97468m24997l76976
16648A5543974p17239L8843k29553n33733n12939j33445m2672o05812m0107o85423
16638A2081894j6681l39255k80023k22134L4559n55687j4479o69462M45071n42718
16628I921085k48792j01275l53782K31740o5956m56993k89952p7275p5086o0880
16618H422834k42451n27661M29897J43078n37496k60921k94521J74217k58004
$$ plain form
16609 7048972 7218315 6847565 6782610 6590432 6295986 6228065 6411804 5933577 5916634 5949304
16599 5949304 5802235 5646007 5812692 5513025 5712084 5555174 5523225 5634853 5371507 5350072
16589 5350072 4978262 4885701 4651289 5105495 5030712 4770262 4576002 4275008 4561435 4310615
16579 4310615 4529353 4560562 4288294 4218378 4252525 4004400 3983618 3978456 4329875 4055514
16569 4055514 3748959 3817785 3581876 3799963 3581953 3516423 3484713 3591752 3442624 3342469
16559 3342469 3419301 3487315 3434021 3409969 3039098 3378758 3398068 3206839 3088329 2753099
16549 2753099 2647445 2864782 3424650 2930776 2963989 2847799 2671152 2289841 2690880 2516887
16539 2516887 2645224 2727097 2764986 2765298 2554340 2651433 2248669 2626284 2511036 2456700 2290800
$$ packed form
16609G048972J69343l70750o4955j92178k94446o7921J83739m78227j6943L2670
16599E949304j47069j56228J66685k99667J99059j56910l1949J11628k63346k1435
16589E350072l71810r2561k34412M54206p4783k60450j94260l00994K86427k50820
16579D310615K18738L1209k72268o9916L4147k48125k0782n162L51419k74361
16569D055514l06555O8826k35909K18087k18010o5530l1710J07039j49128j00155
16559C342469P6832O8014n3294k4052l70871L39660J9310j91229j18510l35230
16549B753099j05654K17337N59868m93874L3213j16190j76647l81311M01039j73993
16539B516887J28337Q1873L7889L12k10958R7093m02764L77615j15248n4336j65900
$$ plain form
16528 2290800 2413901 2453464 2036492 2259760 2226705 2291770 2219315 2635627 2187901 2195849
16518 2195849 2243940 1949173 2144232 2183008 1796618 2317799 1998439 2091081 1950966 1969955
16508 1969955 1921462 1944938 1901627 1887656 2058697 1627669 1493759 1665826 1840166 2048439
16498 2048439 1321809 1776703 1817348 1737426 1371795 1613653 1512812 1711037 1575770 1623339
16488 1623339 1208158 1822929 1636661 1643978 2062467 1632648 1236708 1452726 1722328 1507844
16478 1507844 1396999 1410443 1830954 1572710 1520223 1610939 1529534 987188 1231084 1615719
16468 1615719 1147523 1497943 1287415 1223440 1362778 1345404 1383505 1312789 1199777 1542064
16458 1542064 1007204 883254 1332044 1288975 1203274 1434846 1260964 1120967 1064288 1111280
$$ packed form
16528B290800J23101L9563m16972K23268l3055O5065p2455M16312m47726P948
16518B195849M8091k94767J95059L8776l86390N21181l19360R2642j40115J8989
16508A969955m8493K3476m3311j3971J71041m31028j33910J72067J74340K08273
16498B048439p26630M54894M0645p9922l65631K41858j00841J98225j35267M7569
16488A623339m15181O14771j86268P317M18489m29819l95940K16018K69602k14484
16478A507844j10845J3444M20511k58244n2487R0716q1405n42346K43896L84635
16468A615719m68196L50420k10528o3975J39338j7374L8101p0716j13012L42287
16458A542064n34860j23950M48790m3069q5701K31572j73882j39997n6679M6992
$$ plain form
16448 1111280 1155866 907817 1220086 1028383 1141982 1041274 946668 1221219 1254178 1167043
16438 1167043 1023064 1021621 791523 685624 1189718 873858 987472 1140051 910740 978901
16428 978901 1081768 910075 1015482 1067022 870269 810374 1186191 731060 917252 1025046
16418 1025046 1213152 500483 1142221 767366 536333 606876 951554 1104614 995118 794567
16408 794567 519560 917789 910762 855475 525339 571735 843528 847725 837892 929119 933179
16397 933179 736188 867827 824278 872816 915691 759798 779263 638289 627972 808220
16387 808220 428859 905719 514294 764061 551565 938527 589835 486666 990069 394421
16376 447962 517959 405624 590566 622139 339538 834902 477941 903787 692017 390582
$$ packed form
16448A111280M4586k48049L12269j91703J13599j00708r4606K74551L2959q7135
16438A167043j43979j443k30098j05899N04094l15860J13614J52579k29311O8161
16428I78901J02867j71693J05407N1540j96753n9895L75817m55131J86192J07794
16418A025046J88106E00483O41738l74855k31033P0543L44678J53060j09496k00551
16408G94567k75007L98229p027n5287l30136M6396K71793M197r833R1227M060
16397I33179j96991J31639m3549M8538M2875j55893J9465j40974j0317J80248
16387H08220l79361M76860l91425K49767k12496L86962l48692j03169N03403C94421
16376D47962O9997j12335J84942L1573k82601M95364l56961M25846k11770l01435
$$ plain form
16366 390582 402456 565633 759710 353905 715419 885355 627954 955365 306320 354673
16356 354673 582171 792024 460782 596984 719426 793592 553554 613583 409116 235178
16346 235178 349923 466820 520339 402441 507245 369937 371495 516366 695967 170202
16335 490491 457492 357475 396894 627342 449092 569766 452332 427831 582770 494733
16325 494733 459828 267119 222680 402311 500762 313014 551207 477630 496668 376547
16315 376547 224551 404774 237609 507421 51319 324937 608480 593740 -33681 330560
16304 314858 370442 456726 465468 349964 586553 224698 86989 261348 380670 359194 298670
16293 298670 621748 559165 325197 118344 620245 202629 144046 316222 443594 235824
$$ packed form
16366C90582J1874J63177J94077C53905L61514J69936k57401L27411C06320M8353
16356C54673K27498K09853l31242J36202J22442P4166k40038O0029k04467j73938
16346B35178J14745J16897N3519j17898J04804j37308J558J44871J79601A70202
16335D90491l2999j00017L9419K30448j78250J20674j17434k4501J54939q8037
16325D94733l4905j92709m4439J79631R8451j87748K38193p3577J9038j20121
16315C76547j51996J80223j67165K69812E1319K73618K83543j4740c3681C30560
16304C14858N5584Q6284Q742j15504K36589B24698H6989J74359J19322k1476o0524
16293B98670L23078o2583k33968A18344N01901B02629n8583J72176J27372k07770
$$ plain form
16283 235824 98185 299331 567869 419059 625287 359962 638896 491667 451286 72914
16272 214967 70217 348401 376340 526781 451609 450726 258109 350539 228984 362003 245677
16261 245677 602212 172349 276335 189402 532733 515341 90395 115994 270884 -153702
16250 439525 279390 204985 553318 461218 379576 294971 311064 314788 293669 171223 445165
16239 445165 30841 506796 505512 53583 -85713 271310 84021 85583 302357 65233 -150655
16227 291438 202765 553684 206856 316047 384889 155782 233992 601374 190749 172417
16217 172417 16617 412415 135272 522443 45930 172626 273672 -3664 233307 257382
16207 257382 74959 395676 412623 85067 441084 -194020 96970 385573 -63654 286982
$$ packed form
16283B35824I8185K01146K68538j48810K06228k65325K78934j47229m0381G2914
16272B14967G0217K78184K7939J50441p5172q83j92617R2430j21555J33019j16326
16261B45677L56535A72349J03986q6933L43331j7392I0395K5599J54890a53702
16250D39525j60135p4405L48333r2100q1642q4605J6093L724k1119j22446K73942
16239D45165C0841M75955j284E3583h5713B71310H4021J562K16774F5233a50655
16227B91438q8673L50919B06856J09191O8842A55782P8210L67382A90749j8332
16217A72417A6617L95798A35272L87171D5930J26696J01046c664B33307K4075
16207B57382G4959L20717J6947H5067L56017a94020I6970K88603f3654B86982
$$ plain form
16196 -18376 -77067 402133 291948 533690 41779 407512 470823 148418 308491 260907
16186 260907 271645 -65006 322714 31871 -37410 -139150 187649 210105 538195 317007
16176 317007 251760 63523 134848 248528 329949 -79532 206334 31802 530255 369884 193358
16165 193358 19082 220798 272382 108864 103150 -2882 -23163 132873 149617 178984 174213
16154 174213 66967 -124147 131360 509428 -70259 282468 -60338 247743 -12477 15985
16143 128943 -41185 318962 -72795 222889 -303588 81616 199439 -77168 303078 198096
16133 198096 -2339 -63099 37202 -513 -127144 71519 126953 355731 135874 135794 -17816 330884
16120 137645 133945 138780 -124664 -14516 166509 -96612 -20932 235525 -491062 113049 145527
$$ packed form
16196a8376n8691D02133j10185K41742D1779L65733O3311A48418J60073m7584
16186B60907J0738f5006C22714C1871c7410j01740A87649K2456L28090k21188
16176C17007o5247F3523P1325J13680Q1421g9532B06334C1802M98453j60371j76526
16165A93358A9082K01716N1584A08864n714b882k0281A32873J6744K9367m771
16154A74213F6967a24147A31360L78068g0259B82468f0338B47743a2477A5985
16143A28943d1185C18962g2795B22889c03588H1616J17823g7168C03078j04982
16133A98096b339o0760C7202e13j26631G1519N5434K28778A35874q0a7816C30884
16120A37645l700M835a24664a4516A66509i6612b0932B35525d91062A13049L2478
$$ plain form
16109 145527 -172031 -52842 268917 -148270 197904 234686 268764 110938 -73168 137286
16098 302115 294104 409546 -50755 126105 399541 -72762 63460 -51223 151585 163819 3309
16086 210637 -65463 132464 403114 261064 293522 122821 97559 -352318 245991 74263
16075 -223910 79927 128234 167789 -46117 -29727 -14465 348813 -57470 124617 55516 74366
16064 74366 353583 330986 216328 74479 136168 150453 138062 -264016 60644 -146833 179516
16052 283728 257643 274594 -103741 45412 -27451 20830 341072 -15215 102542 73890 104704
16041 104704 -121416 -4273 271617 308068 -59038 107484 -68479 -274305 -112214 280141
16030 -175389 141044 142920 369751 -110361 -78212 -64790 151966 53499 271306 -201784
$$ packed form
16109A45527a72031e2842B68917a48270A97904L6782L4078A10938g3168A37286
16098C02115q011J15442e0755A26105K73436g2762F3460e1223A51585J2234C309
16086B10637f5463A32464K70650j42050L2458A22821k5262c52318B45991G4263
16075b23910G9927M8307L9555d6117J6390a4465C48813e7470A24617E5516J8850
16064G4366K79217k2597j14658G4479O1689J4285j2391b64016F0644a46833A79516
16052B83728k6085J6951a03741D5412b7451B0830L20242a5215A02542k8652L0814
16041A04704a21416d273B71617L6451e9038A07484f8479k05826a12214B80141
16030a75389A41044J876K26831a10361L2149J3422A51966E3499K17807b01784
$$ plain form
16019 57225 160930 -5012 -72236 25194 65274 151505 -151805 -66296 -148056 -70325 234143
16007 -157154 415188 51304 435273 -245715 -20785 90568 127422 -12164 -163303 -129691 340273
15995 209678 75384 -7439 17977 -133419 -198414 -2257 -54263 -48974 208467 97781 -118783
15983 147460 -167908 184608 394117 50029 -93151 575149 492506 932610 1303889 1052954
15973 1052954 783318 790267 491762 119067 -187262 216573 -85579 19563 -178089 283441
15962 -123789 88409 196945 -112247 504018 -61998 -149366 180248 197774 -180933 209327
15951 76320 -190858 33285 314753 180241 -82069 14816 -120995 94200 -75290 214162 87023
15939 146252 -74351 -183297 -206768 -172704 130178 -102631 402316 -7131 -328489 -118741
$$ packed form
16019E7225J03705e012o7224B5194M0080Q6231a51805f6296q1760g0325B34143
16007a57154D15188E1304L83969b45715b0785I0568L6854a2164j51139L3612C40273
15995B09678G5384g439A7977a33419o4995b257n2006N289B08467I7781a18783
15983A47460a67908A84608K09509E0029i3151E75149q2643M40104L71279k50935
15973A052954k69636O949k98505A19067a87262B16573h5579A9563a78089B83441
15962a23789H8409J08536a12247E04018f1998q7368A80248J7526a80933B09327
15951G6320a90858C3285K81468j34512h2069A4816a20995I4200g5290B14162H7023
15939A46252g4351j08946k3471L4064A30178a02631D02316g131l21358a18741
$$ plain form
15928 -130590 94369 6055 9994 -20640 64505 117847 -325299 -306882 -107058 -4343 111785
15916 39267 -100282 247706 148830 128747 283466 26017 -167436 -90271 5075 73824 22684
15904 -158339 144783 64487 -24704 56196 275393 -71725 71407 -51057 -80344 -27902 -106668
15893 -106668 -81077 -40762 15561 -1051 -5953 269373 75997 -56040 -68494 28289 -133895
15881 152345 -122252 322724 209116 158177 74801 146295 -133075 151593 -148018 -87554
15871 -87554 124231 30247 16274 -18026 -367011 -313774 152330 188671 -330143 -240394 39438
15859 -36287 -335012 -46446 91461 128175 23755 -41332 77134 -89587 88037 37293 106306
15848 106306 213484 -295890 -127280 7018 -174610 -12090 -285321 -291677 21179 40925 247621
$$ packed form
15928a30590I4369F055L939b0640F4505N3342c25299J8417a07058d343A11785
15916C9267a00282B47706r8876k0083J54719B6017a67436P7165E075O8749B2684
15904a58339A44783F4487b4704E6196K19197g1725G1407e1057k9287b7902p8766
15893a06668K5591M0315A5561a051m902B69373G5997e6040j2454B8289a33895
15881A52345a22252C22724j13608n0939G4801P1494a33075A51593a48018O0464
15871h7554A24231C0247j3973a8026l48985N3237A52330L6341c30143Q9749C9438
15859c6287k98725d6446I1461L6714B3755d1332G7134h9587H8037C7293O9013
15848A06306J07178b95890a27280G018a74610a2090k73231o356B1179J9746K06696
$$ plain form
15837 247621 36309 -82230 30393 197005 273447 -78582 -260114 107809 -122997 -464188
15827 -464188 299613 -114528 42386 201558 -232802 42231 -6434 91953 -56289 16120 -270241
15815 77072 177385 -90307 192145 291045 -10835 -352078 97388 58197 -85567 -169379 123214
15803 73996 -221277 -69528 -188482 186140 -60684 -73711 -115400 -250747 -196059 -199377 -6336
15791 91976 -108925 -185836 61898 304631 -27543 -358495 -340249 -54538 146655 25747 74113
15780 74113 -83964 157702 -53459 153274 -21207 199291 -320421 75875 149695 304061 -6343
15768 271817 20056 -15480 -4679 -188021 452863 129223 108090 75841 92888 -438942 -152744
15756 -162279 64519 -58417 178831 -107699 4149 57565 -35458 185924 -92771 -4495 -77248
$$ packed form
15837B47621C6309h2230C0393J66612P6442g8582j81532A07809a22997l41191
15827d64188B99613a14528D2386J59172b32802D2231f434I1953e6289A6120b70241
15815G7072J00313i0307A92145R8900a0835l41243I7388l9191h5567q3812A23214
15803G3996b21277f9528j18954A86140f0684j3027m1689j35347N4688l318f336
15791I1976a08925p6911F1898K42733b7543l30952J8246e4538A46655B5747M8366
15780G4113h3964A57702e3459A53274b1207A99291c20421G5875P3820J54366f343
15768B71817B0056a5480d679j83342D52863A29223k1133l2249J7047d38942a52744
15756a62279F4519e8417A78831a07699D149N3416c5458A85924i2771d495p2753
$$ plain form
15745 -77248 121656 64671 112894 -89411 -537205 -31641 -245646 -353469 30786 97148 78761
15734 78761 60020 -44412 144639 -12690 156768 -299696 131887 65110 -444861 -58462 -221769
15723 -221769 -113695 134257 -110197 -25354 15014 1722 276355 105390 206838 -39548
15712 200587 56168 2413 35829 -134262 61090 -179625 109063 91905 120866 119430 -148041
15700 71949 81296 -192984 81255 12717 -52702 250801 -15949 -60308 8732 -196095 -112354
15689 -112354 -119493 208553 -12924 -69466 -14531 -87138 156118 -156127 -29644 -147932 105248
15677 -81205 415082 -300370 -121443 -102560 29369 194537 -255434 183631 -5299 2330 67832
15666 67832 -159913 -236410 -354428 -22789 -50774 104813 -132725 204710 -6754 -7851 -95178
$$ packed form
15745g7248A21656n6985M8223h9411m47794c1641k14005j07823C0786O6362j8387
15734G8761j8741d4412A44639a2690A56768b99696A31887F5110d44861e8462j63307
15723b21769J08074A34257a10197b5354A5014A722K74633A05390J01448c9548
15712B00587E6168B413L3416a34262F1090a79625A09063j7158K8961j436a48041
15700G1949R347a92984H1255A2717e2702B50801a5949m4359H732a96095Q3741
15689a12354p139B08553a2924n6542a4531p2607A56118a56127b9644j18288A05248
15677h1205D15082c00370a21443J8883B9369J65168b55434A83631e299B330O5502
15666F7832a59913p6497j18018b2789k7985A04813a32725B04710f754j097q7327
$$ plain form
15655 -95178 140833 195937 -123778 84847 -69114 -266546 -45132 -109424 -15831 343575 -19327
15643 84038 144018 -13842 -61528 -395524 -253247 -131045 51884 -200834 -332889 30515 -135723
15631 181531 -70904 38518 268245 55858 -218941 174233 -60641 358513 81049 101165 148742
15620 148742 119780 70755 -18465 -169182 64514 -56988 -140161 -379150 246921 209435 140936
15609 140936 -94634 428217 -29108 -95395 -84513 -306650 2543 286902 -21375 49538 -479092
15597 -101686 235210 -33104 -96765 83741 -87633 -30520 70647 -75428 -156748 -48577 182590
15585 79579 -94723 -95877 9016 -47026 128141 55836 -11865 -282552 141171 -84975 61183
15573 -116809 -357599 -138134 -103549 243047 -136151 75167 -107766 -158963 313171 -152766
$$ packed form
15655i5178A40833N5104a23778H4847f9114j97432d5132o4292a5831C43575a9327
15643H4038N9980a3842m7686l33996J42277J22202E1884b00834j32055C0515a35723
15631A81531g0904C8518K29727E5858b18941A74233f0641C58513H1049K0116M7577
15620A48742k8962m9025a8465j50717F4514e6988q3173k38989B46921l7486o8499
15609A40936i4634D28217b9108o6287J0882k22137B543K84359b1375D9538d79092
15597a01686B35210c3104o3661H3741h7633c0520G0647g5428q1320d8577A82590
15585G9579i4723j154I016d7026A28141E5836a1865k70687A41171h4975F1183
15573a16809k40790a38134L4585B43047a36151G5167a07766n1197C13171a52766
$$ plain form
15562 157150 -82169 442817 -7719 159646 72348 -36518 244607 70175 272173 187415 -23991
15550 81105 374364 -16351 372162 104106 -370884 57386 252650 -143211 -256610 117641
15539 -115057 -53469 490304 278619 -41874 -336887 76756 203860 55351 37158 192213
15529 192213 -39522 311652 1314 -44948 52723 -131520 -64880 429381 -103244 208941 343208
15518 343208 169931 210581 59840 211263 223729 243917 256121 -188717 25612 286992 142583
15506 6648 -118183 205889 202130 -4266 -7395 288056 340699 361262 198695 8419 97189 -28185
15493 295081 239029 222233 42049 -215288 97814 213851 -385048 -16547 -198082 440769
15482 -93137 53998 -34067 2388 -144731 189503 336580 38136 516739 1021492 789062 92704
$$ packed form
15562A57150h2169D42817g719A59646G2348c6518B44607G0175K01998q4758b3991
15550H1105K93259a6351C72162A04106c70884E7386J95264a43211j13399A17641
15539a15057e3469D90304k11685d1874k95013G6756J27104E5351j8193J55055
15529A92213c9522C11652A314d4948E2723a31520f4880D29381a03244B08941J34267
15518C43208A69931M0650E9840J51423J2466K0188J2204a88717B5612K61380A42583
15506F648a18183B05889l759d266l129B88056N2643K0563j62567H419Q8770b8185
15493B95081n6052j6796D2049b15288I7814J16037c85048a6547j81535D40769
15482i3137E3998c4067B388a44731A89503J47077C8136M78603N04753k32430I2704
$$ plain form
15470 235204 2518 136585 -170275 -49760 47731 -138931 89457 214543 253888 -201629 -79896
15458 151354 -280255 -37975 118270 -211264 96545 88312 18604 2030 265987 -78915 -179009
15447 -179009 -76239 -232935 45525 -37520 407583 900694 1048954 1169029 542857 48717
15436 208429 -15577 404345 48822 -133259 -224704 40968 -108018 503922 -80321 136864
15425 22734 -63703 154268 -66382 -152517 -201437 25796 45276 93450 87218 413632 129102
15413 -121294 -79812 259 21202 -254156 -63453 54071 -164619 101914 244174 13475 -80594
15401 178858 135368 -93402 -211102 -75457 -46628 -19773 -220964 -55890 24642 81238 182570
15390 182570 180207 -173975 219912 -66388 -145790 11007 -92785 -36443 -107953 226262 230522
$$ packed form
15470B35204B518J34067a70275d9760D7731a38931H9457J25086L9345b01629g9896
15458A51354b80255c7975A18270b11264I6545q233A8604B030K63957g8915j00094
15447a79009g6239j56696D5525c7520D07583M93111J48260J20075E42857D8717
15436B08429a5577D04345D8822a33259r1445D0968a08018E03922h0321A36864
15425B2734f3703A54268f6382q6135m8920B5796J9480M8174o232L26414A29102
15413a21294M1482B59K0943b54156f3453E4071a64619A01914J42260A3475h0594
15401A78858m3490i3402j17700g5457K8829a9773k01191e5890B4642N6596J01332
15390A82570k363a73975B19912f6388p9402A1007i2785c6443p1510B26262M260
$$ plain form
15379 230522 -394667 93523 30495 -141885 61357 278025 19862 57258 18615 -58413 -30097
15368 -30097 389603 80626 -282006 429239 36987 60203 144844 -11498 221972 399576 272351
15357 272351 300971 68532 206677 68462 -20727 -31667 -58235 -86701 303094 374456 13103
15345 269963 -183044 -18350 203171 195982 109854 184307 67389 542433 314417 47874 79946
15334 79946 182556 286998 1814 181566 157989 52594 -46853 277 99851 303226 -263828
15322 -276662 133689 304087 163522 255919 140085 -26328 44450 239741 277273 193948
15312 193948 45540 87795 127285 -98530 77932 106047 -74812 -230025 128777 377887 102727
15300 343622 -121645 344186 110476 45110 386572 189091 398136 234019 -151508 -91826
$$ packed form
15379B30522c94667I3523C0495a41885F1357K16668A9862L7396A8615e8413K8316
15368c0097C89603H0626b82006D29239C6987K3216Q4641a1498B21972J77604j27225
15357B72351K8620F8532J38145F8462b0727j0940k6568k8466C03094P1362A3103
15345B69963a83044a8350B03171p189q6128P4453F7389M75044k28016D7874L2072
15334G9946J02610J04442A814J79752k3577E2594d6853B77R9574K03375b63828
15322b76662A33689J70398j40565R2397j15834b6328D4450J95291L7532q3325
15312A93948D5540M2255L9490i8530G7932K8115g4812j55213A28777K49110A02727
15300C43622a21645C44186A10476D5110L41462A89091K09045j64117a51508N9682
$$ plain form
15290 -91826 63703 75663 -202852 74224 464495 -18385 -147254 379009 46870 -196521 256993
15278 194584 -218858 54859 191283 106591 -38877 -92938 -228222 87568 -138414 81588 313998
15267 313998 -99485 112894 382371 -75680 113153 -237105 22912 108019 37782 -38172 250268
15255 243928 71912 47160 109062 176766 181256 -26601 -116568 -27339 13292 -33004 145679
15243 -136050 23308 126581 124695 2663 450961 180853 60162 138523 308044 306618 295593
15232 295593 233254 655766 780119 1146261 2957919 4548447 3316721 4293965 3374492
15223 3374492 1261436 329189 39869 55642 33484 -90765 194749 -187291 152124 314087
15213 314087 -151934 129989 -17843 -60104 370297 159572 114914 60036 386343 -79297
$$ packed form
15290i1826F3703J1960b02852G4224L90271a8385j28869C79009D6870a96521B56993
15278A94584b18858E4859J36424q4692c8877n4061j35284H7568a38414H1588K32410
15267C13998i9485A12894K69477g5680A13153b37105B2912Q5107C7782c8172B50268
15255B43928G1912k4752O1902O7704M490b6601q9967b7339A3292c3004A45679
15243a36050B3308J03273j886B663M48298A80853F0162P8361J69521j426j1025
15232B95593o2339M22512J24353L66142J811658J590528j231726R77244r19473
15223C374492A261436C29189C9869J5773k2158i0765A94749a87291A52124J61963
15213C14087a51934A29989a7843m2261C70297A59572m4658n4878L26307g9297
$$ plain form
15202 27892 -123432 -10338 24498 371089 -184693 -14491 483654 42797 207185 113913 185304
15191 185304 159979 267221 46572 -237895 97676 42602 43435 179806 -445188 -102118 -123956
15180 -123956 69842 331376 -115916 -323007 -91017 -36396 293224 99088 -153602 62137
15169 186604 -139539 -119137 52720 -195478 -153594 -20362 -43154 -33991 537468 -65950 314477
15157 -48234 -237810 -81131 215960 56940 -80595 243628 225252 193964 101669 50271 191873
15146 191873 -25066 166024 18844 253124 180537 16380 467980 119298 376386 120293
15135 249676 122163 -248841 310297 455921 100628 102741 119465 380844 80586 209106
15125 209106 187639 315839 93140 -164128 -14915 267876 125383 362823 148383 14188
$$ packed form
15202B7892a23432a0338B4498L46591a84693a4491D83654D2797J64388r3272P1391
15191A85304k5325J07242D6572b37895I7676D2602Q33J36371d45188a02118k1838
15180a23956F9842K61534a15916k07091i1017c6396B93224I9088a53602F2137
15169A86604a39539K0402E2720a95478M1884b0362k2792R163E37468f5950C14477
15157d8234j89576h1131B15960E6940h0595B43628j8376l1288r2295E0271J41602
15146A91873b5066A66024A8844K34280p2587A6380M51600A19298K57088A20293
15135B49676A22163b48841C10297J45624A00628K113J6724K61379H0586J28520
15125B09106k1467J28200I3140a64128a4915B67876A25383K37440A48383A4188
$$ plain form
15114 307825 617012 780230 917106 849057 220252 410619 312214 139100 204717 -57532
15103 408003 -237090 291572 -39205 291117 269426 -166580 1857 548835 267484 -33811
15092 37140 73352 369547 140918 622889 -50017 23079 66405 -65656 75995 501280 118194
15080 -188041 176628 325876 263526 134147 201640 -18769 30334 -196221 329213 308047
15070 308047 -11540 204191 233582 714901 477476 83313 -13606 86751 540786 250032
15059 -89688 137202 379560 161098 425425 162751 394668 211206 243272 202191 184168
15049 184168 528396 403554 211187 61315 392159 220773 408343 139240 306538 136690
15038 552422 505709 153966 500182 5526 -74242 536627 464041 533962 669187 563263 272061
$$ packed form
15114C07825L09187J63218J36876o8049B20252J90367r8405A39100O5617e7532
15103D08003b37090B91572c9205B91117k1691a66580A857N46978B67484c3811
15092C7140L6212K96195A40918M81971e0017B3079M3326f5656G5995M25285A18194
15080a88041A76628J49248o2350j29379O7493a8769C0334a96221C29213k1166
15070C08047a1540B04191K9391M81319k37425H3313a3606H6751M54035B50032
15059h9688A37202K42358A61098K64327A62751K31917j83462L2066m1081j8023
15049A84168L44228j24842j92367F1315L30844j71386J87570A39240J67298A36690
15038E52422m6713A53966L46216E526g4242E36627p2586O9921J35225j05924B72061
$$ plain form
15026 289391 29972 404018 635821 933384 377653 676625 137446 50357 500324 340331
15016 340331 356919 251544 379467 580823 112616 382881 268842 183903 599263 186607
15005 370383 323695 356982 286124 361796 632566 309117 641438 360556 435862 268666
14995 268666 263158 141506 43306 627815 328141 205219 585342 170932 154208 141934
14985 141934 492889 692439 509704 701751 417351 178037 507999 737799 210006 282147
14975 282147 402988 548416 497884 635669 557514 448880 142277 345383 347820 143965
14964 330815 110999 -107662 320810 236946 336018 432265 414561 405205 268635 252099 401926
14953 401926 482484 487510 256070 506859 75849 264475 154771 226002 538053 517237 729539
$$ packed form
15026B89391B9972L74046K31803K97563C77653K98972A37446E0357M49967j59993
15016C40331J6588j05375J27923K01356A12616K70265j14039q4939M15360A86607
15005C70383m6688L3287p0858P5672K70770C09117L32321k80882P5306j67196
14995B68666n508j21652D3306N84509k99674j22922L80123A70932j6724j2274
14985A41934L50955J99550j82735J92047k84400A78037L29962K29800B10006P2141
14975B82147J20841J45428n0532J37785p8155j08634A42277K03106K437A43965
14964C30815A10999a07662C20810q3864R9072R6247j7704r356j36570j6536J49827
14953D01926Q0558N026k31440K50789G5849J88626j09704P1231L12051k0816K12302
$$ plain form
14942 729539 304077 525943 395888 165247 321701 182171 282078 531654 606528 656230
14932 656230 613425 836225 1078559 989175 991457 1282701 1333648 1311897 1314083 1166571 1177783
14921 1177783 1156323 1001433 1413334 1834048 1911119 1636362 1400106 1305483 741252 620750
14911 620750 441291 859913 436023 573775 205170 520181 286645 352120 440136 300511
14901 300511 631796 267907 219775 330613 455114 287877 304588 631612 252713 308811
14891 308811 417507 167591 399105 437819 234781 421361 516816 790745 558576 543054
14881 543054 873816 727889 513264 565437 307086 306086 348854 328880 461512 189642
14870 101239 398184 618377 476919 782040 714233 550579 446837 799688 720358 566143
$$ packed form
14942G29539C04077K21866j30055A65247J56454j39530R9907K49576P4874M9702
14932F56230m2805K22800K42334q9384K282K91244N0947k1751K186j47512J1212
14921A177783k1460j54890M11901M20714P7071k74757k36256r4623n64231j20502
14911F20750j79459M18622m23890J37752B05170L15011k33536O5475Q8016j39625
14901C00511L31285B67907m8132J10838J24501j67237J6711L27024B52713N6098
14891C08811J08696A67591K31514L8714k03038J86580R5455K73929k32169j5522
14881E43054L30762j45927k14625N2173k58351j000M2768j9974J32632A89642
14870A01239K96945K20193j41458L05121o7807j63654j03742L52851p9330j54215
$$ plain form
14860 566143 524528 574735 473472 271267 215582 390541 387344 174191 162796 662550 577441
14849 577441 429878 568686 474245 905030 954363 1002255 889642 1027746 369275 793892
14839 793892 564813 615344 570967 788478 764547 529537 559435 712113 390885 587383
14829 587383 842194 307216 512706 368663 846004 614896 725321 475706 703539 572393
14819 572393 801231 777826 809009 893811 640564 560086 371191 784951 467640 594077
14809 594077 559637 678306 847842 796324 982930 604016 747177 687768 355655 495596
14799 495596 557428 585435 534296 546315 512802 772426 856253 668630 761211 697517 374733
14788 374733 658170 640037 743411 761929 999765 539769 489500 564744 555549 778739 1226508
$$ packed form
14860E66143m1615N0207j01263k02205n5685J74959l197A74191j1395M99754q5109
14849E77441j47563J38808r4441M30785M9333M7892j12613J38104C69275M24617
14839G93892k29079N0531m4377K17511k3931k35010K9898J52678l21228J96498
14829E87383K54811C07216K05490j44043M77341k31108J10425k49615K27833j31146
14819E72393K28838k3405L1183Q4802k53247q0478j88895M13760l17311J26437
14809E94077l4440J18669J69536n1518J86606l78914J43161n9409l32113J39941
14799D95596O1832K8007n1139J2019l3513K59624Q3827j87623R2581o3694l22784
14788C74733K83437j8133J03374J8518K37836m59996n0269P5244r195K23190M47769
$$ plain form
14777 1226508 482910 582969 852706 710866 205288 762200 736729 651387 692508 619906
14767 619906 564210 325049 562181 511612 455451 457227 636565 559568 770732 410299 610095
14756 610095 744393 913520 827641 534262 563449 654830 534764 986694 764724 859748
14746 859748 843108 656742 773042 717250 602195 774028 738688 665242 628181 970194
14736 970194 504658 1065330 881143 742570 872142 1260970 1176481 1334778 1742950 1547638
14726 1547638 1108475 851996 617902 820408 904728 643844 831164 579069 683037 711387
14716 711387 787873 999432 1211367 903172 548571 809860 600261 866875 835738 972320
14706 972320 824797 1270038 1461761 1785936 1625333 1561587 854354 1241731 1093761 1180024
$$ packed form
14777A226508D82910J00059K69737j41840B05288N56912k5471q5342M1121p2602
14767F19906n5696k39161K37132n0569n6161J776J79338p6997K11164l60433J99796
14756F10095J34298J69127q5879k93379K9187R1381j20066M51930k21970R5024
14746H59748j6640j86366J16300n5792j15055J71833l5340p3446l7061L42013
14736I70194m65536N60672j84187j38573J29572L88828q4489J58297M08172j95312
14726A547638m39163k56479k34094K02506Q4320k60884J87320k52095J03968K8350
14716G11387P6486K11559K11935l08195l54601K61289k09599K66614l1137J36582
14706I72320j47523M45241J91723L24175j60603o3746p07233L87377j47970Q6263
$$ plain form
14696 1180024 865553 812491 1325905 666774 1141144 894535 950040 917349 792485 725457
14686 725457 1218914 1215434 1038611 1339692 1070925 908373 798137 752176 963048 1020402
14676 1020402 828823 1308337 586354 664654 900700 825296 786128 964866 1086585 1295458
14666 1295458 1129849 1152039 1425880 1103776 733629 1317114 1198075 1382153 922915 1416181
14656 1416181 1027423 1321008 1482269 1380061 990243 1109629 1369219 1193889 1146447 1336409
14646 1336409 1134170 1381386 1103814 1128223 1064268 1089777 1312860 906612 1350552 1215121
14636 1215121 1122729 994967 1037432 821686 1237437 1146638 1151710 941536 1091038 1210923
14626 1210923 1185194 1706848 1317564 1360987 1156120 1395030 1570057 1350597 1362287 1346364
$$ packed form
14696A180024l14471n3062N13414o59131M74370k46609N5505l2691j24864o7028
14686G25457M93457l480j76823L01081k68767j62552j10236m5961K10872N7354
14676A020402j91579M79514E86354P8300K36046p5404l9168J78738J21719K08873
14666A295458j65609K2190K73841l22104l70147N83485j19039J84078m59238M93266
14656A416181l88758K93585J61261j02208l89818J19386K59590j75330m7442J89962
14646A336409k02239K47216k77572K4409o3955K5509K23083m06248M43940j35431
14636A215121r2392j27762M2465k15746M15751r0799N072k10174J49502J19885
14626A210923k5729N21654l89284M3423k04867K38910J75027k19460J1690j5923
$$ plain form
14616 1346364 891799 1526719 1383738 1416518 1466427 1377771 1482000 1538754 1582838 1435728
14606 1435728 1506737 1473331 1353273 1334173 1555257 1972008 1118549 1430995 1481425 1521351
14596 1521351 1776743 1874783 1466565 1768096 1573473 1414665 1782371 1818698 1725686 1722220
14586 1722220 1773219 2005840 1756319 1642689 1528734 2229538 1739596 2160693 1989282 1694120
14576 1694120 1612368 2042611 2191280 2185131 2208177 2301078 2029013 1916022 2368919 1752105
14566 1752105 2119540 2231836 2768156 2393241 2657875 2320759 2601756 2791941 2498602
14557 2498602 2453815 3003243 3341658 3410168 3148757 3726816 4293246 5120875 6624957 10350009
14547 10350009 19895951 40309433 49017108 19632526 6800718 3512815 2289247 2127765
$$ packed form
14616A346364m54565O34920j42981L2780M9909q8656J04229N6754M4084j47110
14606A435728P1009l3406j20058j9100K21084M16751q53459L12446N0430L9926
14596A521351K55392R8040m08218L01531j94623j58808L67706L6327r3012l466
14586A722220N0999K32621k49521j13630j13955P00804m89942M21097j71411k95162
14576A694120q1752M30243J48669o149K3046R2901k72065j12991M52897o16814
14566A752105L67435J12296N36320l74915K64634l37116K80997J90185k93339
14557B498602m4787N49428L38415O8510k61411N78059N66430Q27629J504082L725052
14547A0350009R545942K0413482Q707675A9632526F800718l287903j223568j61482
$$ plain form
14539 2127765 2233562 1664310 1861600 1857015 2142750 1806134 2164865 2258898 2111901 1844499
14529 1844499 2482977 2448819 2270413 2857138 3300064 4132299 7561908 10930843 5702417
14520 5702417 3076890 2723715 2695081 2255462 2381989 2547642 1947926 2624610 2751124
14511 2751124 2767420 2465899 2446418 2591721 2503144 2526497 2893550 2845392 2942923 2872867 2783147
14500 2783147 2942105 3057507 2792481 2993662 2869866 2814846 3037696 3248419 3315893 3573909
14490 3573909 3418849 3107069 3180785 3267455 3606023 3214726 3579559 3538185 3433786 3568851
14480 3568851 3567633 3870210 3967826 3948223 4079911 3979669 3777481 4086153 3877961 3802297
14470 3802297 4151199 4101586 4223705 4290801 4488124 4153117 4507041 4213244 4326087 4456929
$$ packed form
14539B127765J05797n69252J97290m585K85735l36616L58731R4033j46997k67402
14529A844499O38478l4158j78406N86725M42926Q32235L429609L368935n228426
14520E702417k625527l53175k8634m39619J26527J65653n99716O76684J26514
14511B751124J6296l01521j9481J45303q8577K3353L67053m8158R7531p0056q9720
14500B783147J58958J15402k65026K01181j23796n5020K22850K10723O7474K58016
14490C573909j55060l11780P3716Q6670L38568l91297L64833m1374j04399J35065
14480C568851j218L02577R7616j9603J31688j00242k02188L08672k08192p5664
14470C802297L48902m9613J22119O7096J97323l35007L53924k93797J12843J30842
$$ plain form
14460 4456929 4662859 4904913 5017885 4858531 5160465 4699359 5195165 4821800 5336387
14451 5336387 5155648 5077346 5188873 5304512 5374101 5094188 5396786 5509391 5415816 5706878
14441 5706878 5923444 5912635 5955779 5877155 6132060 6070583 6745137 6616843 6494504 6538217
14431 6538217 6696293 6895760 7178927 6943319 7127529 7233273 7419143 7352892 7424741 7953076
14421 7953076 8084970 8291685 7876217 8112482 8062998 8088174 8163812 8780725 8594868 8557968
14411 8557968 8440642 8984720 8939125 9031290 9493261 9730827 9776545 9792289 10099907 9944816
14401 9944816 10142125 10153542 10307930 10651376 10591634 10698052 10957853 11403491 11648828 11636448
14391 11636448 11770108 12278728 12241741 12664263 12819343 13321750 13512856 13516969 13956181 14147525
$$ packed form
14460D456929K05930K42054J12972j59354L01934m61106M95806l73365N14587
14451E336387j80739p8302J11527J15639O9589k79913L02598J12605r3575K91062
14441E706878K16566j0809M3144p8624K54905o1477O74554j28294j22339M3713
14431F538217J58076J99467K83167k35608J84210J05744J85870o6251P1849N28335
14421G953076J31894K06715m15468K36265m9484K5176P5638O16913j85857l6900
14411H557968j17326N44078m5595R2165M61971K37566M5718J5744L07618j55091
14401I944816J97309J1417J54388L43446n9742J06418K59801M45638K45337j2380
14391A1636448J33660N08620l6987M22522J55080N02407J91106M113M39212J91344
$$ plain form
14381 14147525 14382864 14846482 14617288 14991514 15086209 15458175 16288067 16228836 16343064 16750314
14371 16750314 16820963 17368494 17624489 18331848 18662538 18860696 19432847 19623850 20187813
14362 20187813 20294316 20988123 20915180 21900223 22169765 22774322 23170217 23628529 24074169
14353 24074169 25282812 25467960 25839539 26494887 27471761 28061552 28726351 29718696 30149634
14344 30149634 31225906 32182508 32622006 33480185 34702190 35421142 36536338 37456796 38794838
14335 38794838 39566110 41079294 42034747 43353851 44256355 46271379 47866879 49248019
14327 49248019 50855106 52522055 54102123 56146813 58145977 60409072 61846652 64244106
14319 64244106 67338232 68782669 71563938 74100006 76945941 80264057 83157143 86738609
$$ packed form
14381A4147525K35339M63618k29194L74226R4695L71966Q29892n9231J14228M07250
14371A6750314P0649N47531K55995P07359L30690J98158N72151J91003N63963
14362B0187813J06503O93807p2943R85043K69542O04557L95895M58312M45640
14353B4074169J208643J85148L71579O55348R76874N89791O64799R92345M30938
14344C0149634J076272R56602M39498Q58179J222005P18952J115196R20458J338042
14335C8794838P71272J513184R55453J319104R02504K015024J595500J381140
14327D9248019J607087J666949J580068K044690J999164K263095J437580K397454
14319F4244106L094126J444437K781269K536068K845935L318116K893086L581466
$$ plain form
14311 86738609 90263626 94029272 97882124 102412183 106834235 111106514 116589391 121517714
14303 121517714 127242355 133349761 139372272 146148955 153244304 160810264 168803479 177082944
14295 177082944 186019381 195464056 205852201 216168111 227021774 239216281 251566583
14288 251566583 264448720 277906612 291772375 306408943 321228650 336310686 351493054
14281 351493054 366857021 381662891 396713632 411012499 423946674 436222812 447085575
14274 447085575 455480122 460150675 462029377 461500305 459978903 456617155 453979866 450881607
14266 450881607 443973901 434010653 422628744 409594844 395826215 381223712 365956591
14259 365956591 350276804 334306596 318244624 303107283 288278753 273890551 260131821
$$ packed form
14311H6738609L525017L765646L852852M530059M422052M272279N482877M928323
14303A21517714N724641O107406O022511O776683P095349P565960P993215Q279465
14295A77082944Q936437R444675J0388145J0315910J0853663J2194507J2350302
14288B51566583J2882137J3457892J3865763J4636568J4819707J5082036J5182368
14281C51493054J5363967J4805870J5050741J4298867J2934175J2276138J0862763
14274D47085575Q394547M670553J878702n29072j521402l361748k637289l098259
14266D50881607o907706r963248j1381909j3033900j3768629j4602503j5267121
14259C65956591j5679787j5970208j6061972j5137341j4828530j4388202j3758730
$$ plain form
14252 260131821 247351546 234838752 222817518 211526918 201068251 190790371 181289187
14245 181289187 172522819 164731461 156429307 149073934 142029879 135132983 129146639 123284632
14237 123284632 117303841 111969910 108511775 108331565 103269770 97880958 93920297 89641952
14229 89641952 85602311 82209659 78963701 76040128 73281259 70507802 67675810 65451120
14221 65451120 62993867 61263394 59331743 56750828 54817889 53236551 51852753 49979477
14213 49979477 48900538 46979022 45329205 44183555 42822597 41729710 41317056 40023448
14205 40023448 38653577 37086554 36186711 35143593 34583901 34111669 32850104 31942494 30775135
14196 30775135 30278052 29482135 29024811 28170683 27762322 26789561 26022508 25358427 24743586
$$ packed form
14252B60131821j2780275j2512794j2021234j1290600j0458667j0277880r501184
14245A81289187q766368p791358q302154p355373p044055o896896n986344n862007
14237A23284632n980791n333931l458135j80210n061795n388812l960661m278345
14229H9641952m039641l392652l245958k923573k758869k773457k831992k224690
14221F5451120k457253j730473j931651k580915j932939j581338j383798j873276
14213D9979477j078939j921516j649817j145650j360958j092887m12654j293608
14205D0023448j369871j567023q99843j043118n59692m72232j261565r07610j167359
14196C0775135m97083p95917m57324q54128m08361r72761p67053o64081o14841
$$ plain form
14187 24743586 24296869 23661327 23165928 22834788 21983579 21590563 21130183 20817588 20587455
14178 20587455 19832562 19207095 19076831 18447779 18146828 17956499 17533564 17166802 17148934
14169 17148934 16992627 16726773 15901516 15574680 15504344 15217628 14942927 14547450 14284146
14160 14284146 14321371 14156632 13510904 13312472 12848223 12944119 12589901 12327380 11955076 11854401
14150 11854401 11745482 11400134 11471402 10977491 10827330 10903615 10726978 10356719 10543522 10135463
14140 10135463 10446920 9777681 10140110 9703368 9554660 9533861 8913298 9137620 9082782 8659122
14130 8659122 8926570 8446444 8426161 8364232 8241948 8298793 7935913 8075150 7996321 7832807
14120 7832807 7658807 7714739 7449517 7193221 7057896 7241191 7133304 7071421 6705888 7214739
$$ packed form
14187B4743586m46717o35542m95399l31140q51209l93016m60380l12595k30133
14178B0587455p54893o25467j30264o29052l00951j90329m22935l66762j7868
14169A7148934j56307k65854q25257l26836p0336k86716k74701l95477k63304
14160A4284146L7225j64739o45728j98432m64249R5896l54218k62521l72304j00675
14150A1854401j08919l45348P1268m93911j50161P6285j76637l70259J86803m08059
14140A0135463L11457o69239L62429m36742j48708k0799o20563K24322n4838m23660
14130H659122K67448m80126k0283o1929j22284N6845l62880J39237p8829j63514
14120G832807j74000N5932k65222k56296j35325J83295j07887o1883l65533N08851
$$ plain form
14110 7214739 6595140 6789908 6725574 6366431 6477049 6100708 6505305 6718816 5957544 5833446
14100 5833446 6026389 5806866 5685203 5497377 5683369 5608163 5448846 5749233 5820034 5331547
14090 5331547 5002851 5373291 5235648 5158327 5225331 5336369 4982682 4986963 4934844 4757580
14080 4757580 4772768 4669201 4649550 4464647 4821752 4686186 4576311 4544430 4546645 4149450
14070 4149450 4271955 4393201 4123069 4241556 4007494 4441654 4102687 3991008 3620198
14061 3620198 4069533 3658944 3738875 4030806 3738673 3967838 3736340 3952174 3830184 3653867
14051 3653867 3617614 3623771 3473118 3598128 3777479 3528571 3621464 3291446 3295163 3099454
14041 3099454 3487561 3305061 3117974 3209790 3078482 3148920 3081998 2969389 2941526 2885528
$$ packed form
14110G214739o19599J94768o4334l59143J10618l76341M04597K13511p61272j24098
14100E833446J92943k19523j21663j87826J85992p5206j59317L00387P0801m88487
14090E331547l28696L70440j37643p7321O7004J11038l53687M281n2119j77264
14080D757580J5188j03567j9651j84903L57105j35566j09875l1881K215l97195
14070D149450J22505J21246k70132J18487k34062M34160l38967j11679l70810
14061C620198M49335m10589P9931K91931k92133K29165k31498K15834j21990j76317
14051C653867l6253O157j50653J25010J79351k48908R2893l30018L717j95709
14041C099454L88107j82500j87087R1816j31308P0438o6922j12609k7863n5998
$$ plain form
14031 2885528 2743245 3103103 2649943 2798693 3123043 2663328 2959018 3000549 2956398 2698720
14021 2698720 2639809 2865349 3045245 2769750 2926138 2668894 2669811 2694066 2387376 2384313 2431798
14010 2431798 2555567 2651777 2568753 2181873 2409916 2284951 2195771 2042027 2285119 2291566
14000 2291566 2303250 1610080 2190022 1853352 1863216 2317287 2082834 1999909 1891712 2099458
13990 2099458 2127265 2777439 5184929 11340037 30841059 52168381 28360958 13593775
13981 7362205 5430224 4644602 3402984 3539776 3170790 3113192 2838072 2767639 2538233
13972 2538233 2782879 2980073 2462447 2283432 2617135 2277011 2367176 2242504 2479762 2298454
13962 2298454 2161104 2055637 2347407 1914548 2281620 1869739 2088844 1975087 1888428 2062443
$$ packed form
14031B885528j42283L59858m53160J48750L24350m59715K95690M1531m4151k57678
14021B698720n8911K25540J79896k75495J56388k57244R17K4255l06690l063M7485
14010B431798J23769R6210q3024l86880K28043j24965q9180j53744K43092O447
14000B291566J1684o93170N79942l36670R864M54071k34453q2925j08197K07746
13990B099458K7807O50174K407490O155108J9501022K1327322k3807423A3593775
13981G362205j931981p85622j241618J36792l68986n7598k75120p0433k29406
13972B538233K44646J97194n17626j79015L33703l40124R0165j24672K37258j81308
13962B298454j37350j05467K91770m32859L67072m11881K19105j13757q6659J74015
$$ plain form
13952 2062443 2079615 1966461 1998222 1882249 1893071 1781848 1952265 1838050 1753151 1495664
13942 1495664 2076510 1459409 1580173 1782098 1974793 1729113 1510919 1610955 1486109
13933 1486109 1670911 1795781 1416205 1526441 1640546 1654942 1976399 1416256 1475910 1506293
13923 1506293 1466522 1723453 1518343 2000768 1427225 931003 1151935 1721123 1493853 1240216
13913 1240216 1523608 1350372 1052795 1222887 1335972 1314172 1086614 1331613 1529833 1185538
13903 1185538 1207943 1308804 1494068 1287012 1144316 1434111 1260407 1276792 1143187 1278454
13893 1278454 1196741 1458606 1138239 1166327 1407406 1346311 1312827 949455 1530071 1081493
13883 1081493 1382717 979971 1034937 1009740 1055690 1420081 841565 1084098 1490704 869947
$$ packed form
13952B062443J7172j13154L1761j15973J0822j11223J70417j14215q4899k57487
13942A495664N80846o17101J20764K01925J92695k45680k18194J00036j24846
13933A486109J84802J24870l79576J10236J14105J4396L21457n60143N9654L0383
13923A506293l9771K56931k05110M82425n73543m96222K20932N69188k27270k53637
13913A240216K83392j73236k97577J70092J13085k1800k27558K44999J98220l44295
13903A185538K2405J00861J85264k07056j42696K89795j73704J6385j33605J35267
13893A278454q1713K61865l20367K8088K41079o1095l3484l63372N80616m48578
13883A081493L01224m02746N4966k5197M5950L64391n78516K42533M06606o20757
$$ plain form
13873 869947 1070799 1050983 970245 1006233 1189869 1175077 1032770 1088532 1024948 1296955 1368888
13862 1368888 878601 1042947 982288 1173234 911894 1100524 1121390 1015221 1345729 766142
13852 766142 780796 916855 961618 665510 1034256 1087454 907522 954129 843151 863177
13842 863177 972169 1249911 1317417 1055084 1235965 926998 1011373 1006872 810035 932801
13832 932801 1118514 963961 848798 1250069 1078368 1075561 1144059 893683 773852 945746
13822 945746 758222 791281 707062 1191572 1117982 978132 975495 814985 816217 996942 829913
13811 829913 767658 818919 981210 883847 694192 722186 573725 871243 646403 768790
13801 768790 387362 927013 777762 1091547 870921 768641 929126 996859 749868 677260
$$ packed form
13873H69947K00852j9816q0738L5988J83636j4792j42307N5762o3584K72007P1933
13862A368888m90287J64346o0659J90946k61340J88630K0866j06169L30508n79587
13852G66142J4654J36059M4763k96108L68746N3198j79932M6607j10978K0026
13842H63177J08992K77742O7506k62333J80881l08967Q4375m501j96837J22766
13832I32801J85713j54553j15163M01271j71701k807O8498k50376j19831J71894
13822I45746j87524L3059q4219M84510p3590j39850k637j60510J232J80725j67029
13811H29913o2255N1261J62291r7363j89655K7994j48461K97518k24840J22387
13801G68790l81428N39651j49251L13785k20626j02280J60485O7733k46991p2608
$$ plain form
13791 677260 915939 759298 795507 475120 625851 527732 717228 851600 725366 679505
13781 679505 744173 849035 481393 437199 472538 601457 620898 523681 902599 888504 690204
13770 690204 751521 879895 975590 705830 713569 433348 793518 997808 719278 931333
13760 931333 743430 439154 588028 628863 574273 702329 470032 759717 558580 357823
13750 357823 620062 443461 736191 561885 665745 820458 417650 747350 1077489 454707
13739 607093 891480 765975 603837 316563 564360 243786 372131 628542 445207 585636
13729 585636 738219 655082 798358 587417 597538 882784 686205 560805 826580 799462
13719 799462 368781 823539 371522 492884 499187 474223 347049 497718 641251 655077
$$ packed form
13791F77260K38679j56641L6209l20387J50731r8119J89496J34372j26234m5861
13781F79505O4668J04862l67642m4194L5339J28919J9441r7217L78918j4095j98300
13770F90204O1317J28374R5695k69760P739k80221L60170K04290k78530K12055
13760I31333j87903l04276J48874M0835n4590J28056k32297K89685k01137k00757
13750C57823K62239j76601K92730j74306J03860J54713m02808L29700L30139D54707
13739F07093K84387j25505j62138k87274K47797B43786J28345K56411j83335J40429
13729E85636J52583q3137J43276k10941J0121K85246j96579j25400K65775k7118
13719G99462C68781M54758C71522J21362O303k4964j27174J50669J43533J3826
$$ plain form
13709 655077 710687 548791 421377 127827 804220 476449 248600 738413 450835 470620
13699 470620 685693 579037 588826 947766 711999 467401 536093 409576 449504 376554
13689 376554 247375 534455 676339 557841 534502 403035 774180 880674 517928 472031
13679 472031 588012 529507 567333 623262 215235 507028 534863 447470 355331 477343 495640
13668 495640 439483 557717 583099 257671 598856 566409 660231 531282 306918 586937
13658 586937 499563 398194 581149 664411 580176 364950 382506 421709 454914 424176 547788
13647 547788 221080 -187954 375718 436980 431935 245126 579399 299612 460733 358322
13637 358322 563875 354162 481677 353060 670725 289212 236244 521148 619940 299088
$$ packed form
13709F55077N5610j61896j27414A27827O76393l27771k27849M89813k87578J9785
13699D70620K15073j06656R789L58940k35767k44598O8692j26517L9928p2950
13689C76554j29179K87080J41884j18498k3339j31467L71145J06494l62746m5897
13679D72031J15981n8505L7826N5929B15235K91793K7835q7393r2139J22012J8297
13668D95640n6157J18234K5382B57671L41185l2447R3822j28949k24364K80019
13658E86937q7374j01369J82955Q3262q4235k15226J7556L9203L3205l0738J23612
13647E47788B21080a87954C75718O1262n045j86809L34273k79787J61121j02411
13637C58322K05553k09713J27515j28617L17665B89212n2968K84904R8792B99088
$$ plain form
13626 302234 392816 433406 695969 684885 448106 447293 419559 676210 -109069 213369 20331
13614 235393 460885 -33253 66525 384187 -87762 380043 460390 113646 614617 380842
13604 380842 457659 218927 106982 285800 181068 500556 111714 467068 228552 638680
13594 638680 283266 440902 522602 230370 74074 191414 273964 -8007 355613 301938 346678
13583 346678 379783 404053 271557 351161 698370 738251 449521 416696 85815 132020 493098
13572 493098 179555 158328 260253 376847 292678 751017 646060 190756 204215 268967
13562 268967 550010 225585 13126 343010 415249 316623 306037 254127 221209 380083 465832
13551 465832 781018 272631 668863 23759 355567 193679 108232 173677 204152 416739
$$ packed form
13626C02234R0582M0590K62563j1084k36779q13k7734K56651a09069B13369B0331
13614B35393K25492c3253F6525L17662h7762C80043Q0347A13646N00971k33775
13604C80842P6817B18927A06982J78818j04732L19488A11714L55354B28552M10128
13594F38680B83266J57636Q1700B30370G4074J17340Q2550h007C55613n3675M4740
13583C46678L3105K4270j32496P9604L47209L9881k88730l2825H5815M6205L61078
13572D93098A79555k1227J01925J16594q4169M58339j04957A90756J3459O4752
13562B68967K81043B25585A3126L29884P2239r8626j0586n1910l2918J58874Q5749
13551D65832L15186B72631L96232B3759L31808j61888q5447O5445L0475K12587
$$ plain form
13541 416739 514120 676147 389639 292952 85907 35610 132406 120581 275316 400626 -146881
13529 342701 463769 410461 432374 341342 232706 384250 345744 452496 205763 264033
13519 264033 293122 279837 179508 233003 400147 177973 318902 226621 -30981 293997
13508 364908 293173 157584 222365 345659 379534 203945 357033 338403 -49811 314589
13497 392044 320965 67761 171128 97145 183251 184127 435532 110940 -53644 93534 418165
13486 418165 97427 394136 151783 460729 -38629 701735 95808 390592 61429 240735
13476 240735 257370 258718 -70695 157376 327113 195657 363297 281079 333172 -191279 -12447
13464 67072 267063 98643 422485 33207 296135 417739 241452 141304 88169 -179032
$$ packed form
13541D16739R7381J62027k86508r6687H5907C5610R6796j1825J54735J25310a46881
13529C42701J21068n3308K1913r1032j08636J51544l8506J06752B05763N8270
13519B64033K9089j3285j00329N3495J67144A77973J40929r2281c0981B93997
13508C64908p1735j35589O4781J23294L3875j75589J53088j8630d9811C14589
13497C92044p1079F7761J03367p3983Q6106Q76K51405A10940e3644I3534L24631
13486D18165I7427K96709A51783L08946c8629G01735I5808K94784F1429J79306
13476B40735J6635J348g0695A57376J69737j31456J67640q2218N2093a91279a2447
13464F7072J99991I8643L23842C3207K62928J21604j76287j00148n3135a79032
$$ plain form
13453 89703 292019 207085 1494 -39918 363059 298568 -105863 244185 177144 413580 327181
13442 327181 334413 188765 57589 161233 267390 222917 402624 418761 136277 199781 -28163
13430 197191 191383 -16807 242737 330649 117895 232339 189832 470392 248004 209813 157612
13419 157612 -102550 364327 230533 106279 398165 347646 259558 -16289 86740 374966
13409 374966 150890 -162259 305594 57515 177241 152547 -3435 3019 36599 -90644 187882
13397 391712 73469 170851 117996 264539 -5261 -227425 264247 -9603 133708 189845 314530
13386 314530 280507 234512 174259 274727 103730 278290 347065 223058 343458 -45606
13375 -125305 316876 -95636 273275 254705 529406 348836 38990 155267 74124 113529
$$ packed form
13453H9703K02316q4934A494c9918C63059o4491a05863B44185o7041K36436q6399
13442C27181P232j45648E7589J03644J06157m4473J79707J6137A36277O3504b8163
13430A97191n808a6807B42737Q7912A17895J14444m2507K80560k22388l8191n2201
13419A57612a02550C64327j33794A06279K91886n0519q8088a6289H6740K88226
13409C74966A50890a62259C05594E7515J19726k4694c435C019L3580i0644A87882
13397C91712G3469R7382n2855J46543e261k22164B64247i603A33708N6137J24685
13386C14530l4023m5995o0253J00468A03730J74560O8775j24007J20400d5606
13375a25305C16876i5636B73275j8570K74701j80570C8990J16277G4124L9405
$$ plain form
13365 113529 209933 304687 381378 444393 212611 317449 223703 -127987 21318 305094 175084
13354 175084 264793 291923 205809 34316 152409 156173 411328 -112948 143342 -6994 54211
13342 252668 63692 -92567 261223 319153 356654 472019 284875 543171 194638 257193
13332 257193 84032 -46661 67863 323285 -16541 -60110 276595 96852 474800 12528 117658
13321 117658 314737 72786 9333 -52884 236576 461132 212479 166604 30606 329284 97989
13309 215402 167478 -137700 552159 348139 231641 270099 -31791 177620 472652 228907
13298 484139 85140 -8896 235958 -70652 234798 -72854 -331600 -3397 -236219 77788 -350018
13286 139002 199125 65313 -30150 83192 235116 221657 256258 212045 -145444 1714 164902
$$ packed form
13365A13529R6404R4754P6691O3015B12611J04838r3746a27987B1318K83776j30010
13354A75084Q9709K7130q6114C4316J18093L764K55155a12948A43342f994E4211
13342B52668F3692i2567B61223N7930L7501J15365j87144K58296A94638O2555
13332B57193H4032d6661F7863K55422a6541m3569B76595I6852L77948A2528J05130
13321A17658J97079G2786I333e2884B36576K24556B12479m5875C0606K98678I7989
13309B15402m7924a37700E52159k04020j16498L8458c1791A77620K95032B28907
13298D84139H5140h896B35958g0652B34798g2854k58746c397k32822G7788c50018
13286A39002O0123F5313c0150H3192J51924j3459L4601m4213a45444A714J63188
$$ plain form
13275 164902 387883 37306 350732 308523 23526 14015 -34401 52828 81667 150189 -120186
13263 14772 535510 93693 189391 -167498 415082 358593 337229 258754 174153 -43873 -117901
13252 -117901 50994 44748 59671 -16519 310033 73153 -66312 -30343 -16308 42563 266629
13241 266629 74696 6444 204044 -42986 -123086 -4526 285652 102371 23442 91620 279683
13230 279683 322293 262165 171793 161783 -258711 99304 122526 5367 -55090 -34542 133950
13218 103472 -93492 1330 153236 -10846 51759 93928 121486 138705 563845 257917 235960
13207 235960 326767 97571 218055 365616 250570 -82110 226755 201960 181327 -18110 -73068
13196 -73068 132727 353665 251254 -224924 84435 -39824 328121 190398 192684 269738 18800
$$ packed form
13275A64902K22981C7306L13426m2209B3526r511c4401E2828K8839O8522a20186
13263A4772N20738I3693R5698a67498D15082n6489k1364p8475q4601d3873p4028
13252a17901E0994o246J4923a6519C10033G3153f6312c0343J4035D2563K24066
13241B66629G4696F444J97600d2986q0100d526B85652A02371B3442O8178J88063
13230B79683M2610o0128r0372j0010b58711I9304K3222E367e5090K0548A33950
13218A03472i3492A330J51906a0846E1759M2169K7558J7219M25140B57917k1957
13207B35960R0807I7571J20484J47561j15046h2110B26755k4795k0633a8110n4958
13196g3068A32727K20938j02411b24924H4435c9824C28121j37723K286P7054A8800
$$ plain form
13184 -25092 286680 -266419 -106415 121542 181683 -119737 126586 -76053 84191 -24867
13173 -96986 19704 -106591 166231 221543 6794 -198352 99642 86596 -191893 219240 418679
13162 418679 24598 74802 89598 61070 -48796 42389 160965 95571 121557 273036 -234143
13150 -116013 73298 163926 313600 128847 91184 148118 61153 141649 -60979 -75682 -20740
13138 -26065 -158781 -86837 29055 223511 6392 106192 -268175 32709 -143519 -97619 272396
13126 174272 205276 342958 -119834 -73421 160898 -57003 -129961 64788 78331 377563 -18851
13114 246263 296914 -7430 242565 32030 247362 -8055 -263575 76785 156126 105968 -54487
13102 140008 145167 121714 -29936 60882 -250658 110053 -145504 250447 -119693 -209892 288212
$$ packed form
13184b5092B86680b66419a06415A21542O0141a19737A26586g6053H4191b4867
13173i6986A9704a06591A66231N5312F794a98352I9642j3046a91893B19240J99439
13162D18679B4598N0204J4796k8528d8796D2389J18576o5394K5986J51479b34143
13150a16013G3298R0628J49674A28847l7663N6934F1153Q0496f0979j4703b0740
13138b6065j32716P1944B9055J94456F392R9800b68175C2709a43519M5900B72396
13126A74272L1004J37682a19834M6413A60898e7003p2958F4788J3543K99232a8851
13114B46263N0651g430B42565C2030K15332h055k55520G6785P9341n0158e4487
13102A40008N159k3453b9936F0882b50658A10053a45504B50447a19693r0199B88212
$$ plain form
13090 237441 26204 63845 126235 257971 210337 288795 191807 8080 -67855 -365394 -44100
13078 -66889 -42175 -86874 -175027 -83843 68401 -97174 231249 -95343 81341 229890 23579
13066 -30488 149515 -55943 125621 216557 3582 103058 75721 99901 -141725 93473 37010
13054 -95968 47232 47738 -4308 193506 212286 -70839 117864 7607 379054 68201 186199 245049
13042 245049 14944 -118451 169343 240919 -188199 -86233 -119627 -157045 -145630 70351 -80901
13030 205625 -53512 208388 -42427 -34787 -26163 -90759 239993 308268 -75679 -34595 -395424
13019 -395424 12461 -260111 91506 105326 315349 -142579 -167441 272435 -18171 66790 -69204
13007 -32476 97991 195360 158471 416058 -14291 -160120 136685 405647 65186 196567 196808
$$ packed form
13090B37441B6204L7641O2390J31736m7634P8458r6988H080f7855k97539d4100
13078f6889K4714m4699q8153h3843F8401i7174B31249i5343H1341J48549B3579
13066c0488A49515e5943A25621R0936C582R9476k7337K4180a41725I3473C7010
13054i5968D7232N06d308A93506J8780g0839A17864G607L71447F8201J17998N8850
13042B45049A4944a18451A69343P1576a88199h6233l3394l7418J1415G0351h0901
13030B05625e3512B08388d2427P640Q624o4596B39993O8275g5679c4595l60829
13019c95424A2461b60111I1506J3820K10023a42579k4862B72435a8171F6790f9204
13007c2476I7991R7369l6889K57587a4291j45829A36685K68962F5186J31381K41
$$ plain form
12996 196808 189498 125316 -26652 54120 36321 179654 -47853 -286065 129601 138739 23631
12984 -216282 -56326 7891 -39457 322 69710 -200539 -26037 -41986 317670 -2268 69275 -8980
12971 -20502 -35393 138745 -174402 -97678 45650 116264 25780 190134 -233742 67465 247537
12960 247537 78822 -270573 285383 209231 -3509 -111943 -243847 -196466 5117 -59582 15303
12948 159220 73836 -403522 138648 -110726 110771 120802 18547 29454 -36988 -83532 38739
12936 29294 48245 -19444 -3334 187248 -75781 -79162 -385787 -298863 -154493 35877 145576
12925 145576 -14167 -128012 198245 -6522 -245308 -3632 189464 -85770 88688 -233087 74661
12913 87509 -64756 86865 402513 20885 207298 118179 -215820 -275645 312605 178744 11405
$$ packed form
12996A96808p310o4182b6652E4120j7799J43333d7853k38212A29601R138B3631
12984b16282e6326G891c9457C22O9388b00539b6037j5949C17670b268F9275h980
12971b0502j4891A38745a74402P6724D5650P0614B5780J64354b33742F7465J80072
12960B47537G8822b70573B85383p6152c509j08434j31904M7381E117e9582A5303
12948A59220G3836d03522A38648a10726A10771J0031A8547J0907c6988m6544C8739
12936B9294J8951a9444c334A87248g5781l381l06625Q6924J44370C5877J09699
12925A45576a4167j13845A98245f522k38786c632A89464h5770H8688b33087G4661
12913H7509f4756H6865L15648B0885J86413q9119b15820n9825C12605j33861A1405
$$ plain form
12901 107230 -64994 -165121 22162 188006 96223 233929 167208 63935 229997 125539
12891 125539 -22207 134826 -84346 -77979 -354666 -243006 -50663 174433 53430 -239770 -10737
12879 44892 -93333 -83398 76836 -141834 -228989 -113323 -89020 -58625 -42840 -226098 147379
12867 -466396 -290528 248448 -58711 -124776 -36706 -210246 188419 35521 259181 -58763
12856 112251 -65822 -103047 28174 163421 -11721 6481 12364 232406 185372 -51060 -284705
12845 -284705 -1945 34307 27618 137660 -71512 92277 319007 180693 -121013 -303905 -32316
12833 -225181 127959 0 -97474 87124 -62007 145518 -173737 202177 257393 134189 47851
12821 143086 -25610 307829 154104 -9072 -95703 -58619 -198776 224407 -183252 -296597
$$ packed form
12901A07230f4994j00127B2162J65844r1783J37706o6721F3935J66062j04458
12891A25539b2207A34826h4346O367k76687J11660e0663A74433E3430b39770a0737
12879D4892i3333R935G6836a41834q7155a13323K4303L0395J5785j83258A47379
12867d66396J75868B48448e8711o6065c6706j73540A88419C5521K23660e8763
12856A12251f5822l7225B8174J35247a1721F481N883K20042m7034e1060k33645
12845b84705a945C4307o689J10042g1512I2277K26730j38314a21013j82892c2316
12833b25181A27959@i7474H7124f2007A45518a73737B02177N5216j23204D7851
12821A43086b5610C07829j53725i072q6631L7084j40157B24407a83252j13345
$$ plain form
12811 -296597 154174 -200821 -19038 -148681 -330903 56736 81824 -131026 57750 134905
12801 134905 202538 112056 -60084 69320 124151 -24138 63391 32590 -166787 -203003 147854
12789 -101572 79330 156193 -9641 -28613 106957 -111306 19782 274790 -167760 -231982 64096
12777 83838 242813 236334 352105 -55459 -132410 77143 -171326 -94810 81559 -135911 -35982
12765 -89552 106249 -115789 -39880 193140 65114 246704 86342 -230246 -157744 225510
12754 -408453 27506 9506 -17860 -147048 52668 -8943 -69659 10291 -135257 -169452 39614
12742 -198102 70857 115675 159306 -29688 -277786 153765 -451290 118829 84097 153738 -78825
12730 -28408 190488 75591 -115161 -166294 -32487 -167183 -45568 19416 176505 37931 250966
$$ packed form
12811b96597A54174b00821a9038j29643j82222E6736K5088a31026E7750P7155
12801A34905O7633r0482f0084F9320N4831b4138F3391l0801a66787l6216A47854
12789a01572G9330P6863i641j8972A06957a11306A9782K55008a67760o4222F4096
12777H3838J58975o479J15771e5459p6951G7143a71326P6516H1559a35911c5982
12765h9552A06249a15789c9880A93140F5114J81590H6342b30246P2502B25510
12754d08453B7506I506a7860j29188E2668h943o0716A0291a35257l4195C9614
12742a98102G0857M4818M3631b9688k48098A53765d51290A18829l4732O9641g8825
12730b8408A90488G5591a15161n1133c2487j34696d5568A9416J57089C7931K13035
$$ plain form
12719 250966 -124873 -71581 44395 -61445 -79797 -302696 33801 -296862 -39444 -93788 427414
12707 -224892 -54368 -51912 -203526 -186192 -116557 -2021 -33900 -45941 -145756 163911 -79841
12695 -210864 162076 190316 239380 -175672 -64690 -70840 26129 -104863 355875 66417 -65454
12683 -244724 126414 12112 131593 -13120 58427 -56249 6128 72369 -84460 -78612 -83713 334228
12670 -16792 210897 5299 4964 -148436 -34807 229853 288181 173293 -11420 133392 48065
12658 62504 93200 295062 116797 263960 170042 -74600 21392 91920 -84595 147818 176055
12647 176055 50815 97074 83876 258977 -209064 -33469 -109331 -118439 105225 235024 -161487
12635 90188 91078 104480 258109 -26222 124477 76739 -279728 151291 336445 108339 164750
$$ packed form
12719B50966a24873N3292D4395f1445j8352k22899C3801b96862c9444n4344D27414
12707b24892e4368K456j51614J7334O9635b021l1879j2041r9815A63911g9841
12695b10864A62076K8240M9064a75672f4690o150B6129a04863C55875F6417f5454
12683b44724A26414A2112J19481a3120E8427e6249F128O6241h4460N848n101C34228
12670a6792B10897E299l35a48436c4807B29853N8328j14888a1420A33392D8065
12658F2504L0696K01862A16797J47163r3918g4600B1392P0528h4595A47818K8237
12647A76055E0815M6259j3198J75101b09064c3469p5862r108A05225J29799a61487
12635I0188Q90J3402J53629b6222A24477m7738b79728A51291J85154A08339N6411
$$ plain form
12624 164750 -51563 24294 223405 -5239 175884 234450 121226 263175 -142225 -3038 134846
12612 114697 139308 -134891 85842 119894 236218 -207383 -438131 -387887 211450 -78820
12601 274591 40781 -5253 270583 112869 162943 -126843 31661 165917 -201098 -79221 14754
12589 177520 84892 54349 -157945 226565 -518239 390965 -276881 -88019 196674 -34307
12578 -60226 -11268 153543 -418819 -184637 225229 139732 -329055 182200 -13987 -6929 116696
12566 -247767 -255302 -128372 40178 129245 -114128 353528 132611 25769 -205296 74960 24620
12554 20623 154192 59853 157016 48532 123253 120330 -26862 208721 135171 -500458 73993
12542 -85298 -92821 38503 -17842 210050 -8417 109145 -98871 -36116 -92114 -12839 -121206
$$ packed form
12624A64750e1563B4294J99111e239A75884N8566j13224J41949a42225c038A34846
12612A14697K4611a34891H5842L4052J16324b07383k30748N0244B11450g8820
12601B74591D0781e253B70583A12869N0074a26843C1661J34256b01098g9221A4754
12589A77520H4892l0543a57945B26565e18239C90965b76881h8019A96674c4307
12578f0226a1268A53543d18819a84637B25229q5497c29055A82200a3987f929A16696
12566b47767p535J26930D0178Q9067a14128C53528A32611B5769b05296G4960B4620
12554B0623J33569E9853R7163D8532P4721k923b6862B08721p3550e00458G3993
12542h5298p523C8503a7842B10050h417A09145i8871c6116n5998a2839j08367
$$ plain form
12531 -121206 157798 61737 -105820 -113373 -294701 -109390 109776 135572 75350 6158 179
12519 -173598 -73657 -99955 -237572 -111241 111781 21556 -10152 339406 -86843 307240
12508 369872 -178371 251599 -23398 -122075 -374549 -291957 120158 -35925 -1825 116296 -185051
12496 34521 56183 188621 111316 -22578 -291870 51655 -46874 -163427 118017 229552 -70536
12484 87137 240483 379812 -113245 58724 233405 373719 157334 228648 -117102 92720
12473 -260958 -189187 191647 -162342 54046 -309794 169471 -37663 285084 -99265 169176
12462 108334 79733 156915 -93311 -57442 40278 -152045 86932 -8759 -153785 243348 148590
12451 148590 11610 4587 -114325 -50042 107568 237981 41278 -125549 92182 206825 79304
$$ packed form
12531a21206A57798F1737a05820p553j81328a09390A09776K5796o0222F158A79
12519a73598g3657k6298j37617a11241A11781B1556a0152C39406h6843C07240
12508C69872a78371B51599b3398r8677k52474Q2592A20158c5925a825A16296a85051
12496C4521K1662J32438p7305b2578k69292E1655d6874j16553A18017J11535g0536
12484H7137J53346J39329a13245E8724J74681J40314A57334P1314a17102I2720
12473b60958P1771A91647a62342E4046c09794A69471c7663B85084i9265A69176
12462A08334k8601P7182i3311L5869D0278a52045H6932h759j45026B43348r4758
12451A48590A1610D587a14325e0042A07568J30413D1278a25549I2182J14643G9304
$$ plain form
12439 -170270 124745 161532 213857 92551 204800 -17192 -206335 -193426 -67310 -173790 113845
12427 -70579 232560 9901 -258915 8267 8 -160579 -365105 -45 -100567 -83429 -59258 -155948
12415 -155948 -44666 425184 43052 193093 -119280 99296 78526 -151873 -288266 41291
12404 -301759 -117760 -24202 119426 119718 67943 -137016 -275833 -28602 -17578 34623 159036
12393 159036 299720 344591 -3992 -97149 -25822 66195 114500 225209 202806 75738 236843
12382 236843 -192889 -280408 244252 421554 42723 293599 623754 111625 148377 203041
12372 203041 -244872 162521 -1734 130909 120082 131182 -33355 -80122 -189903 341504 127234
12360 -132162 -20667 27112 -170988 -23686 34744 -73047 -36228 132998 260044 -3365 -199397
$$ packed form
12439a70270A24745L6787N2325I2551J12249a7192j89143J2909f7310j06480A13845
12427g0579B32560I901b58915H267Ha60579k04526d5j00522J7138K4171r6690
12415a55948d4666D25184D3052J50041a19280I9296k0770a51873j36393D1291
12404c01759a17760b4202A19426K92n1775a37016j38817b8602J1024C4623J24413
12393A59036J40684M4871c992r3157b5822F6195M8305J10709k2403G5738J61105
12382B36843a92889q7519B44252J77302D2723K50876L30155A11625L6752N4664
12372B03041b44872A62521a734A30909j0827J1100c3355m6767j09781C41504A27234
12360a32162b0667B7112a70988b3686C4744g3047c6228A32998J27046c365j96032
$$ plain form
12349 -199397 329098 85198 -5721 -99720 127831 -105033 -79920 270029 -71323 -202107 473653
12337 -13337 -298315 196497 136677 236614 -3745 132665 383728 283506 460464 203463
12326 109319 456436 151372 45985 280030 443196 275818 247351 88024 -83064 334077
12315 289865 358667 148032 -161948 222053 349301 -161373 46074 -110721 -89690 150567
12304 -146630 109698 90819 106175 32691 235095 80530 229855 209683 -75538 -21934 586674
12292 113760 110821 -14141 38830 36550 59329 524270 -227359 -89008 429189 250812 256955
12281 256955 457599 42288 307849 179125 27568 -73759 86183 378167 234113 118407
12271 118407 123489 218949 353755 287281 -242409 -98860 -189822 165606 50009 293156 157073
$$ packed form
12349a99397C29098H5198e721r3999A27831a05033K5113B70029g1323j30784D73653
12337a3337k84978A96497n9820R9937c745A32665K51063j00222J76958B03463
12326A09319L47117A51372D5985K34045J63166j67378k8467H8024h3064C34077
12315B89865O8802A48032a61948B22053J27248a61373D6074a10721K1031A50567
12304a46630A09698j8879J5356C2691K02404H0530J49325k0172g5538b1934E86674
12292A13760k939a4141C8830k280K2779M64941b27359h9008D29189j78377O143
12281B56955K00644D2288K65561j28724B7568g3759H6183K91984j44054j15706
12271A18407N082R5460J34806o6474b42409i8860r0962A65606E0009K43147j36083
$$ plain form
12260 157073 291300 97941 -12690 255554 149877 824 -281160 76507 -280992 -80601 284526
12248 193230 122553 353557 353208 -79522 350500 85384 321189 55390 -558 209703 146386
12237 146386 215427 45203 147664 203081 143577 255400 215813 93808 241656 190380 66835
12225 19225 -52662 149930 -37859 110669 41538 179843 477312 422628 240312 116297
12214 428715 380887 413189 135418 28176 29325 377057 103271 710029 98577 15420 354786
12203 354786 -69903 525930 3809 23575 466361 94762 40957 156421 103315 117082 344526
12192 344526 420812 -130327 398219 421893 138544 323130 297038 567748 403675 445190
12182 445190 431543 377534 324940 244564 110703 225449 171420 88432 -82648 404900 494498
$$ packed form
12260A57073J34227I7941a2690B55554j05677H24b81160G6507b80992h0601B84526
12248A93230p0677K31004l49g9522C50500H5384K35805E5390e58B09703o3317
12237A46386O9041D5203J02461N5417n9504J11823l9587I3808J47848n1276F6835
12225A9225e2662A49930c7859A10669D1538J38305K97469n4684j82316A16297
12214D28715m7828L2302A35418B8176J149L47732A03271O06758I8577A5420L39366
12203C54786f9903E25930C809J9766M42786I4762D0957J15464n3106J3767K27444
12192C44526P6286a30327C98219K3674A38544J84586k6092K70710j64073M1515
12182D45190j3647n4009n2594q0376A10703J14746n4029q2988h2648D04900Q9598
$$ plain form
12171 494498 85527 408825 -59505 303758 427128 176918 266307 294332 407016 240616
12161 240616 174656 -34049 173593 294076 -189145 277295 128209 -107601 -222565 -95319
12150 -129618 -7309 214388 220287 -85844 13738 -17113 75475 -78106 -35413 42333 381085
12139 381085 108839 318611 78237 -15557 139788 183194 567356 472235 52339 423211
12129 423211 164995 336612 -45975 147311 187571 371950 449364 227223 176943 310339
12119 310339 322825 351897 990 508667 56801 166429 170224 126122 416636 397726 133128
12107 80272 272716 106408 291491 40677 25037 244788 178101 59179 78844 108647 218789
12096 218789 84247 69478 310541 142846 -117985 196863 68821 98641 -173346 521374
$$ packed form
12171D94498H5527L23298e9505C03758J23370A76918Q9389K8025J12684j66400
12161B40616o5960c4049A73593J20483a89145B77295A28209a07601j14964i5319
12150a29618g309B14388N899h5844A3738a7113G5475g8106c5413D2333L38752
12139C81085A08839K09772G8237a5557A39788M3406L84162r5121E2339L70872
12129D23211A64995J71617d5975A47311M0260J84379P7414k22141n0280J33396
12119C10339J2486K9072I90N07677E6801J09628L795m4102K90514j8910A33128
12107H0272J92444A06408J85083D0677j5640K19751o6687E9179J9665K9803J10142
12096B18789H4247j4769K41063A42846a17985A96863F8821K9820a73346E21374
$$ plain form
12085 -44276 201960 85158 556353 376208 340447 260990 322148 386522 50351 184555 170265
12074 170265 58983 332394 -33627 273313 34152 -31452 -74078 294279 -184342 -89890 -200909
12063 -200909 -227499 -379302 -226990 -228534 154569 88150 -221056 69707 294415 -113699
12052 24819 26580 201373 -92606 13331 50441 -198691 56351 355055 -34930 -105409 120404
12040 -88726 278815 -3142 350692 136796 -100660 71857 -80013 131152 -149954 227309
12029 -255762 -107436 -136311 43591 5103 4561 220479 -256487 -10468 -71868 171356 194738
12018 194738 142887 -11233 -132418 -17721 -132905 -307790 -145602 -37196 -252800 -125637
12007 77591 -51835 158685 66619 -183654 88355 -102513 4624 -121140 165163 147071 -76501
$$ packed form
12085d4276B01960H5158M71195j80145l5761p9457O1158O4374E0351J34204j4290
12074A70265E8983K73411c3627B73313C4152c1452m2626B94279a84342h9890j11019
12063b00909k6590j51803J52312j544A54569o6419b21056F9707K24708a13699
12052B4819J761J74793i2606A3331L7110a98691E6351K98704c4930p0479A20404
12040h8726B78815c142C50692A36796a00660G1857h0013A31152a49954B27309
12029b55762a07436k8875D3591E103n42K15918b56487a0468o1400A71356K3382
12018A94738n1851a1233j21185a7721j15184j74885a45602c7196k15604a25637
12007G7591e1835A58685F6619a83654H8355a02513D624a21140A65163j8092g6501
$$ plain form
11995 -372841 -160056 -62750 -418218 -2049 19032 36107 369938 -223634 -219764 -78544 116454
11983 -128010 -208636 -178457 -290995 70811 247402 48705 -252472 -13069 -1819 -207517 -90211
11971 239489 -280184 -51554 174230 27068 -91964 -100473 301481 8158 -123845 -119948 6671
11959 -111407 140103 -68471 -280281 -166323 113377 -179960 -115547 -159180 164502 -309969
11948 -154730 4891 192964 -29045 -208843 93519 501208 -2538 -149926 -15972 7011 -169042
11936 89747 -142591 -164568 8000 260894 -8446 -132680 18950 162279 -72388 295995 121430
11924 -37027 -281310 -185561 -446578 143544 -13142 -463704 -116401 -153130 172140 -196675
11913 -248076 -5304 -284295 44298 -172066 215603 145686 -496142 -19541 -193523 28581 -224214
$$ packed form
11995c72841a60056f2750l55468b049A9032J7075L33831b23634L870g8544A16454
11983a28010q0626L0179j12538G0811J76591D8705b52472a3069a819k05698i0211
11971B39489b80184e1554A74230B7068i1964q509C01481H158a23845L897F671
11959a11407A40103f8471k11810J13958A13377a79960O4413m3633A64502c09969
11948a54730D891J88073b9045j79798I3519M07689b538j47388a5972G011a69042
11936H9747a42591k1977H000K52894h446j24234A8950J43329g2388B95995A21430
11924c7027k44283R5749k61017A43544a3142m50562a16401l6729A72140a96675
11913b48076e304k78991D4298a72066B15603o9917d96142a9541j73982B8581b24214
$$ plain form
11901 139374 108175 -120070 38731 -34044 107211 6491 130058 -476308 23426 -479314 -170348
11889 66479 71308 -95562 -359613 -98888 261027 177826 53261 -57095 -56536 34413 -80194 -250589
11877 -250589 61069 78471 -137571 99233 -147059 97996 -114637 -181449 -104482 28511 168304
11866 168304 175281 40721 -31741 46302 -221013 104263 -192566 -159187 8219 44642 -230282
11854 -27878 40981 42347 -107617 -124164 -12381 119994 -49205 -472697 -319685 -329545 5397
11842 63866 -250362 -95112 54384 -240881 -63341 -207749 73241 -245790 -192403 80396 176721
11831 176721 -93933 136615 -146619 -127061 -208961 -71264 54251 -513247 -242740 32135 57704
11820 57704 1146 77128 -223884 37953 -148668 -149727 71357 -112612 -56026 -66575 -115840
$$ packed form
11901A39374l1199a20070C8731c4044A07211F491J23567d76308B3426d79314a70348
11889F6479M829i5562k64051i8888B61027q3201E3261e7095N59C4413h0194j70395
11877b50589F1069J7402a37571I9233a47059I7996a14637o6812P6967B8511J39793
11866A68304O977D0721c1741D6302b21013A04263a92566L3379H219L6423b30282
11854b7878D0981J366a07617j6547a2381A19994d9205m23492J53012r860E397
11842F3866b50362i5112E4384b40881f3341j44408G3241b45790N3387H0396R6325
11831A76721i3933A36615a46619J9558q1900g1264E4251e13247b42740C2135K5569
11820E7704A146P5982b23884C7953a48668j059G1357a12612e6026j0549m9265
$$ plain form
11809 -115840 129125 -210007 -120621 -231782 -141901 90017 68836 -113267 -119217 45389 -433451
11797 -10077 242751 -212595 -54037 -50866 127070 -27452 -186716 351162 286692 51364 41839
11786 41839 17886 -8735 -72356 42016 -298705 131514 -46478 156388 -234108 -164705 -73870
11774 -421229 63536 -251000 -402243 -129812 -94114 -325130 117979 231671 -313004 119876
11763 -170351 -24462 262160 -75976 -83078 215339 -81338 221271 -3251 -162927 244265 19422
11751 116486 -102785 -346561 67993 135507 -134560 331726 111001 -405504 154250 -149329
11740 195724 -236317 -92170 -133578 442258 -133149 -27783 -297032 -173462 306810 112741
11729 -129489 13424 -422547 -231494 85393 -97843 61014 227617 -118101 -65998 88084 -332759
$$ packed form
11809a15840A29125b10007Q9386j11161Q9881I0017k1181a13267n950D5389d33451
11797a0077B42751b12595e4037L171A27070b7452j59264C51162o4470E1364r525
11786D1839A7886h735o3621D2016b98705A31514d6478A56388b34108O9403g3870
11774d21229F3536b51000j51243a29812L5698k31016A17979J13692c13004A19876
11763a70351b4462B62160g5976p102B15339h1338B21271c251j59676B44265A9422
11751A16486a02785k43776F7993O7514a34560C31726A11001d05504A54250a49329
11740A95724b36317i2170m1408D42258a33149b7783k69249J23570C06810A12741
11729a29489A3424d22547J91053H5393i7843F1014J66603a18101N2103H8084c32759
$$ plain form
11717 75849 185811 304360 -38516 -17358 -201399 33762 148677 -71945 -84699 284334 122521
11705 -237028 -130184 -53773 -290736 -477095 -55577 -162148 -178357 -201594 282581 -21749
11694 5536 -38006 -212141 -290805 -58023 -55996 -72510 23642 265927 -213569 75726 -130184
11682 -104876 255673 -103090 -120096 -7142 -264844 -118384 -204011 90113 86414 79941 -123686
11670 8095 49730 80356 -120635 -57288 -125241 -101638 63622 -18470 -111302 -238160 94588
11658 -56006 158211 -120781 -202509 177001 -70489 -137357 -6721 -265340 37508 -135776 -388421
11647 -388421 -48760 95514 54410 192858 89469 -180536 -178021 -107566 -29609 -112320 -94963
11636 -94963 236882 -245067 41886 -160148 388959 -198337 31167 -156508 26921 81650
$$ packed form
11717G5849J09962J18549c8516a7358j84041C3762J14915g1945j2754B84334A22521
11705b37028J06844e3773k36963j86359e5577j06571j6209k3237B82581b1749
11694E536c8006j74135p8664e8023K027j6514B3642K42285b13569G5726a30184
11682a04876B55673a03090j7006g142k57702a18384q5627I0113l699o473a23686
11670H095M1635L0626a20635e7288o7953K3603F3622a8470r2832j26858I4588
11658e6006A58211a20781q1728A77001g0489o6868f721k58619C7508a35776k52645
11647c88421d8760I5514m1104J38448H9469a80536K515P0455b9609q2711J7357
11636i4963B36882b45067D1886a60148C88959a98337C1167a56508B6921N4729
$$ plain form
11626 81650 33056 -243037 -33478 32080 -189654 76158 -171501 -12882 -191521 -233928 -310332
11615 -310332 -111331 -237955 -159898 -757 55109 60230 -110780 -51682 14611 93158 50320
11604 50320 -36273 -105107 -157471 -36234 -128050 -147532 -28876 6017 -36626 -236693 56521 -437451
11591 -97464 -63277 14649 -144628 112524 -82626 -198649 -119618 151675 15653 -244938 205116
11579 -77009 -127743 300727 264592 -33418 -43626 -141103 -53829 -102833 7205 124267 182280
11568 182280 -98613 -213776 -33598 34319 -72454 -65068 -183074 30657 64279 73922 -86063
11556 104427 -125883 47410 559255 -29223 -117959 -123467 -228188 -55033 -150209 -165056 159913
11544 197201 -205067 -168522 230198 133555 -203423 -38723 97313 82940 -79402 131380 -338766
$$ packed form
11626H1650C3056b43037c3478C2080a89654G6158a71501a2882j78639m2407p6404
11615c10332a11331j26624P8057g57E5109N121a10780e1682A4611P8547m2838
11604E0320c6273o8834n2364c6234r1816j9482b8876F017c6626k00067E6521d37451
11591i7464L4187A4649a44628A12524h2626j16023P9031A51675A5653b44938B05116
11579g7009n0734C00727l6135c3418j0208r7477e3829m9004G205J17062N8013
11568A82280i8613j15163c3598C4319g2454P386j18006C0657L3622R643h6063
11556A04427a25883D7410N11845b9223q8736n508j04721e5033r5176j4847A59913
11544A97201b05067L6545B30198r6643b03423c8723I7313j4373g9402A31380c38766
$$ plain form
11532 82856 5255 412352 -260186 -256823 -148205 22733 -25590 -189148 133775 -276545 73784
11520 -192942 6210 127282 -389211 -61544 -258942 26586 -966 388324 68731 217456 -130269
11508 108680 169003 -43982 -28019 63556 -89067 -111199 38016 -156488 71727 306589 297642
11497 297642 78241 -258455 167196 -46304 268450 114750 -203810 280190 179507 115207
11487 115207 132345 59333 71407 330436 256255 -49807 115032 229252 54229 141321 -46478
11475 250849 68523 380156 151584 301814 141033 574539 112832 52157 -343130 49105
11464 94587 20012 325924 -37129 -161749 287104 149695 145625 -107852 252480 -150742
11453 68881 87261 168199 289667 363387 -82877 -158658 380929 269635 82739 136635 -300527
$$ packed form
11532H2856E255M07097b60186L363J08618B2733b5590j63558A33775b76545G3784
11520a92942F210J21072c89211f1544j97398B6586i66C88324F8731J48725a30269
11508A08680O0323d3982J5963F3556h9067k2132C8016a56488G1727K34862q947
11497B97642G8241b58455A67196d6304B68450A14750b03810B80190j00683o4300
11487A15207J7138E9333J2074K59029p4181d9807A15032J14220E4229Q7092d6478
11475B50849F8523L11633A51584J50230A41033M33506A12832E2157c43130D9105
11464I4587B0012L05912c7129j24620B87104j37409m070a07852B52480a50742
11453F8881J8380Q0938J21468P3720h2877p5781C80929j11294H2739N3896c00527
$$ plain form
11441 -22723 -115062 -6711 -173272 295627 189295 -5484 -21461 23204 -107948 52317 115515
11430 115515 173493 37204 211075 -98027 74644 383149 157779 -220010 101502 78284
11420 78284 -174764 98470 -81682 7849 40140 -287820 51695 -217958 222217 46254 -105636
11408 75153 -75185 -46043 10925 -158359 217839 31927 -58051 19883 36396 -31681 30716
11396 -200047 95231 -63212 196548 -155650 -114106 -203899 -511723 -252543 -61321 -111915 -35271
11384 -231168 115560 -384640 -51451 363963 -203939 -146138 168232 -147081 108578 -251621
11373 6444 185599 2691 -130590 -300214 -36363 -237233 -33689 -102161 -140798 16895 216276
11362 216276 234770 -52338 -192631 123023 994 82051 -171946 152096 93884 -158095 213795
$$ packed form
11441b2723r2339f711j66561B95627j06332e484j5977B3204a07948E2317O3198
11430A15515N7978C7204J73871i8027G4644L08505A57779b20010A01502k3218
11420G8284a74764I8470h1682G849L2291b87820E1695b17958B22217D6254a05636
11408G5153g5185K9142A0925a58359B17839C1927e8051A9883J6513c1681C0716
11396b00047I5231f3212A96548a55650M1544q9793l07824b52543f1321n0594c5271
11384b31168A15560c84640e1451C63963b03939N7801A68232a47081A08578b51621
11373F444J79155B691a30590j69624c6363k00870c3689o8472l8637A6895J99381
11362B16276J8494e2338j40293A23023I94Q1057a71946A52096n8212a58095B13795
$$ plain form
11350 -114783 -31567 212032 -289719 -225674 51220 -58358 -46947 -153060 15448 -242472 -71209
11338 -350781 -169530 -150976 -22443 -89743 -343390 -210935 13073 4396 170330 127074 -138730
11326 -211212 -488196 -20692 -144634 -116550 -214565 -148071 119988 -272122 182214 -339466
11315 -47607 -103460 -287731 43913 -75667 -49563 50066 -13067 -86100 -256635 -80178 99923
11303 38391 -103593 -217117 -43392 -23747 51501 -248577 69443 -285486 93368 237082 -73897
11291 -55208 -51609 112928 -61753 -210250 33860 -201394 33905 107417 280627 224829 -101866
11279 144170 -193478 -196852 193802 -369144 -143531 178951 -63858 -47934 -164560 23611
11268 -92936 -360601 130877 -95575 140549 126143 -106004 -65452 -291673 -11423 205482
$$ packed form
11350a14783c1567B12032b89719O4045E1220e8358J1411j06113A5448b42472g1209
11338c50781a69530J8554b2443o7300k53647J32455A3073D396J65934m3256a38730
11326b11212k76984b0692j23942K8084r8015O6494A19988b72122A82214c39466
11315d7607n5853j84271D3913g5667K6104E0066a3067p3033j70535h0178I9923
11303C8391a03593j13524d3392J9645E1501b48577F9443b85486I3368J43714g3897
11291e5208L599A12928f1753j48497C3860b01394C3905P3512J73210n5798a01866
11279A44170a93478l374A93802c69144a43531A78951f3858J5924j16626B3611
11268i2936k67665A30877i5575A40549j4406a06004M0552k26221a1423B05482
$$ plain form
11257 -195952 -94728 67865 -266779 57187 -102992 392924 -125636 -36752 198787 -143869
11246 -10314 -389606 -85590 -13729 -113532 -196187 102265 -420685 -263376 52222 -24551 -96858
11235 -96858 -111380 -175606 42067 -202736 187976 -447345 378027 189258 -314391 -138902
11224 -398834 74622 -165444 194483 -110746 -189142 -253665 -111327 -71533 50316 -225460
11213 61607 -35484 -210615 -272872 -32844 87214 -304498 -23125 68425 -214192 48336 -217500
11201 21981 59021 -57980 103303 -74026 -376708 -350222 -207899 45363 96937 -40482 -252387
11190 -252387 -189015 167629 -151346 87828 246729 -39231 -97294 -93573 -354762 249817 -88467
11178 -185094 -236361 -382829 63399 -218520 -82125 236023 218793 178794 -71461 -269241 -192204
$$ packed form
11257a95952i4728F7865b66779E7187a02992C92924a25636c6752A98787a43869
11246a0314l79292h5590a3729r9803q2655A02265d20685J57309E2222b4551p2307
11235i6858j4522o4226D2067b02736A87976d47345C78027j88769c14391a38902
11224c98834G4622a65444A94483a10746p8396o4523a11327L9794E0316b25460
11213F1607c5484j75131o2257c2844H7214c04498b3125F8425b14192D8336b17500
11201B1981L7040e7980A03303g4026l02682K6486J42323D5363N1574d0482k11905
11190b52387O3372A67629a51346H7828J58901c9231n8063L721k61189B49817h8467
11178a85094n1267j46468F3399b18520h2125B36023j7230l9999g1461j97780P7037
$$ plain form
11167 -192204 79429 -4642 -17179 -6804 -76136 -60386 -138500 -372839 -96722 -169420 -274013
11156 -274013 5426 -39870 9650 258342 -163238 -256133 -61972 -172758 -101197 -90685 -330660
11145 -330660 19279 -432871 138941 128472 156364 -165791 44690 -149618 -230976 -39781 193298
11133 -76458 179340 -148878 -108715 112972 -47477 -276541 -111006 -14353 152202 -12935
11122 -201177 198776 494 -99637 26621 -139804 64348 36805 -184677 37745 217085 -287969
11110 95978 182883 99904 -111302 282922 -99552 101614 246375 86601 98467 86388 90959
11099 90959 308245 119049 127260 324576 23577 -4320 225457 197242 333124 82628 276354
11088 276354 256619 137430 -158360 177405 144156 30888 388987 -115896 -142943 135458
$$ packed form
11167a92204G9429d642j2537f804o9332J5750p8114k34339i6722p2698j04593
11156b74013E426c9870I650K48692a63238r2895f1972j10786P1561J0512k39975
11145c30660A9279d32871A38941j0469K7892a65791D4690a49618q1358c9781A93298
11133g6458A79340a48878M0163A12972d7477k29064a11006a4353A52202a2935
11122b01177A98776D94i9637B6621a39804F4348k7543a84677C7745J79340b87969
11110I5978Q6905q2979a11302B82922i9552A01614J44761H6601J1866j2079M571
11099I0959K17286A19049Q211J97316B3577d320B25457k8215J35882H2628J93726
11088B76354j9735j19189a58360A77405l3249C0888L58099a15896k7047A35458
$$ plain form
11077 315866 334891 319209 203007 87883 321888 322130 -72351 -117703 249104 -21401 432464
11065 80621 542237 306701 311349 333688 446503 474275 200772 294751 96666 434499 278115
11054 278115 476072 115054 263417 749586 527437 274128 234543 639603 469881 660197
11044 660197 597637 708256 590338 667350 541540 1097737 916973 461598 991785 991769 785706
11033 785706 729620 792187 548234 856739 842181 1003674 1071169 714291 556583 743877
11023 743877 628109 780917 761992 316953 295874 769856 532276 4186 484262 324686
11013 324686 567248 344008 549840 713415 180022 756153 837694 1229875 797516 597953
11003 597953 504756 656113 352065 546030 351001 468696 568551 688307 727043 449025
$$ packed form
11077C15866J9025j5682j16202H7883K34005K42g2351m5352B49104b1401D32464
11065H0621M61616k35536M648K2339J12815K7772B00772R3979I6666L37833j56384
11054B78115J97957A15054J48363M86169k22149k53309l9585M05060j69722J90316
11044F60197o2560J10619j17918P7012j25810N56197j80764m55375N30187j6k06063
11033G85706n6086O2567k43953L08505j4558J61493O7495l56878j57708J87294
11023G43877j15768J52808j8925C16953k1079M73982k37580D186M80076j59576
11013C24686K42562k23240K05832J63575A80022N76131Q1541L92181m32359j99563
11003E97953r3197J51357l04048J93965j95029J17695R9855J19756L8736k78018
$$ plain form
10993 449025 534188 470385 700824 536048 254817 613102 563252 571572 773397 551318
10983 551318 662660 963224 764366 747781 977037 676784 723973 711367 1166986 813706
10973 813706 1197986 1202475 1565796 1965590 1816900 2152549 2434286 2372561 2712449 2624625
10963 2624625 2698828 3084852 2414085 2850909 2076725 1910775 1425563 1282218 1139895 630682
10953 630682 820419 612701 648179 610409 900193 735517 675585 823619 476167 465442
10943 465442 412989 -76119 221874 525793 199298 110580 160239 40735 -80561 -157392 -104939
10932 -104939 -6913 -16939 -97320 363422 -135487 218392 199207 272748 57929 74618 93200
10921 93200 161363 39956 -63170 242518 201702 -97109 184355 443399 83264 -308547 33847
$$ packed form
10993D49025Q5163o3803K30439j64776B54817L58285m9850Q320K01825k22079
10983E51318J11342L00564j98858j6585K29256l00253M7189j2606M55619l53280
10973H13706L84280M489L63321L99794j48690L35649K81737o1725L39888q7824
10963B624625P4203L86024o70767M36824p74184j65950m85212j43345j42323n09213
10953F30682J89737k07718L5478l7770K89784j64676n9932J48034l47452j0725
10943D65442n2453g6119B21874L03919A99298q8718M9659D0735h0561p6831N2453
10932a04939f913j0026q0381C63422a35487B18392j9185P3541E7929J6689J8582
10921I3200O8163C9956f3170B42518m0816i7109A84355K59044H3264c08547C3847
$$ plain form
10909 -42932 312152 -157004 -191932 38119 -175673 132303 191525 37996 160977 -13112 -33479
10898 -33479 -4306 183670 195344 -4010 -88038 20573 -189094 -268941 294308 -116489 -214181
10887 -214181 -218295 -90939 50640 121015 -47091 -86489 -137635 -209146 67533 11120 -86622 -102017
10875 -102017 133564 120728 -27151 -65751 -142190 5306 186433 -244252 17153 110872 150554
10864 150554 75610 -5550 -268674 -137221 -197978 186381 300195 24913 -173619 -322407
10854 -322407 -46988 51661 -233368 109163 -103609 -152120 257827 -30902 -147536 -167381
10844 -167381 -161767 -193706 227269 -112343 61307 -104781 111536 -150810 -75263 101462
10833 -51344 -213508 -375259 17141 -170059 110951 -142044 463618 -612226 -97474 133862
$$ packed form
10909d2932C12152a57004l4928C8119a75673A32303N9222C7996J22981a3112k0367
10898c3479d306A83670J1674d010q4028B0573a89094p9847B94308a16489r7692
10887b14181m114i0939E0640P0375d7091l9398n1146p1511F7533A1120h6622j5395
10875a02017A33564j2836b7151l8600p6439E306J81127b44252A7153R3719L9682
10864A50554p4944e550k63124J31453o0757A86381J13814B4913a73619j48788
10854c22407d6988E1661b33368A09163a03609m8511B57827c0902j16634j9845
10844a67381N614l1939B27269a12343F1307a04781A11536a50810g5263A01462
10833e1344j62164j61751A7141a70059A10951a42044D63618f12226i7474A33862
$$ plain form
10822 -248749 -30469 -51358 -383426 -170956 -147433 156194 95658 19165 -8459 -140955 -20545
10810 -27684 36338 263837 224728 -42358 -120672 10817 40099 -240735 55631 -277285 -325802
10799 -325802 -122696 -29934 -272387 110019 164792 -113217 -179343 175887 -254689 -269068
10789 -269068 -345260 -42791 -129175 -251983 -169784 7939 -198908 -189558 44783 -239665 -24123
10777 -228030 -360644 -133718 -115682 -111599 246813 -24098 -28323 41436 -238472 136723 -108400
10765 -58054 157321 135946 -37138 -279921 -203253 -106140 8771 -17985 26563 44252 -600173
10753 62701 87627 -160545 -32866 248805 -7987 -87596 38398 100712 -35517 74713 21279
10741 -224973 -317992 -206227 225517 -387794 38303 24949 111456 -97888 -121718 -118746 -135328
$$ packed form
10822b48749c0469k0889l32068a70956K3523A56194o0536A9165h459j32496b0545
10810b7684C6338K27499l9109d2358p8314A0817K9282b40735E5631b77285m8517
10799c25802a22696b9934k42453A10019N4773a13217o6126A75887b54689j4379
10789b69068p6192d2791q6384j22808Q2199G939a98908R350D4783b39665b4123
10777b28030j32614a33718J8036M083B46813b4098m225D1436b38472A36723a08400
10765e8054A57321k1375c7138k42783P6668R7113H771a7985B6563J7689f00173
10753F2701K4926a60545c2866B48805g987p9609C8398O2314c5517G4713B1279
10741b24973r3019J11765B25517c87794C8303j3354Q6507i7888k3830K972j6582
$$ plain form
10730 -135328 -12206 -25307 -262569 -156096 -421313 242787 -294154 -1451 -94017 125300
10719 26209 -187426 -3029 270381 -173806 -11228 -410193 -250526 -160981 -35704 90318 -70475
10707 -256637 -13298 -374602 39943 -73048 38428 -129371 -57827 -84140 140155 -155616 210146
10695 142088 177746 33037 -286797 -327180 29436 15736 -252015 -124802 -84905 -36079 218463
10683 36446 114356 -207667 125822 -118084 -147778 -103003 57547 -69412 -90487 104482 622
10671 136488 100209 -93475 205255 147170 -292058 275571 -112399 40740 345307 -346298
10660 -200110 38393 268824 -176870 168241 -184518 28210 15558 -19590 168585 84461
10650 84461 -169099 -127029 -218880 -215216 26828 -321946 -385286 54970 -58378 236217 45527
$$ packed form
10730a35328a2206j3101k37262J06473k65217B42787b94154a451r2566A25300
10719B6209a87426c029B70381a73806a1228l98965J59667Q9545c5704I0318g0475
10707b56637a3298l61304C9943g3048C8428a29371e7827k6313A40155a55616B10146
10695A42088L5658C3037b86797m0383B9436j3700b52015a24802L9897c6079B18463
10683C6446P7910b07667A25822a18084k9694M4775E7547f9412k1075A04482F22
10671A36488l6279i3475B05255n8085b92058B75571a12399D0740L04567c46298
10660b00110C8393K30431a76870A68241a84518B8210j2652a9590A68585q4124
10650H4461a69099M2070r1851L664B6828c21946o3340E4970e8378B36217D5527
$$ plain form
10638 -303878 -76281 84853 -127283 19866 66211 -75984 18554 80131 -177726 -8274 -43965
10627 -43965 -274943 -110074 -83455 236613 -52744 5354 4795 97544 -104307 -62952 158651
10615 -199263 -65995 -80387 -169723 -41052 -504838 199286 -8753 -521530 -10945 81814 -221606
10603 175460 -62749 -60627 375864 -225404 -32273 -216088 -90217 117020 -146545 83094 113210
10592 113210 -161276 149342 57773 -83503 223932 -4475 -98576 217137 -141955 -134108 25693
10580 58401 -101651 -149891 -130051 -481790 -310186 -30090 61138 -11347 -96668 -26005 112019
10568 -170664 174490 69474 56159 85387 -270481 203988 29626 54001 39985 206409 -88889
10556 -21143 -65918 59282 174654 16392 -116940 -208493 -268125 89511 205860 -111385 -161065
$$ packed form
10638c03878g6281H4853a27283A9866M6345g5984A8554O1577a77726h274l5691
10627d3965k30978a10074K6619B36613e2744E354n59R2749a04307M1355A58651
10615a99263f5995j4392q9336d1052m63786A99286h753n12777a0945H1814b21606
10603A75460f2749K122C75864b25404c2273j83815i0217A17020a46545H3094L0116
10592A13210a61276A49342E7773h3503B23932d475r4101B17137a41955P847B5693
10580E8401a01651m8240J9840l51739J71604c0090F1138a1347q5321b6005A12019
10568a70664A74490F9474j3315K9228b70481B03988B9626K4375j4016J66424h8889
10556b1143m4775E9282J15372A6392a16940r1553n9632H9511J16349a11385m9680
$$ plain form
10545 -161065 -46701 77709 -246436 21231 32543 -97079 -11916 57988 147229 158115 -198978
10533 -13466 537 -115751 -298648 -92341 -13019 -328831 -119303 -101786 -421205 -77141 -77327
10522 -77327 -246600 -99672 -8293 211400 -7216 59543 -53596 288600 165379 -329675 -389663
10511 -389663 -428343 -110852 61965 -180125 198876 50086 -115351 -294104 -290498 -28540 -307944
10500 -307944 -254558 53407 -58589 44169 203035 -71429 -329769 -148460 -299702 33902 425023
10489 425023 -239936 -122366 25514 253750 -164964 -272842 280688 -54061 -87573 -68697
10479 -68697 -6655 -63902 -94169 24002 -281040 58386 73667 229226 -85112 -79027 4922 -59716
10466 46743 -85250 -309328 -123151 90515 -177756 150202 16522 119299 -168746 -17742
$$ packed form
10545a61065d6701G7709b46436B1231J1312i7079a1916E7988Q9241J0886a98978
10533a3466E37a15751j82897i2341a3019l15812a19303J7517l19419g7141j86
10522g7327j69273i9672h293B11400g216E9543e3596B88600j23221c29675n9988
10511c89663l8680a10852F1965a80125A98876E0086a15351j78753L606b8540k79404
10500c07944N3386E3407e8589D4169J58866g1429k58340a48460j51242C3902L91121
10489D25023b39936J17570B5514K28236a64964j07878B80688e4061l3512J8876
10479f8697f655n7247l0267B4002b81040E8386J5281J55559h5112O085D922e9716
10466D6743h5250k24078a23151I0515a77756A50202A6522J02777a68746a7742
$$ plain form
10455 -493577 70458 47589 -515897 -10608 171576 148281 -177851 -302163 19040 -219058
10444 -112405 33231 -76424 -201075 -12658 -95880 -260970 7185 -83674 -166339 96338 -3682
10432 189053 348766 -179504 -302456 85439 -265167 89748 25064 107733 198924 -20730 95090
10420 -249314 24487 -99568 -181857 -97033 70281 -49949 -35949 -313423 -100577 -165822 -197670
10409 -197670 -184835 186626 -121412 134664 -266553 -139828 130504 -135344 -327754 -181528
10399 -181528 -151865 -27735 280644 98765 -133532 88346 164535 250214 412434 -40171 -61957
10388 -61957 -39649 333796 167212 119421 128210 49306 -80367 -78958 -462767 -166833 240725
10376 -264553 238043 -334868 166298 217994 401652 1834 233153 269614 105047 11498
$$ packed form
10455d93577G0458k2869e15897a0608A71576k3295a77851j24312A9040b19058
10444a12405C3231g6424j24651a2658q3222j65090G185h3674q2665I6338c682
10432A89053J59713a79504j22952H5439b65167H9748B5064Q2669R1191b0730I5090
10420b49314B4487i9568q2289Q4824G0281d9949J4000k77474a00577o5245l1848
10409a97670J2835A86626a21412A34664b66553J26725A30504a35344j92410J46226
10399a81528K9663b7735B80644I8765a33532H8346P6189Q5679J62220d0171k1786
10388f1957K2308C33796j66584m7791Q789D9306h0367J409l83809a66833B40725
10376b64553B38043c34868A66298N1696J83658A834K31319L6461A05047A1498
$$ plain form
10365 -93954 441330 105846 427575 199674 380759 321741 68908 389399 389996 225171 318225
10354 318225 160183 20006 170433 240203 234994 161555 253018 262983 654102 632486 738723
10343 738723 303022 106739 274915 58826 121034 132571 56123 241753 138817 54802
10332 168708 39241 191913 -217284 -61307 301688 91854 301214 131655 27505 358103
10322 358103 332702 230783 125212 232121 -40640 346055 205249 35208 86752 -61584
10311 -121776 332273 87596 326524 -139003 139162 -153020 -178806 -123229 -314065 145348
10300 -199702 -326067 -61096 -107688 160836 -62899 111814 -386666 -170775 -28739 -14224
10289 112782 185240 -174244 -245572 -396291 186997 -167829 -94777 -74488 -133579 -73232 -507266
$$ packed form
10365i3954D41330A05846L21729A99674J81085n9018F8908L20491N97j64825R3054
10354C18225j58042B0006J50427O9770n209p3439R1463R965L91119k1616J06237
10343G38723C03022A06739J68176E8826O2208J1537E6123J85630j02936E4802
10332A68708C9241J52672b17284f1307C01688I1854K09360A31655B7505L30598
10322C58103k5401j01919j05571J06909d0640C46055j40806C5208N1544f1584
10311a21776C32273H7596K38928a39003A39162a53020k5786N5577j90836A45348
10300a99702j26365f1096m6592A60836f2899A11814c86666a70775b8739a4224
10289A12782P2458a74244p1328j50719A86997a67829P3052K0289n9091O0347m34034
$$ plain form
10278 -507266 -66101 -26255 223194 -66496 -14488 174635 -295734 -333444 197263 247842 211896
10267 211896 214153 -187551 -305089 -220914 -59022 177265 -2667 64927 -69286 -148062 -227174
10256 -227174 212156 -47917 -88900 -220233 -203884 -36400 -44760 58012 178323 177106 -91253
10244 -87903 -117161 67179 306227 219204 106985 255619 38899 167157 82005 245574 78252
10232 257359 -19825 171626 175483 -168651 -111390 -75068 -16413 81022 -120245 -206718 26254
10220 -50549 -9038 -78930 -147067 -68074 -221890 -65707 227446 -311637 -398271 193540 -17236
10208 40985 101667 -187600 -211504 -216917 -99494 -33186 -69544 59021 115648 -198008 -232080
10197 -232080 -99274 296737 -117527 -212837 -46756 151747 -250781 191639 -344220 -221901
$$ packed form
10278e07266f6101b6255B23194f6496a4488A74635b95734l7710A97263N0579l5946
10267B11896K257a87551j17538Q4175e9022A77265b667F4927f9286p8776p9112
10256b27174B12156d7917m0983j31333J6349c6400q360E8012J20311j217i1253
10244h7903k9258F7179K39048q7023A06985J48634C8899J28258H2005J63569G8252
10232B57359a9825A71626L857a68651N7261L6322a6413H1022a20245q6473B6254
10220e0549i038o9892o8137f8074j53816f5707B27446c11637q6634A93540a7236
10208D0985O0682a87600k3904n413i9494c3186l6358E9021N6627a98008l4072
10197b32080i9274B96737a17527r5310d6756A51747b50781A91639c44220J22319
$$ plain form
10187 -221901 40450 75712 -59430 -157840 -314551 -116977 -200012 -125033 204890 -25821 66687
10175 -114344 -49617 -144101 -333287 -31545 24942 -171574 214076 -451251 -31778 -213282
10165 -213282 -315980 65417 -422954 126872 -108041 -347783 -171725 -30081 -229901 54500
10154 -213594 -480084 -33488 -278443 -163688 186091 -93962 124510 47716 -228710 200915
10143 -30293 -221509 -332360 -101332 -330803 -78290 79351 6303 87890 -107101 -132103 -217671
10132 -217671 -38053 -62880 88120 -209933 -137969 -215450 -190043 -105600 -180806 131458 -106294
10120 137696 -93943 -169566 93584 -156955 15936 -84946 114507 180362 -224216 -217044 -212425
10109 -212425 -292875 -87386 34391 165999 -73185 65556 -424361 -41379 40762 -104156 -221782
$$ packed form
10187b21901D0450L5262e9430r8410j56711a16977q3035P4979B04890b5821F6687
10175a14344d9617r4484j89186c1545B4942a71574B14076d51251c1778j81504
10165b13282j02698F5417d22954A26872a08041k39742a71725c0081j99820E4500
10154b13594k66490c3488k44955J14755A86091i3962A24510D7716b28710B00915
10143c0293j91216j10851a01332k29471g8290G9351F303Q1587a07101k5002q5568
10132b17671c8053k4827H8120b09933P1964p7481K5407Q4443p5206A31458a06294
10120A37696i3943p5623I3584a56955A5936h4946A14507O5855b24216P172M619
10109b12425q0450h7386C4391J31608g3185F5556d24361d1379D0762a04156j17626
$$ plain form
10098 -221782 102974 -201710 -35151 -163589 -337316 -256285 37191 153457 -258105 119832
10087 -129458 165619 -144745 -258407 157124 -133740 -84735 53225 112042 244537 -203396
10076 9592 -323345 -40550 -56966 -301512 167001 51668 -75195 105595 -33591 4019 -216203
10064 97137 194549 -439110 24647 -41298 -278511 -286984 137019 -48226 -79399 -227563 -136969
10053 -136969 58632 -132175 -32399 339520 -200547 -44790 -34912 -73208 54484 -73459 255790
10041 -7138 15828 -174664 277094 3467 -362674 -358798 18247 -238761 -172668 -194812 125662
10029 -271377 -125464 -46789 -243715 -262755 -29388 139195 -2121 113225 -84174 -11803 -54748
10018 -54748 -191977 106488 -200435 -12886 118393 -38514 169618 -180289 68 213456 31971
$$ packed form
10098b21782A02974b01710c5151j28438j73727Q1031C7191J16266b58105A19832
10087a29458A65619a44745j13662A57124a33740M9005E3225N8817J32495b03396
10076I592c23345d0550j6416k44546A67001E1668g5195A05595c3591D019b16203
10064I7137R7412d39110B4647d1298k37213q473A37019d8226l1173j48164R0594
10053a36969E8632a32175c2399C39520b00547d4790R878l8296E4484g3459B55790
10041g138A5828a74664B77094C467c62674L876A8247b38761O6093k2144A25662
10029b71377a25464d6789j96926j9040b9388A39195b121A13225h4174a1803m2945
10018e4748j37229A06488b00435a2886A18393c8514A69618a80289F8K13388C1971
$$ plain form
10006 68474 30261 -204744 58377 109821 153742 -169322 164358 -62630 -248727 -184413 -216708
9995 -216708 288689 143726 -57138 -68517 -141222 86245 -107413 36965 -215779 67723 -227713
9983 -359657 -309502 -123605 84805 -139948 -211363 -245441 -343364 133326 -39622 -114301 -262498
9972 -262498 -215194 -79813 175134 168738 36918 -300568 221106 30415 -24692 -311359 1206
9960 91265 -7969 -111833 213451 -19954 220345 82110 36113 -175650 -73676 -181331 -133076
9949 -133076 84144 4576 238903 173970 -136231 117680 -134040 108038 195910 -21577 135239
9937 81670 -282862 -294497 -144417 -137466 -77073 -411805 -190045 -181906 -159613 -141805 20659
9925 125792 69891 -78772 200441 -110978 -514 -10884 145197 -229652 270946 -248279 -208871
$$ packed form
10006F8474C0261b04744E8377N1444M3921a69322A64358f2630j86097O4314l2295
9995b16708B88689A43726e7138j1379p2705H6245a07413C6965b15779F7723b27713
9983c59657N0155a23605H4805a39948p1415l4078r7923A33326c9622p4679j48197
9972b62498M7304g9813A75134o396C6918c00568B21106C0415b4692k86667A206
9960I1265g969j03864B13451a9954B20345H2110C6113a75650g3676j07655M8255
9949a33076H4144D576K34327o4933a36231A17680a34040A08038Q7872b1577A35239
9937H1670b82862j1635a44417O951O0393l34732a90045Q139K2293J7808B0659
9925A25792n5901g8772B00441a10978e14j0370A45197b29652B70946b48279L9408
$$ plain form
9914 -208871 -14725 -2207 -269137 11946 -28900 -40759 -96308 24635 -85580 97528 48176 -180813
9901 -360771 78005 35940 -208950 -302303 -245374 -265511 -91751 170318 411286 -187846 -582854
9890 -582854 -224067 -123732 -198576 -108137 -250056 14874 -291914 54807 -86187 -247174 -21358
9878 -173252 183839 -183212 -110929 -114027 53860 -26412 -227765 54327 -326543 -3102 41350
9866 -452408 134450 -280993 -255821 92922 -369873 91428 -131645 39733 -241920 -230678 -83121
9854 -102828 -128355 127629 120840 -110351 -144895 -96285 -296127 -311253 -191586 -169223 -88148
9843 -88148 -86655 -335391 -95393 -50694 -40351 -128786 -238531 236700 56456 250265 -60976
9831 48115 -284803 -47434 -28507 -70670 -174785 -177095 145019 236458 -231649 -277441 6906
$$ packed form
9914b08871a4725b207k66930A1946b8900j1859n5549B4635h5580I7528D8176a80813
9901c60771G8005C5940b08950r3353N6929k0137i1751A70318K40968a87846l95008
9890e82854b24067J00335p4844R0439j41919A4874b91914E4807h6187j60987b1358
9878a73252A83839a83212P2283l098E3860b6412k01353E4327c26543c102D1350
9866d52408A34450b80993K5172I2922c69873I1428a31645C9733b41920J1242h3121
9854a02828k5527A27629o789a10351l4544M8610j99842j5126J19667K2363Q1075
9843h8148J493k48736i5393M4699J0343q8435j09745B36700E6456J93809f0976
9831D8115b84803d7434J8927m2163j04115k310A45019R1439b31649m5792F906
$$ plain form
9819 26745 -75106 -344563 -184956 -102567 -172083 -200617 299365 14246 -440914 367860 -126672
9807 97217 26728 -80531 255901 41308 -341289 -12605 238 6040 -197466 -90732 -133029 -62064
9794 -79046 -76704 3344 29238 -27262 52176 -161523 85298 -68694 -39915 -301568 -177684 15285
9781 -473953 -240683 -237659 -245580 -69321 2154 -206624 125423 -6992 -85172 -196508 -65733 58723
9768 -158733 -82387 -119598 -269641 -185989 -92171 -170118 131091 -122261 285191 416061 -65253
9756 -66530 -191498 -450582 -29315 -257669 -70488 44639 76433 1249 65205 -214658 196212
9744 -78194 -43280 141199 90501 51360 -157297 -136025 -31762 -5985 -130614 -66649 -280536
9733 -280536 -8473 -5964 155203 91884 -9708 174030 -121452 23395 -148980 -391395 -4468
$$ packed form
9819B6745g5106k69457J59607Q2389o9516k8534B99365A4246d40914C67860a26672
9807I7217B6728h0531B55901D1308c41289a2605B38N802a97466i0732m2297f2064
9794g9046K342C344K5894b7262E2176a61523H5298f8694K8779k61653J23884A5285
9781d73953K33270L024p921f9321B154b06624A25423f992p8180j11336f5733E8723
9768a58733P6346l7211j50043Q3652i2171p7947A31091a22261B85191J30870f5253
9756f6530j24968k59084b9315k28354g0488D4639L1794A249O3956b14658A96212
9744g8194L4914A41199n0698l9141a57297K1272c1762e985j24629O3965k13887
9733b80536h473K509A55203o3319i708A74030a21452B3395a48980k42415d468
$$ plain form
9721 -105599 -161605 -429427 -476056 123177 -215353 -104116 -121564 -28540 -209205 -64601 64281
9709 -73869 80725 222429 133141 19298 -283546 -79983 -173127 -189273 117173 146129 -93733
9697 -78928 -144156 -68586 -129486 419867 291983 111143 -84166 78424 -366908 -87517 -272067
9686 -272067 127170 -11507 -106217 -205368 -161202 -39388 283900 55268 77603 -33906 -57744
9675 -57744 -71125 -66608 62395 -260898 -39600 -112266 -8903 -3332 -91040 -95413 -63135 -50218
9663 -50218 132957 258446 18941 179204 -30942 68084 -80955 -161137 -49659 -114524 29716
9651 466765 80345 -320453 -363381 -34456 -381798 -14848 -317325 48254 288863 158104 -236997
9639 144928 -131452 -168930 -69452 -386117 -248280 -668044 327245 -153187 -73428 -138986
$$ packed form
9721a05599n6006k67822m6629A23177b15353a04116j7448b8540j80665f4601F4281
9709g3869H0725J41704q9288A9298b83546g9983r3144j6146A17173K8956i3733
9697g8928o5228f8586o0900D19867j27884A11143h4166G8424c66908h7517j84550
9686b72067A27170a1507r4710r9151M4166c9388B83900E5268K2335c3906k3838
9675e7744j3381M517F2395b60898c9600p2666h903c332q7708m373L2278J2917
9663e0218A32957J25489A8941J60263c0942F8084h0955q0182d9659o4865B9716
9651D66765H0345c20453m2928c4456l47342a4848l02477D8254K40609j30759b36997
9639A44928a31452l7478f9452l16665J37837m19764C27245a53187g3428o5558
$$ plain form
9629 -138986 199062 -29585 -161695 38139 -127962 -152420 -97001 120057 -374664 -150150
9618 120282 -11208 77029 -20206 -123351 -343961 32619 -111860 34341 -142166 -77907 173211
9606 -209729 -109653 224736 10979 -137692 -189597 -80161 28920 222843 -154851 747 -58309
9594 -77443 -142090 -102583 -59388 -344014 578305 11808 -255299 -68564 -104865 -82857 -244004
9583 -244004 -204671 59497 65161 -176594 -47577 -154758 -168785 -18099 -35421 -199033 138706
9571 22393 -260962 177100 95958 35191 -318223 -39841 47148 -209899 -10433 76641 46858
9560 46858 67053 15239 34725 -38717 -8816 180430 -115505 -3894 -66299 97396 27669 75415
9548 75415 -147448 -200934 238924 -247096 292 -124962 -502513 -200589 -53347 -132565 256496
$$ packed form
9629a38986A99062b9585j32110C8139a27962k4458N5419A20057c74664a50150
9618A20282a1208G7029b0206j03145k20610C2619a11860C4341a42166O4259A73211
9606b09729J00076B24736A0979a37692n1905h0161B8920J93923a54851G47e8309
9594g7443o4647L9507M3195k84626E78305A1808b55299f8564l6301K2008j61147
9583b44004L9333E9497N664a76594d7577j07181j4027a8099j7322j63612A38706
9571B2393b60962A77100q1142C5191c18223c9841D7148b09899a0433G6641k9783
9560D6858K0195A5239J9486c8717h816A80430a15505c894o2405I7396B7669M7746
9548G5415a47448n3486B38924b47096B92a24962l77551b00589e3347p9218B56496
$$ plain form
9536 263755 183327 -157166 -134833 32854 -93747 -172065 -171916 -197527 -75050 -198898 157828
9524 87943 -165735 4018 -224555 -215539 -194701 -173171 -378354 -234189 69210 -111674 -243149
9513 -243149 -50876 -99138 -36825 119187 -384498 -75269 140445 17696 133024 -192077 -260970
9502 -260970 -126479 41054 -118617 -129262 -86560 248650 -51048 140233 100936 -272689 253136
9490 -276093 21250 -110872 -200219 -47831 -49100 -52981 -112735 -63775 127374 -84764 -256770
9479 -256770 -10988 -191185 98208 103700 41028 -75732 207444 188385 -305503 103545 -304343
9467 -57358 92115 -42459 -257492 -88416 -179071 162462 63833 -211785 -54594 -76188 71427
9455 77685 -225937 -266722 -246732 -38801 89193 41985 -129761 123382 -275173 3034 -218402
$$ packed form
9536B63755q0428a57166K2333C2854i3747p8318J49k5611g5050j23848A57828
9524H7943a65735D018b24555R016K0838K1530k05183J44165F9210a11674j31475
9513b43149e0876m8262c6825A19187c84498g5269A40445A7696J15328a92077o8893
9502b60970a26479D1054a18617j0645M2702B48650e1048A40233l9297b72689B53136
9490b76093B1250a10872q9347d7831j269l881n9754M8960A27374h4764j72006
9479b56770a0988j80197I8208N492D1028g5732B07444j9059c05503A03545c04343
9467e7358I2115d2459k15033h8416r0655A62462F3833b11785e4594k1594G1427
9455G7685b25937m0785J9990c8801H9193D1985a29761A23382b75173C034b18402
$$ plain form
9443 57813 -167730 466463 79612 -86667 19702 -137990 29732 198135 -364171 -8300 -192113
9432 -192113 6738 -333936 136290 123883 -44315 -32453 49435 514550 -113155 80388 -127410
9420 64536 -233020 -221173 -432146 58152 -223185 -118614 -60452 -108539 -268544 -60364 -85160
9409 -85160 -4919 -414604 79431 -24716 232183 171408 276332 196404 -106480 -96901 -330752
9398 -330752 -7372 -156617 85769 -132031 7236 -107971 -94255 -99783 -154338 12715 -238749
9386 -364203 -75885 -199244 241906 -16746 -240230 -308937 94805 -292267 99746 -333097 -32167
9374 -65003 165654 54172 -13822 329421 -83075 46031 -23725 -421956 -38847 -397474 136443
9362 4497 -144504 -40866 -288164 -114729 -124580 412491 -387963 -9524 -44960 -161010 2776
$$ packed form
9443E7813a67730D66463G9612h6667A9702a37990B9732J68403c64171h300j83813
9432a92113F738c33936A36290j2407d4315J1862D9435M65115a13155H0388a27410
9420F4536b33020J1847k10973E8152b23185J04571N8162m8087j60005f0364k4796
9409h5160d919m09685G9431b4716B32183o0775J04924p9928a06480R579k33851
9398c30752g372j49245H5769a32031G236a07971J3716n528n4555A2715b38749
9386c64203g5885j23359B41906a6746k23484o8707I4805b92267I9746c33097c2167
9374f5003A65654E4172a3822C29421h3075D6031b3725l98231c8847l58627A36443
9362D497a44504d0866k47298a14729r851D12491c87963i524l5436j16050B776
$$ plain form
9350 -199749 113138 -467274 25386 -34697 -6164 148654 -97717 -231697 -30974 -247545 274246
9338 -147302 216461 12885 -5423 -311644 -223684 -383942 -266445 270657 260673 147539 218745
9327 218745 241773 14138 -407280 -312269 -38078 -124094 -6781 -80464 161585 -142830 -40949
9315 288580 36182 119082 -222381 -160617 85681 -329489 -20615 74421 -58722 -221145 88320
9303 -223493 -106390 -257677 127338 -78219 -419066 153174 77364 -179905 228998 -199584
9292 -77552 -356832 54550 -452527 58023 161761 -83065 -306014 175683 135256 123943 -179775
9280 -124032 -342605 320845 -2057 -33489 -338783 220000 67277 118956 -237412 45167 -78454
9268 -177083 -22186 -42861 25860 -89248 34927 -435013 -267720 -416647 -20895 -68577 -45978
$$ packed form
9350a99749A13138d67274B5386c4697f164A48654i7717j33980c0974k16571B74246
9338a47302B16461A2885e423l06221Q7960j60258J17497B70657r984j13134P1206
9327B18745K3028A4138d07280R5011c8078q6016f781p3683A61585a42830d0949
9315B88580C6182Q2900b22381O1764H5681c29489b0615G4421e8722j62423H8320
9303b23493a06390j51287A27338g8219l40847A53174p5810a79905B28998a99584
9292g7552k79280E4550d52527E8023J03738h3065k22949A75683m0427j1313a79775
9280a24032k18573C20845b057l1432l05294B20000F7277N1679b37412D5167g8454
9268a77083b2186k0675B5860h9248C4927d35013J67293j48927b0895m7682K2599
$$ plain form
9257 -45978 -99092 -138079 75985 -83590 -9386 -214827 -210802 -118424 -251223 29006 -346081 -302550
9245 -302550 257606 -395938 -81985 -119880 -141157 -233643 8385 -79349 483094 -156726 25973
9233 20852 -94381 192539 -145877 544667 53339 122466 -153205 -64096 46751 -489210 177448
9221 6321 -231543 129239 -335942 232403 12951 -408547 -120019 166367 67366 -236216
9210 39223 120110 44676 -225758 -292025 -41548 -99174 41937 49382 2028 -165692 71941 43413
9198 43413 -15765 -231790 -19338 108302 -97629 40126 -36406 175217 -125398 -382303 121503
9186 -38210 -1881 -190601 -36661 -290483 99884 -117613 165432 -8975 -13700 42532 44143 97255
9174 97255 -91885 -109695 -145694 -89881 -12060 -385534 -297746 300123 -168621 224614 -11072
$$ packed form
9257d5978n3114l8987G5985h3590i386k05441M025R2378j32799B9006c46081M3531
9245c02550B57606c95938h1985l7895k1277r2486H385g9349D83094a56726B5973
9233B0852i4381A92539a45877E44667E3339O9127a53205f4096D6751d89210A77448
9221F321b31543A29239c35942B32403A2951d08547a20019A66367F7366b36216
9210C9223Q0887D4676b25758o6267d1548n7626D1937P445B028a65692G1941k8528
9198D3413a5765k16025a9338A08302i7629D0126c6406A75217a25398k56905A21503
9186c8210a881j88720c6661k53822I9884a17613A65432h975m725D2532J611N3112
9174I7255i1885j7810l5999N5813a2060l73474Q7788C00123a68621B24614a1072
$$ plain form
9162 73591 52282 -16224 -48121 -251681 -3679 -23831 -48993 -44202 -34131 191311 12600 -126843
9149 -318480 -204220 -73510 217667 -272076 123813 -160289 43184 -136145 -147784 18276
9138 -333397 -279959 56806 160033 -21169 246587 188884 -46194 -212209 -163638 56540 -162476
9126 -201234 59428 -198230 -381955 51174 142516 -222145 35405 -157677 -277488 -33150 -112402
9115 -112402 -6908 56733 -135078 -311246 -77756 -6914 99555 -239716 -219073 -100686 15315
9103 -71042 -97798 284835 -386297 130009 90002 -72073 283644 55679 5519 -17458 34881
9091 -329397 282689 -166845 -74086 70025 -231119 196463 92159 34158 -10800 34940 -487903
9079 83969 177159 -186445 361353 -79654 -260367 210735 -271430 53244 -174016 -57778 -119145
$$ packed form
9162G3591k1309a6224l1897k03560c679k0152k5162M791J0071A91311A2600a26843
9149c18480J14260g3510B17667b72076A23813a60289D3184a36145j1639A8276
9138c33397N3438E6806J03227b1169B46587n7703d6194j66015M8571E6540a62476
9126b01234E9428a98230j83725E1174R1342b22145C5405a57677j19811c3150p9252
9115a12402f908E6733a35078j76168g7756f914I9555b39716K0643a00686A5315
9103g1042k6756B84835c86297A30009m0007g2073B83644E5679E519a7458C4881
9091c29397B82689a66845g4086G0025b31119A96463I2159C4158a0800C4940d87903
9079H3969R3190a86445C61353g9654j80713B10735b71430E3244a74016e7778o1367
$$ plain form
9068 -119145 13259 280835 131207 26412 1980 -151953 -47751 -92277 -48410 168984 -301152
9056 -46219 39125 23783 172993 -281159 -283674 -299526 83620 300464 45485 -121512 193455
9044 67878 -263163 -113290 -23806 -120222 105595 -41078 -197909 -105389 -38700 1797 -63089
9032 -148925 -306812 -303981 -20734 -33152 17388 -416359 -22194 -226603 7821 -21742 178683
9020 -107813 17340 39225 -381579 -65476 21505 -3866 -297763 -65376 74009 3606 47169 -220620
9007 -87833 170952 67969 -154571 162737 -40832 116244 -71989 -97747 -255167 21102 -35021
8995 -309621 137973 127965 -97244 -45256 -124100 -424590 -158072 -188878 -160912 55211 31959
8984 31959 -69057 95626 67678 -139452 -111127 -132036 30891 103398 -115722 -62808 -61412 185075
$$ packed form
9068a19145A3259K67576A31207B6412A980a51953d7751m4526M3867A68984c01152
9056d6219C9125j5342J49210b81159k515j5852H3620K16844D5485a21512A93455
9044F7878b63163a13290b3806r6416A05595d1078j56831R2520c8700A797f3089
9032a48925j57887K831b0734j2418A7388d16359b2194k04409G821b1742A78683
9020a07813A7340K1885c81579f5476B1505c866k93897f5376G4009C606M3563b20620
9007h7833A70952F7969a54571A62737d0832A16244g1989k5758j57420B1102c5021
8995c09621A37973j0008i7244d5256p8844l00490a58072l0806K7966E5211k3252
8984C1959f9057I5626k7948a39452K8325k0909C0891P2507a15722N2914J396A85075
$$ plain form
8971 -351029 -164529 -49331 -81725 -163793 -213643 13797 233662 85013 -236577 343681 -123203
8959 199580 76009 -232383 68656 381841 133212 -34242 -7076 310994 -238668 11731 -232668
8947 126245 97891 -238884 -82595 12801 -199057 71521 41388 -82601 108656 -75380 -216646
8936 -216646 254025 301303 -80770 -559589 145414 264538 394205 -105553 256399 -255795
8925 -268428 90322 474415 199448 363958 504496 1156735 3039730 9805099 7470972
8916 7470972 1865273 799131 341236 359578 196580 -121211 25513 -399800 -132492 -177664
8906 -177664 -217809 123164 294006 7078 83551 -127491 -57585 -55913 -330903 -58849 -169599
8895 -169599 120647 -153565 49322 16959 67538 -131164 -25577 -55806 128338 244671 -51783
$$ packed form
8971c51029a64529d9331l2394q2068m9850A3797K19865H5013b36577C43681a23203
8959A99580G6009b32383F8656L13185A33212c4242g076C10994b38668A1731b32668
8947A26245k8354b38884h2595A2801a99057G1521l0133h2601A08656g5380j41266
8936b16646B54025M7278h0770m78819A45414J19124J29667a05553B56399b55795
8925b68428I0322L84093A99448J64510J40538O52239J882995O765369k334127
8916G470972A865273G99131C41236J8342j62998a21211B5513c99800a32492m5172
8906a77664m0145A23164J70842G078P6473a27491e7585J672k74990e8849j10750
8895a69599A20647a53565D9322A6959N0579a31164b5577l0229A28338J16333e1783
$$ plain form
8883 165723 -97201 207473 74431 -53859 190792 91513 162201 -122876 69893 68398 72894
8872 72894 156984 -219305 -104108 -75348 -98504 114142 -171184 427109 -73957 40008 27365
8861 27365 -146454 40137 34972 152741 329589 -319139 -54472 -39568 -259114 96852 89491
8850 89491 -40095 -23113 2054 -180126 14623 -131068 -277123 -72861 123987 -302836 -131714
8838 -262170 -52754 -14212 52525 -181542 -116063 -68911 -120071 86837 320044 -335417 58141
$$ packed form
8883A65723i7201B07473G4431e3859A90792I1513P0688a22876F9893j495M496
8872G2894Q4090b19305a04108K8760k3156A14142a71184D27109g3957D0008j2643
8861B7365a46454D0137n165J17769J76848c19139e4472J4904k19546I6852p361
8850H9491d0095J6982B054a80126A4623a31068j46055g2861A23987c02836a31714
8838b62170e2754a4212E2525a81542O5479M7152n1160H6837K33207c35417E8141
$$ [...]
##END NTUPLES=NMR SPECTRUM
##END=
