
##TITLE=AC1294_INDRS11105_6613898_HpT6ehVIQI
##JCAMPDX= 6.0         $$ Bruker NMR JCAMP-DX V2.0
##DATA TYPE= NMR SPECTRUM
##DATA CLASS= NTUPLES
##ORIGIN= BRUKER
##OWNER= Administrator
$$ 1.72 TOPSPIN		Version 2.1
$$ 2012-08-02 14:23:26.296 -0500  Administrator@TOPSPIN
$$ Compression mode = diff/dup
##.OBSERVE FREQUENCY= 400.02188249412
##.OBSERVE NUCLEUS= ^1H
##.ACQUISITION MODE= SIMULTANEOUS (DQD)
##.ACQUISITION SCHEME= undefined
##.AVERAGES= 64
##.DIGITISER RES= 22
##SPECTROMETER/DATA SYSTEM= spect
##.PULSE SEQUENCE= noesygpps1d.comp
##.SOLVENT NAME= COFFEE_meoh
##.SHIFT REFERENCE= INTERNAL, COFFEE_meoh, 1, 14.96331
##AUDIT TRAIL= $$ (NUMBER, WHEN, WHO, WHERE, PROCESS, VERSION, WHAT)
$$ ##TITLE= Audit trail, TOPSPIN		Version 2.1
$$ ##JCAMPDX= 5.01
$$ ##ORIGIN= Bruker BioSpin GmbH
$$ ##OWNER= Administrator
$$ $$ C:\Bruker\TOPSPIN/data/COFFEE/nmr/AC1294_INDRS11105_6613898_HpT6ehVIQI/12/pdata/1/auditp.txt
$$ ##AUDIT TRAIL=  $$ (NUMBER, WHEN, WHO, WHERE, PROCESS, VERSION, WHAT)
(   1,<2012-08-02 14:23:21.593 -0500>,<Administrator>,<TOPSPIN>,<go>,<TOPSPIN 2.1>,
      <created by zg
	started at 2012-08-02 14:11:51.109 -0500,
	POWCHK enabled, PULCHK disabled,
       configuration hash MD5:
       6B 1B 68 BB D9 2E 58 E2 7F 35 AD 54 07 DF 0E 41
       data hash MD5: 64K
       79 BC 44 CC 2A 1F 38 B7 EE 95 04 E3 66 5A 4E 4A>)
(   2,<2012-08-02 14:23:24.406 -0500>,<Administrator>,<TOPSPIN>,<proc1d>,<TOPSPIN 2.1>,
      <Start of raw data processing
       efp LB = 0.3 FT_mod = 6 PKNL = 1 PHC0 = 0 PHC1 = 0 SI = 128K 
       data hash MD5: 128K
       8B 1E 78 AF 65 C9 24 B4 24 CA F2 5B CC 61 A8 6F>)
(   3,<2012-08-02 14:23:25.500 -0500>,<Administrator>,<TOPSPIN>,<proc1d>,<TOPSPIN 2.1>,
      <pk PHC0 = 0.9393311 PHC1 = 0 
       data hash MD5: 128K
       BC 71 10 60 F2 6B A5 6A DB 71 59 EA 06 4D 89 BC>)
(   4,<2012-08-02 14:23:25.734 -0500>,<Administrator>,<TOPSPIN>,<proc1d>,<TOPSPIN 2.1>,
      <abs ABSG = 1 
       data hash MD5: 128K
       F8 8E DA 1E 76 19 BC 4B 69 E1 8D 58 03 EF 4A 4A>)
(   5,<2012-08-02 14:23:25.812 -0500>,<Administrator>,<TOPSPIN>,<proc1d>,<TOPSPIN 2.1>,
      <abs ABSG = 2 
       data hash MD5: 128K
       59 A6 5C 98 E9 D6 9A 33 87 E8 2C EE 1D 0B 6A E8>)
(   6,<2012-08-02 14:23:25.984 -0500>,<Administrator>,<TOPSPIN>,<proc1d>,<TOPSPIN 2.1>,
      <abs ABSG = 3 
       data hash MD5: 128K
       34 BB DD 89 1D CB 4C B8 66 66 0E DB 0F 84 B8 3F>)
(   7,<2012-08-02 14:23:26.156 -0500>,<Administrator>,<TOPSPIN>,<proc1d>,<TOPSPIN 2.1>,
      <abs ABSG = 4 
       data hash MD5: 128K
       22 49 EC 75 5A 1F 4C 8B 09 F4 00 B2 AA 2D 21 0C>)
(   8,<2012-08-02 14:23:26.218 -0500>,<Administrator>,<TOPSPIN>,<proc1d>,<TOPSPIN 2.1>,
      <abs ABSG = 5 
       data hash MD5: 128K
       46 86 2E 00 79 6C ED 5A 18 0D 2E 9B 93 5D F8 95>)
$$ ##END=
$$ 
$$ $$ hash MD5
$$ $$ 90 87 A1 5B 12 70 8A A8 59 90 88 5F 38 71 A3 D9
##$RELAX= 
##$RELAX= 
##$RELAX= 
##$RELAX= 
##$RELAX= 
##$RELAX= 
##$RELAX= 
##$RELAX= 
$$ Bruker specific parameters
$$ [...]
##$TP07= 0
##$TPNAME0= <>
##$TPNAME1= <>
##$TPNAME2= <>
##$TPNAME3= <>
##$TPNAME4= <>
##$TPNAME5= <>
##$TPNAME6= <>
##$TPNAME7= <>
##$TPOAL= (0..7)
0.5 0.5 0.5 0.5 0.5 0.5 0.5 0.5
##$TPOFFS= (0..7)
0 0 0 0 0 0 0 0
##$TUNHIN= 0
##$TUNHOUT= 0
##$TUNXOUT= 0
##$USERA1= <user>
##$USERA2= <user>
##$USERA3= <user>
##$USERA4= <user>
##$USERA5= <user>
##$V9= 5
##$VALIST= <valist>
##$VCLIST= <CCCCCCCCCCCCCCC>
##$VD= 0
##$VDLIST= <DDDDDDDDDDDDDDD>
##$VPLIST= <PPPPPPPPPPPPPPP>
##$VTLIST= <TTTTTTTTTTTTTTT>
##$WBST= 1024
##$WBSW= 4
##$XGAIN= (0..3)
0 0 0 0
##$XL= 0
##$YL= 0
##$YMAX_a= 16126137
##$YMIN_a= -7969204
##$ZGOPTNS= <>
##$ZL1= 120
##$ZL2= 120
##$ZL3= 120
##$ZL4= 120
##$ABSF1= 14.96331
##$ABSF2= -5.594872
##$ABSG= 5
##$ABSL= 3
##$ALPHA= 0
##$AQORDER= 0
##$ASSFAC= 0
##$ASSFACI= 0
##$ASSFACX= 0
##$ASSWID= 0
##$AUNMP= <proc_prof1d_extract.lims>
##$AXLEFT= 0
##$AXNAME= <>
##$AXNUC= <1H>
##$AXRIGHT= 0
##$AXTYPE= 0
##$AXUNIT= <>
##$AZFE= 0.1
##$AZFW= 0.1
##$BCFW= 0
##$BC_mod= 0
##$BYTORDP= 0
##$COROFFS= 0
##$CY= 15
##$DATMOD= 1
##$DC= 0
##$DFILT= <>
##$DTYPP= 0
##$F1P= 0
##$F2P= 0
##$FCOR= 0.5
##$FTSIZE= 131072
##$FT_mod= 6
##$GAMMA= 0
##$GB= 0
##$INTBC= 1
##$INTSCL= 1
##$ISEN= 128
##$LB= 0.3
##$LEV0= 0
##$LPBIN= 0
##$MAXI= 10000
##$MC2= 0
##$MEAN= 0
##$ME_mod= 0
##$MI= 0
##$NCOEF= 0
##$NC_proc= -2
##$NLEV= 6
##$NOISF1= 0
##$NOISF2= 0
##$NSP= 0
##$NTH_PI= 0
##$NZP= 0
##$OFFSET= 14.96331
##$PC= 1
##$PHC0= 0.9393311
##$PHC1= 0
##$PH_mod= 1
##$PKNL= yes
##$PPARMOD= 0
##$PPDIAG= 0
##$PPIPTYP= 0
##$PPMPNUM= 2147483647
##$PPRESOL= 1
##$PSCAL= 4
##$PSIGN= 0
##$PYNMP= <proc.py>
##$REVERSE= no
##$SF= 400.020008714725
##$SI= 131072
##$SIGF1= 0
##$SIGF2= 0
##$SINO= 400
##$SIOLD= 131072
##$SPECTYP= <>
##$SREGLST= <1H.CDCl3>
##$SSB= 0
##$STSI= 131072
##$STSR= 0
##$SW_p= 8223.68421052631
##$SYMM= 0
##$S_DEV= 0
##$TDeff= 65536
##$TDoff= 0
##$TI= <>
##$TILT= no
##$TM1= 0
##$TM2= 0
##$TOPLEV= 0
##$USERP1= <user>
##$USERP2= <user>
##$USERP3= <user>
##$USERP4= <user>
##$USERP5= <user>
##$WDW= 1
##$XDIM= 131072
##$YMAX_p= 449596374
##$YMIN_p= -708908
##$CURPLOT= <Network HP LaserJet P1505>
##$CURPRIN= <$Network HP LaserJet P1505>
##$DFORMAT= <normdp>
##$LAYOUT= <+/1D_H.xwp>
##$LFORMAT= <normlp>
##$PFORMAT= <normpl>
##$SURQMSG= 1
$$ End of Bruker specific parameters
$$ ---------------------------------
##NTUPLES= NMR SPECTRUM
##VAR_NAME=  FREQUENCY,     SPECTRUM/REAL,   SPECTRUM/IMAG
##SYMBOL=    X,             R,               I
##VAR_TYPE=  INDEPENDENT,   DEPENDENT,       DEPENDENT
##VAR_FORM=  AFFN,          ASDF,            ASDF
##VAR_DIM=   131072,        131072,          131072
##UNITS=     HZ,            ARBITRARY UNITS, ARBITRARY UNITS
##FACTOR=    0.0627417313425164, 1,          1
##FIRST=     8223.62146879497, 190,          -49037
##LAST=      0,             1588,            -49665
##MIN=       0,             -708908,         0
##MAX=       8223.62146879497, 449596374,    0
$$ Real data points
##PAGE= N=1
##DATA TABLE= (X++(R..R)), XYDATA
$$ [...]
$$ plain form
63371 471502 483136 495400 507673 520283 534091 549469 566020 583462 602469 624141 648734
63360 648734 675401 703236 732069 761949 792249 821622 848596 871943 890761 904655 913774 918481
63348 918481 919118 916246 910819 903786 895671 886847 877971 869625 861527 852524 841577 828548 813929 797975
63334 797975 780303 760455 738797 716699 695635 676233 658389 642064 627431 614340 602321
63323 602321 591328 581931 574451 568496 563652 560043 557717 556047 554404 552990 552316 552191 551952 551478 551256
63308 551256 551584 552396 553702 555432 556930 557396 556886 556104 555141 553286 550373 547444 545542 544383 542842 540397
63292 540397 537538 534922 532676 530566 528514 526699 525197 523697 521785 519589 517836 516961 516382 515106 513018
63277 513018 511074 510134 510019 509935 509459 508902 508867 509707 511282 513122 514843 516408 517961 519541 521075 522499
$$ packed form
63371D71502J1634J2264J2273J2610J3808J5378J6551J7442J9007K1672K4593
63360F48734K6667K7835K8833K9880L0300K9373K6974K3347J8818J3894R119M707
63348I18481O37k872n427p033q115q824q876q346q098r003j0947j3029j4619j5954
63334G97975j7672j9848k1658k2098k1064j9402j7844j6325j4633j3091j2019
63323F02321j0993r397p480n955m844l609k326j670j643j414o74j25k39m74k22
63308E51256L28Q12J306J730J498M66n10p82r63j855k913k929j902j159j541k445
63292E40397k859k616k246k110k052j815j502j500j912k196j753q75n79j276k088
63277E13018j944r40j15q4m76n57l5Q40J575J840J721J565J553J580J534J424
$$ plain form
63261 522499 523679 524412 524780 525286 526314 527540 528233 528021 527001 525244 522712 519645 516555 513680 510749
63246 510749 507342 503223 498367 492964 487429 482090 476898 471699 466648 461989 457564 453041 448589 444795
63232 444795 441839 439182 436237 433022 430019 427612 425728 423878 421609 419053 416827 415185 413618 411666
63218 411666 409723 408504 408040 407844 407761 407863 407703 406583 404575 402456 400606 398775 397014 395952 395958 396803 398291
63201 398291 400395 402584 403984 404564 405289 406711 408262 409400 410575 412427 414804 417269 419928 423068 426615
63186 426615 430628 435692 441972 448463 454082 459167 464955 471864 479235 486691 494789 504137 514541 525302
63172 525302 535898 546150 556084 565745 575031 583742 591938 600045 608340 616499 623913 630250 635448 639464
63158 639464 642460 644964 647384 649444 650484 650277 649240 647943 646668 645281 643254 639960 635221 629458
$$ packed form
63261E22499J180P33L68N06J028J226O93k12j020j757k532l067l090k875k931
63246E10749l407m119m856n403n535n339n192n199n051m659m425m523m452l794
63232D44795k956k657k945l215l003k407j884j850k269k556k226j642j567j952
63218D11666j943j219m64j96q3J02j60j120k008k119j850j831j761j062OQ45J488
63201C98291K104K189J400N80P25J422J551J138J175J852K377K465K659L140L547
63186D26615M013N064O280O491N619N085N788O909P371P456Q098R348J0404J0761
63172E25302J0596J0252R934R661R286Q711Q196Q107Q295Q159P414O337N198M016
63158F39464K996K504K420K060J040k07j037j297j275j387k027l294m739n763
$$ plain form
63144 629458 623195 616710 610367 604806 600425 596981 594140 592039 590874 590318 589938 589915 590745 592471 594858
63129 594858 598120 602661 608112 613445 618220 623061 628617 634657 640580 646349 652354 658616 664633 670017
63115 670017 674864 679303 682969 685222 685900 685543 684705 683301 680972 677903 674747 671700 668211 663803 658690
63100 658690 653275 647531 641305 634857 628634 622823 617621 613619 611308 610321 609752 609213 609029 609421 610064 610695
63084 610695 611668 613602 616652 620435 624593 629221 634677 641111 648343 656244 664941 674433 684270 694049
63070 694049 704148 715343 727649 740212 752521 765050 778237 791450 803564 814196 823851 833160
63058 833160 842511 852048 861434 869817 876526 881589 885161 886841 886207 883738 880405 876434 871118 863888
63044 863888 854988 845041 834480 823484 812081 800291 788442 777247 767257 758428 750565 743907 738799
$$ packed form
63144F29458o263o485o343n561m381l444k841k101j165n56l80k3Q30J726K387
63129E94858L262M541N451N333M775M841N556O040N923N769O005O262O017N384
63115F70017M847M439L666K253O78l57q38j404k329l069l156l047l489m408n113
63100F58690n415n744o226o448o223n811n202m002k311r87n69n39j84L92O43O31
63084F10695R73J934L050L783M158M628N456O434P232P901Q697R492R837R779
63070F94049J0099J1195J2306J2563J2309J2529J3187J3213J2114J0632R655R309
63058H33160R351R537R386Q383O709N063L572J680o34k469l333l971n316p230
63044H63888q900r947j0561j0996j1403j1790j1849j1195r990q829p863o658n108
$$ plain form
63031 738799 735082 732362 730654 730119 730452 731225 732555 734603 736638 737676 738145 739804 743641 748719 753571
63016 753571 757918 762390 767241 772126 776814 781365 785633 789105 791332 792274 792234 791604 790696 789756 789067 788893
63000 788893 789204 789624 789903 790197 790618 790823 790632 790814 792553 796056 800329 804431 808367 812602 817343 822564
62984 822564 828198 833910 839127 843607 847694 851775 855847 859797 863677 867427 870710 873343 875570 877553
62970 877553 878956 879320 878609 877003 874275 869691 862459 852235 839368 824789 809439 793681 777430
62957 777430 760814 744293 728111 712101 696264 681068 666862 653357 640083 627109 614983
62946 614983 604112 594465 585721 577423 569135 560644 551957 543057 533948 525034 517089 510495 504741 498948
62932 498948 492745 486420 480343 474624 469315 464663 460957 458130 455599 452699 449320 445922 442780 439579
$$ packed form
63031G38799l717k720j708n35L33P73J330K048K035J038M69J659L837N078M852
63016G53571M347M472M851M885M688M551M268L472K227R42m0o30r08r40o89j74
63000G88893L11M20K79K94M21K05j91J82J739L503M273M102L936M235M741N221
62984H22564N634N712N217M480M087M081M072L950L880L750L283K633K227J983
62970H77553J403L64p11j606k728m584p232j0224j2867j4579j5350j5758j6251
62957G77430j6616j6521j6182j6010j5837j5196j4206j3505j3274j2974j2126
62946F14983j0871r647q744q298q288q491q687q900r109q914p945o594n754n793
62932D98948o203o325o077n719n309m652l706k827k531k900l379l398l142l201
$$ plain form
62918 439579 436120 433003 430917 429406 427207 423973 420828 418847 417733 416485 414740 412765 410626 408188
62904 408188 405736 403838 402600 401635 400776 400266 400142 399989 399511 398895 398275 397174 394943 391703 388464 386112
62888 386112 384457 382538 379866 377044 374992 373789 372663 371050 369335 368389 368602 369481 370091 369900 369298 369283
62872 369283 370484 372536 374601 376389 378333 380857 383833 386843 389729 392825 396868 402536 409789 417758
62858 417758 425636 433498 441817 450372 458354 465484 472255 478962 485204 490628 495379 499480 502429 503852
62844 503852 504007 503162 501069 497543 493103 488519 484116 479928 476055 472339 468160 463153 457739 452423 446997
62829 446997 441064 434904 429051 423379 417423 411397 406083 401796 398195 395065 392486 390168 387427 384039
62815 384039 380549 377504 374847 372234 369499 366655 363834 361331 359297 357290 354547 350815 346574 342365
$$ packed form
62918D39579l459l117k086j511k199l234l145j981j114j248j745j975k139k438
62904D08188k452j898j238r65q59n10j24j53m78o16o20j101k231l240l239k352
62888C86112j655j919k672k822k052j203j126j613j715r46K13Q79O10j91o02j5
62872C69283J201K052K065J788J944K524K976L010K886L096M043N668P253P969
62858D17758P878P862Q319Q555P982P130O771O707O242N424M751M101K949J423
62844E03852J55q45k093l526m440m584m403m188l873l716m179n007n414n316n426
62829D46997n933o160n853n672n956o026n314m287l601l130k579k318k741l388
62815C84039l490l045k657k613k735k844k821k503k034k007k743l732m241m209
$$ plain form
62801 342365 338317 334390 330655 327195 324054 321358 319151 317104 314841 312591 311026 310329 309925 309271 308461
62786 308461 307846 307575 307778 308709 310302 311928 312997 313516 313725 313516 312718 311764 311574 312707 314910 317457 319664
62769 319664 321135 321847 322156 322587 323543 325180 327394 329749 331585 332510 332775 333010 333555 334257 334934 335734 336850
62752 336850 338026 338641 338347 337461 336588 335966 335360 334566 333798 333474 333748 334441 335387 336710 338680 341298 344036
62735 344036 346114 347223 347909 349025 350757 352455 353485 353929 354276 354743 355141 355113 354161 351748 347875 343385
62719 343385 339202 335368 331266 326684 322065 317715 313441 309157 305258 302039 299219 296360 293458 290805
62705 290805 288601 287008 286220 286118 286198 286240 286736 288201 290311 292344 294293 296938 300785 305548 310817 316649
62689 316649 323196 330223 337451 345175 354157 364941 377494 391483 406702 423236 441254 460634
$$ packed form
62801C42365m048l927l735l460l141k696k207k047k263k250j565o97m04o54q10
62786C08461o15k71K03R31J593J626J069N19K09k09p98r54j90J133K203K547K207
62769C19664J471P12L09M31R56J637K214K355J836R25K65K35N45P02O77Q00J116
62752C36850J176O15k94q86q73o22o06p94p68l24K74O93R46J323J970K618K738
62735C44036K078J109O86J116J732J698J030M44L47M67L98k8r52k413l873m490
62719C43385m183l834m102m582m619m350m274m284l899l219k820k859k902k653
62705B90805k204j593p88j02Q0M2M96J465K110K033J949K645L847M763N269N832
62689C16649O547P027P228P724Q982J0784J2553J3989J5219J6534J8018J9380
$$ plain form
62677 460634 480773 500892 520552 539676 558108 575409 591164 605095 616653 624863 628992 629183
62665 629183 626057 619831 610292 597598 582581 566122 548603 530105 510823 491083 471254 451825
62653 451825 433322 415991 399809 384889 371467 359307 347597 335867 324645 314719 306028 297889
62641 297889 290107 283162 277272 271963 266777 261814 257254 252867 248456 244437 241451 239489 237842 235887
62627 235887 233595 231244 229000 226930 225184 223919 223052 222272 221405 220705 220647 221329 222195 222459 221795 220515 219208
62610 219208 218377 218345 219216 220833 222906 225243 227743 230220 232495 234695 237242 240457 244272 248418 252694
62595 252694 257005 261309 265624 270004 274482 279130 284131 289601 295418 301433 307796 314730 321949 328642
62581 328642 334179 338583 342179 345086 347228 348595 349278 349419 349287 349199 349140 348651 347312 345347 343601 342893
$$ packed form
62677D60634K0139K0119J9660J9124J8432J7301J5755J3931J1558Q210M129J91
62665F29183l126o226r539j2694j5017j6459j7519j8498j9282j9740j9829j9429
62653D51825j8503j7331j6182j4920j3422j2160j1710j1730j1222r926q691q139
62641B97889p782o945n890n309n186m963m560m387m411m019k986j962j647j955
62627B35887k292k351k244k070j746j265q67p80q67p00n8O82Q66K64o64j280j307
62610B19208q31l2Q71J617K073K337K500K477K275K200K547L215L815M146M276
62595B52694M311M304M315M380M478M648N001N470N817O015O363O934P219O693
62581C28642N537M404L596K907K142J367O83J41j32q8n9m89j339j965j746p08
$$ plain form
62565 342893 343277 343900 343739 342723 341896 342109 342783 342599 341358 340262 340103 339985 338461 335366 331779 328554
62549 328554 325602 322478 318925 314796 310034 304863 299649 294505 289390 284535 280307 276627 272962 269101
62535 269101 265581 263109 261783 261069 260388 259512 258530 257629 256945 256512 256297 256272 256503 257139 258219 259462 260402
62518 260402 260862 261170 261698 262372 263034 264071 266060 268748 271108 272784 274892 278865 284894 292015 299365
62503 299365 306756 314258 321934 329936 338331 346771 354802 362523 370586 379528 389449 400271 411831 423632
62489 423632 434913 445120 454036 461435 466925 470323 471939 472352 471951 470713 468312 464536 459706 454581
62475 454581 449697 444966 440111 435301 431073 427803 425488 423891 422556 420955 418984 417171 416025 415398
62461 415398 414891 414597 414885 415670 416569 417680 419425 421624 423501 424843 426403 428815 431734 434448 436762
$$ packed form
62565C42893L84O23j61j016q27K13O74j84j241j096j59j18j524l095l587l225
62549C28554k952l124l553m129m762n171n214n144n115m855m228l680l665l861
62535B69101l520k472j326p14o81q76r82r01o84m33k15k5K31O36J080J243R40
62518B60402M60L08N28O74O62J037J989K688K360J676K108L973O029P121P350
62503B99365P391P502P676Q002Q395Q440Q031P721Q063Q942R921J0822J1560J1801
62489D23632J1281J0207Q916P399N490L398J616M13m01j238k401l776m830n125
62475D54581m884m731m855m810m228l270k315j597j335j601j971j813j146o27
62461D15398n07k94K88P85Q99J111J745K199J877J342J560K412K919K714K314
$$ plain form
62446 436762 438791 440379 441292 441663 441664 440920 438827 435409 431351 427118 422423 416701 409805 402136 394294 386763
62430 386763 379810 373548 368042 363349 359437 356163 353477 351709 351500 353313 356953 361695 366977 372876
62416 372876 379805 387893 396915 406723 417362 428662 440117 451397 462643 474037 485326 496009
62404 496009 505711 514112 520839 525848 529604 532456 534096 534037 532362 529431 525225 519674 513440 507532 502119
62389 502119 496508 490437 484589 479568 475129 470901 467287 465148 464995 466874 470651 476000 482483 490089
62375 490089 499467 511270 525584 542353 561978 584969 611180 639902 670659 703564 738971 777124
62363 777124 818027 861227 905717 950439 994993 1039634 1084508 1129097 1172404 1213385 1251016
62352 1251016 1284114 1311302 1331274 1343182 1346903 1342990 1332403 1316265 1295771 1272053 1245949 1217870
$$ packed form
62446D36762K029J588R13L71Jp44k093l418m058m233m695n722o896p669p842p531
62430C86763o953o262n506m693l912l274k686j768k09J813L640M742N282N899
62416C72876O929Q088R022R808J0639J1300J1455J1280J1246J1394J1289J0683
62404D96009R702Q401O727N009L756K852J640n9j675k931m206n551o234n908n413
62389E02119n611o071n848n021m439m228l614k139j53J879L777N349O483P606
62375D90089R378J1803J4314J6769J9625K2991K6211K8722L0757L2905L5407L8153
62363G77124M0903M3200M4490M4722M4554M4641M4874M4589M3307M0981L7631
62352A251016L3098K7188J9972J1908L721l913j0587j6138k0494k3718k6104k8079
$$ plain form
62340 1217870 1187951 1156302 1123201 1089171 1054960 1021370 989027 958282 929322 902326 877660
62329 877660 855931 837664 822665 809861 798147 787407 778366 771443 766118 761612 757764 754911 753101
62316 753101 751803 750338 748232 745103 740480 734056 726084 717255 708028 698168 687135 674919 662251
62303 662251 649940 638241 627015 616260 606227 597129 589009 581868 575758 570782 567061 564612 563219
62290 563219 562679 563220 565280 568649 572253 575243 578014 581673 586771 593003 599928 607382 615275 623585 632593
62275 632593 642604 653463 664756 676461 688890 702138 716158 731326 748245 766913 786789
62264 786789 807896 831182 857548 887127 919870 956223 996776 1041702 1090950 1144554 1202139
62253 1202139 1262301 1322891 1381897 1437807 1489196 1534250 1570778 1596843 1611659 1615949 1611241 1598890
$$ packed form
62340A217870k9919l1649l3101l4030l4211l3590l2343l0745k8960k6996k4666
62329H77660k1729j8267j4999j2804j1714j0740r041o923n325m506l848k853j810
62316G53101j298j465k106l129m623o424p972q829r227r860j1033j2216j2668
62303F62251j2311j1699j1226j0755j0033r098q120p141o110m976l721k449j393
62290E63219n40N41K060L369L604K990K771L659N098O232O925P454P893Q310R008
62275F32593J0011J0859J1293J1705J2429J3248J4020J5168J6919J8668J9876
62264G86789K1107K3286K6366K9579L2743L6353M0553M4926M9248N3604N7585
62253A202139O0162O0590N9006N5910N1389M5054L6528K6065J4816M290m708j2351
$$ plain form
62241 1598890 1579880 1555236 1525994 1492904 1456789 1419150 1381732 1345400 1310087 1276011 1244221
62230 1244221 1215697 1190644 1168946 1150618 1135324 1122178 1110558 1100621 1092555 1085875 1079987 1074933
62218 1074933 1070975 1067927 1065525 1064053 1063907 1064753 1065766 1066553 1067398 1068781 1071144 1074899 1080211 1086904 1094908
62203 1094908 1104463 1115491 1127202 1138938 1151160 1164987 1180951 1198835 1218512 1240261 1264176
62192 1264176 1289889 1317025 1345586 1375801 1407845 1441573 1476143 1509932 1541204 1568920 1592741
62181 1592741 1612455 1627801 1638803 1645996 1650306 1652822 1654520 1656038 1657984 1661640 1669026 1681882 1700795
62168 1700795 1725501 1755628 1790788 1830415 1874018 1921349 1971840 2024198 2076925 2128808 2178365
62157 2178365 2223416 2262198 2294844 2323000 2348054 2370356 2389939 2407011 2421540 2433185 2442036
$$ packed form
62241A598890j9010k4644k9242l3090l6115l7639l7418l6332l5313l4076l1790
62230A244221k8524k5053k1698j8328j5294j3146j1620r937q066o680n888n054
62218A074933l958l048k402j472j46Q46J013P87Q45J383K363L755N312O693Q004
62203A094908R555J1028J1711J1736J2222J3827J5964J7884J9677K1749K3915
62192A264176K5713K7136K8561L0215L2044L3728L4570L3789L1272K7716K3821
62181A592741J9714J5346J1002P193M310K516J698J518J946L656P386J2856J8913
62168A700795K4706L0127L5160L9627M3603M7331N0491N2358N2727N1883M9557
62157B178365M5051L8782L2646K8156K5054K2302J9583J7072J4529J1645Q851
$$ plain form
62146 2442036 2448940 2454913 2460686 2466973 2474529 2483665 2494122 2505792 2519232 2535202 2553906 2574862
62134 2574862 2597306 2620559 2644183 2667958 2691716 2715373 2739282 2764231 2790625 2817831 2844876
62123 2844876 2871748 2899400 2928406 2958274 2988350 3018791 3050147 3082406 3115019 3147769 3181010
62112 3181010 3214922 3248918 3282145 3314534 3347078 3380909 3416241 3452448 3489055 3526301 3564743
62101 3564743 3604787 3646799 3691153 3737723 3785681 3834389 3884327 3936637 3991803 4049269 4108295
62090 4108295 4168644 4230290 4292953 4356318 4420457 4485687 4551898 4618247 4683742 4748172 4812082
62079 4812082 4875463 4936708 4993465 5044490 5089910 5129663 5162721 5188463 5207989 5223235 5235346
62068 5235346 5244770 5252314 5258967 5264773 5268830 5270446 5269530 5266002 5259689 5250873 5240052 5227019 5210875
$$ packed form
62146B442036O904N973N773O287P556R136J0457J1670J3440J5970J8704K0956
62134B574862K2444K3253K3624K3775K3758K3657K3909K4949K6394K7206K7045
62123B844876K6872K7652K9006K9868L0076L0441L1356L2259L2613L2750L3241
62112C181010L3912L3996L3227L2389L2544L3831L5332L6207L6607L7246L8442
62101C564743M0044M2012M4354M6570M7958M8708M9938N2310N5166N7466N9026
62090D108295O0349O1646O2663O3365O4139O5230O6211O6349O5495O4430O3910
62079D812082O3381O1245N6757N1025M5420L9753L3058K5742J9526J5246J2111
62068E235346R424P544O653N806M057J616r16l528o313q816j0821j3033j6144
$$ plain form
62055 5210875 5191077 5167861 5141663 5112966 5082819 5052611 5022926 4993250 4963092 4932825 4903202
62044 4903202 4874746 4847990 4823813 4803184 4786961 4776082 4771338 4772685 4779299 4790488 4805790 4823680
62032 4823680 4840784 4853035 4857504 4853052 4840009 4819934 4795283 4768389 4740349 4710752 4677993 4639559
62020 4639559 4592545 4534847 4466348 4389074 4306316 4221538 4137618 4056532 3979391 3906596 3837926
62009 3837926 3772877 3711372 3654112 3601913 3554898 3512799 3475802 3444386 3418330 3396536 3377914
61998 3377914 3361726 3346904 3331687 3314156 3292532 3264933 3229789 3187015 3138099 3084682 3027678
61987 3027678 2968076 2907701 2848411 2791138 2736284 2684400 2635747 2589797 2546043 2504893 2466904
61976 2466904 2431458 2397051 2362729 2328518 2294694 2261391 2228833 2197072 2165527 2133475 2101012
$$ packed form
62055E210875j9798k3216k6198k8697l0147l0208k9685k9676l0158l0267k9623
62044D903202k8456k6756k4177k0629j6223j0879m744J347O614J1189J5302J7890
62032D823680J7104J2251M469m452j3043k0075k4651k6894k8040k9597l2759l8434
62020D639559m7014n7698o8499p7274q2758q4778q3920q1086p7141p2795o8670
62009C837926o5049o1505n7260n2199m7015m2099l6997l1416k6056k1794j8622
61998C377914j6188j4822j5217j7531k1624k7599l5144m2774m8916n3417n7004
61987C027678n9602o0375n9290n7273n4854n1884m8653m5950m3754m1150l7989
61976B466904l5446l4407l4322l4211l3824l3303l2558l1761l1545l2052l2463
$$ plain form
61965 2101012 2068910 2037574 2006848 1976750 1947498 1918746 1889730 1860613 1832874 1807836 1785361
61954 1785361 1764515 1745014 1727436 1712413 1700297 1691402 1685885 1683340 1683093 1685047 1689870 1698211 1710064
61941 1710064 1725004 1742625 1762471 1783848 1806184 1829521 1854291 1880638 1908255 1936863 1966411
61930 1966411 1996662 2027022 2057085 2087015 2117083 2147233 2177706 2209918 2246080 2287893 2336228
61919 2336228 2392221 2458127 2536747 2630499 2741468 2872107 3025352 3204073 3410670 3647272
61909 3647272 3916201 4220296 4562885 4947239 5375680 5848751 6364443 6917024 7495348
61900 7495348 8081279 8649034 9166059 9595954 9903619 10061562 10055264 9885931 9570005 9135609
61890 9135609 8616797 8047619 7458122 6872702 6309557 5780435 5291211 4843592 4437075
$$ packed form
61965B101012l2102l1336l0726l0098k9252k8752k9016k9117k7739k5038k2475
61954A785361k0846j9501j7578j5023j2116q895n517k545k47J954M823Q341J1853
61941A710064J4940J7621J9846K1377K2336K3337K4770K6347K7617K8608K9548
61930A966411L0251L0360L0063K9930L0068L0150L0473L2212L6162M1813M8335
61919B336228N5993O5906P8620R3752J10969J30639J53245J78721K06597K36602
61909C647272K68929L04095L42589L84354M28441M73071N15692N52581N78324
61900G495348N85931N67755N17025M29895L07665J57943o298j69333l15926m34396
61890I135609n18812n69178n89497n85420n63145n29122m89224m47619m06517
$$ plain form
61881 4437075 4070230 3741216 3447814 3187125 2955503 2749335 2566084 2404190 2261872
61872 2261872 2136536 2025583 1927316 1840714 1764784 1698607 1641651 1593426 1552946 1518987 1490811
61861 1490811 1468355 1451895 1441878 1438901 1443309 1454654 1471817 1493765 1520015 1550308 1584003 1619921
61849 1619921 1656772 1693677 1730077 1765017 1796687 1823010 1842670 1855370 1861328 1861163 1856374 1849262
61837 1849262 1841862 1835123 1829280 1824657 1821928 1822010 1825923 1834219 1846123 1859585 1872583 1884068 1893266
61824 1893266 1898646 1898301 1891210 1877479 1857531 1831737 1800913 1766545 1730262 1693454 1657541 1624188
61812 1624188 1594898 1570495 1551221 1537271 1529055 1526855 1530331 1538607 1551073 1568018 1590220 1617999
61800 1617999 1651072 1689396 1733621 1784447 1841935 1905869 1976559 2054939 2142068 2238874 2346277
$$ packed form
61881D437075l66845l29014k93402k60689k31622k06168j83251j61894j42318
61872B261872j25336j10953r8267q6602p5930o6177n6956m8225m0480l3959k8176
61861A490811k2456j6460j0017k977M408J1345J7163K1948K6250L0293L3695L5918
61849A619921L6851L6905L6400L4940L1670K6323J9660J2700N958j65m789p112
61837A849262p400o739n843m623k729Q2L913Q296J1904J3462J2998J1485R198
61824A893266N380l45p091j3731j9948k5794l0824l4368l6283l6808l5913l3353
61812A624188k9290k4403j9274j3950q216k200L476Q276J2466J6945K2202K7779
61800A617999L3073L8324M4225N0826N7488O3934P0690P8380Q7129R6806J07403
$$ plain form
61789 2346277 2465361 2597689 2745713 2912720 3102040 3316565 3559374 3834715 4148093
61780 4148093 4505619 4913704 5379295 5909911 6513168 7195972 7963378 8816952 9752862
61771 9752862 10759904 11817195 12891763 13937316 14895758 15702147 16293082 16617553 16647370
61762 16647370 16382877 15851540 15101039 14190308 13180685 12128271 11078896 10066678 9114990
61753 9114990 8237906 7441710 6727109 6091545 5530278 5036483 4602023 4219132 3881434
61744 3881434 3583540 3320362 3087299 2880711 2697701 2535473 2391175 2262413 2147638
61735 2147638 2045866 1956018 1876645 1806337 1744191 1689602 1641606 1598655 1559047 1521357 1484462
61724 1484462 1447573 1410396 1372926 1334938 1295991 1256156 1216364 1177800 1141246 1107199 1076119
$$ packed form
61789B346277J19084J32328J48024J67007J89320K14525K42809K75341L13378
61780D148093L57526M08085M65591N30616O03257O82804P67406Q53574R35910
61771I752862J007042J057291J074568J045553R58442Q06389N90935L24471K9817
61762A6647370k64493n31337p50501r10731j009623j052414j049375j012218r51688
61753I114990q77084p96196p14601o35564n61267m93795m34460l82891l37698
61744C881434k97894k63178k33063k06588j83010j62228j44298j28762j14775
61735B147638j01772q9848p9373p0308o2146n4589m7996m2951l9608l7690l6895
61724A484462l6889l7177l7470l7988l8947l9835l9792l8564l6554l4047l1080
$$ plain form
61713 1076119 1048120 1022765 999665 979099 961621 947156 934808 923406 912012 900147 887929
61702 887929 875883 864357 853285 842652 832838 824153 816337 808836 801320 793613 785455 776717 767619
61689 767619 758416 749142 739923 731054 722400 713259 703295 693177 683697 674775 665959 657436 649729 642796
61675 642796 636228 630086 624660 619615 614285 608711 603590 599282 595638 592660 590453 588556 586350 584224
61661 584224 583421 584495 586722 589225 591895 594936 598306 601997 606256 611201 616711 622857 629815 637207
61647 637207 644232 650626 656837 663050 668802 673835 678556 683263 687638 691434 695009 698774 702783 707319
61633 707319 713186 720793 729577 738830 748460 758248 766985 773174 776118 775540 770663 760800 746739 730534
61619 730534 713756 696718 679526 662966 647845 634085 621150 609145 598942 591135 585288 580381
$$ packed form
61713A076119k7999k5355k3100k0566j7478j4465j2348j1402j1394j1865j2218
61702H87929j2046j1526j1072j0633r814q685p816p501p516p707q158q738r098
61689G67619r203r274r219q869q654r141r964j0118r480q922q816q523p707o933
61675F42796o568o142n426n045n330n574n121m308l644k978k207j897k206k126
61661E84224q03J074K227K503K670L041L370L691M259M945N510O146O958P392
61647F37207P025O394O211O213N752N033M721M707M375L796L575L765M009M536
61633G07319N867P607Q784R253R630R788Q737O189K944n78m877r863j4061j6205
61619G30534j6778j7038j7192j6560j5121j3760j2935j2005j0203p807n847m907
$$ plain form
61607 580381 575822 571774 568575 566171 564323 563072 562650 562938 563401 563626 563717 564115 565274 567521 570944 575370
61591 575370 580580 586474 592820 599068 604943 611031 618182 626242 634047 640827 646984 653263 659879 666960
61577 666960 675160 685104 696541 708759 721670 735874 751693 768661 786058 803484 820816 837926
61565 837926 854710 871332 888243 905839 923978 941985 959365 976425 993840 1011609 1028922
61554 1028922 1045150 1060430 1074985 1088381 1099890 1109229 1116437 1121274 1123318 1122493 1119033 1112968 1104092
61541 1104092 1092475 1078675 1063385 1047210 1030847 1015183 1001003 988588 977640 967671 958630 951227
61529 951227 946411 944471 944894 947301 952147 960123 971184 984731 1000790 1020466 1045043 1074996 1110206
61516 1110206 1150938 1198153 1252781 1315053 1384965 1463399 1552388 1653908 1768581 1895916 2035744
$$ packed form
61607E80381m559m048l199k404j848j251m22K88M63K25R1L98J159K247L423M426
61591E75370N210N894O346O248N875O088P151Q060P805O780O157O279O616P081
61577F66960Q200R944J1437J2218J2911J4204J5819J6968J7397J7426J7332J7110
61565H37926J6784J6622J6911J7596J8139J8007J7380J7060J7415J7769J7313
61554A028922J6228J5280J4555J3396J1509R339P208M837K044q25l460o065q876
61541A104092j1617j3800j5290j6175j6363j5664j4180j2415j0948r969r041p403
61529I51227m816j940M23K407M846P976J1061J3547J6059J9676K4577K9953L5210
61516A110206M0732M7215N4628O2272O9912P8434Q8989J01520J14673J27335J39828
$$ plain form
61505 2035744 2188892 2356178 2537008 2729115 2929084 3132370 3332556 3521089 3688404
61496 3688404 3825850 3927062 3988224 4007894 3987216 3930218 3843106 3732513 3604242 3463648
61486 3463648 3316611 3169273 3026552 2891277 2764859 2648410 2542972 2449068 2366538 2295012
61476 2295012 2234503 2185487 2148267 2122155 2105489 2096688 2095139 2100805 2113203 2131180 2153513 2179202
61464 2179202 2207294 2237007 2268097 2300561 2333813 2366618 2397920 2427245 2454314 2478985 2501897
61453 2501897 2524585 2548589 2574817 2604016 2637201 2675078 2717333 2762920 2810782 2859980 2909417
61442 2909417 2957858 3004122 3047130 3086020 3120354 3149817 3173547 3190176 3198695 3198845 3190499 3173428
61430 3173428 3148059 3115799 3077980 3035083 2987735 2937968 2888603 2841489 2797079 2755508 2717344
$$ packed form
61505B035744J53148J67286J80830J92107J99969K03286K00186J88533J67315
61496C688404J37446J01212O1162J9670k0678n6998q7112j10593j28271j40594
61486C463648j47037j47338j42721j35275j26418j16449j05438r3904q2530p1526
61476B295012o0509m9016l7220k6112j6666q801j549N666J2398J7977K2333K5689
61464B179202K8092K9713L1090L2464L3252L2805L1302K9325K7069K4671K2912
61453B501897K2688K4004K6228K9199L3185L7877M2255M5587M7862M9198M9437
61442B909417M8441M6264M3008L8890L4334K9463K3730J6629Q519J50q346j7071
61430C173428k5369l2260l7819m2897m7348m9767m9365m7114m4410m1571l8164
$$ plain form
61419 2717344 2683313 2654058 2630288 2612498 2600358 2592904 2589476 2590040 2594469 2602019 2611694 2622663 2633958
61406 2633958 2644101 2651507 2655207 2655002 2651099 2643945 2634394 2623697 2613059 2603396 2595819 2592313 2595485
61393 2595485 2607403 2628997 2660868 2704335 2761144 2832481 2919019 3021821 3142311 3281195 3438084
61382 3438084 3612251 3802760 4007318 4221745 4440918 4659306 4869944 5063909 5232140
61373 5232140 5367674 5465721 5522779 5537424 5511904 5451496 5361714 5246595 5109406 4953620
61363 4953620 4782757 4600254 4410073 4216802 4024602 3836462 3654645 3481162 3317313
61354 3317313 3163402 3019587 2886668 2765512 2655927 2556710 2466774 2385754 2313556 2249787
61344 2249787 2193908 2145770 2105767 2074371 2051562 2036789 2029514 2029644 2037283 2052169 2073568 2100625
$$ packed form
61419B717344l4031k9255k3770j7790j2140p454l428N64M429P550R675J0969J1295
61406B633958J0143P406L700k05l903p154r551j0697j0638r663p577l506L172
61393B595485J1918K1594L1871M3467N6809P1337Q6538J02802J20490J38884J56889
61382C438084J74167J90509K04558K14427K19173K18388K10638J93965J68231
61373E232140J35534R8047N7058J4645k5520o0408q9782j15119j37189j55786
61363D953620j70863j82503j90181j93271j92200j88140j81817j73483j63849
61354C317313j53911j43815j32919j21156j09585r9217q9936q1020p2198o3769
61344B249787n5879m8138m0003l1396k2809j4773p275J30P639J4886K1399K7057
$$ plain form
61332 2100625 2132529 2168365 2207031 2247294 2287697 2326421 2361618 2392102 2417636 2438520 2455035
61321 2455035 2467380 2475988 2481772 2486017 2489885 2493957 2498274 2502844 2507876 2513468 2519343 2525157 2530708 2535560
61307 2535560 2538775 2539467 2537396 2532470 2523953 2510917 2493478 2472768 2449450 2422947 2392599 2359030
61295 2359030 2323826 2288212 2252721 2218000 2185304 2155955 2130725 2109996 2094284 2084213 2079893
61284 2079893 2080505 2084626 2090870 2098042 2104764 2109381 2110574 2108030 2102326 2094220 2084244 2072874 2060801 2048879
61270 2048879 2037883 2028315 2020329 2013781 2008431 2004183 2001253 2000288 2002314 2008366 2019093 2034937 2056763
61257 2056763 2085987 2123883 2171086 2228012 2295367 2373653 2462213 2559104 2661813 2767649 2873390
61246 2873390 2974905 3067276 3145188 3203423 3237515 3244324 3222219 3171168 3093143 2992327 2874334
$$ packed form
61332B100625L1904L5836L8666M0263M0403L8724L5197L0484K5534K0884J6515
61321B455035J2345Q608N784M245L868M072M317M570N032N592N875N814N551M852
61307B535560L215O92k071m926q517j3036j7439k0710k3318k6503l0348l3569
61295B359030l5204l5614l5491l4721l2696k9349k5230k0729j5712j0071m320
61284B079893O12M121O244P172O722M617J193k544n704q106r976j1370j2073j1922
61270B048879j0996r568p986o548n350m248k930r65K026O052J0727J5844K1826
61257B056763K9224L7896M7203N6926O7355P8286Q8560R6891J02709J05836J05741
61246B873390J01515R2371P7912N8235L4092O809k2105n1051p8025j00816j17993
$$ plain form
61235 2874334 2744900 2609185 2471872 2337234 2208826 2089282 1980353 1882831 1796545 1720949
61225 1720949 1655796 1600914 1555350 1517295 1485095 1457942 1435475 1417218 1402810 1392364 1386003
61214 1386003 1383103 1382385 1382815 1384198 1386925 1391432 1397990 1406720 1417504 1429748 1442362 1454157 1464421
61201 1464421 1473136 1480714 1487594 1494048 1500188 1506059 1511772 1517478 1522939 1527152 1528856 1527633 1524121 1518886
61187 1518886 1511523 1501292 1488239 1473078 1456308 1438285 1419980 1402723 1386895 1371689 1356543
61176 1356543 1342184 1329791 1319692 1311368 1304157 1297143 1288598 1276486 1259793 1239017 1215252 1189233
61164 1189233 1161394 1132405 1103168 1074330 1046025 1018111 990566 963618 937545 912406 888013
61153 888013 864245 841329 819777 800049 782405 767097 754545 745070 738496 734260 732032 731969 734129
$$ packed form
61235B874334j29434j35715j37313j34638j28408j19544j08929r7522q6286p5596
61225A720949o5153n4882m5564l8055l2200k7153k2467j8257j4408j0446o361
61214A386003k900p18M30J383K727M507O558Q730J0784J2244J2614J1795J0264
61201A464421Q715P578O880O454O140N871N713N706N461M213J704j223l512n235
61187A518886p363j0231j3053j5161j6770j8023j8305j7257j5828j5206j5146
61176A356543j4359j2393j0099q324p211p014q545j2112j6693k0776k3765k6019
61164A189233k7839k8989k9237k8838k8305k7914k7545k6948k6073k5139k4393
61153H88013k3768k2916k1552j9728j7644j5308j2552r475o574m236k228o3K160
$$ plain form
61140 734129 737908 742571 748357 756515 767928 782062 797672 814280 832444 852676 874607 897341
61128 897341 920138 942393 963203 981322 995643 1005577 1011032 1012272 1009983 1005331 999558 993261 986249
61115 986249 978371 970393 963658 958836 955350 952127 948511 944324 939470 933917 927833 921360 914382 906763
61101 906763 898663 890355 881930 873420 864936 856385 847339 837652 827996 819331 811969 805563 799828 794764
61087 794764 790328 786522 783759 782550 782668 783157 783233 782716 781471 779026 775028 769576 762860 754891 745955
61072 745955 736956 728895 722138 716417 711311 706498 701816 697319 693116 688994 684482 679527 674760 670742
61058 670742 667209 663527 659708 656511 654558 653813 654058 655485 658553 663480 670088 678036 686986 696624 706785
61043 706785 717628 729532 742587 756228 769509 781780 792985 803202 812141 819317 824586 828155
$$ packed form
61140G34129L779M663N786Q158J1413J4134J5610J6608J8164K0232K1931K2734
61128H97341K2797K2255K0810J8119J4321R934N455J240k289m652n773o297p012
61115I86249p878p978o735m822l486l223l616m187m854n553o084o473o978p619
61101I06763q100q308q425q510q484q551r046r687r656q665p362o406n735n064
61087G94764m436l806k763j209J18M89P6n17j245k445l998n452o716p969q936
61072G45955q999q061o757n721n106m813m682m497m203m122m512m955m767m018
61058F70742l533l682l819l197j953p45K45J427L068M927O608P948Q950R638J0161
61043G06785J0843J1904J3055J3641J3281J2271J1205J0217Q939P176N269L569
$$ plain form
61031 828155 830035 829810 827185 822518 816575 809889 802601 794863 787053 779548 772523 766096 760490 755840
61017 755840 751959 748478 745230 742350 740082 738645 738329 739534 742544 747335 753640 761239 770230 781164
61003 781164 794818 811564 830911 851880 873928 897284 922288 948683 975745 1002781 1029145
60992 1029145 1053987 1076385 1095815 1112236 1125749 1136307 1143721 1147843 1148933 1147963 1146328 1145020 1144291
60979 1144291 1144269 1145481 1148485 1153426 1160386 1169757 1181724 1195782 1211430 1228982 1248892 1270459 1292117
60966 1292117 1313098 1334074 1356072 1379474 1404243 1430561 1458949 1490100 1524683 1563031 1605203
60955 1605203 1651621 1703279 1760867 1824118 1892680 1967112 2048334 2136619 2232013 2335109 2446209
60944 2446209 2564132 2687020 2813908 2944547 3078727 3217698 3365814 3529006 3711948
$$ packed form
61031H28155J880k25k625m667n943o686p288p738p810p505p025o427n606m650
61017G55840l881l481l248k880k268j437l16J205L010M791O305P599Q991J0934
61003G81164J3654J6746J9347K0969K2048K3356K5004K6395K7062K7036K6364
60992A029145K4842K2398J9430J6421J3513J0558P414M122J090r70j635j308p29
60979A144291k2J212L004M941O960R371J1967J4058J5648J7552J9910K1567K1658
60966A292117K0981K0976K1998K3402K4769K6318K8388L1151L4583L8348M2172
60955A605203M6418N1658N7588O3251O8562P4432Q1222Q8285R5394J03096J11100
60944B446209J17923J22888J26888J30639J34180J38971J48116J63192J82942
$$ plain form
60935 3711948 3918261 4152363 4418308 4717229 5049120 5417924 5833207 6308315 6860974
60926 6860974 7515793 8302149 9249703 10391464 11773025 13454612 15504476 17998036 21024152
60917 21024152 24678338 29035828 34125264 39905936 46209016 52636354 58523736 63107931
60909 63107931 65871971 66827901 66501504 65642402 64909069 64719423 65222123 66250417 67270499
60900 67270499 67485562 66159707 62977720 58171308 52338538 46137512 40078495 34478529
60892 34478529 29499417 25191154 21529207 18453120 15893968 13781157 12042311 10609960
60884 10609960 9428342 8450973 7635452 6944752 6350815 5832952 5374430 4963120 4592839
60875 4592839 4260292 3961543 3693080 3453794 3242839 3056984 2892293 2746523 2617154
$$ packed form
60935C711948K06313K34102K65945K98921L31891L68804M15283M75108N52659
60926F860974O54819P86356R47554J141761J381561J681587K049864K493560L026116
60917B1024152L654186M357490N089436N780672O303080O427338N887382M584195
60909F3107931K764040R55930l26397q59102p33333j89646N02700J028294J020082
60900F7270499K15063j325855l181987m806412n832770o201026o059017n599966
60892C4478529m979112m308263l661947l076087k559152k112811j738846j432351
60884A0609960j181618r77369q15521o90700n93937n17863m58522m11310l70281
60875D592839l32547k98749k68463k39286k10955j85855j64691j45770j29369
$$ plain form
60866 2617154 2498691 2384928 2273102 2163653 2057233 1954452 1857371 1768332 1687630 1614351
60856 1614351 1548714 1491318 1440849 1394914 1352807 1315342 1282367 1252529 1225242 1200960 1179686
60845 1179686 1160927 1144757 1131144 1118598 1105337 1091573 1078879 1067464 1055806 1042816 1028676
60834 1028676 1013596 997450 980669 964035 947601 931096 915159 900705 887347 873965 860720
60823 860720 848920 838955 829901 821131 812852 805009 797142 789461 782709 776882 771396 766526 763346 762150
60809 762150 762171 762952 764800 767903 772286 778556 787356 798025 809073 820064 831768 844492 857570
60796 857570 870506 883213 895039 904930 912784 919277 924171 926159 924687 920665 915139 908525 901415
60783 901415 894759 888841 883249 878175 874485 872154 869921 867042 864218 862223 860753 859223 857703 856428
$$ packed form
60866B617154j18463j13763j11826j09449j06420j02781r7081q9039q0702p3279
60856A614351o5637n7396n0469m5935m2107l7465l2975k9838k7287k4282k1274
60845A179686j8759j6170j3613j2546j3261j3764j2694j1415j1658j2990j4140
60834A028676j5080j6146j6781j6634j6434j6505j5937j4454j3358j3382j3245
60823H60720j1800r965r054q770q279p843p867p681o752n827n486m870l180j196
60809G62150K1P81J848L103M383O270Q800J0669J1048J0991J1704J2724J3078
60796H57570J2936J2707J1826R891P854O493M894J988j472m022n526o614p110
60783I01415o656n918n592n074l690k331k233k879k824j995j470j530j520j275
$$ plain form
60769 856428 855258 854139 853297 852518 851070 848773 846299 844030 841473 838275 834943 832000 829145 825800 821900
60754 821900 817777 813845 810733 809173 809487 811578 815418 820869 827112 833234 839425 846632 854811 862493
60740 862493 868341 872171 874094 873704 870692 865397 858205 849008 837741 824897 811143 796993 783050
60727 783050 769936 757712 745971 734733 724580 715804 708144 701552 696417 692767 690010 687735 686068
60714 686068 684929 683625 681520 678545 674852 670498 665570 660027 653383 645184 635863 626417 617329 608536
60700 608536 600303 593090 586564 579761 572434 565350 559185 554022 549929 546935 544355 541330 538168 536053
60686 536053 535209 534613 533695 533022 532957 533075 533455 535205 538948 543873 548954 554042 559199 564126 569013 574850
60670 574850 582081 589893 597500 605071 612699 619606 625267 630281 635192 639493 642839 646210 650688 655906
$$ packed form
60769H56428j170j119q42p79j448k297k474k269k557l198l332k943k855l345l900
60754H21900m123l932l112j560L14K091L840N451O243O122O191P207Q179P682
60740H62493N848L830J923l90l012n295p192r197j1267j2844j3754j4150j3943
60727G83050j3114j2224j1741j1238j0153q776p660o592n135l650k757k275j667
60714F86068j139j304k105k975l693m354m928n543o644q199r321r446r088q793
60700F08536q233p213o526o803p327p084o165n163m093k994k580l025l162k115
60686E36053q44n96r18o73o5J18L80J750L743M925N081N088N157M927M887N837
60670E74850P231P812P607P571P628O907N661N014M911M301L346L371M478N218
$$ plain form
60656 655906 660964 666206 672847 681362 691445 703123 716665 731666 747423 764122 782589 802850
60644 802850 823778 844212 863660 881810 897996 911428 921620 928491 932173 932660 929672 923195 914061
60631 914061 903454 891747 878467 863426 847120 829888 811685 793020 775064 758363 742431
60620 742431 727219 713825 702924 693542 684474 676091 669547 664846 660926 657365 654802 653852 654497 656468
60606 656468 659447 663024 667126 672340 679225 687562 696809 706915 718095 730209 743123 757393 773893
60593 773893 792891 814043 836996 861434 886875 912990 939809 967006 993391 1017812 1040255
60582 1040255 1061286 1080526 1096337 1106949 1111438 1109742 1102208 1089061 1070127 1045348 1015816 983823
60570 983823 951499 919798 889075 859998 833330 809339 787977 769184 752579 737446 723585
$$ packed form
60656F55906N058N242O641Q515J0083J1678J3542J5001J5757J6699J8467K0261
60644H02850K0928K0434J9448J8150J6186J3432J0192O871L682M87k988o477r134
60631I14061j0607j1707j3280j5041j6306j7232j8203j8665j7956j6701j5932
60620G42431j5212j3394j0901r382r068q383o544m701l920l561k563r50O45J971
60606F56468K979L577M102N214O885Q337R247J0106J1180J2114J2914J4270J6500
60593G73893J8998K1152K2953K4438K5441K6115K6819K7197K6385K4421K2443
60582A040255K1031J9240J5811J0612M489j696p534j3147j8934k4779k9532l1993
60570I83823l2324l1701l0723k9077k6668k3991k1362j8793j6605j5133j3861
$$ plain form
60559 723585 711646 702076 694350 687762 682245 677723 673434 668855 664676 661801 659888 657879 655605 653782
60545 653782 652710 652045 651696 651886 652355 652482 652350 652903 654967 658738 664188 671285 679767 689286 699838 711671
60529 711671 724937 739974 757664 778873 803752 832233 865075 903638 948768 1000627 1059696
60518 1059696 1127293 1204928 1293555 1393444 1504215 1624749 1752955 1885110 2015040 2134537
60508 2134537 2235613 2312700 2362830 2384701 2378948 2349455 2303478 2249862 2196882 2151051 2116724
60497 2116724 2096145 2089790 2096553 2113458 2135721 2157891 2175319 2184726 2184057 2172583 2151181 2122146
60485 2122146 2088655 2054400 2023136 1997894 1980592 1972611 1975496 1990966 2020621 2065968 2128381 2208748
60473 2208748 2307512 2425125 2561787 2716171 2884904 3063847 3249825 3441354 3638986 3846096
$$ packed form
60559G23585j1939r570p726o588n517m522m289m579m179k875j913k009k274j823
60545F53782j072o65l49J90M69J27j32N53K064L771N450P097Q482R519J0552J1833
60529G11671J3266J5037J7690K1209K4879K8481L2842L8563M5130N1859N9069
60518A059696O7597P7635Q8627R9889J10771J20534J28206J32155J29930J19497
60508B134537J01076P7087N0130K1871n753k9493m5977n3616n2980m5831l4327
60497B116724k0579o355O763J6905K2263K2170J7428R407o69j1474k1402k9035
60485B122146l3491l4255l1264k5242j7302p981K885J5470K9655M5347O2413Q0367
60473B208748R8764J17613J36662J54384J68733J78943J85978J91529J97632K07110
$$ plain form
60463 3846096 4069356 4318240 4604507 4942096 5346009 5829702 6402885 7070842 7833277
60454 7833277 8680917 9591458 10527425 11436731 12256339 12920399 13371580 13570419 13499228 13162821
60444 13162821 12588992 11826429 10936606 9982056 9017262 8084615 7213175 6418959 5707649
60435 5707649 5078884 4529288 4053241 3643168 3290517 2986934 2725202 2499823 2306486
60426 2306486 2140608 1996970 1871335 1761628 1666589 1584006 1511279 1446909 1390055 1339134
60416 1339134 1292381 1249469 1211049 1176724 1144817 1114162 1084858 1057225 1031313 1007549 986609
60405 986609 968303 951556 935784 921370 908653 897335 887079 877888 869745 862484 856045 850285
60393 850285 844761 839344 834587 830607 826081 819414 810520 800360 789295 777233 764977 753676 743072
$$ packed form
60463C846096K23260K48884K86267L37589M03913M83693N73183O67957P62435
60454G833277Q47640R10541R35967R09306Q19608O64060M51181J98839p1191l36407
60444A3162821n73829p62563q89823r54550r64794r32647q71440p94216p11310
60435E707649o28765n49596m76047m10073l52651l03583k61732k25379j93337
60426B306486j65878j43638j25635j09707r5039q2583p2727o4370n6854n0921
60416A339134m6753m2912l8420l4325l1907l0655k9304k7633k5912k3764k0940
60405I86609j8306j6747j5772j4414j2717j1318j0256r191q143p261o439n760
60393H50285n524n417m757l980m526o667q894j0160j1065j2062j2256j1301j0604
$$ plain form
60380 743072 731903 720121 709125 699636 691020 682969 676222 671014 666347 661519 657127 653887 651578
60367 651578 649757 648350 646973 644753 641564 638462 636353 635118 634475 634611 635411 636143 636560 637273 638457 639238
60351 639238 639070 638662 638714 638761 638203 637617 637983 639241 640633 642062 644179 647377 651383 655669 659788 663507
60335 663507 666992 670583 674194 677385 680162 683148 686724 690638 694651 698848 703075 706899 710563 715172
60321 715172 721478 729150 737624 746903 756970 767262 777416 788015 799968 813659 829241 847171
60309 847171 867799 890797 915529 941522 968019 993380 1015512 1032771 1044184 1049068 1046787 1036835
60297 1036835 1019290 995624 968958 942763 919011 897927 879415 863976 852192 844248 840222 840097
60285 840097 843242 848665 856065 865935 878345 892324 906689 920630 933211 943214 949957 953660 954717
$$ packed form
60380G43072j1169j1782j0996r489q616q051o747n208m667m828m392l240k309
60367F51578j821j407j377k220l189l102k109j235o43J36Q00P32M17P13J184P81
60351F39238j68m08N2M7n58n86L66J258J392J429K117L198M006M286M119L719
60335F63507L485L591L611L191K777K986L576L914M013M197M227L824L664M609
60321G15172O306P672Q474R279J0067J0292J0154J0599J1953J3691J5582J7930
60309H47171K0628K2998K4732K5993K6497K5361K2132J7259J1413M884k281r952
60297A036835j7545k3666k6666k6195k3752k1084j8512j5439j1784p944m026j25
60285H40097L145N423P400R870J2410J3979J4365J3941J2581J0003O743L703J057
$$ plain form
60272 954717 953428 950758 948438 947771 949001 952205 957960 966760 978584 993571 1012294 1034879 1060660
60259 1060660 1089336 1121754 1159036 1201625 1249662 1303568 1363604 1429444 1500696 1577371 1659516
60248 1659516 1747016 1839856 1937689 2038762 2140172 2239560 2335688 2427083 2511401 2586741 2652376
60237 2652376 2707373 2749718 2777853 2792161 2793853 2783210 2760140 2725873 2682956 2633932 2580978
60226 2580978 2526437 2472785 2422262 2377066 2339401 2310596 2290736 2279847 2278874 2288842 2309706 2340933
60214 2340933 2382600 2434943 2497310 2568541 2648071 2735639 2829948 2928292 3027351 3123790 3214443
60203 3214443 3296686 3368563 3428286 3473982 3504383 3519273 3518849 3503129 3472404 3427726 3370517 3302469
60191 3302469 3226296 3145759 3064185 2983693 2906466 2835807 2774854 2724937 2686186 2659159 2644821
$$ packed form
60272I54717j289k670k320o67J230L204N755Q800J1824J4987J8723K2585K5781
60259A060660K8676L2418L7282M2589M8037N3906O0036O5840P1252P6675Q2145
60248A659516Q7500R2840R7833J01073J01410R9388R6128R1395Q4318P5340O5635
60237B652376N4997M2345K8135J4308J692j0643k3070l4267m2917m9024n2954
60226B580978n4541n3652n0523m5196l7665k8805j9860j0889r73R968K0864L1227
60214B340933M1667N2343O2367P1231P9530Q7568R4309R8344R9059R6439R0653
60203C214443Q2243P1877N9723M5696L0401J4890m24j5720l0725m4678n7209o8048
60191C302469p6173q0537q1574q0492p7227p0659o0953m9917l8751k7027j4338
$$ plain form
60180 2644821 2643450 2654515 2677258 2710492 2752333 2801073 2855908 2915930 2978947 3042289 3104238
60169 3104238 3163641 3218712 3267439 3308852 3342733 3368474 3385542 3395032 3399551 3401568 3402834 3405240
60157 3405240 3411059 3422174 3440034 3466353 3502740 3549428 3605152 3668385 3737785 3811419 3886728
60146 3886728 3961955 4037285 4114492 4196190 4285648 4386647 4502861 4637319 4792229 4968703
60136 4968703 5166340 5383175 5616103 5861396 6115135 6373372 6631643 6884294 7124948
60127 7124948 7348071 7549638 7726035 7873107 7986953 8065085 8106184 8109294 8073936 8000431
60117 8000431 7889426 7741860 7560428 7350627 7119433 6873402 6618992 6363925 6116637
60108 6116637 5884191 5671733 5483740 5324443 5196569 5100537 5035175 4998668 4988847 5003442
$$ packed form
60180B644821j371J1065K2743L3234M1841M8740N4835O0022O3017O3342O1949
60169C104238N9403N5071M8727M1413L3881K5741J7068R490M519K017J266K406
60157C405240N819J1115J7860K6319L6387M6688N5724O3233O9400P3634P5309
60146C886728P5227P5330P7207Q1698Q9458J00999J16214J34458J54910J76474
60136D968703J97637K16835K32928K45293K53739K58237K58271K52651K40654
60127G124948K23123K01567J76397J47072J13846P8132M1099L110l5358p3505
60117H000431j11005j47566j81432k09801k31194k46031k54410k55067k47288
60108F116637k32446k12458j87993j59297j27874r6032o5362l6507r821J4595
$$ plain form
60098 5003442 5040469 5098078 5174063 5265890 5370960 5486237 5607657 5730285 5848752 5957266
60088 5957266 6049926 6122000 6170783 6194743 6192463 6163307 6108703 6031772 5935885 5824195 5699964
60077 5699964 5566165 5425010 5278856 5131348 4986644 4847766 4716768 4596318 4489892
60068 4489892 4400378 4329478 4278409 4248011 4238010 4247054 4273457 4314972 4367880 4427514 4490045
60057 4490045 4553084 4614747 4673276 4727877 4779032 4827785 4875373 4923281 4972288 5021004 5066268
60046 5066268 5105222 5136199 5157431 5166065 5159035 5134188 5090217 5026387 4943006 4841822 4725612
60035 4725612 4597800 4462495 4324195 4187003 4054346 3929227 3814064 3710217 3618314 3539057
60025 3539057 3473102 3420304 3380045 3352434 3338305 3337825 3350003 3373957 3409941 3458763 3520817 3596071
$$ packed form
60098E003442L7027N7609P5985R1827J05070J15277J21420J22628J18467J08514
60088E957266R2660P2074M8783K3960k280k9156n4604p6931r5887j11690j24231
60077E699964j33799j41155j46154j47508j44704j38878j30998j20450j06426
60068D489892q9514p0900n1069l0398j0001R044K6403M1515N2908N9634O2531
60057D490045O3039O1663N8529N4601N1155M8753M7588M7908M9007M8716M5264
60046E066268L8954L0977K1232Q634p030k4847m3971o3830q3381j01184j16210
60035D725612j27812j35305j38300j37192j32657j25119j15163j03847r1903p9257
60025C539057o5955n2798m0259k7611j4129m80J2178K3954L5984M8822O2054P5254
$$ plain form
60013 3596071 3684411 3785428 3898020 4020227 4149099 4280655 4410341 4533656 4646277 4744136
60003 4744136 4824155 4884796 4925295 4944560 4941401 4915494 4867372 4797875 4708730 4603474 4486631
59992 4486631 4361914 4232256 4101553 3974977 3857149 3750916 3658209 3580861 3519917 3474954
59982 3474954 3444828 3428734 3426397 3437943 3463869 3504373 3558246 3622945 3695977 3775604 3860009
59971 3860009 3946555 4032303 4114743 4191743 4261325 4321816 4371904 4410647 4437991 4455246 4464164
59960 4464164 4465447 4458935 4445432 4427539 4408463 4390843 4377065 4369889 4372181 4386616 4416042 4463711
59948 4463711 4532782 4625867 4745033 4891685 5066439 5269709 5502463 5765587 6058285 6377529
59938 6377529 6718841 7076520 7442729 7807054 8157162 8479368 8758879 8981044 9133610
$$ packed form
60013C596071Q8340J01017J12592J22207J28872J31556J29686J23315J12621R7859
60003D744136Q0019O0641M0499J9265l159k5907m8122o9497q9145j05256j16843
59992D486631j24717j29658j30703j26576j17828j06233r2707p7348o0944m4963
59982C474954l0126j6094k337J1546K5926M0504N3873O4699P3032P9627Q4405
59971C860009Q6546Q5748Q2440P7000O9582O0491N0088L8743K7344J7255Q918
59960D464164J283o512j3503j7893j9076j7620j3778p176K292J4435K9426M7669
59948D463711O9071R3085J19166J46652J74754K03270K32754K63124K92698L19244
59938F377529L41312L57679L66209L64325L50108L22206K79511K22165J52566
$$ plain form
59929 9133610 9208182 9200457 9110682 8944471 8712183 8426729 8101900 7751914 7390554 7029579
59919 7029579 6678282 6344509 6034869 5753500 5501799 5280175 5089439 4930192 4802046
59910 4802046 4704342 4636933 4599561 4591182 4610654 4657396 4730620 4828415 4948289 5087990 5244836
59899 5244836 5414370 5590240 5765163 5931461 6080912 6204836 6294801 6343705 6346868 6302570
59889 6302570 6211571 6076376 5901388 5693411 5460902 5212253 4954984 4696176 4442380 4198690
59879 4198690 3968535 3754546 3558838 3382312 3224645 3085379 2964299 2860615 2772774 2699454
59869 2699454 2639820 2592440 2554882 2524819 2500545 2480020 2460559 2440216 2418623 2395844 2371423
59858 2371423 2345405 2319307 2295014 2273274 2254125 2238133 2226179 2218462 2214639 2214597 2218169 2224203 2230586
$$ packed form
59929I133610P4572p725q9775j66211k32288k85454l24829l49986l61360l60975
59919G029579l51297l33773l09640k81369k51701k21624j90736j59247j28146
59910D802046r7704o7409l7372q379J9472M6742P3224R7795J19874J39701J56846
59899E244836J69534J75870J74923J66298J49451J23924Q9965M8904L163m4298
59889F302570r0999j35195j74988k07977k32509k48649k57269k58808k53796k43690
59879D198690k30155k13989j95708j76526j57667j39266j21080j03684q7841p3320
59869B699454n9634m7380l7558l0063k4274k0525j9461k0343k1593k2779k4421
59858B371423k6018k6098k4293k1740j9149j5992j1954p717l823m2L572O034O383
$$ plain form
59845 2230586 2235130 2236002 2231581 2220489 2201771 2174933 2140199 2098965 2053506 2006015 1958362 1912796
59833 1912796 1871892 1837192 1808550 1785277 1767284 1754688 1747192 1744699 1748012 1758150 1775285 1798784
59821 1798784 1827818 1861451 1898699 1939141 1983071 2030513 2080419 2131070 2180669 2227154 2268188
59810 2268188 2302017 2327960 2345800 2355354 2357120 2352623 2343575 2331357 2317673 2304792 2294428 2287259
59798 2287259 2284284 2287748 2299721 2320627 2350373 2390460 2443738 2512462 2597863 2701577 2826316
59787 2826316 2974853 3149152 3350656 3580627 3839542 4125950 4435368 4759238 5084148
59778 5084148 5391757 5659893 5865435 5989160 6020872 5961770 5822989 5622226 5380443 5118833
59768 5118833 4855881 4605598 4377406 4176707 4005441 3863028 3747430 3655233 3581431 3520957
$$ packed form
59845B230586M544Q72m421j1092j8718k6838l4734m1234m5459m7491m7653m5566
59833A912796m0904l4700k8642k3273j7993j2596p496k493L313J0138J7135K3499
59821A798784K9034L3633L7248M0442M3930M7442M9906N0651M9599M6485M1034
59810B268188L3829K5943J7840R554J766m497r048j2218j3684j2881j0364p169
59798B287259k975L464J1973K0906K9746M0087N3278O8724Q5401J03714J24739
59787B826316J48537J74299K01504K29971K58915K86408L09418L23870L24910
59778E084148L07609K68136K05542J23725L1712n9102j38781k00763k41783k61610
59768E118833k62952k50283k28192k00699j71266j42413j15598r2197p3802o0474
$$ plain form
59758 3520957 3471400 3433578 3409093 3398310 3401022 3417468 3447246 3487823 3535299 3586577 3640556
59747 3640556 3698277 3762701 3837629 3925852 4028783 4148174 4287029 4447868 4631127 4836472
59737 4836472 5064896 5318409 5598515 5906311 6243328 6610491 7006235 7426678 7867236
59728 7867236 8322605 8785222 9245119 9691716 10115370 10507926 10863702 11180984 11462495
59719 11462495 11714642 11946934 12171612 12402300 12651930 12931549 13250124 13614186 14027057
59710 14027057 14488356 14993725 15534424 16097469 16666667 17223385 17746489 18213312 18602984
59701 18602984 18899982 19095166 19185162 19172604 19067011 18884141 18643709 18367207 18076279 17791021
59691 17791021 17528845 17304782 17132039 17021311 16980026 17013405 17126395 17324113 17611018 17990730
$$ packed form
59758C520957m9557l7822k4485j0783K712J6446K9778M0577M7476N1278N3979
59747C640556N7721O4424P4928Q8223J02931J19391J38855J60839J83259K05345
59737D836472K28424K53513K80106L07796L37017L67163L95744M20443M40558
59728G867236M55369M62617M59897M46597M23654L92556L55776L17282K81511
59719A1462495K52147K32292K24678K30688K49630K79619L18575L64062M12871
59710A4027057M61299N05369N40699N63045N69198N56718N23104M66823L89672
59701A8602984K96998J95184Q9996j2558j05593j82870k40432k76502k90928k85258
59691A7791021k62176k24063j72743j10728m1285L3379J12990J97718K86905L79712
$$ plain form
59681 17990730 18466296 19039252 19707758 20465543 21301435 22197909 23129120 24060423 24949699
59672 24949699 25749371 26409405 26882516 27130708 27130653 26876928 26383299 25681312 24815365 23835966
59662 23835966 22794030 21736856 20704746 19728496 18828655 18015666 17289368 16638618 16043052
59653 16043052 15476885 14913249 14328808 13708697 13049637 12358856 11649948 10939015 10242139
59644 10242139 9573067 8941302 8352146 7808200 7310277 6857357 6447040 6076670 5743787
59635 5743787 5445680 5179141 4940694 4726805 4534406 4361872 4209064 4075613 3959513
59626 3959513 3858053 3769632 3693670 3629265 3575120 3530537 3495155 3467502 3444741 3423956 3402927
59615 3402927 3379713 3352416 3319541 3280014 3232926 3177914 3115641 3047278 2973839 2896756 2818560
$$ packed form
59681A7990730M75566N72956O68506P57785Q35892Q96474R31211R31303Q89276
59672B4949699P99672O60034M73111K48192n5k53725m93629p01987q65947r79399
59662B3835966j041936j057174j032110r76250q99841q12989p26298o50750n95566
59653A6043052n66167n63636n84441o20111o59060o90781p08908p10933o96876
59644A0242139o69072o31765n89156n43946m97923m52920m10317l70370l32883
59635E743787k98107k66539k38447k13889j92399j72534j52808j33451j16100
59626C959513j01460q8421p5962o4405n4145m4583l5382k7653k2761k0785k1029
59615C402927k3214k7297l2875l9527m7088n5012o2273o8363p3439p7083p8196
$$ plain form
59604 2818560 2741888 2667993 2597217 2530633 2469933 2415769 2367471 2324602 2287665 2257062 2232361
59593 2232361 2212987 2198775 2189507 2184606 2183572 2186108 2191634 2199227 2208180 2218109 2228553 2239057 2249571
59580 2249571 2260154 2270315 2279355 2287354 2295251 2304045 2314468 2327281 2343200 2362606 2385897 2413929
59568 2413929 2447568 2487136 2532916 2585826 2646819 2716012 2793271 2879352 2975595 3082818 3201440
59557 3201440 3332442 3477265 3636910 3811895 4002682 4209238 4430515 4665269 4912939
59548 4912939 5172684 5442013 5717490 5996313 6276036 6553381 6825004 7089356 7346423
59539 7346423 7595880 7837002 8070266 8297401 8519656 8737326 8950778 9160039 9362846
59530 9362846 9554290 9728334 9877891 9993126 10061866 10073413 10021878 9906155 9728443 9493584
$$ packed form
59604B818560p6672p3895p0776o6584o0700n4164m8298m2869l6937l0603k4701
59593B232361j9374j4212r268m901j034K536N526P593Q953R929J0444J0504J0514
59580B249571J0583J0161R040P999P897Q794J0423J2813J5919J9406K3291K8032
59568B413929L3639L9568M5780N2910O0993O9193P7259Q6081R6243J07223J18622
59557C201440J31002J44823J59645J74985J90787K06556K21277K34754K47670
59548D912939K59745K69329K75477K78823K79723K77345K71623K64352K57067
59539G346423K49457K41122K33264K27135K22255K17670K13452K09261K02807
59530I362846J91444J74044J49557J15235O8740J1547n1535j15723j77712k34859
$$ plain form
59520 9493584 9208352 8880089 8516374 8126187 7720137 7308689 6900597 6503119 6122386
59511 6122386 5762647 5425782 5112210 4821914 4554485 4309129 4085160 3882000 3698565
59502 3698565 3533345 3385294 3253897 3138338 3037323 2949778 2874893 2811511 2758392 2714978
59492 2714978 2680911 2654912 2635439 2622473 2617298 2620344 2630548 2647190 2671041 2703339 2744831 2796291
59480 2796291 2858748 2932640 3017841 3115064 3226256 3353158 3496351 3655971 3832204 4024542
59470 4024542 4231424 4450790 4679784 4913503 5145136 5367634 5574091 5756394 5905298
59461 5905298 6012993 6074829 6088315 6052087 5966996 5837222 5669251 5470310 5248128 5010925
59451 5010925 4766357 4520706 4279279 4046634 3825886 3618666 3426318 3250258 3090724
$$ packed form
59520I493584k85232l28263l63715l90187m06050m11448m08092l97478l80733
59511F122386l59739l36865l13572k90296k67429k45356k23969k03160j83435
59502C698565j65220j48051j31397j15559j01015q7545p4885o3382n3119m3414
59492B714978l4067k5999j9473j2966n175L046J0204J6642K3851L2298M1492N1460
59480B796291O2457P3892Q5201R7223J11192J26902J43193J59620J76233J92338
59470D024542K06882K19366K28994K33719K31633K22498K06457J82303J48904
59461E905298J07695O1836J3486l6228q5091j29774j67971j98941k22182k37203
59451E010925k44568k45651k41427k32645k20748k07220j92348j76060j59534
$$ plain form
59442 3090724 2946238 2815067 2696523 2590429 2496236 2413273 2341016 2278542 2224388 2177373
59432 2177373 2136894 2102332 2073127 2049591 2032508 2021587 2015433 2013253 2015339 2021497 2030390 2040942
59420 2040942 2053136 2066877 2081438 2096646 2113423 2132495 2153793 2177660 2205367 2237908 2275640
59409 2275640 2319619 2371764 2433053 2503173 2582565 2672747 2773436 2881330 2993551 3111280
59399 3111280 3238841 3380827 3541664 3726434 3939894 4185105 4464293 4779812 5132299
59390 5132299 5518229 5930828 6363084 6808895 7262158 7716242 8163914 8596669 9004870
59381 9004870 9380066 9717151 10013760 10268740 10482543 10658084 10799370 10909329 10989766 11042280
59371 11042280 11067382 11062928 11024827 10949181 10832860 10672965 10467901 10219633 9934288 9620949
$$ packed form
59442C090724j44486j31171j18544j06094r4193q2963p2257o2474n4154m7015
59432B177373m0479l4562k9205k3536j7083j0921o154k180K086O158Q893J0552
59420B040942J2194J3741J4561J5208J6777J9072K1298K3867K7707L2541L7732
59409B275640M3979N2145O1289P0120P9392R0182J00689J07894J12221J17729
59399C111280J27561J41986J60837J84770K13460K45211K79188L15519L52487
59390E132299L85930M12599M32256M45811M53263M54084M47672M32755M08201
59381I004870L75196L37085K96609K54980K13803J75541J41286J09959Q0437N2514
59371A1042280K5102m454l8101p5646j16321j59895k05064k48268k85345l13339
$$ plain form
59361 9620949 9290803 8956764 8632081 8328511 8055806 7821946 7632321 7488472 7388263
59352 7388263 7327051 7298217 7293365 7303305 7318909 7330787 7329304 7306456 7257790 7181990 7079415 6952152
59340 6952152 6804869 6644119 6476617 6308602 6146136 5994664 5858227 5739656 5641064 5563423
59330 5563423 5506253 5468522 5449240 5446360 5455885 5473189 5494713 5517331 5536799 5548151 5547473 5532339
59318 5532339 5501070 5452790 5387984 5308073 5214738 5110339 4998299 4881913 4763305 4644439
59308 4644439 4528392 4418330 4315843 4221542 4136713 4062875 4000188 3947851 3905902 3875171 3855602
59297 3855602 3846060 3845842 3855021 3873281 3899794 3934551 3978645 4032964 4097557 4172523 4258615 4356702
59285 4356702 4467446 4591754 4730878 4885816 5056912 5243852 5445354 5658832 5880728
$$ packed form
59361I620949l30146l34039l24683l03570k72705k33860j89625j43849j00209
59352G388263o1212k8834m852R940J5604J1878j483k2848m8666p5800j02575j27263
59340F952152j47283j60750j67502j68015j62466j51472j36437j18571r8592p7641
59330E563423n7170l7731j9282k880R525J7304K1524K2618J9468J1352o78j5134
59318E532339l1269m8280o4806p9911r3335j04399j12040j16386j18608j18866
59308D644439j16047j10062j02487r4301q4829p3838o2687n2337m1949l0731j9569
59297C855602r542k18R179J8260K6513L4757M4094N4319O4593P4966Q6092R8087
59285D356702J10744J24308J39124J54938J71096J86940K01502K13478K21896
$$ plain form
59276 5880728 6106895 6332217 6550309 6754196 6936947 7091320 7209735 7285815 7315783 7298012
59266 7298012 7232271 7120581 6968113 6781790 6568224 6333909 6086661 5835060 5586219 5345019
59256 5345019 5115258 4900236 4702133 4521966 4360496 4218555 4096591 3994759 3913571 3853865
59246 3853865 3816278 3801279 3809505 3841523 3897747 3979243 4088113 4226298 4394487 4592867 4822088
59235 4822088 5082268 5371317 5685055 6018082 6363021 6709078 7042620 7349416 7615993
59226 7615993 7830037 7981422 8063341 8072025 8006037 7867201 7662016 7400982 7096389 6761195
59216 6761195 6409010 6053217 5705399 5374829 5068810 4792345 4547430 4333184 4146024
59207 4146024 3979237 3823977 3673064 3524399 3380331 3244600 3120862 3012764 2922929 2851468
$$ packed form
59276E880728K26167K25322K18092K03887J82751J54373J18415P6080K9968j7771
59266G298012o5741j11690j52468j86323k13566k34315k47248k51601k48841k41200
59256E345019k29761k15022j98103j80167j61470j41941j21964j01832q1188n9706
59246C853865l7587j4999Q226L2018N6224Q1496J08870J38185J68189J98380K29221
59235D822088K60180K89049L13738L33027L44939L46057L33542L06796K66577
59226G615993K14044J51385Q1919Q684o5988j38836k05185k61034l04593l35194
59216F761195l52185l55793l47818l30570l06019k76465k44915k14246j87160
59207D146024j66787j55260j50913j48665j44068j35731j23738j08098q9835p1461
$$ plain form
59197 2851468 2796749 2757422 2732427 2719481 2715367 2717932 2726493 2740227 2757490 2776913 2798032 2820706
59185 2820706 2844920 2871157 2900098 2932028 2967396 3007551 3053967 3107155 3167378 3235789 3313468
59174 3313468 3399722 3492684 3591168 3694465 3800745 3907316 4012194 4113700 4208559 4292111
59164 4292111 4360694 4412535 4446493 4461492 4457393 4435037 4395306 4339445 4270248 4191530 4106307
59153 4106307 4016764 3925821 3837095 3753108 3674897 3603418 3539895 3484715 3437554 3398890 3370008
59142 3370008 3351281 3341761 3340652 3347913 3363318 3386384 3417440 3457433 3506393 3563388 3628247 3702199
59130 3702199 3786797 3883488 3994293 4121486 4266421 4429818 4613088 4817850 5044128 5290362
59120 5290362 5554974 5836006 6129017 6427179 6723805 7012964 7286941 7534760 7744111
$$ packed form
59197B851468n4719l9327k4995j2946m114K565Q561J3734J7263J9423K1119K2674
59185B820706K4214K6237K8941L1930L5368M0155M6416N3188O0223O8411P7679
59174C313468Q6254R2962R8484J03297J06280J06571J04878J01506R4859Q3552
59164D292111O8583N1841L3958J4999m099k2356l9731n5861o9197p8718q5223
59153D106307q9543r0943q8726q3987p8211p1479o3523n5180m7161l8664k8882
59142C370008j8727r520j109P261J5405K3066L1056L9993M8960N6995O4859P3952
59130C702199Q4598R6691J10805J27193J44935J63397J83270K04762K26278K46234
59120E290362K64612K81032K93011K98162K96626K89159K73977K47819K09351
$$ plain form
59111 7744111 7903793 8004199 8037459 7998697 7887116 7706132 7463593 7171702 6844882 6496773
59101 6496773 6139447 5784345 5441441 5116864 4812872 4530490 4270590 4032286 3812409
59092 3812409 3607601 3415713 3234894 3063140 2899655 2745260 2600639 2465298 2338750
59083 2338750 2221405 2113610 2014918 1924720 1842534 1767446 1698622 1636596 1582597 1536301 1495688
59072 1495688 1459338 1427238 1399141 1374021 1351660 1332894 1317562 1303994 1291276 1280227 1271145
59061 1271145 1262244 1251392 1238010 1222334 1204303 1184229 1163367 1142899 1123463 1106239 1092969
59050 1092969 1084096 1078346 1075010 1075175 1079754 1087735 1097339 1107496 1117215 1124988 1130141 1133630 1136440 1138339
59036 1138339 1139223 1140493 1143996 1150615 1160830 1175459 1194595 1216730 1239938 1263069 1284947 1303500
$$ packed form
59111G744111J59682J00406L3260l8762j11581j80984k42539k91891l26820l48109
59101F496773l57326l55102l42904l24577l03992k82382k59900k38304k19877
59092C812409k04808j91888j80819j71754j63485j54395j44621j35341j26548
59083B338750j17345j07795r8692r0198q2186p5088o8824o2026n3999m6296m0613
59072A495688l6350l2100k8097k5120k2361j8766j5332j3568j2718j1049r082
59061A271145q901j0852j3382j5676j8031k0074k0862k0468j9436j7224j3270
59050A092969q873n750l336J65M579P981R604J0157R719P773N153L489K810J899
59036A138339Q84J270L503O619J0215J4629J9136K2135K3208K3131K1878J8553
$$ plain form
59024 1303500 1316823 1324348 1326180 1322173 1312611 1299050 1283694 1268513 1255268 1245380 1239200 1236338 1237085
59011 1237085 1242440 1252511 1266255 1283087 1303046 1324798 1345218 1361854 1374238 1381979 1383336 1376993
58999 1376993 1363827 1345734 1324006 1299974 1275810 1253302 1232811 1214503 1199486 1188617 1181368
58988 1181368 1177005 1175830 1178188 1183361 1190576 1200145 1212618 1227765 1245272 1265368 1287895 1311890
58976 1311890 1336911 1363636 1392428 1422630 1454097 1487829 1524030 1561040 1597373 1633464 1670231
58965 1670231 1707328 1744049 1780490 1816451 1850556 1882019 1912109 1942493 1973245 2003873 2035162
58954 2035162 2068604 2105089 2145540 2191774 2245266 2306029 2373939 2450123 2535824 2631075 2735847
58943 2735847 2851342 2978793 3118173 3269531 3434479 3614882 3811274 4024146 4255755
$$ packed form
59024A303500J3323P525J832m007r562j3561j5356j5181j3245r888o180k862P47
59011A237085N355J0071J3744J6832J9959K1752K0420J6636J2384P741J357o343
58999A376993j3166j8093k1728k4032k4164k2508k0491j8308j5017j0869p249
58988A181368m363j175K358N173P215R569J2473J5147J7507K0096K2527K3995
58976A311890K5021K6725K8792L0202L1467L3732L6201L7010L6333L6091L6767
58965A670231L7097L6721L6441L5961L4105L1463L0090L0384L0752L0628L1289
58954B035162L3442L6485M0451M6234N3492O0763O7910P6184Q5701R5251J04772
58943B735847J15495J27451J39380J51358J64948J80403J96392K12872K31609
$$ plain form
58934 4255755 4509086 4786024 5088131 5418147 5779047 6172554 6600231 7065062 7570006
58925 7570006 8115403 8698919 9316822 9963140 10627851 11297235 11955203 12582739 13156933
58916 13156933 13652949 14047799 14322549 14463218 14462654 14322406 14052126 13667368 13187935 12636183
58906 12636183 12034174 11401694 10756680 10115604 9491715 8893785 8327825 7798999 7310634
58897 7310634 6862857 6454203 6083910 5751229 5453574 5187144 4948649 4734927 4541842
58888 4541842 4365335 4202906 4052587 3911398 3776474 3646912 3522862 3403733 3289021
58879 3289021 3179912 3078013 2983065 2893865 2810832 2735593 2668268 2607000 2550109 2497181 2448248
58868 2448248 2403397 2363032 2327278 2295343 2266500 2241155 2219956 2202622 2188855 2179450 2175124 2175121
$$ packed form
58934D255755K53331K76938L02107L30016L60900L93507M27677M64831N04944
58925G570006N45397N83516O17903O46318O64711O69384O57968O27536N74194
58916A3156933M96016L94850K74750J40669n64j40248k70280l84758m79433n51752
58906A2636183o02009o32480o45014o41076o23889n97930n65960n28826m88365
58897G310634m47777m08654l70293l32681k97655k66430k38495k13722j93085
58888D541842j76507j62429j50319j41189j34924j29562j24050j19129j14712
58879C289021j09109j01899r4948q9200q3033p5239o7325o1268n6891n2928m8933
58868B448248m4851m0365l5754l1935k8843k5345k1199j7334j3767r405m326l
$$ plain form
58856 2175121 2178431 2185545 2197459 2213848 2233828 2257779 2286772 2320938 2359986 2404628 2455891 2513768
58844 2513768 2578115 2650119 2731248 2821598 2920911 3030396 3151786 3285423 3431158 3590430
58834 3590430 3765599 3957889 4167868 4397423 4649484 4926351 5229989 5563304 5929336
58825 5929336 6329776 6765900 7240090 7754393 8307915 8897011 9516785 10159941 10814417
58816 10814417 11463904 12090167 12673267 13190700 13619234 13938443 14132293 14189703 14106967 13889864
58806 13889864 13551669 13109233 12581884 11991870 11362082 10712391 10059126 9416637 8796656
58797 8796656 8206510 7650224 7131076 6651207 6209638 5803302 5429948 5088154 4775400
58788 4775400 4488758 4227080 3990024 3775260 3579104 3399592 3236453 3088344 2952760
$$ packed form
58856B175121L310P114J1914J6389J9980K3951K8993L4166L9048M4642N1263N7877
58844B513768O4347P2004Q1129R0350R9313J09485J21390J33637J45735J59272
58834C590430J75169J92290K09979K29555K52061K76867L03638L33315L66032
58825E929336M00440M36124M74190N14303N53522N89096O19774O43156O54476
58816A0814417O49487O26263N83100N17433M28534L19209J93850N7410q2736k17103
58806A3889864l38195m42436n27349n90014o29788o49691o53265o42489o19981
58797H796656n90146n56286n19148m79869m41569m06336l73354l41794l12754
58788D775400k86642k61678k37056k14764j96156j79512j63139j48109j35584
$$ plain form
58779 2952760 2828579 2716129 2614636 2521999 2437112 2360050 2289874 2224475 2162612 2103810 2046326
58768 2046326 1987752 1928049 1869886 1815736 1766531 1723043 1686243 1655979 1631288 1612095 1598823
58757 1598823 1590489 1585244 1582669 1583616 1588136 1595693 1606969 1623041 1643095 1665406 1690284 1719269 1751329
58744 1751329 1782390 1808767 1828695 1840656 1843002 1835730 1820281 1797446 1767696 1733353 1697655 1661412
58732 1661412 1623110 1582406 1540881 1499227 1456493 1412571 1368785 1325562 1282084 1238664 1197062
58721 1197062 1158148 1121688 1088496 1059961 1035172 1011404 988000 967008 949573 934560 921267
58710 921267 910415 901695 893363 885272 879538 877178 876733 877125 879031 882217 884214 882945 878362 870428
58696 870428 858052 841281 822245 802671 782598 762545 744543 729734 717035 705334 695053
$$ packed form
58779B952760j24181j12450j01493r2637q4887p7062p0176o5399o1863n8802n7484
58768B046326n8574n9703n8163n4150m9205m3488l6800l0264k4691j9193j3272
58757A598823q334n245k575R47M520P557J1276J6072K0054K2311K4878K8985L2060
58744A751329L1061K6377J9928J1961K346p272j5449k2835k9750l4343l5698l6243
58732A661412l8302m0704m1525m1654m2734m3922m3786m3223m3478m3420m1602
58721A197062l8914l6460l3192k8535k4789k3768k3404k0992j7435j5013j3293
58710I21267j0852q720q332q091n734k360m45L92J906L186J997j269m583p934
58696H70428j2376j6771j9036j9574k0073k0053j8002j4809j2699j1701j0281
$$ plain form
58685 695053 686647 679628 674001 670594 669223 668690 669308 673056 680457 689756 700010 712351 727021 741666
58671 741666 753883 763340 770339 774659 777049 779679 783893 789385 796281 805666 817067 827775 835721
58658 835721 840807 842715 840154 833484 825536 818465 812037 806075 802047 800954 802162 805670 813160 825465
58644 825465 841352 860166 883277 911511 943588 978644 1018022 1063053 1113230 1168103 1228884
58633 1228884 1296727 1371536 1453923 1546290 1650588 1766906 1895457 2037866 2195272 2367153
58623 2367153 2552867 2751909 2961229 3174262 3383402 3581053 3757516 3900913 4001199
58614 4001199 4052724 4052834 4001417 3903247 3767755 3604629 3421741 3227819 3033213 2845748
58604 2845748 2668460 2502928 2351834 2216532 2095433 1987123 1892329 1810838 1739588 1676247
$$ packed form
58685F95053q406p019n627l407j371n33O18L748P401R299J0254J2341J4670J4645
58671G41666J2217R457O999M320K390K630M214N492O896R385J1401J0708P946
58658H35721N086J908k561o670p948p071o428n962m028j093J208L508P490J2305
58644H25465J5887J8814K3111K8234L2077L5056L9378M5031N0177N4873O0781
58633A228884O7843P4809Q2387R2367J04298J16318J28551J42409J57406J71881
58623B367153J85714J99042K09320K13033K09140J97651J76463J43397J00286
58614D001199N1525J10n1417r8170j35492j63126j82888j93922j94606j87465
58604B845748j77288j65532j51094j35302j21099j08310r4794q1491p1250o3341
$$ plain form
58594 1676247 1621956 1578172 1543466 1515823 1495394 1482346 1474382 1468922 1465506 1463592 1460297 1452816
58582 1452816 1441079 1425825 1406339 1382442 1356474 1330989 1306631 1284362 1267273 1257591 1254136 1255191
58570 1255191 1261538 1273963 1289872 1305055 1316880 1323280 1320728 1306181 1279587 1242367 1195386 1140760
58558 1140760 1083520 1028617 977561 929975 886551 848315 814979 786308 763308 745985 731871
58547 731871 718787 707008 696810 686379 674429 662510 652296 642923 633306 624699 618450 613569
58535 613569 608953 605596 604080 602429 599134 595792 594013 592264 588684 584520 581726 579540 576557 573869
58521 573869 572997 572916 572286 572435 575020 578896 582483 587019 594165 602523 609860 616822 625129 634089 642176
58506 642176 650067 658807 666933 672812 677934 684573 692066 698694 705392 714186 724789 735946 748195
$$ packed form
58594A676247n4291m3784l4706k7643k0429j3048p964n460l416j914l295p481
58582A452816j1737j5254j9486k3897k5968k5485k4358k2269j7089r682l455J055
58570A255191O347J2425J5909J5183J1825O400k552j4547k6594l7220m6981n4626
58558A140760n7240n4903n1056m7586m3424l8236l3336k8671k3000j7323j4114
58547G31871j3084j1779j0198j0431j1950j1919j0214r373r617q607o249m881
58535F13569m616l357j516j651l295l342j779j749l580m164k794k186k983k688
58521E73869q72q1o30J49K585L876L587M536P146Q358P337O962Q307Q960Q087
58506F42176P891Q740Q126N879N122O639P493O628O698Q794J0603J1157J2249
$$ plain form
58493 748195 761967 774908 784445 791150 796369 798801 796918 792525 788046 782185 772099 758079 742466
58480 742466 725837 707990 690823 676341 663539 650899 640074 633289 629034 624275 619049 614942
58468 614942 610966 605253 599075 594897 591907 587702 582882 579802 578268 576623 575686 577372 580716 583437
58454 583437 586217 591430 598929 607010 616103 627517 639990 651534 663191 676976 691736 705117
58442 705117 717865 731873 745698 756416 764166 770262 772533 767414 755438 740153 723092 704239
58430 704239 685681 669765 655103 639295 624163 613347 606241 599509 593267 590381 590803 592000 594124
58417 594124 599414 607217 614852 622817 634065 648702 664288 680612 699201 718723 735674 748912
58405 748912 758957 764122 762332 755649 747923 739138 727150 713454 701626 691316 679577 667066
$$ packed form
58493G48195J3772J2941R537O705N219K432j883m393m479n861j0086j4020j5613
58480G42466j6629j7847j7167j4482j2802j2640j0825o785m255m759n226m107
58468F14942l976n713o178m178k990m205m820l080j534j645r37J686L344K721
58454E83437K780N213P499Q081R093J1414J2473J1544J1657J3785J4760J3381
58442G05117J2748J4008J3825J0718P750O096K271n119j1976j5285j7061j8853
58430G04239j8558j5916j4662j5808j5132j0816p106o732o242k886M22J197K124
58417E94124N290P803P635P965J1248J4637J5586J6324J8589J9522J6951J3238
58405G48912J0045N165j790o683p726q785j1988j3696j1828j0310j1739j2511
$$ plain form
58393 667066 657130 649809 642671 636576 634415 634828 633442 629941 627904 628044 627644 626324 626328 627347 626999 626262
58377 626262 628553 633793 639085 644693 653301 663997 673251 681275 691096 701939 710139 716220 724312 734806
58363 734806 744303 752730 763613 777248 790446 803142 818519 836329 852814 867264 881860 895001
58351 895001 901912 902203 899974 896326 888866 878672 870263 864137 856636 847740 841740 839705 838561 838102
58337 838102 841513 848448 855032 861132 870123 881175 889678 895748 904244 915812 926176 934929 946510
58324 946510 961546 975794 988812 1005118 1025488 1045607 1064611 1086221 1109980 1130084 1144427
58313 1144427 1156238 1165524 1168032 1164272 1160352 1158025 1153037 1145000 1139466 1138194 1136842 1134416 1135499 1140956
58299 1140956 1146063 1150128 1158197 1170842 1182206 1190755 1202056 1218273 1234993 1251175 1271965 1298638
$$ packed form
58393F67066r936p321p138o095k161M13j386l501k037J40m00j320MJ019l48p37
58377F26262K291N240N292N608Q608J0696R254Q024R821J0843Q200O081Q092J0494
58363G34806R497Q427J0883J3635J3198J2696J5377J7810J6485J4450J4596J3141
58351H95001O911K91k229l648p460j0194q409o126p501q896o000k035j144m59
58337H38102L411O935O584O100Q991J1052Q503O070Q496J1568J0364Q753J1581
58324I46510J5036J4248J3018J6306K0370K0119J9004K1610K3759K0104J4343
58313A144427J1811R286K508l760l920k327m988q037n534j272j352k426J083N457
58299A140956N107M065Q069J2645J1364Q549J1301J6217J6720J6182K0790K6673
$$ plain form
58287 1298638 1325992 1352771 1384516 1423151 1464036 1506207 1554868 1610674 1667209 1722029 1779202
58276 1779202 1838049 1890784 1934402 1973312 2007240 2028902 2037295 2040981 2044554 2044415 2041429 2044317 2056010
58263 2056010 2069833 2083638 2104299 2133653 2163919 2192119 2225185 2265802 2307415 2348420 2396631
58252 2396631 2454317 2513702 2572615 2639054 2714646 2789901 2861943 2940272 3028528 3117793 3204879
58241 3204879 3299339 3404866 3511977 3617243 3731193 3858700 3990558 4123234 4267305 4427051
58231 4427051 4591909 4757952 4937078 5134904 5341273 5553378 5785736 6045833 6323113
58222 6323113 6613886 6932835 7287356 7666017 8065827 8504524 8992119 9518467 10083846
58213 10083846 10712146 11418056 12192960 13040477 13992442 15071831 16276988 17623950 19166975
$$ packed form
58287A298638K7354K6779L1745L8635M0885M2171M8661N5806N6535N4820N7173
58276A779202N8847N2735M3618L8910L3928K1662Q393L686L573j39k986K888J1693
58263B056010J3823J3805K0661K9354L0266K8200L3066M0617M1613M1005M8211
58252B396631N7686N9385N8913O6439P5592P5255P2042P8329Q8256Q9265Q7086
58241C204879R4460J05527J07111J05266J13950J27507J31858J32676J44071J59746
58231D427051J64858J66043J79126J97826K06369K12105K32358K60097K77280
58222F323113K90773L18949L54521L78661L99810M38697M87595N26348N65379
58213A0083846O28300P05910P74904Q47517R51965J079389J205157J346962J543025
$$ plain form
58204 19166975 20956874 23023373 25426195 28281342 31711683 35821128 40747979 46694688
58196 46694688 53885349 62573962 73148798 86169409 102264466 122072165 146299447
58189 146299447 175664611 210605428 251001642 295964965 343248514 388277674 424071502
58182 424071502 443341537 441942743 420967125 385756176 342969311 298181973 255145371
58175 255145371 216044031 181866764 152745280 128353442 108203897 91722971 78274060
58168 78274060 67267178 58240184 50816842 44655748 39483078 35119459 31428767 28274140
58160 28274140 25546528 23188644 21155875 19384627 17820940 16444328 15238087 14165232
58152 14165232 13194329 12320452 11540662 10834528 10186281 9601030 9081837 8613160 8181818
$$ packed form
58204A9166975J789899K066499K402822K855147L430341M109445M926851N946709
58196D6694688P190661Q688613J0574836J3020611J6095057J9807699K4227282
58189A46299447K9365164L4940817M0396214M4963323M7283549M5029160L5793828
58182D24071502J9270035j398794k0975618l5210949m2786865m4787338m3036602
58175B55145371l9101340l4177267k9121484k4391838k0149545j6480926j3448911
58168G8274060j1006882r026994p423342o161094n172670m363619l690692l154627
58160B8274140k727612k357884k032769j771248j563687j376612j206241j072855
58152A4165232r70903q73877p79790p06134o48247n85251n19193m68677m31342
$$ plain form
58143 8181818 7792326 7447283 7133364 6839996 6572440 6334300 6115826 5910720 5726418
58134 5726418 5567089 5423614 5290166 5174063 5080002 5000375 4929836 4874439 4838670 4817886
58124 4817886 4810565 4824241 4863293 4924238 5008062 5123894 5276082 5460238 5674841 5923161
58114 5923161 6200597 6493162 6792053 7100297 7427084 7789458 8219527 8757536 9438198
58105 9438198 10293516 11364324 12699355 14353634 16404038 18959861 22146839 26092764
58097 26092764 30934993 36809022 43795109 51872276 60879000 70368877 79373357 86389883
58089 86389883 89887246 89085387 84355899 76909377 68125354 59091756 50516911 42801795
58081 42801795 36107534 30432353 25704421 21828484 18682043 16126788 14046154 12355488
$$ packed form
58143H181818l89492l45043l13919k93368k67556k38140k18474k05106j84302
58134E726418j59329j43475j33448j16103r4061p9627p0539n5397l5769k0784
58124D817886p321J3676L9052O0945Q3824J15832J52188J84156K14603K48320
58114E923161K77436K92565K98891L08244L26787L62374M30069N38009O80662
58105I438198Q55318J070808J335031J654279K050404K555823L186978L945925
58097B6092764M842229N874029O986087Q077167R006724R489877R004480P016526
58089H6389883L497363q01859m729488p446522q784023r033598q574845p715116
58081D2801795o694261n675181m727932l875937l146441k555255k080634j690666
$$ plain form
58073 12355488 10979341 9846352 8907891 8136387 7500820 6962420 6494220 6084673 5720516
58064 5720516 5383562 5064911 4765777 4484064 4215078 3964210 3743110 3553118 3385645
58055 3385645 3236663 3106382 2986560 2863418 2733239 2602470 2473728 2344647 2218905
58046 2218905 2104845 2003431 1909421 1823242 1749788 1686903 1627241 1570629 1522883 1483411 1445624
58035 1445624 1408830 1378263 1353854 1330001 1306039 1286115 1269094 1249196 1226480 1206527 1189954
58024 1189954 1172083 1152671 1136126 1122332 1106867 1090182 1077138 1067611 1056828 1044899 1036789 1032850
58012 1032850 1028463 1023204 1021414 1023320 1024252 1023090 1023213 1024665 1023515 1019364 1015510 1011303 1002134 987449
57998 987449 971311 954838 935583 914578 896380 881752 867558 854135 845408 841325 837375 832081
$$ packed form
58073A2355488j376147j132989r38461p71504o35567n38400m68200m09547l64157
58064E720516l36954l18651k99134k81713k68986k50868k21100j89992j67473
58055C385645j48982j30281j19822j23142j30179j30769j28742j29081j25742
58046B218905j14060j01414r4010q6179p3454o2885n9662n6612m7746l9472l7787
58035A445624l6794l0567k4409k3853k3962j9924j7021j9898k2716j9953j6573
58024A189954j7871j9412j6545j3794j5465j6685j3044r527j0783j1929q110l939
58012A032850m387n259j790J906R32j162J23J452j150m151l854m207r169j4685
57998I87449j6138j6473j9255k1005j8198j4628j4194j3423q727m083l950n294
$$ plain form
57986 832081 828036 825314 820919 815158 811545 809926 806433 800651 796000 792657 787000 778686 771567 766852
57972 766852 761835 756015 752028 749835 746337 741433 738246 736757 733542 728556 725872 726756 728073 728426 729885
57957 729885 732675 734093 733787 734459 736227 735692 731535 725855 719327 710382 699682 689946 680784 669135
57943 669135 655328 643150 633425 623258 612240 603526 597832 592179 585812 581795 581437 582417 583578 586366
57929 586366 590311 592336 591785 591182 590971 588607 583965 580430 579355 578467 577015 577472 580795 584929 589399
57914 589399 596583 607106 618588 630129 643285 657572 670005 680354 691832 705129 716738 724704
57902 724704 730984 736361 738010 734287 727413 719293 708954 696057 682747 670019 656236 641082 627068
57889 627068 615419 604376 593133 583504 576086 568804 560912 554464 550175 545822 540482 536327 534412
$$ packed form
57986H32081m045k722m395n761l613j619l493n782m651l343n657q314p119m715
57972G66852n017n820l987k193l498m904l187j489l215m986k684Q84J317L53J459
57957G29885K790J418l06O72J768n35m157n680o528q945j0700r736r162j1649
57943F69135j3807j2178r725j0167j1018q714n694n653o367m017l58R80J161K788
57929E86366L945K025n51o03k11k364m642l535j075q88j452M57L323M134M470
57914E89399P184J0523J1482J1541J3156J4287J2433J0349J1478J3297J1609P966
57902G24704O280N377J649l723o874q120j0339j2897j3310j2728j3783j5154j4014
57889F27068j1649j1043j1243r629p418p282p892o448m289m353n340m155j915
$$ plain form
57876 534412 532525 529101 525510 522736 519527 515762 513947 515441 518494 521714 526031 531643 536662 540538
57862 540538 545414 552296 559133 564289 568549 572228 573717 572503 570323 567866 563733 558051 553559 551519
57848 551519 550002 547743 546209 546312 546650 546692 548228 551947 555975 559465 564246 571283 578884 586031 594016
57833 594016 603203 611739 619150 627608 637780 646939 653048 657242 660464 661283 659078 655790 652404 647049
57819 647049 638727 629532 621039 611831 600805 589589 579507 569468 559111 550705 545531 541552 537061
57806 537061 533442 531999 531286 530103 530035 532338 535281 537137 538929 541601 543378 542667 540887 539726 538136
57791 538136 534664 530238 526096 521425 515510 509810 505529 501566 497150 493913 493014 492870 492159 492345 494690
57776 494690 497445 498648 499136 500122 500488 499303 498462 499885 502402 504338 506819 511525 517429 522901 529006
$$ packed form
57876E34412j887l424l591k774l209l765j815J494L053L220M317N612N019L876
57862E40538M876O882O837N156M260L679J489j214k180k457m133n682m492k040
57848E51519j517k259j534J03L38M2J536L719M028L490M781P037P601P147P985
57833E94016R187Q536P411Q458J0172R159O109M194L222Q19k205l288l386n355
57819F47049q322r195q493r208j1026j1216j0082j0039j0357q406n174l979m491
57806E37061l619j443p13j183o8K303K943J856J792K672J777p11j780j161j590
57791E38136l472m426m142m671n915n700m281l963m416l237q99j44p11J86K345
57776D94690K755J203M88R86L66j185q41J423K517J936K481M706N904N472O105
$$ plain form
57761 529006 537608 547981 558256 568531 579811 591568 603035 615159 628660 641963 653611 664825
57749 664825 676996 688651 697626 704269 709615 712322 710606 705568 699550 692654 683826 673939 664844 656706
57735 656706 649068 643139 640184 638992 637817 637488 639763 643989 648388 653389 660650 669831 679367 689431
57721 689431 701100 713415 724398 734405 745572 758344 771378 784601 799769 818053 839181
57710 839181 862803 888882 917202 948218 983726 1025057 1071618 1122971 1181118 1248705 1326247
57699 1326247 1413455 1512153 1625421 1754695 1900019 2062292 2242689 2440110 2650995 2870870
57689 2870870 3094145 3313250 3519970 3706842 3865645 3986096 4058863 4079704 4049403 3971391
57679 3971391 3851812 3700482 3528564 3345238 3158128 2975444 2804843 2650689 2514780
$$ packed form
57761E29006Q602J0373J0275J0275J1280J1757J1467J2124J3501J3303J1648J1214
57749F64825J2171J1655Q975O643N346K707j716n038o018o896q828r887r095q138
57735F56706p638n929k955j192j175l29K275M226M399N001P261R181R536J0064
57721F89431J1669J2315J0983J0007J1167J2772J3034J3223J5168J8284K1128
57710H39181K3622K6079K8320L1016L5508M1331M6561N1353N8147O7587P7542
57699A326247Q7208R8698J13268J29274J45324J62273J80397J97421K10885K19875
57689B870870K23275K19105K06720J86872J58803J20451P2767K0841l0301p8012
57679C971391j19579j51330j71918j83326j87110j82684j70601j54154j35909
$$ plain form
57670 2514780 2399195 2306355 2237207 2192013 2172632 2181818 2220636 2288374 2384053 2505262 2644924
57659 2644924 2789836 2921206 3016017 3052007 3017340 2917543 2771833 2602597 2428296 2262450
57649 2262450 2113774 1985939 1879532 1794997 1732643 1690867 1666873 1659039 1666776 1688809 1723792
57638 1723792 1772198 1835502 1913935 2007006 2115528 2240829 2382299 2537669 2705103 2882759
57628 2882759 3066596 3250400 3427313 3589345 3726294 3827810 3886689 3899069 3863110 3780464
57618 3780464 3658352 3507232 3336129 3151909 2961871 2773760 2592987 2422085 2262791
57609 2262791 2116437 1982662 1860328 1749797 1652153 1566356 1489462 1419684 1357072 1301347
57599 1301347 1251290 1206223 1165947 1129273 1094693 1062352 1033229 1006630 980729 955394 932167
$$ packed form
57670B514780j15585r2840o9148m5194j9381R186L8818O7738R5679J21209J39662
57659B644924J44912J31370R4811L5990l4667r9797j45710j69236j74301j65846
57649B262450j48676j27835j06407q4535o2354m1776k3994p834P737K2033L4983
57638A723792M8406O3304P8433R3071J08522J25301J41470J55370J67434J77656
57628B882759J83837J83804J76913J62032J36949J01516N8879J2380l5959q2646
57618C780464j22112j51120j71103j84220j90038j88111j80773j70902j59294
57609B262791j46354j33775j22334j10531r7644q5797p6894o9778o2612n5725
57599A301347n0057m5067m0276l6674l4580l2341k9123k6599k5901k5335k3227
$$ plain form
57588 932167 911520 892439 874628 858726 844265 829797 815319 802356 791405 781405 771949 763893
57576 763893 757519 752171 747965 745822 745489 745384 744639 743606 742369 740705 739527 740339 743079 746359 749904
57561 749904 754808 761387 768875 777380 788182 801791 817519 835104 855062 877487 902365 930938
57549 930938 964817 1003822 1046683 1093790 1147234 1208333 1277307 1355243 1444009 1544000 1654112
57538 1654112 1774050 1904501 2044938 2193322 2347807 2506140 2662993 2810096 2939336
57529 2939336 3043873 3116798 3151973 3147273 3105076 3029365 2924557 2797126 2655353 2506373
57519 2506373 2355273 2207059 2066766 1937003 1817859 1709809 1614265 1530828 1456843 1390650
57509 1390650 1332873 1283651 1241230 1204273 1173004 1146912 1123823 1102567 1084258 1069604 1057202
$$ packed form
57588I32167k0647j9081j7811j5902j4461j4468j4478j2963j0951j0000r456q056
57576G63893o374n348m206k143l33j05p45j033j237j664j178Q12K740L280L545
57561G49904M904O579P488Q505J0802J3609J5728J7585J9958K2425K4878K8573
57549I30938L3879L9005M2861M7107N3444O1099O8974P7936Q8766R9991J10112
57538A654112J19938J30451J40437J48384J54485J58333J56853J47103J29240
57529B939336J04537P2925L5175m700m2197p5711j04808j27431j41773j48980
57519B506373j51100j48214j40293j29763j19144j08050r5544q3437p3985o6193
57509A390650n7777m9222m2421l6957l1269k6092k3089k1256j8309j4654j2402
$$ plain form
57498 1057202 1045822 1036223 1029285 1024444 1021495 1022003 1027392 1037351 1051468 1070607 1095300 1124581 1157920
57485 1157920 1196749 1242645 1295642 1355709 1424285 1502856 1591467 1690041 1799721 1921308 2053454
57474 2053454 2193496 2338721 2485459 2628058 2759923 2874438 2964139 3020854 3038596 3015867
57464 3015867 2954722 2859119 2735229 2591484 2436391 2276609 2117601 1964494 1821021 1688671
57454 1688671 1567886 1459057 1361677 1274063 1195036 1124706 1062835 1007929 958884 915969 879102
57443 879102 846717 817543 791953 770300 751315 733465 716624 701204 686966 673899 662864
57432 662864 654046 646093 638011 630588 624618 619175 613135 607077 602051 597695 593166 588895 585771 583508
57418 583508 581357 579556 578574 577719 576048 574011 572795 572662 573129 574107 575637 577198 578439 579902 581944
$$ packed form
57498A057202j1380r599o938m841k949N08N389R959J4117J9139K4693K9281L3339
57485A157920L8829M5896N2997O0067O8576P8571Q8611R8574J09680J21587J32146
57474B053454J40042J45225J46738J42599J31865J14515Q9701N6715J7742k2729
57464C015867o1145r5603j23890j43745j55093j59782j59008j53107j43473j32350
57454A688671j20785j08829r7380q7614p9027p0330o1871n4906m9045m2915l6867
57443H79102l2385k9174k5590k1653j8985j7850j6841j5420j4238j3067j1035
57432F62864q818p953q082p423n970n443o040o058n026m356m529m271l124k263
57418E83508k151j801r82q55j671k037j216j33M67R78J530J561J241J463K042
$$ plain form
57403 581944 583812 584933 586231 588879 592471 595751 598507 601540 605368 610084 615869 622549 629172 634996
57389 634996 640338 645721 651023 656311 662417 669607 676614 682251 687140 692584 698493 703662 707493 710245
57375 710245 712138 713334 714362 715556 716540 717068 717663 718690 719524 719504 718899 718062 716521 713910 711016 708942
57359 708942 707906 707641 708099 708949 709387 709343 709914 711744 714103 716451 719546 723816 727910 730350 731511 732546
57343 732546 733375 733325 732814 732774 733148 733520 734488 736833 739969 742817 745706 749851 755347 761141 766651 772037
57327 772037 777241 782116 787205 793165 799705 806203 812990 820903 830036 840067 851234 863735 876630
57314 876630 888712 900142 912053 924834 937979 951243 964828 978708 992773 1007284 1022245
57303 1022245 1036889 1050780 1064787 1079796 1095138 1109602 1123458 1138113 1154130 1170941 1188215
$$ packed form
57403E81944J868J121J298K648L592L280K756L033L828M716N785O680O623N824
57389F34996N342N383N302N288O106P190P007N637M889N444N909N169L831K752
57375G10245J893J196J028J194R84N28N95J027Q34k0o05q37j541k611k894k074
57359G08942j036k65M58Q50M38m4N71J830K359K348L095M270M094K440J161J035
57343G32546Q29n0n11m0L74L72R68K345L136K848K889M145N496N794N510N386
57327G72037N204M875N089N960O540O498O787P913R133J0031J1167J2501J2895
57314H76630J2082J1430J1911J2781J3145J3264J3585J3880J4065J4511J4961
57303A022245J4644J3891J4007J5009J5342J4464J3856J4655J6017J6811J7274
$$ plain form
57292 1188215 1206264 1225325 1245572 1267496 1291205 1315649 1339527 1362601 1385177 1406979 1427681
57281 1427681 1447822 1467783 1486328 1501543 1512771 1520223 1523242 1520683 1512871 1501539 1487709 1471037
57269 1471037 1451448 1430169 1408870 1388760 1370668 1355129 1342280 1332319 1325929 1323564 1324675 1328388
57257 1328388 1334507 1342968 1352821 1362928 1373327 1384883 1397796 1411460 1425464 1439773 1454211 1468744
57245 1468744 1483986 1500524 1518069 1536074 1554746 1574562 1595346 1616705 1638772 1661610 1684652
57234 1684652 1707788 1732142 1758554 1786094 1813451 1840936 1869547 1898832 1927515 1955711 1984638
57223 1984638 2014421 2043994 2072992 2102037 2131276 2160401 2190077 2221550 2254691 2288071 2321155
57212 2321155 2354857 2389768 2425444 2461688 2498895 2536795 2574406 2611768 2650353 2691217 2733981
$$ packed form
57292A188215J8049J9061K0247K1924K3709K4444K3878K3074K2576K1802K0702
57281A427681K0141J9961J8545J5215J1228P452L019k559p812j1332j3830j6672
57269A471037j9589k1279k1299k0110j8092j5539j2849r961o390k365J111L713
57257A328388O119Q461R853J0107J0399J1556J2913J3664J4004J4309J4438J4533
57245A468744J5242J6538J7545J8005J8672J9816K0784K1359K2067K2838K3042
57234A684652K3136K4354K6412K7540K7357K7485K8611K9285K8683K8196K8927
57223A984638K9783K9573K8998K9045K9239K9125K9676L1473L3141L3380L3084
57212B321155L3702L4911L5676L6244L7207L7900L7611L7362L8585M0864M2764
$$ plain form
57201 2733981 2778033 2823435 2869999 2916629 2962207 3006319 3048744 3089173 3127824 3165498 3202725
57190 3202725 3239602 3276610 3314569 3353608 3393182 3433357 3475107 3519065 3564968 3612682 3662842
57179 3662842 3716012 3771956 3830145 3890353 3952526 4016583 4082510 4150119 4218741 4287695 4356866
57168 4356866 4426190 4494908 4562230 4628475 4694513 4760272 4824854 4887932 4949837 5010316 5068472
57157 5068472 5124038 5177472 5228688 5277029 5322814 5367653 5412666 5457392 5500972 5543408 5585094
57146 5585094 5625948 5665661 5704154 5741316 5776815 5810531 5842620 5872877 5900653 5925750 5948900
57135 5948900 5971117 5993136 6015651 6039398 6064622 6091005 6118558 6148172 6180880 6216791 6255063
57124 6255063 6294897 6336410 6380625 6428478 6479704 6532838 6586485 6640353 6694810 6749856 6805232
$$ packed form
57201B733981M4052M5402M6564M6630M5578M4112M2425M0429L8651L7674L7227
57190C202725L6877L7008L7959L9039L9574M0175M1750M3958M5903M7714N0160
57179C662842N3170N5944N8189O0208O2173O4057O5927O7609O8622O8954O9171
57168D356866O9324O8718O7322O6245O6038O5759O4582O3078O1905O0479N8156
57157E068472N5566N3434N1216M8341M5785M4839M5013M4726M3580M2436M1686
57146E585094M0854L9713L8493L7162L5499L3716L2089L0257K7776K5097K3150
57135E948900K2217K2019K2515K3747K5224K6383K7553K9614L2708L5911L8272
57124F255063L9834M1513M4215M7853N1226N3134N3647N3868N4457N5046N5376
$$ plain form
57113 6805232 6861742 6922234 6991341 7074306 7175637 7298123 7442650 7608938 7796913 8008363
57103 8008363 8248317 8525514 8851979 9242540 9714281 10284795 10969768 11782479 12735498
57094 12735498 13840858 15107126 16537506 18131608 19886427 21792986 23833946 25987148
57086 25987148 28228552 30527165 32840011 35120530 37336169 39479042 41566871 43640412
57078 43640412 45744124 47868531 49877493 51493999 52388476 52317870 51214498 49177522
57070 49177522 46403051 43111417 39499848 35723777 31903362 28141844 24534693 21162799
57062 21162799 18083322 15329517 12914375 10831529 9057875 7561642 6309427 5267089
57054 5267089 4399951 3676972 3073702 2569648 2145344 1784171 1474562 1207786 975133
$$ packed form
57113F805232N6510O0492O9107Q2965J01331J22486J44527J66288J87975K11450
57103H008363K39954K77197L26465L90561M71741N70514O84973Q12711R53019
57094A2735498J105360J266268J430380J594102J754819J906559K040960K153202
57086B5987148K241404K298613K312846K280519K215639K142873K087829K073541
57078D3640412K103712K124407K008962J616506Q94477p0606j103372k036976
57070D9177522k774471l291634l611569l776071l820415l761518l607151l371894
57062B1162799l079477k753805k415142k082846j773654j496233j252215j042338
57054E267089q67138p22979o03270n04054m24304l61173l09609k66776k32653
$$ plain form
57045 975133 769019 584772 419209 268924 131668 7622 -102583 -199807 -285086 -358341
57035 -358341 -420026 -472502 -518229 -557965 -591961 -621214 -646215 -666120 -680639 -691232 -699239 -704518
57023 -704518 -707094 -708311 -708908 -707749 -704007 -698994 -694334 -689900 -684961 -679695 -674058 -666837 -657514 -647640
57009 -647640 -638774 -630445 -621618 -612753 -604788 -597426 -589961 -582604 -575575 -568167 -560062 -552326 -545713 -539297
56995 -539297 -532078 -524599 -517661 -510840 -503645 -496612 -489703 -481006 -468748 -453434 -436497 -417987 -397159
56982 -397159 -374357 -350969 -328608 -309665 -297408 -293743 -297348 -304902 -313205 -319405 -320815 -316062 -305571
56969 -305571 -289844 -268238 -240164 -206054 -166146 -119687 -66320 -6848 58318 130044 208946 294705
56957 294705 387891 490876 605676 732057 868631 1015119 1174145 1353277 1565895 1828429
$$ packed form
57045I75133k06114j84247j65563j50285A31668G622a02583r7224q5279p3255
57035c58341o1685n2476m5727l9736l3996k9253k5001j9905j4519j0593q007n279
57023g04518k576j217n97J159L742N013M660M434M939N266N637P221R323R874
57009f47640Q866Q329Q827Q865P965P362P465P357P029P408Q105P736O613O416
56995e39297P219P479O938O821P195P033O909Q697J2258J5314J6937J8510K0828
56982c97159K2802K3388K2361J8943J2257L665l605p554q303o200j410M753J0491
56969c05571J5727K1606K8074L4110L9908M6459N3367f848E8318P1726P8902Q5759
56957B94705R3186J02985J14800J26381J36574J46488J59026J79132K12618K62534
$$ plain form
56947 1828429 2156894 2567401 3077040 3698907 4435862 5280317 6209860 7163943 8020038
56938 8020038 8614397 8816405 8599197 8043552 7280420 6431336 5585130 4799689 4106358
56929 4106358 3514234 3018175 2605651 2259256 1960447 1696351 1462231 1256788 1077954
56920 1077954 923880 793923 686100 595687 517800 449281 387342 329077 273676 222838 177743
56909 177743 137525 101368 69651 42057 16965 -6121 -25647 -40641 -52325 -62058 -69622 -74637
56897 -74637 -77891 -80108 -80908 -79930 -77476 -73264 -65969 -54702 -39560 -20299 3909 32802 64499 96969
56883 96969 128164 154376 170551 173515 163802 144108 117535 87677 58372 32195 10186 -6689
56870 -17291 -21638 -20712 -14423 -1386 19014 46216 80715 124802 180275 246962 324068 410856 504295
$$ packed form
56947A828429L28465M10507N09639O21867P36955Q44455R29543R54083Q56095
56938H020038N94359K02008k17208n55645p63132q49084q46206p85441o93331
56929D106358n92124m96059m12524l46395k98809k64096k34120k05443j78834
56920A077954j54074j29957j07823r0413p7887o8519o1939n8265n5401n0838m5095
56909A77743m0218l6157l1717k7594A6965f121j9526j4994j1684r733p564n015
56897g4637l254k217q00R78K454M212P295J1267J5142J9261C909K8893L1697L2470
56883I6969L1195K6212J6175K964r713j9694k6573k9858k9305k6177A0186f689
56870a7291m347R26O289a386A9014K7202L4499M4087N5473O6687P7106Q6788R3439
$$ plain form
56857 504295 596672 676288 730542 749850 731799 683048 615981 542325 469792 403272 346253
56846 346253 300410 265880 242963 232304 233390 244882 267042 302098 351928 417367 500110 602855
56834 602855 726316 867366 1019614 1172393 1308001 1403852 1441966 1417712 1339891 1224577
56824 1224577 1089538 950850 820039 702888 601380 516380 448210 396287 359859 338599
56814 338599 331786 337992 356679 389281 437711 502538 583346 679484 788294 901876 1005988
56803 1005988 1082902 1117291 1102443 1042927 951516 843029 730188 622605 526277 443066 372256
56792 372256 313384 266734 231560 206041 189454 182530 185183 195988 214637 242806 281395 328659
56780 328659 381877 438398 493029 536196 557546 551867 521061 471557 411068 346633 283461 224694
$$ packed form
56857E04295R2377P9616N4254J9308j8051m8751o7067p3656p2533o6520n7019
56846C46253m5843l4530k2917j0659J086J1492K2160L5056M9830O5439Q2743J02745
56834F02855J23461J41050J52248J52779J35608R5851L8114k4254p7821j15314
56824A224577j35039j38688j30811j17151j01508q5000o8170n1923l6428k1260
56814C38599o813O206J8687L2602M8430O4827Q0808R6138J08810J13582J04112
56803A005988P6914L4389j4848n9516r1411j08487j12841j07583r6328q3211p0810
56792C72256n8872m6650l5174k5519j6587o924K653J0805J8649K8169L8589M7264
56780C28659N3218N6521N4631M3167K1350n679l0806m9504o0489o4435o3172n8767
$$ plain form
56768 224694 172165 126844 88513 56107 28914 6720 -11377 -27044 -41158 -53288 -63058 -70833
56756 -70833 -76788 -80734 -83326 -86007 -89186 -91865 -93537 -94896 -96109 -96159 -94793 -93483 -93430 -94060 -94537 -95261
56740 -95261 -96695 -97992 -98046 -96978 -95596 -94305 -93356 -93164 -93637 -94114 -94462 -95123 -95768 -95333 -93805 -92342 -91237
56723 -91237 -89554 -87389 -86322 -86738 -86811 -85383 -83809 -83546 -83898 -83791 -83963 -85461 -87423 -88248 -87811 -86846 -85325
56706 -85325 -83131 -81214 -80423 -80166 -79777 -80106 -82067 -84514 -85312 -83853 -81117 -77986 -74915 -72529 -71138 -70149
56690 -70149 -69046 -68204 -67826 -67009 -64969 -62262 -59722 -57198 -54348 -51680 -49759 -48440 -47776 -48409 -50032 -50914
56674 -50914 -50168 -49077 -48974 -49359 -49499 -50174 -52073 -53971 -54443 -54104 -54221 -54293 -53099 -51112 -49791 -49245 -48544
56657 -48544 -47632 -46985 -46054 -43983 -41401 -39722 -39020 -38209 -36966 -35950 -35472 -35255 -35091 -34628 -33183 -30850 -28970
$$ packed form
56768B24694n2529m5321l8331l2406k7193F720a1377j5667j4114j2130r770p775
56756g0833n955l946k592k681l179k679j672j359j213n0J366J310N3o30m77p24
56740i5261j434j297n4J068J382J291R49J92m73m77l48o61o45M35J528J463J105
56723i1237J683K165J067m16p3J428J574K63l52J07j72j498j962q25M37R65J521
56706h5325K194J917P91K57L89l29j961k447p98J459K736L131L071K386J391R89
56690g0149J103Q42L78Q17K040K707K540K524K850K668J921J319O64o33j623q82
56674e0914P46J091J03l85j40o75j899j898m72L39j17p2J194J987J321N46P01
56657d8544R12O47R31K071K582J679P02Q11J243J016M78K17J64M63J445K333J880
$$ plain form
56640 -28970 -28404 -28357 -28010 -28046 -29165 -30492 -31172 -32293 -35335 -39810 -44272 -48680 -53829 -59394 -64445 -69055
56624 -69055 -73558 -77179 -79307 -81144 -84022 -87026 -88372 -88245 -88077 -87851 -86426 -83772 -80536 -76081 -69537
56609 -69537 -62315 -57004 -53917 -51146 -47897 -45323 -43938 -42533 -40112 -36985 -33659 -30302 -27458 -25693
56595 -25693 -24501 -22953 -21257 -20135 -19130 -17227 -14779 -12931 -11495 -9218 -5983 -2872 -234 2519 5370
56580 5370 7777 10041 12864 15809 17945 19670 22032 24660 26333 27276 28828 31036 32657 33404 34234
56565 34234 35535 37003 39083 42511 46572 49834 52426 55617 59419 62800 66044 70594 76577 82742
56551 82742 88870 95997 104201 112491 121059 131342 143543 156238 168769 181934 196001 210048 223559
56538 223559 236775 249343 260588 271124 282082 292719 301066 307033 312558 318504 323762 327590 330430
$$ packed form
56640b8970N66M7L47l6j119j327o80j121l042m475m462m408n149n565n051m610
56624f9055m503l621k128j837k878l004j346J27J68K26J425K654L236M455O544
56609f9537P222N311L087K771L249K574J385J405K421L127L326L357K844J765
56595b5693J192J548J696J122J005J903K448J848J436K277L235b872b34B519K851
56580E370K407K264K823K945K136J725K362K628J673R43J552K208J621P47Q30
56565C4234J301J468K080L428M061L262K592L191L802L381L244M550N983O165
56551H2742O128P127Q204Q290Q568J0283J2201J2695J2531J3165J4067J4047J3511
56538B23559J3216J2568J1245J0536J0958J0637Q347N967N525N946N258L828K840
$$ plain form
56525 330430 332106 331757 329917 328175 326330 322409 316039 309131 302512 294582 284247 272634 260762 247991
56511 247991 234062 220375 207847 195491 182449 169615 158053 147541 137821 129523 122778 116526
56499 116526 110203 104462 99392 93857 87546 81869 77775 74415 70986 68113 66292 64676 62599 60820
56485 60820 60143 60171 60362 60921 61778 62089 61593 61136 61204 61348 61527 62419 63848 64609 64402 64279 64696 65008 65309
56466 65309 66634 68711 69747 69291 69108 70272 71617 72204 73044 74961 76834 77534 77860 79130 81437 84622
56450 84622 89261 95218 100788 104785 108283 113058 119502 127044 135324 143950 152356 160741 169983 180083
56436 180083 190207 200614 212711 226614 240648 253904 267283 281261 294831 307441 319782
56425 319782 331645 341323 348196 353674 358505 361524 362250 362191 362058 360122 354975 347638 339307 329326 317158
$$ packed form
56525C30430J676l49j840j742j845l921o370o908o619p930j0335j1613j1872j2771
56511B47991j3929j3687j2528j2356j3042j2834j1562j0512r720q298o745o252
56499A16526o323n741n070n535o311n677m094l360l429k873j821j616k077j779
56485F0820o77K8J91N59Q57L11m96m57O8J44J79Q92J429P61k07j23M17L12L01
56466F5309J325K077J036m56j83J164J345N87Q40J917J873P00L26J270K307L185
56450H4622M639N957N570L997L498M775O444P542Q280Q626Q406Q385R242J0100
56436A80083J0124J0407J2097J3903J4034J3256J3379J3978J3570J2610J2341
56425C19782J1863R678O873N478M831L019P26n9j33j936n147p337q331r981j2168
$$ plain form
56410 317158 304125 291267 277573 262306 247045 233504 221288 209693 199665 191866 184779 177007
56398 177007 169660 164271 160113 155819 151941 149435 147150 143381 138750 135173 132859 130492 127581 124770
56384 124770 122616 121531 121923 123007 122831 120852 118985 118668 118684 117608 116541 117305 119494 121425 122653 123599
56368 123599 124078 124140 124987 127200 129411 130472 131395 133369 135617 137168 138942 141890 144813 146266 147002 148259
56352 148259 149316 149183 149013 150204 151657 151664 151178 152360 154986 157130 158576 160831 164495 169131 175028 182655
56336 182655 190904 198165 204556 211159 217849 223904 229820 236442 243172 249034 254548 260566 266374 270901
56322 270901 274665 278508 281667 283244 284197 285646 286641 286086 285494 287206 290980 294901 298563 302854 307649
56307 307649 312333 317592 324167 330878 336366 341655 348423 355930 362310 367776 373722 379770 384607 388773
$$ packed form
56410C17158j3033j2858j3694j5267j5261j3541j2216j1595j0028p799p087p772
56398A77007p347n389m158m294l878k506k285l769m631l577k314k367k911k811
56384A24770k154j085L92J084j76j979j867l17J6j076j067P64K189J931J228R46
56368A23599M79O2Q47K213K211J061R23J974K248J551J774K948K923J453P36J257
56352A48259J057j33j70J191J453Pm86J182K626K144J446K255L664M636N897P627
56336A82655Q249P261O391O603O690O055N916O622O730N862N514O018N808M527
56322B70901L764L843L159J577R53J449R95n55n92J712L774L921L662M291M795
56307C07649M684N259O575O711N488N289O768P507O380N466N946O048M837M166
$$ plain form
56293 388773 393663 398615 401876 403697 405679 407862 409267 410447 412536 414524 414395 412320 409948 407341
56279 407341 403555 399463 396890 395466 393325 390464 388591 388190 388570 390196 394091 399461 404762 410510 418230
56264 418230 427391 436341 445586 457049 470742 485277 501034 519631 540865 563413 588127 617381
56252 617381 651533 689246 730818 777972 830754 887977 950390 1020003 1096522 1177724 1263148
56241 1263148 1354046 1449807 1547690 1645983 1744200 1840252 1930711 2013723 2088480 2152135 2200708
56230 2200708 2233061 2250793 2254457 2243341 2218954 2185267 2145370 2100891 2054375 2008785 1964776
56219 1964776 1921857 1881999 1848581 1822020 1800068 1782212 1769888 1762400 1756540 1750468 1744178 1735994
56207 1735994 1722545 1702731 1678135 1649202 1614638 1574817 1532043 1487023 1438653 1387582 1336441
$$ packed form
56293C88773M890M952L261J821J982K183J405J180K089J988j29k075k372k607
56279D07341l786m092k573j424k141k861j873m01L80J626L895N370N301N748P720
56264D18230R161Q950R245J1463J3693J4535J5757J8597K1234K2548K4714K9254
56252F17381L4152L7713M1572M7154N2782N7223O2413O9613P6519Q1202Q5424
56241A263148R0898R5761R7883R8293R8217R6052R0459Q3012P4757O3655M8573
56230B200708L2353J7732L664j1116k4387l3687l9897m4479m6516m5590m4009
56219A964776m2919l9858l3418k6561k1952j7856j2324p488n860o072o290q184
56207A735994j3449j9814k4596k8933l4564l9821m2774m5020m8370n1071n1141
$$ plain form
56196 1336441 1286364 1236862 1189069 1145245 1105084 1066525 1030289 999373 973943 951093 929974
56185 929974 912627 899258 887223 875530 865908 858450 850513 840926 831081 820963 808326 792831
56173 792831 776913 761582 745420 728421 712557 697697 681403 663711 647680 634298 621354
56162 621354 608335 597594 589479 581106 571508 563321 557758 552501 546247 540809 537025 532996 528108 524362
56148 524362 522065 518667 513603 509851 508903 508543 507323 506839 507876 508864 509895 513762 521217 529699 538377
56133 538377 549681 564070 578244 590595 603567 618509 633145 646413 660918 678163 696097
56122 696097 713673 733102 755297 777962 800585 826469 857420 891291 927120 967642 1014182
56111 1014182 1064227 1116797 1175238 1242093 1316353 1398543 1493364 1604456 1731635 1875873 2041333
$$ packed form
56196A336441n0077m9502m7793m3824m0161l8559l6236l0916k5430k2850k1119
56185I29974j7347j3369j2035j1693r622p458p937r587r845j0118j2637j5495
56173G92831j5918j5331j6162j6999j5864j4860j6294j7692j6031j3382j2944
56162F21354j3019j0741q115q373r598q187n563n257o254n438l784m029m888l746
56148E24362k297l398n064l752r48l60j220m84J037R88J031L867P455Q482Q678
56133E38377J1304J4389J4174J2351J2972J4942J4636J3268J4505J7245J7934
56122F96097J7576J9429K2195K2665K2623K5884L0951L3871L5829M0522M6540
56111A014182N0045N2570N8441O6855P4260Q2190R4821J11092J27179J44238J65460
$$ plain form
56100 2041333 2228946 2432758 2645227 2860700 3070990 3264013 3431478 3573844 3695124
56091 3695124 3798192 3887605 3970083 4047309 4112946 4160148 4187051 4192589 4174106 4133605 4080078
56080 4080078 4020553 3953347 3873293 3777338 3661200 3517682 3344392 3148634 2940645 2727301
56070 2727301 2515879 2316911 2137735 1978369 1837896 1718984 1621944 1541079 1471866 1415605
56060 1415605 1372475 1336917 1304992 1279469 1262295 1249004 1236067 1226668 1223421 1222508 1221079 1223150
56048 1223150 1231725 1242266 1250677 1260680 1276433 1294969 1312898 1333365 1359073 1385578 1409036 1433526
56036 1433526 1463171 1494075 1521745 1549264 1580265 1611122 1638140 1665142 1695820 1726167 1752766
56025 1752766 1780705 1814703 1850467 1883717 1919303 1961918 2006373 2047123 2089023 2138242 2191009
$$ packed form
56100B041333J87613K03812K12469K15473K10290J93023J67465J42366J21280
56091C695124J03068Q9413Q2478P7226O5637M7202K6903N538j8483m0501n3527
56080D080078n9525o7206q0054r5955j16138j43518j73290j95758k07989k13344
56070B727301k11422j98968j79176j59366j40473j18912r7040q0865o9213n6261
56060A415605m3130l5558l1925k5523j7174j3291j2937r399l247r13j429K071
56048A223150Q575J0541Q411J0003J5753J8536J7929K0467K5708K6505K3458K4490
56036A433526K9645L0904K7670K7519L1001L0857K7018K7002L0678L0347K6599
56025A752766K7939L3998L5764L3250L5586M2615M4455M0750M1900M9219N2767
$$ plain form
56014 2191009 2242052 2295698 2357508 2423369 2488257 2557205 2635942 2719356 2801225 2886541 2981868
56003 2981868 3082581 3182347 3285809 3398685 3515051 3628365 3745261 3873992 4009211 4143086
55993 4143086 4281057 4430942 4587276 4743003 4905914 5086399 5280022 5479971 5695079
55984 5695079 5936826 6200564 6479154 6782455 7122449 7492420 7883130 8306079 8777484
55975 8777484 9293869 9848751 10458445 11144394 11905653 12737902 13663564 14712480 15890661
55966 15890661 17202552 18687160 20397456 22365851 24632897 27292721 30469206 34270827
55958 34270827 38817286 44288490 50902759 58891094 68572660 80438084 95096623 113181249
55950 113181249 135374149 162429051 194972765 233202942 276675505 323891351 371367753
$$ packed form
56014B191009N1043N3646O1810O5861O4888O8948P8737Q3414Q1869Q5316R5327
56003B981868J00713R9766J03462J12876J16366J13314J16896J28731J35219J33875
55993D143086J37971J49885J56334J55727J62911J80485J93623J99949K15108
55984E695079K41747K63738K78590L03301L39994L69971L90710M22949M71405
55975H777484N16385N54882O09694O85949P61259Q32249R25662J048916J178181
55966A5890661J311891J484608J710296J968395K267046K659824L176485L801621
55958C4270827M546459N471204O614269P988335R681566J1865424J4658539J8084626
55950A13181249K2192900K7054902L2543714L8230177M3472563M7215846M7476402
$$ plain form
55943 371367753 412971730 441053794 449596374 437239769 407688674 367377835 322590788
55936 322590788 277958935 236374364 199361644 167424740 140427807 117958811 99493532
55929 99493532 84417257 72100447 62014406 53743305 46920939 41228674 36440230 32403008
55921 32403008 28976528 26030049 23481336 21284020 19380423 17704878 16221785 14918837
55913 14918837 13768580 12731918 11792009 10950190 10194013 9500433 8864522 8294603 7783541
55904 7783541 7312487 6878021 6488588 6138268 5809756 5499763 5217148 4959216 4713255
55895 4713255 4478871 4266446 4075461 3895103 3724084 3569812 3429872 3293721 3161128
55886 3161128 3040571 2931053 2823341 2717649 2622723 2538587 2456852 2377039 2306457 2244821
$$ packed form
55943C71367753M1603977K8082064Q542580j2356605k9551095m0310839m4787047
55936C22590788m4631853m1584571l7012720l1936904k6996933k2468996j8465279
55929I9493532j5076275j2316810j0086041q271101o822366n692265m788444m037222
55921C2403008l426480k946479k548713k197316j903597j675545j483093j302948
55913A4918837j150257j036662r39909q41819p56177o93580o35911n69919n11062
55904G783541m71054m34466l89433l50320l28512l09993k82615k57932k45961
55895D713255k34384k12425j90985j80358j71019j54272j39940j36151j32593
55886C161128j20557j09518j07712j05692r4926q4136q1735p9813p0582o1636
$$ plain form
55876 2244821 2184562 2125639 2074982 2031953 1988940 1945782 1909543 1880687 1853313 1828484 1813775
55865 1813775 1810054 1811989 1821252 1846061 1887680 1939970 2002069 2078705 2167564 2258535 2345865 2429134
55853 2429134 2501791 2550887 2569792 2560809 2524888 2459864 2369740 2264822 2151104 2029025 1903098
55842 1903098 1782448 1670629 1564583 1464619 1375887 1299083 1229215 1164801 1109309 1062520 1019399
55831 1019399 978604 943542 914188 886472 860550 841001 827873 815986 803945 795390 790511 784999
55819 784999 778574 776036 778430 781316 783101 786902 792750 796161 796233 797272 800569 802157 800576 799454 800642
55804 800642 802174 804863 813590 829996 850846 875276 906177 941870 973207 991555 993957 979286
55792 979286 946764 900916 851418 804887 761832 722873 691425 668095 648834 631294 617410
$$ packed form
55876B244821o0259n8923n0657m3029m3013m3158l6239k8856k7374k4829j4709
55865A813775l721J935R263K4809M1619N2290O2099P6636Q8859R0971Q7330Q3269
55853B429134P2657M9096J8905q983l5921o5024r0124j04918j13718j22079j25927
55842A903098j20650j11819j06046r9964q8732p6804o9868o4414n5492m6789m3121
55831A019399m0795l5062k9354k7716k5922j9549j3128j1887j2041q555m879n512
55819G84999o425k538K394K886J785L801N848L411P2J039L297J588j581j122J188
55804H00642J532K689Q727J6406K0850K4430L0901L5693L1337J8348K402j4671
55792I79286l2522m5848m9498m6531m3055l8959l1448k3330j9261j7540j3884
$$ plain form
55781 617410 607623 598404 587820 577953 569637 560413 549960 542040 538689 537638 537602 540827 548162 556616
55767 556616 563779 569639 572276 567341 554211 537625 521071 503487 484417 466886 452552 439089
55755 439089 425131 413195 405154 399137 393245 387965 382791 375015 364206 353592 344902 336097 326124
55742 326124 317306 310910 304938 298555 294143 292557 290805 286968 283211 281378 279764 276709 273392 270598
55728 270598 266675 261036 255839 251912 246913 239712 232617 227041 221131 213997 208108 204958 202459 199265
55714 199265 197656 199367 202544 205688 210826 219665 230210 240200 250575 262637 274975 286039 296515
55701 296515 306341 312544 312917 308965 302633 293201 280064 265420 251412 237520 223438 211412 202830
55688 202830 195404 186694 177777 170717 165059 159685 155566 153820 153301 152716 152840 154318 155666 155899 156579
$$ packed form
55781F17410r787r219j0584r867q316r224j0453p920l351j051l6L225P335Q454
55767E56616P163N860K637m935j3130j6586j6554j7584j9070j7531j4334j3463
55755D39089j3958j1936q041o017n892n280n174p776j0809j0614q690q805r973
55742C26124q818o396n972o383m412j586j752l837l757j833j614l055l317k794
55728B70598l923n639n197l927m999p201p095n576n910p134n889l150k499l194
55714A99265j609J711L177L144N138Q839J0545R990J0375J2062J2338J1064J0476
55701B96515R826O203L73l952o332r432j3137j4644j4008j3892j4082j2026q582
55688B02830p426q710q917p060n658n374m119j746n19n85J24J478J348K33O80
$$ plain form
55673 156579 158839 160841 160579 158755 156493 152793 146832 140394 135490 131775 128567 126942 127428 128048 127106
55658 127106 125617 124756 123411 120752 118657 118908 120270 120926 121459 122857 123865 122993 121094 119361 116884
55643 116884 112651 107901 104063 100504 96649 94010 93551 93342 91480 89144 88106 87488 85899 84571 85261
55628 85261 86890 87285 86699 86644 86768 85769 84125 83258 83143 83090 83496 84506 84441 81950 78369 75771 74139 72508
55610 72508 71211 70739 70107 68615 67545 67920 68381 67539 66537 66870 67591 67252 66699 67243 67827 66790 64872
55593 64872 63711 62908 61304 59689 59459 59991 60038 60299 61869 63535 63424 62149 61644 62098 62645 63783 66338
55576 66338 69330 71665 74745 80601 88562 96559 104623 114261 125449 137237 150526 167317 187783
55563 187783 210709 236049 264435 294797 325072 354526 382824 407530 425222 434609 436271 430169
$$ packed form
55673A56579K260K002k62j824k262l700n961o438m904l715l208j625M86O20r42
55658A27106j489q61j345k659k095K51J362O56N33J398J008q72j899j733k477
55643A16884m233m750l838l559l855k639m59k09j862k336j038o18j589j328O90
55628H5261J629L95n86n5J24r99j644q67j15n3M06J010o5k491l581k598j632j631
55610G2508j297m72o32j492j070L75M61q42j002L33P21l39n53N44N84j037j918
55593F4872j161q03j604j615k30N32M7K61J570J666j11j275n05M54N47J138K555
55576F6338K992K335L080N856P961P997Q064R638J1188J1788J3289J6791K0466
55563A87783K2926K5340K8386L0362L0275K9454K8298K4706J7692R387J662o102
$$ plain form
55551 430169 416006 395391 371069 344428 315957 287367 260664 235775 211537 188518 168511
55540 168511 151893 137825 126408 118138 111820 105523 99173 93962 89733 85268 80621 76910 74281
55527 74281 72232 71199 71583 72048 71143 69822 69899 70784 70382 68447 66326 63994 60298 55782 52419 50573
55511 50573 48788 46464 44246 41936 38515 34253 30472 27380 24387 22251 22435 24445 26177 26823 27186
55496 27186 27401 26792 25877 26099 27582 29394 31817 35922 40998 44960 47399 49893 53128 55972 57501
55481 57501 57775 56538 53367 49155 45323 41578 36597 30763 25889 22282 18594 14674 12079 11367 11205
55466 11205 10577 9793 9040 8011 7301 8090 10117 11839 12722 13464 14055 13760 13031 13124 13701 13114 11267 9926
55448 9926 9917 10303 10613 11527 12933 13598 13306 13161 13350 12768 11363 10621 11156 11960 12613 14026 16288 17896
$$ packed form
55551D30169j4163k0615k4322k6641k8471k8590k6703k4889k4238k3019k0007
55540A68511j6618j4068j1417q270o318o297o350n211m229m465m647l711k629
55527G4281k049j033L84M65r05j321P7Q85m02j935k121k332l696m516l363j846
55511E0573j785k324k218k310l421m262l781l092k993k136J84K010J732O46L63
55496B7186K15o09r15K22J483J812K423M105N076L962K439K494L235K844J529
55481E7501K74j237l171m212l832l745m981n834m874l607l688l920k595p12j62
55466A1205o28p84p53j029p10P89K027J722Q83P42N91k95p29R3N77n87j847j341
55448I926rL86L10R14J406O65k92j45J89n82j405p42N35Q04O53J413K262J608
$$ plain form
55430 17896 17964 17317 16708 15841 14811 14528 14983 14903 13897 13189 13539 14161 14350 14444 14585 14295 13888 14589 16547
55411 16547 18445 19655 21034 22979 24529 25168 25824 27272 29134 31157 33969 37858 42263 47038 52742
55396 52742 59147 65030 69977 74786 79586 83195 84937 85427 84992 82934 79021 74148 68914 63114 57105
55381 57105 52047 48166 44413 40354 36744 33747 30343 26199 22325 19104 15436 10720 6112 2915
55366 1105 249 409 1409 2516 3522 4834 6091 6212 5321 4975 5947 7321 8259 8950 9377 9014 8354
55349 8354 8808 10335 11117 10431 9833 10499 11352 11140 10550 10812 11662 12147 12303 12758 13597 14554 15394 15505 14284
55330 14284 12459 11606 11839 11529 9892 8124 7276 6824 6264 6254 7038 7482 6909 6340 6749 7584 8199 9209
55312 9209 11134 13079 13999 14047 13669 12715 11496 11215 12258 13444 13990 14595 15528 15460 13655 11631 10998 11148
$$ packed form
55430A7896O8o47o09q67j030k83M55q0j006p08L50O22J89R4J41k90m07P01J958
55411A6547J898J210J379J945J550O39O56J448J862K023K812L889M405M775N704
55396E2742O405N883M947M809M800L609J742M90m35k058l913m873n234n800o009
55381E7105n058l881l753m059l610k997l404m144l874l221l668m716m608B915
55366A105B49J60J000J107J006J312J257J21q91l46R72J374R38O91M27l63o60
55349H354M54J527P82o86n98O66Q53k12n90K62Q50M85J56M55Q39R57Q40J11j221
55330A4284j825q53K33l10j637j768q48m52n60j0P84M44n73n69M09Q35O15J010
55312I209J925J945R20M8l78r54j219k81J043J186N46O05R33o8j805k024o33J50
$$ plain form
55294 11148 10736 10027 9971 10168 9674 8923 9072 10134 11306 12411 13610 14407 14317 13807 13386 12551 10869 9270
55276 9270 8961 9839 11100 12538 14030 14705 13992 12808 12458 13049 14019 15283 16663 17167 16267 15090 14975
55259 14975 15583 15667 15012 14258 13514 12519 11639 11456 11814 12294 13053 14162 14811 14259 12939 11684 10586 9617
55241 9617 9393 10170 10956 10928 10934 12179 14127 15154 14789 13906 13035 11843 10173 8488 7311 6941 7501 8669
55223 8669 9767 10570 11440 12239 12142 11053 10146 10131 10194 9598 9142 9856 11294 12409 13134 13793 13917 13075 12140
55204 12140 12280 13258 14105 14812 16066 17810 19432 20915 22637 24374 25560 26078 25966 24983 23375 22275
55188 22275 22322 22684 22499 22349 23178 24602 25641 26274 26956 27400 27230 27013 27216 26906 25027 22365 20711 20543
55170 20543 20960 21348 21595 21220 19849 18221 17272 16616 15317 13725 12982 13113 13134 12829 12869 13288 13350 12878 12445
$$ packed form
55294A1148m12p09n6J97m94p51J49J062J172J105J199P97r0n10m21q35j682j599
55276I270l09Q78J261J438J492O75p13j184l50N91R70J264J380N04r00j177j15
55259A4975O08Q4o55p54p44r95q80j83L58M80P59J109O49n52j320j255j098r69
55241I617k24P77P86k8OJ245J948J027l65q83q71j192j670j685j177l70N60J168
55223H669J098Q03Q70P99r7j089r07j5O3n96m56P14J438J115P25O59J24q42r35
55204A2140J40R78Q47P07J254J744J622J483J722J737J186N18j12r83j608j100
55188B2275M7L62j85j50Q29J424J039O33O82M44j70k17K03l10j879k662j654j68
55170B0543M17L88K47l75j371j628r49o56j299j592p43J31K1l05M0M19O2m72m33
$$ plain form
55151 12445 12288 12230 12527 13595 15048 16161 17044 18184 19079 18675 17045 15459 14835 15151 16177 17657 18897
55134 18897 19289 19175 19319 19727 19922 20009 20503 21386 22258 23107 24071 24949 25831 27503 30243 32922 34463 35388
55116 35388 36709 38111 38714 38815 39229 39579 39033 38203 38361 39074 38577 36508 34475 33772 34137 34832 35463 35522
55098 35522 34648 33521 33231 33656 33703 33078 32502 32280 32110 32240 33300 34938 36073 36592 37398 38713 39782
55081 39782 40385 41156 42265 43227 44174 45858 48172 50112 51483 53110 55063 56223 56167 56030 56808 57985
55065 57985 58536 58246 57428 56271 55076 54301 53931 53398 52426 51307 50257 49317 48914 49626 51268 53028 54547
55048 54547 56040 57442 58386 58926 59332 59308 58489 57456 57113 57224 56879 56295 56689 58349 60305 62097 64437
55031 64437 67817 71808 76078 80779 85550 89362 91816 93562 95127 96434 97661 99377 101444 102876
$$ packed form
55151A2445j57n8K97J068J453J113Q83J140Q95m04j630j586o24L16J026J480J240
55134A8897L92j14J44M08J95Q7M94Q83Q72Q49R64Q78Q82J672K740K679J541R25
55116C5388J321J402O03J01M14L50n46q30J58P13m97k069k033p03L65O95O31N9
55098C5522q74j127k90M25M7o25n76k22j70J30J060J638J135N19Q06J315J069
55081C9782O03P71J109R62R47J684K314J940J371J627J953J160n6j37P78J177
55065E7985N51k90q18j157j195p75l70n33r72j119j050r40m03P12J642J760J519
55048E4547J493J402R44N40M06k4q19j033l43J11l45n84L94J660J956J792K340
55031F4437L380L991M270M701M771L812K454J746J565J307J227J716K067J432
$$ plain form
55017 102876 103128 102449 100809 97720 93418 88969 84742 79875 73647 66414 58950 51948 46353 42926 41076
55002 41076 39308 37155 35593 35302 35749 36317 37003 37556 37168 35643 33820 32416 31437 30992 31438 32358 32653
54985 32653 32052 31354 30829 29828 28451 28031 29184 30762 31576 31958 32693 33653 34467 35452 36834 37916 38039
54968 38039 37688 37880 39136 41710 45885 51336 56997 62332 67974 74493 81472 88569 96618 106750 119103
54953 119103 133223 149028 166621 185700 205851 226728 247199 265013 278139 286031 289014 287090
54941 287090 280130 268742 254234 238004 221391 205548 190890 177029 163713 151377 140474 130868
54929 130868 122295 114896 108919 104413 101514 100365 100407 100395 99533 98103 96798 96072 96324 97951 100947 105114
54913 105114 110758 118348 127456 137152 147638 160242 175289 191168 206122 219795 232207 242247
$$ packed form
55017A02876K52o79j640l089m302m449m227m867o228p233p464p002n595l427j850
55002D1076j768k153j562k91M47N68O86N53l88j525j823j404r79m45M46R20K95
54985C2653o01o98n25j001j377m20J153J578Q14L82P35R60Q14R85J382J082J23
54968C8039l51J92J256K574M175N451N661N335N642O519O979P097Q049J0132J2353
54953A19103J4120J5805J7593J9079K0151K0877K0471J7814J3126P892K983j924
54941B87090o960j1388j4508j6230j6613j5843j4658j3861j3316j2336j0903r606
54929A30868q573p399n977m506k899j149M2j2q62j430j305p26K52J627K996M167
54913A05114N644P590R108R696J0486J2604J5047J5879J4954J3673J2412J0040
$$ plain form
54901 242247 248227 249373 246037 238947 228899 216752 203168 188673 174070 160214 147315 135244
54889 135244 124544 116177 110155 105554 101944 99555 97837 95470 92287 89631 88126 86651 84406 82410
54875 82410 81691 81296 79484 75944 71582 67045 62694 59187 56755 54454 51307 47696 44691 42622 41244
54860 41244 40631 40818 41203 41275 41397 41938 42360 42131 41843 42266 42906 42742 41967 41809 42915 44932 47371 49886
54842 49886 51947 53224 54157 55333 56563 57324 57712 58158 58481 58079 56792 54850 52280 49156 46166 44164
54826 44164 43357 43428 44060 44792 44904 44288 43935 44774 46387 47680 48431 49307 50640 52055 53247 54426 56035
54809 56035 58462 61813 65633 69221 72651 77026 83293 91286 100415 110664 122328 135379 149744
54796 149744 165716 183389 202073 220741 238561 254499 267142 275513 279534 279222 274230 264819 252437
$$ packed form
54901B42247N980J146l336p090j0048j2147j3584j4495j4603j3856j2899j2071
54889A35244j0700q367o022m601l610k389j718k367l183k656j505j475k245j996
54875H2410p19l95j812l540m362m537m351l507k432k301l147l611l005k069j378
54860D1244o13J87L85P2J22N41M22k29k88M23O40j64p75j58J106K017K439K515
54842D9886K061J277R33J176J230P61L88M46L23m02j287j942k570l124k990k002
54826D4164q07P1O32P32J12o16l53Q39J613J293P51Q76J333J415J192J179J609
54809E6035K427L351L820L588L430M375O267P993R129J0249J1664J3051J4365
54796A49744J5972J7673J8684J8668J7820J5938J2643Q371M021l12m992r411j2382
$$ plain form
54783 252437 238551 223642 208064 192997 179573 167780 157109 147655 139714 133055 127544 123757
54771 123757 121939 121094 120218 119746 120614 122598 124827 127441 131411 137152 144571 154080 166304 181072 197891
54756 197891 217133 239592 265182 293281 323972 357569 393010 428020 460714 489828 513471
54745 513471 529152 535366 532134 519912 499120 471018 438047 402883 367689 334145 303247 274951
54733 274951 248793 224965 204151 186435 171227 158190 147351 138343 130469 123600 118155 114074
54721 114074 110536 106839 102891 98863 95021 91906 90008 89175 88857 88718 88491 87551 85489 82925 80939
54706 80939 79780 78885 77946 77137 76465 75786 75394 75634 75950 75228 73229 70943 69441 68993 69345 70192 71314
54689 71314 72736 74696 77017 78833 79615 80101 81458 83795 86342 88755 91317 94051 96726 99630 103362
$$ packed form
54783B52437j3886j4909j5578j5067j3424j1793j0671r454p941o659n511l787
54771A23757j818q45q76m72Q68J984K229K614L970N741P419R509J2224J4768J6819
54756A97891J9242K2459K5590K8099L0691L3597L5441L5010L2694K9114K3643
54745E13471J5681O214l232j2222k0792k8102l2971l5164l5194l3544l0898k8296
54733B74951k6158k3828k0814j7716j5208j3037j0839r008p874o869n445m081
54721A14074l538l697l948m028l842l115j898q33l18j39k27r40k062k564j986
54706H0939j159q95r39q09o72o79l92K40L16p22j999k286j502m48L52Q47J122
54689G1314J422J960K321J816P82M86J357K337K547K413K562K734K675K904L732
$$ plain form
54674 103362 107773 112074 116035 120232 125079 130504 136719 144370 153663 164007 174700 185422 196005
54661 196005 206283 216269 225948 234927 242854 250078 257346 264974 272893 281314 290679 301157 312805
54648 312805 326030 341225 358277 377220 399133 425481 456717 492187 531058 572385 614430
54637 614430 654842 691405 721790 742829 751215 745264 725510 693892 653204 607016 558911 511404
54625 511404 466012 423991 386190 352499 322396 295929 273360 254173 237466 223117 211586
54614 211586 202752 195981 191108 188320 187234 187153 188009 190075 192932 195812 198605 201292 202804 201909 199033
54599 199033 195670 192122 187449 181628 175937 170943 165802 160036 154358 149213 144061 138813 134397 131097
54585 131097 127702 123275 118559 114685 111575 108603 105844 103617 101564 99267 97144 95865 95283 94737 93961
$$ packed form
54674A03362M411M301L961M197M847N425O215P651R293J0344J0693J0722J0583
54661A96005J0278R986R679Q979P927P224P268P628P919Q421R365J0478J1648
54648C12805J3225J5195J7052J8943K1913K6348L1236L5470L8871M1327M2045
54637F14430M0412L6563L0385K1039Q386n951j9754l1618m0688m6188m8105m7507
54625E11404m5392m2021l7801l3691l0103k6467k2569j9187j6707j4349j1531
54614B11586q834o771m873k788j086q1Q56K066K857K880K793K687J512q95k876
54599A99033l363l548m673n821n691m994n141n766n678n145n152n248m416l300
54585A31097l395m427m716l874l110k972k759k227k053k297k123j279n82n46p76
$$ plain form
54570 93961 93019 91683 89523 86435 82837 79582 77733 77805 79042 80036 80221 80195 80580 81466 83043 85748 89340
54553 89340 92726 95118 96691 97779 98331 98554 99235 100916 103404 106439 110120 114379 118812 123468 129136
54538 129136 136514 145775 157095 170766 186458 203233 220612 238925 258376 278638 299434 320365
54526 320365 339774 354968 364216 367664 365868 358616 345922 329182 310384 290727 270607 250289
54514 250289 230034 210217 191781 175878 162587 150769 139591 129363 120503 112738 105941 100737
54502 100737 97481 95517 94121 93292 92882 91852 89484 86642 84897 84842 85975 87642 89314 90462 91002
54487 91002 91511 92424 93442 94220 95046 96249 97521 98393 98870 99082 98925 98583 98728 99634 100702 101408 101980 102640
54469 102640 102970 102713 102386 102317 101888 100548 98893 97781 97063 96077 94880 93976 93325 92493 91433 90268 88755
$$ packed form
54570I3961r42j336k160l088l598l255j849P2J237R94J85k6L85Q86J577K705L592
54553H9340L386K392J573J088N52K23O81J681K488L035L681M259M433M656N668
54538A29136P378R261J1320J3671J5692J6775J7379J8313J9451K0262K0796K0931
54526C20365J9409J5194R248L448j796p252j2694j6740j8798j9657k0120k0318
54514B50289k0255j9817j8436j5903j3291j1818j1178j0228q860p765o797n204
54502A00737l256j964j396q29m10j030k368k842j745n5J133J667J672J148N40
54487I1002N09R13J018P78Q26J203J272Q72M77K12j57l42J45R06J068P06N72O60
54469A02640L30k57l27o9m29j340j655j112p18r86j197r04o51q32j060j165j513
$$ plain form
54452 88755 86783 84993 84029 83526 82684 81494 80628 80386 80573 81113 81949 82515 82139 80928 79666 78869 78475
54435 78475 78311 78413 78916 79859 80935 81351 80462 78710 77310 76766 76440 75900 75802 76772 78235 79128 79152 78691
54417 78691 78150 78048 79019 80911 82545 83179 83592 84893 86941 88901 90758 93170 96246 99526 102931 106842
54401 106842 111432 116740 123089 130645 138863 147110 155516 164421 173384 181599 188928 195679 201639 206214
54387 206214 209213 210708 210424 208168 204515 200205 195105 188756 181660 174990 169115 163388 157401 151498
54373 151498 145965 140563 135130 130016 125696 122381 120007 118232 116541 114701 112956 111504 110201 109152
54359 109152 108998 109968 111218 111889 112335 113478 115372 117408 119529 122187 125237 128033 130717 134414 139899
54344 139899 146835 154471 162458 170716 179076 187345 195432 203323 211043 218433 224756 228934 230577 230383
$$ packed form
54452H8755j972j790r64n03q42j190q66k42J87N40Q36N66l76j211j262p97l94
54435G8475j64J02N03R43J076M16q89j752j400n44l26n40r8R70J463Q93K4m61
54417G8691n41j02R71J892J634O34M13J301K048J960J857K412L076L280L405L911
54401A06842M590N308O349P556Q218Q247Q406Q905Q963Q215P329O751N960M575
54387B06214K999J495k84k256l653m310n100o349p096o670n875n727n987n903
54373A51498n533n402n433n114m320l315k374j775j691j840j745j452j303j049
54359A09152j54R70J250O71M46J143J894K036K121K658L050K796K684L697N485
54344A39899O936P636P987Q258Q360Q269Q087P891P720P390O323M178J643j94
$$ plain form
54330 230383 229118 226677 222640 217190 210831 203689 195834 187777 179808 171309 161674 151556 142248 134083
54316 134083 126431 119049 112377 106478 100738 94838 89300 84848 81764 79911 78872 77944 76444 74091
54302 74091 70952 67326 63849 61166 59093 56730 53914 51750 51012 50818 49859 48173 46584 45127 43427
54287 43427 42159 42510 44271 45854 46290 46008 45566 44881 43928 43066 42361 41536 40742 40451 40425 39867 38824 38448
54269 38448 39503 41419 43137 44199 44749 45148 45795 46681 47058 46255 44870 44361 45325 46936 48209 48957 49376
54252 49376 49557 49770 50536 52052 54011 56142 58356 60305 61447 61722 61642 61589 61545 61501 61549 61564 61362 61062 60772
54233 60772 60056 58453 56388 54803 53922 53150 52064 50731 49155 47267 45460 44316 43796 43455 43318 43660
54217 43660 44090 43849 43007 42353 42078 41607 40784 40140 39799 39142 37817 36180 34579 33082 31986 31617 31518 30880
$$ packed form
54330B30383j265k441m037n450o359p142p855q057p969q499r635j0118r308q165
54316A34083p652p382o672n899n740n900n538m452l084j853j039r28j500k353
54302G4091l139l626l477k683k073k363k816k164p38j94r59j686j589j457j700
54287D3427j268L51J761J583M36k82m42o85r53q62p05q25p94k91k6n58j043l76
54269C8448J055J916J718J062N50L99O47Q86L77q03j385n09R64J611J273P48M19
54252D9376J81K13P66J516J959K131K214J949J142K75q0n3m4m4M8J5k02l00k90
54233F0772p16j603k065j585q81p72j086j333j576j888j807j144n20l41j37L42
54217D3660M30k41q42o54k75m71q23o44l41o57j325j637j601j497j096l69r9o38
$$ plain form
54199 30880 29921 29735 30584 31424 31378 30595 29468 28221 27629 28763 31363 33592 34146 33608 33138 32872 32440 32054
54181 32054 32038 31911 30902 29082 27337 26539 27016 28333 29294 28824 27263 26099 26181 26940 27663 28502 29642
54164 29642 30470 30426 29999 30044 30640 31290 31733 31922 31701 31165 30882 31188 31668 31874 32096 32852 34060 35268 36315
54145 36315 37226 37816 37904 37630 37185 36573 35981 35902 36458 37010 36899 36262 35751 35765 36278 37102 38024 38915 39860 40893
54125 40893 41661 41876 42038 42985 44642 46026 46628 47008 47664 48255 48405 48543 49336 50797 52348 53313 53119 51678
54107 51678 49887 49089 49692 50855 51668 51931 51677 50906 50063 49786 49809 49107 47559 46386 46383 46793 46599 45910 45295
54088 45295 44741 44117 43807 43970 43961 43338 42675 42471 42095 40783 38943 37539 36822 36637 37173 38353 39195 39000
54070 39000 38585 39115 40228 40611 39999 39323 39146 39295 39877 41273 43038 44009 43826 43410 43741 44904 46482
$$ packed form
54199C0880r59j86Q49Q40m6p83j127j247n92J134K600K229N54n38m70k66m32l86
54181C2054j6j27j009j820j745p98M77J317R61m70j561j164Q2P59P23Q39J140
54164B9642Q28m4m27M5N96O50M43J89k21n36k83L06M80K06K22P56J208J208J047
54145C6315R11N90Q8k74m45o12n92p9N56N52j11o37n11J4N13Q24R22Q91R45J033
54125D0893P68K15J62R47J657J384O02L80O56N91J50J38P93J461J551R65j94j441
54107E1678j791p98O03J163Q13K63k54p71q43k77K3p02j548j173lM10j94o89o15
54088D5295n54o24l10J63ro23o63k04l76j312j840j404p17j85N36J180Q42j95
54070C9000m15N30J113L83o12o76j77J49N82J396J765R71j83m16L31J163J578
$$ plain form
54053 46482 48125 49523 50469 51090 51592 51871 51822 51765 52010 52294 52364 52759 54143 56058 57354 57768 58149 59043
54035 59043 60032 60730 61637 63520 66478 69899 73003 75289 76826 78264 80297 83112 86583 90734 95599
54020 95599 100829 106020 111395 117632 124956 132785 140277 146937 152835 158539 164700 171374 177880 183571
54006 183571 188392 192445 195492 197363 198444 199194 199574 199494 199361 199482 199274 197881 195383 192655 190151 187536
53990 187536 184418 180788 176786 172601 168527 164632 160589 156283 152247 148947 146017 142920 139910 137542
53976 137542 135580 133360 130989 129154 127884 126567 125139 124120 123401 122123 120064 118100 116891 116053 115094
53961 115094 114334 114260 114681 115157 115803 117082 119077 121387 123513 125086 126010 126631 127482 128678 129896 130947
53945 130947 131854 132183 131031 128200 124923 122807 122183 122001 121282 120246 119897 120880 122996 125706 128715 131867
$$ packed form
54053D6482J643J398R46O21N02K79m9n7K45K84P0L95J384J915J296M14L81Q94
54035E9043R89O98R07J883K958L421L104K286J537J438K033K815L471M151M865
54020I5599N230N191N375O237P324P829P492O660N898N704O161O674O506N691
54006A83571M821M053L047J871J081P50L80q0j33J21k08j393k498k728k504k615
53990A87536l118l630m002m185m074l895m043m306m036l300k930l097l010k368
53976A37542j962k220k371j835j270j317j428j019p19j278k059j964j209q38r59
53961A15094p60p4M21M76O46J279J995K310K126J573R24O21Q51J196J218J051
53945A30947R07L29j152k831l277k116o24j82p19j036l49R83K116K710L009L152
$$ plain form
53929 131867 134734 136825 138332 140229 143344 147590 152333 157157 161911 166333 170140 173336 176052 178256
53915 178256 179935 181254 182139 182054 180724 178817 177309 176439 175932 176004 177311 179943 183249 186801 190843 195588
53899 195588 200747 205959 211175 216378 221438 226530 232241 238930 246211 253308 259642 264991 269351 272828
53885 272828 275490 277237 277986 277968 277612 277105 276296 275049 273502 272021 271015 270616 270306 269068 266239 262064
53869 262064 257179 251834 245987 239801 233516 227055 220341 213792 207969 202816 197877 193127 188935 185259
53855 185259 181576 177657 173784 170074 166194 161948 157598 153445 149464 145529 141639 137864 134401 131633
53841 131633 129675 127949 125702 122916 120141 117547 114874 112347 110783 110482 110708 110586 109876 108553 106379
53826 106379 103521 100994 99714 99348 98761 97460 95997 95016 94486 94026 93468 92857 92202 91614 91514 92307 93779
$$ packed form
53929A31867K867K091J507J897L115M246M743M824M754M422L807L196K716K204
53915A78256J679J319Q85q5j330j907j508q70n07P2J307K632L306L552M042M745
53899A95588N159N212N216N203N060N092N711O689P281P097O334N349M360L477
53885B72828K662J747P49j8l56n07q09j247j547j481j006l99l10j238k829m175
53869B62064m885n345n847o186o285o461o714o549n823n153m939m750m192l676
53855A85259l683l919l873l710l880m246m350m153l981l935l890l775l463k768
53841A31633j958j726k247k786k775k594k673k527j564l01K26j22p10j323k174
53826A06379k858k527j280l66n87j301j463r81n30m60n58o11o55n88j00P93J472
$$ plain form
53809 93779 95147 95903 96338 96948 97604 97763 97339 96744 96065 94906 93288 92021 91751 92214 92934 94106 96131
53792 96131 98777 101494 104233 107209 110088 112262 113897 115929 118968 122786 126937 131329 136060 141172
53778 141172 146627 152163 157206 161301 164567 167430 170142 172906 176095 179746 183139 185530 187042 188210
53764 188210 188980 189057 188921 189374 190041 189470 187055 183926 181462 179718 177836 175393 172742 170349 168339 166608
53748 166608 165122 164150 164102 164956 166054 166871 167777 169540 172280 175467 178754 182089 185125 187378 188952 190341
53732 190341 191486 191834 191366 190652 189751 187936 184832 180958 176868 172610 168380 164822 162138 159664 156870
53717 156870 154094 151754 149554 147154 145034 143885 143505 143003 141926 140637 139715 139406 139495 139376 138466 136837
53701 136837 135287 134508 134416 134415 134049 133223 132214 131703 132437 134552 137478 140607 143678 146401 148311 149364 150231
$$ packed form
53809I3779J368P56M35O10O56J59m24n95o79j159j618j267k70M63P20J172K025
53792I6131K646K717K739K976K879K174J635K032L039L818M151M392M731N112
53778A41172N455N536N043M095L266K863K712K764L189L651L393K391J512J168
53764A88210P70P7j36M53O67n71k415l129k464j744j882k443k651k393k010j731
53748A66608j486r72m8Q54J098Q17R06J763K740L187L287L335L036K253J574J389
53732A90341J145L48m68p14r01j815l104l874m090m258m230l558k684k474k794
53717A56870k776k340k200k400k120j149l80n02j077j289r22l09Q9j19r10j629
53701A36837j550p79r2jl66q26j009n11P34K115K926L129L071K723J910J053Q67
$$ plain form
53684 150231 151593 153453 155506 157835 160840 164660 168971 173232 176967 180019 182656 185222 187627 189409
53670 189409 190305 190420 189899 188869 187694 186733 185793 184366 182492 180791 179523 178309 177018 176220 176373 177094
53654 177094 177608 177437 176404 174529 172345 170750 170111 169916 169654 169479 169568 169399 168277 166272 164131 162521
53638 162521 161745 161867 162587 163230 163288 162882 162367 161692 160449 158439 155998 153891 152896 153159 153907 154169 153871 153740
53620 153740 154132 154603 154801 155066 155747 156575 157198 157810 158730 159864 161056 162557 164540 166476 167622 168034 168719
53603 168719 170778 174543 179323 183860 187373 190240 193429 197282 201440 205859 210993 216775 222301 227040
53589 227040 231481 236038 240159 243273 245889 248831 251978 254775 257561 261320 266229 271427 276183 280494
53575 280494 284480 287953 290786 293216 295618 298344 301710 305694 309663 312848 315119 316965 318788 320606
$$ packed form
53684A50231J362J860K053K329L005L820M311M261L735L052K637K566K405J782
53670A89409Q96J15n21j030j175r61r40j427j874j701j268j214j291p98J53P21
53654A77094N14j71j033j875k184j595o39j95k62j75Q9j69j122k005k141j610
53638A62521p76J22P20O43N8m06n15o75j243k010k441k107r95K63P48K62k98j31
53620A53740L92M71J98K65O81Q28O23O12R20J134J192J501J983J936J146M12O85
53603A68719K059L765M780M537L513K867L189L853M158M419N134N782N526M739
53589B27040M441M557M121L114K616K942L147K797K786L759M909N198M756M311
53575B80494L986L473K833K430K402K726L366L984L969L185K271J846J823J818
$$ plain form
53561 320606 322381 324185 325964 327483 328624 329549 330521 331652 332850 333938 334907 335988 337250 338225 338283 337493
53545 337493 336628 336217 336070 335830 335462 334899 333799 332048 330060 328259 326709 325561 325281 325997 327095 327916
53529 327916 328464 329050 329784 330873 332804 335676 338849 341862 345136 349113 353323 357141 361025 365966 372024
53514 372024 378338 384500 390988 398216 406069 414484 423759 434025 445092 456981 470033 484169 498599
53501 498599 512601 526311 540474 555669 572047 589697 608946 630122 653026 676783 700517
53490 700517 724135 748173 772849 797682 822216 846644 871466 896913 922968 949564 976377
53479 976377 1002813 1028582 1054034 1079618 1105296 1130797 1156137 1181597 1207442 1233859 1260814
53468 1260814 1287849 1314468 1340858 1367627 1394603 1420622 1444844 1467506 1488881 1508416 1525599
$$ packed form
53561C20606J775J804J779J519J141R25R72J131J198J088R69J081J262R75N8p90
53545C37493q65m11j47k40l68n63j100j751j988j801j550j148k80P16J098Q21
53529C27916N48N86P34J089J931K872L173L013L274L977M210L818L884M941O058
53514C72024O314O162O488P228P853Q415R275J0266J1067J1889J3052J4136J4430
53501D98599J4002J3710J4163J5195J6378J7650J9249K1176K2904K3757K3734
53490G00517K3618K4038K4676K4833K4534K4428K4822K5447K6055K6596K6813
53479I76377K6436K5769K5452K5584K5678K5501K5340K5460K5845K6417K6955
53468A260814K7035K6619K6390K6769K6976K6019K4222K2662K1375J9535J7183
$$ plain form
53457 1525599 1540937 1555132 1567875 1578362 1586581 1593204 1598620 1602932 1606576 1609973 1612789 1614325 1614377
53444 1614377 1612974 1609626 1603780 1595742 1586198 1574943 1561100 1544560 1526259 1506902 1486218 1463620
53432 1463620 1438956 1412579 1385221 1357734 1330336 1302264 1272773 1242363 1212277 1182971 1153839
53421 1153839 1124361 1094748 1065567 1037566 1011775 988836 968085 948110 928297 909155 891146
53410 891146 874159 858324 844451 833280 824936 819387 816817 817176 819930 824607 831279 840270 851714
53397 851714 865474 881195 898517 917601 939303 964366 992493 1022669 1054268 1087324 1121937
53386 1121937 1158067 1195845 1235437 1276627 1319037 1362705 1407912 1454747 1503391 1554452 1608221
53375 1608221 1663904 1720514 1778301 1838304 1900644 1964345 2028767 2094088 2160272 2226724 2293175
$$ packed form
53457A525599J5338J4195J2743J0487Q219O623N416M312L644L397K816J536N2
53444A614377j403l348n846q038r544j1255j3843j6540j8301j9357k0684k2598
53432A463620k4664k6377k7358k7487k7398k8072k9491l0410l0086k9306k9132
53421A153839k9478k9613k9181k8001k5791k2939k0751j9975j9813j9142j8009
53410H91146j6987j5835j3873j1171q344n549k570L59K754M677O672Q991J1444
53397H51714J3760J5721J7322J9084K1702K5063K8127L0176L1599L3056L4613
53386A121937L6130L7778L9592M1190M2410M3668M5207M6835M8644N1061N3769
53375A608221N5683N6610N7787O0003O2340O3701O4422O5321O6184O6452O6451
$$ plain form
53364 2293175 2359817 2426307 2491669 2555450 2617900 2678678 2736475 2790438 2840908 2888157 2931404
53353 2931404 2969752 3003255 3032329 3056868 3076771 3092692 3105414 3114864 3120357 3121484 3118279 3110927
53341 3110927 3099769 3085097 3066514 3042902 3013397 2977893 2936170 2887247 2830296 2765822 2695425
53330 2695425 2620863 2543815 2465945 2388367 2311274 2234649 2159099 2085471 2013955 1944160 1875868
53319 1875868 1809190 1744140 1680567 1618439 1557814 1498692 1441289 1386309 1334549 1286200 1240821
53308 1240821 1197893 1157273 1119290 1084631 1053958 1027424 1004643 985196 968957 955870 945749
53297 945749 938427 933808 931627 931497 933323 937352 943634 951718 961008 971101 981760 992900 1004696
53284 1004696 1017355 1030785 1044900 1060117 1076919 1094929 1113273 1131991 1152223 1174646 1198629
$$ packed form
53364B293175O6642O6490O5362O3781O2450O0778N7797N3963N0470M7249M3247
53353B931404L8348L3503K9074K4539J9903J5921J2722R450N493J127l205p352
53341C110927j1158j4672j8583k3612k9505l5504m1723m8923n6951o4474p0397
53330B695425p4562p7048p7870p7578p7093p6625p5550p3628p1516o9795o8292
53319A875868o6678o5050o3573o2128o0625n9122n7403n4980n1760m8349m5379
53308A240821m2928m0620l7983l4659l0673k6534k2781j9447j6239j3087j0121
53297I45749p322m619k181j30J826M029O282Q084R290J0093J0659J1140J1796
53284A004696J2659J3430J4115J5217J6802J8010J8344J8718K0232K2423K3983
$$ plain form
53273 1198629 1223502 1249860 1278764 1310148 1342798 1375561 1407890 1439523 1470385 1500722 1530743
53262 1530743 1560169 1588580 1616021 1642773 1668683 1693283 1716409 1738145 1758171 1775818 1791001
53251 1791001 1804647 1817866 1830892 1842970 1853089 1860595 1865194 1866735 1865213 1860817 1853634 1843227
53239 1843227 1828859 1810304 1788148 1763019 1734866 1703330 1668508 1630878 1590870 1549147 1506980
53228 1506980 1465436 1424269 1382446 1339790 1297308 1255847 1215451 1176274 1139088 1104287 1071170
53217 1071170 1038797 1006933 975551 944098 912013 879577 847563 816256 785406 754936 725234
53206 725234 696844 670204 645462 622327 600332 579465 560199 542683 526367 510728 495933
53195 495933 482417 470209 459016 448597 438700 428988 419379 410138 401345 392651 383793 374938 366202
$$ packed form
53273A198629K4873K6358K8904L1384L2650L2763L2329L1633L0862L0337L0021
53262A530743K9426K8411K7441K6752K5910K4600K3126K1736K0026J7647J5183
53251A791001J3646J3219J3026J2078J0119P506M599J541j522m396p183j0407
53239A843227j4368j8555k2156k5129k8153l1536l4822l7630m0008m1723m2167
53228A506980m1544m1167m1823m2656m2482m1461m0396l9177l7186l4801l3117
53217A071170l2373l1864l1382l1453l2085l2436l2014l1307l0850l0470k9702
53206G25234k8390k6640k4742k3135k1995k0867j9266j7516j6316j5639j4795
53195D95933j3516j2208j1193j0419r897r712r609r241q793q694q858q855q736
$$ plain form
53182 366202 357430 348776 340880 333966 327321 320331 313526 307865 303270 298673 293394 287829 282722 278298
53168 278298 274195 269934 265422 261206 258167 256739 256548 256868 257224 257486 257745 258365 259855 262488 266251 271178
53152 271178 277293 284127 290854 297112 303153 308877 313313 315442 315105 312805 309198 305062 301050 296889
53138 296889 291385 283891 275320 267162 259876 252832 245425 237561 229361 221025 212884 205187 197995 191521
53124 191521 186145 181798 177790 173647 169582 165808 162078 158412 155457 153389 151185 147964 144438 142003
53110 142003 140826 139937 138915 138223 137941 137360 136089 134591 133368 132380 131566 131201 131391 131748 131898 131846 131613
53093 131613 130900 129499 127801 126640 126590 127358 127881 127266 125736 124365 123717 123225 122178 120684 119177 117594
53077 117594 115815 114418 114098 114543 114804 114659 114694 115063 115030 113989 112237 110476 109074 108075 107464 107184 107157 107415
$$ packed form
53182C66202q772q654p896o914o645o990o805n661m595m597n279n565n107m424
53168B78298m103m261m512m216l039j428j91L20L56K62K59O20J490K633L763M927
53152B71178O115O834O727O258O041N724M436K129l37k300l607m136m012m161
53138B96889n504p494q571q158p286p044p407p864q200q336q141p697p192o474
53124A91521n376m347m008m143m065l774l730l666k955k068k204l221l526k435
53110A42003j177q89j022o92k82n81j271j498j223r88q14l65J90L57J50n2k33
53093A31613p13j401j698j161n0P68N23o15j530j371o48m92j047j494j507j583
53077A17594j779j397l20M45K61j45L5L69l3j041j752j761j402r99o11k80k7K58
$$ plain form
53059 107415 108017 108873 109819 110684 111121 110788 110033 109927 111059 112683 113717 114198 114981 116316 117674 118814 120022
53042 120022 121248 121950 122045 122222 123063 124430 125899 127143 127737 127248 125803 124002 122092 119761 117018 114688
53026 114688 113718 114288 115785 117291 118063 118006 117886 118691 120648 123191 125870 128810 132240 136109 140314 144830
53010 144830 149538 154362 159654 165948 173265 181108 189180 197473 205560 212503 217793 221803 224950 226912
52996 226912 227068 225323 222080 217672 212230 205945 199185 192426 186145 180564 175394 170070 164359 158571
52982 158571 153170 148414 144267 140323 135876 130582 125099 120592 117462 114989 112327 109348 106292 103206
52968 103206 100138 97473 95559 94200 92953 91811 91206 91319 91694 91630 90826 89532 88134 86733 85216 83631
52952 83631 82283 81357 80734 80278 80010 79844 79452 78711 78023 77814 77936 77922 77599 77062 76283 75266 74422 74207 74462
$$ packed form
53059A07415O02Q56R46Q65M37l33p55j06J132J624J034M81P83J335J358J140J208
53042A20022J226P02R5J77Q41J367J469J244N94m89j445j801j910k331k743k330
53026A14688r70N70J497J506P72n7j20Q05J957K543K679K940L430L869M205M516
53010A44830M708M824N292O294P317P843Q072Q293Q087O943N290M010L147J962
52996B26912J56j745l243m408n442o285o760o759o281n581n170n324n711n788
52982A58571n401m756m147l944m447n294n483m507l130k473k662k979l056l086
52968A03206l068k665j914j359j247j142o05J13L75o4q04j294j398j401j517j585
52952H3631j348r26o23m56k68j66l92p41o88k09J22j4l23n37p79j017q44k15K55
$$ plain form
52933 74462 74668 74744 75037 75475 75378 74256 72376 70431 69043 68659 69429 70936 72341 72971 72644 71518 69981
52916 69981 68608 67802 67395 66888 66111 65345 64914 64940 65386 65889 65740 64562 62962 62017 62105 62699 63260 63756 64327
52897 64327 65033 66076 67700 69775 71876 73877 76042 78544 81414 84927 89411 94514 99333 103522 107824
52882 107824 113225 119958 127497 135080 142039 147966 152806 156514 158663 158810 157266 154957 152400 149325
52868 149325 145460 141141 136832 132536 127997 123163 118165 113117 108171 103470 98887 94176 89543 85710
52854 85710 83117 81340 79582 77604 75919 75116 75094 74944 73662 71115 68205 65955 64638 64011 64027 64806
52838 64806 66113 67400 68324 68769 68536 67536 66200 65117 64329 63487 62616 62022 61486 60255 58045 55485
52822 55485 53433 52282 51988 52236 52530 52670 53196 54835 57557 60660 63691 66539 68689 69307 68354 66851
$$ packed form
52933G4462K06P6K93M38r7j122j880j945j388l84P70J507J405O30l27j126j537
52916F9981j373q06m07n07p77p66m31K6M46N03j49j178j600r45Q8N94N61M96N71
52897F4327P06J043J624K075K101K001K165K502K870L513M484N103M819M189M302
52882A07824N401O733P539P583O959N927M840L708K149J47j544k309k557l075
52868A49325l865m319m309m296m539m834m998n048m946m701m583m711m633l833
52854H5710k593j777j758j978j685q03k2j50j282k547k910k250j317o27J6P79
52838F4806J307J287R24M45k33j000j336j083p88q42q71n94n36j231k210k560
52822E5485k052j151k94K48K94J40N26J639K722L103L031K848K150O18r53j503
$$ plain form
52806 66851 65729 64976 64170 63240 62431 62029 62307 63285 64370 64784 64339 63321 61688 59277 56754 55341 55296
52789 55296 55585 55486 55609 56788 58792 60799 62479 63859 64648 64478 63599 62775 62584 63141 64258 65552 66599
52772 66599 67215 67434 67264 66796 66427 66444 66462 65995 65547 66236 68185 70164 71210 71747 72705 74336 76396 78734
52754 78734 81065 82775 83566 83921 84463 85290 86260 87420 88770 90147 91683 93838 96636 99486 102120 105149
52738 105149 109284 114560 120533 126643 132089 136198 139360 142827 147128 151328 154219 155454 155154 153355
52724 153355 150426 147105 143474 138755 132827 126993 122389 118511 114223 109427 104739 100311 96081 92528
52710 92528 89925 87293 83405 78607 74507 71969 70414 69000 67516 66063 64757 63873 63631 63733 63541
52695 63541 62686 61185 59277 57511 56531 56225 55547 53776 51508 49837 49044 48812 49164 50262 51639 52546
$$ packed form
52806F6851j122p53q06r30q09m02K78R78J085M14m45j018j633k411k523j413m5
52789E5296K89r9J23J179K004K007J680J380P89j70q79q24j91N57J117J294J047
52772F6599O16K19j70m68l69J7J8m67m48O89J949J979J046N37R58J631K060K338
52754G8734K331J710P91L55N42Q27R70J160J350J377J536K155K798K850K634L029
52738A05149M135N276N973O110N446M109L162L467M301M200K891J235l00j799
52724A53355k929l321l631m719n928n834m604l878m288m796m688m428m230l553
52710I2528k603k632l888m798m100k538j555j414j484j453j306q84k42J02j92
52695F3541q55j501j908j766r80l06o78j771k268j671p93k32L52J098J377R07
$$ plain form
52679 52546 52861 52953 52897 52501 51854 51200 50611 50295 50688 51584 51852 50846 49447 48719 48195 46741 44569 43020
52661 43020 42603 42652 42791 43330 44126 44362 43847 43407 43637 44105 44147 43690 43045 42551 42520 42927 43136 42586 41635 41001
52641 41001 40625 40061 39753 40701 42714 44221 44239 43484 43135 43369 43647 43698 43672 43859 44695 46603 49443 52448
52623 52448 54922 56669 57785 58450 58931 59265 58982 57656 55647 53716 52049 50351 48757 47806 47533 47365
52607 47365 46945 46235 44848 42324 39283 37337 37504 39284 41438 42950 43217 42246 40942 40352 40419 40255 39762
52590 39762 39859 40832 41603 41296 40551 40537 41412 42544 43633 44776 45853 46588 47016 47333 47526 47501 47376 47304 47284
52571 47284 47332 47501 47599 47366 47064 47351 48310 49199 49449 49318 49186 48890 48250 47722 47902 48665 49337 49491 49231 48891
52551 48891 48814 49217 50039 51052 52191 53461 54521 54873 54593 54410 54827 55658 56553 57414 58055 58119 57647 57253
$$ packed form
52679E2546L15R2n6l96o47o54n89l16L93Q96K68j006j399p28n24j454k172j549
52661D3020m17M9J39N39P96K36n15m40K30M68M2m57o45m94l1M07K09n50r51o34
52641D1001l76n64l08R48K013J507J8p55l49K34K78N1k6J87Q36J908K840L005
52623E2448K474J747J116O65M81L34k83j326k009j931j667j698j594r51k73j68
52607D7365m20p10j387k524l041j946J67J780K154J512K67r71j304n90O7j64m93
52590C9762R7R73P71l07p45j4Q75J132J089J143J077P35M28L17J93k5j25p2k0
52571D7284M8J69R8k33l02K87R59Q89K50j31j32k96o40n28J80P63O72J54k60l40
52551D8891p7M03Q22J013J139J270J060L52k80j83M17Q31Q95Q61O41O4m72l94
$$ plain form
52533 57253 57359 57766 58281 59165 60532 61874 62718 63304 64071 64834 65051 64633 63937 63152 62194 61132 60305 59954
52515 59954 59984 60061 59895 59542 59437 59941 60860 61691 62321 63066 64127 65507 67453 70261 73517 76293 78392
52498 78392 80720 83953 87472 90187 91982 93704 96022 98853 101748 104342 106438 107903 108538 108080 106570
52483 106570 104697 103344 102684 102111 101088 99576 97561 94868 91761 89085 87387 86305 85142 83582 81573
52468 81573 79106 76529 74627 73910 74155 74864 75677 76135 75707 74539 73564 73372 73548 73632 74058 75354 76947
52451 76947 77647 77109 76066 75276 74957 75122 75770 76666 77388 77676 77462 76817 76157 76196 77134 78149 78259 77563 77073
52432 77073 77410 78203 78758 78814 78598 78530 78903 79533 79785 79259 78400 78018 78251 78439 78077 77545 77691 78869 80539
52413 80539 81831 82469 82984 83904 84862 84972 84061 83001 82599 82681 82590 82050 81129 79850 78448 77666 78090 79336
$$ packed form
52533E7253J06M07N15Q84J367J342Q44N86P67P63K17m18o96p85r58j062q27l51
52515E9954L0P7j66l53j05N04R19Q31O30P45J061J380J946K808L256K776K099
52498G8392K328L233L519K715J795J722K318K831K895K594K096J465O35m58j510
52483A06570j873j353o60n73j023j512k015k693l107k676j698j082j163j560k009
52468H1573k467k577j902p17K45P09Q13M58m28j168r75j92J76Q4M26J296J593
52451G6947P00n38j043p90l19J65O48Q96P22K88k14o45o60L9R38J015J10o96m90
52432G7073L37P93N55N6k16o8L73O30K52n26q59l82K33J88l62n32J46J178J670
52413H0539J292O38N15R20R58J10r11j060m02Q2r1n40r21j279j402p82M24J246
$$ plain form
52395 79336 80442 81035 81533 82271 82995 83331 83338 83413 83920 85030 86712 88757 90861 92660 93691 93608 92677 91839
52377 91839 91970 93121 94676 96070 97117 97844 98365 98900 99609 100379 100977 101381 101839 102648 103979 105854 108147
52360 108147 110604 112969 115024 116588 117633 118455 119530 121140 123208 125422 127386 128795 129775 130890 132457
52345 132457 134015 134975 135694 137275 140305 144419 149098 154082 158841 162546 165054 167186 169539 171661 172973
52330 172973 173840 174929 175964 175945 174429 171943 169254 166796 164741 163121 161836 160800 160053 159517 158933 158219
52314 158219 157555 156866 155653 153691 151536 149959 149154 148855 148854 148990 148984 148711 148370 148094 147799 147739 148686 151037 154128
52295 154128 156899 158860 160004 160364 160298 160737 162356 164778 167202 169470 171833 174125 176007 177799 180129
52280 180129 182839 185080 186562 187954 189901 192290 194603 196472 197811 198864 200204 202262 204796 207120
$$ packed form
52395G9336J106N93M98P38P24L36PP5N07J110J682K045K104J799J031q3r31q38
52377I1839J31J151J555J394J047P27N21N35P09P70N98M04M58Q09J331J875K293
52360A08147K457K365K055J564J045Q22J075J610K068K214J964J409R80J115J567
52345A32457J558R60P19J581L030M114M679M984M759L705K508K132K353K122J312
52330A72973Q67J089J035j9j516k486k689k458k055j620j285j036p47n36n84p14
52314A58219o64o89j213j962k155j577q05k99jJ36ok73l41k76k95o0R47K351L091
52295A54128K771J961J144L60o6M39J619K422K424K268K363K292J882J792K330
52280A80129K710K241J482J392J947K389K313J869J339J053J340K058K534K324
$$ plain form
52266 207120 208761 209558 209405 208468 207539 207531 208612 210244 211967 213595 214815 215284 215134 214836 214507 213898 213054
52249 213054 212428 212243 212292 212460 212958 213851 214791 215435 215821 216238 216935 218003 219287 220442 221281 221984 222744 223424
52231 223424 223891 224489 225764 227888 230731 234246 238309 242388 245942 249167 252779 257025 261321 264899 267527
52216 267527 269629 271987 275134 278686 281514 282951 283552 284272 285246 285985 286374 286704 286908 286590 285806 285040 284408
52199 284408 283657 283007 283193 284430 286034 287334 288392 289545 290817 292119 293594 295415 297536 299833 302234
52184 302234 304569 306647 308617 311006 314232 318222 322480 326347 329316 331474 333596 336435 339936 343370
52170 343370 346199 348512 350746 353272 356144 359010 361433 363474 365651 368105 370311 371997 373724 375937
$$ packed form
52266B07120J641P97j53r37r29qJ081J632J723J628J220M69j50k98l29o09q44
52249B13054o26j85M9J68M98Q93R40O44L86M17O97J068J284J155Q39P03P60O80
52231B23424M67N98J275K124K843L515M063M079L554L225L612M246M296L578K628
52216B67527K102K358L147L552K828J437O01P20R74P39L89L30K04l18p84p66o32
52199B84408p51o50J86J237J604J300J058J153J272J302J475J821K121K297K401
52184C02234K335K078J970K389L226L990M258L867K969K158K122K839L501L434
52170C43370K829K313K234K526K872K866K423K041K177K454K206J686J727K213
$$ [...]
##END NTUPLES=NMR SPECTRUM
##END=
